##TITLE=AC1613_BRAAN13343_8317232_K7zRmm9ZwH
##JCAMPDX= 6.0         $$ Bruker NMR JCAMP-DX V2.0
##DATA TYPE= NMR SPECTRUM
##DATA CLASS= NTUPLES
##ORIGIN= BRUKER
##OWNER= Administrator
$$ 1.72 TOPSPIN		Version 2.1
$$ 2013-11-13 18:56:58.688 -0800  Administrator@X
$$ Compression mode = diff/dup
##.OBSERVE FREQUENCY= 400.02188249412
##.OBSERVE NUCLEUS= ^1H
##.ACQUISITION MODE= SIMULTANEOUS (DQD)
##.ACQUISITION SCHEME= undefined
##.AVERAGES= 64
##.DIGITISER RES= 22
##SPECTROMETER/DATA SYSTEM= spect
##.PULSE SEQUENCE= noesygpps1d.comp
##.SOLVENT NAME= COFFEE_meoh
##.SHIFT REFERENCE= INTERNAL, COFFEE_meoh, 1, 14.96075
##AUDIT TRAIL= $$ (NUMBER, WHEN, WHO, WHERE, PROCESS, VERSION, WHAT)
$$ ##TITLE= Audit trail, TOPSPIN		Version 2.1
$$ ##JCAMPDX= 5.01
$$ ##ORIGIN= Bruker BioSpin GmbH
$$ ##OWNER= Administrator
$$ $$ E:\/data/COFFEE/nmr/AC1613_BRAAN13343_8317232_K7zRmm9ZwH/12/pdata/1/auditp.txt
$$ ##AUDIT TRAIL=  $$ (NUMBER, WHEN, WHO, WHERE, PROCESS, VERSION, WHAT)
(   1,<2013-11-13 18:56:53.266 -0800>,<Administrator>,<X>,<go>,<TOPSPIN 2.1>,
      <created by zg
	started at 2013-11-13 18:45:23.391 -0800,
	POWCHK enabled, PULCHK disabled,
       configuration hash MD5:
       C8 4E 4E 5D D3 5C D8 9E 9F 52 82 E0 59 8A DE 15
       data hash MD5: 64K
       D7 9F EA 79 D4 C5 AE 06 83 A2 62 C0 59 62 59 B4>)
(   2,<2013-11-13 18:56:56.251 -0800>,<Administrator>,<X>,<proc1d>,<TOPSPIN 2.1>,
      <Start of raw data processing
       efp LB = 0.3 FT_mod = 6 PKNL = 1 PHC0 = 0 PHC1 = 0 SI = 128K 
       data hash MD5: 128K
       23 AA 44 73 71 E1 FC 91 9F CA 9D 16 CF F4 0C D3>)
(   3,<2013-11-13 18:56:57.438 -0800>,<Administrator>,<X>,<proc1d>,<TOPSPIN 2.1>,
      <pk PHC0 = -85.58899 PHC1 = 0 
       data hash MD5: 128K
       81 0F 54 AF F7 41 97 5A A3 C0 91 75 4E AE 5F A5>)
(   4,<2013-11-13 18:56:57.985 -0800>,<Administrator>,<X>,<proc1d>,<TOPSPIN 2.1>,
      <abs ABSG = 1 
       data hash MD5: 128K
       44 A1 6E 59 FD D3 31 B9 A6 21 8A 6B 57 7E 71 83>)
(   5,<2013-11-13 18:56:58.095 -0800>,<Administrator>,<X>,<proc1d>,<TOPSPIN 2.1>,
      <abs ABSG = 2 
       data hash MD5: 128K
       49 43 DE 94 63 FD B6 2D F2 E7 A4 15 30 7B 0C 80>)
(   6,<2013-11-13 18:56:58.188 -0800>,<Administrator>,<X>,<proc1d>,<TOPSPIN 2.1>,
      <abs ABSG = 3 
       data hash MD5: 128K
       78 AE 14 28 C2 05 78 9E 73 A5 8F 13 3B 70 92 86>)
(   7,<2013-11-13 18:56:58.298 -0800>,<Administrator>,<X>,<proc1d>,<TOPSPIN 2.1>,
      <abs ABSG = 4 
       data hash MD5: 128K
       DB 28 5B 29 19 15 60 D4 D3 ED A0 49 C2 3C B4 71>)
(   8,<2013-11-13 18:56:58.391 -0800>,<Administrator>,<X>,<proc1d>,<TOPSPIN 2.1>,
      <abs ABSG = 5 
       data hash MD5: 128K
       A1 82 D3 BE 9E 29 73 18 BE C8 8E EB BC 28 0A 0B>)
$$ ##END=
$$ 
$$ $$ hash MD5
$$ $$ 90 1B 80 38 FF 28 AB A1 2C 48 7D 13 3B 76 AE 0F
##$RELAX= 
##$RELAX= 
##$RELAX= 
##$RELAX= 
##$RELAX= 
##$RELAX= 
##$RELAX= 
##$RELAX= 
$$ Bruker specific parameters
$$ --------------------------
##$DU= <E:\>
##$EXPNO= 12
$$ [...]
##$TP07= 0
##$TPNAME0= <>
##$TPNAME1= <>
##$TPNAME2= <>
##$TPNAME3= <>
##$TPNAME4= <>
##$TPNAME5= <>
##$TPNAME6= <>
##$TPNAME7= <>
##$TPOAL= (0..7)
0.5 0.5 0.5 0.5 0.5 0.5 0.5 0.5
##$TPOFFS= (0..7)
0 0 0 0 0 0 0 0
##$TUNHIN= 0
##$TUNHOUT= 0
##$TUNXOUT= 0
##$USERA1= <user>
##$USERA2= <user>
##$USERA3= <user>
##$USERA4= <user>
##$USERA5= <user>
##$V9= 5
##$VALIST= <valist>
##$VCLIST= <CCCCCCCCCCCCCCC>
##$VD= 0
##$VDLIST= <DDDDDDDDDDDDDDD>
##$VPLIST= <PPPPPPPPPPPPPPP>
##$VTLIST= <TTTTTTTTTTTTTTT>
##$WBST= 1024
##$WBSW= 4
##$XGAIN= (0..3)
0 0 0 0
##$XL= 0
##$YL= 0
##$YMAX_a= 6096960
##$YMIN_a= -13166639
##$ZGOPTNS= <>
##$ZL1= 120
##$ZL2= 120
##$ZL3= 120
##$ZL4= 120
##$ABSF1= 14.96075
##$ABSF2= -5.597432
##$ABSG= 5
##$ABSL= 3
##$ALPHA= 0
##$AQORDER= 0
##$ASSFAC= 0
##$ASSFACI= 0
##$ASSFACX= 0
##$ASSWID= 0
##$AUNMP= <proc_prof1d_extract.lims>
##$AXLEFT= 0
##$AXNAME= <>
##$AXNUC= <1H>
##$AXRIGHT= 0
##$AXTYPE= 0
##$AXUNIT= <>
##$AZFE= 0.1
##$AZFW= 0.1
##$BCFW= 0
##$BC_mod= 0
##$BYTORDP= 0
##$COROFFS= 0
##$CY= 15
##$DATMOD= 1
##$DC= 0
##$DFILT= <>
##$DTYPP= 0
##$F1P= 0
##$F2P= 0
##$FCOR= 0.5
##$FTSIZE= 131072
##$FT_mod= 6
##$GAMMA= 0
##$GB= 0
##$INTBC= 1
##$INTSCL= 1
##$ISEN= 128
##$LB= 0.3
##$LEV0= 0
##$LPBIN= 0
##$MAXI= 10000
##$MC2= 0
##$MEAN= 0
##$ME_mod= 0
##$MI= 0
##$NCOEF= 0
##$NC_proc= -2
##$NLEV= 6
##$NOISF1= 0
##$NOISF2= 0
##$NSP= 0
##$NTH_PI= 0
##$NZP= 0
##$OFFSET= 14.96075
##$PC= 1
##$PHC0= -85.58899
##$PHC1= 0
##$PH_mod= 1
##$PKNL= yes
##$PPARMOD= 0
##$PPDIAG= 0
##$PPIPTYP= 0
##$PPMPNUM= 2147483647
##$PPRESOL= 1
##$PSCAL= 4
##$PSIGN= 0
##$PYNMP= <proc.py>
##$REVERSE= no
##$SF= 400.020009737219
##$SI= 131072
##$SIGF1= 0
##$SIGF2= 0
##$SINO= 400
##$SIOLD= 131072
##$SPECTYP= <>
##$SREGLST= <1H.CDCl3>
##$SSB= 0
##$STSI= 131072
##$STSR= 0
##$SW_p= 8223.68421052631
##$SYMM= 0
##$S_DEV= 0
##$TDeff= 65536
##$TDoff= 0
##$TI= <>
##$TILT= no
##$TM1= 0
##$TM2= 0
##$TOPLEV= 0
##$USERP1= <user>
##$USERP2= <user>
##$USERP3= <user>
##$USERP4= <user>
##$USERP5= <user>
##$WDW= 1
##$XDIM= 131072
##$YMAX_p= 367057483
##$YMIN_p= -12185
##$CURPLOT= <Network HP LaserJet P1505>
##$CURPRIN= <$Network HP LaserJet P1505>
##$DFORMAT= <normdp>
##$LAYOUT= <+/1D_H.xwp>
##$LFORMAT= <normlp>
##$PFORMAT= <normpl>
##$SURQMSG= 1
$$ End of Bruker specific parameters
$$ ---------------------------------
##NTUPLES= NMR SPECTRUM
##VAR_NAME=  FREQUENCY,     SPECTRUM/REAL,   SPECTRUM/IMAG
##SYMBOL=    X,             R,               I
##VAR_TYPE=  INDEPENDENT,   DEPENDENT,       DEPENDENT
##VAR_FORM=  AFFN,          ASDF,            ASDF
##VAR_DIM=   131072,        131072,          131072
##UNITS=     HZ,            ARBITRARY UNITS, ARBITRARY UNITS
##FACTOR=    0.0627417313425164, 1,          1
##FIRST=     8223.62146879497, -1241,        -64855
##LAST=      0,             76,              -65488
##MIN=       0,             -12185,          0
##MAX=       8223.62146879497, 367057483,    0
$$ Real data points
##PAGE= N=1
##DATA TABLE= (X++(R..R)), XYDATA
$$ [...]
67772 81846 84224 87012 89762 91909 93263 94130 94794 95164 95172 95120 95335 95811 96546 97851 99845 101960 103524
67755 103524 104636 105834 106998 107362 106746 106095 106412 107593 108664 108811 107873 106179 104367 103167 102918 103299
67739 103299 103744 104008 104020 103399 101622 98752 95597 92976 91079 89686 88729 88267 88070 87650 86790 85823 85160
67722 85160 84712 84010 82904 81906 81655 82130 82531 82029 80585 79000 78136 78079 78035 77112 75210 73143 71906 71898
67704 71898 72838 74207 75590 76679 77272 77436 77491 77683 77925 77994 77936 78120 78813 79813 80585 80762 80422 79843 79093
67685 79093 78083 77036 76654 77513 79310 80998 81802 81950 82270 83196 84373 85154 85277 85021 84894 85259 86113
67668 86113 87109 87853 88294 88786 89694 90993 92338 93428 94172 94568 94676 94696 94803 94757 93964 92209 90131 88640
67650 88640 87930 87430 86700 85939 85444 85064 84495 83870 83645 84019 84775 85636 86429 87011 87377 87868 88923 90561
67632 90561 92343 93959 95545 97323 99150 100591 101325 101392 101208 101395 102348 103839 105178 105885 106079 106144 106276
67615 106276 106435 106533 106480 106228 105942 105976 106521 107414 108348 109043 109196 108617 107583 106669 105905 104533 102026 99013
67597 99013 96633 95173 93966 92506 91015 89817 88857 88050 87601 87648 87960 88277 88605 88960 89137 88981 88593
67580 88593 87994 86902 85213 83442 82325 82110 82526 83293 84294 85365 86290 87026 87673 88183 88359 88147 87784
67563 87784 87596 87717 87968 87920 87218 86001 84924 84625 85186 86152 86916 87005 86262 85026 83949 83397 83133 82786
67545 82786 82431 82396 82649 82791 82616 82325 82156 82108 82058 81914 81605 81152 80755 80543 80280 79658 78906 78698 79285 80015
67525 80015 80010 79174 78280 78080 78526 78952 78926 78720 78819 79140 79189 78953 79054 79711 80123 79495 78218 77302 76935 76505
67505 76505 75964 76093 77203 78529 79356 79873 80385 80491 79773 78699 77996 77600 77008 76327 76123 76468 76994 77718
67487 77718 78971 80505 81549 81850 81928 82167 82383 82476 82729 83127 83049 82065 80516 78985 77714 76918 77079 78337
67469 78337 80004 81221 81795 81935 81629 80883 80260 80375 80954 81078 80401 79552 79299 79890 81310 83514 86112
67452 86112 88294 89480 89866 90092 90592 91351 92012 92068 91302 90235 89805 90363 91285 91802 91896 92085 92707 93860
67434 93860 95694 98125 100426 101700 101844 101502 101042 100163 98596 96624 94592 92448 90158 88149 86894
67419 86894 86345 86145 86139 86283 86327 86126 86055 86613 87668 88557 88880 88761 88369 87696 86826 85946 85077 84261 83989 84833
67399 84833 86460 87643 87566 86701 86105 86270 86941 87611 87826 87379 86592 86100 86040 85840 85084 84166 83665 83549 83500
67380 83500 83573 83905 84150 83898 83436 83374 83772 84287 84975 86150 87596 88782 89766 90970 92037 92028 90991 90291
67362 90291 90847 91902 92146 91290 89926 88511 87307 86790 87227 88076 88563 88660 88917 89515 90160 90718 91260 91590
67344 91590 91437 91133 91415 92360 93112 92985 92400 92410 93492 95134 96511 97376 98286 99958 102457 105129 107342
67327 107342 109040 110475 111709 112609 113076 112996 112230 111002 110037 109832 109935 109413 107949 106087 104526 103639 103602
67310 103602 104414 105677 106753 107257 107160 106522 105601 105165 106125 108635 111844 114613 116237 116646 116400 116462 117463
67293 117463 119125 120720 121955 122840 122923 121601 119316 117471 116796 116563 115854 114739 113618 112279 110521 109057
67277 109057 108760 109311 109636 109489 109606 110266 110712 110333 109659 109760 111124 113434 116035 118289 119767 120469 120781
67260 120781 121072 121358 121309 120472 118681 116563 115393 115955 117571 118740 118726 118024 117296 116559 115644 114763 114178 113807
67242 113807 113603 113905 114884 115983 116472 116336 116098 115919 115460 114641 113969 113913 114348 114788 114934 114817 114588 114343 114082
67223 114082 113839 113891 114644 116071 117359 117518 116448 115106 114498 114770 115397 115988 116556 117167 117655 117796 117628 117497
67205 117497 117762 118424 119089 119464 119871 121026 123179 125671 127566 128579 129129 129604 129950 129998 129817 129565 129244
67188 129244 128847 128580 128700 129214 129969 130917 132019 132902 133018 132297 131392 131009 131150 131276 131107 130896 130905 130979 130885 130845
67168 130845 131400 132716 134297 135463 135965 136062 136085 136124 136110 136078 136231 136731 137421 137873 137776 137361 137310 138147 139730 141362
67148 141362 142350 142407 141702 140775 140359 140935 142265 143568 144378 145020 145970 146912 146946 145825 144544 144362 145466 146911
67130 146911 147740 147798 147541 147482 148005 149361 151497 153896 155802 156688 156599 156147 156170 157187 159031 161112 163101
67113 163101 165167 167421 169401 170486 170706 170760 171229 172115 173205 174476 175863 177052 177823 178407 179067 179534
67097 179534 179328 178577 177987 177863 177689 176929 175909 175545 176388 178229 180422 182291 183358 183557 183266 182988 183088
67080 183088 183904 185786 188615 191533 193698 195258 197073 199444 201679 203081 203808 204459 205305 206334 207614
67065 207614 209031 210011 210078 209570 209219 209153 208981 208869 209717 211912 214542 216466 217762 219478 222116 225059 227551
67048 227551 229592 231543 233285 234306 234543 234670 235443 236994 238874 240603 242024 243235 244366 245447 246421
67033 246421 247272 248146 249290 250787 252426 253955 255347 256731 258146 259604 261328 263607 266318 268845 270683
67018 270683 271946 273104 274366 275600 276728 277939 279472 281418 283795 286645 289962 293555 297090 300303
67004 300303 303286 306554 310624 315383 320050 323931 327130 330279 333732 337287 340638 343652 346211 348187
66990 348187 349749 351393 353459 355898 358679 362095 366305 370808 374802 378006 380851 383847 387089 390360
66976 390360 393475 396393 399269 402472 406376 410980 415820 420401 424661 428953 433644 438790 444122 449267
66962 449267 454014 458470 462962 467778 473028 478769 485150 492303 500055 507856 515141 521814 528382 535531
66948 535531 543545 552105 560612 568669 576297 583845 591763 600395 609822 619821 629951 639723 648819 657317
66934 657317 665708 674546 684007 693897 704155 715145 727252 740294 753607 766700 779659 792875
66922 792875 806617 820894 835526 850245 864914 879790 895373 911834 928733 945525 962205
66911 962205 979216 996853 1015052 1033770 1053231 1073586 1094580 1115745 1136893 1158289 1180427
66900 1180427 1203699 1228141 1253414 1279136 1305328 1332430 1360760 1390043 1419644 1449172 1478750
66889 1478750 1508798 1539736 1571757 1604609 1637631 1670286 1702740 1735767 1770032 1805577 1841958
66878 1841958 1878676 1915522 1952675 1990470 2028797 2066860 2103902 2140182 2176752 2214136 2251711
66867 2251711 2288664 2325007 2361162 2396905 2431345 2463835 2494406 2523433 2551403 2578914 2606236
66856 2606236 2632674 2656885 2678032 2696283 2712103 2725531 2736391 2744719 2750572 2753748 2754123 2752086
66844 2752086 2748247 2742786 2735334 2725387 2712631 2697020 2678843 2658645 2636795 2613169 2587478 2559799
66832 2559799 2530602 2500322 2469166 2437264 2404692 2371281 2336635 2300419 2262548 2223142 2182538
66821 2182538 2141390 2100556 2060707 2022017 1984158 1946583 1908982 1871613 1835140 1799902 1765366
66810 1765366 1730473 1694588 1658026 1621733 1586615 1553068 1520839 1489170 1457288 1424982 1392793
66799 1392793 1361587 1331880 1303528 1275974 1248714 1221504 1194228 1166889 1139908 1114181 1090313
66788 1090313 1067723 1044944 1021118 996940 973891 952837 933646 915812 898873 882346 865800
66777 865800 849141 832554 816189 800164 784754 770140 756009 741838 727569 713588 700001
66766 700001 686450 672728 659093 645856 633154 621332 610895 601731 592876 583546 574022 565019
66754 565019 556529 547902 538830 529628 520609 511733 502956 494446 486356 478681 471401 464464 457674 450896
66740 450896 444357 438370 432835 427366 421911 416757 411912 406974 401754 396548 391594 386728 381768 376837
66726 376837 371988 366988 361801 356897 352644 348784 344967 341408 338353 335221 331073 325906 320676 315967
66712 315967 311403 306636 302096 298255 294755 290942 286879 283137 279814 276417 272706 269043 265825 263025
66698 263025 260376 257620 254500 250923 247264 244149 241845 240130 238765 237650 236434 234526 231810 228893
66684 228893 226311 223858 221105 218266 216051 214834 214357 214088 213448 211847 209021 205421 201893 198955 196616
66669 196616 194731 193115 191357 189067 186412 184044 182378 181268 180386 179539 178535 177209 175756 174665 174117
66654 174117 173761 173234 172513 171605 170351 168871 167761 167385 167254 166536 165045 163350 162034 161221 160759 160474 160172
66637 160172 159632 158678 157217 155366 153633 152728 152925 153752 154514 154937 155084 154925 154362 153509 152515 151235 149487
66620 149487 147573 146092 145237 144670 144109 143601 143149 142488 141425 140046 138477 136736 135005 133692 132975 132538
66604 132538 131959 131115 130010 128526 126718 125157 124517 124786 125213 125112 124497 123845 123529 123617 124033 124592 124937 124737
66586 124737 124084 123442 123038 122462 121166 119255 117466 116315 115607 114856 113840 112566 111031 109367 107972 107148
66570 107148 106734 106414 106252 106590 107501 108658 109623 109987 109407 107920 106163 104834 103996 103279 102723 102877 103994
66553 103994 105621 107100 108024 108118 107176 105434 103610 102318 101673 101517 101618 101536 100876 99898 99341 99345 99110 98092
66535 98092 96981 96893 97944 99220 99849 99514 98251 96498 95179 94962 95388 95393 94659 93818 93320 92926 92492 92447
66517 92447 92989 93458 93130 92258 91696 91694 91654 91072 90185 89559 89364 89248 88808 87967 86924 85847 84718 83548 82630
66498 82630 82415 83122 84542 86209 87607 88332 88338 88069 88038 88212 88109 87639 87449 88137 89421 90471 90883 90880 90668
66479 90668 90129 89263 88464 88052 87760 87048 85845 84697 84166 84290 84732 85259 85925 86808 87712 88207 87954 86979
66461 86979 85702 84716 84459 85009 86120 87487 88912 90185 90927 90772 89744 88324 86982 85798 84693 83960
66445 83960 84200 85595 87468 88812 89234 89199 89384 90017 90858 91554 91879 91837 91760 92140 93055 93909 94024 93441 92748
66426 92748 92129 91076 89290 87413 86407 86369 86389 85602 84091 82764 82527 83551 85131 86279 86615 86598 86732
66409 86732 86769 86084 84701 83451 82980 83070 83101 82778 82096 80987 79490 78107 77502 77742 78186 78253 78126 78465 79546
66390 79546 80832 81495 81307 80875 80953 81630 82349 82641 82566 82439 82468 82831 83787 85358 87029 88120 88477 88605 89089
66371 89089 90003 90877 91127 90595 89780 89411 89604 89611 88683 87046 85607 84786 84150 83343 82783 83028 83781 84076 83351
66352 83351 81901 80283 78725 77232 75938 75095 74904 75457 76721 78428 80114 81423 82293 82834 83143 83280
66336 83280 83226 82786 81736 80261 79020 78560 78783 79195 79524 79848 80262 80755 81320 81846 81945 81312 80262 79520
66318 79520 79406 79653 80100 80986 82240 83070 82816 81854 81072 80684 80219 79579 79349 79925 80935 81815 82404 82677
66300 82677 82369 81379 80216 79501 79133 78480 77383 76503 76472 77081 77595 77655 77550 77677 78059 78491 78895 79316 79673
66281 79673 79803 79755 79813 80136 80547 80778 80747 80508 80126 79819 79928 80479 80878 80474 79416 78647 79001 80527 82652
66262 82652 84647 85946 86401 86339 86080 85432 84090 82534 81888 82555 83601 83986 83919 84295 85155 85577 85112 84446
66244 84446 84285 84262 83509 81999 80717 80500 81120 81661 81532 80992 80780 81457 83033 85018 86665 87362 87071 86429
66226 86429 86172 86332 86234 85452 84500 84330 85316 87063 89036 90888 92189 92396 91402 89878 88740 88405 88713
66209 88713 89381 90249 91132 91708 91686 91008 89905 88836 88312 88595 89500 90551 91376 91870 91968 91486 90371 89066
66191 89066 88275 88284 88711 89167 89922 91524 93792 95706 96487 96445 96503 97115 98004 98736 99129 99128 98619 97527 95896
66172 95896 93868 91758 90136 89551 90033 91008 91754 91934 91741 91672 92090 92858 93463 93607 93564 93758 94174 94437 94324
66153 94324 93829 92885 91484 90015 88961 88210 87188 85838 84937 85169 86337 87761 89016 89914 90223 89903
66137 89903 89346 88931 88611 88330 88480 89368 90515 91179 91431 91946 92774 93191 92966 92905 93661 94673 94969 94583 94444
66118 94444 95059 95958 96428 96222 95497 94562 93908 94062 95120 96587 97850 98657 99050 99103 98959 98940 99330 100073 100903
66099 100903 101754 102828 104182 105444 106066 105845 105119 104464 104252 104476 104950 105592 106483 107607 108669 109316 109567
66082 109567 109912 110840 112317 113818 114826 115266 115473 115867 116634 117575 118212 118188 117671 117263 117362 117704 117702 117176 116502
66063 116502 116023 115584 114913 114225 114060 114469 114780 114442 113822 113718 114132 114073 112864 111272 110861 112278 114634 116627
66045 116627 117822 118586 119162 119347 119075 118811 119132 120107 121312 122330 123059 123632 124244 125051 126033 126906 127385 127629
66027 127629 128211 129493 131142 132503 133350 133961 134493 134675 134309 133744 133485 133524 133440 133145 133147 133991 135721 138042
66009 138042 140732 143721 146902 150063 152972 155490 157788 160491 164306 169313 174776 179917 184698 189551
65995 189551 194486 198900 202349 205145 207973 211046 213878 215778 216486 216302 215693 214794 213332 211059 208137
65980 208137 204967 201698 198168 194380 190754 187666 184846 181497 177090 171896 166697 162093 158158 154708
65966 154708 151698 149294 147659 146821 146791 147621 149155 150790 151746 151717 151200 151045 151675 152815 153916 154691 155246
65949 155246 155865 156877 158655 161464 165130 168969 172229 174629 176419 178060 180038 182795 186367 189964
65935 189964 192395 193314 193829 195417 198307 201356 203514 204961 206721 209519 213253 217280 220942 224020 226962
65920 226962 230522 234967 239782 244387 248959 254180 260225 266399 271852 276346 280150 283471 286230 288282
65906 288282 289561 290036 289739 288933 288073 287480 287103 286729 286345 286083 285784 284896 282944 280000 276407 272197 267095
65889 267095 261087 254637 248232 241926 235460 228569 221124 213324 205957 200079 196043 193073 190149 187046
65875 187046 184095 181221 177892 174035 170365 167569 165623 164098 162703 161345 160069 159188 159056 159453 159602
65860 159602 159140 158583 158448 158390 157888 157362 157800 159333 161024 162168 163026 164014 164892 165309 165617 166506 168037 169592
65842 169592 170645 171147 171264 171268 171712 173133 175320 177253 178127 178235 178600 179905 182110 184983 188563 192968
65826 192968 198067 203620 209544 215821 222250 228565 234713 240732 246412 251401 255642 259238 261789 262411
65812 262411 260766 257680 254234 250563 246094 240747 235205 230008 225037 220078 215299 210919 206908 203291
65798 203291 200346 198184 196523 195156 194237 193813 193502 193053 192845 193360 194522 196073 198214 201220 204695 207982
65782 207982 211301 215763 222133 230186 239367 249396 259944 270327 279925 288528 295918 301462 304481
65769 304481 304774 302555 298148 292039 284882 277134 268839 260079 251424 243653 237186 232031 228123 225495
65755 225495 224392 225466 229560 236864 246470 257194 268723 281533 295785 310838 325922 340829
65743 340829 355651 370083 383170 393660 400662 404125 404683 402850 398407 390832 380257 367629 353928
65730 353928 339554 324553 309009 293077 277023 261499 247418 235122 223931 212948 202280
65719 202280 193019 186009 180940 176775 172742 168704 164867 161444 158603 156441 154877 153657 152588 151712
65705 151712 151166 150928 150803 150720 150853 151361 152023 152320 151973 151332 151153 151889 153206 154249 154480 154270 154576 156007
65687 156007 158324 160890 163423 166165 169463 173466 178198 183643 189668 196067 202801 210043 217992 226859
65673 226859 237105 249386 263973 280369 297766 315779 334471 353690 372727 390704 407142
65662 407142 421997 435332 447081 457035 464915 470489 473765 475109 475151 474591 474056 474012 474711 476163 478169
65647 478169 480396 482456 483983 484624 483932 481394 476670 469751 460717 449380 435396 418785 400135 380236
65633 380236 359768 339402 319865 301628 284722 269073 254790 241805 229577 217667 206555
65622 206555 197282 190218 184635 179592 174741 170135 165844 162135 159461 157754 156104 153784 151335 149953
65608 149953 149862 149955 149170 147655 146347 145874 146168 146810 147406 147736 147816 147837 147966 148270 148818 149693 150917 152445 154188
65589 154188 155866 157069 157791 158824 161201 165276 170667 177013 184210 191926 199653 207620 217108 229306
65575 229306 244154 260647 277880 295346 312570 329152 345037 360218 374134 385826 394715 400851
65563 400851 404372 405101 402792 397501 389555 379326 367080 352967 337202 320327 303176 286434 270386
65550 270386 255267 241575 229720 219490 210254 201659 193873 187270 182192 178882 177240 176629 176331 176234
65536 176234 176767 178113 179831 181355 182507 183390 184003 184160 183683 182598 181172 179703 178208 176471 174513
65521 174513 172671 170958 168655 165141 160988 157616 155768 154878 154023 152994 152120 151524 150940 150129 149212 148696
65505 148696 149127 150528 152150 153106 153244 153130 153177 153275 153328 153612 154393 155595 157107 158994 161203 163454 165793
65488 165793 168855 173207 178640 184437 190049 195202 199629 203153 205928 208209 209911 210614 209972 207990 205004
65473 205004 201487 197680 193367 188248 182621 177334 172924 169203 165905 163269 161558 160423 159227 157779
65459 157779 156259 154661 152776 150629 148517 146703 145442 145073 145607 146361 146505 146042 145871 146835 148983 151626
65443 151626 153744 154439 153569 152081 151415 152365 154605 157215 159472 161315 163434 166791 171634 176964 181291
65428 181291 183862 184875 184694 183454 181429 179170 176986 174672 171958 168927 165851 162953 160548 159059
65414 159059 158563 158534 158378 158142 158430 159592 161178 162322 162671 162846 163864 166073 168804 171109 172680 173940
65398 173940 175526 177901 181196 185061 188766 191762 194060 195900 197268 198031 198238 197858 196516 194048 191203
65383 191203 189175 188381 188171 187726 186779 185530 184420 183993 184393 184953 184845 184170 183833 184312 185267 186397 187824
65366 187824 189377 190436 191048 192461 195871 201174 207520 214551 222412 231007 240033 249516 259556 269720
65352 269720 279309 288097 296226 303543 309695 314781 319177 322641 324243 323390 320463 316292 311377 305792
65338 305792 299477 292380 284557 276262 267830 259386 250860 242273 233885 226078 219240 213620 209068 205070
65324 205070 201299 198019 195656 194152 193082 192227 191572 190850 189611 187812 185863 183997 181973 179531 176774
65309 176774 173964 171348 169315 168312 168305 168549 168201 167152 166192 166468 168662 172397 176428 179709 182345 185232
65293 185232 188833 192743 196401 199619 202147 203383 203028 201660 200146 198728 197199 195697 194706 194284 193870
65278 193870 193024 191914 190949 190292 189892 189653 189318 188482 187057 185521 184363 183370 181809 179400 176805 174960
65262 174960 174059 173428 172415 171188 170571 171141 172606 174034 174657 174408 173766 173175 172667 172000 170998 169739 168539
65245 168539 167857 167982 168595 168785 167877 166248 164920 164269 163597 162249 160676 159872 160078 160651 161052 161275 161305 160906
65227 160906 160234 160009 160605 161416 161640 161347 161216 161376 161151 159997 158183 156436 155303 155003 155534 156692 158158
65210 158158 159720 161237 162363 162633 162098 161571 161937 163242 164693 165447 165230 164266 162949 161653 160620 159934
65194 159934 159666 160037 161202 162857 164359 165424 166469 168030 170003 171778 172999 173877 174685 175318 175532 175355
65178 175355 175082 175024 175471 176676 178569 180540 181890 182531 183015 183751 184533 185011 185424 186498 188697 191870 195637
65161 195637 199780 204091 208190 211828 215204 218649 222075 225254 228686 233595 240722 249513 259031 269325
65147 269325 281299 295386 311174 328443 347729 369409 392879 417248 442299 468033 493618
65136 493618 517735 539951 560885 580842 599070 614740 627910 638950 647525 652874 654837 653903
65124 653903 650282 643589 633561 620651 605648 589053 570965 551313 529993 507031 482850 458291
65112 458291 434196 411079 389196 368719 349675 331937 315534 300760 287726 275948 264758
65101 264758 254082 244460 236238 229102 222513 216287 210608 205820 202379 200594 199999 199326 197686 195650
65087 195650 194650 195314 196882 198267 199077 199440 199473 199350 199414 199683 199564 198552 196966 195493 194219 192707 190943
65070 190943 189533 188914 188960 189507 190653 192222 193475 193821 193515 193227 193199 193280 193555 194325 195407 196016 195605 194583
65052 194583 193938 194280 195409 196688 197631 198129 198248 197958 197110 195699 194000 192310 190615 188672 186442 184214
65036 184214 182193 180188 177962 175759 174139 173216 172380 171010 169191 167459 165980 164389 162456 160523 159132
65021 159132 158472 158399 158789 159542 160385 160946 161130 161278 161861 163012 164348 165319 165928 167032 169602 173587 177862
65004 177862 181512 184731 188074 191237 193336 194260 194987 196332 197990 199198 199862 200493 201314 201962 202121 202095
64988 202095 202583 204023 206232 208677 211042 213484 216259 219234 221943 224069 225559 226325 226139 224976 223116
64973 223116 220770 217887 214546 211240 208467 206202 203998 201473 198524 195291 192165 189634 187822 186289
64959 186289 184554 182652 180933 179501 178233 177211 176655 176472 176284 175973 175802 175870 175806 175255 174366 173577 173069
64942 173069 172650 172094 171455 171085 171395 172485 173983 175351 176340 177006 177344 177255 176914 176783 177023 177222 177002 176665
64924 176665 176816 177447 177827 177347 176128 174721 173517 172627 172106 172040 172502 173518 174963 176434 177479 178205 179484
64907 179484 182214 186430 191426 196665 202124 207701 212831 217206 221556 227145 234394 242365 249737 255979
64893 255979 261422 266501 271320 275920 280596 285684 291053 296004 299786 302190 303504 303963 303471 301940 299582
64878 299582 296620 292909 288252 282938 277585 272417 267168 261801 256925 253236 250892 249655 249314 249620 250064
64863 250064 250103 249528 248346 246448 243674 240054 235682 230520 224681 218763 213472 208978 204987 201390 198374
64848 198374 195925 193714 191617 189864 188554 187459 186571 186324 186851 187421 187137 186031 184965 184493 184283 183760
64832 183760 182924 182390 182835 184506 186996 189397 190901 191505 192093 193674 196539 200133 203617 206498 208923
64817 208923 211530 214965 219429 224692 230518 236943 244056 251766 259991 268923 278698 288790 298088 305729
64803 305729 311636 316087 319009 320004 318946 316240 312431 307754 302124 295438 287843 279786 271802 264220
64789 264220 257139 250740 245402 241340 238271 235712 233482 231673 230276 229310 229213 230552 233196 236328 239531
64774 239531 243314 248119 253358 258125 262600 267982 274967 282972 291093 299253 307989 317413 326811 335198
64760 335198 341987 347212 351298 354704 357689 360358 362821 365171 367288 368896 369878 370379 370479 369916 368304
64745 368304 365489 361514 356368 350018 342628 334461 325499 315531 304851 294618 286101 279598 274457 270147
64731 270147 266825 264665 263196 261786 260440 259513 258830 257842 256649 256119 256766 258165 259807 261827 264395
64716 264395 267016 269198 271376 274340 277878 280811 282433 283213 283942 284742 285152 284655 282880 279682 275283
64701 275283 270136 264547 258723 253143 248374 244334 240232 235591 231000 227556 225746 225134 224912 224540 224049
64686 224049 223965 224832 226673 229033 231686 235031 239613 245414 251802 258132 264318 270954 278831 288123 298062
64671 298062 307655 316666 325497 334134 341728 347366 350709 351636 349877 345524 339454 332672 325389 317199
64657 317199 308029 298476 289403 281600 275627 271468 268438 265859 263764 262541 262095 261998 262424 264181 267577
64642 267577 271896 276526 282158 290250 301334 314366 327903 341567 356013 371574 387364 401907
64630 401907 414433 425151 434232 440928 443976 442713 437594 429720 420053 408977 396435 382520 367957
64617 367957 353902 341222 330146 320577 312357 305130 298452 292403 287689 284774 283242 282455 282428 283414
64603 283414 284927 286008 286416 286868 287979 289622 291479 293553 295861 298126 300135 301958 303519 304459 304759
64588 304759 305097 306034 307155 307555 307058 306496 306776 308111 310148 312520 315113 318049 321518 325471 329378 332410
64572 332410 333999 334222 333570 332382 330538 327694 323682 318517 312102 304244 295160 285699 276766 268674 261392
64557 261392 255270 250940 248366 246508 244306 241749 239590 238200 237148 235911 234671 234126 234599 235588 236331
64542 236331 236720 237339 238553 239818 240181 239330 237838 236446 235411 234523 233470 232174 230949 230261 230118 229926
64526 229926 229349 228984 229582 230769 231380 231189 231323 232594 234246 235054 235033 235233 236245 237779 239586 241904 244871
64509 244871 248154 251440 254964 259265 264603 270706 277061 283501 290579 299088 309056 319475 329291 338338
64495 338338 346909 354758 361037 365005 366294 364677 360264 353945 347057 340480 334409 328891 324032 319676
64481 319676 315504 311543 308046 304808 301198 297060 292969 289393 286178 283104 280343 277993 275738 273432
64467 273432 271551 270584 270388 270617 271382 272894 274822 276642 278391 280400 282409 283610 283531 282401 280704 278945
64451 278945 277790 277736 278467 279155 279588 280459 282315 284798 287362 290230 294066 298937 304174 309277 314539 320748
64435 320748 328545 338166 349557 362620 377405 394129 413060 434534 459180 487967 521829 561323
64423 561323 606886 659314 719731 789010 867464 955097 1051765 1156683 1267662 1381118 1493031
64412 1493031 1600112 1700215 1791869 1873597 1943669 2000291 2041821 2066918 2074784 2065535 2040230
64401 2040230 2000395 1947472 1882699 1807261 1722305 1628970 1528853 1424556 1319385 1216176
64391 1216176 1116528 1021370 932000 850194 777238 713261 657609 609637 568867 534583 505604
64380 505604 480658 458949 440289 424652 411590 400204 389709 379852 370613 361682 352588 343379
64368 343379 334784 327520 321618 316447 311153 305010 297840 290411 284106 279762 277012 275039 273748 273730 275329
64353 275329 278243 281966 286071 290138 293985 298023 302792 308034 312816 316697 320009 322699 323666 321984
64339 321984 318245 313934 309800 305548 300967 296620 293352 291714 291912 293709 296254 298538 300268 301923
64325 301923 303907 306048 308076 310079 312182 314169 315675 316532 316662 315917 314327 312275 310157 307988 305529
64310 305529 302601 299051 294651 289363 283589 277834 272176 266383 260537 255244 251071 247973 245423 243043
64296 243043 240924 239326 238207 237223 236171 235231 234663 234525 234978 236658 240262 245701 252047 258450 264791
64281 264791 271304 277949 284491 290929 297572 304790 312828 321600 330386 337985 343571 347301 349943 352042
64267 352042 353697 354910 355765 356318 356602 356645 356259 355036 352947 350785 349531 349249 348943 347473 344242 339066
64251 339066 331999 323556 314719 306410 299064 292724 287209 282118 277022 271907 267211 263318 260304 258222
64237 258222 257174 256848 256426 255407 254306 254100 255056 256489 257569 258059 258235 258444 258861 259423 259864 259863 259306 258409
64219 258409 257631 257379 257644 257848 257215 255417 252795 249905 247089 244598 242823 242122 242528 243845 245896 248418
64203 248418 250886 252800 254184 255496 257072 258884 260876 263290 266582 271192 277382 285091 293952 303736
64189 303736 314814 327883 343056 359355 375192 389192 400575 409080 414784 417769 417751 414164 406895
64176 406895 396795 385204 372996 360363 347485 334983 323469 312852 302489 292066 282163 273803
64164 273803 267529 263070 259847 257583 256217 255413 254475 252917 250914 249088 248004 248025 249389 252045 255453
64149 255453 258889 262080 265316 268890 272747 276787 281062 285386 289058 291489 292883 293851 294463 294248 293097
64134 293097 291489 289644 287142 283788 280322 277751 276377 276023 276760 278730 281488 284349 287349 291149 295937
64119 295937 301128 306327 311937 318632 326778 336549 347890 360019 371618 381970 391393 400154 407618
64106 407618 413069 416828 419808 422403 424540 426512 428902 431874 435273 439299 444233 449555 454145 457414
64092 457414 459434 459977 458415 454848 450363 445670 440287 433636 426155 418531 410463 401220 391176 381868
64078 381868 374434 368645 363524 358293 352591 346432 340314 335053 331179 328585 326871 325781 325143 324582 323630
64063 323630 322171 320641 319702 319700 320491 321789 323563 325906 328603 331154 333347 335551 338295 341829 346326
64048 346326 352282 360279 370382 382012 394398 406944 419250 431168 442933 454935 467163 478940
64036 478940 489339 497775 504090 508197 509882 509148 506671 503631 500816 498011 494570 490565 486986 484661
64022 484661 483387 482385 481229 479853 477845 474346 468710 460968 451645 441547 431726 423137 415999 409719
64008 409719 403672 397848 392648 388281 384670 381719 379383 377539 376012 374764 373826 373131 372667 372821 374231
63993 374231 377086 380791 384666 388892 394374 401542 409622 417373 424295 430787 437313 443961 450851 458420
63979 458420 466983 476417 486507 497275 508578 519741 530136 540021 550417 562215 575834 591555
63967 591555 609579 629634 651047 673470 697263 723047 751245 782266 816805 855705 899735
63956 899735 949732 1006746 1071905 1146421 1231971 1330776 1444999 1576218 1725700 1894814 2084576
63945 2084576 2294787 2524106 2771108 3034892 3314294 3606695 3907841 4212811 4516810
63936 4516810 4814817 5100681 5367068 5606776 5814171 5985325 6117106 6206680 6252015 6252311
63926 6252311 6207696 6118929 5987887 5818069 5614101 5380834 5123382 4847922 4561669 4271532
63916 4271532 3982848 3699388 3424162 3159978 2909519 2675198 2458771 2260885 2081153
63907 2081153 1918901 1773669 1644794 1530850 1430018 1341040 1263371 1196294 1138241 1087226
63897 1087226 1041706 1000782 963764 929863 898362 868871 841343 815903 792619 771353 751830
63886 751830 733907 717755 703663 691723 681777 673609 667001 661749 657933 656270 657882 663420 672512
63873 672512 684246 698027 713743 731274 750261 770467 791969 814740 838218 861547 884091
63862 884091 905499 925396 943401 959537 974255 987762 999409 1007968 1012504 1012880 1009511 1002872 993252
63849 993252 980740 965283 946924 926093 903508 879627 854375 827680 800164 772875 746190
63838 746190 719387 691583 662930 634611 607761 582705 559242 537269 516889 498071 480503
63827 480503 463906 448394 434402 422165 411303 400989 390647 380409 370877 362477 355146 348561
63815 348561 342545 337122 332266 327734 323308 319188 315962 313992 312880 311769 310229 308572 307200 305950
63801 305950 304324 302157 299686 297060 294206 291224 288500 286175 283755 280595 276718 272925 269995 267955
63787 267955 266251 264607 263487 263563 264766 266075 266383 265443 263885 262471 261479 260673 259626 258116 256433 255266
63771 255266 255048 255400 255443 254684 253465 252516 252283 252712 253453 254146 254643 255068 255581 256101 256352 256167 255549 254537
63753 254537 253263 252199 252018 252983 254559 255764 255932 255245 254717 255493 257867 260949 263631 265812 268290 271460
63737 271460 274696 277274 279295 281296 283391 285388 287519 290395 294255 298716 303302 307837 312286 316651
63723 316651 321185 326387 332542 339367 346122 351987 356347 359014 360348 361012 361453 361561 360787 358631 355141
63708 355141 351071 347425 344658 342409 340109 337732 335763 334564 334014 333700 333260 332699 332595 333871 336975
63693 336975 341340 345977 350538 355404 360674 365527 368831 370114 369753 368460 366831 365196 363642 362168
63679 362168 360898 360059 359723 359726 359888 360224 360865 361948 363642 366107 369285 372808 376151 378844 380608 381465
63663 381465 381647 381172 379655 376830 373177 369509 365923 361735 356668 351494 347008 342917 338400 333507 329192
63648 329192 325960 323180 320018 316508 313380 311200 310076 309947 310743 312266 314211 316355 318633 321100 323903
63633 323903 327211 331014 335111 339521 344794 351519 359417 367183 373574 378623 383620 389950 398037 407311
63619 407311 416913 426392 436059 446824 459522 474179 490073 506703 524539 544506 566828 590672
63607 590672 614907 638863 662247 684670 705492 723930 739118 750283 757136 760106 760031 757690 753661
63594 753661 748440 742419 735827 728803 721404 713312 703689 691700 677256 661023 643689 625496 606612
63581 606612 587689 569813 553925 540417 529190 519942 512389 506354 501745 498467 496416 495554 495958
63568 495958 497669 500516 504137 508245 512766 517621 522413 526591 530063 533524 537976 543896 551073 559269
63554 559269 568849 580646 595355 613173 633948 657484 683650 712234 742735 774387 806474 838389
63542 838389 868984 895893 916132 927963 932099 930839 926199 919263 910996 902770 895608 889304 882753
63529 882753 875024 865795 854801 841292 824321 803540 779604 753732 726890 699467 671701 644185
63517 644185 617725 592829 569587 548009 528150 509918 493119 477868 464577 453322 443518 434538
63505 434538 426401 419492 413773 408706 403902 399410 395367 391780 388769 386612 385330 384524 383800 383105 382456
63490 382456 381710 380897 380496 380948 382050 383247 384436 386063 388453 391516 395154 399478 404435 409618 414687
63475 414687 419559 423859 426636 427133 425685 423339 420726 417815 414662 411633 408693 405146 400622 395891
63461 395891 392056 389158 386171 382452 378633 375884 374674 374611 375267 376717 379182 382427 385859 389268 393257
63446 393257 398696 405707 413505 421376 429526 438643 448844 459615 470870 483548 498798 516913 537481
63433 537481 560271 585263 611629 637229 659619 677546 691303 701826 709828 715874 720935 726509
63421 726509 734065 744467 757909 774277 793451 815288 839426 865102 891068 915637 937013 953871
63409 953871 965752 972855 975521 974100 969286 962269 954230 945693 936497 926283 914809 901846 887097
63396 887097 870329 851392 830023 805910 779222 750930 722344 694377 667437 641926 618441
63385 618441 597357 578503 561536 546519 533919 524050 516663 511133 506973 504131 502879 503519 506183
63372 506183 510760 516846 523797 531074 538739 547479 557938 570129 583739 598860 615999 635308 656278
63359 656278 678439 702008 727491 754855 783473 812673 841789 869702 894857 916041 932869
63348 932869 945344 953252 956325 954856 949850 942550 934028 925165 916612 908396 899598 888725 874702
63335 874702 857532 837935 816517 793546 769538 745578 722704 701193 680847 661885 645082
63324 645082 631021 619618 610599 603997 599848 597555 595872 593422 589048 581867 571401 557820 541935
63311 541935 524933 508072 492337 478101 465180 453465 443405 435609 429956 425445 421036 416482
63299 416482 412228 408753 406174 404326 402918 401583 399880 397445 394218 390537 386934 383707 380718 377667
63285 377667 374545 371687 369413 367787 366742 366259 366286 366589 366780 366552 365870 365006 364353 364109 364113 364098 364023 364079 364401
63266 364401 365004 365924 367154 368435 369451 370431 372272 375710 380498 385653 390446 394871 399239 403623 407858
63251 407858 411924 416251 421619 428644 437199 446454 455727 465246 475866 488149 502022 517301 534074
63238 534074 552414 572102 592979 615339 639701 666241 694663 724459 755032 785679 815806
63227 815806 845256 874198 902684 930568 957948 985375 1013335 1041665 1069755 1097295 1124523
63216 1124523 1151591 1177893 1202256 1223685 1241637 1255547 1264496 1267639 1264830 1256527 1243121 1224625
63204 1224625 1201084 1173024 1141447 1107629 1072960 1038617 1005182 972790 941918 913756 889481
63193 889481 869318 852732 839456 829873 824301 822342 823273 826793 833113 842480 854959 870582 889309
63180 889309 910608 933272 955980 978127 1000032 1022218 1044588 1066421 1087124 1106717 1125437
63169 1125437 1143054 1158770 1171705 1181237 1186910 1188309 1185175 1177468 1165201 1148285 1126677 1100679
63157 1100679 1071063 1038853 1005003 970246 935249 900789 867554 835709 804982 775406 747817
63146 747817 723304 702267 684291 668819 655538 644105 634016 624948 616940 610065 604226 599388
63134 599388 595665 592998 591081 589757 589071 588695 587875 586440 585503 586505 589740 594390 599810 606033 612931
63119 612931 619632 625187 629406 632725 635568 638165 640763 643652 646937 650414 653595 655853 656767 656491 655686
63104 655686 654993 654612 654323 653748 652607 650968 649261 647837 646598 645357 644431 644347 644895 645123 644637 644370 645540
63087 645540 648134 650958 652949 653979 654532 655221 656633 659101 662426 666172 670323 675303 681250 687640 693886
63072 693886 700087 707011 715516 726079 738636 752722 767912 784284 802350 822542 844979 869810
63060 869810 897450 928279 962314 999404 1039598 1083132 1130252 1181278 1236573 1296087 1359055
63049 1359055 1424507 1492066 1561839 1633562 1706280 1778979 1851138 1922432 1992330 2060445 2127090
63038 2127090 2193045 2258737 2323966 2388358 2451621 2513118 2571437 2624640 2670804 2708163 2734996
63027 2734996 2749748 2751389 2739420 2713573 2673819 2620917 2556719 2483651 2403839 2318977 2231057
63016 2231057 2142846 2057325 1976588 1901519 1832521 1770340 1716024 1670255 1633018 1603975 1582957
63005 1582957 1569978 1564872 1567110 1575964 1590773 1610995 1636030 1665058 1697137 1731511 1767760 1805531
62993 1805531 1844136 1882635 1920377 1957263 1993282 2027938 2060350 2089818 2115990 2138398 2156081
62982 2156081 2167746 2172070 2167740 2153554 2128906 2094281 2051120 2001090 1945446 1884952 1820229 1752176
62970 1752176 1682174 1611927 1543040 1476693 1413677 1354528 1299432 1248004 1199457 1153282 1109779
62959 1109779 1069716 1033401 1000183 968927 938904 910111 882822 857141 833015 810402 789134
62948 789134 768775 748888 729457 710892 693673 678134 664420 652296 641035 629949 619135
62937 619135 609383 601215 594357 588351 583270 579437 576754 574748 573125 571778 570394 568554 566334 564352
62923 564352 563013 561963 560392 557690 553797 549200 544697 540836 537421 533781 529693 525710 522374 519383
62909 519383 515872 511413 506425 501681 497712 494698 492593 491134 489850 488306 486453 484703 483627 483477
62895 483477 483995 484647 485012 484936 484442 483611 482520 481176 479529 477683 476069 475226 475373 476361 478001 480205 482726
62878 482726 484988 486387 486712 486188 485212 484097 483003 482028 481344 481149 481313 481174 480021 477800 475154 472722
62862 472722 470743 469350 468822 469239 470209 471235 472222 473377 474780 476256 477511 478245 478413 478479 479123 480399
62846 480399 481576 482127 482436 483094 483868 484046 483556 483007 482690 482296 481715 481365 481491 481717 481646 481457 481607 482318 483624
62827 483624 485531 487820 489985 491715 493235 494984 497259 500248 504028 508234 512188 515726 519562 524441
62813 524441 530143 535751 540679 545120 549706 555085 561599 568951 576379 583513 590901 599302 608737 618706
62799 618706 629109 640360 652731 666240 681159 697942 716559 736560 758088 782201 809877
62788 809877 841247 876341 916158 962287 1015483 1075143 1140344 1211103 1288453 1373388 1465850
62777 1465850 1564666 1668340 1775713 1885728 1996670 2105907 2210446 2307636 2395383 2471932
62767 2471932 2535556 2584406 2616724 2631402 2628306 2607912 2570803 2517914 2451126 2373006 2285788
62756 2285788 2191057 2090621 1987079 1883065 1780322 1679979 1583378 1491935 1406319 1326360
62746 1326360 1251835 1182861 1119531 1061650 1009004 961442 918546 879599 844128 812206 783983
62735 783983 759183 737277 717925 700944 686036 672856 661309 651476 643254 636318 630505 626012
62723 626012 623085 621645 621360 622015 623667 626372 629984 634441 640273 648547 660036 674533 691211 709673
62709 709673 730354 753908 780640 810822 845214 884654 929164 977900 1030202 1086380 1147266
62698 1147266 1213229 1283866 1358482 1436524 1517489 1600539 1684242 1766646 1845612 1919136 1985255
62687 1985255 2041774 2086395 2117429 2134282 2137073 2125916 2100780 2061935 2010315 1947593 1876137
62676 1876137 1798688 1717615 1634431 1550309 1466847 1385841 1308387 1234816 1165579 1101460 1042691
62665 1042691 988552 938357 892256 850562 812813 778202 746557 718143 692757 669775 649016
62654 649016 630829 615269 601757 589594 578297 567526 557266 547997 540016 532656 524990 517302
62642 517302 510948 506542 503246 500202 497717 496404 496021 495952 496200 496974 497684 497284 495477 492876 490090 487299
62626 487299 484576 481997 479474 477098 475592 475816 477739 480362 482730 484733 486956 490190 494967 501118
62612 501118 507805 514340 520909 528174 536369 545292 554981 565855 578226 592234 608226 626656 647643
62599 647643 671166 697683 727997 762490 800992 843316 889253 938022 988464 1039912 1092195
62588 1092195 1144588 1195395 1242753 1285171 1321107 1348895 1367583 1377210 1377854 1369138 1351248 1325720
62576 1325720 1294424 1258195 1217204 1172316 1125255 1077527 1029869 982730 936716 892516 850822
62565 850822 812311 777384 745936 717666 692454 670097 649942 631241 613858 598260 584858
62554 584858 573573 563922 555228 546974 539254 532663 527444 522992 518613 514430 511015 508398 506128 504120
62540 504120 502696 501789 500814 499526 498395 497947 498269 499358 501389 504313 507639 511022 514826 519798 526412
62525 526412 534725 544646 556140 569406 585064 603919 626292 651709 679464 709394 742016 778048
62513 778048 817881 861248 907187 954456 1002162 1049919 1097287 1143223 1186240 1225021 1258703
62502 1258703 1286556 1307566 1320571 1325055 1321810 1312535 1298633 1280684 1259350 1236404 1214296 1194841
62490 1194841 1178859 1166985 1160089 1158686 1162580 1171462 1185491 1205024 1230175 1260846 1296560 1335816
62478 1335816 1376069 1414928 1451107 1483687 1510884 1530419 1541137 1543487 1538184 1524952 1502885 1471631
62466 1471631 1431862 1384848 1332032 1274931 1215052 1153707 1091978 1030995 972132 916862 866303
62455 866303 820969 780950 746147 716231 690531 668368 649520 634053 621646 611507 603166 596941
62443 596941 593219 591551 590943 590849 591371 592524 593863 594898 595423 595270 594158 592038 589234 585934 581798 576385
62427 576385 569768 562471 554923 547329 539950 533109 526815 520644 514168 507404 500752 494530 488678 482930
62413 482930 477239 471959 467460 463511 459309 454330 449058 444575 441448 439315 437631 436375 435738 435447 434985
62398 434985 434507 435009 437282 440964 444900 448286 451177 454003 456983 460079 463245 466561 470208 474346 478880
62383 478880 483418 487696 492058 497207 503350 509933 516447 523150 530596 538687 546744 554535 562704 572038
62369 572038 582674 594235 606412 619201 632912 648302 666473 688225 713599 742335 774597
62358 774597 810711 850232 891847 934486 978078 1022825 1067943 1111495 1151349 1186003 1214618
62347 1214618 1236768 1252385 1261741 1265178 1262862 1254869 1241520 1223656 1202534 1179316 1154498 1127954
62335 1127954 1099680 1070412 1041316 1013180 986211 960619 936914 915349 895383 876098 857102
62324 857102 838724 821262 804324 787044 768806 749618 729888 710059 690528 671731 654083
62313 654083 637821 623035 609797 598091 587577 577796 568759 560966 554530 548635 542451 536401 531801
62300 531801 529175 527661 526288 525133 524766 525207 526047 527151 528556 529947 531001 532154 534245 537357 540647
62285 540647 543424 545834 548334 551053 553968 557211 560865 564711 568440 571859 574779 577099 579293 582532
62271 582532 587943 595829 605709 616926 629061 642137 656744 673863 694280 718233 745736 777004
62259 777004 812328 851704 894864 941553 991575 1044529 1099612 1155534 1210517 1262561 1309948
62248 1309948 1351446 1386016 1412560 1430252 1438997 1439312 1431741 1416506 1393710 1363742 1327480 1286106
62236 1286106 1240743 1192346 1142071 1091570 1042501 995734 951372 909630 871221 836700 805896
62225 805896 778323 753760 731999 712401 694286 677686 663190 651074 640949 632228 624557 617753
62213 617753 611650 606057 600692 595271 589950 585528 582793 581709 581629 582256 583870 586552 589762 592969 596360
62198 596360 600561 605884 612109 618928 626402 634936 644841 655817 667009 677792 688450 699742 711812
62185 711812 723921 735381 746243 756787 766643 774880 780832 784566 786695 788015 789301 791111 793798
62172 793798 797847 804083 813293 825685 841043 859436 881502 907830 938191 971395 1005705 1039344
62160 1039344 1070896 1099512 1124747 1146116 1162929 1174706 1181581 1183989 1181969 1175147 1163468 1147683
62148 1147683 1128847 1107593 1084215 1059283 1033694 1008108 982760 958029 934816 914054 895990
62137 895990 880205 866219 853889 843320 834611 827724 822429 818409 815470 813558 812582 812474 813524 816307
62123 816307 821012 827062 833820 841498 850952 862584 875788 889533 903199 916767 930417 943963
62111 943963 956436 966261 972187 974143 973038 969770 964794 958589 952071 946190 941288 936953 932345 926655
62097 926655 919633 911932 904756 899006 894828 892017 890540 890499 891851 894389 897850 901912 906290 911025 916468
62082 916468 922827 929959 937777 946587 956762 968328 981194 995518 1011372 1028151 1044795 1060746
62070 1060746 1076364 1092313 1108834 1125686 1142497 1158946 1174800 1190007 1204709 1219000 1232649
62059 1232649 1245113 1255693 1263687 1268557 1270143 1268682 1264492 1257632 1247943 1235328 1219782 1201199 1179511
62046 1179511 1155225 1129549 1103491 1076869 1048651 1018508 987634 957708 929346 902007 875247
62035 875247 849422 825107 802421 781282 761885 744507 728989 714791 701537 689221 677892
62024 677892 667372 657368 647717 638476 629797 621628 613491 604778 595399 586041 577552 570157 563439 557088
62010 557088 551414 547071 544460 543430 543563 544663 547004 551004 556644 563271 570042 576437 582256 587266
61996 587266 591075 593320 593859 592811 590542 587486 583736 578851 572340 564363 555697 546918 537943 528650
61982 528650 519643 511921 505749 500305 494712 489113 484382 480979 478487 476225 473750 470697 466814 462630
61968 462630 459589 458742 459464 460105 459885 459420 459284 458955 457664 455672 453979 453204 453353 454435 456479 459039
61952 459039 461439 463773 467042 472053 478582 485965 494112 503501 514392 526540 539716 554140 570162
61939 570162 587674 606038 624623 643282 662160 681111 699477 716548 732083 746263 759223
61928 759223 770788 780570 788160 793279 795934 796446 795280 792820 789333 784996 779894 774201 768531 763932
61914 763932 761287 760889 762826 767517 775352 785863 797793 810136 822742 835729 848634 860445 870241
61901 870241 877594 882452 884828 884575 881445 875437 867037 856890 845368 832783 819990 808234 798104
61888 798104 788990 779863 770289 760442 750468 740336 730173 720244 710515 700517 689716 677943 665570
61875 665570 653415 642355 632722 624110 615912 607981 600657 594370 589527 586585 585856 587231 590414 595411
61861 595411 602491 611686 622731 635549 650455 667712 687168 708436 731178 755167 780344 806977
61849 806977 835426 865477 896064 925874 954077 980268 1003850 1023859 1039464 1050474 1057225 1060038
61837 1060038 1058853 1053542 1044622 1033546 1022100 1011544 1002516 995608 991586 990976 993788 999822 1008872
61824 1008872 1020337 1032901 1044903 1054927 1061962 1065298 1064583 1059736 1050501 1036367 1017288 994329
61812 994329 969152 942965 916232 889201 862171 835341 808958 783718 760556 739821 720959
61801 720959 703162 686100 670013 655390 642578 631441 621383 611968 603418 596096 589687 583458
61789 583458 577339 572050 568018 564816 561924 559327 557002 554463 551399 548238 545534 543252 541192 539593
61775 539593 538587 537492 535558 533213 531727 531686 532519 533474 534268 534802 535176 536187 538962 543662 549098 554018
61759 554018 558275 562446 566891 571627 576537 581129 584438 585751 585367 584267 583156 582078 580696 578573
61745 578573 575323 570857 565498 559717 553851 548170 542963 538353 534245 530675 527935 526121 524849 523748
61731 523748 523065 523390 524911 527281 530142 533426 537124 541026 544780 548101 550963 553676 556662 559989 563246
61716 563246 565943 567900 569131 569580 569235 568314 567067 565510 563488 560843 557323 552650 547058 541555 537179
61701 537179 533956 530950 527304 522914 518068 512938 507645 502493 497780 493444 489153 484855 481005 478040
61687 478040 475591 472526 468045 462612 457473 453311 449849 446772 444406 443131 442623 442182 441495 440595 439339
61672 439339 437539 435533 434084 433673 434189 435208 436236 436821 436918 437063 437738 438668 439251 439588 440440 442099 443991
61655 443991 445624 447251 449274 451547 453779 456148 458947 461834 464088 465594 467090 469283 472069 474848
61641 474848 477396 480088 483094 485629 486429 485190 483200 482117 482226 482308 481189 478924 476351 474036 471999
61626 471999 470067 468045 465716 463094 460614 458816 457844 457454 457390 457462 457372 456803 455759 454521 453037 450546
61610 450546 446118 439681 432365 425619 419974 414793 409236 403219 397273 391736 386484 381413 376810 373051
61596 373051 370132 367617 364943 361788 358278 354876 351967 349553 347458 345719 344485 343620 342752 341803 341116
61581 341116 340924 340993 340919 340571 340083 339570 339012 338251 337078 335501 333950 332977 332671 332695 332892 333459 334393 335271 335897
61562 335897 336773 338457 340681 342578 343722 344507 345555 347102 349029 351158 353325 355293 356728 357379 357429
61547 357429 357600 358606 360347 361951 362847 363487 364666 366426 368166 369681 371524 374246 377797 381798 385867
61532 385867 389416 391598 392002 391186 390097 388951 387100 383995 379912 375592 371532 367896 364908 362904 361939
61517 361939 361540 361022 360022 358778 357955 358132 359272 360705 361764 362370 362754 362728 361766 360002 358620 358765 360295
61500 360295 362071 363339 364326 365553 367084 368632 369963 370961 371540 371714 371588 371213 370610 369984 369709 370029 370936
61483 370936 372329 374082 376013 378003 380115 382372 384522 386387 388262 390506 392788 394317 394828 394749 394354
61468 394354 393495 392395 391859 392180 392479 391767 390188 388531 387007 385315 383687 382985 383626 385032 386291 386982
61452 386982 387324 387897 389261 391492 394079 396483 398654 400719 402484 403833 405407 408088 411763 415313 418126
61437 418126 420929 424620 428836 432304 434453 436016 437981 440432 442647 444014 444497 444360 443838 443194 442821
61422 442821 442985 443538 444147 444773 445641 446743 447733 448376 448764 448955 448776 448208 447612 447281 447030 446491 445508 443978
61404 443978 441692 438775 435969 433877 432106 429681 426282 422579 419420 417123 415554 414432 413552 413029 413265
61389 413265 414275 415215 415168 414363 413975 414654 415860 416913 418031 419920 422732 425960 429143 432298 435720 439624
61373 439624 443907 448118 451704 454385 456215 457333 457909 458370 459354 461263 463990 467142 470321 473185 475624
61358 475624 478078 481464 486466 492926 499985 506845 513448 520543 528976 538688 548469 556972 563899 569913
61344 569913 575545 580670 585047 588828 592373 595977 599957 604552 609505 614106 617827 620549 622002 621543
61330 621543 618981 615179 611331 607797 604110 599919 595445 591046 586824 582733 578839 575449 573109 572373
61316 572373 573278 575179 577400 580003 583646 588751 595199 602828 611848 622566 634932 648507 662698
61303 662698 676804 689914 700986 709175 714119 715969 715137 712004 706791 699634 690699 680273 668824
61290 668824 657019 645570 635008 625537 617058 609304 602124 595826 591138 588583 587862 588076 588559 589356
61276 589356 590940 593791 598202 604065 610659 617054 622991 629111 636031 643465 650601 657118 663410 669973
61262 669973 677107 685265 695069 706634 719127 731299 742305 751825 759651 765617 769871 772768 774342
61249 774342 774251 772468 769651 766476 762867 758340 752936 747237 741561 735800 730180 725423 721757 718394 714609
61234 714609 710818 707916 705910 704031 702094 700930 701356 703344 706313 709694 713066 716259 719449 722738
61220 722738 725560 727089 727368 727508 728541 730540 733036 735687 738260 740408 741896 742731 742904 742404 741642 741365
61204 741365 741901 743055 745028 748848 755367 764351 775043 787149 800762 815805 832155 849898 868698
61191 868698 887221 903939 918353 930717 940793 947789 951655 953607 954997 956117 956375 955212 952599
61178 952599 948965 944893 940665 935944 930022 922491 913538 903650 893283 882806 872431 862037 851216
61165 851216 839602 827119 814016 800798 787959 775579 763281 750874 738962 728635 720604 714852
61153 714852 711030 708874 708258 709127 711394 714623 717832 719853 719962 718005 714000 707882 699602 689308 677486
61138 677486 665173 653856 644764 638171 633598 630635 629306 629732 631876 635723 641404 648999 658409 669445
61124 669445 681845 695234 709403 724731 742080 762082 784615 809003 834508 860524 886529
61113 886529 912138 937269 962129 986840 1011051 1034072 1055541 1075798 1095230 1113305 1128713
61102 1128713 1140519 1148646 1153039 1153054 1148213 1139116 1126876 1111901 1093862 1072767 1049384 1024600 998941
61089 998941 972813 946714 921040 896041 872042 849400 828217 808442 790277 774051 759695
61078 759695 746705 734647 723420 713078 703854 696295 690833 687116 684231 681706 679844 678927 678620 678481
61064 678481 678689 679947 682817 687346 693184 699882 707201 715199 724025 733755 744611 757018 771095 786300
61050 786300 802064 818653 836858 856975 878728 902092 927431 954629 982891 1011659 1041083
61039 1041083 1071253 1101673 1132003 1162722 1194442 1226946 1259484 1291770 1324170 1357111 1390805
61028 1390805 1425513 1461713 1499879 1540228 1582552 1626267 1670870 1716454 1763569 1812667 1864239
61017 1864239 1919631 1981125 2050729 2129268 2217077 2315316 2426148 2551835 2694329 2856257
61007 2856257 3042683 3262239 3526762 3850421 4250344 4748658 5372134 6146862 7091777
60998 7091777 8217170 9527309 11020303 12684353 14497461 16430690 18441190 20448631
60990 20448631 22318741 23889558 25040073 25751088 26107043 26242328 26282296 26314786 26380080
60981 26380080 26453711 26431401 26152055 25467397 24315785 22747345 20890693 18896736 16897334
60972 16897334 14988443 13228332 11643479 10239659 9013053 7955359 7053581 6290309
60964 6290309 5646597 5104352 4646458 4256691 3920988 3628647 3372022 3145476 2944585
60955 2944585 2765572 2604980 2460079 2329353 2211970 2106704 2011838 1925920 1847822 1775998
60945 1775998 1708497 1643926 1581753 1521492 1462389 1404214 1347646 1293432 1241695 1192440 1146154
60934 1146154 1103378 1064033 1027678 994129 963424 935381 909519 885295 862311 840594 820771
60923 820771 803539 788729 775330 762644 750953 740782 732057 724439 717936 712607 708049 703864 700413
60910 700413 698469 698176 698875 699832 700626 700900 700367 699187 697849 696518 694843 692587 690066 687755 685656 683292
60894 683292 680264 676695 673156 670077 667178 663605 658800 653051 646999 640825 634236 627122 619722 612228
60880 612228 604675 597289 590413 583913 577080 569410 561145 552854 544884 537532 531338 526648 523058 519847
60866 519847 516886 514621 513151 511898 510400 508981 508324 508684 509919 512038 515206 519161 522994 525754 527179
60851 527179 527788 528366 529413 530962 532829 534932 537307 539793 541888 543116 543478 543368 543031 542294 540818 538418
60835 538418 535144 531297 527449 524193 521690 519583 517503 515469 513747 512519 511893 511933 512350 512359 511268 509236
60819 509236 507077 505261 503454 501171 498512 495976 493762 491536 488811 485320 481125 476636 472509 469172
60805 469172 466298 462961 458522 453262 448016 443305 439027 434896 430883 427145 423797 420839 418158 415459
60791 415459 412440 409223 406421 404530 403352 402335 401372 400925 401347 402419 403635 404665 405407 405904 406376 407158
60775 407158 408403 409927 411450 412894 414413 416235 418483 421020 423525 425926 428638 432025 435745 439101
60761 439101 441991 444957 448186 451108 453259 454881 456255 457036 456817 455887 454776 453414 451425 449012 446838
60746 446838 445105 443415 441479 439380 437167 434756 432185 429440 426136 422012 417646 413935 410805 407213
60732 407213 402622 397770 393698 390656 388292 386287 384357 382145 379563 376933 374507 372253 370426 369802
60718 369802 370829 372832 374532 375174 374859 374146 373688 373976 374938 375911 376314 376220 376091 376249 376924 378413 380786
60701 380786 383614 386355 388862 391245 393516 395742 398249 401246 404465 407502 410266 412729 414575 415671
60687 415671 416675 418590 421750 425638 429570 433058 435734 437560 439094 441001 443271 445376 447170 449073
60673 449073 451317 453551 455260 456107 455805 454163 451398 447888 443582 438213 432182 426559 421930 417879 413951
60658 413951 410517 408221 407122 406938 407633 409081 410509 411155 411382 412421 414813 417735 420017 421311 421926
60643 421926 421979 421199 419497 417338 415381 413881 412503 410783 408678 406571 404759 403142 401569 400255 399562
60628 399562 399390 399192 398725 398528 399434 401688 404658 407345 409008 409418 408814 407758 406866 406398 406085 405518 404824
60611 404824 404766 405918 407802 409148 409119 408110 407221 407160 407805 408652 409321 409680 409784 409826 409987 410252 410529 411007 412203
60592 412203 414471 417554 420762 423562 425889 427977 430040 432084 433876 435077 435586 435725 435962 436437 436995
60577 436995 437709 439006 441072 443453 445677 448149 451921 457502 464313 471503 478946 487185 496682 507411
60563 507411 518954 530619 541566 551134 559056 565156 569064 570565 570057 568237 565341 561211 556170 551237
60549 551237 547238 544142 541661 540085 539999 541449 543965 547402 552219 558816 567087 576876 588495 602381
60535 602381 618401 635796 653733 671556 688554 703851 716743 726919 734167 738071 738346 735415
60523 735415 730273 723661 715680 706445 696801 687940 680352 673561 666928 660367 654126 648380 643440 640045
60509 640045 638876 639720 641637 644156 647934 653992 662590 673308 686106 701755 721102 744319 771236
60496 771236 802042 837097 876022 917467 959995 1002832 1045448 1086743 1125099 1159175 1188244
60485 1188244 1211778 1229119 1239676 1243093 1239136 1227728 1209265 1184550 1154202 1118447 1077746 1033369
60473 1033369 987043 940319 894596 851405 811973 776432 743943 713802 686095 661261 639375
60462 639375 620035 602678 586810 572191 559008 547684 538305 530348 523085 516203 509948 504755 500758
60449 500758 497499 494121 490107 485853 482252 479674 477688 475853 474348 473492 473034 472304 470948 469146 467296
60434 467296 465770 464831 464403 464045 463445 462825 462579 462707 462971 463379 463994 464364 463799 462301 460697 459725 459474 459851
60416 459851 461006 462987 465446 468042 470767 473508 475701 476872 477332 477918 479126 480770 482300 483207 483415
60401 483415 483538 484500 486512 488718 490271 491475 493324 496113 499157 501826 504214 506673 509311 512164 515436
60386 515436 519289 523661 528388 533171 537442 540763 543519 546638 550333 553615 555513 556388 557515 559663
60372 559663 562570 565596 568295 570359 571592 572194 572778 573897 575660 577827 580061 582093 583884 585693 587855
60357 587855 590514 593787 598103 604039 611699 620545 630017 640033 650727 661848 672658 682257 689819
60344 689819 694752 697039 697353 696459 694456 690971 686095 680583 674827 668124 659578 649555 639607 630968
60330 630968 623722 617546 612487 608567 605158 601420 597103 592439 587533 582546 578236 575479 574152 573254
60316 573254 572372 572345 574140 577715 582451 588187 595244 603877 614328 627137 642642 660255 678846 697848
60302 697848 717392 737279 756345 772976 785858 794186 797608 796218 790292 779981 765631 748399
60290 748399 730014 711736 694004 677289 662573 650503 640563 631768 623860 617175 611534 606082 600261
60277 600261 594300 588567 583081 577906 573419 569714 566181 562210 558061 554481 551587 548649 545022 540838
60263 540838 536663 532881 529604 526863 524593 522583 520676 518951 517568 516505 515611 514876 514553 514960 516137
60248 516137 517622 518646 518738 518179 517691 517684 518075 518771 519848 521071 521750 521539 521068 521267 522289 523654 525317
60231 525317 527878 531605 535890 539941 543587 547095 550674 554541 559095 564555 570572 576588 582469 588502
60217 588502 594895 601593 608448 615332 622168 629128 636598 644689 652919 660753 668299 676066 684127 692007
60203 692007 699364 706295 712861 718861 724309 729696 735343 740702 744716 746842 747446 747220 746464 744962 742393
60188 742393 738729 734312 729524 724436 718883 712937 707147 702062 697486 692502 686444 679785 673750 669011
60174 669011 664985 660640 655825 651444 648351 646427 644921 643359 641853 640643 639644 638466 636735 634512
60160 634512 632472 631498 631841 632787 633400 633489 633619 634359 635868 638079 640824 643689 646220 648422 650751 653457
60144 653457 656295 659109 662335 666564 671800 677534 683510 690077 697703 706317 715290 723988 732314 740716
60130 740716 749608 758758 767257 774049 778567 781014 782278 783444 785023 786554 787198 786798 786087 785766 785715 785377
60114 785377 784621 783895 783634 783830 784128 784048 783121 781132 778292 775044 771637 767978 763899 759442 754908 750666
60098 750666 746824 743028 738812 734364 730739 728962 728952 729648 730163 730513 731221 732618 734653 736988 739053 740334
60082 740334 740934 741611 742968 744758 746289 747313 748080 748552 748055 745879 741903 736439 729728 721829 712867
60067 712867 703105 692805 682209 671672 661616 652322 643852 636212 629517 623936 619489 615904 612705
60054 612705 609483 606174 603091 600718 599503 599757 601513 604394 607836 611614 616048 621463 627537 633482
60040 633482 638846 643829 648716 653294 657034 659701 661499 662709 663342 663154 661842 659188 655162 649955 643923
60025 643923 637492 631019 624655 618307 611831 605273 598803 592413 585801 578650 570886 562662 554350 546651
60011 546651 540398 535917 532620 529546 526302 523315 521196 520131 519925 520333 521130 521985 522546 522773 523111 524204
59995 524204 526335 529152 532050 534791 537629 540851 544444 548294 552422 556796 561107 565026 568506 571549
59981 571549 573800 574807 574700 574183 573710 572926 571125 568036 564060 559960 556453 553924 552317 551364 550984 551271
59965 551271 552094 553095 554352 556747 561187 567508 574529 581193 587233 592609 596875 599550 600825 601328 601176
59950 601176 599847 597199 594143 591834 590410 588942 586544 583144 579232 575306 571646 568245 564825 561227
59936 561227 557885 555485 554025 552696 550980 549383 548722 549167 550556 553195 557523 563153 569045 574775 581001
59921 581001 588526 597459 607448 618095 628766 638505 646667 653478 659643 665553 671154 676407 681586 687118
59907 687118 693193 699429 704937 708964 711547 713303 714588 715222 715073 714395 713356 711722 709418 707017 705185
59892 705185 703907 702752 701758 701441 701983 702920 703828 704924 706747 709521 713051 717125 721720 726857 732409
59877 732409 738157 743926 749558 754789 759348 763245 766827 770316 773331 775076 774959 772927 769394 765152
59863 765152 761207 758166 755704 753018 749884 746808 744014 740887 736784 731948 727174 722969 719590 717611
59849 717611 717762 720134 723992 728448 733049 737748 742644 747775 752922 757574 761264 763846 765234 765128 763388
59834 763388 760615 757944 756195 755419 755159 754760 753463 750678 746352 740895 734716 728061 721247 714683 708590
59819 708590 702996 698003 693703 689751 685476 680631 675734 671447 667893 664809 662035 659492 656849 653714
59805 653714 650271 647442 646137 646357 647122 647284 646357 644620 642604 640701 639212 638311 637689 636442 633761 629827
59789 629827 625775 622653 620488 618402 615517 611761 607889 604692 602161 599592 596556 593453 590919 589070
59775 589070 587835 587637 588982 591445 593954 596348 599824 605301 612006 618471 624440 630883 638256 645775
59761 645775 652669 659328 666702 675077 684110 693751 704433 716274 728674 740889 752651 763970 774674
59748 774674 784545 793790 802932 812102 820688 827826 833101 836698 838980 840098 839920 838245 835116 830928
59734 830928 826168 821003 815273 809016 802817 797445 793157 789535 785989 782306 778668 775262 771918 768218
59720 768218 763995 759661 755788 752336 748623 744270 739922 736663 734887 734100 733773 733948 734904 736645 738992
59705 738992 741924 745542 749746 754204 758592 762825 767026 771375 775921 780471 784716 788487 791852 794900
59691 794900 797492 799264 799910 799460 798278 796771 795061 793010 790532 787725 784585 780793 776077 770781 765755
59676 765755 761525 757655 753102 747136 739870 732016 724354 717516 712071 708410 706313 704823 702938 700580
59662 700580 698688 698231 699284 701155 703173 705107 707053 709277 712194 716201 721341 727093 732482 736430
59648 736430 738318 738375 737407 735918 733601 729778 724153 716995 708857 700412 692330 684889 677743 670457 663211
59633 663211 656677 651319 647117 643885 641347 638955 636144 632893 629611 626316 622398 617414 611745 606154
59619 606154 600993 596116 591340 586662 582176 578046 574550 571957 570405 569815 569849 570036 570251 571094 573336 576846
59603 576846 580438 583013 584473 585272 585571 585402 585287 585962 587412 588797 589511 589870 590524 591555 592499 593030 593260
59586 593260 593386 593306 592679 591292 589353 587407 585863 584493 582524 579443 575671 572209 569600 567458 565142
59571 565142 562532 559920 557360 554561 551345 547854 544327 541081 538719 537838 538285 539098 539466 539405 539297 539198
59555 539198 539045 539113 539757 540938 542488 544567 547299 550230 552823 555386 558852 563716 569882 577576 587495
59540 587495 599759 613461 627682 642371 657712 673080 687078 698289 705707 708934 708604 706436
59528 706436 704308 703161 702967 703514 704824 706900 709371 711472 712427 712041 710969 710046 709196 707344 703562 697906
59512 697906 690901 682742 673473 663542 653592 643879 634426 625608 618054 611929 606742 601881 597077 592446
59498 592446 588417 585565 584133 583677 583453 583153 582956 582987 583140 583470 584373 586196 588851 591974 595340 599044
59482 599044 603308 608066 612767 616804 620259 623899 628230 632798 636783 639975 642727 645151 646963 648144
59468 648144 649162 650333 651335 651649 651219 650560 650408 651363 653635 657004 661183 666313 672923 681346 691361
59453 691361 702358 713619 724369 733905 741906 748480 753787 757722 760007 760388 758681 754883 749377 742792
59439 742792 735462 727282 718366 709633 702325 696863 692498 688237 683897 680080 677334 675645 674776 674842 676371
59424 676371 679921 685803 694039 704395 716485 730061 745265 762408 781439 801763 822619 843467
59412 843467 863880 883176 900225 913567 921777 924017 920474 912329 901407 889953 880373 874501 872789
59399 872789 874466 878558 884212 889819 892587 889867 880940 867167 850681 833412 817017 802724 790871
59386 790871 781034 772889 766591 762206 759250 757126 755736 755385 756311 758479 761598 765105 768395 771349 774453
59371 774453 778079 781792 784700 786454 787593 788855 790407 791922 793229 794714 797019 800445 804764 809659
59357 809659 815249 821986 830030 838993 848499 858874 870999 885483 902164 920322 939127 957811
59345 957811 975773 992800 1009015 1024377 1038330 1050195 1059743 1067061 1071972 1074101 1073559 1070975 1066617
59332 1066617 1059949 1050485 1038695 1025593 1011702 996983 981556 965940 950659 936119 922753 910669
59320 910669 899231 887705 876367 866217 857434 848958 839934 830747 822091 813766 805207 796666 788941
59307 788941 782251 776241 771032 767399 765766 765699 766620 768523 771710 776299 782242 789554 798183 807758 817516
59292 817516 826346 832861 835662 833827 827253 816704 803580 789493 775814 763473 753095 745092 739546
59279 739546 736301 735398 737207 741981 749484 759261 770985 784254 798337 812552 826739 840981 854935
59266 854935 867812 878925 887980 894888 899605 902083 902122 899412 894028 886731 878443 869525 859923 849913
59252 849913 840330 832032 825351 820020 815513 811656 809070 808678 810480 813196 815553 817544 819944 822981
59238 822981 826285 829902 834412 839916 845631 850724 854994 858582 861490 863574 864612 864264 862334 859086
59224 859086 854867 849442 842261 833409 823770 814153 804810 795840 787431 779528 771876 764538 757763 751155
59210 751155 743766 735460 727501 721213 716548 712544 708745 705533 703317 702062 701539 701507 701666 701905 702593 704286
59194 704286 707094 710624 714544 718934 724019 729753 735753 741590 747129 752644 758579 765171 772300 779609
59180 779609 786588 792705 797782 802287 806973 812141 817532 823002 828916 835571 842501 848767 853930 858426
59166 858426 862828 866915 869781 870969 871155 871279 871040 868853 863553 855672 846643 837211 827192 816372
59152 816372 804861 792680 779778 766538 753707 741736 730649 720465 711211 702551 694090 686031
59140 686031 678892 672585 666541 660835 656264 653035 650225 647050 643957 641970 641512 642383 644347 647136 650364
59125 650364 654061 659030 666114 675241 685498 695945 706134 716198 726777 738442 750875 762981
59113 762981 774125 784819 795801 806906 817365 826814 835451 843465 850876 857757 864054 869267 872725
59100 872725 874187 874037 873018 871969 871427 871177 870401 868567 865972 863290 861005 859471 858940 859014 858501 856376
59084 856376 852638 847830 842106 835309 827675 819793 811964 804064 795915 787454 778673 769761 761153 753144
59070 753144 745659 738621 732129 725990 719593 712793 706423 701272 696905 692237 687026 682022 677779 674125
59056 674125 670747 667521 664153 660273 656153 652717 650507 649103 647806 646451 645229 644154 643173 642606 642922
59041 642922 643973 644870 644967 644800 645634 648015 651234 654489 658058 662718 668417 674469 680988 689149 699813
59026 699813 712831 728026 745761 765846 786782 806972 826036 844128 860592 874285 884745
59015 884745 892054 895889 895804 892273 886522 879395 871210 862586 854465 847363 841458 837293 835508 835835 837311
59000 837311 839583 843084 847738 852467 856321 859304 861666 863082 862989 861274 858277 854465 850314 846061 841444
58985 841444 836133 830453 825080 820021 814706 809325 805260 803721 804533 806745 809918 814309 820220 827744
58971 827744 836869 847399 858874 870851 883023 894905 905816 915573 924864 934435 944009 952334 958173
58958 958173 960946 960569 957110 950719 941682 930345 917052 902248 886619 870948 855601 840247 824448
58945 824448 808620 794031 781622 771238 762333 754950 749462 745720 743153 741560 741050 741333 741741 742010
58931 742010 742346 742702 742655 742112 741459 740798 739659 737684 735037 731899 728099 723600 718868 714451 710557 707289
58915 707289 704876 703413 702716 702658 703302 704537 706078 708096 711418 716801 724251 733291 743554 754911 767329
58900 767329 780797 795151 809841 824307 838693 853753 869848 886485 903102 919863 937364
58889 937364 955933 975512 995860 1016457 1036460 1055139 1072194 1087408 1100223 1109951 1116278 1119330
58877 1119330 1119337 1116424 1110608 1101966 1090939 1078439 1065388 1052126 1038584 1025030 1012250 1000915 991067
58864 991067 982240 973666 964429 953983 942740 931675 921176 910756 900009 889308 879288 870199
58852 870199 862056 854900 848511 842323 836003 829772 823749 817385 809940 801178 791193 779978 767646 754787
58838 754787 742102 729866 718161 707381 698013 690059 683147 677070 671795 667043 662432 658159 655105
58825 655105 654016 654731 656379 658235 660275 662871 666113 669579 672870 676088 679510 682941 685778 687677
58811 687677 688769 689241 689202 689030 689244 689740 689595 688057 685417 682575 679964 677235 673830 669597 664936 660539
58795 660539 656882 653814 650755 647389 644014 641180 639255 638429 638857 640630 643718 648031 653329 659133 665009
58780 665009 670936 677085 683288 689098 694367 699279 703752 707307 709612 710540 709567 705808 699126 690766 682437
58765 682437 675085 668834 663610 659310 655679 652593 650397 649558 650050 651433 653428 656124 659526 663143 666151
58750 666151 667982 668758 669102 669553 670368 671902 674711 678921 683884 688946 694248 700209 706620 713015 719629
58735 719629 727008 734798 742011 748567 755435 762967 770202 776285 781530 786509 791055 794857 798186 801268
58721 801268 803709 805372 807161 810038 813833 817916 822456 827948 833864 838838 842113 843842 844020 842036
58707 842036 837465 830595 821893 811428 799017 784603 768374 750787 732533 714269 696332 678814
58695 678814 661771 645341 629883 616118 604723 595621 587965 580993 574449 568120 561687 555418 550290
58682 550290 546766 543945 540588 536629 533013 530388 528663 527600 527080 526860 526806 527445 529713 533980 539703
58667 539703 546224 553617 562546 573338 585297 597061 607627 616795 624408 629616 631581 630704 628316
58654 628316 625081 620554 614451 607392 600042 592464 584807 577756 571630 565815 559801 554128 549591 546206
58640 546206 543662 542137 541818 542205 542759 543778 545814 548676 551787 555003 558169 560394 560797 559665 557931
58625 557931 555832 553058 549973 547636 546679 547050 548727 551739 555604 559744 564494 570694 578146 585392 591319
58610 591319 596202 600814 605223 608925 611764 614127 616320 618042 618664 618090 617119 616574 616191 615015 613014
58595 613014 611462 611333 612141 613033 614249 616657 620435 625133 630680 637422 645492 654906 665877 678162
58581 678162 690464 701462 711279 721045 731184 741035 750102 758767 767712 777355 787955 799712 812789
58568 812789 827689 845415 866652 890972 917328 945095 974101 1003953 1033977 1063493 1091527
58557 1091527 1116605 1137506 1153979 1166166 1173809 1176728 1175696 1172053 1166696 1160044 1152475 1144073 1134407
58544 1134407 1123259 1110975 1097397 1081197 1061303 1038373 1013817 988042 960855 932990 905852
58533 905852 880080 855673 833192 813560 796882 782678 770952 761828 754452 747660 741477 736599
58521 736599 732703 728766 724880 722112 720525 718849 716291 713260 710166 706916 703763 701289 699288 696933
58507 696933 694223 692020 690520 689049 687506 686584 686299 685688 684300 682736 681434 680256 679492 679879 681219
58492 681219 682423 683319 685131 688690 693589 699579 707405 717573 729562 742996 758418 776200 795692
58479 795692 816137 837379 858980 879572 897832 913276 925581 933913 937516 936337 930779 921586
58467 921586 910200 898315 886777 875687 865638 857809 852712 849963 849406 851308 855383 860933 868158
58454 868158 877883 889635 901320 911214 918967 924368 926624 925355 920890 913121 901602 887333 872799
58441 872799 859493 846901 834705 824314 817110 812589 809493 807644 807542 809215 812616 818262 826344
58428 826344 835962 846132 856868 868494 880629 892543 903742 913585 921130 925998 928530 928611 925290
58415 925290 918081 907748 895341 881495 867086 853331 840618 828357 816555 806287 798034 790836
58403 790836 783923 777970 773894 771522 770291 770295 771835 774720 778602 783182 787783 791734 795398 799568 803657
58388 803657 805976 806115 805426 804806 803784 802352 801693 802214 802674 802277 802001 802939 804986 808064 812817 819075
58372 819075 825424 831459 838686 848030 858287 868342 879096 891750 905825 920350 935362 950784
58360 950784 965387 978401 990673 1002800 1013658 1022183 1028981 1034698 1038470 1039666 1039571 1039682 1039846 1039668
58346 1039668 1040170 1042322 1045527 1049307 1054958 1063687 1074609 1086416 1099514 1114621 1130782 1146766 1163034
58333 1163034 1180317 1197612 1213561 1228503 1243143 1256503 1267255 1275784 1282906 1287831 1289495 1288776
58321 1288776 1287359 1285570 1283220 1281334 1281053 1282056 1283984 1288017 1295029 1303592 1311932 1320532 1330749 1342306
58307 1342306 1354376 1367645 1382908 1398942 1414126 1428989 1444911 1461542 1477736 1493682 1509904
58296 1509904 1525606 1540267 1555326 1571901 1588460 1603279 1617531 1633283 1650066 1666329 1682773
58285 1682773 1701152 1721010 1740599 1760042 1780809 1803160 1826733 1852461 1881282 1912218 1944232
58274 1944232 1978548 2016659 2057698 2100404 2145775 2194932 2246365 2298311 2351904 2408810 2467896
58263 2467896 2527519 2588915 2653604 2719557 2783755 2846584 2909866 2972613 3032762 3091220 3150195
58252 3150195 3209541 3268806 3330611 3397635 3468458 3540877 3616967 3700142 3789603 3882849 3981359
58241 3981359 4088385 4203265 4323421 4449973 4585792 4730065 4880457 5038623 5207835
58232 5207835 5387444 5575614 5775150 5990437 6221156 6465462 6726471 7008817 7311857
58223 7311857 7633813 7979551 8356302 8764796 9203103 9676137 10192455 10755019 11364781
58214 11364781 12030395 12764488 13573959 14464937 15454037 16563645 17810506 19212017 20800394
58205 20800394 22618171 24705972 27112441 29915019 33218905 37146723 41856020 47571169
58197 47571169 54584895 63235620 73898941 86976898 102840748 121754046 143834774
58190 143834774 169025330 197003112 227088833 258258112 289170751 318031557 342413135
58183 342413135 359516156 367057483 364244163 352060932 332726802 308866753 282909528
58176 282909528 256751449 231563864 207806443 185515666 164674755 145382485 127790054
58169 127790054 111996219 98017804 85795120 75193335 66028298 58117823 51307148
58162 51307148 45454910 40423072 36089297 32352798 29123085 26316864 23868768 21731389
58154 21731389 19860896 18212686 16751344 15452714 14294024 13251768 12309911 11459863
58146 11459863 10690852 9988941 9345721 8758923 8223884 7732704 7281878 6872090 6499992
58137 6499992 6158138 5843267 5556536 5295100 5051248 4820627 4604023 4400452 4205907
58128 4205907 4019831 3845725 3684089 3531164 3385668 3250424 3126220 3010024 2900404
58119 2900404 2798960 2705305 2616101 2530260 2450019 2375963 2305915 2239399 2178152 2121503 2066298
58108 2066298 2012180 1961996 1916155 1871503 1826697 1783838 1743778 1704478 1665195 1627793 1592729
58097 1592729 1558028 1523393 1491182 1462191 1434460 1407257 1382208 1359440 1336606 1312853 1289885
58086 1289885 1268124 1245697 1222303 1200099 1179533 1158187 1135071 1112292 1090977 1069305 1046219
58075 1046219 1023579 1002861 982880 962558 942975 925025 907834 891032 875899 862777 849992
58064 849992 836743 824475 814099 804396 794507 785432 777682 769870 761041 752191 744231 736561 728748
58051 728748 721450 714713 707570 700235 694375 690254 685923 680220 674233 668871 663405 657442 651895 646842
58037 646842 640815 633435 626483 621151 616384 611116 605828 600656 594176 585548 575937 566569 557297 548168
58023 548168 540310 533962 527587 520281 513264 507831 503699 500462 498608 497834 496354 493286 489936 487479
58009 487479 485261 482696 480795 480273 479980 478859 477817 478034 478921 479384 479692 480586 481816 483056 484994 488069
57993 488069 491225 493197 493998 494065 493220 491580 490125 489180 487583 484548 480993 477814 474270 469485 464331
57978 464331 460301 457516 455137 452805 450407 447397 443627 440110 437870 436756 436220 436283 436899 437374 437336 437266
57962 437266 437290 436585 434821 432974 431809 430768 429281 427855 426848 425455 423084 420478 418341 416056 413071
57947 413071 410453 409717 411054 413881 418192 424157 431296 439192 448209 458501 469303 480164 491766
57934 491766 504381 516625 527014 535728 543547 549975 553807 554727 553070 548756 541760 533013 523569 513450
57920 513450 502358 490848 479808 469450 459849 451660 445308 440212 435828 432628 431056 430518 430512 431702
57906 431702 434541 437827 440186 442141 445034 448491 450765 451334 451550 452643 454465 456319 457892 459163 460197
57891 460197 461211 462321 463363 464267 465173 465707 464879 462369 459223 456494 453905 450677 446974 443533 440437
57876 440437 437228 433726 429813 424963 419033 413157 408886 406704 406059 406467 407826 410036 413057 416977 421548
57861 421548 426172 430850 436454 443508 451447 459677 468463 477975 487309 495314 501713 506696 510223 512484
57847 512484 514138 515263 514872 512271 507964 502566 496012 488718 482141 476884 471502 464619 457144 450902
57833 450902 446069 441643 437525 434330 431818 429323 427318 426818 427551 428327 428891 429800 430766 430794 429857 428880 428082
57816 428082 426765 424759 422683 420739 418466 415712 412684 409070 404230 398271 391893 385326 378425 371565
57802 371565 365365 359753 354413 349822 346709 344821 343444 342708 343072 343936 344339 344792 346817 350718 355350
57787 355350 360109 365602 372225 379597 387602 396595 406296 415863 425255 435227 445650 455222 463191 470134
57773 470134 476604 482171 486204 488503 488771 486530 482053 476453 470475 464026 457060 449988 442929 435525
57759 435525 427737 419980 412371 404805 397870 392582 389047 386391 384191 382876 382491 382208 381423 380366 379419
57744 379419 378843 379315 381441 384425 386498 387147 387698 389171 390852 391798 392572 394425 397523 400991 404259 407560
57728 407560 411351 415764 420382 424350 427049 428749 430093 430991 430791 429524 427999 426495 424378 421317 417891
57713 417891 414569 411017 406925 402694 398806 395205 391671 388038 383800 378464 372721 368280 365944 364736
57699 364736 363435 362046 361096 360448 359664 358823 358074 356972 355055 352610 350150 347719 345381 343811 343505 343923
57683 343923 344330 345237 348097 353748 361962 372596 386482 405036 429401 460079 497047 540077 588993
57670 588993 643458 702404 763803 824969 882609 932366 968909 987318 984929 962280 922865 872050
57658 872050 815534 757938 702322 650586 603914 562878 527601 498019 473766 453894 437188
57647 437188 422909 410903 400961 392520 385095 378638 373338 369312 366548 364878 364019 363788 364109 364606 364589
57632 364589 363831 362923 362303 361461 359820 357931 356781 356278 355489 354204 353118 352420 351377 349458 346903 344056
57616 344056 341179 339013 338394 338975 339353 338756 337632 336376 334637 332309 330081 328462 327233 326316 326101 326342
57600 326342 325808 323840 321399 319796 319107 318481 317266 315198 312239 308977 306539 305401 304835 304067 303287 302953
57584 302953 302802 302301 301460 300518 299391 298017 296707 295580 294242 292557 291107 290303 289718 288876 287997 287313
57568 287313 286368 284754 282870 281270 279884 278624 278039 278541 279613 280666 282029 284208 286788 289048 291158
57553 291158 293698 296407 298476 299803 300993 302298 303476 304494 305551 306528 307183 307715 308470 309378 310355 311857
57537 311857 314151 316391 317433 317387 317398 318014 318767 319321 320006 321035 322091 322970 323938 325200 326650 328301 330384
57520 330384 332815 335056 336745 338096 339531 341277 343319 345427 347229 348637 350113 352112 354313 355870
57506 355870 356444 356584 357028 357996 359186 360119 360411 359974 359063 358027 357085 356350 355835 355257 354157 352475 350787
57489 350787 349652 348978 348288 347380 346477 345971 346227 347356 348936 350252 351060 351747 352612 353492 354297 355267 356283
57472 356283 356604 355887 354859 354327 354040 353350 352526 352459 353269 354127 354508 354837 355746 357285 359065 360761 362262
57455 362262 363595 364848 366128 367542 369133 370651 371541 371646 371832 373268 376014 379058 381879 385051 388926
57440 388926 392827 396203 399595 403556 407482 410599 413437 417130 421639 425840 429159 432007 434711 437082
57426 437082 439117 441259 443806 446693 449828 453016 455640 457079 457507 457854 459121 461947 466332 471193 474781
57411 474781 476427 477523 480004 484208 488965 493263 496828 499559 501614 503855 507015 510549 513394 515725
57397 515725 518680 522444 525974 528848 531974 536032 540430 544452 548405 552940 558114 563859 570631 578740
57383 578740 587434 595365 601795 606973 611583 616174 620904 625497 629559 633057 636297 639501 642680 645927
57369 645927 649433 653208 657151 661381 666067 670938 675411 679268 682849 686624 690965 696201 702375 708912
57355 708912 715005 720435 725728 731535 738166 745546 753238 760683 767781 775027 782718 790406 797600 804561
57341 804561 811774 819051 825882 832329 838759 845118 851349 858133 866109 874562 882038 888270 894415 901353
57327 901353 908826 916395 924131 932056 939848 947477 955370 963699 972211 980901 989978 999058 1007372 1015076
57313 1015076 1023442 1033310 1044051 1054458 1064016 1072985 1081934 1091501 1101972 1112781 1123038 1132693 1142541
57300 1142541 1152975 1163567 1174119 1185221 1197289 1209755 1221709 1232876 1243666 1254780 1266951
57289 1266951 1280480 1294781 1308895 1322597 1336469 1350895 1365726 1380930 1396669 1412550 1427722
57278 1427722 1441997 1456081 1470469 1484957 1499539 1514852 1531336 1548725 1566685 1585198 1603994
57267 1603994 1622480 1640625 1659126 1678315 1697706 1716958 1736411 1756200 1775765 1794777 1813744
57256 1813744 1833085 1852362 1871042 1889404 1908066 1927143 1946353 1965508 1984563 2003645 2023257
57245 2023257 2043830 2064978 2085968 2106951 2128751 2151280 2173400 2194752 2216486 2239576 2263552
57234 2263552 2287624 2311946 2336945 2362348 2387770 2413361 2439079 2464186 2488338 2512351 2537043
57223 2537043 2562157 2587273 2612880 2639507 2666666 2693749 2721238 2749869 2779262 2808619 2838302
57212 2838302 2869426 2902155 2935501 2968651 3001536 3034294 3067088 3100371 3134570 3169652 3205566
57201 3205566 3242701 3281200 3320213 3358672 3396577 3434811 3473942 3513836 3554056 3593933 3632602
57190 3632602 3669727 3705880 3741588 3776283 3808823 3838698 3866162 3891610 3915526 3938649 3961470
57179 3961470 3983754 4005007 4025029 4043602 4060224 4074868 4088606 4102933 4118793 4136525 4156082
57168 4156082 4176858 4197947 4219019 4240302 4261518 4281911 4301627 4321742 4342284 4361666 4378980
57157 4378980 4395341 4411861 4427813 4442327 4456499 4471985 4488598 4505183 4522029 4540387 4560225
57146 4560225 4580480 4601185 4623436 4647463 4672492 4698436 4725988 4755047 4784603 4814130 4843666
57135 4843666 4872645 4900112 4926051 4951074 4974972 4996929 5016945 5035669 5053116 5069097 5084692
57124 5084692 5101763 5121214 5143302 5169281 5201006 5239077 5283068 5333467 5391736 5458723 5534828
57113 5534828 5621453 5720471 5832534 5958019 6099451 6260954 6445576 6655525 6895131 7171486
57103 7171486 7492522 7867237 8308219 8832020 9457773 10208903 11116780 12220243 13561576
57094 13561576 15185182 17138071 19464704 22197389 25351839 28929184 32915865 37280820
57086 37280820 41978859 46959107 52167121 57543134 63029889 68577276 74104997 79423883
57078 79423883 84190862 87972131 90388861 91237476 90512212 88354726 84992767 80691867
57070 80691867 75712806 70280397 64579650 58773250 53014425 47442988 42175292 37298946
57062 37298946 32870678 28915027 25427671 22384324 19749096 17478660 15525744 13844493
57054 13844493 12394468 11140699 10052494 9103758 8273433 7544271 6901361 6332040 5826141
57045 5826141 5375312 4972309 4611092 4286825 3995044 3731119 3490710 3270252 3066713
57036 3066713 2877454 2700734 2535896 2382703 2240868 2110633 1993335 1890781 1804195 1734090
57026 1734090 1680836 1644664 1624983 1620196 1628390 1647598 1674390 1701710 1718680 1713936 1680655 1619389
57014 1619389 1536615 1440757 1339103 1237061 1138669 1046882 963525 889347 824281 767696 718643
57003 718643 676168 639470 607809 580366 556213 534435 514296 495446 478018 462385 448748
56992 448748 436960 426682 417581 409477 402567 397463 394606 393476 392801 391835 391027 390867 390365 387358 380359
56977 380359 369496 355699 339843 323004 306656 291785 278258 265767 254990 247065 242166 239515
56965 239515 238728 240258 244428 250872 259277 269950 283156 298412 314743 331108 346104 357798 364467
56952 364467 365363 360475 350030 334789 316510 297366 278888 261833 246903 234955 226396 220916
56940 220916 218085 218001 221232 228296 239257 253756 271334 291747 314789 339678 364755 387894 406926
56927 406926 419588 423686 418162 404103 384154 360747 335168 308304 281570 256517 233790 213080
56915 213080 194154 177454 163465 151832 141609 132337 124453 118432 113871 109876 106200 103485 102309
56902 102309 102406 103079 104048 105529 107694 110465 113871 118305 124301 132183 142043 153974 168202 184949
56888 184949 204157 225383 247875 270636 292307 311200 325637 334348 336644 332522 322945 309836
56876 309836 295404 281304 268562 258082 250834 247514 248360 253394 262654 276296 294863 319389 350735
56863 350735 388653 431811 478765 528430 579396 629152 674147 710319 733752 741760 734144 713312
56851 713312 682965 646841 608556 571624 538770 511412 490296 476400 470836 474269 487121 510132
56839 510132 544135 589335 645318 711517 786860 868727 952689 1033374 1105103 1161820 1197519
56828 1197519 1207978 1192523 1154167 1098208 1030696 957558 884087 814393 751089 695606 648920
56817 648920 612032 585840 570783 566814 573743 591456 619736 657871 704318 756635 811667 865793
56805 865793 914836 953784 977296 981393 965187 931042 883193 826321 764885 702741 642840 587399
56793 587399 538376 497303 464524 439178 420386 408236 403384 406008 415463 430670 450435 473494
56781 473494 498579 524426 549426 571098 586007 590543 582498 562426 533431 499204 462217 423860
56769 423860 385667 349430 316173 285909 258603 234636 214104 196496 181434 169008 158992
56758 158992 150502 142886 136248 130576 125135 119413 113977 109604 106115 102895 100038 98036 96678 95179
56744 95179 93227 91111 89035 87133 85943 85925 86556 86770 86358 86159 86727 87602 88115 88276 88514 89049 89806 90615
56726 90615 91281 91704 92038 92549 93324 94338 95623 97079 98303 99018 99543 100463 101965 103828 105834 107749
56710 107749 109173 109974 110659 111745 112972 113752 114212 114984 116067 116723 116636 116423 116727 117413 117932 118008 117702 117226
56692 117226 116880 116806 116703 116147 115262 114633 114497 114500 114382 114382 114758 115368 115977 116650 117588 118859 120453 122357 124384
56673 124384 126155 127357 127927 128044 128152 128828 130229 131780 132781 133329 134237 136094 138761 141734 144478 146430
56657 146430 147204 146973 146278 145456 144628 144218 144898 146878 149592 152164 153855 154189 153324 152328 152459 153811 155223
56640 155223 155726 155596 155581 155559 154546 151930 148314 145125 143478 143340 143620 143163 141654 139617 137678 136032
56624 136032 134541 133090 131825 131139 131261 131736 131613 130424 128759 127509 126830 126260 125596 125075 124809 124571 124164
56607 124164 123617 123019 122465 122018 121498 120601 119569 119331 120454 122343 124104 125730 127661 129584 130705 131024
56591 131024 131333 131965 132541 132986 133722 134726 135346 135418 135674 136713 138317 140035 141669 142940 143500 143668 144444
56574 144444 146363 148962 151649 154430 157479 160753 164430 168997 174549 180673 187394 195500 205402 216390
56560 216390 227487 238446 249326 259730 269016 276781 282623 286001 286901 286250 285126 283882 282397 280651
56546 280651 278618 276054 272914 269673 266835 264487 262579 261082 259524 256972 252998 248216 243401 238611
56532 238611 233595 228567 223984 219977 216501 213620 211201 208777 206206 203985 202426 200970 198877 196158
56518 196158 193295 190514 187864 185538 183488 181182 178386 175799 174209 173372 172429 171104 169750 168465 166991
56503 166991 165381 163993 162828 161533 160172 159382 159566 160365 161076 161335 161258 161143 161119 161063 160843 160585 160520 160630
56485 160630 160789 161136 161835 162525 162644 162429 162834 164247 166015 167580 169196 171041 172432 172685 172126 171481 170847
56468 170847 170023 169353 169355 169842 170238 170529 171124 172010 172800 173414 173988 174271 173891 173165 173009 173973 175852 178083 179993
56449 179993 180833 180327 179230 178833 179742 181452 183006 183720 183432 182546 181789 181598 181729 181689 181351 180867 180256 179467
56431 179467 178627 177908 177362 177113 177387 178062 178642 179025 179758 181076 182182 182164 181257 180526 180559 181066 181595 182029 182458
56412 182458 183000 183685 184278 184483 184555 185228 186684 188094 188692 188780 189154 190032 191155 192463 193965 195280 196003
56395 196003 196279 196475 196676 197030 198120 200294 202999 205428 207432 209157 210284 210466 210144 210140 210623 211128 211268
56378 211268 210868 209858 208691 208311 208954 209540 209057 207948 207257 207121 207171 207785 209552 211986 214133 216187 219032
56361 219032 222411 225000 226376 227429 228697 229635 229862 229861 230067 230354 230861 232203 234409 236517 237634 237668 236827
56344 236827 235400 234292 234754 236971 239717 241860 243544 245536 248185 251453 255260 259283 262949 266059
56330 266059 268998 272094 275280 278532 282076 285923 289748 293363 296745 299430 300564 299854 298030 296143
56316 296143 294855 294377 294540 294819 294828 294842 295269 295763 295621 295096 295437 297419 300618 304346 308592 313679 319600
56299 319600 325947 332024 336903 339966 341633 343124 345370 348512 352308 356408 360330 363897 367717 372566
56285 372566 378326 384213 389984 396119 402809 409616 416228 422835 429708 437149 445794 456125 467657 479437
56271 479437 491380 504230 518304 533231 549006 566193 584910 604673 625568 648613 674686
56260 674686 703959 736688 773619 815312 861912 913910 972302 1037734 1110323 1190440 1278630
56249 1278630 1374398 1476050 1582194 1692474 1806440 1922541 2038694 2152849 2262435 2364038
56239 2364038 2454353 2531132 2592987 2638970 2668555 2681362 2676664 2654008 2614587 2561196 2496554
56228 2496554 2422444 2340585 2253169 2161987 2067976 1972252 1876813 1783590 1693392 1606310 1522580
56217 1522580 1442637 1366879 1295786 1229761 1168571 1111386 1057561 1006913 959383 915115 874727
56206 874727 838563 805670 774518 744853 717831 694226 673523 654902 638056 622806 608988
56195 608988 596959 587197 579214 571841 564681 558168 552254 546480 541453 538653 538261 538637 538508 538281 538609
56180 538609 539097 539238 539324 539603 539634 539286 539369 540530 542463 544814 547812 551512 555474 559765 565158 571748 578545
56163 578545 585066 592237 601090 611612 623448 636610 651002 666346 683068 702141 723750 747451
56151 747451 773961 805229 842311 884899 933601 990835 1058597 1137061 1226350 1327786 1441990
56140 1441990 1567135 1700281 1838963 1980135 2118942 2250187 2370431 2478052 2572611 2655171
56130 2655171 2727964 2792538 2849002 2897349 2937744 2968699 2987047 2991098 2982385 2963162 2933859 2894141
56118 2894141 2844370 2784104 2710618 2620960 2514788 2394318 2263007 2125628 1987978 1854709
56108 1854709 1728335 1611181 1506418 1415642 1337178 1268544 1209128 1158927 1116469 1080005 1049383
56097 1049383 1024804 1005005 988423 974884 964404 955729 947856 941672 938297 937050 936685 937139 938419
56084 938419 939446 939880 941455 945568 951193 957044 963886 972520 981478 989319 997478 1008095 1020596 1033139
56070 1033139 1045964 1060374 1075659 1090061 1103829 1118559 1134332 1150127 1166145 1183097 1200084
56059 1200084 1215737 1230575 1245810 1260825 1274276 1286657 1299253 1311671 1322937 1333905 1346038
56048 1346038 1358954 1371660 1384855 1399408 1414078 1427583 1441474 1457960 1476359 1494784 1513890
56037 1513890 1535734 1560312 1586519 1615187 1647688 1682804 1718409 1755005 1794180 1835030 1875748
56026 1875748 1917388 1962176 2009372 2056678 2104500 2154821 2207035 2259055 2311503 2366714 2424587
56015 2424587 2483441 2543868 2607668 2674245 2742210 2813179 2889600 2970265 3052476 3137100 3226768
56004 3226768 3320840 3417288 3517892 3626100 3741280 3860713 3985713 4119831 4262458 4410374
55994 4410374 4564315 4727736 4900576 5080914 5271390 5476991 5697753 5930848 6178513
55985 6178513 6446310 6734915 7041729 7369539 7725182 8110769 8525025 8972278 9460967
55976 9460967 9994350 10572456 11202252 11895885 12660296 13499961 14429147 15470005 16640013
55967 16640013 17954558 19441552 21140738 23091285 25337847 27951453 31032063 34696989
55959 34696989 39093352 44431211 50992049 59107498 69147237 81512842 96591804 114680925
55951 114680925 135937004 160343353 187626258 217157325 247954446 278733218 307805420
55944 307805420 332859114 351059134 359799208 357752106 345427426 324853471 298751293
55937 298751293 269797705 240215523 211605423 184942990 160726143 139174252 120340012
55930 120340012 104126089 90307783 78599041 68705953 60341538 53238972 47176277
55923 47176277 41980473 37506915 33629719 30251478 27302191 24721286 22450938 20446492
55915 20446492 18677809 17115780 15728030 14489358 13384559 12398094 11510827 10708795
55907 10708795 9985298 9331964 8736499 8190797 7692528 7236957 6815435 6423553 6062673
55898 6062673 5731588 5424299 5137597 4873287 4631046 4406191 4196306 4003203 3826415
55889 3826415 3661470 3506613 3364755 3236517 3117462 3004565 2899839 2805153 2718711 2638885
55879 2638885 2566626 2501690 2440754 2381152 2322426 2262926 2199384 2131468 2062551 1994637 1926756
55868 1926756 1859462 1796189 1738390 1683722 1630849 1581879 1538230 1498111 1460066 1425186 1393794
55857 1393794 1363543 1332910 1303414 1276533 1251512 1227740 1206071 1185971 1164458 1139726 1113148
55846 1113148 1086202 1058288 1029126 1000457 973644 948059 923234 900138 878993 858400 837952
55835 837952 819247 803093 788186 773757 760902 750074 739815 729280 719503 710876 701899 691736
55823 691736 681596 672247 662629 652252 642551 634423 626754 618766 611530 605739 600287 594513 589678 586709
55809 586709 584664 582894 582630 584851 588564 592706 597808 604281 610972 616897 622634 628472 632987 634900
55795 634900 634622 632579 627834 619896 610177 600088 589334 577624 566404 557258 549909 543389 537747
55782 537747 533111 528330 522174 514926 507618 500837 495360 492632 493286 496328 500868 507409 516307 526256
55768 526256 535394 542589 546600 545574 538907 528455 516529 503682 489578 474814 460564 447367
55756 447367 435444 425268 416807 409165 401834 395209 389055 381867 372804 362991 353870 345523 337691 331077
55742 331077 326285 322614 319200 316341 314540 313277 311881 310580 309583 308182 305851 303235 300950 298481
55728 298481 295338 292143 289363 286088 281352 275741 270471 265837 261739 258786 257543 257440 257535 257697 258176
55713 258176 258979 260558 264031 269564 275583 280597 284734 288438 290980 291598 290989 290121 288518 285211 280562
55698 280562 275657 270638 265092 259442 254463 249932 245129 240327 236628 234697 234537 235938 238228 240272
55684 240272 241709 243486 246365 249783 253084 256746 261195 265471 268448 270478 272427 273937 274062 272889
55670 272889 271037 268346 264582 260804 258409 257273 256305 255350 255120 255698 256612 258077 260671 264008 267042
55655 267042 269447 271521 273093 273814 274175 274925 275692 275394 273740 271222 267994 263961 259549 255157 250248
55640 250248 244255 237938 232473 227620 222235 216249 210584 205408 200161 195240 191958 190582 189860 188799
55626 188799 187597 186567 185416 183975 182594 181466 180376 179347 178654 178137 177262 175898 174203 171930 168848
55611 168848 165709 163688 162799 161957 160586 159118 157810 156213 154126 152113 150721 149891 149306 148679 147700 146361
55595 146361 145271 144910 144730 143825 142326 141203 140769 140406 139784 139340 139433 139922 140739 142057 143737 145319 146648
55578 146648 147886 149022 150088 151670 154367 157869 161383 164830 168692 172906 176936 180828 185052 189286
55564 189286 192408 193865 194023 193125 190912 187533 183824 180386 177147 173958 170864 167703 164300 161157 159097
55549 159097 158116 157421 156656 156196 156186 156308 156642 157743 159555 161180 162070 162627 163354 164227 165171 166310 167388
55532 167388 167704 167003 165774 164389 162601 160130 157114 153745 150127 146688 144071 142330 140799 138946 136853
55517 136853 134732 132637 130724 129218 127956 126549 125003 123657 122589 121660 120949 120416 119397 117399 115210
55502 115210 114088 113882 113170 111429 109831 109541 110346 111428 112397 113033 112992 112461 112325 113059 114046 114488 114398 114275
55484 114275 114358 114619 114941 114973 114385 113482 112995 113151 113662 114650 116585 119001 120374 119821 118087 116329 114782
55467 114782 113188 111651 110310 108893 107343 106294 106239 106762 107286 108015 109309 110603 110864 109978 108946 108695
55451 108695 109191 109754 109852 109516 109174 109104 109141 109094 109240 109922 110754 110850 109932 108642 107632 106997 106728 107026 107822 108509
55431 108509 108514 107769 106578 105537 105556 107194 109771 111854 112788 113077 113145 112713 111761 111149 111634 112925 114279 115395
55413 115395 116254 116634 116374 115672 114732 113606 112626 112330 112556 112284 110861 108802 106999 105777 105147 105224 105841
55396 105841 106377 106551 106793 107378 107870 107941 107983 108264 108283 107775 107608 108681 110424 111435 111300 110839 110757 111006 111403
55377 111403 112006 112677 112966 112598 111735 110668 109566 108513 107531 106626 105894 105405 104923 104087 102946 101877 100935
55360 100935 99926 99291 100073 102528 105490 107690 109034 109997 110449 110016 109068 108426 108267 108127 107789 107513 107462
55343 107462 107514 107555 107507 107255 106977 107271 108429 109833 110536 110183 108988 107253 105476 104537 104985 106339 107661
55326 107661 108595 109258 109415 108613 107012 105379 104222 103500 103102 103004 102933 102462 101599 100886 100828 101514 102736 104119
55308 104119 105196 105706 105828 105933 106161 106433 106663 106765 106643 106424 106435 106793 107335 108053 109096 110104 110207 109199
55290 109199 108146 108188 109176 110108 110507 110658 110783 110735 110389 109738 108737 107546 106711 106578 106743 106624 106280 106124
55272 106124 106147 106037 105800 105600 105274 104778 104825 106227 108631 110679 111499 111368 110963 110670 110716 111262 112155 113062 113950
55253 113950 114984 115953 116272 115607 114107 112139 110286 109440 110190 112019 113670 114386 114345 113952 113319 112516 111760
55236 111760 111148 110642 110409 110723 111458 112086 112281 112170 111949 111625 111142 110381 109079 107183 105269 104135 103931
55219 103931 104119 104284 104514 104925 105388 105901 106771 108125 109508 110255 110163 109703 109587 110111 110837 111046 110576 109957
55201 109957 109658 109599 109594 109734 109897 109467 108184 106884 106607 107245 107837 108018 108306 109013 109767 110232 110558 110905 111143
55182 111143 111231 111336 111450 111450 111622 112443 113699 114468 114276 113668 113283 112968 112237 111179 110357 110045 110020 110034 110159 110662
55162 110662 111742 113386 115361 117310 118856 119668 119577 118703 117412 116064 114916 114182 113885 113658 113133 112583
55146 112583 112589 112920 112546 111187 109996 110025 110740 111033 110996 111497 112383 112461 111322 109984 109534 110102 111343 112937
55128 112937 114295 114677 114056 113232 112837 112838 113139 113886 114980 116064 117269 119177 121701 123782 124572 124279 123462
55111 123462 122248 120735 119475 118938 118905 118886 118726 118426 117901 117368 117481 118551 119953 120826 121046 121089 121213 121303
55093 121303 121319 121483 121997 122763 123340 123184 122229 121252 121301 122625 124487 126046 127009 127413 127314 126887 126381 125837 125253
55074 125253 124993 125428 126094 125981 124964 124258 125047 127235 129833 132027 133430 133877 133487 132563 131090 128720
55058 128720 125566 122515 120396 119274 118826 118890 119264 119545 119630 119940 120717 121515 121755 121341 120463 119350 118594 118995
55040 118995 120575 122253 123088 123257 123316 123191 122637 122085 122084 122287 121914 120965 120110 119578 119046 118594 118889 120211 121961
55021 121961 123333 124009 124087 123762 123258 122811 122638 122956 123830 124843 125295 125079 124955 125506 126291 126592 126602 127066 127954
55002 127954 128379 127900 127102 126729 126828 127046 127296 127839 128901 130341 131575 131934 131381 130675 130582 131089 131728 132324
54984 132324 132874 133036 132499 131765 131761 132549 133190 133136 133035 133769 135269 136747 137672 138030 137954 137660 137557 137922 138433
54965 138433 138485 138079 138055 139176 141131 142663 142716 141283 139159 137175 135909 135782 136882 138583 139825 140047
54949 140047 139577 138940 138128 136895 135443 134326 133769 133482 133160 132823 132633 132693 133122 134134 135909 138374 141164
54932 141164 143813 146071 148042 149943 151847 153858 156406 159993 164672 170215 176740 184534 193065 200892
54918 200892 207009 211745 215833 219047 220417 219437 216437 211995 206617 200820 194849 188394 181216 173978
54904 173978 167848 163211 159377 155586 151816 148441 145692 143706 142676 142659 143418 144616 145976 147252 148324
54889 148324 149398 150859 152836 155128 157549 160137 163008 166275 170152 174858 180378 186441 192640 198460
54875 198460 203387 207302 210572 213347 214891 214153 210985 206383 201438 196495 191387 186038 180590 175338
54861 175338 170732 167202 164721 162737 160659 158298 155748 153111 150459 147871 145377 143048 141205 140279
54847 140279 140290 140617 140486 139576 138084 136348 134646 133254 132421 132107 131905 131433 130827 130616 131010 131498 131412 130738
54829 130738 130021 129587 129279 128976 128839 128879 128774 128412 128181 128401 128883 129371 129986 130777 131268 131063 130634 130874 131963
54810 131963 133233 134024 134219 134031 133823 134103 135196 136900 138788 140755 142852 144727 145863 146327 146706 147252
54794 147252 147625 147632 147643 148022 148556 148687 148099 146888 145398 144046 143136 142769 142959 143733 144949 146199 147241 148385
54776 148385 150178 152781 155937 159389 163071 167112 171926 177984 185101 192325 199029 205638 212661 219428
54762 219428 224666 228027 230077 230949 230114 227492 223654 218769 212479 205166 198256 192635 187693 182522 177265
54747 177265 172608 168718 165452 162971 161371 160179 158935 157882 157378 157093 156548 156111 156622 158201 160178
54732 160178 162007 163597 164930 166156 168037 171547 176874 183342 190306 197485 204380 210133 214359 217587
54718 217587 220440 222669 223351 221830 218170 212829 206274 199000 191672 184974 179262 174447 170267 166613
54704 166613 163459 160662 158105 155990 154613 153829 153143 152462 152272 152753 153138 152457 150687 148714 147312 146618
54688 146618 146449 146566 146553 145997 145034 144382 144507 144966 144817 143667 142082 140968 140655 140640 140188 139058 137622 136389
54670 136389 135620 135381 135698 136491 137442 138141 138366 138197 137897 137666 137477 137121 136518 135921 135737 136156 137024 137940 138369
54651 138369 137938 136920 136229 136480 137205 137538 137574 138284 139945 141422 141543 140559 139710 139704 140254 140799 141104 141212 141329
54632 141329 141659 142008 141792 140852 140018 140236 141268 141950 141716 141154 140876 140604 139828 138823 138362 138631 139033 139043
54614 139043 138756 138426 137881 136756 135219 134093 134113 135162 136423 137243 137697 138262 139180 140312 141464 142596
54598 142596 143656 144440 144809 144912 144988 144920 144280 143013 141868 141721 142472 143057 142797 142243 142290 142863 143128 142858 142722
54579 142722 143127 143541 143389 143010 143119 143738 144263 144422 144553 144964 145500 145874 146070 146246 146451 146604 146656 146697 146912
54560 146912 147424 148152 148853 149305 149343 148794 147595 146077 144884 144507 145038 146380 148411 150777 152859 154241
54544 154241 155068 155791 156796 158382 160751 163630 166157 167533 167704 167184 166398 165549 164829 164254 163347 161562
54528 161562 159167 157270 156689 157052 157256 156628 155394 154158 153301 152992 153401 154541 155918 156748 156701 156184 155699
54511 155699 155235 154617 154111 154113 154362 154156 153364 152589 152226 151992 151643 151488 151777 152227 152639 153403 154775 156111 156536
54492 156536 156134 155797 156090 156868 157840 158854 159649 159922 159690 159208 158581 157860 157340 157246 157293 157083 156836 157143 158141
54473 158141 159531 161258 163394 165372 166236 165920 165560 166166 167627 169330 171076 172931 174699 176081 177017
54458 177017 177399 176835 175230 173375 172395 172671 173608 174364 174486 173965 173108 172356 172015 172042 172178 172151 171744 170907 169981
54439 169981 169520 169678 169942 169735 169064 168336 167775 167375 167249 167561 168110 168391 168150 167609 167120 166862 167020 167886 169502
54420 169502 171267 172254 172069 171294 170906 171210 171543 171145 170174 169541 169788 170504 170982 171082 171090 171008 170451 169285 167995
54401 167995 167299 167598 168847 170699 172636 174225 175441 176612 177852 178693 178602 177776 177135 177396 178364 179262 179549
54384 179549 179232 178598 177969 177697 177998 178631 178962 178548 177608 176809 176692 177342 178515 179938 181531 183399 185579
54367 185579 187825 189788 191478 193238 195177 196848 197812 198393 199452 201395 203649 205230 205667 205255 204585
54352 204585 203976 203333 202367 200870 198835 196426 193945 191727 189926 188378 186804 185154 183610 182257 180972
54337 180972 179758 178937 178827 179315 179909 180113 179653 178520 176955 175385 174250 173868 174340 175352 176124 175984 175136
54320 175136 174496 174569 174885 174817 174517 174584 175083 175478 175413 175026 174527 173954 173366 172862 172339 171571 170620 169823 169354 169106
54300 169106 169037 169309 169976 170831 171691 172637 173886 175484 177067 177860 177206 175380 173624 172901 172822 172319 171225
54283 171225 170506 170915 172117 173343 174305 175163 176085 177167 178422 179563 180164 180275 180451 180927 181244 181009 180562
54266 180562 180396 180363 180076 179786 180202 181465 182881 183751 184044 184179 184501 185080 185735 186120 186008 185564 185208 185172 185341
54247 185341 185422 185087 184026 182177 180031 178444 177962 178350 178828 178732 177986 177107 176768 177269 178310 179289 179779 179733
54229 179733 179344 178870 178565 178603 179023 179770 180809 182073 183356 184365 184966 185263 185386 185304 184933 184345 183726 183132
54211 183132 182470 181771 181301 181250 181425 181454 181232 180930 180640 180268 179819 179427 178995 178144 176787 175466 174861 175095 175754
54192 175754 176416 176899 177194 177464 177962 178684 179248 179404 179479 179930 180661 181207 181471 181741 182000 181785 180873 179697 178875
54173 178875 178667 178953 179443 179753 179580 178970 178222 177529 176945 176636 176754 177088 177238 177178 177181 177189 176774 175922 175272 175314 175804
54152 175804 176319 176930 177918 179065 179691 179342 178247 177191 176938 177561 178275 178261 177636 177203 177258 177284 176979 176843 177343
54133 177343 178148 178709 179076 179513 179771 179507 179142 179521 180804 182355 183668 184751 185573 185819 185473 185155 185541
54116 185541 186684 188098 189379 190565 192017 194033 196520 198983 200824 201648 201403 200532 199922 200326 201658
54101 201658 203197 204561 205996 207564 208703 209148 209739 211638 215007 219127 223469 227923 232217 235985 239416
54086 239416 242981 246354 248399 248498 247197 245237 242634 239196 235346 231825 228883 226344 224244 222858 222112
54071 222112 221478 220571 219577 218988 219025 219374 219384 218589 217133 215699 214911 214848 215126 215356 215483 215747 216424 217595 219127
54052 219127 220888 222916 225333 228128 231126 234131 237009 239801 242937 247204 253160 260466 268032 274920
54038 274920 280972 286579 292108 297665 303198 308588 313701 318512 323109 327530 331643 335282 338415 341081
54024 341081 343267 344992 346482 348073 349866 351530 352583 352824 352423 351535 349950 347271 343386 338616 333403
54009 333403 327981 322374 316539 310498 304453 298859 294113 290093 286195 282028 277948 274712 272640 271273
53995 271273 269796 267705 265137 262633 260545 258656 256510 254102 252011 250779 250367 250283 249962 248936 247015
53980 247015 244575 242378 240751 239159 236925 234186 231786 230381 229976 230239 230824 231420 231830 232135 232647 233650
53964 233650 235260 237340 239393 240781 241358 241771 242802 244562 246596 248627 250805 253309 256128 259335 263253
53949 263253 268322 274938 283317 293289 304331 316062 328569 341922 355462 367883 377971 385066
53937 385066 389039 390219 389227 386542 382374 377206 372032 367574 363612 359774 356674 355482 356519 359153
53923 359153 362996 368136 374062 379535 384052 388543 394002 400221 406537 413106 420554 428857 437384 445783
53909 445783 454027 461825 468792 475064 480922 485799 488475 488488 486754 484477 482011 479088 475783 472669 470073
53894 470073 467512 464038 459109 452999 446275 438962 430475 420520 409709 399073 389174 380000 371455 363468
53880 363468 355778 348198 341148 335373 330939 326998 322789 318400 314217 310085 305595 300892 296514 292467
53866 292467 288148 283332 278649 274756 271553 268620 265984 263863 261966 259750 257280 255171 253578 251936
53852 251936 249953 248233 247485 247574 247797 247753 247429 246770 245787 244954 244891 245576 246239 246125 245064 243391 241613 240134
53834 240134 238997 237981 237126 236985 237940 239481 240645 241059 241109 241192 241366 241675 242250 243004 243728 244558 245825 247474
53816 247474 249171 250976 253209 255566 257191 257958 258965 261269 264662 268215 271574 275184 279541 284680
53802 284680 290203 295549 300467 305418 311113 317479 323583 328867 333823 339029 344137 348471 352105 355613
53788 355613 359079 362125 364711 367150 369396 370947 371411 370569 368048 363577 357601 351065 344598 338407 332866
53773 332866 328432 324805 320904 315960 310187 304217 298463 293269 289083 285929 283077 279746 275963 272326
53759 272326 269131 266119 263022 259900 256901 254009 251254 248958 247499 246808 246263 245244 243767 242449 241878
53744 241878 242128 242820 243441 243535 242868 241599 240223 239228 238889 239308 240331 241356 241651 241119 240440 240263 240617 241372
53726 241372 242701 244599 246402 247492 248141 248881 249305 248485 246679 245580 246456 248747 251034 252773 254484
53711 254484 256601 258918 261140 263430 266121 269111 271731 273360 274191 275253 277460 280755 284442 288128
53697 288128 291843 295398 298368 300890 303719 307120 310247 312168 312981 313411 313730 313776 313709 313931 314325 314309 313745
53680 313745 313170 312987 312951 312664 312162 311764 311691 312038 312763 313528 313877 313794 313766 314100 314475 314413 313852 312978 311852 310638
53660 310638 309865 309889 310236 310070 309298 308659 308664 309029 309351 309745 310416 311122 311544 311922 312741 313953 314997 315580 315933
53641 315933 316336 316879 317772 319347 321474 323460 324838 325928 327151 328097 327926 326716 325825 326576 328884 331575
53625 331575 333835 335904 338353 341247 344374 347898 352180 356960 361315 364721 367795 371717 377125 383799
53611 383799 391012 397792 403181 406841 409392 411647 413709 415299 416727 418696 421097 422952 423943 425127
53597 425127 427495 430470 432638 433516 433732 433689 433054 431678 430154 429069 428239 427069 425392 423608 422228 421512
53581 421512 421422 421656 421742 421238 419899 417733 415028 412290 409962 408187 406902 406162 406153 406911 408096 409104 409364
53564 409364 408693 407474 406387 405734 405148 404148 402891 402095 402317 403540 405355 407190 408403 408624 408234 408187
53548 408187 409075 410523 411645 411934 411608 411373 412092 414427 418402 423275 428142 432729 437371 442223 446877
53533 446877 451031 455260 460590 467336 474789 482246 489909 498385 507691 517342 527274 538000 549693 561722
53519 561722 573402 584828 596698 609690 624270 640668 658567 677093 695661 714726 735273
53508 735273 757656 781310 805503 829900 854386 878745 902720 926174 949159 971915 994734
53497 994734 1017580 1039887 1061043 1081065 1100636 1120411 1140390 1159936 1178343 1195539 1212319
53486 1212319 1229681 1247818 1266075 1284003 1302004 1320560 1339291 1357378 1374678 1391720 1408710
53475 1408710 1425127 1440327 1453982 1465863 1475699 1483324 1488595 1491166 1490833 1488100 1483898 1478676 1472178
53462 1472178 1464148 1454723 1444109 1432469 1420201 1407729 1394835 1380778 1365333 1349101 1332560 1315388
53450 1315388 1297158 1278118 1258750 1239033 1218743 1198232 1178346 1159720 1142540 1126813 1112436
53439 1112436 1099145 1086877 1076127 1067558 1061244 1056522 1052538 1048729 1044990 1041778 1039992 1040366 1042779
53426 1042779 1046343 1050241 1054379 1059274 1065494 1073336 1082937 1094463 1108002 1123277 1139685 1156783 1174609
53413 1174609 1193365 1212991 1233372 1254784 1277729 1302360 1328491 1356104 1385410 1416436 1449068
53402 1449068 1483616 1520711 1560462 1602239 1645550 1690615 1737741 1786621 1836676 1887731 1939897
53391 1939897 1993049 2046802 2100757 2154520 2207751 2260468 2312898 2364738 2415022 2463096 2509241
53380 2509241 2553837 2596411 2636204 2673271 2708231 2741035 2770723 2796367 2817598 2834284 2846354
53369 2846354 2853969 2857176 2855192 2846681 2830951 2808441 2779886 2745675 2706422 2663648 2619242 2574322
53357 2574322 2528933 2482810 2436079 2389246 2342759 2296870 2251969 2208814 2168007 2129080 2090503
53346 2090503 2051051 2010976 1971350 1932437 1893426 1853895 1814775 1777401 1742110 1708345 1675933
53335 1675933 1645563 1617961 1593102 1570505 1549953 1531519 1514971 1499484 1484168 1468751 1453525
53324 1453525 1438649 1423655 1407798 1390793 1373102 1355558 1338758 1322854 1307803 1293677 1280612
53313 1280612 1268516 1257081 1246242 1236437 1228196 1221676 1216891 1214158 1213733 1215017 1216737 1218229 1220112
53300 1220112 1223499 1229033 1236957 1247529 1260754 1276022 1292678 1310832 1331067 1353376 1376911 1400811
53288 1400811 1424756 1448567 1471715 1493543 1513884 1533257 1552372 1571428 1589864 1606873 1622095
53277 1622095 1635547 1646932 1655520 1660924 1663523 1663821 1661724 1656855 1649129 1638610 1625172 1608934 1590679
53264 1590679 1571188 1550375 1527804 1503848 1479553 1455326 1430566 1404719 1378025 1351025 1323971
53253 1323971 1297035 1270556 1244757 1219560 1194927 1171022 1147893 1125268 1102804 1080224 1057236
53242 1057236 1033729 1010074 986762 963771 940827 918310 897187 877894 859950 842938 827189
53231 827189 813170 800784 789695 779764 770675 761655 752107 742133 731994 721440 710026 697681
53219 697681 684431 669980 654202 637799 621857 606834 592422 578237 564187 550354 537022
53208 537022 524697 513682 503751 494561 486119 478428 471007 463301 455338 447394 439257 430502 421327 412373
53194 412373 403771 395154 386672 379169 373088 367881 362792 357611 352368 346955 341549 336865 333412 330775
53180 330775 328148 325287 322494 319921 317381 314747 312025 309146 306157 303556 301945 301263 300763 299867 298601
53165 298601 297076 295045 292362 289582 287566 286477 285581 284179 282460 281237 281020 281603 282465 283234 283681 283507
53149 283507 282459 280638 278495 276439 274574 272911 271742 271540 272393 273684 274606 274986 275386 276294 277488 278431
53133 278431 279113 280091 281701 283627 285369 286841 288281 289809 291301 292564 293433 293903 294355 295443 297410
53118 297410 299626 301146 301700 301850 302188 302747 303182 303181 302557 301300 299757 298503 297729 296863 295068 292100 288560
53101 288560 285354 283047 281648 280794 280093 279378 278725 278242 277892 277550 277095 276441 275623 274970 274940 275522 275951 275420
53083 275420 274106 273122 273289 274286 275231 275806 276364 277062 277442 277029 275974 274838 273959 273297 272734 272203 271625 270963
53065 270963 270351 269919 269505 268798 267846 267139 267033 267276 267269 266751 266046 265715 266021 266729 267339 267607 267850 268658 270203
53046 270203 271969 273241 273780 273867 273826 273752 273749 274149 275235 276747 277858 277870 276919 275842 275298 275171 274994 274707 274647
53027 274647 274912 275197 275386 275796 276566 277204 277226 276962 277159 277847 278206 277715 276930 276817 277659 278960 280166 281138
53009 281138 282019 283013 284244 285545 286388 286323 285577 284971 285076 285632 285953 285767 285487 285683 286501 287587 288442 288772
52991 288772 288641 288417 288505 289000 289616 290079 290630 291954 294450 297605 300335 301986 302873 303723 304838 306043 307323
52974 307323 309021 311282 313630 315380 316354 316905 317364 317724 317872 317848 317856 318158 318889 319774 320161 319669 318746 318133
52956 318133 317803 316993 315418 313804 312835 312202 311292 310325 309963 310064 309702 308500 307068 305921 304715 303031
52940 303031 301226 299927 299142 298472 297917 297824 298157 298404 298241 297811 297271 296515 295499 294498 293795 293300 292654 291623
52922 291623 290303 289025 288100 287536 286971 285989 284585 283246 282525 282624 283403 284637 286107 287527 288617 289331
52906 289331 289884 290450 290859 290758 290071 289144 288352 287705 286974 286126 285466 285329 285708 286178 286171 285487 284622 284409 285107
52887 285107 286049 286459 286378 286434 286892 287477 287989 288470 288725 288473 288212 289165 291794 294959 297131 298004 298309 298558
52869 298558 298843 299577 301402 304210 307086 309454 311637 313999 316170 317540 318060 318142 318058 317844 317519 317001 315929
52852 315929 313892 310809 306915 302536 298074 294033 290737 288005 285305 282281 279053 276066 273679 271865
52838 271865 270290 268750 267442 266579 265829 264554 262717 261201 260914 261797 263035 264052 264951 265990 266985 267381
52822 267381 266840 265667 264646 264327 264482 264453 264055 263832 264173 264538 264065 262881 262258 263224 265367 267303 268170
52805 268170 268315 268600 269406 270449 271289 271649 271289 270008 268022 266122 265059 264765 264461 263634 262611 262020 261962
52788 261962 261981 261710 261243 260843 260520 260045 259367 258890 259174 260272 261488 262043 261952 261964 262594 263596 264473 265138 265812
52769 265812 266615 267547 268534 269112 268405 266055 263051 261045 260758 261541 262470 263311 264228 265172 265946 266500 266825 266836
52751 266836 266651 266695 267231 268013 268698 269365 270348 271827 273855 276507 279547 282253 284069 285321 286726 288251
52735 288251 289073 288771 288003 287729 288199 289074 290192 291726 293675 295653 297239 298337 299016 299156 298470 296960
52719 296960 295215 293971 293279 292400 290739 288669 287090 286314 285833 285145 284234 283201 281980 280795 280357 281131
52703 281131 282655 284054 284996 285709 286271 286467 286363 286368 286543 286349 285414 284235 283715 284202 285317 286584 287807
52686 287807 288841 289467 289717 290009 290634 291279 291438 291133 290804 290492 289720 288361 287041 286209 285331 283743 281947
52669 281947 281167 281665 282420 282686 282960 283986 285596 287196 288741 290496 292318 293989 295890 298461 301210
52654 301210 303160 304302 305667 307809 310027 311435 312119 312750 313533 313973 313454 311770 309293 306839 305151
52639 305151 304341 303992 303794 303792 304030 304440 305173 306631 308989 312036 315575 319542 323645 327337 330324 332547
52623 332547 333570 332625 329649 325703 321894 318301 314437 310343 306690 304089 302750 302502 302780 302913 302848 303181
52607 303181 304063 304644 304245 303524 303569 304211 304330 303683 303293 303853 304891 305920 307370 309601 311766 312624 312178
52590 312178 311676 311997 312813 313459 314019 315095 316754 318177 318513 317908 317462 318115 319702 321195 321769 321470 320915
52573 320915 320606 320572 320500 320075 319229 318118 316913 315711 314644 313826 313093 312031 310489 308899 307819 307337 307173
52556 307173 307146 307109 306594 305119 302978 301258 300761 301157 301418 300880 299758 298780 298527 299008 299720 300043 299627 298490
52538 298490 297002 295873 295827 296942 298453 299616 300641 302300 304636 306648 307451 307326 307309 308059 309407 310757
52522 310757 311599 311791 311736 312263 314068 317080 320424 323097 324772 326091 328127 331414 335409 338923 341058
52507 341058 341751 341579 341201 340848 340123 338385 335519 332246 329421 327187 325123 323058 321312 320148 319479 319159
52491 319159 319052 318643 317120 314272 311026 308650 307553 307109 306601 306024 305899 306519 307571 308531 309309 310271 311611
52474 311611 313017 314206 315483 317354 319769 322236 324595 327162 330060 332968 335647 338185 340515 342186
52460 342186 342939 343083 342941 342302 340776 338436 335714 332892 330078 327522 325558 324190 322913 321043 318230
52445 318230 314840 311832 309941 308883 307684 305923 304296 303690 304019 304336 303910 302885 301993 301915 302819 304224
52429 304224 305356 305759 305578 305286 305317 305959 307275 308982 310624 311952 312911 313305 312969 312397 312660 314384 317172
52412 317172 320268 323391 326653 330208 334428 339929 346848 354413 361831 369365 377862 387309 396385 403417
52398 403417 407362 408014 405859 401801 396629 390603 383802 376734 370257 364928 360795 357733 355621 354176
52384 354176 353034 352024 351168 350424 349772 349479 349982 351506 353995 357330 361316 365560 369666 373511 377140
52369 377140 380570 383909 387404 390961 393853 395346 395475 394849 393938 393039 392654 393190 394269 395031 395174 395156 395385
52352 395385 395835 396549 397847 399760 401823 403679 405429 407150 408600 409749 411169 413516 416795 420472 424085
52337 424085 427624 431570 436687 443426 451346 459448 467317 475678 485553 497185 510039 523566 537634
52324 537634 552381 567974 584455 601611 618984 636118 652785 669070 685432 702622 721225
52313 721225 741207 762109 783645 805776 828277 850802 873478 896857 921032 945283 968978
52302 968978 992371 1015965 1039386 1061458 1081358 1099290 1115920 1131421 1145122 1155978 1163395 1167687
52290 1167687 1169718 1170136 1169086 1166585 1162777 1157740 1151395 1143911 1135949 1128213 1120948 1114043 1107505 1101633
52276 1101633 1096886 1093727 1092390 1092595 1093669 1095178 1097346 1100756 1105789 1112419 1120334 1129122 1138557 1148875
52262 1148875 1160563 1173806 1188360 1203990 1220663 1238203 1256260 1274817 1294267 1314589 1334817
52251 1334817 1353740 1370825 1386089 1399360 1410175 1418242 1423601 1426497 1427459 1427197 1425958 1423154 1418164
52238 1418164 1411315 1403581 1395356 1386049 1374936 1361990 1347855 1333442 1319532 1306404 1293748 1281212
52226 1281212 1268966 1257381 1246319 1235220 1223929 1212956 1202858 1193783 1185736 1178823 1173094 1168440
52214 1168440 1164819 1162325 1160994 1160816 1161907 1164283 1167467 1170802 1174235 1178265 1182927 1187357 1190748 1193392
52200 1193392 1196410 1200709 1206507 1213598 1221617 1230049 1238282 1245775 1252270 1257981 1263484 1269086 1274274 1278164
52186 1278164 1280547 1281977 1282661 1281871 1278797 1273455 1266248 1257183 1246299 1234559 1223485 1213823 1205190 1197041
52172 1197041 1189340 1182190 1175533 1169554 1164836 1161702 1159800 1158664 1158364 1159242 1161349 1164545 1168831 1174021
52158 1174021 1179172 1182955 1184790 1185293 1185476 1185735 1185812 1185520 1185222 1185491 1186428 1187489 1188180 1188864 1190523 1193529 1196922
52141 1196922 1199263 1200026 1199811 1199387 1199033 1198834 1199052 1199969 1201780 1204854 1209714 1216499 1224842 1234647 1246634
52126 1246634 1261638 1279617 1299809 1321631 1344885 1369274 1394362 1420043 1446465 1473371 1500126
52115 1500126 1526552 1553092 1579787 1605579 1629145 1650137 1669278 1687600 1706039 1725312 1745524
52104 1745524 1765902 1785445 1803821 1821265 1837720 1852638 1865644 1876760 1885724 1891586 1893371 1890924
52092 1890924 1884698 1874940 1861495 1844529 1825177 1805254 1786198 1768293 1750882 1733323 1715596 1698020
52080 1698020 1680739 1663838 1647855 1633755 1622265 1613475 1607115 1602835 1600141 1598474 1597801 1599009 1603313
52067 1603313 1611182 1621955 1634435 1647734 1661593 1676154 1691518 1707511 1723864 1740620 1758166
52056 1758166 1776627 1795311 1813024 1828995 1843321 1856370 1867890 1876879 1882287 1883765 1881756 1876991
52044 1876991 1869958 1860785 1849500 1836362 1821875 1806468 1790160 1772677 1753968 1734520 1715035 1695798
52032 1695798 1676595 1657280 1638223 1620020 1602804 1585980 1568573 1549831 1529769 1509391 1490131
52021 1490131 1472639 1456060 1438932 1420870 1403070 1386977 1372909 1360260 1348583 1337826 1327604
52010 1327604 1316965 1305183 1292419 1279248 1265640 1250705 1233498 1214007 1193321 1172845 1153298
51999 1153298 1134461 1115894 1097737 1080599 1064764 1049824 1035137 1020322 1005148 989279 972498
51988 972498 954990 937085 918751 899637 879622 859085 838625 818718 799632 781368 763665
51977 763665 746353 729799 714783 701795 690692 681169 673254 667193 663102 661040 661224 663782 668338
51964 668338 674095 680335 686640 692643 697817 701521 703113 702098 698407 692561 685375 677485 669373 661734
51950 661734 655487 651288 649247 649196 651046 654831 660620 668485 678371 689903 702514 715796 729492 743136
51936 743136 756044 767874 778792 788777 797053 802649 805399 805975 804989 802491 798440 793249 787580 781792
51922 781792 775868 769801 763777 757860 751570 743936 734084 721817 707612 692105 675790 659306 643774
51909 643774 630444 619913 611824 605427 600339 596722 594855 594601 595209 595559 594738 592513 589188 584910 579201
51894 579201 571362 561285 549680 537458 525174 513242 502367 493329 486360 481125 477479 475913 477018
51881 477018 480756 486479 493461 501141 509116 517289 525992 535534 545544 554954 562681 568164 571389 572696
51867 572696 572580 571347 568970 565483 561418 557475 553875 550512 547695 546186 546347 547768 549866 552322 554701
51852 554701 556265 556574 555792 554059 551049 546611 541259 535447 528769 520627 511447 502465 494470 487439 481335
51837 481335 476508 473181 471182 470356 470677 471851 473267 474604 476021 477635 479154 480131 480184 478948 476371
51822 476371 473246 470848 469650 468826 467407 465582 464407 464475 465340 466204 466825 467616 469008 470787 472092 472164
51806 472164 471073 469581 468366 467570 467037 466675 466539 466810 467708 469114 470410 471108 471631 472870 474802 476135
51790 476135 475670 473568 470936 468609 466787 465461 464541 463637 462229 460188 457917 456015 454908 454692 455147
51775 455147 456075 457789 461043 466388 473770 482830 493155 504051 514617 524482 534049 543479 551770 557504
51761 557504 560282 560780 559528 556306 550794 543176 533984 523851 513524 503604 494109 484792 476024 468836
51747 468836 463783 460186 456872 453366 450084 447707 446754 447565 450262 454632 460147 466102 471796 476859 481462
51732 481462 485974 490277 493694 495699 496450 496524 496517 497067 498807 501832 505403 508519 510642 511594 511071 508755
51716 508755 504868 500185 495524 491488 488513 486680 485433 483985 482131 480354 479111 478388 478051 478131 478586
51701 478586 479183 479889 480998 482502 483679 483735 482678 481182 479760 478524 477603 477219 477210 476937 475879 474064 471769
51684 471769 469053 465787 461986 457944 454154 451140 449151 447923 446951 446107 445783 446322 447559 449102 450819
51669 450819 452841 455307 458439 462704 468526 475834 484129 492930 501864 510334 517464 522535 525343 526109
51655 526109 525290 523542 521666 520369 520074 520925 522810 525342 527961 530090 531148 530483 527506 522005 514288
51640 514288 505021 495032 485221 476373 468885 462629 457137 452002 447308 443748 442150 442650 444452 446560
51626 446560 448610 450780 453106 455278 457025 458232 458660 457968 456177 453790 451329 448930 446395 443374 439573
51611 439573 435196 431192 428601 427485 426942 426243 425485 424979 424620 424259 424196 424866 426394 428884 432772 438386
51595 438386 445428 453336 461882 470916 479754 487341 492957 496363 497476 496387 493580 489682 485180 480757
51581 480757 477621 476821 478353 481528 486157 492711 501421 511948 524016 537598 552351 567698 583839
51568 583839 601954 622844 645867 669696 693760 718493 744594 772588 802855 835414 869603
51557 869603 904302 938455 971142 1001139 1026596 1045235 1055061 1055249 1046407 1029749 1006025 975742
51545 975742 940351 902441 864273 826689 789875 754534 721629 691448 663806 638908 617165
51534 617165 598306 581640 567303 556265 548763 543480 538849 534609 531535 530059 529798 530150 530689 530931
51520 530931 530309 528612 526161 523290 519821 515275 509558 503273 497243 491823 486858 482218 478067 474409
51506 474409 470734 466515 462002 458054 455147 452898 450731 448560 446562 444605 442327 439670 436943 434435
51492 434435 432276 430738 430260 430966 432290 433328 433580 433276 432966 432884 432761 432207 431150 429850 428629 427690 427155
51475 427155 427032 427118 427070 426602 425523 423667 421029 417995 415172 412861 410903 409086 407399 405782 403971 401944
51459 401944 400231 399415 399417 399608 399541 399294 399231 399736 401089 403227 405666 408012 410534 413874 418324 423861 430788
51442 430788 439652 450330 461750 472827 483193 492673 500635 506385 509926 511838 512658 512751 512415 511455
51428 511455 508912 503973 497170 490050 483602 477610 471640 465979 461226 457453 454236 451258 448560 446438
51414 446438 445332 445562 446907 448634 450116 451228 451924 451839 450714 449002 447638 447212 447634 448557 449861 451760
51398 451760 454603 458502 462976 467180 470724 474187 478661 484938 493327 503919 516625 531126 547336
51385 547336 565903 587874 613907 644178 678940 718541 762731 810498 860834 913137 966414
51374 966414 1018525 1066699 1108671 1142930 1168090 1182662 1185660 1177134 1157996 1129509 1093083 1050353
51362 1050353 1003177 953426 902778 852691 804500 759372 718022 680542 646677 616287 589390
51351 589390 565852 545396 527908 513335 501064 489889 479040 469028 460916 454826 449612 444050
51339 444050 437917 431856 426630 422677 419974 417998 416065 413906 411763 409817 407885 405924 404452 403992
51325 403992 404345 404869 405385 406260 407611 408994 410136 411491 413721 416875 420399 423716 426505 428498 429448
51310 429448 429400 428807 428252 428000 427760 426891 425041 422606 420315 418293 415962 413086 410408 408647 407215 404731
51294 404731 400816 396540 392848 389417 385661 382197 380378 380567 381752 382984 384508 387152 391124 395860
51280 395860 400788 405787 410948 416223 421436 426428 431035 434947 437742 439138 439241 438508 437467 436508 435954
51265 435954 436151 437318 439332 441731 443975 445690 446806 447517 448001 448061 447176 445079 442210 439395 437096 435076
51249 435076 432743 429633 425688 421363 417477 414681 412889 411350 409338 406722 403933 401576 400111 399617
51235 399617 399707 399773 399411 398612 397612 396772 396468 396768 397188 397111 396651 396723 398014 400139 402160 403673 404984 406382
51217 406382 407759 409072 410706 413107 416269 419797 423313 426565 429266 431192 432530 433916 435842 438031
51203 438031 439679 440471 441205 443062 446215 449453 451359 451643 451074 450357 449472 448077 446153 444063 442278 441214
51187 441214 441108 441770 442558 442817 442331 441299 440022 438783 437853 437331 437007 436648 436431 436788 437729 438618 438768 438090
51169 438090 436991 435856 434883 434275 434212 434616 435261 436205 437885 440658 444354 448348 451985 454874 456985 458540
51153 458540 459726 460452 460469 459747 458511 456788 454223 450582 446281 442108 438416 434877 431109 427359 424412
51138 424412 422897 422730 423241 423837 424475 425408 426565 427529 428239 429341 431474 434410 437356 440059 443115 447035
51122 447035 451496 455791 459631 463190 466586 469761 472766 475709 478372 480246 481131 481533 482257 483679 485494
51107 485494 487058 487910 488101 488177 488815 490231 491904 493022 493294 493135 493023 492878 492365 491577 490998 490764 490444 489777
51089 489777 489174 489049 489012 488282 486853 485653 485448 486138 487301 488832 490609 491955 492178 491545 491113 491482 492230
51072 492230 492814 493522 495085 497621 500543 503490 506814 511011 516152 522200 529554 538787 550025 562983
51058 562983 577532 593664 610847 627916 643810 658118 670850 682261 693204 705005 718308
51047 718308 732224 745072 755689 763695 768960 771568 772035 770724 767068 760234 750637 740010 729772
51034 729772 720121 710925 702481 694735 686530 676643 665260 653785 643452 634714 627704 622466 618785
51021 618785 616389 615305 615555 616626 617919 619716 623019 628301 635017 642524 650863 660323 670806 682077
51007 682077 694266 707507 721253 734471 746601 757973 769120 779908 789511 797185 802863 806988
50995 806988 809949 811895 812986 813434 813234 812163 810301 808237 806524 805338 805137 807282 813223 823066 835646
50980 835646 850167 867084 887128 910125 935242 961924 989990 1019198 1049384 1080997 1115020
50969 1115020 1152379 1193775 1239975 1291741 1349308 1412223 1479761 1551239 1625875 1702638 1780446
50958 1780446 1858407 1935800 2011839 2085358 2154624 2217651 2273035 2320471 2360269 2392541 2417271
50947 2417271 2435104 2447462 2455646 2460165 2461208 2459410 2455786 2451136 2445809 2439768 2432500 2423005 2410354
50934 2410354 2394385 2375611 2354534 2331291 2305774 2277557 2245701 2209160 2167638 2121695 2071849
50923 2071849 2018004 1960107 1898970 1835987 1772276 1708561 1645753 1585060 1527445 1473315 1422778
50912 1422778 1375851 1332356 1291987 1254649 1220439 1189208 1160481 1133921 1109515 1087087 1066064
50901 1066064 1046124 1027763 1011729 998029 985940 974946 965196 957001 950316 944965 941004 938570
50889 938570 937462 937121 937017 937018 937397 938578 940799 944057 948417 954211 961651 970246 979067 987805 997255 1008414
50873 1008414 1021318 1035180 1049509 1064562 1080689 1097836 1115997 1135785 1158091 1183450 1212120
50862 1212120 1244569 1281318 1322305 1367022 1415609 1469448 1530349 1599349 1676623 1762320 1857045
50851 1857045 1961540 2076269 2201388 2336864 2482434 2637552 2801349 2972447 3148809
50842 3148809 3327997 3507698 3685825 3859951 4026684 4181744 4320714 4439948 4537126 4611270
50832 4611270 4662336 4690912 4698350 4687105 4660656 4622946 4577851 4528941 4479368 4431814 4388627
50821 4388627 4351934 4323098 4301722 4285322 4270364 4253727 4233069 4205936 4169003 4118642 4052383
50810 4052383 3969805 3872020 3760474 3636426 3501414 3357809 3208579 3056670 2904863 2756043
50800 2756043 2613109 2478341 2352985 2237543 2132378 2038023 1955012 1883448 1822706 1771598
50790 1771598 1729005 1694212 1666598 1645267 1629244 1617793 1610063 1604676 1600255 1596286 1592807 1589239
50778 1589239 1584357 1577701 1570223 1562933 1555439 1546366 1534759 1520514 1503890 1485358 1465707 1445536
50766 1445536 1424652 1402497 1379105 1355178 1331349 1307976 1285504 1264343 1244338 1225092 1206983
50755 1206983 1191302 1179070 1170265 1164360 1161081 1160301 1161753 1165397 1171832 1181874 1195862 1213757 1235726
50742 1235726 1262246 1293687 1330228 1372217 1420265 1474809 1535723 1602484 1674564 1751592 1833195
50731 1833195 1918850 2007883 2099616 2193432 2288652 2384352 2479300 2572112 2661413 2745814 2823739
50720 2823739 2893363 2952834 3000618 3035546 3056483 3062198 3052030 3026945 2989834 2944603 2894932
50709 2894932 2843824 2793983 2748094 2708456 2676363 2651924 2634568 2623550 2617727 2614904 2611984 2606210
50697 2606210 2595975 2579975 2556012 2521593 2475753 2419479 2354190 2280823 2200831 2117035 2032531
50686 2032531 1949327 1868875 1793337 1725109 1665261 1613451 1569431 1533694 1506555 1487475 1475729
50675 1475729 1471116 1473742 1483540 1500140 1522711 1549710 1579251 1609957 1641182 1672403 1702880 1731886
50663 1731886 1758768 1782750 1803212 1820323 1834817 1847055 1856900 1864644 1871339 1877811 1883894 1888986
50651 1888986 1892939 1896070 1898780 1901615 1905344 1910597 1917665 1926922 1939122 1954967 1974580 1997562 2023296
50638 2023296 2051118 2080624 2111983 2145507 2180663 2215921 2249847 2282039 2312866 2342827 2372407
50627 2372407 2401996 2431467 2460013 2486345 2508456 2523132 2526694 2517134 2495428 2464672 2428620 2391260
50615 2391260 2356562 2327208 2303634 2284985 2270863 2261498 2256525 2254388 2252904 2249857 2243220 2231538
50603 2231538 2214204 2190984 2161343 2124642 2080887 2030845 1975633 1916660 1855744 1794670 1734590
50592 1734590 1676208 1620302 1567521 1517907 1471163 1427331 1386646 1348877 1313459 1280223 1249426
50581 1249426 1221034 1194600 1169904 1147211 1126823 1108863 1093588 1081450 1072787 1067743 1066376 1068333
50569 1068333 1072545 1077882 1084190 1092188 1102387 1114669 1128952 1145568 1164775 1186477 1210650 1237511
50557 1237511 1266990 1298460 1331214 1364921 1399534 1435090 1471658 1508997 1546166 1582013 1616172
50546 1616172 1649055 1680799 1710911 1739293 1767034 1795752 1826578 1860112 1896838 1937090 1980905
50535 1980905 2028326 2079569 2134632 2193118 2254891 2320529 2390683 2465283 2543832 2626213 2712621
50524 2712621 2802792 2895744 2990166 3084580 3177201 3266105 3349566 3425912 3493020 3548443 3590230
50513 3590230 3617449 3629878 3627428 3609967 3577523 3530671 3470928 3400811 3323311 3241211 3157032
50502 3157032 3073533 2993832 2920845 2856827 2803677 2763382 2737606 2726698 2729355 2743397 2766515
50491 2766515 2796066 2828520 2859751 2885971 2904048 2910975 2903695 2879857 2838566 2780289 2706493 2619719
50479 2619719 2523428 2421011 2314882 2206933 2099612 1995898 1898126 1807315 1723717 1647532
50469 1647532 1578897 1517632 1463251 1415119 1372568 1335079 1302330 1273722 1248017 1223912 1201072
50458 1201072 1180189 1161968 1146514 1133717 1123683 1116543 1112304 1111084 1113036 1117826 1124669 1133159 1143661
50445 1143661 1156604 1171838 1188947 1207728 1227915 1248856 1269895 1290667 1310542 1328186 1342406
50434 1342406 1353316 1362213 1370372 1378386 1386476 1394819 1403517 1412666 1422480 1433044 1443989 1454803 1465537
50421 1465537 1476882 1489554 1503954 1520445 1539614 1562095 1588276 1618179 1651430 1687393 1725644
50410 1725644 1766369 1810005 1856366 1904352 1952651 2000517 2047688 2093660 2137280 2177093 2211930
50399 2211930 2241028 2263632 2278768 2285555 2283586 2272720 2252672 2223197 2184730 2138515 2086143 2029383
50387 2029383 1970473 1911866 1855405 1802197 1753566 1711392 1676926 1649888 1629526 1616163 1610731
50376 1610731 1612943 1620809 1631932 1644394 1656294 1665601 1671000 1672094 1668136 1657246 1637720 1609783
50364 1609783 1575350 1536323 1493803 1448768 1402627 1356787 1312174 1269405 1229108 1191819 1157798
50353 1157798 1127089 1099525 1074656 1052030 1031817 1014870 1001916 992862 987151 984568 985193 988527
50341 988527 993043 996750 997975 995626 989265 979394 967507 955360 944071 934042 925555 918956 914248
50328 914248 911047 909215 909114 910841 913559 916245 919061 923373 930182 939016 948628 958335 968153 977878
50314 977878 986860 994843 1002445 1010386 1018563 1026338 1033544 1040703 1048379 1056851 1066446 1077573 1090108 1103182
50300 1103182 1116066 1129103 1143417 1159892 1178740 1199900 1223423 1249432 1277946 1308702 1340960
50289 1340960 1373638 1405754 1436303 1463069 1481862 1487941 1478902 1456291 1424570 1388914 1353621 1321472
50277 1321472 1293660 1270321 1251428 1237121 1227234 1220949 1217204 1215251 1214689 1215248 1216796 1219320 1222689
50264 1222689 1226615 1230998 1236107 1242384 1250346 1260663 1273929 1290205 1309228 1331110 1356361 1385003
50252 1385003 1416284 1449535 1484653 1521266 1558073 1593661 1627555 1659794 1689948 1717437 1742591
50241 1742591 1766411 1789199 1810067 1827828 1841634 1850578 1853480 1849474 1838415 1820426 1795541 1764180
50229 1764180 1727790 1688654 1649063 1610674 1574359 1540455 1509127 1480456 1453931 1428006 1400575
50218 1400575 1370181 1336708 1300992 1264067 1226930 1190727 1156700 1125715 1097797 1072265 1048506
50207 1048506 1026594 1006968 989589 973877 959571 947065 936503 927066 917710 908302 899387 891135
50195 891135 883172 875308 867702 860341 853063 846179 840405 836051 832771 830174 828054 825980 823426 820570
50181 820570 818276 816865 815446 812904 809146 805033 801513 799142 797964 797430 796744 795719 795004 795185 795999
50166 795999 796838 797645 798899 801004 804175 808658 814500 821149 827831 834417 841647 850398 860802 872025
50152 872025 882911 893069 903409 915268 928915 943324 957655 972409 988783 1007461 1028799
50141 1028799 1053806 1084065 1120569 1163319 1212160 1267448 1329567 1398157 1472008 1549487 1628882
50130 1628882 1708555 1787007 1862903 1935208 2003469 2067867 2128684 2185765 2238517 2286049 2326812
50119 2326812 2358178 2376973 2380805 2368899 2341798 2300693 2247131 2183086 2111037 2033889 1954576
50108 1954576 1875459 1798120 1723839 1654026 1589822 1531401 1478122 1429352 1384726 1343637 1305083
50097 1305083 1268369 1233636 1201412 1171810 1144367 1118560 1094357 1072394 1053582 1038352 1026303
50086 1026303 1016788 1009728 1005407 1003501 1002916 1002797 1003168 1004244 1005665 1006987 1008548 1011195 1015208 1019984 1024801
50071 1024801 1029395 1033816 1038169 1042626 1047298 1051924 1055934 1058902 1060702 1061210 1060209 1057759 1054314 1050239
50057 1050239 1045531 1040269 1035072 1030609 1026700 1022327 1016753 1010436 1004691 1000593 998299 997290 997048 997488
50043 997488 998971 1002003 1006849 1013374 1021317 1030779 1042201 1055663 1070423 1085608 1101342 1118636 1137891
50030 1137891 1157998 1177432 1195866 1214070 1232455 1250611 1268419 1286715 1306356 1327282 1349132
50019 1349132 1372284 1397511 1424887 1453838 1484174 1516234 1549804 1583697 1616755 1648714 1679627
50008 1679627 1708930 1735705 1759619 1781094 1800659 1818588 1835029 1849870 1862181 1870092 1871435 1864448
49996 1864448 1847943 1821284 1784663 1739366 1687466 1631058 1571816 1511212 1450867 1392356 1336656
49985 1336656 1284030 1234542 1188487 1146153 1107461 1072140 1040107 1011302 985321 961766 940904
49974 940904 923343 908860 896178 884268 873343 864039 856100 848546 840886 833434 826534 820181 814528
49961 814528 810058 807000 805070 804112 804586 807045 811399 816974 823147 829704 836717 844275 852204 859935 866767
49946 866767 872333 876623 879529 880711 880138 878407 876154 873282 869074 863008 855175 845934 835521 824044
49932 824044 811625 798398 784573 770652 757422 745510 734950 725387 716680 709098 702833 697633
49920 697633 693261 690159 689137 690203 692152 693721 694902 696725 699896 704168 709027 714439 720703 727982
49906 727982 736261 745527 755719 766631 778085 790056 802411 814633 826019 836169 845106 852910
49894 852910 859254 863314 864222 861686 856189 848509 839115 828178 816051 803405 790807 778414 766187
49881 766187 754175 742506 731311 720786 711118 702242 693900 686024 678878 672742 667756 664172 662340
49868 662340 662117 662673 663404 664819 668044 673472 680385 687949 696090 705219 715547 727021 739664 753448
49854 753448 767856 781884 794692 806026 815901 824041 830008 833828 836188 837732 838329 837252 833993
49841 833993 828615 821350 812236 801409 789560 777863 767354 758438 750946 744636 739598 736064 733871
49828 733871 732336 730898 729738 729498 730532 732811 736430 741705 748623 756681 765485 775061 785312 795573
49814 795573 805175 814188 823163 832291 841169 849280 856311 862048 866391 869423 871183 871392 869741 866476
49800 866476 862319 857738 852594 846556 839518 831473 822394 812479 802293 792310 782453 772339 761918
49787 761918 751707 742418 734603 728580 724406 721779 720118 718880 717766 716687 715727 715251 715814 717728 720785
49772 720785 724621 729299 735291 742845 751544 760502 768810 775796 781169 785080 787928 790039 791653 792998
49758 792998 793933 793492 790412 784471 776837 768750 760325 751118 741336 731773 722902 714844 708003 702829 698950
49743 698950 695424 691944 689087 687237 686125 685630 686142 687727 689771 691992 695059 699541 704932 710436 716145
49728 716145 722581 729468 735991 742224 749430 758730 770040 782429 795122 807942 821072 834521 847784
49715 847784 860060 870773 879612 885984 888904 887798 883075 875670 866417 856213 846244 837408 829813
49702 829813 823329 818281 815059 813407 812765 812981 813895 814504 813502 810692 807170 804106 802056 801415 802623
49687 802623 805653 810020 815571 822748 831821 842551 854864 869312 886421 905957 927181 949469
49675 949469 972425 995684 1018681 1040238 1058195 1070085 1074759 1073265 1067946 1060905 1053464 1046606 1041278
49662 1041278 1038166 1037369 1038379 1040297 1042062 1042416 1039705 1032146 1018781 1000207 978139 954366 930341
49649 930341 907337 886291 867410 850504 835774 823812 814808 808338 804018 801786 801289 801546 801558 800890
49635 800890 799461 797167 793946 789949 785402 780510 775450 770155 764185 757281 749940 742905 736188 729355
49621 729355 722716 717295 713371 710038 706636 703694 701892 700969 700439 700662 702248 704881 707589 709893 711883
49606 711883 713550 714900 716514 719013 721960 724097 724809 724728 724749 725108 725645 726440 727773 729681 731796 733616
49590 733616 734939 736071 737441 738960 740022 740357 740519 741231 742578 744253 746259 748815 751802 754838 757818
49575 757818 760980 764597 769037 774913 782629 791900 802223 813640 826448 840232 853875 866531 878027
49562 878027 888217 896582 902666 906471 908234 908121 906259 902775 897776 891628 885207 879413 874472 870091
49548 870091 866216 863122 860801 858887 857276 856247 855834 855646 855490 855675 856531 858069 860269 863171 866571
49533 866571 870273 874890 881697 891397 903598 917865 934479 953595 974373 995777 1017744 1040517
49521 1040517 1063038 1082950 1098397 1109249 1116540 1121415 1124811 1127525 1130089 1132778 1135930 1140039 1145302
49508 1145302 1151112 1156004 1158123 1155999 1149239 1138485 1124550 1107825 1088744 1068472 1048456 1029395
49496 1029395 1011214 994045 978508 964870 952661 941520 931800 923823 917094 910931 905495 901478
49484 901478 898978 897397 896401 896223 896943 898141 899474 900990 902575 903674 903932 903756 903863 904656 906335 909121
49468 909121 912884 916930 920739 924634 929178 934175 938919 943197 947316 951144 953959 955360 955576 954693 952309
49453 952309 948385 943714 939001 933961 927962 921191 914584 908762 903621 898888 894648 891305 889314 888923
49439 888923 889952 891992 895037 899696 906512 915316 925566 937089 950099 964790 981303 999864 1020428
49426 1020428 1042365 1064985 1088113 1111598 1134594 1156186 1176539 1196269 1214335 1227540 1232923
49415 1232923 1230238 1221746 1210173 1197593 1185778 1176473 1170891 1169307 1171379 1176710 1185010 1195850 1208456
49402 1208456 1221909 1235712 1250091 1265467 1281581 1297465 1312303 1325965 1338499 1349572 1358842
49391 1358842 1366501 1372869 1377522 1379342 1377500 1372108 1363857 1353451 1341489 1328516 1314885 1300766 1286583
49378 1286583 1273354 1262293 1253942 1247793 1242874 1238734 1235792 1234708 1235558 1237752 1240698 1244252 1248368 1252502
49364 1252502 1255669 1257116 1256698 1254591 1250873 1245579 1239032 1231832 1224451 1216983 1209327 1201527 1193865 1186744
49350 1186744 1180637 1175971 1172804 1170619 1168689 1166733 1165069 1164062 1163647 1163449 1163097 1162140 1159955 1156113 1150900
49335 1150900 1145172 1139710 1134882 1130795 1127474 1124849 1122874 1121764 1121898 1123403 1126073 1129853 1135172 1142617
49321 1142617 1152335 1163897 1176707 1190464 1205196 1220905 1237286 1253905 1270531 1286924 1302213
49310 1302213 1314847 1323584 1328308 1329509 1327240 1321197 1311747 1300198 1287884 1275494 1263481 1252456
49298 1252456 1242759 1234130 1226342 1219821 1215116 1211928 1209202 1206081 1202328 1197884 1192547 1186177 1178843 1170621
49284 1170621 1161543 1151909 1142398 1133738 1126340 1120338 1115810 1112886 1111733 1112429 1114798 1118293 1122191 1126025
49270 1126025 1129835 1133958 1138450 1142689 1145655 1146794 1146601 1146104 1145773 1145285 1144461 1143947 1144660 1146975 1150995 1157345
49254 1157345 1166854 1179325 1193286 1207250 1220658 1233119 1243166 1248583 1248035 1241918 1231548 1218026
49242 1218026 1202206 1185336 1169065 1154626 1142287 1131816 1123327 1117412 1114541 1114569 1116900 1120868 1125837
49229 1125837 1131134 1136234 1141105 1146217 1152079 1158777 1165988 1173388 1180955 1188819 1196906 1204885 1212537 1220022
49215 1220022 1227691 1235725 1244125 1252878 1261813 1270413 1278248 1285757 1294197 1304519 1316605 1329878 1344273
49202 1344273 1360083 1377088 1394491 1411755 1428921 1445909 1462038 1476657 1489929 1502533 1514741
49191 1514741 1526194 1536563 1546071 1555220 1564224 1572959 1581445 1590292 1600542 1613006 1627781 1644516
49179 1644516 1663208 1684598 1709728 1739177 1772805 1810153 1850914 1895007 1942246 1991813 2041846
49168 2041846 2089469 2131438 2165046 2188817 2202807 2208565 2208672 2205839 2201973 2197932 2194007 2190412 2187265
49155 2187265 2184433 2181796 2179704 2178884 2179820 2182386 2186239 2191355 2197976 2206132 2215549 2226101 2238103 2251955
49141 2251955 2267557 2284241 2301277 2318393 2335809 2353861 2372565 2391510 2410166 2428344 2446328
49130 2446328 2464522 2482988 2501383 2519300 2536621 2553630 2570946 2589356 2609480 2631450 2654948
49119 2654948 2679681 2705853 2734236 2766023 2802816 2846628 2899490 2962821 3037262 3123285 3221874
49108 3221874 3334331 3461102 3600378 3747384 3894947 4035618 4164622 4281535 4388421
49099 4388421 4484871 4563991 4613791 4623943 4592604 4527477 4440465 4340884 4232586 4115945 3991512
49088 3991512 3862038 3732232 3607495 3492649 3390946 3303547 3229698 3167545 3115045 3070559
49078 3070559 3033020 3001645 2975438 2952955 2932681 2913622 2895477 2878314 2862195 2847025 2832503
49067 2832503 2818240 2804118 2790537 2777998 2766429 2755241 2744120 2733314 2722933 2712477 2701580
49056 2701580 2690930 2681784 2674568 2668472 2662482 2656300 2650114 2644131 2638832 2635244 2634242 2635575 2638082 2641007
49042 2641007 2644670 2649653 2655659 2661432 2665681 2667949 2668849 2669694 2671579 2674307 2676341 2676287 2674532 2672876 2672460
49027 2672460 2672624 2672097 2670589 2668562 2665985 2662303 2657566 2652647 2648160 2643986 2640176 2637593 2637045 2638275 2640335
49012 2640335 2642683 2645517 2649263 2654105 2659804 2665738 2671443 2677310 2684231 2692223 2700007 2706511 2712207 2718179
48998 2718179 2724363 2729648 2733436 2736110 2738037 2739166 2739713 2740229 2740639 2740059 2737947 2734756 2731125 2727176 2723048
48983 2723048 2719385 2716551 2713819 2709989 2704594 2698025 2690717 2682705 2673828 2663970 2653230 2642097 2631213
48970 2631213 2620757 2610346 2599771 2589489 2580137 2572022 2565498 2561316 2559983 2561000 2563348 2566673 2571547
48957 2571547 2578617 2587884 2598765 2610528 2622779 2635847 2650525 2667118 2684938 2703063 2721355 2740202
48945 2740202 2759447 2778213 2795936 2813130 2831010 2850627 2872381 2896090 2921484 2948799 2978799
48934 2978799 3011989 3048010 3086169 3126367 3169052 3214352 3261804 3311005 3362040 3415195 3470616
48923 3470616 3528357 3588324 3650090 3713196 3777748 3844276 3912715 3981942 4050609 4118224 4185046
48912 4185046 4251178 4316156 4379369 4440490 4499347 4555585 4608723 4658566 4705425 4749777 4791734
48901 4791734 4831062 4867773 4902408 4935466 4966690 4995254 5020601 5042792 5061982 5077929 5090201
48890 5090201 5098734 5103934 5106244 5105719 5102112 5095381 5085953 5074301 5060369 5043731 5024329 5002579 4978521
48877 4978521 4951385 4920384 4885674 4848037 4807867 4764985 4719290 4671033 4620549 4568274 4514972
48866 4514972 4461420 4407877 4354369 4301423 4249811 4199490 4149642 4100101 4052092 4006980 3964729
48855 3964729 3924120 3884267 3845416 3808483 3774216 3742789 3713912 3687344 3663434 3642998 3626522
48844 3626522 3613660 3603579 3595614 3589514 3585398 3583719 3584948 3589059 3595523 3603967 3614498 3627147 3641434
48831 3641434 3656880 3673517 3691423 3710054 3728665 3747231 3766337 3786235 3806679 3827733 3850006
48820 3850006 3873719 3898032 3921811 3944825 3967775 3991213 4014797 4037683 4059450 4080531 4101830
$$ [...]
##END NTUPLES=NMR SPECTRUM
##END=
