##TITLE=AC1614_BRAAN13344_8317279_I8KFlJ24um
##JCAMPDX= 6.0         $$ Bruker NMR JCAMP-DX V2.0
##DATA TYPE= NMR SPECTRUM
##DATA CLASS= NTUPLES
##ORIGIN= BRUKER
##OWNER= Administrator
$$ 1.72 TOPSPIN		Version 2.1
$$ 2013-11-13 20:10:10.395 -0800  Administrator@X
$$ Compression mode = diff/dup
##.OBSERVE FREQUENCY= 400.02188249412
##.OBSERVE NUCLEUS= ^1H
##.ACQUISITION MODE= SIMULTANEOUS (DQD)
##.ACQUISITION SCHEME= undefined
##.AVERAGES= 64
##.DIGITISER RES= 22
##SPECTROMETER/DATA SYSTEM= spect
##.PULSE SEQUENCE= noesygpps1d.comp
##.SOLVENT NAME= COFFEE_meoh
##.SHIFT REFERENCE= INTERNAL, COFFEE_meoh, 1, 14.96082
##AUDIT TRAIL= $$ (NUMBER, WHEN, WHO, WHERE, PROCESS, VERSION, WHAT)
$$ ##TITLE= Audit trail, TOPSPIN		Version 2.1
$$ ##JCAMPDX= 5.01
$$ ##ORIGIN= Bruker BioSpin GmbH
$$ ##OWNER= Administrator
$$ $$ E:\/data/COFFEE/nmr/AC1614_BRAAN13344_8317279_I8KFlJ24um/12/pdata/1/auditp.txt
$$ ##AUDIT TRAIL=  $$ (NUMBER, WHEN, WHO, WHERE, PROCESS, VERSION, WHAT)
(   1,<2013-11-13 20:10:04.661 -0800>,<Administrator>,<X>,<go>,<TOPSPIN 2.1>,
      <created by zg
	started at 2013-11-13 19:58:34.926 -0800,
	POWCHK enabled, PULCHK disabled,
       configuration hash MD5:
       C8 4E 4E 5D D3 5C D8 9E 9F 52 82 E0 59 8A DE 15
       data hash MD5: 64K
       B4 CF AF 02 80 D1 D5 32 7A 54 A1 C1 9F 02 48 FB>)
(   2,<2013-11-13 20:10:08.036 -0800>,<Administrator>,<X>,<proc1d>,<TOPSPIN 2.1>,
      <Start of raw data processing
       efp LB = 0.3 FT_mod = 6 PKNL = 1 PHC0 = 0 PHC1 = 0 SI = 128K 
       data hash MD5: 128K
       7A 7B 1F EB D9 56 6B 22 8C 78 74 50 A8 C8 43 71>)
(   3,<2013-11-13 20:10:09.129 -0800>,<Administrator>,<X>,<proc1d>,<TOPSPIN 2.1>,
      <pk PHC0 = -85.30334 PHC1 = 0 
       data hash MD5: 128K
       17 36 DA EC 8D 15 A1 FD 3E A3 03 1F 88 73 81 11>)
(   4,<2013-11-13 20:10:09.770 -0800>,<Administrator>,<X>,<proc1d>,<TOPSPIN 2.1>,
      <abs ABSG = 1 
       data hash MD5: 128K
       6C 9E F7 5B 3C B0 E4 27 1A CB 68 62 99 DE 54 95>)
(   5,<2013-11-13 20:10:09.911 -0800>,<Administrator>,<X>,<proc1d>,<TOPSPIN 2.1>,
      <abs ABSG = 2 
       data hash MD5: 128K
       B5 8C 9D FF 93 10 F3 99 05 90 F9 78 2F 59 1B 09>)
(   6,<2013-11-13 20:10:10.020 -0800>,<Administrator>,<X>,<proc1d>,<TOPSPIN 2.1>,
      <abs ABSG = 3 
       data hash MD5: 128K
       31 FF 41 5F 32 C2 62 45 B6 83 D7 06 51 14 93 12>)
(   7,<2013-11-13 20:10:10.098 -0800>,<Administrator>,<X>,<proc1d>,<TOPSPIN 2.1>,
      <abs ABSG = 4 
       data hash MD5: 128K
       5F FD 46 44 AC C5 9A 10 46 41 89 F6 EF 39 CF E9>)
(   8,<2013-11-13 20:10:10.192 -0800>,<Administrator>,<X>,<proc1d>,<TOPSPIN 2.1>,
      <abs ABSG = 5 
       data hash MD5: 128K
       19 60 3A 5E 44 0A 14 B8 97 CD DA 04 E2 9A 00 F2>)
$$ ##END=
$$ 
$$ $$ hash MD5
$$ $$ CA 23 FD 3A 2B 7B D1 06 EF 05 CB AF 95 33 A8 52
##$RELAX= 
##$RELAX= 
##$RELAX= 
##$RELAX= 
##$RELAX= 
##$RELAX= 
##$RELAX= 
##$RELAX= 
$$ Bruker specific parameters
$$ --------------------------
##$DU= <E:\>
##$EXPNO= 12
$$ [...]
##$TP07= 0
##$TPNAME0= <>
##$TPNAME1= <>
##$TPNAME2= <>
##$TPNAME3= <>
##$TPNAME4= <>
##$TPNAME5= <>
##$TPNAME6= <>
##$TPNAME7= <>
##$TPOAL= (0..7)
0.5 0.5 0.5 0.5 0.5 0.5 0.5 0.5
##$TPOFFS= (0..7)
0 0 0 0 0 0 0 0
##$TUNHIN= 0
##$TUNHOUT= 0
##$TUNXOUT= 0
##$USERA1= <user>
##$USERA2= <user>
##$USERA3= <user>
##$USERA4= <user>
##$USERA5= <user>
##$V9= 5
##$VALIST= <valist>
##$VCLIST= <CCCCCCCCCCCCCCC>
##$VD= 0
##$VDLIST= <DDDDDDDDDDDDDDD>
##$VPLIST= <PPPPPPPPPPPPPPP>
##$VTLIST= <TTTTTTTTTTTTTTT>
##$WBST= 1024
##$WBSW= 4
##$XGAIN= (0..3)
0 0 0 0
##$XL= 0
##$YL= 0
##$YMAX_a= 6040187
##$YMIN_a= -12452531
##$ZGOPTNS= <>
##$ZL1= 120
##$ZL2= 120
##$ZL3= 120
##$ZL4= 120
##$ABSF1= 14.96082
##$ABSF2= -5.597362
##$ABSG= 5
##$ABSL= 3
##$ALPHA= 0
##$AQORDER= 0
##$ASSFAC= 0
##$ASSFACI= 0
##$ASSFACX= 0
##$ASSWID= 0
##$AUNMP= <proc_prof1d_extract.lims>
##$AXLEFT= 0
##$AXNAME= <>
##$AXNUC= <1H>
##$AXRIGHT= 0
##$AXTYPE= 0
##$AXUNIT= <>
##$AZFE= 0.1
##$AZFW= 0.1
##$BCFW= 0
##$BC_mod= 0
##$BYTORDP= 0
##$COROFFS= 0
##$CY= 15
##$DATMOD= 1
##$DC= 0
##$DFILT= <>
##$DTYPP= 0
##$F1P= 0
##$F2P= 0
##$FCOR= 0.5
##$FTSIZE= 131072
##$FT_mod= 6
##$GAMMA= 0
##$GB= 0
##$INTBC= 1
##$INTSCL= 1
##$ISEN= 128
##$LB= 0.3
##$LEV0= 0
##$LPBIN= 0
##$MAXI= 10000
##$MC2= 0
##$MEAN= 0
##$ME_mod= 0
##$MI= 0
##$NCOEF= 0
##$NC_proc= -2
##$NLEV= 6
##$NOISF1= 0
##$NOISF2= 0
##$NSP= 0
##$NTH_PI= 0
##$NZP= 0
##$OFFSET= 14.96082
##$PC= 1
##$PHC0= -85.30334
##$PHC1= 0
##$PH_mod= 1
##$PKNL= yes
##$PPARMOD= 0
##$PPDIAG= 0
##$PPIPTYP= 0
##$PPMPNUM= 2147483647
##$PPRESOL= 1
##$PSCAL= 4
##$PSIGN= 0
##$PYNMP= <proc.py>
##$REVERSE= no
##$SF= 400.020009708299
##$SI= 131072
##$SIGF1= 0
##$SIGF2= 0
##$SINO= 400
##$SIOLD= 131072
##$SPECTYP= <>
##$SREGLST= <1H.CDCl3>
##$SSB= 0
##$STSI= 131072
##$STSR= 0
##$SW_p= 8223.68421052631
##$SYMM= 0
##$S_DEV= 0
##$TDeff= 65536
##$TDoff= 0
##$TI= <>
##$TILT= no
##$TM1= 0
##$TM2= 0
##$TOPLEV= 0
##$USERP1= <user>
##$USERP2= <user>
##$USERP3= <user>
##$USERP4= <user>
##$USERP5= <user>
##$WDW= 1
##$XDIM= 131072
##$YMAX_p= 399432120
##$YMIN_p= -20187
##$CURPLOT= <Network HP LaserJet P1505>
##$CURPRIN= <$Network HP LaserJet P1505>
##$DFORMAT= <normdp>
##$LAYOUT= <+/1D_H.xwp>
##$LFORMAT= <normlp>
##$PFORMAT= <normpl>
##$SURQMSG= 1
$$ End of Bruker specific parameters
$$ ---------------------------------
##NTUPLES= NMR SPECTRUM
##VAR_NAME=  FREQUENCY,     SPECTRUM/REAL,   SPECTRUM/IMAG
##SYMBOL=    X,             R,               I
##VAR_TYPE=  INDEPENDENT,   DEPENDENT,       DEPENDENT
##VAR_FORM=  AFFN,          ASDF,            ASDF
##VAR_DIM=   131072,        131072,          131072
##UNITS=     HZ,            ARBITRARY UNITS, ARBITRARY UNITS
##FACTOR=    0.0627417313425164, 1,          1
##FIRST=     8223.62146879497, -930,         -63948
##LAST=      0,             116,             -64210
##MIN=       0,             -20187,          0
##MAX=       8223.62146879497, 399432120,    0
$$ Real data points
##PAGE= N=1
##DATA TABLE= (X++(R..R)), XYDATA
$$ [...]
63910B595656k07503j91419j74444j56985j39632j23059j07896r4472q2576p1695
63900A245975o1652n2912m6042m0883l6614l2696k9420k7245k5888k4520k2807
63889H45296k1201k0131j9401j8623j7769j6972j6040j4609j2585j0089p170l890
63877F66816n57K518N385Q251J1056J3579J5851J8010J9863K1063K1641K1913
63865H25389K1921K1576K1271K1584K2124K1540J9142J5895J3183J1103Q760N760
63853A029248K540n65l656o595q976j1039j3760j7513k1290k3776k4836k5341
63841H74441k5912k6526k7100k7763k8417k8669k8392k7936k7596k7216k6477
63830E72437k5341k3977k2424k0578j8463j6390j4859j4192j4113j3778j2568
$$ plain form
63910 2595656 2388153 2196734 2022290 1865305 1725673 1602614 1494718 1400246 1317670 1245975
63900 1245975 1184323 1131411 1085369 1044486 1007872 975176 945756 918511 892623 868103 845296
63889 845296 824095 803964 784563 765940 748171 731199 715159 700550 687965 677876 670706 666816
63877 666816 666259 668777 674162 682413 693469 707048 722899 740909 760772 781835 803476 825389
63865 825389 847310 868886 890157 911741 933865 955405 974547 990442 1003625 1014728 1023488 1029248
63853 1029248 1031788 1031223 1027567 1020972 1011996 1000957 987197 969684 948394 924618 899782 874441
63841 874441 848529 822003 794903 767140 738723 710054 681662 653726 626130 598914 572437
63830 572437 547096 523119 500695 480117 461654 445264 430405 416213 402100 388322 375754
63819C75754j0814r431q785q339p522o431n442m584l818l443l669l959l547k480
63805B93490j543j140r58q72j283k210k786k380j722k065l361m208l675k453j848
63790B60986k195k785k935k634k212j920j845j951k038j910j599j276q96k55N40
63775B35075Q96L66o98j442j448j095q96q62o45j98J98M47Q33J495J933J435R
63758B35403j340j551o69J71nr12j439r73J9P70J157J567K098K362K058J388Q01
63741B40905N27N66R07J610K679L855M613M521L798L299L587M075L605K016N59
63726B81122M63J506K506K887L061L439L817L939M035M337M486L888K567J217
63712C23270M25J23j74q35j884l039l855m005l522k757k007j278m72K98P01N71
$$ plain form
63819 375754 364940 355509 346724 338385 330863 324432 318990 314406 310588 307145 303476 299517 295970 293490
63805 293490 291947 290807 289849 288977 287694 285484 282698 280318 278596 276531 273170 268962 265287 262834 260986
63790 260986 258791 256006 253071 250437 248225 246305 244460 242509 240471 238561 236962 235686 234790 234535 235075
63775 235075 235971 236337 235639 234197 232749 231654 230758 229896 229251 229053 229251 229698 230531 232026 233959 235394 235403
63758 235403 234063 232512 231843 232014 232009 231097 229658 228685 228704 229474 230631 232198 234296 236658 238716 240104 240905
63741 240905 241432 241998 242905 244515 247194 251049 255662 260183 263981 267280 270867 274942 278547 280563 281122
63726 281122 281585 283091 285597 288484 291545 294984 298801 302740 306775 311112 315598 319486 322053 323270
63712 323270 323695 323818 323644 322809 320925 317886 314031 310026 306504 303747 301740 300462 299990 300288 300989 301560
63696C01560J82R8P24K012L471M451M468L560K415J913K267K716K357J219J64
63681C33577l13o95j558k532k699j864p98j53K29O91J026R15O96J075K015K556
63665C32168J980P13k22m24m06q07j696k741l742m694n428n488m611l266k426
63650B98910k609l263l346k462j184k06L91Q13R42N82J84N67J722K543K243J532
63634B97359J667K684L427L340L237L875M717M893M706N200O458P430P520P357
63620C63870P702Q412Q988R467J0150J0996J1886J3116J4926J6885J8433J9788
63608E14619K1554K3567K4923K5241K5089K4928K4359K2814K0419J7644J4471
63597G59628J0547N990J593j841m153n757p133q426r513j0365j1235j2367j3752
$$ plain form
63696 301560 301742 301840 302564 304576 308047 312498 316966 320526 322941 324854 327121 329837 332194 333413 333577
63681 333577 333264 332569 331011 328479 325780 323916 323118 322965 323194 323885 324911 325826 326522 327597 329612 332168
63665 332168 334148 334861 334639 334215 333809 333002 331306 328565 324823 320129 314701 309213 304602 301336 298910
63650 298910 296301 293038 289692 287230 286046 285840 286231 287044 287986 288568 288752 289319 291041 293584 295827 297359
63634 297359 299026 301710 305137 308477 311714 315589 320306 325199 329905 335105 341563 348993 356513 363870
63620 363870 371572 379984 388972 398439 408589 419585 431471 444587 459513 476398 494831 514619
63608 514619 536173 559740 584663 609904 634993 659921 684280 707094 727513 745157 759628
63597 759628 770175 776165 777758 775917 771764 766007 758874 750448 740935 730570 719335 706968 693216
63584F93216j5304j7098j9070k0678k1286k0864j9905j8707j7173j5279j3208
63573D94644j0940q276n464l162j613l94P98J721K234K710L398L938M093M335
63559D88022N098N965O278O210O521P528R050J1102J3848J6996J9957K2618K5349
63546F44542K8226L0820L2706L3735L3863L3194L1893K9455K4460J6115N957k969
63534I41997q856j2223j4133j4568j3186j0798r023q824j0038j2179j4990j8297
63522G94882k1779k5060k7781k9624l0393l0098k8961k7366k5677k3946k1965
63511E02232j9828j8065j6820j5315j2854j0107q435p997p614o656n840n702n499
63498C61500m535l527l503m022l786k635j635j254q08J41R15Q05J76j29J31O59
$$ plain form
63584 693216 677912 660814 641744 621066 599780 578916 559011 540304 523131 507852 494644
63573 494644 483704 475428 469964 466802 465189 464795 465593 467314 469548 472258 475656 479594 483687 488022
63559 488022 493120 499085 505363 511573 518094 525622 534672 545774 559622 576618 596575 619193 644542
63546 644542 672768 703588 736294 770029 803892 837086 868979 898434 922894 939009 944966 941997
63534 941997 933141 920918 906785 892217 879031 868233 859210 850386 840348 828169 813179 794882
63522 794882 773103 748043 720262 690638 660245 630147 601186 573820 548143 524197 502232
63511 502232 482404 464339 447519 432204 419350 409243 400808 392811 385197 378541 372701 366999 361500
63498 361500 356965 353438 349935 345913 342127 339492 337857 336603 335795 335936 336851 337656 337832 337703 337834 338493
63482C38493J384K416L489M000L717L115K864L164L625L699L110J999P33l96j304
63467C74108k017k534k872l204l705m163l966k821j373o41p32p64l02j48r69j822
63451C42075j131J006K813L326L627N007O966Q008P796P377P601Q318R206J0512
63437D22507J2647J5504J8458K0875K2573K3939K5479K7063K7758K6632K3510
63426F66945J8893J3535Q358M388K131J240J256K470N504J0145J5223J9661K3123
63413G92872K5655K7191K7658K7134K5628K2897J8677J3024O488M0n228q669j0413
63400I62954j1117j1444j1892j2856j4528j6723j9016k1156k3181k5221k7223
63389G68597k8874k9749k9681k8921k7778k6166k3844k1061j8419j6092j3712
$$ plain form
63482 338493 339877 342293 345782 349782 353499 356614 359478 362642 366267 369966 373076 375075 375808 375412 374108
63467 374108 372091 369557 366685 363481 359776 355613 351647 348826 347453 346812 346080 345316 345014 344866 343897 342075
63451 342075 340944 341950 344763 348089 351716 356723 363689 371697 379493 386870 394471 402789 411995 422507
63437 422507 435154 450658 469116 489991 512564 536503 561982 589045 616803 643435 666945
63426 666945 685838 699373 707731 712119 714250 715490 716746 719216 724720 734865 750088 769749 792872
63413 792872 818527 845718 873376 900510 926138 949035 967712 980736 987224 987264 982036 973367 962954
63400 962954 951837 940393 928501 915645 901117 884394 865378 844222 821041 795820 768597
63389 768597 739723 709974 680293 651372 623594 597428 573584 552523 534104 518012 504300
63378E04300j1185r012p509o267m746k910r16J241L420N222O646Q250J0205J1835
63364E08574J2766J3732J5468J7511J9066K0414K2308K4470K5997K7050K8691
63353G36047L0954L2367L1744K9458K6543K3423J9945J6004J1662P077K522j776
63341I65970n771r155j1205j1716j1782j2726j4562j6406j8101k0167k2371k3775
63329G88233k4364k5127k6216k6385k4813k2159j9224j5877j2110q939p170o153
63317E69696m759k978j814k216m711r228j4508j8489k0058j9826j8665j6517j3462
63304D22465j0752r511r141q341p025o003n268m088k512j464j390j863k465l024
63290C49618l130k495j716j643k103k179j713j431j620j780j676j657j718j305
$$ plain form
63378 504300 493115 484103 476594 470327 465581 462671 461755 462996 466416 471638 478284 486534 496739 508574
63364 508574 521340 535072 550540 568051 587117 607531 629839 654309 680306 707356 736047
63353 736047 767001 799368 831112 860570 887113 910536 930481 946485 958147 965224 967746 965970
63341 965970 960199 951044 939839 928123 916341 903615 889053 872647 854546 834379 812008 788233
63329 788233 763869 738742 712526 686141 661328 639169 619945 604068 591958 583019 575849 569696
63317 569696 564937 561959 560145 557929 553218 543990 529482 510993 490935 471109 452444 435927 422465
63304 422465 411713 402202 393061 384720 377695 371692 366424 362336 359824 358360 356970 355107 352642 349618
63290 349618 346488 343993 342277 340634 338531 336352 334639 333208 331588 329808 328132 326475 324757 323452
63276C23452l59L63L11j84n92p60o25o6P05J266J637K136K537K179J104L06N25
63259C33935J532K814M143N176N403M931M619M929N395N580N822O498P305P865
63245D05947Q361R001R497R769J0478J2081J3945J5258J6386J8284K0826K2781
63233E72614K3435K3390K3565K4175K4933K5675K6391K6956K7138K6765K5928
63222H50965K5054K4685K4916K5278K5339K5144K4737K3705K1758J9401J7217
63211A108199J4697J0743N434K24m051q363j3935k0186k5261k8290l0029l1266
63199I77916l1662l0660k8606k6261k3688k0460j6667j2861r049m646L72N032
63187G78760Q606J1525J4479J7179J8911J9916K1220K3117K4766K5555K5886K6252
$$ plain form
63276 323452 323093 323456 323767 323583 322991 322231 321606 321540 322245 323511 325148 327284 329821 332000 333104 333410 333935
63259 333935 335467 338281 342424 347600 353003 357934 362553 367482 372877 378457 384279 390777 398082 405947
63245 405947 414308 423309 432806 442575 453053 465134 479079 494337 510723 529007 549833 572614
63233 572614 596049 619439 643004 667179 692112 717787 744178 771134 798272 825037 850965
63222 850965 876019 900704 925620 950898 976237 1001381 1026118 1049823 1071581 1090982 1108199
63211 1108199 1122896 1133639 1139073 1139297 1135246 1126883 1112948 1092762 1067501 1039211 1009182 977916
63199 977916 946254 915594 886988 860727 837039 816579 799912 787051 778002 773356 773728 778760
63187 778760 787366 798891 813370 830549 849460 869376 890596 913713 938479 964034 989920 1016172
63175A016172K6389K5996K5559K5616K5573K4219K1308J7805J4527J1302P626
63164A242092L420j263o676j2944j9468k5284k9921l3641l6857l9638m1691m2605
63152I55524m2133m0491l8307l6117l3915l1402k8499k5359k2036j8571j5418
63141F23276j3275j2255j1603j0489q809o988n324l966l175l093l344l380l128
63128E34447k805k223r57P44J948K323K654L685N010N806O084O438O796O439N247
63113E81636M035L404K968K175J301J046J495K002K045J683J252R83R89J228J367
63098F09609R82R7o80q23n39m49p07q30n05p0O5J00M64R63R85N34L55Q78J624
63079F12053K044K400L312M780O188P062P372P307P188P518Q624J0292J2021J3556
$$ plain form
63175 1016172 1042561 1068557 1094116 1119732 1145305 1169524 1190832 1208637 1223164 1234466 1242092
63164 1242092 1245512 1244249 1237573 1224629 1205161 1179877 1149956 1116315 1079458 1039820 998129 955524
63152 955524 913391 872900 834593 798476 764561 733159 704660 679301 657265 638694 623276
63141 623276 610001 597746 586143 575654 566845 559857 554533 550567 547392 544299 540955 537575 534447
63128 534447 531642 529419 528462 529206 531154 533477 536131 539816 544826 550632 556716 563154 569950 576389 581636
63113 581636 585671 589075 592043 594218 595519 596565 598060 600062 602107 603790 605042 606025 607014 608242 609609
63098 609609 610591 610688 610008 609185 608646 608197 607490 606660 606155 606085 606150 606250 606714 607677 608662 609196 609551 610429 612053
63079 612053 614097 616497 619809 624589 630777 637839 645211 652518 659706 667224 675848 686140 698161 711717
63065G11717J4848J5818J6601J7790J9948K2891K5967K8880L1775L4673L7457
63054I78365M0351M3796M7718N1495N4696N7367N9519O1015O2000O2928O3860
63043A583110O4353O4198O3793O3490O3107O2363O1327O0162N8848N7383N5835
63032B257969N3872N0708M5838L9407L1617K2194J0847k086j5765k9253m1605
63021B423743n2052o0424o7064p2088p5159p6206p5609p3349o8757o1715n3426
63010A687894m5212l7097k8382j9099r974j360O783J4150K0373K5906L1478L6717
62998A682177M0474M2706M4792M7529M9858N0357M9176M7656M6567M5541M3928
62987B190761M1447L8024L3619K8253K1955J4613O061l719j4587k6136l7555m7934
$$ plain form
63065 711717 726565 742383 758984 776774 796722 819613 845580 874460 906235 940908 978365
63054 978365 1018716 1062512 1110230 1161725 1216421 1273788 1333307 1394322 1456322 1519250 1583110
63043 1583110 1647463 1711661 1775454 1838944 1902051 1964414 2025741 2085903 2144751 2202134 2257969
63032 2257969 2311841 2362549 2408387 2447794 2479411 2501605 2512452 2510366 2494601 2465348 2423743
63021 2423743 2371691 2311267 2244203 2172115 2096956 2020750 1945141 1871792 1803035 1741320 1687894
63010 1687894 1642682 1605585 1577203 1558104 1548130 1546770 1553553 1567703 1588076 1613982 1645460 1682177
62998 1682177 1722651 1765357 1810149 1857678 1907536 1957893 2007069 2054725 2101292 2146833 2190761
62987 2190761 2232208 2270232 2303851 2332104 2354059 2368672 2374733 2371014 2356427 2330291 2292736 2244802
62975B244802n6936o4931p2166p8146q2081q3699q3334q1498p8610p4951p0588
62964A417862o5526o0108n4959n0294m5723m1062l6909l3849l1508k9116k6734
62953I42074k5191k4732k4547k3781k2419k0984j9860j9170j8795j8262j7061
62942G07272j5365j3994j3415j3199j2737j1998j1151j0041q540p050n977n002
62930E78803l599k094j430j875k593k733k286j780j572j679j885j868j569j437
62916E50403j888k512k517j970j782k254k569k232k073k960m345n076n045m926
62902E08254m720l854k592j902j849j456m73N4l78o62J68J210R91k07p34J9R45
62885D92814J003M56nl31p26r08m94K92Q35Q47M61j91r96j565j461q47n44j087
$$ plain form
62975 2244802 2187866 2122935 2050769 1972623 1890542 1806843 1723509 1642011 1563401 1488450 1417862
62964 1417862 1352336 1292228 1237269 1186975 1141252 1100190 1063281 1029432 997924 968808 942074
62953 942074 916883 892151 867604 843823 821404 800420 780560 761390 742595 724333 707272
62942 707272 691907 677913 664498 651299 638562 626564 615413 605372 596832 589782 583805 578803
62930 578803 575204 573110 571680 569805 567212 564479 562193 560413 558841 557162 555277 553409 551840 550403
62916 550403 548515 546003 543486 541516 539734 537480 534911 532679 530606 527646 523301 518225 513180 508254
62902 508254 503534 499680 497088 495186 493337 491881 491408 491462 491084 490422 490590 491800 492791 492584 491850 491869 492814
62885 492814 493817 494273 494268 493937 493211 492303 491809 492101 492936 493783 494244 494053 493057 491492 490031 489184 488640 487553
62867D87553j924j984j050j95m53j440j813j069q9L03N03J258K232K409J691J043
62851D86975R95R98N83K41N13R47P22j00q16j280j921k649k625j434J86J196J298
62834D83829P80j13j127j659j173L1R90J063M60j59k64L49J464K444K683K243
62818D91841J838K012K637L258L594L501K878K046J837K828M563N960O469O492
62804E41754O696P316Q167Q947R405R425R214R241R936J1402J3348J5180J6444
62791F76475J7414J9055K1995K5733K9361L2905L7249M2699M8462N3872N9343
62780A064563O5547P2174P8346Q3854Q9162R4186R7886R9341R8633R6314R2394
62769B032400Q6260P7423O5986N2442L7303K1042M165j2754k9131m4398n8021
$$ plain form
62867 487553 485629 483645 482595 482400 481947 480507 478694 477625 477536 477839 478342 479600 481832 484241 485932 486975
62851 486975 487970 488968 489551 489792 490305 491252 491974 491874 491058 489778 487857 485208 482583 481149 481335 482531 483829
62834 483829 484609 484496 483369 481710 480537 480568 481558 482621 483081 482922 482658 483007 484471 486915 489598 491841
62818 491841 493679 495691 498328 501586 505180 508681 511559 513605 515442 518270 522833 528793 535262 541754
62804 541754 548450 555766 563933 572880 582285 591710 600924 610165 620101 631503 644851 660031 676475
62791 676475 693889 712944 734939 760672 790033 822938 860187 902886 951348 1005220 1064563
62780 1064563 1130110 1202284 1280630 1364484 1453646 1547832 1645718 1745059 1843692 1940006 2032400
62769 2032400 2118660 2196083 2262069 2314511 2351814 2372856 2377021 2364267 2335136 2290738 2232717
62758B232717o9592p8920q6012r0970r3962r5272r5109r3393q9980q5247q0105
62747A274155p5163p0131o4450n8322n2572m7587m3018l8612l4675l1438k8477
62736G29710k5227k1736j8508j5815j3532j1494r691q192p055o196n279l979k454
62723E80552j219m00N01J889L501M886O076P371Q827J0387J2235J4564J7189J9801
62709F86160K2471K5432K8607L1831L5372L9719M4868N0350N5865O1551O7547
62698A149773P3749P9959Q5914R1178R5341R8213R9568R8867R5646R0074Q2601
62687B140883P3213O1534M7598L1969J5137k610k0625l7824n3379o7071p8821
62676B110004q8262r5017r9046j00598j00084r7993r4591q9769q3582p6899p0875
$$ plain form
62758 2232717 2163125 2084205 1998193 1907223 1813261 1717989 1622880 1529487 1439507 1354260 1274155
62747 1274155 1198992 1128861 1064411 1006089 953517 905930 862912 824300 789625 758187 729710
62736 729710 704483 682747 664239 648424 634892 623398 613707 605515 598460 592264 586985 583006 580552
62723 580552 579333 578933 579434 581323 584824 589710 595786 603157 611984 622371 634606 649170 666359 686160
62709 686160 708631 734063 762670 794501 829873 869592 914460 964810 1020675 1082226 1149773
62698 1149773 1223522 1303481 1389395 1480573 1575914 1674127 1773695 1872562 1968208 2058282 2140883
62687 2140883 2214096 2275630 2323228 2355197 2370334 2367724 2347099 2309275 2255896 2188825 2110004
62676 2110004 2021742 1926725 1827679 1727081 1626997 1529004 1434413 1344644 1261062 1184163 1113288
62665A113288o5711o0603n5015m9450m4640m0625l7019l3644l0483k7344k4083
62654F44671k0956j8389j6521j5132j3866j2413j0807r614r338r583r327q262
62642D90463p223o897o754n841m181k649j728j073k57O25J168J079L89m60q72
62627D55789o97m75p64j443j963k060j815j208j83R59J691J883J947K337L187
62612D57185M336N474O278O724P150P814Q596R399J0548J2322J4372J6139J7774
62599E84111J9945K2836K5939K8915L1977L5269L8476M1313M3822M5902M7051
62588I65556M6947M5863M4047M1089L6347K9823K2197J4127N837k633j1095j9137
62576A218968k6331l2508l7756m1982m4598m5186m4450m3755m3494m2529l9813
$$ plain form
62665 1113288 1047577 986974 931959 882509 837869 797244 760225 726581 696098 668754 644671
62654 644671 623715 605326 588805 573673 559807 547394 536587 526973 517635 508052 498725 490463
62642 490463 483240 476343 469589 463748 459567 456918 455190 454117 453860 454485 455653 456732 457121 456661 455789
62627 455789 455092 454617 453853 452410 450447 448387 446572 445364 445181 446140 447831 449714 451661 453998 457185
62612 457185 461521 466995 473273 479997 487147 494961 503557 512956 523504 535826 550198 566337 584111
62599 584111 604056 626892 652831 681746 713723 748992 787468 828781 872603 918505 965556
62588 965556 1012503 1058366 1102413 1143502 1179849 1209672 1231869 1245996 1251833 1249200 1238105 1218968
62576 1218968 1192637 1160129 1122373 1080391 1035793 990607 946157 902402 858908 816379 776566
62565G76566l5910l2236k9283k6493k3621k1147j9340j7828j6304j4862j3334
62554E26208j1145q277n681m213l710l607l787m155l998k762j167n25r49j206
62540D71026m83O30J212J281J419J814K238K610K987L247L288L394L925M819N789
62525E09196O887Q491J0766J3531J6513J9477K2220K4854K7950L1969L6538M0749
62513G69141M4152M7113N0131N3275N6243N8493N9159N7408N3245M7658M1610
62502A337628L5099K7498J8567Q870o42r192j6376k2193k6869l0516l2913l3638
62490A255323l2316k8762k3138j6179r041k595L137Q743J4691K0934K7094L2658
62478A250549L7083L9888M0914M0451L8977L6590L2606K5940J6287M947n901j4976
$$ plain form
62565 776566 740656 708420 679137 652644 629023 607876 588536 570708 554404 539542 526208
62554 526208 515063 506786 501105 496892 493182 489575 485788 481633 477635 474873 473706 473181 472232 471026
62540 471026 470543 471173 472385 473666 475085 476899 479137 481747 484734 487981 491269 494663 498588 503407 509196
62525 509196 516083 524574 535340 548871 565384 584861 607081 631935 659885 691854 728392 769141
62513 769141 813293 860406 910537 963812 1020055 1078548 1137707 1195115 1248360 1296018 1337628
62502 1337628 1372727 1400225 1418792 1427662 1427020 1417828 1401452 1379259 1352390 1321874 1288961 1255323
62490 1255323 1223007 1194245 1171107 1154928 1145887 1143292 1146429 1155172 1169863 1190797 1217891 1250549
62478 1250549 1287632 1327520 1368434 1408885 1447862 1484452 1517058 1542998 1559285 1564232 1558331 1543355
62466A543355k2757l0518l8825m7223n4879o0983o4757o5753o4403o1857n9061
62455I72339n6145n2764m8695m4011l8930l3675k8357k2962j7651j3055r890q057
62443E98147o520m301j446J242L124M061M141L623L063K931L017K609J385k65
62429F14811j921l668n671p661r227j0356j1261j1850j1826j1192j0294r392q552
62416E01940p880p449p050o412n691n263n082m718m131l801l908l956l518k832
62402D30249k284j777j142o92q31j337j608j424r54k79N24J049J041J042J811
62387D23388L121L876L596L000K852L013L057L193L925N179O391P264P867Q140
62373D87862P853P170O818P456R025J0812J2100J2746J3187J3963J5284J7113
$$ plain form
62466 1543355 1520598 1490080 1451255 1404032 1349153 1288170 1223413 1157660 1093257 1031400 972339
62455 972339 916194 863430 814735 770724 731794 698119 669762 646800 629149 616094 606204 598147
62443 598147 591627 587326 585880 587122 590246 594307 598448 602071 605134 608065 611082 613691 615076 614811
62429 614811 612890 609222 603551 595890 586663 576307 565046 553196 541370 530178 519884 510492 501940
62416 501940 494060 486611 479561 473149 467458 462195 457113 452395 448264 444463 440555 436599 433081 430249
62402 430249 427965 426188 425046 424354 423523 422186 420578 419154 418200 417921 418445 419494 420535 421577 423388
62387 423388 426509 430385 433981 436981 439833 442846 445903 449096 453021 458200 464591 471855 479722 487862
62373 487862 495715 502885 509703 517159 526184 536996 549096 561842 575029 588992 604276 621389
62361F21389J9499K2522K6007K9587L3128L6794M0541M3858M6204M7449M7663
62350A014641M6725M4412M0729L5909L0101K3343J5828Q042O43n830j1205j5776
62338A227562k0012k4040k7476k9827l1020l1430l1423l1001k9864k7805k4982
62327I18682k1862j8961j6692j5314j4768j4643j4558j4696j5510j6871j7962
62316G36845j8386j8795j9874k1121k1351k0187j8263j6178j4133j2463j1570
62305E44524j1074r927p802n614m272l604k940k157j614j457j501j480j047j0
62291D90025J197J780J601J387J647K019K088K164K616L118L220L126L169L064
62277E22221K475J894K071K870L495L626L609L729M083M942O476Q266R821J1357
$$ plain form
62361 621389 640888 663410 689417 719004 752132 788926 829467 873325 919529 966978 1014641
62350 1014641 1061366 1105778 1146507 1182416 1212517 1235860 1251688 1259730 1260373 1254543 1243338 1227562
62338 1227562 1207550 1183510 1156034 1126207 1095187 1063757 1032334 1001333 971469 943664 918682
62327 918682 896820 877859 861167 845853 831085 816442 801884 787188 771678 754807 736845
62316 736845 718459 699664 679790 658669 637318 617131 598868 582690 568557 556094 544524
62305 544524 533450 523523 515721 510107 505835 502231 499291 497134 495520 494063 492562 491082 490035 490025
62291 490025 491222 493002 494603 495990 497637 499656 501744 503908 506524 509642 512862 515988 519157 522221
62277 522221 524696 526590 528661 531531 535026 538652 542261 545990 550073 555015 561491 569757 579578 590935
62263E90935J3407J5905J8529K1591K5577K9902L3392L6053L9199M3494M7899
62252I15883N1001N2439N2476N1082M8164M4082L9150L3005K5141J5898O424k205
62240A332540r544j5800k1632k7689l3990l9778m4151m6764m7897m8028m7430
62229I49837m5931m3112l8965l4211k9631k5228k0636j6170j2732j0618r111p505
62217F55987n813m253k783j548j079j555k319k660k649k790l292m036m866n465
62203F10879n405m787m395m687n035m499l064j529m97K7K35L21N76J203K068K980
62187E84391L981N109O177P089Q052Q974R212Q450P424P001O906O200M810L665
62173F77441L392L812M806O696R515J2716J5976J9584K3600K7428L0589L3281
$$ plain form
62263 590935 604342 620247 638776 660367 685944 715846 749238 785291 824490 867984 915883
62252 915883 966884 1019323 1071799 1122881 1171045 1215127 1254277 1287282 1312423 1328321 1334745 1332540
62240 1332540 1322996 1307196 1285564 1257875 1223885 1184107 1139956 1093192 1045295 997267 949837
62229 949837 903906 860794 821829 787618 757987 732759 712123 695953 683221 672603 663492 655987
62217 655987 650174 645921 643138 641590 640511 638956 636637 633977 631328 628538 625246 621210 616344 610879
62203 610879 605474 600687 596292 591605 586570 582071 579007 577478 576981 577008 577243 577564 578140 579343 581411 584391
62187 584391 588372 593481 599658 606747 614799 623773 632985 641435 648859 655860 662766 668966 673776 677441
62173 677441 680833 684645 689451 696147 705662 718378 734354 753938 777538 804966 835555 868836
62161H68836L5597L6815L6209L4093L1297K7912K3418J7838J2003O524J261m024
62149A127779r058j3424j7126k0409k3346k5769k7413k7988k7395k6062k4715
62138H85074k3571k2033j9495j6172j2765r573o484l727j970j526j816j925j420
62125G62597n21L05Q03J167J957L518N430O882P592P989Q402Q593Q301P677O773
62110H37465N150K562l88k892m765o070o386n422m079l823m928o244o850o858
62096G86472o437n188l114j156P2J251L147N129O027O007O369P586Q749R139R249
62081H33302R849J0873J1818J2619J3494J4396J5167J5978J7039J8047J8511J8522
62069A009615J8687J9132J9145J8140J6619J5688J5781J6318J6677J6975J7548
$$ plain form
62161 868836 904433 941248 977457 1011550 1042847 1070759 1094177 1112015 1124018 1130542 1131803 1127779
62149 1127779 1118721 1105297 1088171 1067762 1044416 1018647 991234 963246 935851 909789 885074
62138 885074 861503 839470 819975 803803 791038 781465 774981 771254 769284 767758 765942 764017 762597
62125 762597 762076 762381 763184 764351 766308 769826 775256 782138 789730 797719 806121 814714 823015 830692 837465
62110 837465 842615 845177 844789 841897 837132 831062 824676 819254 815175 811352 806424 800180 793330 786472
62096 786472 780035 774847 771733 770577 770649 771900 775047 780176 786203 792210 798579 806165 814914 824053 833302
62081 833302 843151 854024 865842 878461 891955 906351 921518 937496 954535 972582 991093 1009615
62069 1009615 1028302 1047434 1066579 1084719 1101338 1117026 1132807 1149125 1165802 1182777 1200325
62058A200325J8073J7695J5992J3296R989N991J239l732q059j1384j4070j6742
62046A228613j9831k3503k7661l1858l5450l7995l9439l9959l9721l8886l7696
62035H56614l6365l4818l2731l0019k7184k4947k3434k2017k0084j7702j5340
62024E71973j3251j1457j0081r198q551p918p605p947q363p781o127m591m043
62011D65060l963l437k455j539o60N46J888K807L298L800M332M527M510M809N356
61996D88879N435M914M610M999N304M568L075J901J404Q63l61k045l608m877o009
61981E09052o975p461p278o641n965n483n168m959m924n081n223n082m688m350
61967D29774m234m121l637k701j690j169j370j882j975j359n77l99r22j466j345
$$ plain form
62058 1200325 1218398 1236093 1252085 1265381 1275370 1281361 1282600 1278868 1270809 1259425 1245355 1228613
62046 1228613 1208782 1185279 1157618 1125760 1090310 1052315 1012876 972917 933196 894310 856614
62035 856614 820249 785431 752700 722681 695497 670550 647116 625099 605015 587313 571973
62024 571973 558722 547265 537184 527986 519435 511517 503912 495965 487602 479821 473694 469103 465060
62011 465060 461097 457660 455205 453666 453006 453552 455440 458247 461545 465345 469677 474204 478714 483523 488879
61996 488879 494314 499228 503838 508837 514141 518709 521784 523685 525089 525952 525591 523546 519938 515061 509052
61981 509052 502077 494616 487338 480697 474732 469249 464081 459122 454198 449117 443894 438812 434124 429774
61967 429774 425540 421419 417782 415081 413391 412222 410852 408970 406995 405636 405059 404660 403738 402272 400927
61952D00927m98O38J568K041K226K704L995N894P510Q196Q233Q452R275J0371
61938D71532J1204J1598J1746J1877J2004J1998J1751J1285J0682R953R022P779
61926F02431O139M157K120M10r38k375m225o015o848o513n766n297m888l892k178
61911E66322j07K101M364O250P220P439P735Q546R392R614R072P872N969L533
61897F55322J176p49k671m998p075p814p278o690o793p033o705o078n825n904
61883E80885n729n033m078l205k773l284m899o928q256q338p416o027m701l961
61869E06257l929l973l295j954o87K76J529L370N113N972O196O713P956R514J0889
61854E49947J2060J3298J4732J6297J7939J9630K1192K2232K2350K1470J9865
$$ plain form
61952 400927 400429 401067 402635 404676 406902 409606 413601 419495 427005 435201 443434 451886 461161 471532
61938 471532 482736 494334 506080 517957 529961 541959 553710 564995 575677 585630 594652 602431
61926 602431 608570 612727 614847 615257 614319 611944 607719 601704 594856 588343 582577 577280 572392 568500 566322
61911 566322 566215 568316 572680 578930 586150 593589 601324 609870 619262 628876 637948 645820 651789 655322
61897 655322 656498 655749 653078 648080 641005 633191 625913 619223 612430 605397 598692 592614 586789 580885
61883 580885 575156 570123 566045 562840 560067 556783 551884 544956 536700 528362 520946 514919 510218 506257
61869 506257 502328 498355 495060 493106 492419 492695 494224 497594 502707 508679 514875 521588 529544 539058 549947
61854 549947 562007 575305 590037 606334 624273 643903 665095 687327 709677 731147 751012
61843G51012J7846J5647J3530J1681R739O870K796j527m756o573p664q527q958
61830G91116q715p883o483m434k099j55J356L154N486P428P935O970N088K545
61816H01309n51l693o415q962j1763j4493j6386j7359j8043j8703j8843j8060
61804F48038j6603j4911j3084j1145r443q438q213q405q489q108p214n974m632
61791E23379l483k909l103l663l795l211k468k204k381k590k673k571j954o98
61777D85676N28Q80N32M36Q35Q56j02j309j569p45K38P05R00J275J701J720J320
61760D93877J047J330J995K606K985L175L154K961K911L202L380K743J343K4o81
61745E26052j084j600k138k627l401m455m956m338l376l307m036m195l032j386
$$ plain form
61843 751012 768858 784505 798035 809716 819455 826325 829121 827594 822838 816265 808601 800074 791116
61830 791116 782401 774518 768035 763601 761502 761347 762703 765857 771343 778771 786706 793676 798764 801309
61816 801309 800758 797065 790650 781688 769925 755432 739046 721687 703644 684941 666098 648038
61804 648038 631435 616524 603440 592295 582852 574414 566201 557796 549307 541199 533985 528011 523379
61791 523379 519896 516987 513884 510221 506426 503215 500747 498543 496162 493572 490899 488328 486374 485676
61777 485676 486204 487084 487616 488052 488887 489743 489641 488332 486763 486018 486256 486961 487861 489136 490837 492557 493877
61760 493877 494924 496254 498249 500855 503840 507015 510169 513130 516041 519243 522623 525366 526709 526733 526052
61745 526052 524968 523368 521230 518603 515202 510747 505791 501453 498077 494770 490734 486539 483507 482121
61731D82121n21o11p53j07J186K177K063J126M93P69J277J034K32N2J110K657
61715D94305L441K950J738P97O61R11O52l56j432j974k255k712k968k381j244
61700D90133n51p56j430k092k605k835k725k660k978l244k794j998j943k834l708
61685D54980l887l712l581l269k754k643l182l609l191k290j778j892k258k500
61671D14434k355j679q71p83j631k507k524j961j639j634j351n95K12O97Q40P19
61655C97372N15O45J385K374K913K770K330K075K164K435K533K155J410P67N15
61640D24358N12O14R13J318J364Q07O1l68n60q47j182j359j603k270l118l477
61624D15163l150k660k518k658k714k506k122j729j446j351j530k088k972l821
$$ plain form
61731 482121 481600 480989 480236 480129 481315 483492 485555 486681 487174 487943 489220 490254 490486 490538 491648 494305
61715 494305 497746 500696 502434 503231 503892 504803 505455 505099 503667 501693 499438 496726 493758 491377 490133
61700 490133 489582 488826 487396 485304 482699 479864 477139 474479 471501 468257 465463 463465 461522 458688 454980
61685 454980 451093 447381 443800 440531 437777 435134 431952 428343 425152 422862 421084 419192 416934 414434
61671 414434 412079 410400 409529 408746 407115 404608 402084 400123 398484 396850 395499 394904 395116 395813 396653 397372
61655 397372 397887 398532 399917 402291 405204 407974 410304 412379 414543 416978 419511 421666 423076 423843 424358
61640 424358 424870 425484 426397 427715 429079 429886 429947 429579 429019 428172 426990 425631 424028 421758 418640 415163
61624 415163 412013 409353 406835 404177 401463 398957 396835 395106 393660 392309 390779 388691 385719 381898
61610C81898m197m049l746l632l759m055m410m553m265l797l641l729l403k428
61596C28234j482j300j752k196k333k278k184k194k480k873k770j844o00J83K96
61581C02427K1m48j048j537j673j525j310j066p86o34o79o90m42RN72J242J752
61564B94185J659J075P51J002J128N37k08j93N33J266J795K335K649K262J387
61549C12163P60N38K49j97l50j05Q3L5J47O16J057J107Q72O38O17R92J707K191
61531C23120J893J045L52n2n99j313j670j552j472j589j346n40N0l29j331j975
61515C12692j854j351r62p90n62Q5J143J958J801Q01j25l63k34l35p52j099r85
61498C09068k33R49J863J872J109K72l64j016j447q59Q04K303K442J444M04l6
$$ plain form
61610 381898 377701 373652 369906 366274 362515 358460 354050 349497 345232 341435 337794 334065 330662 328234
61596 328234 326752 325452 323700 321504 319171 316893 314709 312515 310035 307162 304392 302548 301948 302131 302427
61581 302427 302448 302000 300952 299415 297742 296217 294907 293841 293055 292421 291742 291052 290610 290619 291191 292433 294185
61564 294185 295844 296919 297670 298672 299800 300337 300129 299936 300469 301735 303530 305865 308514 310776 312163
61549 312163 312923 313461 313710 313513 313163 313058 313141 313176 313323 313939 314996 316103 316975 317613 318230 319222 320929 323120
61531 323120 325013 326058 326410 326358 325759 324446 322776 321224 319752 318163 316817 316277 316327 315998 314667 312692
61515 312692 310838 309487 308525 307735 307173 307258 308401 310359 312160 312961 312836 312473 312239 311904 311152 310053 309068
61498 309068 308835 309784 311647 313519 314628 314900 314536 313520 312073 311214 312018 314321 316763 318207 318611 318575
61482C18575J17P83J718K230J822R50N13P08R81R61P95O86O95R03J251J343R27
61465C35958L82J71No37j427j493q73o03j132j585j149k32L66O58J023J187O88
61448C31307NJ33J068J756J674J454J632J713J134M10M31J059J325Q59K99K34
61432C46493M96P40J052J590K127K348K350K409K464K202J563Q55M35M48P73J096
61416C69441J150J089J367K059K555K234J320O24N53P26N78q4j103k151k713k342
61400C75303j211j89K2l67o05m68m78j001j584j570j123j025j428j443l72J135
61384C63596J823J480J098J351J691J317M03j27K14J065J783K044J937J784J803
61369C83262J811J414N95j13k13K23Q11J367J851K173K296K368K467K435K243
$$ plain form
61482 318575 318692 319475 321193 323423 325245 326195 326708 327416 328397 329358 330153 330839 331534 332437 333688 335031 335958
61465 335958 336340 336511 336516 335879 334452 332959 332086 331483 330351 328766 327617 327385 327751 328409 329432 330619 331307
61448 331307 331312 331445 332513 334269 335943 337397 339029 340742 341876 342286 342717 343776 345101 345960 346259 346493
61432 346493 346989 347729 348781 350371 352498 354846 357196 359605 362069 364271 365834 366689 367124 367572 368345 369441
61416 369441 370591 371680 373047 375106 377661 379895 381215 381839 382392 383118 383696 383612 382509 380358 377645 375303
61400 375303 374092 373903 373925 373558 372953 372485 372007 371006 369422 367852 366729 365704 364276 362833 362461 363596
61384 363596 365419 366899 367997 369348 371039 372356 372759 372632 372846 373911 375694 377738 379675 381459 383262
61369 383262 385073 386487 387082 386969 386756 386979 387790 389157 391008 393181 395477 397845 400312 402747 404990
61354D04990K227K707L561M426N018N144M846M766N648P103P543O061L734K243
61340D70017J794J495J240J850L316M344M058L098K478K220J695P25k87r01r04
61325D96238l35M02P88P42O19O20O65R28J831L265M447M941N280O175P565Q905
61309E43076J0012J1126J2332J3389J3963J3872J3234J2507J2029J1433R951P417
61297F84341M556K040k22k550m821o757q409r888j0942j1299j1157j0953j0831
61284F03108j0721j0603j0334r528q037o394n257m634m045l250k368j471n20L67
61270E26313J021J559K228K950L402L461L283L032K953L514M928O508P115O493
61256E78760N664N656O213O214N196L862L018K571J907R87M97R04J798K312J929
$$ plain form
61354 404990 407217 409924 413485 417911 422929 428073 432919 437685 443333 450436 457979 464040 467774 470017
61340 470017 471811 473306 474546 476396 479712 484056 488114 491212 493690 495910 497605 498330 498043 497142 496238
61325 496238 495903 496305 497093 497835 498454 499074 499739 500667 502498 505763 510210 515151 520431 526606 534171 543076
61309 543076 553088 564214 576546 589935 603898 617770 631004 643511 655540 666973 676924 684341
61297 684341 688897 690937 690715 688165 683344 676587 668178 658290 647348 636049 624892 613939 603108
61284 603108 592387 581784 571450 561922 553885 547491 542234 537600 533555 530305 527937 526466 525946 526313
61270 526313 527334 528893 531121 534071 537473 540934 544217 547249 550202 553716 558644 565152 572267 578760
61256 578760 584424 590080 596293 602507 607703 611565 614583 617154 619061 620048 620545 621449 623247 625559 627488
61241F27488P85n12j153p01K91O09k36j318j460p25k8M32J368L051M676N443N521
61224F43531N541N777O225O940P797Q360Q382Q098P746P206O403N673N294N136
61210G38109N101N361N797N670M520L020K317K719L561M178M454M623M991N805
61196H00226O998Q184R108R865J0460J0547J0029R340Q649P319M929K399J047
61183H99100P50P8j643l457m221m065l924m334n221o394p642q565q897q895r120
61168H23550r850j0886j1768j2084j1770j1273j1165j1510j1807j1720j1532j1579
61156F86606j1561j0847r371p764o532n448m009k226p44j71m42r28j111j081j363
61141F23008k262l562m767n573n901n679m832l557k331j382l52J257L338N192
$$ plain form
61241 627488 628273 627761 626608 625907 626198 626807 626571 625253 623793 623068 623040 623472 624840 627891 632567 638010 643531
61224 643531 649072 654849 661074 668014 675811 684171 692553 700651 708397 715603 722006 727679 732973 738109
61210 738109 743210 748571 754368 760038 764558 767578 769895 772614 776175 780353 784807 789430 794421 800226
61196 800226 807224 815408 824516 834381 844841 855388 865417 874757 883406 890725 895654 898053 899100
61183 899100 899850 899928 898285 894828 890607 886542 882618 878284 873063 866669 859027 850462 841565 832670 823550
61168 823550 813700 802814 791046 778962 767192 755919 744754 733244 721437 709717 698185 686606
61156 686606 675045 664198 654827 647063 640531 635083 631074 628848 628104 627933 627491 626563 625452 624371 623008
61141 623008 620746 617184 612417 606844 600943 595264 590432 586875 584544 583162 582810 584067 587405 592597
61127E92597O277O726P055P675Q815J0602J2912J5330J7495J9403K1194K2848
61115G48929K4259K5448K6387K6878K6813K6454K6060K5493K4467K3046K1398
61104A025632J9345J6694J3912J1758J0171Q119M862Q13l153o761j0296j3819
61092A077277j7025j9773k2236k4346k5486k5116k3709k2602k2643k3222k3057
61081H28062k1813k0365j9460j8802j7803j6454j4956j3107j0830q780p652p188
61069F50852o661n933n207m129k179J66J703K027J838J759J819K133L076M512
61055F45776N789O713P738R020J0217J1381J2998J4949J6405J7122J7802J8866
61043G94776J9887K0664K1786K3570K5484K7186K9166L1626L3702L4619L4879
$$ plain form
61127 592597 598874 605600 612655 620330 629145 639747 652659 667989 685484 704887 726081 748929
61115 748929 773188 798636 825023 851901 878714 905168 931228 956721 981188 1004234 1025632
61104 1025632 1044977 1061671 1075583 1087341 1097512 1105631 1110493 1111306 1108153 1101392 1091096 1077277
61092 1077277 1060252 1040479 1018243 993897 968411 943295 919586 896984 874341 851119 828062
61081 828062 806249 785884 766424 747622 729819 713365 698409 685302 674472 665692 658040 650852
61069 650852 644191 638258 633051 628922 626743 626909 628612 630639 632477 634236 636055 638188 641264 645776
61055 645776 651565 658278 666016 675036 685253 696634 709632 724581 740986 758108 775910 794776
61043 794776 814663 835327 857113 880683 906167 933353 962519 994145 1027847 1062466 1097345
61032A097345L5508L6811L8509M0422M2349M3953M5362M7288M9907N2314N3659
61021A583427N4287N5255N7379O1109O6618P3604Q1730R1489J03736J18328J34454
61010B481416J52583J74936K04017K42366K93855L63006M52326N62192O93526
61001E620223Q47628J022064J208506J393817J559356J682147J749040J774782
60993A6857563J790301J792960J713583J462454J028176N20758R6800j59343k71437
60984B4831815l01757k81356k29176k14836l52546p05054j203442j681726j994469
60975A7867453k099043k039741j881840j672223j442053j216702j013096q36550
60967E666205o86680n63126m63989l84067l18505k65685k24600j92229j65619
$$ plain form
61032 1097345 1132853 1169664 1208173 1248595 1290944 1334897 1380259 1427547 1477454 1529768 1583427
61021 1583427 1637714 1692969 1750348 1811457 1878075 1951679 2033409 2124898 2228634 2346962 2481416
61010 2481416 2633999 2808935 3012952 3255318 3549173 3912179 4364505 4926697 5620223
61001 5620223 6467851 7489915 8698421 10092238 11651594 13333741 15082781 16857563
60993 16857563 18647864 20440824 22154407 23616861 24645037 25165795 25262595 25103252 24831815
60984 24831815 24530058 24248702 24019526 23804690 23452144 22747090 21543648 19861922 17867453
60975 17867453 15768410 13728669 11846829 10174606 8732553 7515851 6502755 5666205
60967 5666205 4979525 4416399 3952410 3568343 3249838 2984153 2759553 2567324 2401705
60958B401705j44025j26973j12385r8579q6112p5817o6736n7801m9685m3192l7413
60947A502987l1447k6481k4135k3867k3793k3131k2084k0401j7898j5536j4180
60936A260034j3068j1154r240q837r548r525q322p347p478p990q098q110q499
60923A142818r006r236r408j0050j1314j2805j3890j4229j4158j4306j4753j5057
60911I94606j5193j5644j6349j6480j5720j4801j4215j3472j2323j1561j1643
60900H37205j1579j0407q849q182q263q054p484p396p959q547q850q960q651p730
60886G16294o888o947p569p828p824q404r495j0018r570q875q432p874o951o152
60872F03467n851n690n205m553m251m540n147n412m764l390k188j832k184k846
$$ plain form
60958 2401705 2257680 2130707 2018322 1919743 1833631 1757814 1691078 1633277 1583592 1540400 1502987
60947 1502987 1471540 1445059 1420924 1397057 1373264 1350133 1328049 1307648 1289750 1274214 1260034
60936 1260034 1246966 1235812 1226572 1217735 1208187 1198662 1190340 1182993 1175515 1167525 1159427 1151317 1142818
60923 1142818 1133812 1124576 1115168 1105118 1093804 1080999 1067109 1052880 1038722 1024416 1009663 994606
60911 994606 979413 963769 947420 930940 915220 900419 886204 872732 860409 848848 837205
60900 837205 825626 815219 806370 798188 789925 781871 774387 766991 759032 750485 741635 732675 724024 716294
60886 716294 709406 702459 694890 687062 679238 670834 661339 651321 641751 632876 624444 616570 609619 603467
60872 603467 597616 591926 586721 582168 577917 573377 568230 562818 558054 554664 552476 550644 548460 545614
60858E45614l632m123l612k214j229j512k254k315j907j836j943j729j728k620
60844E12960l495k933j538j388k916m295m315l935m306n010n291n510o166o534
60830D55328n540l371j221R6N36L81P6J07M68O03K64p5K1L34N27O49O76K27p20
60811D49366j389j139l68N3j05m13n60n95o29o97q48j033j120j135j240j343j180
60794D35625r68j387k605l798m115l744l494l623l664l276k731k481k536k514
60780C94689k196j919k245l193l973l838k981k215j836j398o54o9o4k31J62J157
60764C69196K066K393K427K793L599M213L915K733J452Q14Q55J151J409J621J823
60749D02460K006K223K500K784L081L390L342K361N35j143j873k090k764m035
$$ plain form
60858 545614 541982 537859 534247 532033 530804 529292 527038 524723 522816 520980 519037 517308 515580 512960
60844 512960 509465 506532 504994 503606 500690 496395 492080 488145 483839 478829 473538 468028 461862 455328
60830 455328 449788 446417 445196 445292 445828 446209 446285 446392 446860 447463 447727 447652 447673 448007 448534 449183 449859 450086 449366
60811 449366 447977 446838 446470 446523 446418 446005 445445 444850 444221 443524 442676 441643 440523 439388 438148 436805 435625
60794 435625 434657 433270 430665 426867 422752 419008 415514 411891 408227 404951 402220 399739 397203 394689
60780 394689 392493 390574 388329 385136 381163 377325 374344 372129 370293 368895 368241 368172 368108 367877 368039 369196
60764 369196 371262 373655 376082 378875 382474 386687 390602 393335 394787 395601 396456 397607 399016 400637 402460
60749 402460 404466 406689 409189 411973 415054 418444 421786 424147 424682 423539 421666 419576 416812 412777
60735D12777n213n905o344o725o889o736o280n369l948k587j985j987j784j201
60721C49824r30j337j842j837j473j192j030q38p06o86n06j5L90J91n55j262j461
60704C34735j232j011j053j082o15K99R27P98M41P54J755K559K493J755R92P27
60688C43242J162K028K688K806K789L149L678L863L850M198M847N171N001M769
60674C93241M581M073L229K568K326K197J977J698J082k24j779k697k967l417
60660D05888m141m146l017j792j531j973k293k264j916r97L92J380J428J179J327
60645C87524J377N92m57n47K29M43p12k412l437l629l736m268m905m916m014k761
60629C54371j926j501p78N01J652K015J805J559J274P39K26J23J98n6m90m98k1
$$ plain form
60735 412777 407564 401659 395315 388590 381701 374965 368685 363316 359368 356781 354796 352809 351025 349824
60721 349824 348894 347557 345715 343878 342405 341213 340183 339345 338639 337953 337447 337432 337822 338013 337458 336196 334735
60704 334735 333503 332492 331439 330357 329742 330041 330968 331766 332207 332961 334716 337275 339768 341523 342515 343242
60688 343242 344404 346432 349120 351926 354715 357864 361542 365405 369255 373453 378300 383471 388472 393241
60674 393241 397822 401895 405124 407692 410018 412215 414192 415890 416972 416748 414969 412272 409305 405888
60660 405888 401747 397601 394584 392792 391261 389288 386995 384731 382815 381818 382210 383590 385018 386197 387524
60645 387524 388901 389493 389036 388489 388718 389161 388449 386037 382600 378971 375235 370967 366062 361146 357132 354371
60629 354371 352445 350944 350166 350667 352319 354334 356139 357698 358972 359711 359937 360060 360258 360202 359712 359214 359193
60612C59193K72q4p45j051p39j5P55J330J672J821J686J198O45N46R87J400J237
60595C70108O06O3k3L58R64J432J564J645K098K704K655J608J92q15j282j376
60579C82501r90m2J113K060K768L348L801M314N285O556P303P206P108P801Q833
60564D48965R364R659J0575J1812J1880R967O862L846J394p87l023n257o939p298
60550E01020o136m333l001k119o72J798M433O110O718P059P854R249J1011J2856
60536E51847J4603J6126J7207J7502J6797J5231J3112J0614P840M976K096r86
60524F86965m304p275r071r524r309r227r505r816r620q534o657m593k955j804
60510E84771q07J33P48R92J443K798N126P828J0390J3029J6351K0511K4924K8970
$$ plain form
60612 359193 359465 359381 358636 357585 356846 356831 357586 358916 360588 362409 364095 365293 365938 366484 367471 368871 370108
60595 370108 370714 370777 370754 371112 372076 373508 375072 376717 378815 381519 384174 385782 385974 385159 383877 382501
60579 382501 381511 381469 382582 384642 387410 390758 394559 398873 404158 410714 418017 425223 432331 440132 448965
60564 448965 458329 467988 478563 490375 502255 512222 519084 522930 524324 523537 520514 515257 508318 501020
60550 501020 494884 490551 487550 485431 484759 486557 490990 497100 503818 510877 518731 527980 538991 551847
60536 551847 566450 582576 599783 617285 634082 649313 662425 673039 680879 685855 687951 686965
60524 686965 682661 675386 666315 656791 647482 638255 628750 618934 609314 600780 594123 589530 586575 584771
60510 584771 583964 584097 584845 585837 587280 590078 595204 603032 613422 626451 642802 663313 688237 717207
60496G17207L2622L6061L9004M1020M2287M3378M4117M3415M0458L5520K9299
60485A144388K2146J4270O130j934j0024j8155k5823l2562l8451m3550m7315m9148
60473I19972m9180m7871m5255m1316l6764l2652k9257k6096k2981k0317j8316
60462E49967j6512j4365j1963r964r007r039r114q163o274m793m743n514n690
60449D34826m802l594k787k360j950j304l93M22M92l09j122j146p85r69j642j898
60433D10679j516j226j373j460j241j177j425j373p79l85p12j055n23N61J168
60418C98163J022O12J42n22r93n19P71J674J421P50Q77J792K324J803R70Q74J468
60401D12629J892J856J954K499K827K336J603J748K851L790L690K899K370K586
$$ plain form
60496 717207 749829 785890 824894 865914 908201 951579 995696 1039111 1079569 1115089 1144388
60485 1144388 1166534 1180804 1186934 1185000 1174976 1156821 1130998 1098436 1059985 1016435 969120 919972
60473 919972 870792 822921 777666 736350 699586 666934 637677 611581 588600 568283 549967
60462 549967 533455 519090 507127 497163 488156 479117 470003 461840 455566 450773 446030 440516 434826
60449 434826 430024 426430 423643 421283 419333 418029 417636 418058 418550 418241 417119 415973 415188 414219 412577 410679
60433 410679 409163 407937 406564 405104 403863 402686 401261 399888 399109 398724 398012 396957 396434 396995 398163
60418 398163 399185 399797 399939 399417 398424 397905 398676 400350 401771 402521 403398 405190 407514 409317 410287 411161 412629
60401 412629 414521 416377 418331 420830 423657 425993 427596 429344 432195 435985 439675 442574 444944 447530
60387D47530L293L904L876L080K025J502J762K238K266J864J566J675J919J857
60373D80357J418R64Q60J085J294J267J125J059J076J098J127J062O85P7j62M99
60357D94891J819L030L705M031M248M366M480M914N780O698P169P135O810O234
60343E65310N201L764K391J390L05j618m202o108o301n398m930n428o064o164
60329E32148o068o170o083n347m312l575l197l103l557m426m572l084p39P93J043
60314D79751J026J564K463L429M694O340P922R230J0781J3080J5794J8019J9085
60301E93178J8943J8043J6927J5585J3333R652M995K28m466r435j4365j8123j9895
60288F24600j9826j8467j6323j4015j2117j0509q648o626n270m932m919m503l751
$$ plain form
60387 447530 450823 454727 458603 461683 463708 465210 466972 469210 471476 473340 474906 476581 478500 480357
60373 480357 481775 482739 483599 484684 485978 487245 488370 489429 490505 491603 492730 493792 494477 494554 494392 494891
60357 494891 496710 499740 503445 507476 511724 516090 520570 525484 531264 537962 545131 552266 559076 565310
60343 565310 570511 574275 576666 578056 578361 576743 572541 566433 560132 554734 549804 544376 538312 532148
60329 532148 526080 519910 513827 508480 504168 500593 497396 494293 490736 486310 481738 478654 477915 478708 479751
60314 479751 480777 482341 484804 488233 492927 499267 507189 516419 527200 540280 556074 574093 593178
60301 593178 612121 630164 647091 662676 676009 685661 690656 690884 686418 676983 662618 644495 624600
60288 624600 604774 586307 569984 555969 543852 533343 524695 518069 512799 507867 502948 498445 494694
60275D94694l020k329j782j864k666l400l326k778k608k926l075k653k035j836
60261D58396k296l130l718l513k506j251l52J1rk11m09m68l88j76K94J036J636
60244D42946J609J086P01P17P92O40M55M60N67O63Q46J132J332J404J536J756
60228D58642J874J917K152K553K779K829L143L811M228L860K946K199K131K802
60214D97866L830M587M870N288O374P482P470O513O059O765P658P830P671P675
60200E87938P317O167N044M802M810L986K729K282K604K393J211R9j72j40o16
60185F30454j523k310k684k603k173j885k359l556m763n484n794n749n197m373
60171E80001l943m089m166l677l011k758k829k746k395j986j592j212r74q61m85
$$ plain form
60275 494694 491674 489345 487563 485699 483033 479633 476307 473529 470921 467995 464920 462267 460232 458396
60261 458396 456100 452970 449252 445739 443233 441982 441630 441641 441632 441421 441012 440544 440156 439980 440274 441310 442946
60244 442946 444555 445641 446342 447059 447851 448491 448946 449406 449973 450636 451482 452614 453946 455350 456886 458642
60228 458642 460516 462433 464585 467138 469917 472746 475889 479700 483928 487788 490734 492933 495064 497866
60214 497866 501696 506283 511153 516441 522815 530297 537767 544280 550339 557104 564762 572592 580263 587938
60200 587938 595255 601422 606466 611268 616078 620064 622793 625075 627679 630072 631283 631382 631210 631070 630454
60185 630454 628931 626621 623937 621334 619161 617276 614917 611361 606598 601114 595320 589571 584374 580001
60171 580001 576058 571969 567803 564126 561115 558357 555528 552782 550387 548401 546809 545597 544623 543762 543277
60156E43277L54J175J373J101J024J307J460J222R70R67Q57K56m04k88P81K054
60140E57486K755K887K994L445M099M607M821M950N354O057O547O254N250M202
60126F21708L558L147K684K238J923J546J016P35J063J613J730J503J634K382
60112F48480L266L869M119L744K317J89j442j951k132k993m236m702m060l201
60098F41267k974l239l293k781j885r99l69N8N34J198J811J944J473Q06N30Q24
60082F34905J296J455J284J121R65L26r90k370l186l747m808o286p310p586p853
60067E97216q659r465r429q574p628p124p086p220p035o120m675l495l100l215
60053E04391l349l400l369k938j890n83N24J452K424L321L971M605N496O343O665
$$ plain form
60156 543277 543631 544806 546179 547280 548304 549611 551071 552293 553263 554230 555087 555343 554939 554651 555432 557486
60140 557486 560241 563128 566122 569567 573666 578273 583094 588044 593398 599455 606002 612256 617506 621708
60126 621708 625266 628413 631097 633335 635258 636804 637820 638555 639618 641231 642961 644464 646098 648480
60112 648480 651746 655615 659734 663478 665795 665984 664542 662591 660459 657466 653230 648528 644468 641267
60098 641267 638293 635054 631761 628980 627095 626096 625727 625785 626319 627517 629328 631272 632745 633551 634081 634905
60082 634905 636201 637656 638940 640061 641026 641352 640362 637992 634806 631059 626251 619965 612655 605069 597216
60067 597216 588557 579092 569663 561089 553461 546337 539251 532031 524996 518876 514201 510706 507606 504391
60053 504391 501042 497642 494273 491335 489445 488862 489386 490838 493262 496583 500554 505159 510655 516998 523663
60038E23663O547O412O244N692M808M011L312K236O74p82j568j842k250l205m571
60023E49381n771o218n821n141m849n071n511n965o361o372n579m157k986k720
60009D76859l044l205l085l231l828m163l552k480k117k687l039k215p97j8j3
59994D39385J97J138K208K731K817K933L274L787M293M303L420K147J697K516
59980D76846L532L323J624n74k070k291j617j081j418k268k813l072l693m431
59966D59997m055k255m43R3j54NO77J260J761K560L313L339K746K222J902J412
59950D74380P88M21L75M82Q28J312J238K84n71k37Q18J260R52R31J540J995J913
59933D88709J826J919J630Q71N09J101K209L408M919O567P209O030L828K239K141
$$ plain form
60038 523663 530210 536622 542866 548558 553366 557377 560689 562925 563599 562817 561249 559407 557157 553952 549381
60023 549381 543610 537392 531571 526430 521581 516510 510999 505034 498673 492301 486722 482565 479579 476859
60009 476859 473815 470610 467525 464294 460466 456303 452751 450271 448154 445467 442428 440213 439416 439398 439385
59994 439385 439582 440720 442928 445659 448476 451409 454683 458470 462763 467066 470486 472633 474330 476846
59980 476846 480378 483701 485325 484751 482681 480390 478773 477692 476274 474006 471193 468121 464428 459997
59966 459997 455942 453687 453244 453337 453183 453188 453865 455125 456886 459446 462759 466098 468844 471066 472968 474380
59950 474380 475168 475589 475964 476446 477274 478586 479824 480108 479537 479300 480118 481378 482330 483261 484801 486796 488709
59933 488709 490535 492454 494084 494955 495464 496565 498774 502182 507101 513668 520877 526907 530735 532974 535115
59918E35115L215M590N466N565N352N420N526M862L350J845P52n19k214l352l096
59903E71877k209k120k932l428k867j859j342j404j428r22OQ83J483K181L466
59888E59385N087O080N936N314N180N522N536M941M477M939O116P069P212O789
59874F39583O235N411L829J544o09j894k496l142m095m926n192m970m709m792
59860F19777n232n543n104l935k902k713k941k558j306J61J450K947M838O404
59846F03343O828O402O299P185Q455Q841P590N010K052m18j907k180j323L3R75
59831F57185J093O61j59j682l902n896o719o587o430o555o515o069n479m907m264
59816E93775l691l421l230k719k138k103k541k757k615k756l412l956l943l737
$$ plain form
59918 535115 538330 542920 548386 553951 559303 564723 570249 575111 578461 580306 581058 580539 578325 574973 571877
59903 571877 569668 567548 564616 561188 558321 556462 555120 553716 552288 551366 551372 552255 553738 555919 559385
59888 559385 564472 570552 576488 581802 586982 592504 598040 602981 607458 612397 618513 625582 632794 639583
59874 639583 645818 651229 655058 656602 655993 654099 651603 648461 644366 639440 634248 629278 624569 619777
59860 619777 614545 609002 603898 599963 597061 594348 591407 588849 587543 587704 589154 592101 596939 603343
59846 603343 610171 616573 622872 630057 638512 647353 654943 659953 662005 661587 659680 657500 656177 656210 657185
59831 657185 658278 658939 658780 657098 653196 647300 640581 633994 627564 621009 614494 608425 602946 598039 593775
59816 593775 590084 586663 583433 580714 578576 576473 573932 571175 568560 565804 562392 558436 554493 550756
59802E50756l686l518l001k490k227j840j121o77j098j949k334k058j590j104
59788E22063l80M95R53O51o4n74o16m29l25k93j06J82J77k38n21j79M06M38j15
59769E21525m16R2J116K076K607K450J546N23L44J183K192K649K752L031L578
59754E47248M223M877N349N365N124N282O067O886P150O947O545N896N043M399
59740F26401M083L588K576J487P88K13n63j047n57N64J215Q67o0r44j410j096
59724F36105J98J895K722J810l84k426l126k500j542j072r03m04L58O18J27l73
59708F31103k10L21N84O29R38J594K314L071M046N040N543N376M829M195L553
59693F72926L014K834L145L762M194L798K219o1j833k236j635j129j270j664j805
$$ plain form
59802 550756 547070 543552 540551 538061 535834 533994 532873 532196 531098 529149 526815 524757 523167 522063
59788 522063 521683 522178 523131 523782 523718 523144 522528 522099 521774 521481 521375 521557 521734 521496 520975 520796 521202 521640 521525
59769 521525 521109 521201 522317 524393 527000 529450 530996 531519 531863 533046 535238 537887 540639 543670 547248
59754 547248 551471 556348 561697 567062 572186 577468 583535 590421 597571 604518 611063 616959 622002 626401
59740 626401 630484 634072 636648 638135 638923 639136 638573 637526 636969 637533 638748 639615 639555 638611 637201 636105
59724 636105 636303 638198 640920 642730 642346 639920 636794 634294 632752 631680 630777 630373 630731 631349 631476 631103
59708 631103 630893 631214 631798 632427 633365 634959 637273 640344 644390 649430 654973 660349 665178 669373 672926
59693 672926 675940 678774 681919 685681 689875 693673 695892 695831 693998 691762 690127 688998 687728 686064 684259
59678F84259j895k554l909n258n818n628n461n823o379o581o456o310n963m994
59664F11230l672k943l202l638l125j495L01J107N71m76p02M29K108L227L648
59649F03368L904L988L367K123J106O80J91j002k671m239n464o288o612o577o457
59634E79417o074n003l574k792k863k800j992j284j686k757l276k967k686l104
59620E36559m044m881n014m133k578j291r74j409j919k137k008j477o06L04J099
59605E05491J885K513K490J764J058R17J032R49Q83J147J342Q92Qo27q34r99j312
59588E18599j581j622j407r70n15l47m71o46j003j971l310l987l537k791k593
59573D91848k612k276k046k712l805l995k901j530q75r07j078j046p78l98o8K36
$$ plain form
59678 684259 682364 679810 675901 670643 664825 659197 653736 647913 641534 634953 628497 622187 616224 611230
59664 611230 607558 604615 601413 597775 594650 593155 593456 594563 595134 594658 593956 594385 596493 599720 603368
59649 603368 607272 611260 614627 616750 617856 618536 618727 617725 615054 610815 605351 599063 592451 585874 579417
59634 579417 573343 568340 564766 561974 559111 556311 554319 553035 551349 548592 545316 542349 539663 536559
59620 536559 532515 527634 522620 518487 515909 514618 513644 512235 510316 508179 506171 504694 504088 504392 505491
59605 505491 507376 509889 512379 514143 515201 516118 517150 518099 518982 520129 521471 522363 522371 521744 520910 519911 518599
59588 518599 517018 515396 513989 513019 512504 512157 511686 511040 510037 508066 504756 500769 497232 494441 491848
59573 491848 489236 486960 484914 482202 478397 474402 471501 469971 469096 468189 467111 466065 465287 464889 464821 465057
59557D65057P81J605K263K306J845J323J073J267J926K684L059L226L941N375
59543D97731O727P421P940Q934J0249J1453J2565J3550J3921J3576J3206J2922
59531F30195J1302P053J063m274p456q500p792n627k766k34J516K514K616J758
59517F21368N76j84o95j643l078m550n974p454q522q643q213q085q333q406q162
59502E40002p776o977n499l963l135k596j420N6O09J22j59M13J056R92M88J39
59486E12352J39N92J592K717L310L482L953M820N411N457N399N384M995M206L627
59471E67436L501L350K839K133J267P3j064j355p39J2N26J181K096K841L441M579
59455E92117O370P927Q638Q963R486J0005J0066R683R012P936O459M896L314J338
$$ plain form
59557 465057 465838 467443 469706 472012 473857 475180 476253 477520 479446 482130 485189 488415 492356 497731
59543 497731 504458 511879 519819 528753 539002 550455 563020 576570 590491 604067 617273 630195
59531 630195 641497 648550 649613 645339 637883 629383 621591 615964 613198 612964 614480 616994 619610 621368
59517 621368 621944 621760 621065 619422 616344 611794 605820 598366 589844 581201 572988 564903 556570 548164 540002
59502 540002 532226 525249 519750 515787 512652 510056 508636 508692 509301 509423 509264 509677 510733 511725 512213 512352
59486 512352 512491 513083 514675 517392 520702 524184 528137 532957 538368 543825 549224 554608 559603 563809 567436
59471 567436 570937 574287 577126 579259 580526 580599 579535 578180 577441 577453 577979 579160 581256 584097 587538 592117
59455 592117 598487 606414 615052 624015 633501 643506 653572 663255 672267 680203 686662 691558 694872 696210
59441F96210j131l617n706p486r098j0367j1017j0820r595p667o108n687n742
59428F02169n025l513k293j687p63J078L323N470P714J0062J1931J3254J4925
59415F56645J7474K0142K1793K1963K0656J8171J5575J4117J3316J0618M154m681
59403H29943j2190j5577j4716j1452q022n646l872j412J911M236L128k146r874
59390G54311j7122k1547k2548k1039j8237j4848j1481q985p579o183l735q73Q89
59377F01023J384J786K600L154L265L709M614M969M395L963M480N258N367N009
59363F54976M778M692M746N361O397O835O278N791O327P281P629P551P884Q749
59349G45275R722J0765J2004J3190J4165J5217J6266J6434J5234J3414J1780J0048
$$ plain form
59441 696210 695079 691462 685756 678270 669172 658805 647788 636968 627373 619706 613598 607911 602169
59428 602169 597144 593631 591338 589651 588888 589966 593289 598759 606473 616535 628466 641720 656645
59415 656645 674119 694261 716054 738017 758673 776844 792419 806536 819852 830470 834624 829943
59403 829943 817753 802176 787460 776008 767986 762340 758468 757056 758967 763203 766331 764185 754311
59390 754311 737189 715642 693094 672055 653818 638970 627489 618504 610925 604742 601007 600134 601023
59377 601023 602407 604193 606793 609947 613212 616921 621535 626504 630899 634862 639342 644600 649967 654976
59363 654976 659754 664446 669192 674553 680950 687785 694063 699854 706181 713462 721091 728642 736526 745275
59349 745275 754997 765762 777766 790956 805121 820338 836604 853038 868272 881686 893466 903514
59337I03514P693N100K853O22k112m897o973q508j0146j1706j2497j2530j2461
59324H37952j2578j2659j2596j2358j1660j0353q869p697o775n921n315n003m523
59311G21645l657k932k790k882k798k690k473j322J093L645N082N643O322P190
59297G29076P588P479P391P242O239L751m05o050j2198j7034j9278j9235j7865
59284F76701j5438j1973q300n504l739k486j515o48P75L108N535P145Q382J0191
59270F62234J2236J3298J3150J2705J2423J1857J0748R327P476M726J283j928
59258G69535m369o279p915r169r966j0365j0284r711q991q317p271n538l717k575
59244F65068j921j080r7N03P78J218J797K237K827L945M942M736L438K281J950
$$ plain form
59337 903514 911207 916307 919160 919782 917670 912773 905800 897292 887146 875440 862943 850413 837952
59324 837952 825374 812715 800119 787761 776101 765748 756879 749182 742407 736486 731171 726168 721645
59311 721645 717988 715056 712266 709384 706586 703896 701423 700101 701194 704839 709921 715564 721886 729076
59297 729076 736664 744143 751534 758776 765015 768766 768361 762311 750113 733079 713801 694566 676701
59284 676701 661263 649290 640990 635486 631747 629261 627746 627098 627873 630981 636516 643661 652043 662234
59270 662234 674470 687768 700918 713623 726046 737903 748651 757978 765454 770180 771463 769535
59258 769535 765166 758887 750972 741803 731837 721472 711188 701477 692486 684169 676898 671360 667643 665068
59244 665068 663147 662067 661970 662473 663251 664469 666266 668503 671330 675275 680217 684953 688391 690672 692622
59229F92622J972J746J244N63l75j504k651l735m514m478l706l215l581l897l149
59214F63342j962j685k255k562k503k932l698l539k199j056j119j810k199k181
59200F31642j930j363p50q48j778k611k509j619n21L79P44M12p2Q4P83J219J333
59183F22595J965L312M350M314L722L413L459L579L816M228M587M881N416O093
59169F79730O338O205O589P798Q804Q692Q066Q084Q605Q368O745M450K427P83
59155G71684r71l072n236p071q494r680j0700j1495j2113j2639j2770j1917j0136
59142F55390q438p793q056q390q350q010p460o776o211n764m965l682k680k512
59128E66303k397j233O33J851K094K423L561N041O305P527Q938J0217J0960J1164
$$ plain form
59229 692622 694594 696340 697584 698147 697772 696268 693617 689882 685368 680890 677184 673969 670388 666491 663342
59214 663342 661380 659695 657440 654878 652375 649443 645745 642206 640007 638951 637832 636022 633823 631642
59200 631642 629712 628349 627599 626751 624973 622362 619853 618234 617713 618092 618836 619248 619176 619260 620043 621262 622595
59183 622595 624560 627872 632222 636536 640258 643671 647130 650709 654525 658753 663340 668221 673637 679730
59169 679730 686068 692273 698862 706660 715464 724156 732222 740306 748911 757279 764024 768474 770901 771684
59155 771684 770713 767641 762405 755334 746840 737160 726460 714965 702852 690213 677443 665526 655390
59142 655390 646952 639159 631103 622713 614363 606353 598893 592117 585906 580142 575177 571495 568815 566303
59128 566303 563906 562673 563306 565157 567251 569674 573235 578276 584581 592108 601046 611263 622223 633387
59114F33387J0975J0545J0191J0091R853R026P922P126O385M932K928J475J056
59101G25892J010P06L03K0l85j028j574j835k049k328k482k523k639k653k237
59086G06198j662j504j625j464j342k287m334o174o894o974p132p242p082p084
59072F43398p566p908p311n930m622l973l985m388m768m716m153l348k637k334
59058E75759k721l595m081l606k837k807l305l173k158j297j311j726j900j854
59044E39388j710j192k35O79J227J548J688J461J112J224J751K001J866K131L166
59029E56105M235M601M524M698N373O487Q010R751J1362J2708J3752J4099J3411
59016F69116J2261J1519J0877R074N830K418m6j788l371m593n041m847m312l382
$$ plain form
59114 633387 644362 654907 665098 675189 685042 694068 701990 709116 715501 720433 723361 724836 725892
59101 725892 726902 727608 727911 727931 727546 726518 724944 723109 721060 718732 716250 713727 711088 708435 706198
59086 706198 704536 703032 701407 699943 698601 696314 691980 685806 678912 671938 664806 657564 650482 643398
59072 643398 635832 627924 620613 614683 610061 606088 602103 597715 592947 588231 584078 580730 578093 575759
59058 575759 573038 569443 565362 561756 558919 556112 552807 549634 547476 546179 544868 543142 541242 539388
59044 539388 537678 536486 536251 536930 538157 539705 541393 542854 543966 545190 546941 548942 550808 552939 556105
59029 556105 560340 564941 569465 574163 579536 586023 594033 603784 615146 627854 641606 655705 669116
59016 669116 681377 692896 703773 712847 718677 721095 721049 719261 715890 711297 706256 701409 697097 693715
59002F93715k025n33R17K406L803M810N555O342O754O046M496L253K699K092J085
58987G41415L57L07L53M5k67l60n99r45o78M05J540K361L506N311P069Q265R486
58970G77571J1286J3228J4684J5677J6229J5972J4975J4042J3459J2527J0840
58959I30490Q936P074M599J275j968m482o845r575j2097j3925j5643j7609j8940
58946H51290j8873j8113j7595j6935j5317j3079j1124r583q082o586n039l024
58934G07940q41J81m43j188n10R27J419P11j36o72j255j870k183k442k996l297
58918F93345k614j437r27j300j799j932j729j107r2P93J291K118L871N832O992
58903G01305P695R011J0935J2559J3630J4588J5329J5340J4973J5208J6105J6737
$$ plain form
59002 693715 691690 691157 692074 694480 698283 703093 708648 714990 721744 727790 732286 735539 738238 740330 741415
58987 741415 741772 742079 742432 742477 742210 741850 741251 740306 739628 740033 741573 743934 747440 752751 759820 768085 777571
58970 777571 788857 802085 816769 832446 848675 864647 879622 893664 907123 919650 930490
58959 930490 939426 946500 951099 952374 950406 945924 939079 929504 917407 903482 887839 870230 851290
58946 851290 832417 814304 796709 779774 764457 751378 740254 730671 722589 716003 710964 707940
58934 707940 707099 707280 706837 705649 705139 706066 707485 708196 708060 707388 706133 704263 702080 699638 696642 693345
58918 693345 690731 689294 688367 687067 685268 683336 681607 680500 680408 681201 682492 684610 688481 694313 701305
58903 701305 709000 718011 728946 741505 755135 769723 785052 800392 815365 830573 846678 863415
58891H63415J6760J6933J7830J9052K0041K0826K1636K2295K2219K0768J7715
58880A079490J3718R980P046M269Q89k840o211r160j2100j4988j7276j8550j8673
58867A015594j7688j6060j4582j3594j2722j1758j1091j0873j0590r993r644r915
58855H67084j0329j0493j0672j0799j0098q567p553p814q197p552o663o804p477
58842G54066p438p047p684r244j0211r996r415q928q081o837n913n556n161m412
58828F48143l666l079k330j318l03O41J560K086J909J626K234L799N394O282O493
58813F69471O308N850N126M033K604J394R97R16r7k109l598l724l671m613n758
58798F73129n839n365n604o254o076n209m978n654o162n841m959l698k099q34
$$ plain form
58891 863415 880175 897108 914938 933990 954031 974857 996493 1018788 1041007 1061775 1079490
58880 1079490 1093208 1103188 1110234 1114503 1115392 1112552 1106341 1097181 1085081 1070093 1052817 1034267 1015594
58867 1015594 997906 981846 967264 953670 940948 929190 918099 907226 896636 886643 876999 867084
58855 867084 856755 846262 835590 824791 814693 806126 798573 790759 782562 775010 768347 761543 754066
58842 754066 746628 739581 731897 722653 712442 702446 693031 684103 676022 669185 663272 657716 652555 648143
58828 648143 644477 641398 639068 637750 637447 638088 639648 641734 643643 645269 647503 651302 656696 662978 669471
58813 669471 675779 681629 686755 690788 693392 694786 695783 696699 696602 694493 690895 687171 683500 678887 673129
58798 673129 667290 661925 656321 650067 643991 638782 633804 628150 621988 616147 611188 607490 605391 604557
58784F04557n26m73N49K373L764M453N347O734P656P273N733L649J665L56l45
58769F52765j373l293n333o577p341q266q818q202p028o439o149n068l372k217
58755E73289j733j032O4R22J549K449L306L424L208L621M381M490M199M662N835
58740F12634O637P050Q067R581J0319J0004R685R737R408Q557Q050Q014P502O230
58726G31475N071M474L895L014K059Q10j048k586k418r52l9k15j25R77K174K672
58710G49238K841K882K242R00l91j658l812o758r096j0220j1101j2475j3908j5109
58696F73575j6431j7496j7152j5485j4123j3784j3205j1378r221p949p317o463
58684E23571n350m345l463k764k563k627k216j346r26j241j482j127n14K93J843
$$ plain form
58784 604557 604031 603558 604107 606480 610244 614697 620044 626778 634434 641707 647440 651089 652754 653110 652765
58769 652765 651392 648099 642766 636189 628848 620582 611764 603562 596534 590095 583946 578878 575506 573289
58755 573289 571556 570524 570588 571510 573059 575508 578814 582238 585446 589067 593448 597938 602137 606799 612634
58740 612634 619271 626321 634388 643969 654288 664292 673977 683714 693122 701679 709729 717743 725245 731475
58726 731475 736546 741020 744915 747929 749988 750798 749750 747164 744746 743794 743755 743540 743415 744392 746566 749238
58710 749238 752079 754961 757203 758103 757712 756054 752242 745484 736388 726168 715067 702592 688684 673575
58696 673575 657144 639648 622496 607011 592888 579104 565899 554521 545300 537351 530034 523571
58684 523571 518221 513876 510413 507649 505086 502459 500243 498897 497971 496730 495248 494121 493607 493900 495743
58669D95743M124O304Q031R669J1040J1398J0856J0453J0492J0333R851R371Q044
58656F15709M441p88m902o452o782p428q068p976p599p473p136o265n496n169
58642E38616m684l836l411l641l556k675j766j287n58O73J501J545J732K465K732
58627E23850J941J021P25M59j54k46O13J330J103Q59J653L017M048M841N651O023
58611E56734N833N882O387O255M960L680L326K960J508k56r38o63n76j031j579
58596E92482j969k143j896j407j324j610j245L79K652M821O712Q075Q543Q710
58582F20780R795J1633J2576J1879J0598R603Q510P194O528O685O613O124O662
58569G35180Q899J1472J3200J4804J7191J9766K1676K3184K4620K5526K5839K6342
$$ plain form
58669 495743 499867 506171 514202 523871 534911 546309 557165 567618 578110 588443 598294 607665 615709
58656 615709 620150 619362 614460 608008 601226 593798 585730 577754 570155 562682 555546 549281 543785 538616
58642 538616 533932 530096 526685 523044 519488 516813 515047 513760 513202 513875 515376 516921 518653 521118 523850
58627 523850 525791 526812 527537 527996 527842 527596 528209 529539 530642 531501 533154 536171 540219 545060 550711 556734
58611 556734 562567 568449 574836 581091 586051 589731 593057 596017 597525 597269 596331 595668 595092 594061 592482
58596 592482 590513 588370 586474 585067 583743 582133 580888 581267 583919 588740 595452 603527 612070 620780
58582 620780 630575 642208 654784 666663 677261 686864 695374 702568 709096 715781 722394 728518 735180
58569 735180 744079 755551 768751 783555 800746 820512 842188 865372 889992 915518 941357 967699
58557I67699K6924K6164K3548K0301J7076J2938P739L259N84j576m515p471r477
58544A083193j1130j2978j4227j4696j5970j8812k1481k2525k3146k4720k6023
58533H77485k5305k3278k1649k0165j7539j4048j0950q418o119m648m463m471
58521G16432l564k385j941j768j208j006j914l035l357l434l875l842k857k301
58507F79945l102l733k741j424j590k308j616kN36j61o72o84r32j204p23R6L92
58490F60077O09J643L043L887M534N783P341Q784J0778J3652J6076J6975J7360
58477G70542J8410J9298J8807J7526J6341J4406J0741O321K398j634o450j0654
58465H76052j2719j3444j4064j3709j1313q226o161m201p26L234N581O612P948
$$ plain form
58557 967699 994623 1020787 1044335 1064636 1081712 1094650 1102389 1105648 1106232 1104656 1100141 1092670 1083193
58544 1083193 1072063 1059085 1044858 1030162 1014192 995380 973899 951374 928228 903508 877485
58533 877485 852180 828902 807253 787088 769549 755501 744551 736133 730014 725366 720903 716432
58521 716432 712868 710483 708542 706774 705566 704560 702646 699611 696254 692820 688945 685103 682246 679945
58507 679945 676843 673110 670369 668945 667355 665047 663431 663429 663965 663804 663132 662448 661516 660312 659589 659685 660077
58490 660077 660686 662329 665372 669259 673793 679576 686917 695701 706479 720131 736207 753182 770542
58477 770542 788952 808250 827057 844583 860924 875330 886071 892392 894790 893156 886706 876052
58465 876052 863333 849889 835825 822116 810803 802577 796416 792215 791489 794723 800304 806916 814864
58452H14864R289R288Q417P947P222M817J415j276l384n972q510r920j0799j1939
58438H11459j2086j0021p216n572m152j359J559K589K806M363O346O525N811O748
58424H07800Q775R243Q231Q036Q545P504M988L366K874J313j795m556o236p815
58410H50273r105q877p875q118r258r077p500o647o925o609n240m070l168j460
58396G56344M92J045O31J079K150K131J381J732K786K559J448J695L198L684K890
58381G85245K711L291K957J990K513M429N402N047N398O967Q067Q273Q908R932
58367H61130R916R207R599J0920J1460J1483J2602J4072J3739J2265J2238J3347
58355A001978J2769J0203Q116P024N000K015L23K49q4o88K79K440L494L607N045
$$ plain form
58452 814864 824153 833441 841858 849805 857027 861844 863259 861983 858599 852627 844117 834197 823398 811459
58438 811459 799373 789352 782136 776564 772412 771053 772612 775201 778007 782370 788716 795241 801052 807800
58424 807800 816575 825818 834049 842085 850630 858134 863122 866488 869362 870675 868880 864324 858088 850273
58410 850273 841168 832291 824416 816298 807040 797963 790463 783816 776891 770282 765042 760972 757804 756344
58396 756344 756836 757881 758512 759591 761741 763872 765253 766985 769771 772330 773778 775473 778671 782355 785245
58381 785245 787956 791247 794204 796194 798707 803136 808538 813585 818983 825950 834017 842290 851198 861130
58367 861130 871046 880253 889852 900772 912232 923715 936317 950389 964128 976393 988631 1001978
58355 1001978 1014747 1024950 1033066 1040090 1045090 1047105 1047428 1047677 1047593 1046905 1047184 1049624 1053118 1056725 1061770
58340A061770P446Q197P556Q516J1355J3193J3355J4197J6145J6791J5566J4636
58328A208723J4596J3807J2331J1846J1565R077N266L403L436K455O72J160L664
58315A302001M614L616L898N907O668O067P356J0613J2095J1146J1322J3606J4880
58302A413789J4297J4713J6518J6640J4961J5138J7647J8749J7721J8235K1079
58291A599487K2552K1706K2085K4488K5289K3818K3995K6671K7821K6573K7349
58280A871834L1560L4815L4984L5464L7777L8675L7347L7782M1022M2780M1646
58269B285686M1859M5077M7387M7388M9021N3370N6064N5942N7704O2789O6290
58258B868577O6245O7003P0090P1003O8515O7690P0078P0713O8539O9563P5733
$$ plain form
58340 1061770 1069216 1077413 1084969 1093485 1104840 1118033 1131388 1145585 1161730 1178521 1194087 1208723
58328 1208723 1223319 1237126 1249457 1261303 1272868 1281945 1287211 1290614 1294050 1296505 1297177 1298337 1302001
58315 1302001 1306615 1310231 1314129 1320036 1326704 1332771 1340127 1350740 1362835 1373981 1385303 1398909 1413789
58302 1413789 1428086 1442799 1459317 1475957 1490918 1506056 1523703 1542452 1560173 1578408 1599487
58291 1599487 1622039 1643745 1665830 1690318 1715607 1739425 1763420 1790091 1817912 1844485 1871834
58280 1871834 1903394 1938209 1973193 2008657 2046434 2085109 2122456 2160238 2201260 2244040 2285686
58269 2285686 2327545 2372622 2420009 2467397 2516418 2569788 2625852 2681794 2739498 2802287 2868577
58258 2868577 2934822 3001825 3071915 3142918 3211433 3279123 3349201 3419914 3488453 3558016 3633749
58247C633749Q1148Q3410Q7902R6511J03397J06624J12384J22755J31242J35655
58237D694777J42899J55526J66442J72897J82354J98065K12634K22815K36392
58228F384801K57075K77198K93187L13139L40893L68410L92578M23013M63886
58219I514180N05455N43614N89684O49925P14443P78394Q54265R50212J056984
58210A6157156J170432J305472J472800J664671J880447K142418K469344K860854
58202C1123594L328386L915175M665928N608268O788023Q287265J0174309J2464073
58194H6355021J5151260J8232187K1633503K5122836K8301819L0668274L1746557
58187B57211457L1338464K9716374K7339574K4104259J8970381J0751611m52955
$$ plain form
58247 3633749 3714897 3798307 3886209 3982720 4086117 4192741 4305125 4427880 4559122 4694777
58237 4694777 4837676 4993202 5159644 5332541 5514895 5712960 5925594 6148409 6384801
58228 6384801 6641876 6919074 7212261 7525400 7866293 8234703 8627281 9050294 9514180
58219 9514180 10019635 10563249 11152933 11802858 12517301 13295695 14149960 15100172 16157156
58210 16157156 17327588 18633060 20105860 21770531 23650978 25793396 28262740 31123594
58202 31123594 34451980 38367155 43033083 48641351 55429374 63716639 73890948 86355021
58194 86355021 101506281 119738468 141371971 166494807 194796626 225464900 257211457
58187 257211457 288549921 318266295 345605869 369710128 388680509 399432120 398979165
58180C98979165j2698471k3229332l0136541l3156355l3237928l1645384k9346832
58173B05528322k6829260k4195613k1422256j8591624j5900609j3497272j1399965
58166G3691723r580590q039904o771375n723267m842551m114593l529286l048303
58158B8041854k635833k288030k005540j766955j553396j371398j228004j107544
58150A4085154r94237q94796q18164p53566o87904o25838n74549n26422m74048
58141G735630m25840l90269l59890l26200k95399k74832k58094k38047k20932
58132D946127k13423k08486j97781j85927j79306j72511j59203j45242j37958
58123C346290j32689j22545j11707j06590j03075r4764q5353q0928p8089p1270
$$ plain form
58180 398979165 386280694 363051362 332914821 299758466 266520538 234875154 205528322
58173 205528322 178699062 154503449 133081193 114489569 98588960 85091688 73691723
58166 73691723 64111133 56071229 49299854 43576587 38734036 34619443 31090157 28041854
58158 28041854 25406021 23117991 21112451 19345496 17792100 16420702 15192698 14085154
58150 14085154 13090917 12196121 11377957 10624391 9936487 9310649 8736100 8209678 7735630
58141 7735630 7309790 6919521 6559631 6233431 5938032 5663200 5405106 5167059 4946127
58132 4946127 4732704 4524218 4326437 4140510 3961204 3788693 3629490 3484248 3346290
58123 3346290 3213601 3091056 2979349 2872759 2769684 2674920 2589567 2508639 2430550 2359280
58113B359280o4164o2550o2856n8852n3146n1507n2003m9787m6846m7254m8413
58102A761902m6203m3336m3803m4648m1855l8659l9304m0238l6338l0540k8499
58091A328479k8609k6085k2219k1000k0842j8104j4820j4883j6290j5009j2829
58080A117789j3784j6393j6842j6330j8050k0331j9968j8883k0472k2653k1499
58069I12584j8562j7698j7885j5974j3474j3640j4757j3158j0233r713j0547r176
58057G47767o540o298q175r221r597j1168j2444j0927q396q102q864p590n447
58044F34998n655p283p078n579n577o361n268l338l710n861o795o518p135q039
58030E50801p279o182p348r538r585q040p819q696q300p068p217p968o923m955
$$ plain form
58113 2359280 2295116 2232566 2169710 2110858 2057712 2006205 1954202 1904415 1857569 1810315 1761902
58102 1761902 1715699 1672363 1628560 1583912 1542057 1503398 1464094 1423856 1387518 1356978 1328479
58091 1328479 1299870 1273785 1251566 1230566 1209724 1191620 1176800 1161917 1145627 1130618 1117789
58080 1117789 1104005 1087612 1070770 1054440 1036390 1016059 996091 977208 956736 934083 912584
58069 912584 894022 876324 858439 842465 828991 815351 800594 787436 777203 767490 756943 747767
58057 747767 741227 734929 726754 717533 707936 696768 684324 673397 665001 656899 648035 640445 634998
58044 634998 629343 622060 614982 609403 603826 597465 592197 588859 585149 579288 572493 565975 558840 550801
58030 550801 543522 537340 529992 520454 510869 502829 495010 486314 478014 470946 463729 455761 448838 443883
58016D43883m748n637m819k631j814k496k559j955k039j935j38J520L02k274k556
58001D10104q21k31r01k21J671K032P52M44J439J433J17l46M90Q95N26N44N20
57984D18447q16k285j720j98o16k695l650l269l821n271n199l439k442k813k670
57969C77543j615j295j822j533n15n90j686j919j322j639k524j843J30P65m47
57954C59688j303j057j315k393k559j463q45j244j296o69m56l70J116L607N059
57939C54500N314O081P367P472O612O860Q271Q677P730P444Q216Q024O187M354
57925D53109L048Q45k218m060m255m886o639p529o602n557n449m971l435k397
57911C99004k802l255k643j961k110k246j657j227j754k661l338l985m512m431
$$ plain form
58016 443883 439135 433498 428679 426048 424234 421738 419179 417224 415185 413250 413112 414632 414934 412660 410104
58001 410104 409283 409052 408151 407930 409601 411633 412385 412829 414268 415701 415818 415472 415962 416857 417383 417927 418447
57984 418447 417631 415346 413626 413428 412812 410117 406467 403198 399377 394106 388907 385468 383026 380213 377543
57969 377543 375928 374633 372811 371278 370763 370173 368487 366568 365246 363607 361083 359240 359370 360135 359688
57954 359688 358385 357328 356013 353620 351061 349598 348753 347509 346213 345544 345088 344718 345834 349441 354500
57939 354500 359814 365895 373262 380734 387346 394206 402477 411154 418884 426328 434544 442568 448755 453109
57925 453109 456157 457002 454784 450724 446469 441583 434944 427415 420813 415256 409807 404836 401401 399004
57911 399004 396202 392947 390304 388343 386233 383987 382330 381103 379349 376688 373350 369365 364853 360422
57897C60422m170m589n013l947j840p23r94j094n18m42j023r36MM54K19N26J248
57880C37584P84o87r26O20J750J168L18L90L34p72j827j664p93j3P72J461J417
57863C39916J012J474K588K713J609R77J601K252K081J706J384N12m74k29Q43
57848C59965O95r28j945j617j833l645n363n558n245n566n736m945m103m113m271
57833C05792l833l317l063k316q92J11K70N94J469J873J514J574K343K438J390
57818C05947P34J331J884J421R36J171J015l64j831k320k639l743m930n302n272
57803B88038n328m890l747k903k867k638j559m45J01P26J728K251K112K398L279
57788B76256L339K177J506K383L497L547L159L152L002K524K817M003M222K597
$$ plain form
57897 360422 356252 351663 346650 342703 340863 340140 339146 338052 337534 337092 336069 335133 335137 335591 335810 336336 337584
57880 337584 338368 337681 336755 337375 339125 340293 340611 341001 341335 340563 338736 337072 336279 336266 337038 338499 339916
57863 339916 340928 342402 344990 347703 349312 350289 351890 354142 356223 357929 359313 359825 359351 359122 359965
57848 359965 360660 359732 357787 356170 354337 350692 345329 339771 334526 328960 323224 318279 314176 310063 305792
57833 305792 301959 298642 295579 293263 292371 292482 292752 293346 294815 296688 298202 299776 302119 304557 305947
57818 305947 306681 308012 309896 311317 312253 313424 314439 314075 312244 309924 307285 303542 298612 293310 288038
57803 288038 282710 277820 274073 271170 268303 265665 264106 263661 263762 264488 266216 268467 270579 272977 276256
57788 276256 279595 281772 283278 285661 289158 292705 295864 299016 302018 304542 307359 311362 315584 318181
57774C18181R94J038J490O02r29j549j638k460l762m490m694m892m736l995l588
57759B85572m002m061k883j602j467j712j056N1N24O82J421K476L165L723M396
57744B85227M428L468K602K602K551J686J044J497J800N41j368k163j871j589
57730C00455j316n54oo12j708j989j492j050p73n73j103k483l282k471j279j334
57714B78430k166k347j977k013k283k101j943k521l170k994k699l276l928l311
57700B41701j954j261j028r9J189J522J022Q70R91K51j303k425k700k720k483
57685B31573j455pR85J783L336N462P183Q640J0944J4375J8359K3060K9293L6893
57671C90424M4578N1296N6377N8773N7843N4623N0679M5550L6677K1899J333k2486
$$ plain form
57774 318181 319175 320213 321703 322305 321376 319827 318189 315729 311967 307477 302783 297891 293155 289160 285572
57759 285572 281570 277509 274626 273024 271557 269845 268789 268840 269364 270046 271467 273943 277108 280831 285227
57744 285227 289655 293123 295725 298327 300878 302564 303608 305105 306905 307446 306078 303915 302044 300455
57730 300455 299139 298585 298579 297967 296259 294270 292778 291728 290955 290382 289279 286796 283514 281043 279764 278430
57714 278430 276264 273917 271940 269927 267644 265543 263600 261079 257909 254915 252216 248940 245012 241701
57700 241701 239747 238486 237458 237359 238548 240070 241092 241962 242953 243204 241901 239476 236776 234056 231573
57685 231573 230118 230111 231096 232879 236215 241677 248860 257500 268444 282819 301178 324238 353531 390424
57671 390424 435002 486298 542675 601448 659291 713914 764593 810143 846820 868719 870052 847566
57659H47566m4978o0948o7758o7235o3248n7790n0710m2346l4291k7625k2206
57648C08431j7836j4529j1683q582n847m797n262n452m319k671j649j274r55m73
57634B23102k6J26k09r06j502j772k067k651l212l379l198k653j574m42l25j313
57618A97999k143k026j678j805j932j705j854k632k834j717m84k91l58K67O07
57603A77414n08j993k004q56k65n93r75j269j787j933j229q15j770k986k899k284
57587A53248k763l612k998j505j320k325k276p78K08p2j82L79J99j209k340k422
57571A30232k593l444l813l040k164j860j300j23N42R4l75m3L06l8l59Q8P53R24
57553A13787P98O71M05K67R05J847J697L81m73n3M76J26m29m95o73j338j424j11
$$ plain form
57659 847566 802588 741640 673882 606647 543399 485609 434899 392553 358262 330637 308431
57648 308431 290595 276066 264383 255801 249954 245157 239895 234443 230124 227453 225804 224530 223575 223102
57634 223102 223076 223202 222993 222087 220585 218813 216746 214095 210883 207504 204306 201653 200079 199637 199312 197999
57618 197999 195856 193830 192152 190347 188415 186710 184856 182224 179390 177673 177189 176898 176540 176807 177414
57603 177414 176906 174913 172909 172053 171788 171195 170220 168951 167164 165231 164002 163187 161417 158431 155532 153248
57587 153248 150485 146873 143875 142370 141050 138725 136449 135671 135879 135807 135625 136004 136203 134994 132654 130232
57571 130232 127639 124195 120382 117342 115178 113318 112018 111895 112437 112531 112156 112113 112419 112381 112022 112110 112863 113787
57553 113787 114585 115256 115661 115928 116833 118680 120377 120758 120285 120232 120708 120834 120405 119910 119237 117899 116475 116364
57535A16364J588K285K097J837J383K60j056j648j480j149q43l71K00N89O80M38
57519A21174l6k96P1P45J123J304J694J853J048j37k91N86R64J63p30q17o02o64
57501A27152o51l92n10j132j348q38o82j635k817l061k513j951j525j117j042
57486A05938j513k032k070j680j052k71K07j55r31j042m20j29n76r12p30q53j760
57469I0019k641k761k504k276j742r16o60j222j517q20L7J28j62j53j59o34j092
57452G0925r38m68n9N97J539J868J108K69L68Q83P91K76J55L41K01j37k4N07Q83
57433G9085R14P17R9j058k137k312j501k98P35J257J147P57O26O77L12m40q17
57416G7763o40o48j051r80m3P14L46n06o46QP35J210J443J239N87K6j47l47q16
$$ plain form
57535 116364 117952 120237 122334 124171 125554 125814 124758 123110 121630 120481 119638 119267 119467 120056 120736 121174
57519 121174 121138 120842 120913 121658 122781 124085 125779 127632 128680 128543 128252 128838 129802 129965 129235 128418 127816 127152
57501 127152 126501 126109 125599 124467 123119 122281 121599 119964 117147 114086 111573 109622 108097 106980 105938
57486 105938 104425 102393 100323 98643 97591 97320 97527 97372 96441 95399 94979 94850 94274 93362 92632 91779 90019
57469 90019 87378 84617 82113 79837 78095 77179 76519 75297 73780 72960 72997 73125 72963 72810 72651 72017 70925
57452 70925 69987 69519 69460 70057 71596 73464 74572 74841 75209 76092 76883 77159 77314 77655 77856 77719 77695 78202 79085
57433 79085 79999 80716 80815 79757 77620 75308 73807 73509 74244 75501 76648 77405 78031 78708 79020 78580 77763
57416 77763 77123 76475 75424 74444 74401 75115 75461 74955 74309 74317 75052 76262 77705 78944 79531 79557 79410 79063 78247
57397G8247j015o31k90n08p27l10L64O32O70R40J293J441J720K412K978K796K191
57380I2203J884J898J701J026Jj087j737j572j027r74j451j625j318j347j946
57365H4629k188j588r76j002j084p09n07j029j645j652j369j149n12O69J393J053
57349G2334N25N87N55k01p51j38Q00P98K45J86K75l86j212q88L14R08N07P0R8
57330G4626K36L72O74P29O0p47p86l47l87q12q09m14l04l26J49O53R4j289k027
57311F9345j552p63l76j98j04l86q20p00j08L9n11r05m81L87J039J315J313J099
57293F7633P41K21o11j473j515m40P09P57m7o11o47o73q38q66p57n22L17J759
57275F3137K506J490k90r65m27j24m96m64M53J323J426J210J111Q87N22N77J125
$$ plain form
57397 78247 77232 76601 76311 75803 75076 74766 75130 75762 76432 77372 78665 80106 81826 84238 87216 90012 92203
57380 92203 94087 95985 97686 98712 98713 97626 95889 94317 93290 92316 90865 89240 87922 86575 84629
57365 84629 82441 80853 79877 78875 77791 77082 76575 75546 73901 72249 70880 69731 69219 69888 71281 72334
57349 72334 72859 73446 74001 73800 73049 72911 73711 74509 74754 74940 75215 74829 73617 72729 73043 73951 74458 74528 74626
57330 74626 74862 75234 75908 76637 76697 75950 75164 74817 74430 73618 72809 72395 72091 71765 71914 72567 72661 71372 69345
57311 69345 67793 67030 66654 66456 66352 65966 65146 64446 64338 64377 63866 62961 62480 62867 63906 65221 66534 67633
57293 67633 68374 68595 67984 66511 64996 64556 65265 66022 65975 65364 64717 64044 63206 62340 61583 61061 61378 63137
57275 63137 65643 67133 66843 65878 65451 65327 64831 64367 64820 66143 67569 68779 69890 70777 71299 71876 73001
57258G3001J398R45K57j07j53L9N10J023J301J688K649L633L583K527J540J067
57242I4901N60j07k17M31J043J196J494K335L048K949K368K035K100K314K540
57227A18990K730K854L152L882M735N084M901M757M940N316N990P177Q403Q849
57213A91760Q652Q859R866J0904J1376J1730J2504J3481J4288J5175J6475J7832
57201C42902J8424J7828J6385J4975J4449J4965J5903J6707J7586J8907K0322
57190E29353K1102K1136K0856K0439J9870J9453J9500J9780K0026K0654K2071
57179G54240K3694K4734K5515K6863K8564K9730L0429L1540L3084L4154L4536
57168A077083L4957L5634L5985L5983L6367L7230L7736L7607L7539L7884L8253
$$ plain form
57258 73001 74399 75344 75601 75494 75341 75380 75890 76913 78214 79902 82551 86184 89767 92294 93834 94901
57242 94901 95461 95354 95137 95568 96611 97807 99301 101636 104684 107633 110001 112036 114136 116450 118990
57227 118990 121720 124574 127726 131608 136343 141427 146328 151085 156025 161341 167331 174508 182911 191760
57213 191760 200412 209271 219137 230041 241417 253147 265651 279132 293420 308595 325070 342902
57201 342902 361326 379154 395539 410514 424963 439928 455831 472538 490124 509031 529353
57190 529353 550455 571591 592447 612886 632756 652209 671709 691489 711515 732169 754240
57179 754240 777934 802668 828183 855046 883610 913340 943769 975309 1008393 1042547 1077083
57168 1077083 1112040 1147674 1183659 1219642 1256009 1293239 1330975 1368582 1406121 1444005 1482258
57157A482258L8748M0139M2318M3985M4519M4868M5887M7104M7930M8884N0598
57146A977238N2580N3842N4031N3176N1122M8137M5581M5091M7344N1856N7506
57135B537504O2990O7324P0152P1112O9154O3496N5293M7151M0784L6332L4108
57124C155400L5517M1461N1055O2528P4319Q4671R1676R4852R5956R7240R9598
57113C984273J03055J08007J14937J23672J33982J46430J61841J80536K02822
57104E259555K29772K62859L03473L53531M16025M94433N92334P14054Q64627
57095I490663J047809J264313J512207J787697K084240K391687K698007K992196
57087B5268819L265334L510319L723126L905452M065676M215758M361945M487017
$$ plain form
57157 1482258 1521006 1561145 1603463 1647448 1691967 1736835 1782722 1829826 1877756 1926640 1977238
57146 1977238 2029818 2083660 2137691 2190867 2241989 2290126 2335707 2380798 2428142 2479998 2537504
57135 2537504 2600494 2667818 2737970 2809082 2878236 2941732 2997025 3044176 3084960 3121292 3155400
57124 3155400 3190917 3232378 3283433 3345961 3420280 3504951 3596627 3691479 3787435 3884675 3984273
57113 3984273 4087328 4195335 4310272 4433944 4567926 4714356 4876197 5056733 5259555
57104 5259555 5489327 5752186 6055659 6409190 6825215 7319648 7911982 8626036 9490663
57095 9490663 10538472 11802785 13314992 15102689 17186929 19578616 22276623 25268819
57087 25268819 28534153 32044472 35767598 39673050 43738726 47954484 52316429 56803446
57079E6803446M529410M379457L914438L065824J874061M83398r24210k204356
57071G1921468l280653m125235m727780n085562n210993n135479m902397m558049
57063C4895320m146731l707147l268720k851093k467114k124639j825855j568073
57055A2935948j347236j160067j002854q70576p58601o64080n84720n17589m60096
57046E570129m10903l68937l32531l00370k72183k47575k25306k04495j85484
57037C022345j68601j52993j37715j22985j09384r6510q3410o9736n5628m1088
57027A984295k6334j2404o70Q163J4243J7886J8371J2937k127k7525n7944q4688
57015A844203j01926j09438j09616j04219r4772q3663p2886o2833n3484m5584
$$ plain form
57079 56803446 61332856 65712313 69626751 72692575 74566636 75050034 74125824 71921468
57071 71921468 68640815 64515580 59787800 54702238 49491245 44355766 39453369 34895320
57063 34895320 30748589 27041442 23772722 20921629 18454515 16329876 14504021 12935948
57055 12935948 11588712 10428645 9425791 8555215 7796614 7132534 6547814 6030225 5570129
57046 5570129 5159226 4790289 4457758 4157388 3885205 3637630 3412324 3207829 3022345
57037 3022345 2853744 2700751 2563036 2440051 2330667 2234157 2150747 2081011 2025383 1984295
57027 1984295 1957961 1945557 1944887 1953050 1967293 1985179 2003550 2016487 2014360 1986835 1928891 1844203
57015 1844203 1742277 1632839 1523223 1419004 1324232 1240569 1167683 1104850 1051366 1005782
57005A005782l9491l4185k8757k3864k0536j8523j7002j5874j5143j4084j2282
56994G66041j0586r805r361q317o852n521m039j994J04J620K738L527L111J063
56980G21729j521l630n989r616j3806j7121j9377k0891k0752j7883j3384r760
56968E67999p917o596m648k270P4K429M797O936Q844J0628J1975J2434J1950J0403
56954F27038P194K106l935r762j4938j9043k1097k0833j9596j8674j7462j4745
56942D76253j0886p243m104q36K488N298P951J1357J5351J8781K0896K1475K0234
56929E77015J7425J4202J0830N430l497j3939k1864k5631k6863k7296k6941k5506
56917D53365k3410k0914j7892j4853j2668j1086r113o944n889o137o296n479m275
$$ plain form
57005 1005782 966291 932106 903349 879485 858949 840426 823424 807550 792407 778323 766041
56994 766041 755455 745650 736289 727972 721120 715599 711560 709566 709670 711290 714028 717555 720666 721729
56980 721729 720208 716578 710589 700973 687167 670046 650669 629778 609026 591143 577759 567999
56968 567999 560082 553486 548838 546568 546642 549071 553868 560804 569648 580276 592251 604685 616635 627038
56954 627038 634232 636338 632403 622641 607703 588660 567563 546730 527134 508460 490998 476253
56942 476253 465367 458124 454020 453184 455672 460970 468921 480278 495629 514410 535306 556781 577015
56929 577015 594440 608642 619472 624902 621405 607466 585602 559971 533108 505812 478871 453365
56917 453365 429955 409041 391149 376296 363628 352542 343429 336485 330596 324459 318163 312684 308409
56904C08409l258k172r92l81m50m20J01O99J322K633M787P113R270J1590J4057
56889C52308J6033J7230J7795J7538J6229J4583J3362J1646P707J775l883p859
56877D74464j0723j2848j3248j1456q683o020k989J019N337R250J3381J8569K4359
56864D80412K9739L4510L8805M1994M3082M1850L8720L3875K6983J7503N115r326
56852H23262k3079l2783l6999l6850l4022k9225k2835j5704q390n28Q233J7427
56840F08507K6489L5494M4560N3174O0571O6090O8813O7740O2818N4852M3806
56829A192914K8200P157j7422m1347o0478p2392p6738p4832o8660n9808m9298
56818G07296l8125k7205j6801o718K962J2137K1361L1064M0114M6373M8889M8438
$$ plain form
56904 308409 305151 302979 301987 301606 301156 300736 300837 301536 302858 305491 310278 317391 326661 338251 352308
56889 352308 368341 385571 403366 420904 437133 451716 465078 476724 484431 486206 482323 474464
56877 474464 463741 450893 437645 426189 417506 411486 408497 409516 414853 424103 437484 456053 480412
56864 480412 510151 544661 583466 625460 668542 710392 749112 782987 809970 827473 832588 823262
56852 823262 800183 767400 730401 693551 659529 630304 607469 591765 583375 582847 591080 608507
56840 608507 634996 670490 715050 768224 828795 894885 963698 1031438 1094256 1149108 1192914
56829 1192914 1221114 1228271 1210849 1169502 1109024 1036632 959894 885062 816402 756594 707296
56818 707296 669171 641966 625165 618447 621409 633546 654907 685971 726085 772458 821347 869785
56806H69785M5720M0324L1613J9390L519j5399l4555m9731n8474o1490o0565n6606
56794F73531n0251m2706l4810k6521j8191j1120n768p32N333J1831J7293K1212
56782E39101K3661K4190K2505J9418J5648J0315K051q663j9471k8230l4188l7413
56770E28924l8130l6718l3709k9754k5691k2246j9370j6471j3564j1422j0317
56759B71532r458q200o861n856m964m044l562l657l618l032k491k466k390j713
56745B09220q79m04N2P55J001K22q86j406j541j819j866j164l15j94n00m02k4
56728A99850J8R6J015K334K711J850Q37M36L44K67N65J436K292K393J654O52J69
56711B18919O52J689K165J378j24j141j074k36P10J210J111Q43R82J323R76k73
$$ plain form
56806 869785 915505 955829 987442 1006832 1010351 994952 960397 910666 852192 790702 730137 673531
56794 673531 623280 580574 545764 519243 501052 489932 484164 483432 488765 500596 517889 539101
56782 539101 562762 586952 609457 628875 644523 654838 656889 648226 628755 600525 566337 528924
56770 528924 490794 454076 420367 390613 364922 342676 323306 306835 293271 281849 271532
56759 271532 262074 253874 247013 241157 236193 232149 228587 224930 221312 218280 215789 213323 210933 209220
56745 209220 208341 207937 207989 208744 209745 209967 209081 207675 206134 204315 202449 201285 200970 200776 200276 199874 199850
56728 199850 199868 199964 200979 203313 206024 207874 208711 209147 209491 209758 210323 211759 214051 216444 218098 218750 218919
56711 218919 219571 221260 223425 224803 224679 223538 222464 222228 222938 224148 225259 226102 227084 228407 229383 229110
56695B29110j367j358o46k25k67k71q8M6J04K00J68j18l24j22L07O78J029J247
56677B28103Q36k10r35o00J86L11l07q48q59n98l56p5L98J181K163K765K376J336
56659B34867P63J103J558J415J001P92N82K66M48J280J696Q61l70o41qN32P53
56642B46898J058J159L91p85j012R0J361J595P87k60q46p82m30m03r08j539j926
56625B44448k193k411k241j564r20p62q24p54p43r35r65o75n87r26r64k15N74
56608B27343M94q9k46N1K00J40K42M20L28P1q6k95o14n59P1N22J86l54k33K65
56588B27857K93k01o37p94p01p9J063J918J918J648J779J880J326O16N70R00Q27
56571B40183N55Q11J548K286L173M445N532N990O644Q396J0528J1694J2002J2496
$$ plain form
56695 229110 227743 226385 225739 225514 225247 224976 224888 224934 225038 225238 225406 225288 224964 224842 225149 225827 226856 228103
56677 228103 228939 228729 227794 227194 227380 227691 227384 226536 225677 225079 224723 224648 225046 226227 228390 231155 233531 234867
56659 234867 235630 236733 238291 239706 240707 241499 242081 242347 242795 244075 245771 246632 246262 245621 245613 246145 246898
56642 246898 247956 249115 249506 248721 247709 247799 249160 250755 251542 251282 250436 249654 249224 248821 247913 246374 244448
56625 244448 242255 239844 237603 236039 235119 234357 233533 232779 232036 231101 230136 229461 228874 227948 226984 226769 227343
56608 227343 227837 227748 227502 227553 227753 227893 228135 228555 228883 228954 228868 228573 227959 227400 227471 227993 228179 227825 227592 227857
56588 227857 228150 227949 227312 226518 225817 225738 226801 228719 230637 232285 234064 235944 237270 237886 238456 239356 240183
56571 240183 240738 241549 243097 245383 248556 253001 258533 264523 271167 279563 290091 301785 313787 326283
56557C26283J3143J2919J1604R793P547M607J738J53k24m89r42j102j205j943
56543C81882k844k662j495q79j612k896l875m555n035n125m975m902m582l610
56529C32835k710l063m421n296n031m357l895l479l063k969l094l022k980l503
56515B81952m262m359l715k946k159j184o73j358k426k326j105k75l67m24m0p4
56499B54259q99j615j552j148q81n43m0K58K84L14J89m17j009p79j0L40K76N23
56481B47550R15P04K52O78J787K199J611J048Q68M15j66J83J308J661P55k5K71
56464B62014R23J150J223J244O33n13j075o64j79r2J76O31K32j211k342k234j497
56447B58419p67K50J492J990J473R54J010R05K20k87k20l28r88j374r49l01J82
$$ plain form
56557 326283 339426 352345 363949 373742 381289 385896 387634 387787 387563 387074 386132 385030 383825 381882
56543 381882 379038 376376 374881 374002 372390 369494 365619 361064 356029 350904 345929 341027 336445 332835
56529 332835 330125 327062 322641 317345 312314 307957 304062 300583 297520 294551 291457 288435 285455 281952
56515 281952 277690 273331 269616 266670 264511 263327 262654 261296 258870 256544 255439 255164 254797 254373 254333 254259
56499 254259 253360 251745 250193 249045 248164 247621 247581 247839 248123 248437 248626 248209 247200 246421 246411 246751 247027 247550
56481 247550 248465 249169 249421 250099 251886 254085 255696 256744 257612 258027 257861 258044 259352 261013 261768 261743 262014
56464 262014 262937 264087 265310 266554 267187 266674 265599 264935 264756 264664 264840 265471 265703 264492 262150 259916 258419
56447 258419 257652 257902 259394 261384 262857 263811 264821 265726 265946 265659 265439 265111 264123 262749 261800 261499 261681
56430B61681Q89J635J460M53m3K67J02q22q96N47J687R80m61q97n62m96l36P37
56412B65925K109K574K204J758J235M22m3L83R29O21j37l06J38M97N77N98N15
56395B79999L07L04N17M02j25l91j51j0j69mN68O87J45n1N84J208J289J421J792
56376B88322J536N11j9N02Q94L99P2P99J678J728J537J768J764J026N18R62J387
56359C05384R17M19Q52J454J271R15J180J392Q83O18J464K335J859O86K23L54
56343C22206K93M89J648K953L213K859L038L645L910M007M367M423L628K717K405
56328C65801K055J210J052K530M366M813M139L492K690J167j37j01N67O61O35
56313C94940J309J738P63n02k62R10J196P92J340K856L845M044M455N075M996
$$ plain form
56430 261681 262570 264205 265665 266118 266075 266342 266444 265622 264726 265273 266960 267940 267479 266582 266020 265524 265188 265925
56412 265925 268034 270608 272812 274570 275805 276227 276184 276567 277496 278117 277980 277674 277812 278309 278886 279484 279999
56395 279999 280306 280610 281127 281529 281404 281013 280862 280852 280683 280679 281247 281934 282079 282028 282612 283820 285109 286530 288322
56376 288322 289858 290369 290350 290852 291746 292145 292217 293016 294694 296422 297959 299727 301491 302517 303035 303997 305384
56359 305384 306301 306720 307572 309026 310297 311212 312392 313784 314667 315285 316749 319084 320943 321629 321852 322206
56343 322206 322499 322988 324636 327589 330802 333661 336699 340344 344254 348261 352628 357051 360679 363396 365801
56328 365801 367856 369066 370118 372648 377014 381827 385966 389458 392148 393315 393178 393077 393644 394305 394940
56313 394940 396249 397987 398750 398248 397986 398896 400092 400884 402224 405080 408925 412969 417424 422499 427495
56298D27495M537M862N739N872N194M699M396L626L005L694N087N502M986N072
56284D93766N961O293N792N829P085Q705R971J1042J1865J2051J1962J2369J3149
56271F15840J3721J4474J6155J8346K0124K1762K4024K6511K8509L0847L4741
56260H65054L9508M3564M7263N2428N9423O7029P4945Q4022R4142J04187J14187
56249A645752J25225J37053J47942J57048J64975J71705J75907J76557J73605
56240C075769J66985J56469J42500J25609J05322Q1175N4407K7014n21k8661n6512
56229C849556q1965j03836j22190j36824j47306j54032j57640j57947j55061j50643
56219B482112j46109j40566j32668j23477j15156j07753r9859r1654q4528p8335
$$ plain form
56298 427495 432032 436894 442633 448505 453699 458398 462794 466420 469425 473119 478206 483708 488694 493766
56284 493766 499727 506020 511812 517641 524726 533431 543402 554444 566309 578360 590322 602691 615840
56271 615840 629561 644035 660190 678536 698660 720422 744446 770957 799466 830313 865054
56260 865054 904562 948126 995389 1047817 1107240 1174269 1249214 1333236 1427378 1531565 1645752
56249 1645752 1770977 1908030 2055972 2213020 2377995 2549700 2725607 2902164 3075769
56240 3075769 3242754 3399223 3541723 3667332 3772654 3853829 3908236 3935250 3934729 3906068 3849556
56229 3849556 3767591 3663755 3541565 3404741 3257435 3103403 2945763 2787816 2632755 2482112
56219 2482112 2336003 2195437 2062769 1939292 1824136 1716383 1616524 1524870 1440342 1362007
56209A362007p1758o4980n9300n4553m9524m4488m0660l7575l3744k9506k6453
56198H49466k4503k2270j9855j8363j7233j5058j2582j1660j1722j0595q496p589
56186F69540p804o855m619l568m347m595l076j530j330j507j121q47j105j129
56172F26107o76l39K26J911L878M283L408L278M216M750M837N901P548P789O784
56157F83901O936Q788J0351J0892J1911J3817J5222J6182J8559K2559K6440L0248
56145H75806L6038M3710N0569N5941O2246P0285P7364Q1462Q3539Q4434Q3087
56134A604481P9261P4377O8445N9826M9349M0820L5940L2408K8403K4899K1984
56123B120193J7051Q838l72q627j6812k5497l2986l8685m4916n3233o2052o9730
$$ plain form
56209 1362007 1290249 1225269 1165969 1111416 1061892 1017404 976744 939169 905425 875919 849466
56198 849466 824963 802693 782838 764475 747242 732184 719602 707942 696220 685625 677129 669540
56186 669540 661736 654881 650262 646694 642347 637752 634676 633146 631816 630309 629188 628341 627236 626107
56172 626107 625431 625092 625318 627229 631107 635390 638798 642076 646292 651042 655879 661780 669328 677117 683901
56157 683901 690837 699625 709976 720868 732779 746596 761818 778000 796559 819118 845558 875806
56145 875806 911844 955554 1006123 1062064 1124310 1194595 1271959 1353421 1436960 1521394 1604481
56134 1604481 1683742 1758119 1826564 1886390 1935739 1976559 2012499 2044907 2073310 2098209 2120193
56123 2120193 2137244 2146082 2145710 2137083 2120271 2094774 2061788 2023103 1978187 1924954 1862902 1793172
56111A793172p6599q2234q4246q1777p6923p1017o3024n3173m4268l7499l0781
56100A091631k3198j7163j4087j1798q572n789m411k758j44J224M88L18K371M414
56086A012526M578M537N826O824O249N913P226Q549Q578Q777R977J0413R486R530
56072A118989J1361J2323J1228J0849J2751J4306J3777J3686J5785J7428J6462
56061A268945J5311J6523J8470J9084J9570K0861K0754J8159J5975J6193J6601
56050A466446J5652J5805J8343J9977J8613J7496J9384K1671K1707K1879K4650
56039A681623K7550K7986K8181L0428L2244L1393L0865L3620L6992L7492L6645
56028B035019L7091L7543L6616L6777L9541M1688M1249M1795M5868M9880N0895
$$ plain form
56111 1793172 1716573 1634339 1550093 1468316 1391393 1320376 1257352 1204179 1159911 1122412 1091631
56100 1091631 1068433 1051270 1037183 1025385 1016813 1011024 1006613 1003855 1003711 1004935 1005423 1005741 1008112 1012526
56086 1012526 1017104 1021641 1027467 1034291 1040540 1046453 1053679 1062228 1070806 1079583 1089560 1099973 1109459 1118989
56072 1118989 1130350 1142673 1153901 1164750 1177501 1191807 1205584 1219270 1235055 1252483 1268945
56061 1268945 1284256 1300779 1319249 1338333 1357903 1378764 1399518 1417677 1433652 1449845 1466446
56050 1466446 1482098 1497903 1516246 1536223 1554836 1572332 1591716 1613387 1635094 1656973 1681623
56039 1681623 1709173 1737159 1765340 1795768 1828012 1859405 1890270 1923890 1960882 1998374 2035019
56028 2035019 2072110 2109653 2146269 2183046 2222587 2264275 2305524 2347319 2393187 2443067 2493962
56017B493962N2328N7219O2118O3796O5549P0454P4867P5537P6565Q2053Q8329
56006C262777R0957R2910R8091J03519J05923J09308J17619J26664J31870J37008
55996D376646J46494J56475J62763J70046J83360J98138K08899K19976K36989
55987F059786K55793K71037K87423L10808L36619L59305L84441M18724M57155
55978I141091M93556N34160N86610O45616P04676P71378Q55043R50482J051454
55969A5734066J168420J314438J486056J678809J908917K198114K551276K973862
55961C1013958L498100M167514N012826O072419P417318R118361J1200111J3656805
55953I1157412J6484219J9632671K2912442K5959498K8287080K9411637K9082012
$$ plain form
56017 2493962 2546290 2603509 2665627 2729423 2794972 2865426 2940293 3015830 3092395 3174448 3262777
56006 3262777 3353734 3446644 3544735 3648254 3754177 3863485 3981104 4107768 4239638 4376646
55996 4376646 4523140 4679615 4842378 5012424 5195784 5393922 5602821 5822797 6059786
55987 6059786 6315579 6586616 6874039 7184847 7521466 7880771 8265212 8683936 9141091
55978 9141091 9634647 10168807 10755417 11401033 12105709 12877087 13732130 14682612 15734066
55969 15734066 16902486 18216924 19702980 21381789 23290706 25488820 28040096 31013958
55961 31013958 34512058 38679572 43692398 49764817 57182135 66300496 77500607 91157412
55953 91157412 107641631 127274302 150186744 176146242 204433322 233844959 262926971
55946B62926971K7486107K5066299K1851552J6991602R336184j207447j2952591
55939C49498677k3273846l0232856l3434631l3606285l1738902k8662048k5040230
55932A43509879k1382721j7987987j4979362j2409458j0291482q575076p175759
55925E0708034o034938n117987m375769l754002l229385k798996k443988k135794
55917B0817175j866787j643192j456108j287409j135983j011578r09474q15459
55909A0691185p29358o60593o05875n52819n00932m58872m25200l90627l55617
55900F011292l27950l06217k82282k56991k37745k23500k07024j89064j76072
55891C804447j66802j54842j41597j33383j28303j19053j06455r7578r2632q5896
$$ plain form
55946 262926971 290413078 315479377 337330929 354322531 363658715 362451268 349498677
55939 349498677 326224831 295991975 262557344 228951059 197212157 168550109 143509879
55932 143509879 122127158 104139171 89159809 76750351 66458869 57883793 50708034
55925 50708034 44673096 39555109 35179340 31425338 28195953 25396957 22952969 20817175
55917 20817175 18950388 17307196 15851088 14563679 13427696 12416118 11506644 10691185
55909 10691185 9961827 9301234 8695359 8142540 7641608 7182736 6757536 6366909 6011292
55900 6011292 5683342 5377125 5094843 4837852 4600107 4376607 4169583 3980519 3804447
55891 3804447 3637645 3482803 3341206 3207823 3079520 2960467 2854012 2756434 2663802 2577906
55881B577906p7668p3263p1734o7387o1232n9706o2984o5119o4848o5943o7791
55870A840231o5868o1019n8591n8673n6361n1231m7621m6050m2990l8747l6976
55859A276104l6853l4087k9316k7301k8072k7031k3646k2042k2869k2472k0357
55848I82058j9894k1252k0929j8742j8307k0041k0432j8729j7855j8302j7460
55837G70115j5372j4839j5515j4180j1197j0448j2323j2911j0808q856q449p860
55825F27357o886p550r377r435p744p495r240j0146r508r743j1164j1016q587
55812E09466o425n631m625l136k754k977j504J110J818N79N82K577L933L887M617
55797E01517O244N938L193J068Q32P1k386m295m270l979m526m641m022m443o050
$$ plain form
55881 2577906 2500238 2426975 2355241 2287854 2226622 2166916 2103932 2038813 1973965 1908022 1840231
55870 1840231 1774363 1713344 1654753 1596080 1539719 1488488 1440867 1394817 1351827 1313080 1276104
55859 1276104 1239251 1205164 1175848 1148547 1120475 1093444 1069798 1047756 1024887 1002415 982058
55848 982058 962164 940912 919983 901241 882934 862893 842461 823732 805877 787575 770115
55837 770115 754743 739904 724389 710209 699012 688564 676241 663330 652522 643666 635217 627357
55825 627357 620471 612921 603544 594109 586365 578870 569630 559484 549976 540233 529069 518053 509466
55812 509466 503041 497410 492785 489649 486895 483918 482414 483524 485342 485921 486503 489080 493013 496900 501517
55797 501517 507761 513699 516892 517960 518792 518863 516477 512182 507912 503933 499407 494766 490744 486301 480251
55782D80251o462m958l881m542n399n603o484q065p798m549n22K264M213N751
55768D34216O028N349N486O171M555l68n870r398j1333j2589j2660j1534j0679
55755C87374j0597r996q544p766q203q481q153q525r665r611p708n753m730l501
55741B76141j798j336k502l113k010r02j061j194l69j03j574l285l578l165l296
55726B46855l587l453l679m694n251m480l490l374l372k464j151k50N31J569K459
55711B12169L164M457O275P272O846N910M953L254P57j291k428l681n355o235
55697B36067n891n649o290o777o318n630n160m090k169o02J7O51J762K303J852
55682A94076J761K893M137M354M119M335M702M655M253L344J425r23k164k074
$$ plain form
55782 480251 473789 468831 464950 460408 455009 449406 442922 434857 427059 422510 421988 424252 428465 434216
55768 434216 440244 445593 451079 457250 461805 461437 455567 446169 434836 422247 409587 398053 387374
55755 387374 376777 366781 358237 350471 342268 333787 325634 317109 307444 297833 290125 284372 279642 276141
55741 276141 274343 273007 270505 267392 265382 264480 263419 262225 261856 261753 260179 256894 253316 250151 246855
55726 246855 243268 239815 236136 231442 226191 221711 218221 214847 211475 209011 207860 207610 208141 209710 212169
55711 212169 215333 219790 226065 233337 240183 246093 251046 254300 255057 253766 251338 247657 242302 236067
55697 236067 230176 224527 218237 211460 205142 199512 194352 190262 188093 187491 187508 188159 189921 192224 194076
55682 194076 195837 198730 202867 207221 211340 215675 220377 225032 229285 232629 234054 233131 230967 228893
55668B28893k025k508k401j338n94p28n81M24J112P63L51N73O80L60N83J574J968
55651B27106J169M32M72K34q39j545j246j231k299l180k856k366k720l067k611
55636B05453k356l268m447m814m842n070m736l457k498k681k832j928r96j113
55622A60415j327n23L22k12j454j825j375j239j594j869k086k471k611k298k210
55607A37643k688k929k442j976j996j763r08l49m75k40P70J301O99K48P32Q27
55591A26454l57j282n52N39K76n21k49N15L13k90J92J303J502R99J230K212K783
55574A35067K914L520M442M702M374M317M458M132L629L639L669K722J048l25
55560A82308j257k163k753k730k959m211n460n275m194l827m205m006l018k356
$$ plain form
55668 228893 226868 224360 221959 220621 220027 219299 218718 219142 220254 221017 221368 221941 222621 222981 223564 225138 227106
55651 227106 228275 228707 229179 229413 228574 227029 225783 224552 222253 219073 216217 213851 211131 208064 205453
55636 205453 203097 199829 195382 190568 185726 180656 175920 172463 169965 167284 164452 162524 161528 160415
55622 160415 159088 158565 158887 158675 157221 155396 154021 152782 151188 149319 147233 144762 142151 139853 137643
55607 137643 134955 132026 129584 127608 125612 123849 122941 122592 122117 121877 122647 123948 124647 124895 125627 126454
55591 126454 126097 124815 124263 124802 125078 124557 124308 124823 125136 124846 125038 126341 127843 128842 130072 132284 135067
55574 135067 137981 141501 145943 150645 155019 159336 163794 167926 171555 175194 178863 181585 182633 182308
55560 182308 181051 178888 176135 173405 170446 166235 160775 155500 151306 147479 143274 139268 136250 133894
55546A33894k419k389j795j032l05O22J653K360K634K530J989J420J695K637K681
55531A46175J149m32o50m52j358k680k690j574j051j567k040j977j926k018j851
55516A25058j662j983k388k109j582j865k749l026k321j331n30M7J29l55o14p
55500A02712Q16Q96L50l15j247k323k345q13O72N71k18m5O39L79m00j90P30P93
55482A00662L0j65K39mp78o59L73Q21L76K73P40N90l64q22l88k03o81q12k95j85
55462I8748p75r51l28n5p05j268j042o76n79p8R91J585J236R19J238J328N19m31
55444I9676o85n93o67o12k32q7m09n09o5K12q6k83J07N07M32K99L75R9o65r58
55424I5856k00P35Q87O59Q68J297J218P02L82M16M80L80R7l67p00m46K69P12N65
$$ plain form
55546 133894 131475 129086 127291 126259 125954 126576 128229 130589 133223 135753 137742 139162 140857 143494 146175
55531 146175 147324 146892 146242 145790 144432 141752 139062 137488 136437 134870 132830 130853 128927 126909 125058
55516 125058 123396 121413 119025 116916 115334 113469 110720 107694 105373 104042 103512 103559 103688 103333 102719 102712
55500 102712 103528 104424 104774 104459 103212 100889 98544 97731 98403 98974 98756 98711 99350 99729 99329 99139 99869 100662
55482 100662 100692 100527 100766 100762 99984 99325 99698 100519 100895 101168 101908 102498 102134 101312 100924 100721 100040 99228 98933 98748
55462 98748 97973 97022 96694 96639 95934 94666 93624 92948 92369 92291 93282 94867 96103 97022 98260 99588 100107 99676
55444 99676 98991 98398 97731 97119 96887 96800 96391 95882 95817 96029 95943 95660 95767 96274 96706 97005 97380 97479 96814 95856
55424 95856 95656 96391 97278 97937 98805 100102 101320 102022 102404 102820 103300 103680 103777 103410 102710 102264 102533 103245 103810
55405A03810K56K7m95j398k050j995j547j082m59L46Q16N97O4k28j47J98O34P36
55387I8083J51o78q57k54L61N04N15P03Q78R37J063J112N88m54j358j860k277
55370I7157k488j825l31Q35Q02K6m98l87J50Q06J218J097O03K04K2j37k07qJ53
55351I7192j13l88J06J160J656J095J30n56q72q57m96j54k74n62m39j22k81p07
55333I5518o02j04j28o57o35J94Q12N90P9k22m81n95n3Q29R55K15j89K91P07L71
55313I6895k4K09N99N39L09K57J13j65m8M62N53R8R6Q90J412R66L94M69N78J11
55293A04713k39J70N41M0o13l93K25J95k39j57K59J13n41q86q11q50r91p59k33
55274I9544J39M57J051J529J225L52k39k36J3K89N07L23m05j041q43K5Q26J180
$$ plain form
55405 103810 104066 104093 103598 102200 100150 98155 96608 95526 95067 95413 96229 96826 96890 96662 96515 96713 97347 98083
55387 98083 98234 97556 96699 96445 96806 97310 97825 98528 99406 100343 101406 102518 103106 102652 101294 99434 97157
55370 97157 94669 92844 92513 93348 94150 94176 93678 93291 93441 94247 95465 96562 97165 97369 97391 97254 97047 97039 97192
55351 97192 97079 96691 96797 97957 99613 100708 100838 100282 99410 98553 98057 97903 97629 97067 96628 96506 96225 95518
55333 95518 94916 94812 94684 94027 93392 93586 94398 94988 95067 94845 94364 93769 93716 94545 95500 95715 95526 95817 96524 96895
55313 96895 96871 97080 97679 98218 98527 98784 98897 98732 98684 99146 99699 99797 99893 100783 102195 103161 103555 104024 104602 104713
55293 104713 104474 104644 105185 105225 104612 104219 104444 104639 104400 104243 104502 104615 104074 103188 102377 101527 100536 99777 99544
55274 99544 99683 100140 101191 102720 103945 104297 104058 103822 103835 104124 104631 104954 104549 103508 102665 102690 103516 104696
55256A04696R62r1j772k876k422j048j60l8J64P77J146Q00Q6n56j079j434j381
55239I5774q46p8O34J005P75R3l78k71j23n75j283j376p29n5K51N29J032J379
55221I5758J059J65o27o76N4R21J235J013Q45J008J126Q36L08j39m90p59p57m39
55203A00441j08K6J12K76L37K54L16O99J146J324J077L45o43j156o73J47J46o72
55185A03394j098n79Q2J79M8N6j64p33r33l97J32N2j10J62L49J0j45M93J088N69
55165A02455n50r51m85m6L3J09J32k03m91k1R46J414J117O57L56k2m31m65j01
55146A03453K29L51L79K49j13l22kN13O29M42M65P32R16R88J032P72Q5l80k6O38
55126A11030P06L03K62O33O81J29n34j039j554j928j648p11K76Q91J106Q71J83
$$ plain form
55256 104696 105658 105567 103795 100919 98497 97449 97289 97251 97415 98192 99338 100138 100224 99668 98589 97155 95774
55239 95774 94928 94850 95484 96489 97264 97357 96979 96708 96585 96010 94727 93351 92622 92567 92818 93347 94379 95758
55221 95758 96817 96982 96355 95679 95733 96654 97889 98902 99747 100755 101881 102717 103025 102886 102396 101637 100880 100441
55203 100441 100333 100359 100471 100747 101084 101338 101654 102353 103499 104823 105900 106245 105602 104446 103773 103920 104066 103394
55185 103394 102296 101717 101799 101978 102026 102082 101918 101185 100252 99855 99987 100039 99929 100091 100440 100450 100305 100798 101886 102455
55165 102455 101905 100954 100469 100423 100456 100565 100697 100494 100003 99982 100928 102342 103459 104116 104472 104450 104019 103554 103453
55146 103453 103682 104033 104412 104661 104548 104226 104224 104737 105366 105808 106273 107005 107921 108909 109941 110713 110798 110418 110392 111030
55126 111030 111736 112039 112301 112934 113615 113744 113210 112171 110617 108689 107041 106330 106606 107497 108603 109474 109657
55109A09657n06p10n86m92j96O23J415J344O70M35Q38J077Q20O27P47O11l2n23
55091A15819l10K38N25N35M72K33k28m71m8P99J346J192O47L27M18M35j28r37
55073A20864j077l62K96J17n06q11q39j025j186q05n4M83P81J182J412Q51k50
55056A19071q81o77l99p07j273j370p96N7O33O29K12j47l01n30q10n17O25J848
55038A14667K320K278K336K225J275k03j182j424j598j919j832j164n75n03n29
55023A14172j11O76J384J667J420Q66M86M66M01k5l52l0N45M78l79j348j839j649
55005A16828o95P09J625J474R46J022J526J609J269J110J032N10l3L46J363J673
54989A32314R42K49K31L05K9j69j56n34j303j390l30P69P46q0p08r17j063j114
$$ plain form
55109 109657 109151 108441 107855 107363 107167 107790 109205 110549 111219 111654 112492 113569 114389 115016 115763 116374 116342 115819
55091 115819 115509 115747 116272 116807 117279 117512 117284 116813 116765 117564 118910 120102 120749 121076 121494 121929 121801 120864
55073 120864 119787 119425 119721 119838 119332 118521 117682 116657 115471 114666 114612 115095 115876 117058 118470 119321 119071
55056 119071 118190 117513 117114 116407 115134 113764 112968 113025 113658 114287 114499 114352 114051 113521 112711 112194 112819 114667
55038 114667 116987 119265 121601 123826 125101 124898 123716 122292 120694 118775 116943 115779 115204 114701 114172
55023 114172 114061 114737 116121 117788 119208 120074 120560 121026 121427 121402 121050 121020 121565 122043 121664 120316 118477 116828
55005 116828 116133 116842 118467 119941 120887 121909 123435 125044 126313 127423 128455 128965 128932 129278 130641 132314
54989 132314 133256 133505 133736 134041 134070 133901 133745 133211 131908 130518 130188 130957 131703 131623 130915 129998 128935 127821
54971A27821q05k99k0r8l87p15q10m66M2J76r4k67k4N52J393K271K419J322j77
54952A31834o74r4L81K78K81N55K54p70j297o58J04q3p16p97l91lN52J414J736
54933A31906P98n78r89l32M24R08J543K383K982L288L679M110M215M148M480N176
54917A68141N608N630N826O402O537N342L023O89r07k063l526n333o621o690n930
54902A76128n348n333n419n136m490l589k497j569j220j229r08k27K1m71q89m57
54886A37367M39R56J052J400K336L472M219M337M130M265N118O221O748O564O216
54871A94840N818M799L012J349O33M82j86j890m206o238p158o768n767n082m783
54856A68855m183l106k303k333k768k930k783k610k471k353k334k257j778j057
$$ plain form
54971 127821 127016 126717 126697 126599 126212 125497 124687 124221 124263 124439 124345 124078 124054 124606 125999 128270 130689 132011 131834
54952 131834 131160 131066 131447 131725 132006 132561 132815 132045 130748 130090 130194 130111 129395 128598 128207 128204 128756 130170 131906
54933 131906 132704 132126 131137 130805 131229 132137 133680 136063 139045 142333 146012 150122 154337 158485 162965 168141
54917 168141 173749 179379 185205 191607 198144 203486 206509 207198 206291 204228 200702 195369 188748 182058 176128
54902 176128 170780 165447 160028 154892 150402 146813 144316 142747 141527 140298 139390 139163 139184 138713 137824 137367
54886 137367 137806 138762 139814 141214 143550 147022 151241 155578 159708 163973 169091 175312 182060 188624 194840
54871 194840 200658 205457 208469 209818 210451 210933 210747 208857 204651 198413 191255 184487 178720 173638 168855
54856 168855 164672 161566 159263 156930 154162 151232 148449 145839 143368 141015 138681 136424 134646 133589
54842A33589p22q88r41n60j71m3J43M23K06n73r83n04j1m19j169j074j00P10P04
54823A27617J31n02q96r47q46r29j016m41R03K136K447J932R77l52j719k232j516
54806A24747l29N99J487K455K660J540J31k25J96K01k75k50N12J232J492J603
54790A37776J633J279O83L08K1o05j173q03L50J125J041Q21R47R30M44J74Q33
54773A45784K042K911L178L226L332L455L643M211N430P066Q331Q471P578O544
54759B15202N938N258L669J153j510l665n121n850n978n931o079o292o269o055
54745A78470n779n160l872k237j000n72r13j845k909l220k273p10L61O75Q24J174
54729A51014J542J838K200K531K616K746L502M810N814N915N383M783M295L715
$$ plain form
54842 133589 132867 131979 131038 130478 130307 130264 130407 130830 131036 130463 129480 128976 128965 128546 127377 126303 126203 126913 127617
54823 127617 127748 127246 126350 125403 124557 123628 122612 122171 123074 125210 127657 129589 130566 130214 128495 126263 124747
54806 124747 124418 125017 126504 128959 131619 133159 133290 133065 133261 133462 133187 132937 133449 134681 136173 137776
54790 137776 139409 140688 141371 141679 141700 141095 139922 139119 139469 140594 141635 142456 143403 144333 144777 144951 145784
54773 145784 147826 150737 153915 157141 160473 163928 167571 171782 177212 184278 192609 201080 208658 215202
54759 215202 221140 226398 230067 231220 229710 226045 220924 215074 209096 203165 197086 190794 184525 178470
54745 178470 172691 167531 163659 161422 160422 159850 158937 157092 154183 150963 148690 147980 148341 149016 149840 151014
54729 151014 152556 154394 156594 159125 161741 164487 167989 172799 178613 184528 189911 194694 198989 202704
54715B02704K895J975J258P73m3j745l895n284n519n625o454p235o685m908l180
54700A59032k201j725j613j964k272j681l62M54J36n56p01l61j36k60n61q16q40
54683A43573o56o85j273j973j944j114l07j10k62l22k36k6L76O82K70r13j979
54666A33101k091j400o51k33l5L7j01m22o42n11j27J29P2JL23R63J453J644J789
54647A33299J836J295J76o86p09l97m55p09o37l73l56l95l5N34Q50J076J525J746
54629A37585J101J04j21M19N90p2p38o72j53K36K90j01r56j698j499m03O51J134
54611A35697J345J443J064K07m63n80m75l35J77J004J307N22q17j754j834j156
54595A35352j59L71p4q55o79O76J945K063J386Q41O37M36J14k43n71o71l46K1
$$ plain form
54715 202704 205599 207574 208832 209605 209562 207817 203922 198638 193119 187494 181040 173805 167120 162212 159032
54700 159032 156831 155106 153493 151529 149257 147576 147214 147668 147804 147248 146547 146186 146050 145790 145229 144413 143573
54683 143573 142917 142232 140959 138986 137042 135928 135621 135511 135249 134927 134691 134665 135041 135723 135993 135080 133101
54666 133101 131010 129610 128959 128726 128691 128728 128627 128205 127563 127052 126925 127054 127126 127127 127450 128413 129866 131510 133299
54647 133299 135135 136430 136606 135920 135211 134814 134359 133650 133013 132640 132284 131889 131854 132388 133238 134314 135839 137585
54629 137585 138686 138790 138669 139088 139678 139606 138868 138196 138043 138279 138569 138468 137512 135814 134315 133912 134563 135697
54611 135697 137042 138485 139549 139756 139293 138713 138238 137903 138080 139084 140391 140913 140096 138342 136508 135352
54595 135352 135193 135564 135490 134635 133956 134632 136577 138640 140026 140867 141504 141940 142054 141811 141240 140569 140223 140244
54577A40244k82j165j595j012q6L38L05K27R2k16m42m21m10n04l22K08M97K51
54559A35707O4M79J130J503J760K073J943J101L91O46J139M29j455k814k384o71
54543A41041R18J563J359Q44N62P45J170J434J394J197R85P66N25K92R9PK4Nj66
54524A54764l27k91k65o00j163j448j360j262j274j172j085j354j614r65M47J195
54508A42226N22m24k83N51P44J36k50PK75J32p2j02k49o00p27m71l17n61p37k80
54488A39520N70J021O92lm07k32K87P68J021J119J163J145R73O03J53k9L83J196
54470A49943J702J482J034J093J541J646J211P07L08l32j098j184l06O70Q47L82
54454A59646r5m31p26p52l78m8j42l18j67n7m99j134j191p01l46l26k30L5P6j56
$$ plain form
54577 140244 139962 138797 137202 136190 136104 136442 136747 136974 137066 136850 136408 135987 135577 135073 134751 134959 135456 135707
54559 135707 135771 136250 137380 138883 140643 142716 144659 145760 146151 146797 147936 148365 146910 144096 141712 141041
54543 141041 141959 143522 144881 145725 146287 147032 148202 149636 151030 152227 153212 153978 154503 154795 154894 154901 154925 154930 154764
54524 154764 154437 154146 153881 153281 152118 150670 149310 148048 146774 145602 144517 143163 141549 140584 141031 142226
54508 142226 142748 142324 142041 142592 143336 143472 143222 143229 143504 143636 143564 143462 143213 142613 141886 141415 141098 140537 139800 139520
54488 139520 140090 141111 141803 141800 141393 141161 141448 142216 143237 144356 145519 146664 147637 148240 148393 148364 148747 149943
54470 149943 151645 153127 154161 155254 156795 158441 159652 160359 160667 160335 159237 158053 157747 158417 159264 159646
54454 159646 159551 159120 158394 157642 157264 157216 157074 156756 156589 156532 156033 154899 153708 153007 152661 152335 152105 152140 152216 152060
54434A52060k05L9N3m99j187j365q87p1O81J037Q51L64P1K80Q51J415J691J653
54416A56832J487J368J216P54m0p68j060j017r71j006r35o27j85J22P5k15k43
54399A54787L86J333J843J747J614J759J794J474J258J475J499O32o26j061m02
54384A69512L43L35q6j32K23K77l26j017r82k13N04O60O31Q50R35L00o00o63K48
54365A70799J108J356J647K443K965K408J397J204K033L041L710M183M451M181
54351B06926L395K585K092J807J508R51j21j600k761k995k630k518k934l407l579
54336A96719l560l509l420l354l403l368k845j738m59M05M87j10p56p79j88L18
54320A70440K73k8j74k76n63p83n71n3L86N98N52J07n73q94o65n73j230k182k524
$$ plain form
54434 152060 151855 151894 151947 151448 150261 148896 148009 147938 148619 149656 150507 150871 150942 151222 152073 153488 155179 156832
54416 156832 158319 159687 160903 161657 161617 160849 159789 158772 157801 156795 155860 155233 155048 155170 155245 155030 154787
54399 154787 155173 156506 158349 160096 161710 163469 165263 166737 167995 169470 170969 171601 170975 169914 169512
54384 169512 169855 170190 170104 169972 170195 170472 170146 169129 168147 167934 168438 169098 169729 170579 171514 171814 171214 170551 170799
54365 170799 171907 173263 174910 177353 180318 182726 184123 185327 187360 190401 194111 198294 202745 206926
54351 206926 210321 212906 214998 216805 218313 219264 219143 217543 214782 211787 209157 206639 203705 200298 196719
54336 196719 193159 189650 186230 182876 179473 176105 173260 171522 171063 171468 171955 171845 171089 170310 170122 170440
54320 170440 170713 170685 170511 170235 169672 168889 168318 168265 168651 169249 169801 169908 169335 168441 167776 167203 165973 163791 161267
54301A61267k101j394o46J31O23N84M19O28R16O77R5j34O8J68R9L65J025J442
54283A64232J213O97M59O84J187J541J268M08l68n84o15q77r26j31J085J670J362
54266A72305P96L70J4j03L27R46J064P99Q71J282J272P47N53J030J379R37J67
54249A84756j68r4j42n24j034j347j219p80p07j491k506k483j089O62J664J723
54233A75221J177L33m42p20m88j20J91M86N31K3o84q47l78J26M31Q43J255J031
54215A77969J70m40l45k06o15j222j460j414j316r70l13Q8j88o73o33o2M48M89
54197A69307Q0m99q02o03k88m63r71r78j89P27J136J137J008P57N36O68Q38K00
54179A71601j242k232j841o33L96J176K048K665K364J273J44n72q63p26k64P1
$$ plain form
54301 161267 159166 157772 157126 157257 157880 158464 158883 159511 160427 161104 161199 161065 161133 161301 161400 161765 162790 164232
54283 164232 165445 166142 166601 167285 168472 170013 171281 171689 171321 170737 170122 169245 168319 168188 169273 170943 172305
54266 172305 173101 173471 173485 173382 173709 174655 175719 176518 177389 178671 179943 180690 181243 182273 183652 184589 184756
54249 184756 184588 184494 184352 183828 182794 181447 180228 179448 178741 177250 174744 172261 171172 171834 173498 175221
54233 175221 176398 176731 176289 175569 175081 174961 175152 175638 176169 176192 175508 174661 174283 174409 174840 175683 176938 177969
54215 177969 178139 177699 177354 177148 176533 175311 173851 172437 171121 170151 169838 169926 169738 169065 168432 168370 168818 169307
54197 169307 169387 168888 168086 167483 167195 166732 165761 164783 164594 165321 166457 167594 168602 169359 169895 170563 171401 171601
54179 171601 170359 168127 166286 165653 166049 167225 169273 171938 174302 175575 175719 175147 174284 173558 173294 173365
54163A73365n8m45p88j103j318j005n2R03J263J138Q20K13n88q99l91J94M2n53
54145A70738q23p43p23o08r7L54Q9m82l48N42J246J295J123R88O10Q2R7P93J234
54126A75367O38m66q60q8J145J817J475M93l18m13L6M33M38K09K4j01l29o38o53
54107A78209L9J214J875J259p5o57J68J526K221K003J310M51l60o80l06K80M88
54090A88965L14L7l49p47n69M41J429J360N20J48P08J450J718J737J938K342K907
54073B04349L753M732N247M968M301L926M069M387M295L364J688j32j592k786
54059B44569l983m940n129m564l822l263k746k155j680j343q45nR26J624K082
54044B14726K430K715K987L367L849M180M100L691L413L776M817N958O566O707
$$ plain form
54163 173365 173307 172862 172074 170971 169653 168648 168596 169499 170762 171900 172720 172933 172345 171446 171055 171249 171291 170738
54145 170738 169915 169172 168449 167841 167744 168098 168187 167705 167357 167899 169145 170440 171563 172551 173161 173243 173340 174133 175367
54126 175367 176005 175539 174679 174591 175736 177553 179028 179521 179203 178790 178826 179259 179697 179906 179930 179829 179500 178862 178209
54107 178209 178248 179462 181337 182596 182521 181864 182032 183558 185779 187782 189092 189543 189183 188503 188197 188477 188965
54090 188965 189279 189316 188967 188220 187651 188092 189521 190881 191401 191549 192257 193707 195425 197162 199100 201442 204349
54073 204349 208102 212834 218081 223049 227350 231276 235345 239732 244027 247391 249079 248947 247355 244569
54059 244569 240586 235646 230517 225953 222131 218868 216122 213967 212287 210944 210099 210094 211020 212644 214726
54044 214726 217156 219871 222858 226225 230074 234254 238354 242045 245458 249234 254051 260009 266575 273282
54030B73282O913P212O975O007N027M570M097K991J861J732K276K040N31j027
54016C24487j337n71J24o1j149k600l642l844l698m139n217n878n389m335l730
54001B79021l703l659l319k819k095r27L88J099R54N72N90Q10O06n7n08m41n77
53984B65935j777l628m601l864k400j846k525l311l210k364j461q80p33j080j589
53969B30666j489m52O53N48q15j966j546P5J267J047J34j26N89J426J738J864
53953B33613K389L145L448L061K382J907J853K291L074L678L571K918K535K981
53939B72846L960M742M936M701M392M231M186M101L891L658L615L981N008O862
53925C35110R277J1456J2653J2850J2629J2480J2450J2330J1839J0598Q384N510
$$ plain form
54030 273282 280195 287407 294382 300389 305416 309986 314083 317074 318935 320667 322943 324983 325514 324487
54016 324487 323150 322579 322703 322642 321493 318893 315251 311407 307709 303570 298353 292475 287086 282751 279021
54001 279021 275318 271659 268340 265521 263426 262499 262887 263986 264940 265512 266102 266912 267518 267461 266953 266512 265935
53984 265935 264158 260530 255929 252065 249665 247819 245294 241983 238773 236409 234948 234068 233335 232255 230666
53969 230666 229177 228725 229378 229926 229111 227145 225599 225674 226941 227988 228122 227996 228585 230011 231749 233613
53953 233613 236002 239147 242595 245656 248038 249945 251798 254089 257163 260841 264412 267330 269865 272846
53939 272846 276806 281548 286484 291185 295577 299808 303994 308095 311986 315644 319259 323240 328248 335110
53925 335110 344387 355843 368496 381346 393975 406455 418905 431235 443074 453672 462056 467566
53913D67566K697M27j316k570l082k714j947j523j563j515j061p83j437k805l807
53898D44567l946l909m355m739m169l097l082m704o744p804p908p915q107q159
53884C65929p970p723p353o642n754n096m783m696m852n211n361m923m160l717
53870B87688l901m525n191n320m336k460r02o44j316j897k183k600k995k757k045
53855B44616j766k178k517k312k032k040j848j009K0N43N77N82O37M75K3n68j184
53838B30019j688j861j669j275o64L31J376J584N88p33j138l97O84J388J671J722
53822B29938J509R60K87j45k21k00l40m60o0R72K042K433K104J611J462J875K942
53805B46709M433N556N591M881M604N301O215O388N879N418N294N089M411L421
$$ plain form
53913 467566 470263 470690 469374 466804 463722 461008 459061 457538 455975 454460 453399 452616 451179 448374 444567
53898 444567 440621 436712 432357 427618 423449 420352 417270 412566 405822 398018 390110 382195 374088 365929
53884 365929 357959 350236 342883 336241 330487 325391 320608 315912 311060 305849 300488 295565 291405 287688
53870 287688 283787 279262 274071 268751 264415 261955 261053 260409 259093 257196 255013 252413 249418 246661 244616
53855 244616 242850 240672 238155 235843 233811 231771 229923 228914 228934 229477 230054 230636 231273 231748 231771 231203 230019
53838 230019 228331 226470 224801 223526 222862 223193 224569 226153 226741 226008 224870 224473 225157 226545 228216 229938
53822 229938 231447 232407 232694 232549 232328 232128 231788 231328 231268 232240 234282 236715 238819 240430 241892 243767 246709
53805 246709 251142 256698 262289 267170 271774 277075 283290 289678 295557 300975 306269 311358 315769 319190
53791C19190K606K273K273K193J825J380J062O80l9q32j199j253j671k633l432
53776C22423l527l383l767m565m935m490l774l485l641l775l674l660m012m374
53762B67361m090l109k203k027k319k424k312k485l075l598l658l298k664j867
53748B28232j222j029j030o88j07P0k41k91K93Q63Q00M83N19O25J03q13j078k47
53730B25242R07J418J176P57N67N28M18K93M36R70J619J905J631J077P10P38R12
53713B41304P94L17Q5P47K039K843K570J958K036K697L013K706K393K489K678
53698B70669K630K464K356K308K468L025L619L532K630J524O76N1k89j68on79
53682B96910j705k183j522o82n04m81J05P25M47n22j205j298j187r47l70K17K40
$$ plain form
53791 319190 321796 324069 326342 328535 330360 331740 332802 333482 333443 332611 331412 330159 328488 325855 322423
53776 322423 318896 315513 311746 307181 302246 297756 293982 290497 286856 283081 279407 275747 271735 267361
53762 267361 263271 260162 257959 255932 253613 251189 248877 246392 243317 239719 236061 232763 230099 228232
53748 228232 227010 225981 224951 224263 224156 224226 223985 223694 223987 224850 225650 226133 226652 227277 227380 226567 225489 225242
53730 225242 226149 227567 228743 229500 230067 230595 231013 231306 231742 232712 234331 236236 237867 238944 239654 240392 241304
53713 241304 242098 242415 242500 243247 245286 248129 250699 252657 254693 257390 260403 263109 265502 267991 270669
53698 270669 273299 275763 278119 280427 282895 285920 289539 293071 295701 297225 297901 297952 297663 297495 297489 296910
53682 296910 295205 293022 291500 290818 290314 289833 289938 290663 291110 290588 289383 288085 286898 285951 285581 285798 286038
53665B86038j89m29l65l57l74k1N97Q70O19K81P9j82n24o58n49m12j46N13J223
53646B86014J254O28K48N93J047Q94L59J02K56N04P44J099J467J598J511J414
53630B99732J346J214J116J264J537J529J174R73J323J896K101K067K544L676
53616C23492M506M231L423L267L875M287M071L854M057M197L977M067M984N985
53602C82273N977N028M051L400K802K268K036J762Q67l40r39r18j304k452l253
53587D01258k679j301n08q16j645k370k815k834k238j298p43r81j576j769j391
53572C76294r49q60r08o67j75J58K36M06Q33J214J319J315J303R59J74m38k34
53555C79980N22J054J230J544K062K173J604R77R74J448J754J620J278R90Q34
$$ plain form
53665 286038 285849 285420 285055 284698 284324 284303 284900 285770 286389 286670 286749 286567 286043 285385 284836 284424 284278 284791 286014
53646 286014 287268 287896 288144 288737 289784 290678 291037 291139 291395 291899 292643 293742 295209 296807 298318 299732
53630 299732 301078 302292 303408 304672 306209 307738 308912 309885 311208 313104 315205 317272 319816 323492
53616 323492 327998 332229 335652 338919 342794 347081 351152 355006 359063 363260 367237 371304 376288 382273
53602 382273 388250 393278 397329 400729 403531 405799 407835 409597 410464 410124 409185 408267 406963 404511 401258
53587 401258 398579 397278 396770 395954 394309 391939 389124 386290 384052 382754 382011 381030 379454 377685 376294
53572 376294 375345 374485 373577 372910 372735 372893 373129 373535 374368 375582 376901 378216 379519 380478 380652 380214 379980
53555 379980 380502 381556 382786 384330 386392 388565 390169 391146 392120 393568 395322 396942 398220 399210 400044
53540D00044R73J734L227M965O049N950N030M226M196M947O156P441Q282Q295
53526D71515P886Q104R415J0992J1797J1916J2177J2787J3215J3326J3727J4750
53514F11607J5853J6386J6491J6873J7999J9736K1526K2763K3221K3232K3308
53503H28995K3516K3491K2949K1957K0730J9592J8983J9068J9285J8818J7621
53492A055005J6599J6534J7192J7719J7605J7017J6436J6191J6241J6260J5987
53481A238786J5562J5378J5568J5774J5494J4542J3113J1497R733P639N290L226
53469A381602J842O08j541m808q045j0050j0843j1214j1544j1740j1953j2506
53457A289808j3300j3960j4515j5296j6237j6886j7087j7059j6949j6818j6931
$$ plain form
53540 400044 401017 402751 405978 410943 416992 422942 427972 432198 436394 441341 447497 454938 463220 471515
53526 471515 479401 487505 496920 507912 519709 531625 543802 556589 569804 583130 596857 611607
53514 611607 627460 643846 660337 677210 695209 714945 736471 759234 782455 805687 828995
53503 828995 852511 876002 898951 920908 941638 961230 980213 999281 1018566 1037384 1055005
53492 1055005 1071604 1088138 1105330 1123049 1140654 1157671 1174107 1190298 1206539 1222799 1238786
53481 1238786 1254348 1269726 1285294 1301068 1316562 1331104 1344217 1355714 1365447 1373086 1378376 1381602
53469 1381602 1383444 1384052 1382511 1377703 1369658 1359608 1348765 1337551 1326007 1314267 1302314 1289808
53457 1289808 1276508 1262548 1248033 1232737 1216500 1199614 1182527 1165468 1148519 1131701 1114770
53446A114770j7297j7156j5738j3532j1891j1355j1160j0471r170p354n072k941
53434I81633j972k207k378j536k48M58O48J173K338L741N077O323P356Q120R058
53419A017584J0703J2802J4494J5421J6209J7586J9436K0995K1888K2669K4192
53408A213979K6540K8829L0279L1116L2112L3473L4829L6139L7889M0176M2343
53397A587704M3881M5078M6378M7544M8069M8038M8053M8408M8807M8823M8333
53386B109116M7530M6693M5913M4960M3501M1519L9181L6411L3017K9348K6180
53375B543369K3660K0829J6652J1253N610M04m429r125j3700j8150k2646k7289
53363B526438l1871l5966l9261m1727m3447m4334m4249m3446m2606m2087m1478
$$ plain form
53446 1114770 1097473 1080317 1064579 1051047 1039156 1027801 1016641 1006170 997000 989646 984574 981633
53434 981633 979661 977454 975076 973540 973292 973750 974398 975571 977909 981650 986727 993050 1000406 1008526 1017584
53419 1017584 1028287 1041089 1055583 1071004 1087213 1104799 1124235 1145230 1167118 1189787 1213979
53408 1213979 1240519 1269348 1299627 1330743 1362855 1396328 1431157 1467296 1505185 1545361 1587704
53397 1587704 1631585 1676663 1723041 1770585 1818654 1866692 1914745 1963153 2011960 2060783 2109116
53386 2109116 2156646 2203339 2249252 2294212 2337713 2379232 2418413 2454824 2487841 2517189 2543369
53375 2543369 2567029 2587858 2604510 2615763 2621373 2621777 2617348 2608223 2594523 2576373 2553727 2526438
53363 2526438 2494567 2458601 2419340 2377613 2334166 2289832 2245583 2202137 2159531 2117444 2075966
53352B075966m0196l8339l6458l4812l3452l2736l2966l3627l3908l3975l4661
53341A690836l5765l5799l3915l1041k8481k6360k4209k2208k0875k0040j9096
53330A393047j7898j6632j5256j3863j3244j4085j5849j7270j7777j7723j7388
53319A216062j6702j5760j4811j3701j2108j0282q764p434n700l713k369j885
53307A102833j282K03J967K982L299L974N690Q092J0403J2159J3430J4628J6270
53294A194648J8530K0930K2564K2924K2458K2226K2861K3944K4455K3769K2035
53283A441344J9749J7334J5165J3462J2005J0283Q141N894L610Q14k690o153q667
53270A530291j0309j1852j3594j5171j6480j7966j9824k1519k2478k2772k2798
$$ plain form
53352 2075966 2035770 1997431 1960973 1926161 1892709 1859973 1827007 1793380 1759472 1725497 1690836
53341 1690836 1655071 1619272 1585357 1554316 1525835 1499475 1475266 1453058 1432183 1412143 1393047
53330 1393047 1375149 1358517 1343261 1329398 1316154 1302069 1286220 1268950 1251173 1233450 1216062
53319 1216062 1199360 1183600 1168789 1155088 1142980 1132698 1123934 1116500 1110800 1107087 1104718 1102833
53307 1102833 1101551 1101754 1103721 1106703 1110002 1113976 1119666 1127758 1138161 1150320 1163750 1178378 1194648
53294 1194648 1213178 1234108 1256672 1279596 1302054 1324280 1347141 1371085 1395540 1419309 1441344
53283 1441344 1461093 1478427 1493592 1507054 1519059 1529342 1537483 1543377 1546987 1547801 1545111 1538958 1530291
53270 1530291 1519982 1508130 1494536 1479365 1462885 1444919 1425095 1403576 1381098 1358326 1335528
53259A335528k2636k2196k1771k1937k2829k3780k4001k3493k2989k2925k2808
53248A084163k1957k0606j9710j9763k0333k0876k1296k1472k0944j9669j8455
53237H59082j8007j7930j7348j6225j5254j4625j3728j2158j0354r054q603q952
53225F96844r816j0720j1235j1349j1440j1766j2290j2961j3810j4760j5528j5812
53213E45357j5459j4556j3478j2594j1783j0576r025p958p965q491q578q130p745
53200D09019p593p294o821o646o893p092o945o617o151n329m378m002m390m816
53186C24052m628m032l492k889j956j019p20j129j733k149k418k557k315j467
53172B91548k29P47Q15p8j221j706j317o86n00p69j001r34q13r93j447j746j560
$$ plain form
53259 1335528 1312892 1290696 1268925 1246988 1224159 1200379 1176378 1152885 1129896 1106971 1084163
53248 1084163 1062206 1041600 1021890 1002127 981794 960918 939622 918150 897206 877537 859082
53237 859082 841075 823145 805797 789572 774318 759693 745965 733807 723453 714399 705796 696844
53225 696844 687028 676308 665073 653724 642284 630518 618228 605267 591457 576697 561169 545357
53213 545357 529898 515342 501864 489270 477487 466911 457886 449928 441963 433472 424894 416764 409019
53200 409019 401426 394132 387311 380665 373772 366680 359735 353118 346967 341638 337260 333258 328868 324052
53186 324052 319424 315392 311900 309011 307055 306036 305316 304187 302454 300305 297887 295330 293015 291548
53172 291548 291319 292066 292881 292803 291582 289876 288559 287873 287373 286604 285603 284669 283856 282863 281416 279670 278110
53155B78110j129j121j853k790l008k115n94O56R91M15m29p51l77R9R1k79n70
53138B65346p27r50j061o45K15R34J232J359J508J519J321J117R91P38K88j01
53122B73084j87L8N28J142J506J334R49R11J174J131N28k49q53j195j013j10P97
53105B79515M59j257k965l535l355l190k797j658l21K22K3p8J5l65j185j442o48
53088B57438M23Q27N47J07k26l35RP37J216R52L49K01O01Q90O19P4k61l25k76
53069B63567q6L02N58J81q08j762k190k274k379k393j966j152l32L97J221J979
53053B52863K130J496O13J05J22M73Q85R88N18k71p63q17q75j083r13j41N30L84
53035B56244k11l79j6K74K58K62L71K81j2p5K36N22N15M51N70P34P94Q65J041
$$ plain form
53155 278110 276981 275860 274007 271217 268209 266094 265500 266156 267147 267562 267133 266382 266005 266104 266195 265916 265346
53138 265346 264619 263669 262608 261963 262178 263112 264344 265703 267211 268730 270051 271168 272159 272897 273185 273084
53122 273084 272897 272935 273463 274605 276111 277445 278394 279305 280479 281610 282138 281889 281036 279841 278828 278718 279515
53105 279515 279974 278717 275752 272217 268862 265672 262875 261217 260896 261118 261141 261063 261078 260713 259528 258086 257438
53088 257438 257861 258688 259235 259342 259116 258781 258790 259527 260743 261695 262044 262245 262846 263736 264355 264429 264168 263843 263567
53069 263567 263481 263783 264341 264522 263714 261952 259762 257488 255109 252716 250750 249598 249266 249663 250884 252863
53053 252863 254993 256489 257102 257207 257329 257802 258687 259675 260193 259922 259159 258342 257467 256384 255471 255330 255860 256244
53035 256244 256033 255654 255638 255912 256170 256432 256803 257084 257072 256997 257233 257755 258270 258721 259291 260025 260819 261684 262725
53016B62725J184J232J328J473J353Q13J79j56j77q6J10M49O94M84j35o18m51
52999B70401L47J245J672J470Q64J53n25j082j348j188o82m6N71J076J327J235
52983B75490R57P95R00J166J362J325J084R44J273K070K868L204L045K587J947
52968C01017J285Q98Q73Q39N44L17N22P73M09m12q81q29r79j690k254j954j158
52951B97320q24j255j921k165j734q48j68l15j110j596j267p39p60j047q88m79
52935B80204o65j457j868j453r82j179j575j281l71L19M40M91R70J712K123J807
52919B77235Q64j52o86p05p39j163j681j754j314o85l3O66J179J161P28M40M76
52902B73837M25k5n54p30n30j00O15J539K096J748P13k92q46r48n55L38J231J370
$$ plain form
53016 262725 263909 265141 266469 267942 269295 270108 270287 270131 269954 269868 269978 270427 271121 271605 271470 270852 270401
52999 270401 270748 271993 273665 275135 275999 276152 275627 274545 273197 272009 271327 271281 271852 272928 274255 275490
52983 275490 276447 277242 278142 279308 280670 281995 283079 284023 285296 287366 290234 293438 296483 299070 301017
52968 301017 302302 303200 304073 304912 305456 305773 306295 307068 307477 307065 306184 305355 304376 302686 300432 298478 297320
52951 297320 296496 295241 293320 291155 289421 288573 288405 288090 286980 285384 284117 283378 282618 281571 280683 280204
52935 280204 279539 278082 276214 274761 273779 272600 271025 269744 269373 269692 270132 270623 271593 273305 275428 277235
52919 277235 278099 277947 277261 276556 275817 274654 272973 271219 269905 269220 269187 269853 271032 272193 272921 273361 273837
52902 273837 274262 274237 273683 272953 272423 272323 272938 274477 276573 278321 279034 278742 277896 276948 276393 276731 277962 279332
52884B79332O31l77j166j818k350k287j375k30K74O9j25K36R81J655K052K258
52868B77760K381K397K222J894J693J823J956J455K66p44p39J3N01K02n21j209
52852B91350j872k595l162l373l370l322l062k381j523j048j231j847k494k907
52838B57163k956k587j883j065l51J47L90L93K73K51M55P58Q37N32J30J19O22
52821B53228J151J048J60j015j820j971j605j014l74K82R00J304J320J072R42
52806B53608J145J473J595J488J286Q79Oj193k117k374k210k086k081j967j672
52791B45780j426j440j636j664j142l5J097J467R63L98N88J320J667J238N84K97
52775B48056K95K75L87Q85J402J219K83n68o37k42j96o77j004n73L90J112J157
$$ plain form
52884 279332 279963 279586 278420 276602 274252 271965 270590 270360 270634 270703 270578 270814 271795 273450 275502 277760
52868 277760 280141 282538 284760 286654 288347 290170 292126 293581 293847 293103 292364 292377 292878 293080 292559 291350
52852 291350 289478 286883 283721 280348 276978 273656 270594 268213 266690 265642 264411 262564 260070 257163
52838 257163 254207 251620 249737 248672 248321 248468 248858 249251 249524 249775 250230 250988 251825 252357 252487 252606 253228
52821 253228 254379 255427 255587 254572 252752 250781 249176 248162 247788 248070 248970 250274 251594 252666 253608
52806 253608 254753 256226 257821 259309 260595 261474 261480 260287 258170 255796 253586 251500 249419 247452 245780
52791 245780 244354 242914 241278 239614 238472 238437 239534 241001 241964 242362 242950 244270 245937 247175 247759 248056
52775 248056 248351 248626 249013 249898 251300 252519 252802 252234 251597 251355 251159 250482 249478 248905 249295 250407 251564
52758B51564P30K13l22r32j369j139j65Q82J173O01j64m64k23L07R87J725K301
52741B55705K564K708K921K946K340J278N88Q11J555K018J857J314P98O37R61
52726B81001J471J501P51k53q09r74j324j916k146j764j321j263j206o22J78L86
52710B71690j90q87j020n42R4L53no23p42m1Q57J119Q05O25P43N50j88p87n92
52691B71219R3N69P30Q68R14N37j19m87l63j14r9l02o07r40j128r98p11o55r00
52672B67507j101j038q18n24n4M72O39L22k0K6J98K0m08m67J59J156K022K522
52654B70613K694K659K606K695K890K924K612K023J311M84m85j341j594j112m58
52639B88521l52q31j257j212r58q57p77m90j99k05l21k87l61p84r36qJ506K038
$$ plain form
52758 251564 252294 252507 252185 251253 249884 248745 248580 249462 250635 251236 251072 250608 250385 250692 251679 253404 255705
52741 255705 258269 260977 263898 266844 269184 270462 271050 271861 273416 275434 277291 278605 279403 280040 281001
52726 281001 282472 283973 284724 284471 283662 282688 281364 279448 277302 275538 274217 272954 271748 271126 271304 271690
52710 271690 271500 270613 269593 269051 269145 269498 269493 268870 268128 268087 268944 270063 270868 271493 272236 272786 272598 271811 271219
52691 271219 271312 271881 272611 273479 274393 274930 274811 274324 273961 273847 273748 273446 272839 271899 270771 269773 269062 268407 267507
52672 267507 266406 265368 264550 264026 263972 264444 265083 265405 265385 265411 265609 265629 265221 264754 264913 266069 268091 270613
52654 270613 273307 275966 278572 281267 284157 287081 289693 291716 293027 293511 293026 291685 290091 288979 288521
52639 288521 288169 287338 286081 284869 283911 283054 282277 281787 281588 281383 281062 280775 280414 279630 278694 278686 280192 282230
52621B82230R85n54j386j519j295m43J045K046J637O35M76R71O44p96j873j569
52605B81234o81l37l20K10J116J527J304J320K118L030K909J467k98j070n20M07
52589B93416O41J51k55p9M53R69J381J570J244M03m57q94r52q36m57L49J365J988
52571C00000J677L96j189k036j570l22N87N49j82j084j782j921j325m75j88o06
52555B90529j005q65n50o48j122j479j442j071o01l65m86n17Q2J008J336Q80M45
52538B84129L98k4j234k173j682k37Q21J212J611J944J395J11n61N4R75J073N63
52521B88375L30N55P46O72N64O78J075J664K134K158J891J918K415K797K597K185
52505C12754K146K260J758M22j178k450l194l329k796j943j472j676k063k037
$$ plain form
52621 282230 283215 282661 281275 279756 278461 278018 279063 281109 282746 283381 283857 284828 285472 284676 282803 281234
52605 281234 280553 280216 279896 280106 281222 282749 284053 285373 287491 290521 293430 294897 294599 293529 293009 293416
52589 293416 294057 294208 293953 293874 294327 295296 296677 298247 299491 299894 299437 298543 297591 296755 296298 296647 298012 300000
52571 300000 301677 302073 300884 298848 297278 296956 297543 298092 297910 296826 295044 293123 291798 291323 291135 290529
52555 290529 289524 288659 288109 287461 286339 284860 283418 282347 281746 281381 280895 280378 280460 281468 282804 283684 284129
52538 284129 284527 284503 283269 281096 279414 279177 279998 281210 282821 284765 286160 286271 285710 285764 286739 287812 288375
52521 288375 288705 289260 290006 290678 291242 291920 292995 294659 296793 298951 300842 302760 305175 307972 310569 312754
52505 312754 314900 317160 318918 319340 318162 315712 312518 309189 306393 304450 302978 301302 299239 297202
52491B97202j661j381j220p77M4P36Q47N34K08q4n46j059j095k81J131K420K844
52474B97862K114O85m28n05J50O19N65N68J193K161K736K679K405K377K623K777
52458C20581K382J251l01j614k243k330k382k807l580m209m105l256k382k067
52444B92938j888j100n2P6q67j461p15M07M01n86j157q38n36q66j246r40p2P83
52426B82281J321J432J049M36J58M38Q97J126J093R14O46N52J012J942K712K897
52410C00906K778K907L579M808O336P459P411O304N224N045N458N531M739L105
52396C71590P58j999m469o060o890p425p551o612m533k361j302j491j993j875
52382C17787j019J02J064J777K358K991L844M812N381N078M134L423L511M051
$$ plain form
52491 297202 295541 294160 292940 292163 292207 292943 293790 294324 294532 294448 293902 292843 291748 291467 292598 295018 297862
52474 297862 299976 300661 300233 299728 299878 300497 301062 301630 302823 304984 307720 310399 312804 315181 317804 320581
52458 320581 322963 324214 323913 322299 320056 317726 315344 312537 308957 304748 300643 297387 295005 292938
52444 292938 291050 289950 289898 289974 289107 287646 286931 287338 287739 287153 285996 285158 284622 283756 282510 281570 281498 282281
52426 282281 283602 285034 286083 286519 286677 287115 288012 289138 290231 291145 291791 292343 293355 295297 298009 300906
52410 300906 303684 306591 310170 314978 321314 328773 336184 342488 347712 352757 358215 363746 368485 371590
52396 371590 372348 370349 365880 359820 352930 345505 337954 331342 326809 324448 323146 321655 319662 317787
52382 317787 316768 316870 317934 319711 322069 325060 328904 333716 339097 344175 348309 351732 355243 359294
52368C59294M373M294M063L745L124K123R57k2n13m62l21o80j361j356k30R72
52352C78000R93J81m1P13J403J311R86J086J400J625K143L265M398M787M589M540
52336D11379M987N805O831P785Q235Q290Q886J0662J2937J4584J5610J6947J8895
52323E51833K0639K1419K1344K0968K0657K0610K0867K1139K1069K0729K0529
52312G81803K0544K0517K0455K0624K0892K0730K0101J9664J9716J9573J8533
52301A003152J6975J5861J5379J4770J3392J1398R248P091M774K245l39k717m712
52288A106517o366p929r446j0509j0626r919r052q362p418n789l849k397j570
52275A013285o87Q32K865M975O959Q712J0045J0987J1991J3357J4641J5077J4571
$$ plain form
52368 359294 363667 367961 372024 375769 378893 381016 381973 381951 381438 380976 380655 379975 378614 377258 377028 378000
52352 378000 378993 379174 379133 379846 381249 382560 383546 384632 386032 387657 389800 393065 397463 402250 406839 411379
52336 411379 416366 422171 429002 436787 445022 453312 462198 472860 485797 500381 515991 532938 551833
52323 551833 572472 593891 615235 636203 656860 677470 698337 719476 740545 761274 781803
52312 781803 802347 822864 843319 863943 884835 905565 925666 945330 965046 984619 1003152
52301 1003152 1020127 1035988 1051367 1066137 1079529 1090927 1100175 1107266 1112040 1114285 1113946 1111229 1106517
52288 1106517 1100151 1092222 1082776 1072267 1061641 1051722 1042670 1034308 1026890 1021101 1017252 1014855 1013285
52275 1013285 1012598 1013430 1016295 1021270 1028229 1036941 1046986 1057973 1069964 1083321 1097962 1113039 1127610
52262A127610J3925J3993J4821J5674J5826J5289J4851J5204J6036J6260J5297
52251A294786J3727J2412J1358R922P830N353K712n0k654m712o254p639q830r464
52237A318497r658j0118j1151j2159j2387j1778j0801r883r225q835q481p963
52225A196058p519p542p791p465o183m425k732j114M78J708K336K664L070L568
52211A165111M168N143O434P349P387P002O934P216P394P321P085O518N485M501
52197A255048M268M772N392N808O180O525O591O332N949N466M714L739K658J234
52183A324676q36l185m984n963o707p821r243j0480j1061j0727r656q583q121
52170A227309p914p012n206l427k557k399k186j569o74L17J211J690J741J897
$$ plain form
52262 1127610 1141535 1155528 1170349 1186023 1201849 1217138 1231989 1247193 1263229 1279489 1294786
52251 1294786 1308513 1320925 1332283 1342205 1350035 1355388 1358100 1358050 1355396 1350684 1344430 1336791 1327961 1318497
52237 1318497 1308839 1298721 1287570 1275411 1263024 1251246 1240445 1230562 1221337 1212502 1204021 1196058
52225 1196058 1188539 1180997 1173206 1165741 1159558 1155133 1152401 1151287 1151765 1153473 1155809 1158473 1161543 1165111
52211 1165111 1169279 1174422 1180856 1188205 1195592 1202594 1209528 1216744 1224138 1231459 1238544 1245062 1250547 1255048
52197 1255048 1259316 1264088 1269480 1275288 1281468 1287993 1294584 1300916 1306865 1312331 1317045 1320784 1323442 1324676
52183 1324676 1323840 1320655 1315671 1309708 1303001 1295180 1285937 1275457 1264396 1253669 1244013 1235430 1227309
52170 1227309 1219395 1212383 1207177 1203750 1201193 1198794 1196608 1195039 1194365 1194682 1195893 1197583 1199324 1201221
52156A201221K573L284L062J678pj004j113p76m51l73o19j000r93k09J034J855
52140A208162J699Q96J99NJ99N88J132J809K578L513M781O417Q330J0511J3087
52125A263906J6101J9428K2846K5985K8320K9548K9989L0285L0650L0796L0548
52114A558402L0067K9371K8104K6034K3397K0551J7725J5296J3771J3094J2386
52103A788198J0860Q794P138O343N911N022L360J306n08j957l629o037q773j1047
52089A804981j2880j5027j7571j9506k0111j9872j9469j8721j7165j4997j2540
52078A617122r545n939k714r19j11J149L460O208Q783J1090J3000J4364J5555
52065A671503J7006J8185J8103J6955J6067J6072J6117J5340J4025J2787J1511
$$ plain form
52156 1201221 1203794 1207078 1210140 1211818 1211811 1210807 1209694 1208918 1208467 1208094 1207475 1206475 1205482 1205273 1206307 1208162
52140 1208162 1209861 1210757 1210956 1210961 1211160 1211748 1212880 1214689 1217267 1220780 1225561 1231978 1240308 1250819 1263906
52125 1263906 1280007 1299435 1322281 1348266 1376586 1406134 1436123 1466408 1497058 1527854 1558402
52114 1558402 1588469 1617840 1645944 1671978 1695375 1715926 1733651 1748947 1762718 1775812 1788198
52103 1788198 1799058 1807852 1814990 1821333 1827244 1832266 1835626 1836932 1836424 1834467 1830838 1824801 1816028 1804981
52089 1804981 1792101 1777074 1759503 1739997 1719886 1700014 1680545 1661824 1644659 1629662 1617122
52078 1617122 1607577 1601638 1598924 1598005 1597894 1599043 1602503 1608711 1617494 1628584 1641584 1655948 1671503
52065 1671503 1688509 1706694 1724797 1741752 1757819 1773891 1790008 1805348 1819373 1832160 1843671
52054A843671R831P933O183M402K148n91l430o034q179r816j1375j3649j6878
$$ plain form
52054 1843671 1853502 1861435 1867618 1872020 1874168 1873577 1870147 1864113 1855934 1846118 1834743 1821094 1804216
$$ [...]
##END NTUPLES=NMR SPECTRUM
##END=
