##TITLE=AC1615_BRAAN13346_8317375_tVIwYc4zw2
##JCAMPDX= 6.0         $$ Bruker NMR JCAMP-DX V2.0
##DATA TYPE= NMR SPECTRUM
##DATA CLASS= NTUPLES
##ORIGIN= BRUKER
##OWNER= Administrator
$$ 1.72 TOPSPIN		Version 2.1
$$ 2013-11-13 21:47:37.735 -0800  Administrator@X
$$ Compression mode = diff/dup
##.OBSERVE FREQUENCY= 400.02188249412
##.OBSERVE NUCLEUS= ^1H
##.ACQUISITION MODE= SIMULTANEOUS (DQD)
##.ACQUISITION SCHEME= undefined
##.AVERAGES= 8
##.DIGITISER RES= 22
##SPECTROMETER/DATA SYSTEM= spect
##.PULSE SEQUENCE= zg30
##.SOLVENT NAME= COFFEE_meoh
##.SHIFT REFERENCE= INTERNAL, COFFEE_meoh, 1, 14.98509
##AUDIT TRAIL= $$ (NUMBER, WHEN, WHO, WHERE, PROCESS, VERSION, WHAT)
$$ ##TITLE= Audit trail, TOPSPIN		Version 2.1
$$ ##JCAMPDX= 5.01
$$ ##ORIGIN= Bruker BioSpin GmbH
$$ ##OWNER= Administrator
$$ $$ E:\/data/COFFEE/nmr/AC1615_BRAAN13346_8317375_tVIwYc4zw2/10/pdata/1/auditp.txt
$$ ##AUDIT TRAIL=  $$ (NUMBER, WHEN, WHO, WHERE, PROCESS, VERSION, WHAT)
(   1,<2013-11-13 21:47:30.094 -0800>,<Administrator>,<X>,<go>,<TOPSPIN 2.1>,
      <created by zg
	started at 2013-11-13 21:46:23.844 -0800,
	POWCHK enabled, PULCHK disabled,
       configuration hash MD5:
       C8 4E 4E 5D D3 5C D8 9E 9F 52 82 E0 59 8A DE 15
       data hash MD5: 64K
       8A 44 8C 22 EE A5 74 D1 E8 EB E8 1B 0C B4 93 63>)
(   2,<2013-11-13 21:47:33.313 -0800>,<Administrator>,<X>,<proc1d>,<TOPSPIN 2.1>,
      <Start of raw data processing
       efp LB = 0 FT_mod = 6 PKNL = 1 PHC0 = 0 PHC1 = 0 SI = 32K 
       data hash MD5: 32K
       5A 71 52 58 C5 62 C9 28 3F 3A EE FE CC A2 8B E1>)
(   3,<2013-11-13 21:47:33.813 -0800>,<Administrator>,<X>,<proc1d>,<TOPSPIN 2.1>,
      <pk PHC0 = 93.47168 PHC1 = 0 
       data hash MD5: 32K
       28 0F CC E2 F4 4F F6 AE BD AB 3F EA 29 E5 DF 5C>)
(   4,<2013-11-13 21:47:34.032 -0800>,<Administrator>,<X>,<proc1d>,<TOPSPIN 2.1>,
      <abs ABSG = 1 
       data hash MD5: 32K
       C8 9F 33 53 D2 D1 D7 9B F9 24 25 15 8F 0B 20 E7>)
(   5,<2013-11-13 21:47:34.204 -0800>,<Administrator>,<X>,<proc1d>,<TOPSPIN 2.1>,
      <abs ABSG = 2 
       data hash MD5: 32K
       DC 20 A3 9C 7D DC B5 08 51 2F A6 3B D5 FF FF 78>)
(   6,<2013-11-13 21:47:34.298 -0800>,<Administrator>,<X>,<proc1d>,<TOPSPIN 2.1>,
      <abs ABSG = 3 
       data hash MD5: 32K
       5F FC DC 05 7E B7 0D 76 58 35 86 90 5A D2 1E 58>)
(   7,<2013-11-13 21:47:34.360 -0800>,<Administrator>,<X>,<proc1d>,<TOPSPIN 2.1>,
      <abs ABSG = 4 
       data hash MD5: 32K
       0A 1F 84 E3 DB 9F D3 55 1F 88 85 5D C5 69 DD CC>)
(   8,<2013-11-13 21:47:34.423 -0800>,<Administrator>,<X>,<proc1d>,<TOPSPIN 2.1>,
      <abs ABSG = 5 
       data hash MD5: 32K
       FB 87 B4 73 45 CD 92 B1 57 51 18 71 78 EF 19 73>)
$$ ##END=
$$ 
$$ $$ hash MD5
$$ $$ AF AE 86 57 5D 96 52 9C 39 50 B9 5C 2C 45 7A B6
##$RELAX= 
##$RELAX= 
##$RELAX= 
##$RELAX= 
##$RELAX= 
##$RELAX= 
##$RELAX= 
$$ Bruker specific parameters
$$ --------------------------
##$DU= <E:\>
##$EXPNO= 10
##$NAME= <AC1615_BRAAN13346_8317375_tVIwYc4zw2>
$$ [...]
150 150 150 150 150 150 150 150
##$TP07= 0
##$TPNAME0= <>
##$TPNAME1= <>
##$TPNAME2= <>
##$TPNAME3= <>
##$TPNAME4= <>
##$TPNAME5= <>
##$TPNAME6= <>
##$TPNAME7= <>
##$TPOAL= (0..7)
0.5 0.5 0.5 0.5 0.5 0.5 0.5 0.5
##$TPOFFS= (0..7)
0 0 0 0 0 0 0 0
##$TUNHIN= 0
##$TUNHOUT= 0
##$TUNXOUT= 0
##$USERA1= <user>
##$USERA2= <user>
##$USERA3= <user>
##$USERA4= <user>
##$USERA5= <user>
##$V9= 5
##$VALIST= <valist>
##$VCLIST= <CCCCCCCCCCCCCCC>
##$VD= 0
##$VDLIST= <DDDDDDDDDDDDDDD>
##$VPLIST= <PPPPPPPPPPPPPPP>
##$VTLIST= <TTTTTTTTTTTTTTT>
##$WBST= 1024
##$WBSW= 4
##$XGAIN= (0..3)
0 0 0 0
##$XL= 0
##$YL= 0
##$YMAX_a= 604940
##$YMIN_a= -514291
##$ZGOPTNS= <>
##$ZL1= 120
##$ZL2= 120
##$ZL3= 120
##$ZL4= 120
##$ABSF1= 14.98509
##$ABSF2= -5.573092
##$ABSG= 5
##$ABSL= 3
##$ALPHA= 0
##$AQORDER= 0
##$ASSFAC= 0
##$ASSFACI= 0
##$ASSFACX= 0
##$ASSWID= 0
##$AUNMP= <proc_prof1d_extract_pilot.lims>
##$AXLEFT= 0
##$AXNAME= <>
##$AXNUC= <1H>
##$AXRIGHT= 0
##$AXTYPE= 0
##$AXUNIT= <>
##$AZFE= 0.1
##$AZFW= 0.1
##$BCFW= 0
##$BC_mod= 0
##$BYTORDP= 0
##$COROFFS= 0
##$CY= 15
##$DATMOD= 1
##$DC= 0
##$DFILT= <>
##$DTYPP= 0
##$F1P= 0
##$F2P= 0
##$FCOR= 0.5
##$FTSIZE= 32768
##$FT_mod= 6
##$GAMMA= 0
##$GB= 0
##$INTBC= 1
##$INTSCL= 1
##$ISEN= 128
##$LB= 0
##$LEV0= 0
##$LPBIN= 0
##$MAXI= 10000
##$MC2= 0
##$MEAN= 0
##$ME_mod= 0
##$MI= 0
##$NCOEF= 0
##$NC_proc= -8
##$NLEV= 6
##$NOISF1= 0
##$NOISF2= 0
##$NSP= 0
##$NTH_PI= 0
##$NZP= 0
##$OFFSET= 14.98509
##$PC= 1
##$PHC0= 93.47168
##$PHC1= 0
##$PH_mod= 1
##$PKNL= yes
##$PPARMOD= 0
##$PPDIAG= 0
##$PPIPTYP= 0
##$PPMPNUM= 2147483647
##$PPRESOL= 1
##$PSCAL= 4
##$PSIGN= 0
##$PYNMP= <proc.py>
##$REVERSE= no
##$SF= 400.02
##$SI= 32768
##$SIGF1= 0
##$SIGF2= 0
##$SINO= 400
##$SIOLD= 32768
##$SPECTYP= <>
##$SREGLST= <1H.CDCl3>
##$SSB= 0
##$STSI= 32768
##$STSR= 0
##$SW_p= 8223.68421052631
##$SYMM= 0
##$S_DEV= 0
##$TDeff= 65536
##$TDoff= 0
##$TI= <>
##$TILT= no
##$TM1= 0
##$TM2= 0
##$TOPLEV= 0
##$USERP1= <user>
##$USERP2= <user>
##$USERP3= <user>
##$USERP4= <user>
##$USERP5= <user>
##$WDW= 1
##$XDIM= 32768
##$YMAX_p= 462485379
##$YMIN_p= -705237
##$CURPLOT= <Network HP LaserJet P1505>
##$CURPRIN= <$Network HP LaserJet P1505>
##$DFORMAT= <normdp>
##$LAYOUT= <+/1D_H.xwp>
##$LFORMAT= <normlp>
##$PFORMAT= <normpl>
##$SURQMSG= 1
$$ End of Bruker specific parameters
$$ ---------------------------------
##NTUPLES= NMR SPECTRUM
##VAR_NAME=  FREQUENCY,     SPECTRUM/REAL,   SPECTRUM/IMAG
##SYMBOL=    X,             R,               I
##VAR_TYPE=  INDEPENDENT,   DEPENDENT,       DEPENDENT
##VAR_FORM=  AFFN,          ASDF,            ASDF
##VAR_DIM=   32768,         32768,           32768
##UNITS=     HZ,            ARBITRARY UNITS, ARBITRARY UNITS
##FACTOR=    0.250966925370066, 1,           1
##FIRST=     8223.43324360094, 100436,       -175992
##LAST=      0,             -105458,         131301
##MIN=       0,             -705237,         0
##MAX=       8223.43324360094, 462485379,    0
$$ Real data points
##PAGE= N=1
##DATA TABLE= (X++(R..R)), XYDATA
$$ [...]
19535h1209E4489Q0312a63167h1233E1051j5283b5307B64423a58971O5833B3690
19523H9694g1047q454j67537a398j32026M7795A12029a37636J7342A9287H163
19511E2277J53136a49157A43082p0772a07907A87715a09001j5079j23231K9074
19501b18237R3701r2508C32882b97113a2411q4506C594P3419a1827k28432l8357
19490b78616C35516h9815E1068f6247j20628N4078K7948g628j27183A09659C6753
19478A84887A9758a5029j86819a7756j92174j19859B08404g208j07621n2217m0459
19467b07505E3695a19368k29940a25845c0026C2587b9554l08060D260d4616E3184
19455c60193J68689a3030A54270b77830a20645A34409b04851A45172a86970b5880
$$ y = [-81209, 54489, 134801, -163167, -81233, 51051, 35768, -25307, 264423, -158971, -93138, 23690, 89694, -71047, -79501, -247038, -1398, -133424, -85629, 112029, -137636, -120294, 19287, 8163, 52277, 205413, -149157, 143082, 72310, -107907, 187715, -109001, -124080, -247311, -218237, -124536, -217044, 332882, -297113, -12411, -96917, 3594, 77013, -11827, -240259, -278616, 335516, -89815, 51068, -66247, -186875, -132797, -104849, -7628, -134811, 109659, 36753, 184887, 19758, -15029, -201848, -17756, -209930, -329789, 208404, -7208, -114829, -167046, -207505, 53695, -119368, -349308, -125845, -30026, 32587, -29554, -337614, 4260, -44616, 53184, -360193, -191504, -13030, 154270, -277830, -120645, 134409, -204851, 145172, -186970, -25880]
19444c9497E1490c43727G6318J36554b57305J22443B09727a45768j30092E5767
19433B865f4824b5909k2867p2163q1786f7895j16890L4626l6170f3050o1235j42606
19421b66891g1159p8802j17311B19659h6883K0005a648q5119H6557C2849a66870
19409a44873g0722j2552k48271J17574J01683D4275o706K06556a62479B56362
19398c2404A25408J36402f9486B19447j08708e5213b2519k3813c118E5471j8106
19387C7365g6152l85628A47882a24855J3583j34719B16960h1062A6863a89746
19376G4750F598a25200J8187E5925e4337F7552b36308B26625b09816i5177k40093
19365c35270a37567A1664n721a623k05038M1557m6917K9105F1611h3824n9082
$$ y = [-39497, 51490, -343727, 76318, 212872, -257305, -134862, 209727, -145768, -275860, 55767, 2865, -64824, -25909, -48776, -120939, -202725, -67895, -184785, -150159, -186329, -63050, -124285, -266891, -71159, -149961, -267272, 219659, -86883, -66878, -1648, -86767, 86557, 32849, -166870, -144873, -70722, -83274, -331545, -213971, -112288, 44275, 37569, 244125, -162479, 256362, -32404, 125408, 261810, -69486, 219447, 110739, -55213, -22519, -46332, -3118, 55471, 37365, -76152, -461780, 147882, -124855, -111272, -245991, 216960, -81062, 16863, -189746, 74750, 6598, -125200, -107013, 55925, -54337, 67552, -236308, 226625, -209816, -95177, -335270, -137567, 11664, 5943, -1623, -206661, -165104, -212021, -182916, 61611, -83824, -142906]
19354a42906n7065j74884a12420j87496A23434b2050B02586a25597k72173a28880
19343i1155j40439i2461j42792i3025A35702c51012A682P5417R3036a81262p1438
19332b52700m4154B846b61351r4401J44651I3489K36738b25170a02403k06150
19322c08553e7055k9734c1420j42187L2398F1327b19675a2445k03775A61002o7146
19311I3856b28089k29681c202j04278j39503E5635e1123j5926k9762A87764a17812
19299a33255b2663C4372g7833J3937j54087A46157F0119d51904K08842i1994o8074
19288a60068B87259l434a56446j0836g6294o9075k75222h1822L5317N148C6822
19276b82403J3096J21155e5017F9200a03979I3269N4720A1181J34193a28944M7609
$$ y = [-142906, -199971, -374855, -112420, -299916, 123434, -22050, 202586, -125597, -397770, -128880, -91155, -231594, -92461, -235253, -93025, 135702, -351012, 1682, 77099, 170135, -181262, -252700, -296854, 2846, -261351, -355752, -211101, 93489, 330227, -225170, -102403, -308553, -57055, -86789, -31420, -173607, -141209, 61327, -219675, -12445, -216220, 161002, 93856, -228089, -457770, -3202, -107480, -246983, 55635, -51123, -67049, -96811, 187764, -117812, -133255, -22663, 34372, -77833, -63896, -217983, 146157, 60119, -451904, -243062, -91994, -160068, 287259, 283825, -156446, -167282, -76294, -145369, -420591, -81822, -46505, -41357, 36822, -282403, -269307, -148152, -55017, 69200, -103979, 93269, 147989, 11181, 145374, -128944, -81335]
19265h1335c2702B18726a01511C30456B9957a24686j54063R649J24495p6076h1585
19253a55185r5189C01245K05735b70322D22194A68751c24784A60243b03704k26663
19243d30367A26500m9572b68150H3062a01391d8792B09348J3353N1777A32337
19232b18580B79584c23811i7722k88166a20151A80046b8055o2819j97292J37616
19222a50550L975j73029A61735b53427m3447K3648B7224c47144a16031F332J59570
19211A65902a32962A32086m2739e2500j88229A03292g0990j57469a12322R784
19201a02538p9923c9784l14472d0003G4100L8754a22372G3166J20382b54055f3760
19189e4007j42115b7228G9146a81950j9346o7586R0635Q7870b5862B3990d1233
$$ y = [-81335, -32702, 218726, -101511, 330456, 29957, -124686, -278749, -269100, -144605, -220681, -81585, -155185, -250374, 301245, 506980, -270322, 422194, 168751, -324784, 160243, -203704, -430367, 126500, 76928, -268150, 83062, -101391, -48792, 209348, 222701, 274478, 132337, -218580, 279584, -323811, -97722, -385888, -120151, 180046, -28055, -90874, -288166, -150550, -146575, -319604, 161735, -253427, -296874, -273226, 27224, -347144, -116031, 6332, 165902, -132962, 132086, 89347, -52500, -240729, 103292, -70990, -228459, -112322, -102538, -182461, -39784, -354256, -40003, 74100, 112854, -122372, 73166, 193548, -254055, -63760, -54007, -196122, -27228, 79146, -181950, -201296, -268882, -178247, -90377, -25862, 23990, -41233]
19177c4885m55135C15384B1181a08973o752m4146l39746b14140P1543E4710L997
19166E8707k3854a43611j1471A98748a45908G1176o779c92634H8222R4774B6361
19154d3091r4330e3799o8849j13648O0101H7475b59487B83503r9641c18639a07637
19142A44228a66125A39183m5169a2841k0391C4406J44246g2574A01491a96661
19131g2438A48015a99147I0626b08951L8706e4396c312o098r4426j97e1m23601
19119d23652A05332a41284k84359L6914G3862c11830C4625I049b2773B19926c27475
19107g1191A8005a54604e4500j38196j31479R7243O4944n8442F0752e937k76839
19096b82776a21237A0145L53111A28303c24626F191K9698A836b55857A08802a64518
$$ y = [-34885, -490020, 315384, 21181, -108973, -115725, -159871, -499617, -214140, -142597, 54710, 58707, 34853, -143611, -155082, 198748, -145908, 71176, 64397, -392634, 88222, 182996, 26361, -43091, -137421, -53799, -122648, -236296, -176195, 87475, -259487, 283503, 183862, -318639, -107637, 144228, -166125, 139183, 94014, -12841, -33232, 34406, 178652, -72574, 101491, -196661, -72438, 148015, -199147, 90626, -208951, -170245, -54396, -3312, -9410, -103836, -104033, -51, -423652, 105332, -141284, -425643, -388729, 73862, -311830, 34625, 9049, -22773, 219926, -327475, -71191, 18005, -154604, -54500, -192696, -324175, -226932, -161988, -220430, 60752, -5937, -282776, -121237, 10145, 363256, 128303, -324626, 6191, 35889, 1836, -255857, 108802, -164518]
19084e8097D0555h5614C1849h3434m6626a3741c071A0665d9681C5133a02105B4753
19071c52425I9608J06013g3392A14172a42438O1073C33630a09272L5994A99598
19060A00812b21639a07988o5853O032n6936P0609O5987l1672L2760A90246q2868
19049A07378a02626M0203J6257k29358I6406N5857d5974C46251A7449a33842N6645
19038g7197B61433a37290b7421G5795n699J65718p6473e7345A13227L5836Q9530
19027B38593b1808o9188D0888K00684C7922L5475N4665l9931b63335Q6448j34448
19016c11335a1725j2005q7061k86104C10261G6821E158a77124D4578d5083q260
19005e3343k11949j64777a83494g4054A36195M5217a05617p8470d0497D3364d38132
$$ y = [-58097, 40555, -85614, 31849, -83434, -130060, -13741, -3071, 10665, -49681, 35133, -102105, 24753, -352425, 99608, 205621, -73392, 114172, -142438, -81365, 333630, -109272, -73278, 199598, 100812, -221639, -107988, -173841, -167809, -224745, -154136, -88149, -119821, -87061, 190246, 107378, -102626, -62423, -46166, -275524, 96406, 152263, -45974, 346251, 17449, -133842, -77197, 261433, -137290, -27421, 75795, 70096, 235814, 159341, -57345, 113227, 149063, 238593, -21808, -90996, 40888, 241572, 37922, 73397, 128062, 88131, -263335, -176887, -311335, -11725, -23730, -110791, -396895, 310261, 76821, 5158, -177124, 44578, -45083, -53343, -265292, -430069, -183494, -74054, 136195, 181412, -105617, -184087, -40497, 43364, -438132]
18993E7717a79079r493h3994a3413n0558j26437O3989A10480b9592H9192B8582
18981a66679j38509b0410C30281a94596I4986J2403a60008k0376D1848R3567l5677
18970I9738b35251d5966C14010A6108a10961e4720D3825b5222o5877c596B88171
18958C8752J5673b16770A05685a47798k97295A27468d3010k45408J20933j0405
18948a77890j10528B13787l8086j5701M009a32420b8835H50L22274b99632N1444
18937b48188K2837a09192A61493a62895A21920b64905j6621B60138b64165N8231
18927b05934h4649L3843g722m6939j35452g1310j18867j25605E0485i5215d5456
18915B50725q9254f7377A76602J2953a42743j90l8415E4265i308p7940J5320j54931
$$ y = [57717, -179079, -188572, -83994, -13413, -63971, -190408, -126419, 110480, -29592, 89192, 28582, -166679, -305188, -20410, 330281, -194596, 94986, 107389, -160008, -180384, 41848, 135415, 99738, -235251, -45966, 314010, 16108, -110961, -54720, 43825, -25222, -91099, -3596, 288171, 38752, 54425, -216770, 105685, -147798, -445093, 127468, -43010, -288418, -167485, -177890, -288418, 213787, 175701, 160000, 164009, -132420, -28835, 850, 323124, -299632, -248188, -225351, -109192, 161493, -162895, 121920, -264905, -281526, 260138, -264165, -205934, -84649, -50806, -7722, -54661, -190113, -71310, -190177, -315782, 50485, -95215, -45456, 250725, 161471, -67377, 176602, 189555, -142743, -142933, -181348, 54265, -9308, -87248, -71928, -226859]
18903b26859B35522a20317B6852K29910L0547a68104p694A36583C4237R6026e6900
18891B31998p7030f9267k48658j26067f7919B35927H3094a44536m8629J9749k33828
18880d07244J83500j813N5109g5263B04064O2266E6608b19689B7946a13878M010
18869a09868k8229A43003J77816A51943G0486K31768c43545a38839A6240K93793
18859C10033i2542B2047a89056i0789a4084j45996k74627i0907o0489L3925q0942
18848a98413C27865B5924R6552G128f7390K0439j07909A01690b30173P4446A95888
18836b81706e7588B39860N3626g8243j03602c7981l78239H609c0517r5277C9783
18824G0895h5479c7865A04439b780j59762p8144b4157j92404c6883J3843A45993
$$ y = [-226859, 235522, -120317, 26852, 256762, 287309, -168104, -175798, 136583, 34237, 130263, -56900, 231998, 154968, -69267, -317925, -443992, -67919, 235927, 83094, -144536, -193165, -173416, -407244, -223744, -225557, -170448, -75263, 204064, 266330, 56608, -219689, 27946, -113878, -109868, -138097, 143003, 320819, 151943, 70486, 302254, -343545, -138839, 16240, 310033, -92542, 22047, -189056, -90789, -14084, -160080, -434707, -90907, -151396, -117471, -198413, 327865, 25924, 122476, 7128, -67390, -46951, -154860, 101690, -230173, -155727, 195888, -281706, -57588, 239860, 293486, -78243, -181845, -37981, -416220, 8609, -30517, -125794, 39783, 70895, -85479, -37865, 104439, -2780, -162542, -240686, -24157, -216561, -36883, -23040, 145993]
18812A7618J30658C5125K32737j203N889H9870a8465B9578a62165M4735L2036
18801h5394m3336A12629Q3213i728A11610C0984K10082D2495k636g5592j58542
18790b34134A6595J07027Q8024a7314l32230e3542E5784A3196L7238J62594c30710
18778b0031j64084k847I4951a70631f1283j59622l3562I217Q4805A1694i9175
18766a08692q9117A5706a97121r262Q1366G8440a01057n3408r5384A7075R0418
18755A07493D4829d55238a33112A34970a84723j6499f7646K2873k38702D1611
18744E993J7439h8224A23990a7033j57649A46557a38774A08695b37774K4848A76889
18732b49456B27476g5499a0232j7287j30907B296K65580N0829D8063i1180L2010
$$ y = [17618, 148276, 35125, 267862, 266659, 272548, 89870, -18465, 29578, -162165, -117430, -85394, -128730, 112629, 195842, -9728, 111610, 30984, 241066, 42495, 39859, -75592, -234134, 16595, 123622, 211646, -17314, -349544, -53542, 55784, 13196, 50434, 213028, -330710, -20031, -184115, -186962, 94951, -170631, -61283, -220905, -254467, 9217, 94022, 11694, -99175, -108692, -197809, 15706, -197121, -206383, -125017, 78440, -101057, -154465, -249849, 17075, 107493, 44829, -455238, -133112, 134970, -184723, -201222, -67646, -44773, -283475, 41611, 5993, 23432, -88224, 123990, -17033, -174682, 146557, -138774, 108695, -237774, -212926, 176889, -249456, 227476, -75499, -10232, -27519, -158426, 2296, 267876, 318705, 48063, -91180, -59170]
18721e9170A18750f5975K9955k58554e7866o499j2585m4603A31690h3680I5897
18709g9174F3029C0334J56349N1323A00763c34641M9122a29282k46938A06687
18698d78999i4347A26362b54073I0063i7384q1179A75658b92542R4446K5772k25676
18687c98000A04384A3466b22644O682b6984j37710B2490i1659l78613A75885f6691
18675a15729D3400J40599a64539I7685m4984k1743b61273A46325a39609k06400
18665c46009A59576c6312A63733i7659F5450O3278J78506A5323P4631Q2604a05029
18653b10572F8675b12100A0689a65042c2061j16966j06850j1439h5249L1047k03241
18642b57443J19801L7338j85315E5805d8597G7109i0901G1369b52795A90639c4545
$$ y = [-59170, 118750, -65975, -36020, -294574, -57866, -64365, -76950, -121553, 131690, -83680, 95897, -79174, 63029, 30334, 186683, 238006, 100763, -334641, -285519, -129282, -376220, 106687, -478999, -94347, 126362, -254073, 90063, -97384, -178563, 175658, -292542, -198096, -172324, -398000, 104384, 13466, -222644, -215962, -26984, -164694, 22490, -91659, -470272, 175885, -66691, -115729, 43400, 183999, -164539, 97685, 52701, 30958, -261273, 146325, -139609, -346009, 159576, -36312, 163733, -97659, 65450, 128728, 307234, 15323, 89954, 172558, -105029, -210572, 68675, -212100, 10689, -165042, -32061, -149027, -255877, -267316, -85249, -54202, -257443, -137642, -100304, -285619, 55805, -48597, 77109, -90901, 71369, -252795, 190639, -34545]
18630D7729c2659p8570e2760k53635J39737B21368c86962J25415g3988C8924b01032
18618A55253c42488A70375b9764A04000A8138K49726a26404j55454F3868N1960
18608A15828C7122c599o2923p6878D4473c9540G8150c3522i606j37843b5622k4595
18596e0217D0434d0160j8146l94531a20351b1431n7981j77815J19603A45208A2347
18584B02372g7309G7245d0896m6172o3880A3752c8366F666a1639A19223b7313
18572a09760N4513j42237B66366e9330A63172b03489B22095k9833a48265B72947
18561A860d740q2341A54473a26888k9754k25525A22783b15923B83474e2007j20983
18550a72990l4410A00978a19098A6393M9278f4148E9417b24400r2890c3082k24871
$$ y = [47729, -32659, -111229, -52760, -306395, -166658, 221368, -386962, -261547, -73988, 38924, -201032, 155253, -342488, 170375, -29764, 104000, 18138, 267864, -126404, -281858, 63868, 115828, 37122, -3599, -66522, -143400, 44473, -39540, 78150, -33522, -9606, -147449, -25622, -50217, 40434, -40160, -58306, -452837, -120351, -21431, -79412, -257227, -137624, 145208, 12347, 202372, -77309, 77245, -40896, -87068, -150948, 13752, -38366, 6666, -11639, 119223, -27313, -109760, -55247, -197484, 266366, -59330, 163172, -203489, 222095, 192262, -148265, 272947, 1860, -4740, -87081, 154473, -126888, -156642, -382167, 122783, -215923, 283474, -52007, -172990, -207400, 100978, -119098, 16393, 65671, -64148, 59417, -224400, -317290, -33082, -257953]
18539b57953N002A2283c54869A69756a61916n8766Q3679a1214H8288b83657L8897
18528b44760a6291A64413a74482g9036k04925f9590C59928B8228K1237P675b57473
18516e056G6198N3177c16436b0243D9935J05594a68501B5232L1422b0872j40580
18505a61452d5628m0038A44873b10126A60293d9093k18399a05342k61472A70025
18494A63984e9979o4625k30145a29663L5617C5201d718l5875C10875I6846b4044
18482B26090B4611J05778c9801A7612K1033K9326b8981k44085D9084d94924A917
18470c23680c307A0401c2702a4935k55756A40360F2108a30924B50874H1175J36653
18459B17828d8243E210d34672A81262b84708A60160G5264C5192b81363c1067B0078
$$ y = [-257953, -252951, 12283, -354869, 169756, -161916, -220682, -137003, -11214, 88288, -283657, -244760, -16291, 164413, -174482, -79036, -283961, -69590, 359928, 28228, 49465, 57140, -257473, -5056, 76198, 129375, -316436, -20243, 49935, 155529, -168501, 25232, 56654, -20872, -161452, -45628, -85666, 144873, -210126, 160293, -49093, -267492, -105342, -366814, 170025, 163984, -59979, -124604, -354749, -129663, -94046, 35201, -4718, -40593, 310875, 96846, -24044, 226090, 24611, 130389, -39801, 17612, 38645, 67971, -28981, -273066, 49084, -494924, 1917, -323680, -3307, 10401, -32702, -14935, -270691, 140360, 62108, -130924, 250874, 81175, 217828, -48243, 5210, -434672, 181262, -284708, 160160, 75264, 35192, -281363, -31067, 20078]
18447H49a95521A01120P4600a12494A52176h2918o399A38309c47972e4702B40254
18435I7318C6369f6769k97680A019i9358j46783m5148a30163J0534p5197p0859
18424b65685a16237k34326a19087o6218A25581a55550m0225i4458A5431J57787
18414A73218d12402E4840b43373a08779A87289a80851M7241c8002r5562d49I7077
18402B34120I988N5434b5870l2621k42544A39198a74095A57417b13431i2613C9554
18390h857m1280l234K6321j48635b2216j16664F9026b44559O3104r1602e4930
18378B46564J18260g7558D9618A3252R5989J06136c87234J90961j09758E5529
18367a50391E4080c33656c413A665J36507b29692A82932r0006k226Q9871M8118
$$ y = [849, -195521, 101120, 175720, -112494, 152176, -82918, -89317, 138309, -347972, -54702, 240254, 97318, 36369, -66769, -364449, 1019, -99358, -246141, -291289, -130163, -119629, -194826, -265685, -116237, -350563, -119087, -185305, 125581, -155550, -195775, -94458, 15431, 173218, -412402, 54840, -243373, -108779, 187289, -180851, -133610, -38002, -133564, -449, 97077, 234120, 9988, 65422, -25870, -58491, -301035, 139198, -174095, 157417, -213431, -92613, 39554, -8857, -50137, -53371, -27050, -175685, -22216, -138880, 69026, -244559, -181455, -273057, -54930, 246564, 364824, -77558, 49618, 13252, 109241, 215377, -387234, -196273, -306031, 55529, -150391, 54080, -333656, -3413, 1665, 138172, -229692, 182932, 92926, 90700, 180571, 228689]
18356B28689A00442b4017o6220d0446I8195b96784F4849i8674r0487F4216b05533
18344A16176b37017A36878L988a04485d8621b1629A06159a56749A65457b346l36880
18333c39226B3288d7582B06919h2867J0152A04762a50649C31507j46103L3728
18323B19132e30013H7109b50108B42750e616q1320J2349r8903C68967I4699K4097
18312A18796c81571a45230g976k99572N4665I1952b68831g5912i567m2472j6747
18301f8786I1908a93253d5913p3041I4967b03867A9685j97J86810a48238A57311
18289a31694b7375j74716f3172C4722c37463J43675m8996b378B92982H9539K21906
18278C11445b16996A97925b4682A05794C9836a39395j3824p7253G6500a01667
$$ y = [228689, 100442, -24017, -90237, -40446, 98195, -296784, 64849, -98674, -189161, 64216, -205533, 116176, -237017, 136878, 140866, -104485, -48621, -21629, 106159, -156749, 165457, -2346, -339226, 23288, -47582, 206919, -82867, -72715, 104762, -150649, 331507, 185404, 219132, -530013, 87109, -250108, 242750, -5616, -86936, -74587, -173490, 368967, 94699, 118796, -381571, -145230, -7976, -307548, -252883, 91952, -268831, -75912, -9567, -52039, -68786, 91908, -193253, -45913, -118954, 94967, -203867, 19685, 19488, 206298, -148238, 157311, -131694, -27375, -202091, -63172, 34722, -337463, -193788, -242784, -2378, 292982, 89539, 311445, -216996, 197925, -24682, 105794, 39836, -139395, -153219, -230472, 76500, -101667]
18267b00593j11568A92807g1383r8289L0662C9778J97341a5107A35274a12219
18256c16909e7273A03837P6676a42163E2520b92438J29114j2275O8342B17896
18245a68442q7933B6850L39187p5085j42093A6870g9503k93270a46547n0633j9007
18234b16187A22465a52298A55685a27577d0138D0264L13235h5585J1402A71911
18223A75229A5391a63448C890K8464J27226d03185a67599M7231L9822A11932f7336
18211g5319j81660A50664n2949A2911Q1724b26462F0711h7711c4931r8945A221
18199i2689l5295B10821A00006D6846a70522C47009b43520a01789n9490C9682
18188a69226c8245J3647A27155a07730D8605e8396k11855B41023i8538A54597
$$ y = [-200593, -312161, 192807, -71383, -169672, -139010, 39778, 237119, -15107, 135274, -112219, -316909, -57273, 103837, 180513, -142163, 52520, -292438, -163324, -175599, -107257, 217896, -168442, -256375, 26850, 366037, 290952, 148859, 16870, -79503, -372773, -146547, -197180, -216187, 122465, -152298, 155685, -127577, -40138, 40264, 353499, -85585, -74183, 171911, 175229, 15391, -163448, 3890, 32354, 159580, -403185, -167599, -120368, -80546, 111932, -67336, -75319, -256979, 150664, 97715, 12911, 94635, -226462, 60711, -87711, -34931, -133876, 1221, -92689, -127984, 210821, 100006, 46846, -170522, 347009, -243520, -101789, -161279, 39682, -169226, -38245, -24598, 127155, -107730, 48605, -58396, -270251, 241023, -98538, 154597]
18177a38670b5122k34849B19i0797A16735a79600Q7769o0281d7354a3723o5837
18166g9560C09135a40855g655q8716F5481b12892B057b19076R1663o6853C6248
18154d2451C0265b88156I2658a95796K8756G846O2390c1810A8186a4726A24022
18142A03249a22368b1729j59038A67224h1916p3917D21688a52307B09922c01704
18131a69643j44446J19647h7496A7979Q1663a00982k32790g4869m5762j72865
18121b93496A40659a3833l27878g028m1962n8412G4364c13856F1559d3819H3482
18109A96661a79350C4038N4451J16524a43513F7161J09586B9541i0789B06181
18098h7322J4005B6735a3188k5375a2582A29203l4212N0192n1352b28304a7887
$$ y = [-138670, -25122, -259971, 219, -90797, 116735, -179600, -91831, -152112, -47354, -13723, -79560, 309135, -140855, -7655, -96371, 65481, -212892, 2057, -219076, -127413, -194266, 36248, -42451, 30265, -288156, 92658, -195796, -167040, 7846, 70236, -31810, 18186, -14726, 124022, 103249, -122368, -21729, -180767, 167224, -81916, -155833, 421688, -152307, 209922, -301704, -169643, -314089, -194442, -87496, 17979, 99642, -100982, -333772, -74869, -120631, -293496, 140659, -13833, -341711, -7028, -48990, -107402, 74364, -313856, 61559, -43819, 83482, 196661, -179350, 34038, 88489, 205013, -143513, 67161, 176747, 29541, -90789, 206181, -87322, -73317, 26735, -13188, -38563, -12582, 129203, 94991, 145183, 93831, -228304, -17887]
18086B04436o6291a28748B30972b82712J30936A07469b90721J8709R7332K019
18076a72661j02641O9206M6609J4750E28a36816o1389B04718n5129j465g9459
18064a32873g944j29294B39262D9333i0787j42328A05752c59196J20617k91g5759
18052b01124g1957o084A68843K08277E3599c57661m6640p5818A00617J50837a71833
18040b14646l7654G9091K4317e1641B65675a15445D4137m569d7833B13785c776
18028b88197M0818J23044L7770G2260b98520d1313F4475b22550A89977a38070
18017f7613q088D6157c8609j33012b3065q6672d6958B17058B0536J49167o1492
18006A08211k9061J66068C6169d4931m14037i9415I7363F721c13788E7779a70985
$$ y = [204436, 138145, -128748, 230972, -282712, -151776, 107469, -290721, -272012, -174680, -172661, -275302, -206096, -159487, -144737, 528, -136816, -198205, 204718, 149589, 148124, -79459, -132873, -7944, -137238, 239262, 49333, -90787, -233115, 105752, -359196, -238579, -238870, -75759, -201124, -71957, -78041, 168843, 377120, 53599, -357661, -404301, -480119, 100617, 251454, -171833, -214646, -252300, 79091, 103408, -51641, 265675, -115445, 44137, 39568, -47833, 213785, -3776, -288197, -247379, -124335, -86565, 72260, -298520, -41313, 64475, -222550, 189977, -138070, -67613, -75701, 46157, -38609, -171621, -23065, -109737, -46958, 217058, 20536, 169703, 108211, 79150, 245218, 36169, -44931, -458968, -99415, 97363, 6721, -313788, 57779, -170985]
17994H1834c10192A91692p2753I293o31P5663h4846a1267j17334j56492A50707
17982H2629h9232l3914J8089J2236E677L2058J93728l9112f63733I9633b95043
17970a08630A33701J5225h9996m4682A82685a41363B2812d8806A53416c34789
17959A63566h1439j28482J1698D4657E629h5229A93590b44438B78718H7264A3044
17947c22474B6818b33349a06362L0985r1489o7710A33710b84901B20439e8779
17936B90882f3055K4702C41183F5856J59428e4580J1086H0493a75260A24602a09737
17924b24243j90476d1228J6186D7865b9307j88824F8655O543a58309k1067d8318
17912a57365k19870A22304d5311o022m8539J0540P023F4289K89558j73416p8682
$$ y = [81834, -310192, 191692, 118939, 9293, 8662, 84325, -84846, -11267, -128601, -285093, 150707, 82629, -89232, -123146, -105057, -92821, 5677, 37735, 231463, 192351, -663733, 99633, -295043, -108630, 133701, 148926, -89996, -134678, 182685, -141363, 22812, -48806, 153416, -334789, 163566, -81439, -209921, -198223, 44657, 5629, -85229, 193590, -244438, 278718, 87264, 13044, -322474, 26818, -233349, -106362, -75377, -166866, -234576, 133710, -284901, 220439, -58779, 290882, -63055, -38353, 341183, 65856, 225284, -54580, -43494, 80493, -175260, 124602, -109737, -224243, -414719, -41228, -25042, 47865, -29307, -218131, 68655, 75198, -158309, -179376, -48318, -157365, -377235, 122304, -45311, -51333, -99872, -89332, -82309, 64289, 353847, 180431, 101749]
17901A01749a18235k3049A80159g4690B889e9612B10881g7567A0467h7070k07472
17890b94542A01070b04651C2528g6787E618b54842I938K7254J7611B3591d8576
17878a11422I4120f8659B14111f1390j07576A34801b32274E3598g3102L5387A71634
17866a88277A2002O9131a70297B26338J07346a83088h9582G1476O8932E1914K00954
17855B52868c16076D05834a30650F8672Q3333a7720k68787i3081A53261a31473
17844a26677K7919A52414a71181M4296m6121k96142D2468K8257A3578a60321o9262
17833b29583B34247b40321b0964A01660a47619g415j86689B04068K75813h3397
17822b99942B62350b20007m9604A46932k0630i9684J9671H3648K17124e5636A80251
$$ y = [101749, -118235, -141284, 180159, -74690, 2889, -59612, 210881, -77567, 10467, -87070, -294542, 101070, -204651, 32528, -76787, 5618, -254842, 9938, 37192, 54803, 23591, -48576, -111422, 94120, -68659, 214111, -61390, -168966, 134801, -232274, 53598, -73102, -37715, 171634, -188277, 12002, 81133, -170297, 226338, 333684, -183088, -89582, 71476, 140408, 51914, 252868, -316076, 405834, -130650, 68672, 152005, -17720, -286507, -93081, 153261, -131473, -126677, -98758, 152414, -171181, -126885, -173006, -469148, 42468, 70725, 13578, -160321, -229583, 234247, -240321, -20964, 101660, -147619, -7415, -194104, 204068, 479881, -83397, -299942, 262350, -220007, -269611, 146932, 126302, -99684, -80013, 83648, 300772, -55636, 180251]
17810g6638G3781a16555A22378k3703a40693C89823A91389d53854a77571g6282
17799b78611a11067N0712o3894j4549C86497A79882Q4552f7733m0953J5936J8969
17788g3781k07415F1952a95187P6665j38383A98966b79168A34450B2141Q5730
17778A07871C0074b60261R1816E4801d4161A74523K55819k01014b03886A14900
17767g0313I8261l6371b17629H5024J23272K3865c3500m6029A03381b2535G7050
17755A9988a64457A31743K7512e5798A36035K0651a97922e5705A01388c03952
17744b75410A08542h9909E3802B4867L15771a13730C5322J05501F3844c1838B67062
17732B10881a83755K1515G2623B6752b60630j63396A29895a83007m2542a08907
$$ y = [-76638, 73781, -116555, 122378, 98675, -140693, 389823, 191389, -453854, -177571, -76282, -278611, -111067, -60355, -124249, -138798, 386497, 179882, 264434, -67733, -108686, -92750, -73781, -281196, 61952, -195187, -118522, -256905, 198966, -279168, 134450, 22141, 107871, 30074, -260261, -168445, 54801, -44161, 174523, 430342, 229328, -203886, 114900, -70313, 98261, 61890, -217629, 85024, 208296, 232161, -33500, -79529, 103381, -22535, 77050, 19988, -164457, 131743, 159255, -55798, 136035, 156686, -197922, -55705, 101388, -303952, -275410, 108542, -89909, 53802, 24867, 340638, -113730, 35322, 140823, 63844, -31838, 267062, 210881, -183755, -162240, 72623, 26752, -260630, -424026, 129895, -183007, -225549, -108907]
17721B57975b87283A75174e0927j98255a11920C4291a25881K7406c62B63846a22700
17709F8907Q8458R9541j25242K59236A86089c0873A56268J02552j9202b76911
17698h0825k8584E5139O4338D7189K70306a03392B96740j34872b59610a02976
17687B36196k9308D9504O7454c74971a24873k82724a90560n9791C72219F7749
17676a78929d8678B44558g772j57427e466A49789a56824B41733a6573B20252C5450
17664B51408f2482A23507c6178C4915a80813Q2652A9896a40507A52966f9344r2802
17653a62146B39531b22343B90959a66935f9742d857l2523o4062L9545r9160b2967
17641A71118B5701a10967k40639B32521a7910D80a38344A35439l5452K35431n4166
$$ y = [257975, -287283, 175174, -50927, -249182, -111920, 34291, -125881, -98475, -362, 263846, -122700, 68907, 157365, 256906, 131664, 390900, 186089, -30873, 156268, 258820, 239618, -276911, -80825, -109409, 55139, 119477, 47189, 317495, -103392, 296740, 161868, -259610, -102976, 236196, 206888, 49504, 116958, -374971, -124873, -407597, -190560, -250351, 372219, 67749, -178929, -48678, 244558, -7772, -165199, -5466, 149789, -156824, 241733, -16573, 220252, 35450, 251408, -62482, 123507, -36178, 34915, -180813, -98161, 19896, -140507, 152966, -69344, -162146, 239531, -222343, 290959, -166935, -69742, -4857, -37380, -101442, -61897, -161057, -22967, 171118, 25701, -110967, -351606, 232521, -17910, 480, -138344, 135439, 99987, 335418, 281252]
17630B81252f5602k6777F4742K0819j7839J03527H4671K0335e0187q48A46649
17618b96170R0883A55480M6797I133K95205d0238A46590a06340E9190J3798Q3762
17607A56750A7804a39470B08537g2182p3155F9852a04840A85011b7681A19863
17596B34082J15533e1564j10840j53180a52543M0989B67771a30616e2045C6996
17585A30694N0207b36896G4105N6474b0940B85551H5219Q8516a22740o8069G3543
17573b92971F4849O7254a46649d945C3452a76858Q2270n3863A67060O692b5548
17561A54068o0981K00925o459A6146i1344a9704A4712N6943l705a77881d2292
17549d5663B57104F4845B7429J55912a37269j470l5465C30991i347F3474b06910
$$ y = [281252, -65602, -92379, 64742, 85561, 67722, 171249, 84671, 105006, -50187, -51035, 146649, -296170, -205287, 155480, 202277, 9133, 304338, -40238, 146590, -106340, 59190, 72988, 156750, 17804, -139470, 208537, -72182, -145337, 69852, -104840, 185011, -27681, 119863, 234082, 349615, -51564, -162404, -315584, -152543, -111554, 267771, -130616, -52045, 36996, 130694, 180901, -236896, 74105, 130579, -20940, 285551, 85219, 173735, -122740, -190809, 73543, -292971, 64849, 132103, -146649, -4945, 33452, -176858, -94588, -148451, 167060, 173752, -25548, 154068, 93087, 294012, 287553, 16146, -91344, -19704, 14712, 71655, 67950, -177881, -42292, -45663, 257104, 64845, 27429, 183341, -137269, -138739, -174204, 330991, -9347, 63474, -206910]
17537A32443l5712N4268B5771a37151B57794p3672a47770B7566L5859b77337A96597
17525D75587A85190l3584K2239b66345H4792c4819p5150G4245l4218K94267A59276
17513E3132D110f8349m8684D3843A9108N001L33616H0422J31068J48592A58135
17501A68853g3284A19399J68411G2202J07883c11635B06406l0323b91450I3179
17490A70439D1580N683J26050K41110A29930Q2068A7347J01240b11753D98667
17479e1906A99677a50129B14595l3338a56163a4359q540B09690d4270B19270M0791
17468B60061A27245a24853H1662J44518j02987K9261J91734A02583L21886b4498
17457C05503M540a20272H1061K4497K27181A49470J21490n3433j06930l1272P721
$$ y = [132443, 96731, 150999, 25771, -137151, 257794, 184122, -147770, 27566, 63425, -277337, 196597, 475587, 185190, 151606, 173845, -266345, 84792, -34819, -109969, 74245, 40027, 334294, 159276, 53132, 4110, -68349, -117033, 43843, 19108, 24109, 357725, 80422, 211490, 360082, 158135, 168853, -73284, 119399, 287810, 72202, 180085, -311635, 206406, 176083, -291450, 93179, 170439, 41580, 47263, 173313, 414423, 129930, 211998, 17347, 118587, -211753, 498667, -51906, 199677, -150129, 214595, 181257, -156163, -14359, -22899, 209690, -44270, 219270, 260061, 127245, -124853, 81662, 226180, 123193, 152454, 344188, 102583, 424469, -24498, 305503, 310043, -120272, 81061, 105558, 332739, 149470, 270960, 217527, 110597, 79325, 87046]
17446H7046r511K32725p5496a51375C74435a4669I0903J19698L9175J32947N4845
17435D37568F3685O6491J85006Q1517j63495a4227B11284j4712r6655P4646J67491
17424C42054p9892l6186L59872e1537A65970p4724n122L84903k5003j29237q8588
17413B28199A6696M80215E0848c14267A22269J40562H267J6268d445l7102A10785
17401C922J84179a93542C79559A19086j3392R7833J05282M7385D8534a97813c9851
17389B7286P1861a34025F2017R7151O4419o1316G5068J67541i9708G9276L1459
17378A10735a38236c715A87766K9282P6968q3649a45115D2062A6678N4161J13680
17367A84519a22358e4823B24990B2934L03023A50773a970B7162K54793a36483
$$ y = [87046, 77535, 310260, 234764, -151375, 374435, -14669, 90903, 210601, 249776, 382723, 437568, 63685, 130176, 315182, 396699, 233204, -14227, 211284, 196572, 99917, 174563, 342054, 262162, 225976, 585848, -51537, 165970, 91246, 86124, 471027, 446024, 316787, 228199, 16696, 496911, 50848, -314267, 122269, 262831, 8267, 24535, -4445, -41547, 110785, 3922, 188101, -193542, 379559, 119086, 105694, 203527, 308809, 356194, 48534, -197813, -39851, 27286, 99147, -134025, 62017, 159168, 223587, 162271, 75068, 242609, -99708, 79276, 110735, -138236, -3715, 187766, 217048, 294016, 210367, -145115, 42062, 16678, 70839, 184519, -122358, -54823, 224990, 22934, 325957, 150773, -1970, 27162, 281955, -136483]
17356g4245I8592C3569a58974D9997b01543D41740j21031a5165D9653j2931i9516
17344c570q7462F2802a29680F6799K63521C8117b12145C29486j8174F5402J37874
17333B03276J21540r1823L1934r2122H0867a02884f670A11547K85359a7621A41810
17321C80334A02464R7039c8866D9513N7034P6668P9245k067k4035I541K34718
17310B44259r0095N6186J28056A33239b23280B73676p5514G1572N4808a17212
17299h9571j32525C1758i5096F2450J16463G9252A1590J62947O7766f0832j69329
17288b30161O953B35969A14396K3984J34173n648i603D73827A40724K28173j24403
17277B44494a60161C53841o1278o3796D6767O1331J38376J74550A33617d7089
$$ y = [-74245, 98592, 33569, -158974, 49997, -201543, 441740, 320709, -15165, 49653, 36722, -99516, -3570, -91032, 62802, -129680, 66799, 330320, 38117, -212145, 329486, 311312, 65402, 203276, 324816, 232993, 264927, 172805, 80867, -102884, -6670, 111547, 396906, -17621, 141810, 380334, 102464, 199503, -38866, 49513, 106547, 183215, 262460, 260393, 236358, 9541, 244259, 154164, 210350, 338406, 133239, -223280, 273676, 198162, 71572, 126380, -117212, -89571, -222096, 31758, -95096, 62450, 178913, 79252, 11590, 174537, 242303, -60832, -230161, -223208, 235969, 114396, 138380, 272553, 266905, -9603, 473827, 140724, 368897, 244494, -160161, 353841, 292563, 228767, 46767, 108098, 246474, 421024, 133617, -47089]
17266A26873J99891g0945j36795C1020K48835h390j28993B77220J35388H4242
17255A60729J54744p6132b4315f350A32463D0097J18126k554J03619C0276Q3413
17244A13689K52833H9589k7422a3930p3873C58865l9403a9043C67037A50077K32051
17233C82128C3920b1058A69795m4677K05596E1243N31354k85210j15556C3392
17222C29058A42921K09412g9095B59929m8755l3316P7409j16850J78440A06580
17211A29083C1738Q3281k6421K31776a06208G086L32085Q0690r4455l3111c679
17199A43238L35102c988G8987E460L96328A03950M2637Q5011m0203K25953A52380
17187D40980A86096O3561l9882K61488A00704K82842k12A29303K75172A65119
$$ y = [126873, 326764, -70945, -207740, 31020, 279855, -8390, -137383, 277220, 412608, 84242, 160729, 315473, 239341, -24315, -6350, 132463, 40097, 158223, 155669, 259288, 30276, 113689, 366522, 89589, 62167, -13930, -87803, 358865, 319462, -19043, 367037, 150077, 382128, 33920, -21058, 169795, 125118, 330714, 51243, 582597, 297387, 181831, 33392, 329058, 142921, 352333, -79095, 259929, 211174, 177858, 255267, 138417, 316857, 106580, 129083, 31738, 115019, 88598, 320374, -106208, 7086, 339171, 419861, 325406, 292295, -3679, 143238, 478340, -3988, 78987, 5460, 401788, 103950, 146587, 231598, 191395, 417348, 152380, 440980, 186096, 249657, 209775, 471263, 100704, 383546, 383334, 129303, 404475, 165119]
17176a6919B35417G2675L32614j57690R3325A30006J40545H3027k1372J03285
17166A64940J22411g8383D04100l6740Q1929a49792B56801J2040j30919n6298
17156H1624J84317j7894L6377k3686L8514J16389A88408J09379M1729l6101B7747
17144d5478D5667K46766K7329C8548M05797j51027G3972J95797q7176J07047J19270
17133D08910N5419A84171J48488A54666J36049P6710r9453n6370E2456L37585
17123C90041n7345j60452M11314q0187O4084k55054L030M3981k3439J7565C5310
17111B34415p5811K46069j80737L25210B39582C4503M63302j29832K57858C06085
17100C53918j21527e3280C64000j44313K13280j56662p8399l0560L18756j80643
$$ y = [-16919, 235417, 72675, 405289, 247599, 340924, 130006, 270551, 83027, 61655, 164940, 287351, -78383, 404100, 367360, 449289, -149792, 256801, 268841, 137922, 81624, 265941, 248047, 284424, 260738, 299252, 415641, 188408, 297787, 339516, 303415, 27747, -45478, 45667, 292433, 319762, 38548, 444345, 293318, 73972, 269769, 182593, 289640, 408910, 464329, 184171, 332659, 154666, 290715, 367425, 267972, 211602, 52456, 390041, 332696, 172244, 583558, 503371, 567455, 312401, 315431, 359412, 335973, 353538, 35310, 234415, 158604, 404673, 223936, 549146, 239582, 34503, 497805, 367973, 625831, 306085, 353918, 232391, -53280, 364000, 219687, 432967, 276305, 197906, 167346, 486102, 305459]
17090C05459j36069j885N35771C21503j39059K5010J20220J5742J06385j4809
17080D34992L679N3564M3576B28636p3418j0181K37204q546M8450A64008O29367
17069G93375C45642P5399Q8169j34100j29018J10948K07996o9385j61560K48140
17059E82231k67693j11493M86915B31648N75925l89123j55706J71319A50045M57901
17049F07946l124k07282J81734j49996o5877J87881k43803K37286N2931k10598
17039C87098m1041o7953J17433K58147j94556r3639P9602L9375l1582J05291k07421
17028C50754k6935K2210L92601A08910L48859N22216A96846L73614j70159J46144
17018E46445L02225B34268K82572q5237M54424k18839k82271K88825l5941J73619
$$ y = [305459, 169390, 167505, 703276, 321503, 182444, 207454, 327674, 343416, 449801, 434992, 438671, 492235, 535811, 228636, 155218, 145037, 382241, 373695, 422145, 164008, 793375, 345642, 421041, 509210, 375110, 246092, 357040, 565036, 495651, 334091, 582231, 314538, 203045, 689960, 231648, 807573, 418450, 262744, 434063, 150045, 607946, 604822, 397540, 579274, 429278, 363401, 551282, 307479, 544765, 597696, 387098, 346057, 278104, 395537, 653684, 459128, 365489, 445091, 484466, 452884, 558175, 350754, 323819, 346029, 738630, 108910, 457769, 979985, 196846, 570460, 400301, 546445, 848670, 234268, 516840, 431603, 886027, 667188, 384917, 673742, 637801, 811420]
17008H11420l06469M52825k17030B59870N38394m1322k19448K68257k14614P8330
16998F69467j58181M08312j72641m5847j21993J73863P4528l50191K72883M9102
16988G99302C71697O97758m76427J42013k26278K51210Q4740j63351n0874R7859
16978G28347j10635q1723K33025n2945L59422m10160K60686n7814o9762J69158
16968I67599l26302K97524q3978J48664m19518L18809q2338J32180J88344j78161
16958I62823o6946N9585J54163p8671K362l53202L05268n8477K24600k31729o5310
16947H54466k71678L0877L24683r4043N94644o33255Q2567k81740O12016j57245
16937A061292L3833k2691k70216K24765l9207K25712j638L496J93310k68425L8153
$$ y = [811420, 504951, 957776, 740746, 259870, 798264, 756942, 537494, 805751, 591137, 669467, 511286, 919598, 746957, 701110, 579117, 752980, 827508, 477317, 750200, 799302, 371697, 1069455, 593028, 735041, 508763, 759973, 844713, 681362, 630488, 728347, 617712, 535989, 769014, 716069, 1075491, 665331, 926017, 868203, 798441, 967599, 641297, 938821, 854843, 1003507, 583989, 902798, 820460, 952640, 1140984, 962823, 895877, 955462, 1109625, 1030954, 1033316, 680114, 985382, 926905, 1151505, 919776, 854466, 582788, 613665, 938348, 844305, 1438949, 805694, 888261, 606521, 1218537, 1061292, 1095125, 1072434, 802218, 1026983, 987776, 1213488, 1211850, 1215346, 1408656, 1140231, 1178384]
16926A178384J51524n1183m0228k03313N5002J94236k99581J34203K09522j79922
16916A148644N86396l13558N2731l10603L23328m62539K45270M82690l38752k33725
16906A179882M93040k44399k6634k54655K45410k1626J05953O4931q2323K10235
16896A669814K90661l95641j11007Q5873K29443l61684J07597L36666J49656j44393
16886A856985k1416k96824K18372L046M61698J16158n71631K1126L69207k27116
16876A929605K51763k63549K11397K7242M8758p1408K50517l31719K5090j45516
16866A932180N8558P6191M39280k85711L73427l91495K34439k1439j221J12103
16856B526312r1784L60864K1138L8469j91616j08507r2427K68263R5686j48100
$$ y = [1178384, 1329908, 1278725, 1238497, 1035184, 1090186, 1284422, 984841, 1119044, 1328566, 1148644, 1735040, 1421482, 1474213, 1163610, 1486938, 1024399, 1269669, 1752359, 1413607, 1179882, 1672922, 1428523, 1401889, 1147234, 1392644, 1371018, 1476971, 1541902, 1459579, 1669814, 1960475, 1564834, 1453827, 1539700, 1769143, 1407459, 1515056, 1851722, 2001378, 1856985, 1835569, 1538745, 1757117, 1760163, 2221861, 2338019, 1766388, 1787514, 2156721, 1929605, 2181368, 1917819, 2129216, 2156458, 2205216, 2133808, 2384325, 2052606, 2077696, 1932180, 1990738, 2066929, 2506209, 2220498, 2593925, 2202430, 2436869, 2415430, 2414209, 2526312, 2434528, 2795392, 2816530, 2854999, 2663383, 2554876, 2462449, 2730712, 2826398, 2678298]
16846B678298L02659j17841K17086N8604l35690M66721k95281N57127l75512J83121
16836C339292Q5138M5112J24784j6148q1881J24107O7547L72677l92619O16128
16826D284137m65476K67795L5482K50599k27923P7187L64018L0389K07870l8481
16816D785597L84554j01219Q9955L47685j89768k5437K89458J80466O2423N1644
16806E875358K0607J14627J96800L88061j41141p0943N61263r6393J24770K20409
16796G193418J7850J05244M60585J27400K45638L09578J62105K88570L54025J43065
16786I407478m8645N97360n9259L10833L85604M19390M79549K72728K58512L37604
16776A2361154J03421P35349M15551L83643j25995Q78574O55645M59019L98750
$$ y = [2678298, 2980957, 2863116, 3080202, 3138806, 2803116, 3269837, 2974556, 3531683, 3156171, 3339292, 3424430, 3469542, 3594326, 3578178, 3496297, 3620404, 3687951, 4060628, 3668009, 4284137, 3818661, 4086456, 4121938, 4372537, 4144614, 4221801, 4585819, 4616208, 4824078, 4785597, 5170151, 5068932, 5158887, 5506572, 5316804, 5291367, 5580825, 5761291, 5823714, 5875358, 5895965, 6010592, 6207392, 6595453, 6454312, 6383369, 6944632, 6848239, 6973009, 7193418, 7211268, 7316512, 7777097, 7904497, 8150135, 8459713, 8621818, 8910388, 9264413, 9407478, 9358833, 9956193, 9896934, 10207767, 10593371, 11012761, 11492310, 11765038, 12023550, 12361154, 12464575, 13199924, 13615475, 13999118, 13873123, 14751697, 15407342, 15866361, 16265111]
16767A6265111P69236L94583R49147O32797P53005L55307Q89244J206788N11486
16758B2726704J271674O97090R91444J402978R18356J399947R42005J414380J800489
16749C3565067J507079J677595J901530K174737J813807K140694K534696K469704
16741D9784909L145926K724922L146272L506364L704496L890959M509405M207365
16733G8620618M834549N512474N063092O347243O199608O323316P247411O930826
16725A27079137P306911P256342P288003P523846O715154O870883N469364M752866
16717A80262506L950075K643108J723144k51727j171757k702200l668982m844599
16709A75939568n652581o438865p111159p325763p554087p507277p231823p277947
$$ y = [16265111, 17034347, 17428930, 18378077, 19010874, 19763879, 20119186, 21008430, 22215218, 22726704, 23998378, 24695468, 25686912, 27089890, 28008246, 29408193, 30350198, 31764578, 33565067, 35072146, 36749741, 38651271, 40826008, 42639815, 44780509, 47315205, 49784909, 52930835, 55655757, 58802029, 62308393, 66012889, 69903848, 74413253, 78620618, 83455167, 88967641, 94030733, 100377976, 106577584, 112900900, 120148311, 127079137, 134386048, 141642390, 148930393, 156454239, 163169393, 170040276, 175509640, 180262506, 184212581, 186855689, 188578833, 188327106, 187155349, 184453149, 180784167, 175939568, 170286987, 163848122, 156736963, 149411200, 141857113, 134349836, 127118013, 119840066]
16701A19840066o909456o759135o601936n999664n455779n277264m977940m713631
16693G3145261m101037m121581l488508l813141k931737l145888k782373k746778
16685D6014218k106163k250446j991610k185591j903008j691443j553254j382596
16677C0950107j480461j248291j430167j088956j260901r75343q20540p69747
16669B1875701q41697j155463n04740n99734r96347m84547p79871p33291k65526
16660A5514485o80175k49714o85580l47868m57213k38207p15681r1759n93271
16651A1455017m81315j43138n43639k87570L40887m73315n27519m01410k75686
16642H662312R8109m03415l17631K29633l13606k58012j62681l51080k73537l68798
$$ y = [119840066, 112930610, 106171475, 99569539, 93569875, 88114096, 82836832, 77858892, 73145261, 69044224, 64922643, 61434135, 57620994, 54689257, 51543369, 48760996, 46014218, 43908055, 41657609, 39665999, 37480408, 35577400, 33885957, 32332703, 30950107, 29469646, 28221355, 26791188, 25702232, 24441331, 23465988, 22645448, 21875701, 21034004, 19878541, 19373801, 18774067, 17777720, 17293173, 16513302, 15780011, 15514485, 14834310, 14584596, 13899016, 13551148, 13093935, 12855728, 12140047, 12048288, 11455017, 10973702, 10830564, 10286925, 9999355, 10340242, 9866927, 9339408, 8937998, 8662312, 8760421, 8357006, 8039375, 8269008, 7955402, 7697390, 7534709, 7183629, 6910092, 6541294]
16632F541294Q6604l6323k87749j36602R3450l74564l61432Q2741j29403m65249
16622E012767J80521j34135J49068l30870J99578l39746r1786j39238r432J09534
16612D606261j75466k42480k07019K67688l40765J7314j27645k34163P4755k33384
16602C405096K7291J28715j14262m54997O6033J70371k3780j40735J84711o25895
16592B622548K09591P8881K35386m0432l15085P8777j60372r6473J59605m42499
16582B329927L35394k12860k7475j41200n6187J34652O6122j13895k18241j774
16572B094463j00209K79284j48438j11235M22342l84741j08941J93269j36729
16563A999065K3833k56654j15729o9477Q7570L88161j90311l38477L04830k32048
$$ y = [6541294, 6627898, 6591575, 6303826, 6167224, 6260674, 5886110, 5524678, 5607419, 5478016, 5012767, 5193288, 5059153, 5208221, 4877351, 5076929, 4737183, 4645397, 4506159, 4496727, 4606261, 4430795, 4188315, 3981296, 4248984, 3908219, 3925533, 3797888, 3563725, 3638480, 3405096, 3432387, 3561102, 3446840, 2991843, 3057876, 3228247, 3204467, 3063732, 3248443, 2622548, 2832139, 2911020, 3146406, 3105974, 2790889, 2869666, 2709294, 2612821, 2772426, 2329927, 2665321, 2452461, 2424986, 2283786, 2227599, 2362251, 2428373, 2314478, 2096237, 2094463, 1994254, 2273538, 2125100, 2013865, 2436207, 2051466, 1942525, 2135794, 1999065, 2022898, 1766244, 1650515, 1581038, 1668608, 2056769, 1866458, 1527981, 1832811, 1600763]
16553A600763J2842K78934l96867K97022l51897j73945J32063J94507P8726q8370
16543A583778k68352k97830K20656l3768L44234r6864j6949j00489K2466j42620
16533A214262J15884o0688K6067j62393K5705J29614k68986J24287R428k10789
16523I42391L50940J16710m28475j5585J1289K34059k19807N0612n6253j59387
16513H26494R1558L55975k61566j52691J38372K76819k64665L9218m13894L10192
16503I45812k26380p4659m7420K40698l53J10929j3757Q141j2367k5471n6k6336
16491H78781J05206j75358O5888m05327M43942O3759k21437j46958J2880K24974
16481H46350J40423l67443J42451M7227n1337J41193m41235M50735k95005J09441
$$ y = [1600763, 1613605, 1892539, 1495672, 1792694, 1440797, 1266852, 1398915, 1593422, 1672148, 1583778, 1315426, 1017596, 1238252, 1204484, 1548718, 1451854, 1434905, 1334416, 1356882, 1214262, 1330146, 1269458, 1295525, 1133132, 1158837, 1288451, 1019465, 1143752, 1153180, 942391, 1293331, 1410041, 981566, 965981, 977270, 1211329, 991522, 1042134, 985881, 826494, 918052, 1274027, 1012461, 859770, 998142, 1274961, 1010296, 1049514, 635620, 945812, 719432, 644773, 597353, 838051, 837698, 948627, 934870, 943011, 930644, 905173, 905117, 878781, 983987, 808629, 874517, 469190, 913132, 976891, 755454, 608496, 621376, 846350, 986773, 619330, 761781, 809008, 757671, 898864, 457629, 908364, 613359, 722800]
16471G22800j89184J31311n4661B26799K62342M18850j24303B21859O08161l97635
16461D32385K33400J80395m13138L78062l32252P338k37401K62093n7781K4015
16451D77116K08956j78946K7261k65140M01835j55205J24140j97883m1832j23872
16441B76430k7444J93071l6668Q6862J79928l8594j62072B17970K60479J37481
16431F15930l06893r4253K2099L10741J62145n2485B53624L05635B17523M12635
16421F30158k447k97081L62995c7777D81770J58433k97038I9297L99503q8567
16411D10233A65234J00369J36128i449E96179A75305J30586J95144l4974q9470
16401C76591A29471M67830B35980P6357m464O220j15539P9881p221J17372K05338
$$ y = [722800, 533616, 664927, 610266, 226799, 489141, 907991, 783688, 221859, 830020, 432385, 665785, 846180, 433042, 811104, 478852, 486190, 248789, 510882, 453101, 477116, 686072, 507126, 534387, 269247, 671082, 515877, 640017, 442134, 400302, 276430, 248986, 442057, 405389, 492251, 672179, 633585, 471513, 217970, 478449, 615930, 309037, 214784, 236883, 547624, 709769, 657284, 253624, 559259, 217523, 630158, 627711, 330630, 693625, -37777, 481770, 640203, 343165, 99297, 498800, 410233, 165234, 265603, 401731, -9449, 596179, 175305, 305891, 501035, 466061, 376591, 129471, 597301, 235980, 312337, 307873, 314093, 198554, 278435, 271214, 388586, 593924]
16390E93924A92978K66260j23158M13029l72269p9085j38220K73227A75684Q4859
16380B60543N6113c2472E40454M2193k26285K7408j8204A3159J09963Q0491J17394
16369C21007A35099L75139K5083B05013P0774h2198D40218m2268K04455A30511
16358B74933R7695o3396A46756a49909C78381j660j53807p6409b04778H7588C160
16346D04653R4257A21236O7571Q8669j4361H423L50622A55235a98930A55371k0557
16335A34814J55583A37283L02364k0300r1602d2133E0429J93915P6913j30019
16325A91238L1048M6257b000I0107K4061L50437j33467E5017J44747J4925J43505
16314C58194j38355M22873k61050A39686L50041d4855j6427A26398P3553M3846
$$ y = [593924, 192978, 459238, 336080, 749109, 376840, 297755, 159535, 432762, 175684, 260543, 316656, -32472, 540454, 582647, 356362, 383770, 365566, 13159, 123122, 203613, 321007, 135099, 510238, 535321, 205013, 275787, -82198, 440218, 397950, 602405, 130511, 274933, 372628, 309232, 146756, -149909, 378381, 376721, 222914, 146505, -204778, 87588, 3160, 404653, 498910, 121236, 188807, 277476, 263115, 8423, 359045, 155235, -198930, 155371, 134814, 290397, 137283, 439647, 419347, 327745, -42133, 50429, 244344, 321257, 191238, 222286, 268543, -2000, 90107, 114168, 464605, 331138, 55017, 199764, 214689, 358194, 219839, 642712, 381662, 139686, 489727, -44855, -61282, 126398, 199951, 243797]
16304B43797D4343d5162A14735j7386c8949E19105k28906j20306c1666C40542
16293B93188J2011B5952Q0362A5356A780L04571A12216k3096b25366g1589A17596
16281c221A55694m3905K45477h0419I8065a99669C37941I7908a03073A88002e0026
16269C70616j24070J1572K25360K93076F1307L73535j93834A10394J60666M1716
16259C12776b1325A54080e5766B13009a9183B18210f5311D09586b03476M2126
16249a61350c204A16584e4380D6096M1423a37368N1740C24089n2399j16771J51775
16238C06694b31286g8613K47B37668r6909J15485M4166a68534g216k5315I452
16226C69908q8623r2175G7986n290b32620A08454d5635A00644K38913A27806b74378
$$ y = [243797, 44343, -45162, 114735, 97349, -38949, 519105, 290199, 169893, -31666, 340542, 293188, 305199, 25952, 106314, 15356, 1780, 306351, 112216, 89120, -225366, -71589, 117596, -3221, 155694, 111789, 357266, -80419, 98065, -199669, 337941, 97908, -103073, 188002, -50026, 370616, 246546, 258118, 483478, 776554, 61307, 434842, 241008, 110394, 271060, 312776, -21325, 154080, -55766, 213009, -19183, 218210, -65311, 409586, -203476, -161350, -3204, 116584, -54380, 46096, 87519, -137368, -85628, 324089, 271690, 154919, 306694, -231286, -78613, -78366, 237668, 140759, 256244, 300410, -168534, -7216, -32531, 9452, 369908, 281285, 189110, 77986, 72696, -232620, 108454, -45635, 100644, 339557, 127806, -274378]
16214b96416d4559C3379J66361O9444A2148M63766B29650J37121A58769c0001
16203B76201E1836g7333D805h5706G5681b1265j95912C56805A59823J5523c10779
16191b3376A96266p0743l2916K15924j10019k922H8710m1947b03369q2825E46841
16179A58831l5840b10349d8161A97628E9423L4369k6216j5528O5868m8193c9450
16167d0467E390a46550F596a1021o4245A34732e8634l5974A00316D7731D022a17038
16154B63355I0230a38550E5855d8612a2186B63298m4272a10918k11186C20198
16143C45048a97160E924h9797A00375g9633B32878a72209F5221R5083g916I3520
16131h8633B55518g4571F624L1700d1048k84599a11653b5245D1690a31890o1647
$$ y = [-296416, -44559, 33379, 199740, 269184, 12148, 475914, 229650, 366771, 158769, -30001, 276201, 51836, -77333, 4805, -85706, 75681, -21265, -217177, 356805, 159823, 175346, -310779, -23376, 196266, 125523, 92607, 308531, 198512, 195590, 88710, 46763, -203369, -286194, 546841, 158831, 122991, -210349, -48161, 197628, 59423, 93792, 67576, 52048, 117916, 69723, -39450, -40467, 5390, -146550, 6596, -11021, -75266, 134732, -58634, -94608, 100316, 47731, 4022, -117038, 263355, 90230, -138550, 55855, -48612, -12186, 263298, 219026, -110918, -322104, 320198, 345048, -197160, 5924, -89797, 100375, -79633, 232878, -172209, 65221, 160304, -7916, 93520, -88633, 255518, -74571, 6624, 38324, -41048, -325647, -111653, -25245, 41690, -131890, -193537]
16120a93537c3883E2491J32945I536a65804B71662c88125H855K73810a34711c6006
16108a41274d134o6956D2928b67962j10515B73167g6507A39920P1796K6232L1878
16097B69826j33661f8115C25468g1176o4783j48755J41920A50216j2913a65723
16086C70313j60961H941b77849b4645B01903a53784A71628B2714J04699M376f3151
16074C65632c6037C90703g4893A56898R9399a89092d3838l54731A09824c21353
16063d31165A85602c4590E7125h5347G6095a29386C3478a66719f330k88779Q9934
16052b05175f0332r2025B1416d78732A86706j0822c0824A04157a95514Q7413A4961
16040a57567A47037b85603A00330J28842c44088a16136a7352j14185A10674a46227
$$ y = [-193537, -33883, 52491, 185436, 9536, -165804, 271662, -388125, 8855, 282665, -134711, -36006, -141274, -4134, -71090, 42928, -267962, -378477, 273167, -76507, 139920, 211716, 237948, 269826, 136165, -68115, 325468, -71176, -135959, -284714, -142794, 150216, 137303, -165723, 370313, 209352, 8941, -277849, -24645, 201903, -153784, 171628, 22714, 127413, 131789, -63151, 365632, -36037, 390703, -74893, 156898, 256297, -189092, -43838, -398569, 109824, -321353, -431165, 185602, -34590, 57125, -85347, 76095, -129386, 33478, -166719, -6330, -295109, -205175, -60332, -152357, 21416, -478732, 186706, 175884, -30824, 104157, -195514, -108101, 14961, -157567, 147037, -285603, 100330, 229172, -344088, -116136, -17352, -131537, 110674, -146227]
16029c7534A26312d6830j78700d4925r8307N1228A31029A8938P4058a58855B05655
16017e2450k15595F7470K64426B9879N4114b46898B5034L5145a18201A5676a88129
16005F1747A9013c1502l2342A75805c699B68423n6017i8747r9307e6356j73557
15994b29913M0389b0218l13878H2022c2189j42017B59848l1305b84917c2954r8358
15983a31312E35096A69429M0064c09382M7754f9325p8721j41085I2726D0409L653
15972D4062a09504a2135B5168b6926j38675H8339a54910e2267p2000c9646R593
15961c0053j05280A21338B7537N6325e8674C1715c5270j22965j85753J47793J5845
15950a80350E6671d8233j8491C52989H7395b04953M4857b2729j58341A76025b66955
$$ y = [-37534, 126312, -46830, -225530, -44925, -143232, -92004, 131029, 18938, 92996, -158855, 205655, -52450, -268045, 67470, 331896, 29879, 83993, -246898, 25034, 60179, -118201, 15676, -188129, 61747, 19013, -31502, -63844, 175805, -3699, 268423, 212406, -98747, -198054, -56356, -229913, -189524, -20218, -334096, 82022, -32189, -174206, 259848, 228543, -284917, -32954, -131312, 535096, 169429, 209493, -309382, -261628, -69325, -148046, -289131, 92726, 40409, 44062, -109504, -12135, 25168, -26926, -165601, 88339, -154910, -52267, -124267, -39646, -30053, -135333, 121338, 27537, 83862, -58674, 31715, -35270, -158235, -343988, -196195, -180350, 56671, -48233, -66724, 352989, 87395, -204953, -160096, -22729, -181070, 176025, -266955]
15938h2394K5680Q395q6037k4508a7732j09082k5274I288K2851Q0734j9033a58180
15925b30337b6390k68139B0645d4112A04882J42860a3816q5997j84434A93694
15914i5487l7277C50044i5955A80286a95010A62J68188c832C7166d47054A8916
15902G9216J02031a10214B01389P0190h2317K9032D18854A56082f1319m17512
15892d78831A09732J72158b71590a5731B15982L2295g9039l6586E5103o061f5906
15880F2495K5236G191K24395c9985k45559b4420k10439Q4286d765k9587k37560
15869b71912B7108L13122g2427k19434B43889b53964k8238a13236G1835d3459
15858A2471a39636B3818K26126a56900K0085I3814m5865d8815q132F8217a51626
$$ y = [-82394, -56714, -48319, -134356, -158864, -17732, -126814, -152088, 9288, 32139, 112873, 93840, -158180, -230337, -26390, -294529, 20645, -44112, 104882, 247742, -13816, -99813, -284247, 193694, -95487, -132764, 350044, -95955, 180286, -195010, 162, 168350, -3832, 37166, -447054, 18916, 79216, 181247, -110214, 201389, 271579, -82317, -53285, 418854, 156082, -61319, -478831, 109732, 281890, -271590, -15731, 215982, 248277, -79039, -115625, 55103, 49042, -65906, 62495, 87731, 7191, 231586, -39985, -285544, -24420, -234859, -150573, -4765, -34352, -271912, 27108, 340230, -72427, -291861, 243889, -253964, -282202, -113236, 71835, -43459, 12471, -139636, 23818, 249944, -156900, -136815, 93814, 47949, -48815, -56947, 68217, -151626]
15846a40038f4640B00472h9917K1232c1995j764A36908d22989b3758k07505L4553
15835a96710k54623a7453j98551d6501m8826d0089C02448H0519h0372A149b0848
15823G6420a42553A26236c6392A51095h8131B33799b74674e4051m740k19973J34482
15812a44282J3791M6097n340j81934l4864D75581h6771B80701H1607K0772a36299
15800g7875F2179b42503A31989c63405b6409j15271O4696k23442b7294E4365O4911
15789A19276b20747A57174J1806c48156I2016i1700A92097d3268B8665i1294j8731
15778a10025B42365a48074o2890e4108F0099g3499A21173a35996L9354A47644
15767f0105k1976j79488J02979d5960K0794j79316e6122B01511p5304A7237K28943
$$ y = [-140038, -64640, 200472, -89917, -68685, -31995, -33759, 136908, -422989, -23758, -231263, -196710, -451333, -17453, -216004, -46501, -95327, -40089, 302448, 80519, -80372, 1149, -20848, 76420, -142553, 126236, -36392, 151095, -88131, 233799, -274674, -54051, -58791, -278764, -144282, -130491, -84394, -89734, -271668, -306532, 475581, -86771, 280701, 81607, 102379, -136299, -77875, 62179, -242503, 131989, -363405, -26409, -141680, -76984, -300426, -27294, 54365, 119276, -220747, 157174, 168980, -348156, 92016, -91700, 192097, -43268, 28665, -91294, -110025, 242365, -148074, -210964, -54108, 60099, -73499, 121173, -135996, -96642, 147644, -60105, -82081, -261569, -158590, -45960, -25166, -204482, -56122, 201511, 126207, 17237, 246180]
15756B46180j1332J428c33192A53698a87735J397I7007b90202h8666M514A15632
15744b25834B79239a30198k69648A9721a00756b2284A70593N575h4646a5701A77171
15732F4158c1223k5425K1178k5613j19961g5009L6310A66384K6817b03676A06260
15720d69814E4057B3806J1500J576L7203a57787N8413D7726a28411C20716d2069
15708B13222C8269a4592k64163J37044j7482A67689a42722k46245E5287b57101
15697A65410c0853k28098A2343b80785B37853b63714J07429K0680d4325o2349
15687a06674d3875A558N8543b10719B5732D42Q2300c20269A56292D7469f5274
15675a93265L4277F8353g7580B7114J45141a8048k17701A17403K38333H5292b4616
$$ y = [246180, 234848, 236276, -333192, 153698, -187735, -186338, 97007, -290202, -88666, -84152, 115632, -225834, 279239, -130198, -399846, 19721, -100756, -22284, 170593, 176168, -84646, -15701, 177171, 64158, -31223, -56648, -35470, -61083, -181044, -75009, -38699, 166384, 193201, -203676, 106260, -469814, 54057, 23806, 35306, 36882, 74085, -157787, -99374, 47726, -128411, 320716, -42069, 213222, 38269, -14592, -278755, -141711, -159193, 167689, -142722, -388967, 55287, -257101, 165410, -30853, -258951, 12343, -280785, 237853, -263714, -156285, -135605, -44325, -106674, -43875, 1558, 60101, -210719, 25732, 442, 82742, -320269, 156292, 47469, -65274, -193265, -158988, 68353, -77580, 27114, 172255, -18048, -235749, 117403, 355736, 85292, -24616]
15663b67736a24035C44477A57127a49214C55029a39339G9526O8072L607m523a80736
15651B85236c28838f8048j20478e8192m8812I6097D3351O1674c17259a37123C1570
15639a75559J251a9788H7605B481c8508C16039a07633C3378a48919n9669A31301
15627i6973F719d09617F058L7021c28623b8427r8756J9268n0200A88113l4579
15616A53534b1003C806O440a89178b1473B0183b7199j11903p1969C04315e934
15604b69176J05607Q1558k0660j5064L6855C64859i1819l1430q5242R85e309k78168
15592b83477i9589o0132C72953a30535M5772l77740b04880M1011m6614C2595J14706
15581A47301J48588A43134a18899l78964e5255r6923P3796p0377H2952O7600J11046
$$ y = [-267736, -124035, 344477, 157127, -149214, 355029, -139339, 79526, 147598, 151205, 146682, -180736, 285236, -328838, -68048, -188526, -58192, -107004, 96097, 43351, 105025, -317259, -137123, 31570, -175559, -174308, -19788, 87605, 2481, -38508, 316039, -107633, 33378, -148919, -208588, 131301, -96973, 6719, -409617, 6058, 43079, -328623, -28427, -127183, -107915, -158115, 188113, 153534, -21003, 3806, 10246, -189178, -21473, 20183, -27199, -139102, -211071, 304315, -5934, -269176, -163569, -82011, -102671, -117735, -80880, 364859, -91819, -123249, -208491, -207506, -5309, -283477, -99589, -159721, 372953, -130535, -84763, -462503, -204880, -163869, -210483, 32595, 147301, 295889, 143134, -118899, -497863, -55255, -152178, -78382, -148759, 82952, 150552, 261598]
15570B61598c171n75166a74789f5722F4902f1581C45238b60905P6975D15589c21596
15558D7544K48786f7948A64187l5733C0229L1035Q9624a89969I6494M1129C8049
15546A05001J98998G4015O7824a41985A39118b61250g340l3835E4974c29910a03362
15534B4210f8812B27502h2178E59412B64879r6771b54256e664j26174I137L1423
15523D0560c7309j26315r7958a6076m0797A09686L8746a74427k2856A01977k1136
15512H0841J50600a15184A60447E4724c44535A39247a37114E4826c32894B12507
15501B50517a39280A72757J74793D440K7422L7684Q9810d24555a24914j41137
15491b66051J18862A56981n4927b90804c3783Q880p333a3829q7558A08323b72133
$$ y = [261598, -3171, -578337, -174789, -65722, 64902, -61581, 345238, -260905, -183930, 415589, -321596, 47544, 296330, -67948, 164187, 128454, 30229, 61264, 150888, -189969, 96494, 137623, 38049, 105001, 303999, 74015, 141839, -141985, 139118, -261250, -7340, -41175, 54974, -329910, -103362, 24210, -68812, 227502, -82178, 559412, 264879, 168108, -254256, -5664, -131838, 9137, 40560, -37309, -163624, -261582, -16076, -56873, 109686, 148432, -174427, -197283, 101977, 80841, 231441, -115184, 160447, 54724, -344535, 139247, -137114, 54826, -332894, 212507, 250517, -139280, 172757, 347550, 4440, 31862, 69546, 159356, -424555, -124914, -266051, -147189, 156981, 102054, -290804, -33783, -24903, -32236, -13829, -101387, 108323, -272133]
15479d07933A15529P0205c65687a75747A68045j8865N0687A0120d3255p1852C6265
15467e5206J9723q5666n8289C25140K7826l7177j29182a53069A22268b86558a14075
15455B5357R4802a41937C32304p6537i8522C30144a7425j91285I7144J06234C0476
15443e9708j65341A37041f408A05228a17716e2362k58808C8542a67017C97145
15432I7392K0413l116c33414a57342F3007a3622E8558h4155r8394k52721g5324
15420a85831g7301A60177e2531B34005b03554C3789i5156M2103j88584D0435a8158
15408b14616l44747E8748i4712C6843J46143c54136F0900N6407a44931D96646
15397a81089B27271g6126M657A78508b24424n8678c0262C91514G2329j3713A792
$$ y = [-407933, 115529, 185734, -365687, -175747, 168045, 149180, 199867, 10120, -43255, -115107, 36265, -55206, -35483, -121149, -179438, 325140, 352966, 315789, 186607, -153069, 122268, -286558, -114075, 25357, 120159, -141937, 332304, 255767, -98522, 330144, -17425, -208710, 97144, 203378, 30476, -59708, -225049, 137041, -6408, 105228, -117716, -52362, -311170, 38542, -167017, 397145, 97392, 117805, 114689, -333414, -157342, 63007, -13622, 58558, -84155, -182549, -435270, -75324, -185831, -77301, 160177, -52531, 234005, -203554, 33789, -95156, -53053, -241637, 40435, -18158, -214616, -559363, 58748, -94712, 36843, 182986, -354136, 60900, 117307, -144931, 496646, -181089, 227271, -76126, -71469, 178508, -224424, -283102, -30262, 391514, 72329, 58616, 1792]
15385b83857f6305C37950A9099O9589J75786a03643B7576J92958a87273j95801
15375c83074B74061a63526j1910B1823Q8816B9811c1548A26017D4255j8590c84325
15363C3428k032b56121I3522h9842E7250d30122F5078k5253D808b0225q4541j14109
15351b18875B425b90242J19828A58097a70726n0725C77576c2008C6888K1786d11
15339c11830D6330a32173C53201a28888A03957a72090P3030C4805l92g2331C59315
15327a02893L5661B57579f2221B42927j19110I94J49685a8683j09055F7174d7743
15315a35135j9704h923A64793b16770B42044D0244a91524K419E9201b78357g6631
15303I2085a01583L1080F0818J3877a38330B282a74475B04532K4407a54930A36800
$$ y = [-283857, -66305, 337950, 19099, 88688, 264474, -103643, 27576, 220534, -187273, -383074, 274061, -163526, -175436, 21823, 110639, 29811, -31548, 126017, 44255, 25665, -384325, 33428, 31396, -256121, 93522, -89842, 57250, -430122, 65078, 39825, 4808, -20225, -104766, -218875, 2425, -290242, -170414, 158097, -170726, -221451, 377576, -32008, 36888, 58674, -411, -311830, 46330, -132173, 353201, -128888, 103957, -172090, -99060, 34805, 34413, -72331, 359315, -102893, -67232, 257579, -62221, 242927, 123817, 994, 150679, -18683, -127738, 67174, -47743, -135135, -154839, -8923, 164793, -216770, 242044, 40244, -191524, -189105, 59201, -278357, -76631, 92085, -101583, -70503, 60818, 74695, -138330, 2282, -174475, 204532, 228939, -154930, 136800]
15291b08190B92033O4425a20207B57193A04688B9905Q9732a72645n8483D0258
15280H6134K59990c5752A81573H9265K18096j32391J05268L3838a1629j36458
15270a48087j06540a22099A92527b8549A21010n7615g7157I2027a8787j68660
15260a87447B29955a25382C5052h4234A58242b49547R2232A51200J37645m6348
15250B42497B8386M59369K16092P36994j96523M2394r3510C72436A78778B9302
15239A92069K56828I2191J53687e4834C1783J52641a48233m6150M4430p9161A5287
15227a33911B5957J63191a65536D12482r2513o0063D877J06787n3376O3877m1956
15216H0209j4064K31564A29612E8710a78624A21952a65150A55399p4080k8467
$$ y = [-208190, 292033, 356458, -120207, 257193, 104688, 29905, 119637, -172645, -231128, 40258, 86134, 346124, -35752, 181573, 89265, 307361, 174970, 280238, 314076, -11629, -148087, -254627, -122099, 192527, -28549, 121010, 63395, -77157, 92027, -18787, -187447, 229955, -125382, 35052, -84234, 158242, -249547, -157315, 151200, 288845, 242497, 28386, 487755, 703847, 1440841, 1244318, 1286712, 1193202, 372436, 178778, 29302, 192069, 448897, 92191, 245878, -54834, 31783, 184424, -148233, -194383, -149953, -229114, 15287, -133911, 25957, 189148, -165536, 412482, 319969, 259906, 4877, 111664, 58288, 122165, 80209, 66145, 297709, 129612, 58710, -178624, 121952, -165150, 155399, 81319, 52852]
15206E2852J56817h3539I6760a62719K4159l7770A84975i53A68539n4681J06046
15195B19904j9448a57034e7612B92006H7618k2936b91199A41748b11093l0127
15185b41220A33701l6492K95617C3592b43401i6880A18847m6522h4525g965n5620
15174f3585B12501a77772E9830K17843D2360d2969A63923a3742A90402J77485
15164C67887m5318n5414H1484j0544a82906c9523a7766C46505b41874B11946H6695
15152C74353b9501A12707M2403a2697F0279h8369J0174D1671K57680r0132d76898
15140h7657I7656a84354f8431H6024J33091a25688a4007A00730l4627e2238B3834
15128F7062R345B8551Q8474E7074b55747C43367M8380c1898A96730J04093b9749
$$ y = [52852, 209669, -83539, 96760, -162719, -138560, -176330, 184975, -953, 168539, 113858, 219904, 200456, -157034, -57612, 292006, 87618, 64682, -291199, 141748, -211093, -241220, 133701, 97209, 392826, 33592, -243401, -96880, 118847, 72325, -84525, -7965, -63585, 212501, -177772, 59830, 277673, 42360, -42969, 163923, -13742, 190402, 367887, 322569, 267155, 81484, 70940, -182906, -39523, -17766, 346505, -241874, 211946, 86695, 374353, -29501, 112707, 155110, -12697, 60279, -88369, -78195, 41671, 299351, 209219, -476898, -87657, 97656, -184354, -68431, 86024, 219115, -125688, -14007, 100730, 66103, -52238, 23834, 67062, 76407, 28551, 117025, 57074, -255747, 343367, 391747, -31898, 196730, 300823, -29749]
15116I6062J19182e7491A75093b6235o9132L3001C84055j86421J6114g2059A04610
15104I7845J8423B1790Q549K73347A38603d38956C48973A00853J79763o6776O4084
15093B77924A18701k6033l1583A0647J1571J97891r0289k3485h7263l48364H4804
15081C31338m4422H3220L93170E4702K0103a79427H0936L51586j3137a34300B2136
15069A56332J20233k9220i6249A37491K72761j50251b48603C88961d9414F9038
15058C19284A4269K90928H279J44325n8719b9377I7023l2248A0467M7296L21249
15047C79012A17200K11797J9468C3391c7666B16127a421A50338c5176D53514p2690
15036C80824J27560k15110j05540k0334K5157j1739b6605o2249g936B63288j05398
$$ y = [96062, 215244, -57491, 175093, -26235, -95367, -62366, 384055, 197634, 213748, -72059, 104610, 97845, 116268, 21790, 30339, 303686, 138603, -438956, 348973, 100853, 280616, 213840, 277924, 118701, 92668, 61085, 10647, 22218, 220109, 129820, 106335, -87263, -435627, 84804, 331338, 286916, 83220, 476390, 54702, 74805, -179427, 80936, 432522, 419385, -134300, 22136, 156332, 276565, 247345, -96249, 137491, 410252, 260001, -248603, 388961, -49414, 69038, 319284, 14269, 305197, 8279, 152604, 93885, -29377, 97023, 64775, 10467, 57763, 379012, 117200, 328997, 348465, 33391, -37666, 216127, -1421, 150338, -35176, 453514, 380824, 508384, 293274, 187734, 167400, 192557, 180818, -26605, -88854, -7936, 263288, 157890]
15025A57890d7009B46258K2743K4636J42797A27117P6798D480J23656D3892a3383
15013D43243B10417C9641M58964A32757c3165L262C33111j08865K52779j78161
15003B98864R6111A20407J75701H7317d573B52428C5757L22159j11616a02774
14992C10484o0469D3041f9120j1305B13512K45792A46716e2113B9709J26667j4428
14981A41948J79290h4352D59703k16687L0172P0147j45385J04548q9599b6904
14970B76042q4684b3340j5938l8205D58897j85282R7423A01127d1665C16782A07558
14958B59804N9856A27048E3296Q4306N0180n2096k2381C3837J50904J85636O1562
14947D31939b07630D31006j64767k3019J13169A74524j4387j2905a29771B01977
$$ y = [157890, -47009, 246258, 269001, 293637, 436434, 127117, 203915, 4480, 128136, 43892, -13383, 443243, 210417, 39641, 498605, 132757, -33165, -29903, 333111, 224246, 477025, 298864, 394975, 120407, 296108, 87317, -4573, 252428, 35757, 357916, 246300, -102774, 310484, 250015, 43041, -69120, -80425, 213512, 459304, 146716, -52113, 29709, 156376, 141948, 321238, -84352, 459703, 243016, 273188, 343335, 197950, 302498, 212899, -26904, 276042, 191358, -23340, -39278, -77483, 458897, 273615, 371038, 101127, -41665, 316782, 107558, 259804, 319660, 127048, 53296, 137602, 187782, 135686, 113305, 33837, 184741, 370377, 431939, -207630, 431006, 266239, 243220, 356389, 174524, 160137, 147232, -129771, 201977]
14936B87344K92243k52112K88238k18523H5016b36D02906A49265M57515k41650
14926C65130q3634J5237G0305f7306I6354L99005k02559J7558B9389K77437J04801
14915D11627A39983a281D12620a5662M145A01950L62490D4895J12990L4430p463
14904A84852J63903A23661K33194I3009J4739R4204J11549J13428o2029B4450
14893C49069M3983J03199A16622L20308A84626M8863K23330j98316n0503K77210
14883D85210j54483J31251I6574M40662k27950b9242D54884B06058K45806k5807
14873D26057A17804L25360A66251O3742J08382L4988J01666J03537A16315K01501
14863C17816J77526j89090L1590A25380K37490j6986j69791L08836K9695N9301
$$ y = [287344, 579587, 327475, 615713, 397190, 85016, -236, 402906, 149265, 606780, 365130, 281496, 296733, 70305, -67306, 96354, 495359, 292800, 310358, 29389, 306826, 411627, 139983, -1281, 412620, -15662, -11517, 101950, 464440, 44895, 157885, 192315, 184852, 348755, 123661, 356855, 93009, 107748, 201952, 313501, 426929, 364900, 24450, 349069, 393052, 496251, 116622, 436930, 184626, 233489, 456819, 258503, 208000, 485210, 330727, 461978, 96574, 537236, 309286, -29242, 454884, 206058, 451864, 426057, 117804, 443164, 166251, 229993, 338375, 373363, 475029, 578566, 116315, 317816, 495342, 306252, 337842, 125380, 362870, 345884, 176093, 484929, 514624, 573925]
14853E73925j47375A28227J82837Q6073K397R7734n7041j66558K10187k01277
14843B82579o1232I4604J11613q2345J12356k6869p9292L42178j40137O9259K06850
14832F08217C01596J17391K5608R9749j16636L29819l20251A38132M74647j776
14822F11003j34025A58597K38032J23674B18956j05699L56149J52279B22847K0222
14812B43069R0309M94737k38374J14308A38047j2952K13762J10636r2392j7087
14802C40014J23790j13492K15932k0031k51216A46358J87376K76694k28020J04928
14792D87336k03726L04843k51480J13173K21099j89484k8881K4554K87182j17164
14782F47452k91126j04707L75425j23821j01657J49348J55017r7629j8873j18364
$$ y = [573925, 426550, 128227, 311064, 397137, 399534, 497268, 440227, 273669, 483856, 282579, 221347, 94604, 206217, 123872, 236228, 209359, 130067, 472245, 332108, 401367, 608217, 301596, 418987, 444595, 544344, 427708, 757527, 437276, 138132, 612779, 611003, 476978, 158597, 396629, 520303, 218956, 113257, 469406, 621685, 222847, 243069, 333378, 828115, 589741, 704049, 138047, 125095, 338857, 449493, 357101, 340014, 463804, 350312, 566244, 546213, 294997, 146358, 333734, 610428, 382408, 487336, 283610, 588453, 336973, 450146, 671245, 481761, 452880, 477434, 764616, 647452, 356326, 251619, 627044, 503223, 401566, 550914, 705931, 608302, 589429, 471065]
14772D71065j04698K54579A26730J75949J37562M58838j45509C22433J34565n2185
14762D04813R1704K25269C15607j14402L89287o5199B53269M21570j54248O8541
14752E89132J67285k20951R7087r1468k28036L50597k05484K74185j54359n611
14742E72377P2932J37439l9564j17170k20248N1168M0588L13147O2460q5517q8749
14731F98863k75490L85462j36726j51268N3912L11500n4181L3510j96896J419
14721F70105j56834J02402K64221j24682j55933J71602j38088K45725k39012K61339
14711I00845j20254M2395j22621L66945D99631L86430k92762k0387J8017K88363
14701H79292j28391l0366l228M13294j85017D46895N94046l09125k24214J54105
$$ y = [471065, 366367, 620946, 126730, 302679, 440241, 899079, 753570, 322433, 456998, 404813, 496517, 721786, 315607, 201205, 590492, 525293, 253269, 674839, 520591, 589132, 756417, 535466, 632553, 541085, 313049, 663646, 458162, 732347, 577988, 572377, 645309, 782748, 743184, 626014, 405766, 456934, 497522, 810669, 873129, 787612, 698863, 423373, 808835, 672109, 520841, 574753, 886253, 832072, 865582, 668686, 670105, 513271, 615673, 879894, 755212, 599279, 770881, 632793, 878518, 639506, 900845, 780591, 822986, 700365, 1067310, 499631, 886061, 593299, 572912, 590929, 879292, 750901, 720535, 717307, 1130601, 945584, 446895, 1040941, 731816, 507602, 661707]
14691F61707J17976K0941R8007k85420n6586J4222L78076k11766K24821k17193
14681G44785j26883K68796k5821k02856N49930m31455J38813k78745j3753N56292
14671A179103m65454J33570j9346K283m2368K40633k31282K19678R0041N0245
14661A157103l50932K28976k10581L29009j2541n49403M59066l10061N23014l80270
14651H83380O0206j73128K73712L6738K10089l67004K75713l10406J77647j0117
14641A056830J6540K17962l82590K18499k58254M7619M83059o56694N03636j61402
14631A085205q0032J12483K47918j97176k08379R8288N3559Q7894R3738j02281
14621A191217M7525p0705P6680K28600J78052l61765j69688J43755j19592J80278
$$ y = [661707, 779683, 800624, 898631, 613211, 556625, 570847, 948923, 737157, 961978, 744785, 617902, 886698, 860877, 658021, 1207951, 776496, 915309, 636564, 622811, 1179103, 713649, 847219, 827873, 830156, 787788, 1028421, 797139, 1016817, 1106858, 1157103, 806171, 1035147, 824566, 1153575, 1141034, 591631, 1050697, 740636, 1263650, 883380, 943586, 770458, 1044170, 1080908, 1290997, 923993, 1199706, 889300, 1066947, 1056830, 1073370, 1291332, 908742, 1127241, 868987, 916606, 1399665, 742971, 1246607, 1085205, 1005173, 1117656, 1365574, 1168398, 960019, 1058307, 1111866, 1199760, 1293498, 1191217, 1238742, 1168037, 1244717, 1473317, 1651369, 1289604, 1119916, 1263671, 1144079, 1324357]
14611A324357J35545j1024p01974M24980K05931k75986M27518k77539J67814J00438
14601A520060j08089j65173K17224l90068N41553k73663q3447L29019k15515K06721
14591A578622J1849N081j20921K0360L99740n22291L93789l0379J81261n61390
14581A355721L52289K09311j98035L694j26882J00322K6228j41493K05013J419
14571A787587k42350L41296K53811J10409k41397J22677l2704K95749l35572K45666
14561B305172M6712p8229N00247j45396J81645K50308o106P6503L03903K24335
14551C659094L97884J122155J823398M737758J0516871J5630615K022393j9583268
14543B0326900I656390D443600j639863o57997l85664P6847j18314k1814j69486
$$ y = [1324357, 1459902, 1448878, 746904, 1171884, 1377815, 1101829, 1529347, 1251808, 1419622, 1520060, 1411971, 1246798, 1464022, 1073954, 1615507, 1341844, 1258397, 1587416, 1371901, 1578622, 1590471, 1595552, 1474631, 1494991, 1894731, 1372440, 1766229, 1735850, 1917111, 1355721, 1708010, 1917321, 1719286, 1722980, 1596098, 1696420, 1722648, 1581155, 1786168, 1787587, 1545237, 1886533, 2140344, 2250753, 2009356, 2132033, 2099329, 2395078, 2059506, 2305172, 2351884, 2273655, 2773902, 2628506, 2810151, 3060459, 3054353, 3130856, 3434759, 3659094, 4056978, 5179133, 7002531, 11740289, 22257160, 37887775, 39910168, 20326900, 9656390, 4443600, 2803737, 2145740, 1760076, 1836923, 1718609, 1696795, 1527309]
14534A527309L34473M07551j91749n5413j39485O6945J7275m723K35275j02691
14524B094767K69019l34459K21877M536J61235M6672J40918q1574l76790K05061
14514B351262J89341j57136L65678l16225J72013j94491K83847m69686K05895
14505B430498L35890p8900j889J92875O9898l3128o4531j31602J01100M12991
14495C233202j96941j24301r230l34848M07460k65444K03501N5538M96984m10348
14485C055573O09197j10055n08810K71850J87355R8697n12664N72624k00391J17997
14475C581373m1298l5669M65225m03277J05353J77568r1994M77774m85090K30718
14465C980683k04256M76070k14781L11551J87845j20297k38869J32857J49045
$$ y = [1527309, 1861782, 2269333, 2077584, 2022171, 1882686, 1949631, 1966906, 1962183, 2197458, 2094767, 2363786, 2029327, 2251204, 2255740, 2416975, 2463647, 2604565, 2522991, 2146201, 2351262, 2540603, 2383467, 2749145, 2432920, 2604933, 2410442, 2694289, 2224603, 2430498, 2766388, 2687488, 2685599, 2878474, 2948372, 2915244, 2850713, 2719111, 2820211, 3233202, 3036261, 2911960, 2902730, 2567882, 2975342, 2709898, 2913399, 2968937, 3465921, 3055573, 3664770, 3554715, 3045905, 3317755, 3505110, 3603807, 3091143, 3663767, 3463376, 3581373, 3540075, 3504406, 3969631, 3566354, 3671707, 3849275, 3757281, 4235055, 3749965, 3980683, 3776427, 4252497, 4037716, 4349267, 4537112, 4416815, 4177946, 4310803, 4459848]
14456D459848l07658K36031K68237j78530L13562n3467p4140L81063p6470O1200
14446E029676j35488M34208k65462K55449J16375l60374L52621j18374L74282
14437E682913k01553J1005M53596P3493l20595N12619j2749n6152l9742L82772
14427F485607k29522J75737J73735k36715J84070J06563M90278k37635P2493J14940
14417G099551L47579j64063k588L64975p1024K67559J59791j64480O4467N56220
14407H457987o3442J09305N88548n37349N48108k66310M28016K4720Q0205J87814
14397I557602K72611r3895J37310N35662J14833J19366J55574k3343M96252J36277
14387A1408249L25173O6988Q7349P49498R9442Q8521J019P47707J3689R5272J75369
$$ y = [4459848, 4152190, 4388221, 4656458, 4477928, 4791490, 4738023, 4663883, 5044946, 4968476, 5029676, 4894188, 5328396, 5062934, 5318383, 5434758, 5074384, 5427005, 5308631, 5682913, 5481360, 5492365, 5945961, 6019454, 5698859, 6211478, 6198729, 6142577, 6102835, 6485607, 6256085, 6431822, 6605557, 6368842, 6552912, 6659475, 7149753, 6912118, 6984611, 7099551, 7447130, 7283067, 7280479, 7645454, 7574430, 7841989, 8001780, 7837300, 7901767, 8457987, 8394545, 8503850, 9092398, 8555049, 9103157, 8836847, 9264863, 9289583, 9369788, 9557602, 9830213, 9736318, 9873628, 10409290, 10524123, 10643489, 10799063, 10775720, 11271972, 11408249, 11733422, 11800410, 11887759, 12637257, 12736699, 12825220, 12826239, 13573946, 13587635, 13682907, 13858276]
14376A3858276K10280O3791N13053K12614Q03218K18250J13285M50459J97762
14367A6640988K21595M87952K32884M83187J64971N27108L75060P20313K00440
14358B0054498N81953L38628N09570L17994M54201R63975L80109L02558Q49273
14349B4752759N39998O18995L26222J113773M43060Q19675O53272J148828N88132
14340C1004714O51469R28934Q69799J103148Q89482J249827Q69865J312695J476760
14331D0356693Q00410J741110J107359J676431J067559J748452J718720J686252
14323E1902986J629223J936829K029762K384314K089935K502456K265734K871461
14315F9612700K241822K716388L512281L241555L217432L549793M031329L483201
$$ y = [13858276, 14068556, 14132347, 14645400, 14858014, 15661232, 15879482, 15992767, 16443226, 16640988, 16862583, 17350535, 17583419, 18066606, 18231577, 18758685, 19133745, 19854058, 20054498, 20636451, 20975079, 21484649, 21802643, 22256844, 23220819, 23600928, 23903486, 24752759, 25292757, 25911752, 26237974, 27351747, 27794807, 28614482, 29267754, 30416582, 31004714, 31656183, 32585117, 33454916, 34558064, 35447546, 36697373, 37567238, 38879933, 40356693, 41157103, 42898213, 44005572, 45682003, 46749562, 48498014, 50216734, 51902986, 53532209, 55469038, 57498800, 59883114, 61973049, 64475505, 66741239, 69612700, 71854522, 74570910, 78083191, 81324746, 84542178, 88091971, 92123300, 95606501]
14307I5606501M546458M575547M696729N350646N272864N897081O178651O862009
14299A38986486O661562P388856P948960Q694146R057666R879450R724303J0880789
14291B09222218J1119286J2125289J2534859J3219315J3937704J4394609J4989298
14284C01542578J5812833J5911814J6190501J5905062J6177005J5845251J4435692
14277D11820736J3617230J2424683J0476081Q266200N479868M00581k693524j797061
14269D57994794k044298j848517l095000r122120j1412859j2675719j4457204
14262D03339077j5687865j6072539j6835393j6346408j6552210j6004387j5517919
14255B90322356j4923510j3470768j3365115j2703902j2618686j2224736j0609657
$$ y = [95606501, 100152959, 104728506, 109425235, 114775881, 120048745, 125945826, 132124477, 138986486, 145648048, 153036904, 160985864, 169680010, 178737676, 188617126, 198341429, 209222218, 220341504, 232466793, 245001652, 258220967, 272158671, 286553280, 301542578, 317355411, 333267225, 349457726, 365362788, 381539793, 397385044, 411820736, 425437966, 437862649, 448338730, 456604930, 462084798, 462485379, 459791855, 457994794, 455950496, 454101979, 451006979, 441884859, 430472000, 417796281, 403339077, 387651212, 371578673, 354743280, 338396872, 321844662, 305840275, 290322356, 275398846, 261928078, 248562963, 235859061, 223240375, 211015639, 200405982]
14248B00405982j0265001r691905r528065q024587p926156p778281o753674p105019
14240A33333294n951272o035130n277220m638487n632939m157591m682428l766160
14232I3192067l988608l213125l445738l580275l101568l138080k506961k801151
14224F7416561k352612k567198k191751k309309j649461j648443k123279j812608
14216E0761900j643924j501350j429729r09918j621575j434551j281525j134910
14208C9804418r76193o05557j403655j119030j299533q25102j039160m37665n67573
14199C1530950j404985o38686r84498p76969l83387m59718j093907m61312q05971
14190B4521517l65871o45504m54077m58042r09547m64234n03807r6074o86914
$$ y = [200405982, 190140981, 180449076, 170921011, 162896424, 154970268, 147191987, 140438313, 133333294, 127382022, 121346892, 116069672, 111431185, 105798246, 101640655, 96958227, 93192067, 89203459, 85990334, 82544596, 78964321, 75862753, 72724673, 70217712, 67416561, 65063949, 62496751, 60305000, 57995691, 56346230, 54697787, 52574508, 50761900, 49117976, 47616626, 46186897, 45276979, 43655404, 42220853, 40939328, 39804418, 38828225, 38222668, 36819013, 35699983, 34400450, 33575348, 32536188, 32098523, 31530950, 30125965, 29487279, 28502781, 27725812, 27342425, 26882707, 25788800, 25327488, 24521517, 24155646, 23510142, 23056065, 22598023, 21688476, 21224242, 20720435, 20624361, 19937447]
14181A9937447r568r28410k96808l36439m84080m10185n27043J9806m10579m8236
14171A6505905o34104l07842l52241n4793n33954l68170J35151o62098L0863l09310
14161A3449407q3891k22438m25431k29982k6832l99507K05780p40169o114l53386
14151A1167437J57507m20889J0341j59784k91344o5967k32979R7859o42022Q2144
14141I702303R5214m22827n72258M84081j8188o43156J82732l24832L14465l64809
14131H432725k49817J75393k3650n22721k37293P1011r314J31756j47608k66546
14121G353936j95665J7521k39541J07416k89948J94477m63175l67084O40410k61904
14111F496443j45268j02498j45408l4886l17228J42685j87236j5264P9502j99008
$$ y = [19937447, 19927879, 18999469, 18702661, 18366222, 17882142, 17471957, 16944914, 16964720, 16554141, 16505905, 15871801, 15563959, 15211718, 15156925, 14622971, 14254801, 14389952, 13727854, 13758717, 13449407, 13365516, 13143078, 12717647, 12487665, 12460833, 12061326, 12267106, 11526937, 11520823, 11167437, 11324944, 10904055, 10914396, 10754612, 10463268, 10397301, 10164322, 10262181, 9620159, 9702303, 9797517, 9374690, 8802432, 9286513, 9268325, 8625169, 8807901, 8483069, 8797534, 8432725, 8182908, 8358301, 8334651, 7811930, 7574637, 7645648, 7636334, 7768090, 7620482, 7353936, 7158271, 7175792, 6936251, 7043667, 6753719, 6948196, 6485021, 6117937, 6758347, 6496443, 6351175, 6248677, 6103269, 6068383, 5751155, 5893840, 5706604, 5691340, 5770842, 5571834]
14101E571834q5260J84984l08883J86821m24234K21488k77268o1628M4886l06649
14091D746091M41460n25454K36472j46063J98982l45589K52665o4439l88176M4714
14081D450663J82125m38017R5290N5508j12576q3410m0903k85534l0223K5176
14071C818099M25362l84658N1611j89222M62690k34655l10713J15400J53l7458
14061C716609j26955K98136m816J7282m46612L3385K34308l60482k61001L98247
14051C498101m21082Q5852k74934P37529n41491J8198j70262K03506p7891j07811
14041B949715J99761k65786J41519l38164J34010R3722J41410q9432J31649j69996
14031B928408l99582N12531j93158l56929L0042Q0256J38341j89704J12308m00322
$$ y = [5571834, 5486574, 5671558, 5362675, 5549496, 5125262, 5346750, 5069482, 5007854, 5052740, 4746091, 5187551, 4662097, 4898569, 4752506, 4951488, 4605899, 4858564, 4794125, 4405949, 4450663, 4632788, 4194771, 4290061, 4345569, 4232993, 4149583, 4108680, 3823146, 3792923, 3818099, 4243461, 3858803, 3910414, 3721192, 4183882, 3949227, 3638514, 3753914, 3754067, 3716609, 3589654, 3887790, 3882974, 3900256, 3453644, 3487029, 3721337, 3360855, 3099854, 3498101, 3077019, 3162871, 2887937, 3625466, 3083975, 3102173, 2931911, 3135417, 3057526, 2949715, 3149476, 2883690, 3025209, 2687045, 2821055, 2914777, 3056187, 2966755, 3098404, 2928408, 2528826, 3041357, 2848199, 2491270, 2521312, 2601568, 2739909, 2550205, 2662513, 2262191]
14021B262191J14027L5560j57393j80111J04710N5056k1779J92209j42223j58064
14011B104183Q4529K2974k24475J23702j94158N0710q8675J88327J72742n75484
14001A664375K34224p0959j04785L05678k40482P5547j5209O6278k17591L44009
13991B041085m5160L91522R74842L578769Q693524J6956633Q935009j6637898
13983B4888326A1833550m585505k280691o93466j47375j077927l94855J7789j73268
13974B498252L82320l36306k40366J29443j01420l25101K67906k76210L211K07355
13964B209084j38475J40518j72586K50673k90989j84425L04360k46038p0019J29473
13954A931576j38637l57428K69807L41105l47682J17370p6736n2246K39078k41020
$$ y = [2262191, 2376218, 2411778, 2254385, 2074274, 2178984, 2234040, 2212261, 2404470, 2262247, 2104183, 2188712, 2211686, 1987211, 2110913, 1916755, 1967465, 1878790, 2067117, 2239859, 1664375, 1898599, 1827640, 1722855, 2028533, 1788051, 1863598, 1848389, 1914667, 1697076, 2041085, 1995925, 2387447, 3362289, 6941058, 15634582, 32591215, 41526224, 24888326, 11833550, 7248045, 4967354, 4273888, 4126513, 3048586, 2653731, 2671520, 2498252, 2880572, 2544266, 2303900, 2433343, 2331923, 2006822, 2274728, 1998518, 2001729, 2209084, 2070609, 2211127, 2038541, 2289214, 1998225, 1813800, 2118160, 1872122, 1802103, 1931576, 1792939, 1435511, 1705318, 2046423, 1698741, 1816111, 1739375, 1687129, 1926207, 1685187]
13944A685187L07464m51135o594J36960J26388k35366L12424K6060k05499r4933
13934A600956N0126N3454j95765j25212L68586j25874p5520j65650o9334P9918
13924A395685M6530J14223m2881k30560J5172K03860J81176j6665k41225k31959
13914A193356M1411J61433j18137L03435m37379K19756P9354j40291l0390j01788
13904A170760J4846J20441J66948k36886L82938l13010j61180J27659l4552l13602
13894I24362J39822M7780p4951K66049l30330L34796l67036K2541O7059J27163
13884A157255n7485Q6215p4853K98646p1734j45241j5323j58102m4934P7099K7903
13873A079446N834Q8836Q8604n54547M48474k51011J25913J85786j88941j73835
$$ y = [1685187, 1992651, 1541516, 1534922, 1671882, 1798270, 1562904, 1875328, 1901388, 1695889, 1600956, 1651082, 1704536, 1508771, 1383559, 1752145, 1626271, 1550751, 1385101, 1315767, 1395685, 1442215, 1556438, 1513557, 1282997, 1298169, 1502029, 1683205, 1666540, 1425315, 1193356, 1234767, 1396200, 1278063, 1581498, 1144119, 1363875, 1443229, 1302938, 1272548, 1170760, 1185606, 1306047, 1472995, 1236109, 1619047, 1306037, 1144857, 1272516, 1237964, 924362, 1064184, 1111964, 1037013, 1303062, 972732, 1307528, 940492, 963033, 1030092, 1157255, 1099770, 1185985, 1111132, 1409778, 1338044, 1192803, 1177480, 1019378, 974444, 1051543, 1079446, 1085280, 1174116, 1262720, 708173, 1156647, 905636, 1031549, 1217335, 1028394, 854559]
13863H54559K95900j95363k87499J10017L52848k86781j18969K78136o6966l37602
13853E98280J92113j81686L75973L05045o20532M3884M12245m0584l73993L12593
13843A023338m5692l49809K53924j59488P3548J80309K6666K8936r1813k02727
13833G37192J05151O2960r1156K80621j1936j23623l37594J92056r9837J66571
13823H80405n3936J55144l31333L06080k02121j66518J26269L52214m22314o1952
13813E81938L07349l0714l15947M59919n5936M4971j26806j21803n391O4117l0499
13802G71198K64169D99538L12463O4351k49968L54860k55760q7801J56684j49249
13792F45118J92264D16807n7984M42479J6661L095j81927M3916L4020j811p5613
$$ y = [854559, 1150459, 955096, 667597, 777614, 1130462, 843681, 724712, 1002848, 935882, 598280, 790393, 608707, 984680, 1289725, 669193, 713077, 1125322, 1084738, 710745, 1023338, 977646, 627837, 881761, 722273, 795821, 976130, 1002796, 1031732, 939919, 737192, 842343, 905303, 814147, 1094768, 1082832, 959209, 621615, 813671, 713834, 880405, 826469, 981613, 650280, 956360, 754239, 587721, 713990, 1066204, 643890, 581938, 889287, 858573, 542626, 1002545, 946609, 991580, 864774, 742971, 737580, 801697, 771198, 1035367, 499538, 812001, 876352, 626384, 981244, 725484, 637683, 794367, 645118, 837382, 416807, 358823, 801302, 817963, 821058, 639131, 683047, 717067, 715256, 639643]
13781F39643J41192J92355k06479r5366j54375j36220K78620J7847j89706N09666
13771I97177C72870J25268K19106p5641R5157k65802K71732l8492J87173N9743
13761I51114B65194J11692O18214D94913K3046N9176R8328j44845Q2398o7721
13751E45295J19755P9705B33180J67584J69313M33685m66425j21282J14742o485
13741E24312L84050C02389J28760L68963k81063K00679p7022B33506K72842M7962
13731E54310n5836o5511K36587r9551L8131j86825j33141L99695k9010B68249
13720G90411B61282J76307O835J40459p6859K10256C26177L15224J22054C23137
13709G05271j4325j48035o4950J55861j12949j50415j2704K32333j04260j95368
$$ y = [639643, 780835, 973190, 766711, 671345, 516970, 380750, 659370, 677217, 487511, 997177, 372870, 498138, 717244, 641603, 736760, 470958, 742690, 704198, 891371, 951114, 265194, 376886, 995100, 494913, 517959, 577135, 675463, 530618, 613016, 545295, 665050, 744755, 233180, 400764, 570077, 1003762, 537337, 416055, 530797, 524312, 908362, 302389, 431149, 800112, 519049, 719728, 642706, 233506, 506348, 554310, 498474, 432963, 669550, 569999, 608130, 421305, 288164, 687859, 658849, 268249, 790411, 261282, 437589, 444424, 584883, 508024, 718280, 326177, 641401, 763455, 323137, 705271, 690946, 542911, 477961, 633822, 520873, 370458, 357754, 590087, 485827, 290459]
13699B90459Q4522K64524J61872q8475B48476n6601M53475o0093k30036A24493
13688D33346J18519k53889L92690B95492K25569A35560j7424O9294J04444M39694
13678G31568k25889A53503K14435J27005k9461j72906q1482g7380D90578B32148
13667C22826J70919K01561k42786O742j58940K63697o840j10672j22821m6033
13657B77653G6208N56685P6052k51778p2375p3394J40520p6730A76431J36072
13647C12503K32780j85410j25447L73554B11899J93449r4763J91836j32863j5306
13637C54252A58324J15702l8238K93545k2556A65574A3753P29878k88754D5184
13626D27842J11833O1180j44071B5582N78990k16781K55908j30526k52844K87033
$$ y = [290459, 374981, 639505, 801377, 712902, 248476, 191875, 645350, 585257, 355221, 124493, 433346, 551865, 297976, 690666, 295492, 521061, 135560, 118136, 187430, 291874, 731568, 505679, 153503, 367938, 494943, 465482, 292576, 211094, -77380, 490578, 232148, 322826, 493745, 695306, 452520, 459262, 300322, 564019, 557179, 446507, 323686, 277653, 76208, 632893, 708945, 457167, 384792, 311398, 451918, 375188, 176431, 312503, 545283, 359873, 234426, 607980, 211899, 405348, 310585, 502421, 369558, 354252, 158324, 274026, 235788, 529333, 506777, 165574, 13753, 743631, 454877, 45184, 427842, 539675, 600855, 456784, 25582, 604572, 387791, 643699, 513173, 260329, 547362]
13616E47362A90916N34205B47805J36886K58728J7963j47106F6361K93008L42424
13606G01793k36383K7965j31884q6950P2170J0425j04343P0362C9030k136K82349
13595C19243j26910J2491J38824P5697A62317O3189K06003O7365J86499l06360
13585C79013j71254l3405H1440l5588M98607k58627q5589P7015b3609D18639j118
13574D17521K61510C15148A6411J71199J17012o3353M1738k9706J81747J09519
13564E44567j10911j93659k0088J46733j66520A0545L83811A83948d3062h105
13553D28957B14460J75293r8445R3543A43166K67565j09395a5844A53207K86013
13543D39220N214B00247J25243A40291K45051j59062j420l0122J69620p2266P6854
$$ y = [547362, 190916, 725121, 247805, 384691, 643419, 661382, 514276, 66361, 359369, 701793, 465410, 493375, 361491, 274541, 346711, 357136, 252793, 323155, 39030, 36894, 319243, 192333, 204824, 343648, 419345, 162317, 225506, 431509, 498874, 685373, 379013, 207759, 174354, 81440, 45852, 544459, 285832, 200243, 277258, -23609, 418639, 417521, 679031, 315148, 16411, 187610, 304622, 241269, 283007, 253301, 435048, 544567, 433656, 239997, 219909, 366642, 200122, 10545, 394356, 183948, -43062, -8105, 428957, 214460, 389753, 291308, 384851, 143166, 410731, 301336, -15844, 153207, 439220, 444434, 200247, 325490, 140291, 385342, 226280, 224860, 194738, 364358, 292092, 368946]
13532C68946E2992J62342K23007B3735K74969K11554A60950J82472P79j10747
13522B33454m466O6938N8995R0232j82208o0343K4154J97250A86490J06576I6452
13510I3594K9905e6525B63180N4876j16502k4119K57122j81180m1671K18273j37637
13499B92342k8601b51171C77391J25543A05457b21096C14581q7628M22205l05476
13489C43682A0305J93313m4926J17724f2202C69913A63648J30449K81114E6010
13478F96520F650J38777q292h8357A20940J96341J22906G4534Q2676k6108L46948
13467D78050K545k37201L1118J38637j61599j09057F1702J48029o7819K63509
13457D05421E8630M5337d3804B50568L7594H3519P9733J22150k3029A04244K98210
$$ y = [368946, 52992, 215334, 438341, 23735, 298704, 510258, 160950, 343422, 344201, 233454, 228988, 295926, 354921, 445153, 262945, 202602, 226756, 424006, 186490, 293066, 96452, 93594, 123499, -56525, 263180, 318056, 201554, 177435, 434557, 253377, 211706, 429979, 292342, 263741, -251171, 377391, 502934, 105457, -221096, 314581, 226953, 649158, 343682, 10305, 203618, 158692, 276416, -62202, 369913, 163648, 294097, 575211, 56010, 696520, 6650, 145427, 137135, -88357, 120940, 317281, 440187, 74534, 157210, 131102, 478050, 480595, 243394, 274512, 413149, 251550, 142493, 61702, 209731, 141912, 405421, 58630, 103967, -43804, 250568, 288162, 83519, 163252, 285402, 262373, 104244, 402454]
13446D02454j81618g3219A40611M3872J4839p2367i6181B28356N1190a9337C44072
13434C15729j01170P4369R2623K61866k94990a50737B85266E5239a64427d9475
13423D19083j26824m615o74m7926C3303L51614A35811B4578K91795r5610O3622
13412B84385H1948J51294B9211J60642L14963I8841L12478G2709J32501B4648
13401a04742B17319J43166n1906g8647A74684O5415q1818m9426M4152J03877a66935
13389a55905B99094j38949K78357G8686i750B88049M8432a07678A43368g6720
13378A09975R7537o7111J46558E8651B1829K3189a37627B97616j40488n2047N6346
13367A61427J74008A06799l3215K36025E5378K34872A44672Q7041L2317G6889
$$ y = [402454, 220836, -73219, 140611, 184483, 199322, 126955, -96181, 228356, 279546, -19337, 344072, 315729, 214559, 288928, 381551, 643417, 348427, -150737, 285266, 55239, -164427, -49475, 419083, 292259, 287644, 286970, 239044, 33303, 384917, 135811, 24578, 316373, 220763, 284385, 81948, 233242, 29211, 189853, 504816, 98841, 411319, 72709, 205210, 24648, -104742, 217319, 360485, 308579, -78647, 174684, 240099, 158281, 108855, 153007, 256884, -166935, -155905, 299094, 160145, 438502, 78686, -9750, 288049, 336481, -107678, 143368, -76720, 109975, 207512, 140401, 286959, 58651, 21829, 45018, -137627, 297616, 157128, 105081, 161427, 335435, 106799, 73584, 309609, 55378, 290250, 144672, 231713, 264030, 76889]
13356A81005B0227J24642K94534k16739a9652B35827J69163G4234L1422k3328
13346H2328J01488F9605k1955K88222L6558F2619J05978p1819J12204K80366A55272
13334A55739o4150J39921E8689J32858J37278q6380J7385o1684D1036J85469Q615
13323B35120E1080b9372A9013J40940k7033I945J51691L24681E6645L78099H7973
13311E16600k53179b01746E10639A04107C5973O7075g034C22838J21961A76369
13300C55285H0216K25013A1507J67288b8774A29420J01690G3851J98802q4242
13290A88411M5394L412o7441J37718h0507A10975M2469D9840P9549a34166I9341
13278I4173D2797P5003e3605C63079M4073a33349C83543C8544J28399a7128k05953
$$ y = [181005, 20227, 144869, 439403, 222664, -19652, 235827, 404990, 74234, 105656, 82328, 183816, 69605, 47650, 335872, 372430, 62619, 168597, 96778, 208982, 489348, 155272, 155739, 91589, 231510, 58689, 191547, 328825, 242445, 259830, 198146, 41036, 226505, 235120, 51080, -29372, 19013, 159953, 132920, 9945, 161636, 486317, 56645, 434744, 87973, 516600, 263421, -201746, 510639, 104107, 35973, 103048, -7034, 322838, 444799, 176369, 355285, 80216, 305229, 11507, 178795, -28774, 129420, 231110, 73851, 272653, 188411, 233805, 237217, 169776, 307494, -80507, 110975, 153444, 49840, 129389, -134166, 99341, 94173, 42797, 117800, -53605, 363079, 407152, -133349, 383543, 38544, 166943, -17128, -223081]
13267b23081N0625C61542F8767j5114J02725o2774J43484i6597E7589L07504A74925
13255G0393c5322A41593J9113i3504D29365A34531D3947d7436D51100a14036D5592
13243B6925I666A691J93230J31554j01063j02271D5977K6354b2411n7090a9384
13231a97534A70307C8850A4957M5932c0791B41586A01108a0294A37923l3802A8435
13219A20292a79928D7606J33666A5191e1707j61505B98248f3131B67502F2711
13208f3747A99695b42411a07435A51226c30107B01418J45239j03772r827D0179
13197a33293l1963A10543a47168D69820j26962p5582K48841E5987J98441b5584
13186B20392E0189J12632d74473a26431A48624K9845G2271j8871b9445f912j94839
$$ y = [-223081, -172456, 361542, 68767, 53653, 156378, 93604, 237088, -96597, 57589, 365093, 174925, 70393, -35322, 141593, 160706, -93504, 429365, 134531, 43947, -47436, 451100, -114036, 45592, 26925, 9666, 1691, 194921, 326475, 225412, 123141, 45977, 72331, -22411, -79501, -19384, -197534, 170307, 38850, 14957, 60889, -30791, 241586, 101108, -10294, 137923, 104121, 18435, 120292, -179928, 47606, 181272, 15191, -51707, -213212, 298248, -63131, 267502, 62711, -63747, 199695, -242411, -107435, 151226, -330107, 201418, 346657, 242885, 233058, 40179, -133293, -165256, 110543, -147168, 469820, 342858, 267276, 516117, 55987, 254428, -25584, 220392, 50189, 162821, -474473, -126431, 148624, 178469, 72271, 53400, -29445, -6912, -201751]
13175b01751A8327a96095C96442a15168C95666j53849r3962E4786J57577J56693
13165C69056r5740m7628a22220A56258A3418K61025A33813g7921k7999C9651J82749
13154B22400a43306E7687J9776a83998H5600L19437b15804G9523N6400K3875J06684
13143B66482A0467J8057L1966a71339a0704n0658p0568B4103N4758K42902A18279
13131A52292J26102A28703b15454A5028K12768J37831F79c8974A90364M9570J6935
13120B56869a30878A65987a15355j50076A64820b13084c7666B07521J80363b0352
13109B22748i4232A52665b4916A15240B2770K29897I4084l5083N7984d4012B68454
13097b87704B28112B6001L24509F0983J21276p3140J61987b83214J27850c6173
$$ y = [-201751, 18327, -196095, 396442, -115168, 395666, 241817, 147855, 54786, 212363, 369056, 273316, 225688, -122220, 156258, 13418, 274443, 133813, -77921, -105920, 39651, 222400, -143306, 57687, 77463, -183998, 85600, 405037, -215804, 79523, 135923, 159798, 266482, 10467, 28524, 60490, -171339, -10704, -61362, -131930, 24103, 78861, 321763, 118279, 152292, 278394, 128703, -215454, 15028, 227796, 365627, 679, -38974, 190364, 239934, 256869, -130878, 165987, -115355, -265431, 164820, -213084, -37666, 207521, 387884, -20352, 222748, -94232, 152665, -24916, 115240, 22770, 252667, 94084, 59001, 116985, -44012, 268454, -287704, 228112, 26001, 350510, 60983, 182259, 109119, 271106, -283214, -155364, -36173]
13086a70386F7178a46815G683L10990b9055q1653E4402P3396D2870R6686f4936
13074A66012f6046J3377l93j3763I835a21791b4583A97167J6634D1966P5287K83350
13062D00603A22127P3914e565A43523J0833f7495C11488A08261O0158A7932b6327
13050A51236J48834a2348F2075a64364D38112B9172J81725r0003e4265n377B16190
13038E3748J97093F8235O3729J66991h5791j40330A73694G3523g7747L1896g190
13026A10918a88865R2583b0420A28851j4488L58790b07410G4654C6630J17340
13016A53970D8105J88204G3553A870b1682B31352e4219B3923P1280c1304A27170
13004A4663J14408a91170B58184J5706i9183A72628p5039m2839J40018e6143I0497
$$ y = [-170386, 67178, -146815, 7683, 318673, -29055, -110708, 54402, 127798, 42870, 139556, -64936, 166012, -66046, -52669, -53062, -66825, 9835, -121791, -24583, 197167, 213801, 41966, 117253, 400603, 122127, 196041, -5565, 143523, 154356, -67495, 311488, 108261, 168419, 17932, -26327, 151236, 300070, -12348, 62075, -164364, 438112, 29172, 210897, 120894, -54265, -59642, 216190, 53748, 250841, 68235, 131964, 298955, -85791, -226121, 173694, 73523, -77747, -45851, -7190, 110918, -188865, -96282, -20420, 128851, 114363, 473153, -207410, 74654, 36630, 153970, 48105, 236309, 73553, 1870, -21682, 231352, -54219, 23923, 95203, -31304, 127170, 14663, 129071, -191170, 258184, 273890, -99183, 172628, 97589, 54750, 194768, -56143, 90497]
12992A00369J20753A06337J6534J95859j32045B9085h0559H4403L0703J410f631
12980H1548a2462C7099d1835B54303B9905J85745a96374B18910a15154C5633M7443
12969H3076f2895A57891G3718C5455A5404e6109J0110A09704L9205g703G8376
12957g9682j4156h383D56164I9191b49138R4013A68506i6395o0891A58436f2373
12945I2168L27860A54282a52911B18421C0630L6389Q3519b72610A61962c448H9951
12933A00258e5479k08913a22541E3588K46640b1019o155A52404C8162b44507b7390
12921A20955D2962K76519h9505j49261a9938B87984f5306A5879J99263d9311B56344
12909a3383j82637a459k25688G3114g1958B50706q8525g8316p8648E0092a49867
$$ y = [100369, 221122, 106337, 122871, 318730, 186685, 29085, -80559, 84403, 115106, 116516, -6631, 81548, -12462, 37099, -41835, 254303, 29905, 215650, -196374, 218910, -115154, 35633, 83076, -62895, 157891, 73718, 35455, 15404, -56109, -45999, 109704, 148909, -7703, 78376, -79682, -93838, -8383, 456164, 99191, -249138, -155125, 168506, -96395, -157286, 158436, -62373, 92168, 420028, 154282, -152911, 218421, 30630, 67019, 150538, -272610, 161962, -3448, 89951, 100258, -55479, -264392, -122541, 53588, 300228, -21019, -27174, 152404, 38162, -244507, -27390, 120955, 42962, 319481, -89505, -238766, -19938, 287984, -65306, 15879, 215142, -49311, 256344, -13383, -196020, -1459, -227147, 73114, -71958, 250706, 162181, -78316, -156964, 50092, -149867]
12897B30661C6942O7410c83194G5019I607P6732i2114A86729h1847A1998M05774
12886D17772a2215D2010K90835F5642Q816c5429A53694f4167L559p7722B16155
12874H5965f6975l4061A9782J60946b8474I5360a80648b7877c303D15027r5447
12863C19580b7742D9055O2628b9244j3065L149D9427j336i6767C1221J68908q0606
12851A19523J58625A5985Q0735a99603d3242A73853a75553A58074a48882a8165
12840f3668B04672a4519l5000l47409A36637C4940J06504b88321A43581a24641
12829A89106A8137L2492J51063D9605R6558j2589D8937J77077h0564k10793F1009
12817A32171a07321N801D19836a08303A03327b36185A65893O4234B8941a78301
$$ y = [230661, 36942, 104352, -383194, 75019, 9607, 86339, -92114, 186729, -81847, 11998, 417772, -12215, 42010, 332845, 65642, 74458, -35429, 153694, -64167, -60608, -138330, 216155, 85965, -66975, -101036, 19782, 180728, -28474, 95360, -180648, -27877, -3303, 415027, 319580, -27742, 49055, 111683, -29244, -42309, -39160, 49427, 48091, -96767, 31221, 200129, 119523, 278148, 15985, 96720, -199603, -43242, 173853, -175553, 158074, -148882, -18165, -63668, 204672, -14519, -49519, -396928, 136637, 34940, 141444, -288321, 143581, -124641, 189106, 18137, 50629, 201692, 49605, 146163, 133574, 48937, 226014, -80564, -291357, 61009, 132171, -107321, -101520, 419836, -108303, 103327, -236185, 165893, 230127, 28941, -178301]
12806e7569l9688r7868j7734l7011O4628j14305a12865B0196a25879R336F8415
12794b98469D1468b02899H2708J9385h6181B50577b8636A95890e3467A95158a58399
12782b3271C77804j66220f5649k525L38C87349a93093D8402L6934K57055b60493
12770B4157N01880A22717e8215j17010B02531g6789B73975j30356a01945j84231
12760b86176I7458J22370J4229l2200J37371j64200c10325P965a25242O0676k18564
12749b83130C7656K94361G3757b14292K4405B01585f2827L1036B3911J1633J46791
12738A82335a68886C33153b9107Q775B32512a14357c7739A27656R4682m9962b4984
12726A05155J48233p194E9049N6272k7769R432J24236r5621b55458E465c94E3369
$$ y = [-57569, -97257, -195125, -212859, -249870, -185242, -299547, -112865, 20196, -125879, -116543, 68415, -298469, 41468, -202899, 82708, 102093, -86181, 250577, -28636, 195890, -53467, 195158, -158399, -23271, 377804, 211584, -65649, -68174, -67836, 387349, -193093, 48402, 85336, 342391, -260493, 24157, 526037, 122717, -58215, -175225, 202531, -76789, 273975, 143619, -101945, -286176, 97458, 219828, 234057, 201857, 339228, 175028, -310325, -302360, -125242, -64566, -283130, 37656, 332017, 73757, -214292, -189887, 201585, -62827, -31791, 23911, 35544, 182335, -168886, 333153, -29107, -20332, 232512, -114357, -37739, 127656, 222338, 172376, -24984, 105155, 253388, 246194, 59049, 115321, 87552, 96984, 221220, 125599, -255458, 5465, -394, 53369]
12713A2372K65164O1068b48374B20280Q153J88055j83533p4807O6106C2305a53620
12701E76599g6535E8M6707J99119j02189R9252b3274J819j03529a0202A01201
12689B2650J4595K495c0735o498A28252K41249r9367D9750b66559A9406h7944
12677A02321J2277a62362F0376A2171c71712D7434K35350I3240f5972A06169O3959
12666A70128n622b05434c6222B75946d4643A21448A2930K59753o5382m3626a3760
12654a45954I5202F946K97080A28210P3357C0409K01931N5650b45564C64787a7885
12642c79822J43008R5131e210F905L32506I774D639J32129k3756a69501F4281
12630A33069J05326J89115o4335A08005q506L61826A38654n4140J38822B1916
$$ y = [12372, 277536, 338604, -248374, 220280, 228433, 416488, 232955, 158148, 224254, 32305, -153620, 576599, -76535, 58, 46765, 245884, 143695, 242947, -23274, -21455, -124984, -10202, 101201, 22650, 37245, 39740, -30735, -37233, 128252, 369501, 270134, 49750, -266559, 19406, -87944, 102321, 114598, -162362, 60376, 12171, -371712, 47434, 282784, 93240, -65972, 106169, 170128, 164506, -205434, -36222, 275946, -44643, 121448, 12930, 272683, 207301, 163675, -13760, -145954, 95202, 6946, 304026, 128210, 201567, 30409, 232340, 287990, -245564, 364787, -17885, -379822, -236814, -141683, -5210, 6905, 339411, 9774, 4639, 136768, 113012, -169501, 64281, 133069, 238395, 427510, 363175, 108005, 99499, 461325, 138654, 84514, 223336, 21916]
12619A96034a32765C68518A35766i9440k5646e9288A3104a58440B95211c46535
12608B73626j30809b45449a07610B11987F9377J0311P0322a3071A18747b3002
12597G3401K34691h4238I6423L73314f5581G4527J61699A9495b80917R2446G4440
12585g1868B79770a89776l0765J706b9995n1451o4409M6518B41525b807A08980
12573b10722E2998a36091A77988P0262Q4945G4227J41192E1020a96593A16613
12562C0181P5035d30504F2502a08588a982k64195F4138M8171i31H9415R5159b16307
12549I6215C1460b13599J1458F4350i061A61856F3436L40965A563b26703R7863
12538a28840j67772I359c3361j27397n5361J06785c0110k36478A90560a87190
$$ y = [196034, -132765, 368518, 135766, -99440, -125086, -59288, 13104, -158440, 295211, -346535, 273626, 142817, -245449, -107610, 211987, 69377, 79688, 150010, -13071, 118747, -23002, 73401, 308092, -84238, 96423, 469737, -65581, 74527, 236226, 19495, -280917, -188471, 74440, -71868, 279770, -189776, -220541, -218835, -29995, -81446, -145855, -99337, 241525, -2807, 108980, -210722, 52998, -136091, 177988, 248250, 333195, 74227, 215419, 51020, -196593, 116613, 30181, 105216, -430504, 62502, -108588, -1982, -266177, 64138, 112309, -931, 89415, 184574, -216307, 96215, 31460, -213599, -202141, 64350, -9061, 161856, 63436, 404401, 1563, -226703, -128840, -296612, 9359, -33361, -160758, -216119, -109334, -30110, -266588, 190560, -187190]
12527A85484e7810j43236B36275d8634k680l837E9820k412J14098a51016A09377
12515c3552B03001J23860A40685l1624i314k58005B22184B0069J33515F8009p775
12504F0234c62374F5490c40867e0118C45614j71894a85525K9865C00982h2286
12493E2574m402J7316d9940A29320G661a65499G868b82390A48K48721J68537c12449
12480B84053c60535i5635G3182J26623a67470D3401P9454M6681E5421d9915A55580
12468e438p1767L8353E0153b39537F79h286B14K00540i3767F0191J27046G5875
12455a1851G9828K96314I4631h3852A78175o8201b21206B1864L23798N7700b65465
12443a5531A02672D904J63523K82767A32332f5316H1441M1786N3454Q748a77632
$$ y = [185484, -57810, -201046, 236275, -48634, -51314, -55151, 59820, 57408, 171506, -151016, 109377, -33552, 203001, 326861, 140685, 109061, -9314, -267319, 222184, 20069, 153584, 68009, 60234, -362374, 65490, -340867, -50118, 345614, 173720, -185525, -155660, 300982, -82286, 52574, 48172, 65488, -49940, 129320, 7661, -165499, 7868, -282390, 148, 248869, 417406, -312449, 284053, -360535, -95635, 73182, 199805, -167470, 43401, 122855, 169536, 55421, -49915, 155580, -5438, -77205, -38852, 50153, -239537, 679, -8286, 214, 200754, -93767, 60191, 187237, 75875, -11851, 79828, 376142, 94631, -83852, 178175, 109974, -221206, 21864, 345662, 403362, -265465, -15531, 102672, 4904, 168427, 451194, 132332, -65316, 81441, 123227, 176681, 185429, -177632]
12431a61023j924A01794L8291a78515f031B7458c33100C01b4359C00220B8093
12419a96978A36404a63750A84658B2201K2202K02925a14432l7197A70714a40255
12408c2555k28290N4251A26881a7043O953F1487d15224a69312o0706G1404a11098
12396f6677m8755C43446C4316J16625c39801E3305c61600J21190d5342D93636
12385F2438b90973F7366b62817A24525B959a96075L0795A6659i4012G9398f650
12373i4009D6675a10305j12926E0006e0956j32094L8166I8992b92061N0224a5302
12361E0056b46602B1570J09674k2433c5081l4763j66952B9228J9482M7252B5950
12349I0966k7774M7181I34J97714Q4719o7738H2818J01124a52837F4597J61721
$$ y = [-161023, -162947, 101794, 140085, -178515, -6031, 27458, -333100, 301, -24359, 300220, 28093, -196978, 136404, -163750, 184658, 22201, 44403, 247328, -114432, -151629, 170714, -140255, -32555, -260845, -206594, 126881, -17043, -10090, 61487, -415224, -169312, -230018, 71404, -111098, -66677, -115432, 343446, 34316, 150941, -339801, 53305, -361600, -240410, -45342, 493636, 62438, -290973, 67366, -262817, 124525, 2959, -196075, -165280, 16659, -94012, 79398, -6650, -94009, 46675, -110305, -223231, 50006, -50956, -183050, -144884, 98992, -292061, -241837, -15302, 50056, -246602, 21570, 131244, 108811, -35081, -69844, -236796, 29228, 48710, 95962, 25950, 90966, 63192, 110373, 934, 198648, 283367, 215629, 82818, 183942, -152837, 64597, 226318]
12338B26318K45606a34394C2049c2207H9442J05857b64191C0511P289R3628E6100
12326a73732r9149A12496G732M13867A9125a02671j57150A13772J1288a25826
12315e5697R561C8453J15270N9792R9078D9283K81355F302K73082f6677c1421
12303d9052B0688a58426A35382N9618G5410K07140N6334a91406f8843A52500a07030
12291I2094d8843k80488G5075d22614e7013n0086j88591A08067N6734b15887C77750
12279A10900j7669M5687E5655J54023N1404J28261j70421G1094K12016b017A3970
12267B52593k0400a67546P0814L180E7217a07194A25365J86483B4115a11619K4868
12256h6751L084A34128J9975o6589k3682h3862B2312f4040k604k7310j4652n5287
$$ y = [226318, 471924, -134394, 32049, -32207, 89442, 195299, -264191, 30511, 37800, 131428, 56100, -173732, -272881, 112496, 7732, 421599, 19125, -102671, -259821, 113772, 125060, -125826, -55697, -46136, 38453, 153723, 213515, 312593, 49283, 330638, 6302, 279384, -66677, -31421, -49052, 20688, -158426, 135382, 195000, 75410, 282550, 338884, -191406, -68843, 152500, -107030, 92094, -48843, -329331, 75075, -422614, -57013, -107099, -295690, 108067, 164801, -215887, 377750, 110900, 93231, 138918, 55655, 209678, 261082, 389343, 218922, 71094, 283110, -2017, 13970, 252593, 232193, -167546, -96732, -93552, 57217, -107194, 125365, 311848, 24115, -111619, -86751, -83667, 134128, 154103, 87514, 63832, -83862, 22312, -64040, -66644, -93954, -108606, -163893]
12244a63893A08139J48271a00364A90036a9559j37657A79317J671i9012A29542
12233a51685E5108h996A12661C0677P9303a43447b1538A36742K12749j52358J98516
12222C95649j40858G4857M91123B04351J77384C6068b03675C4775a20031a3095
12211B50126a51939H3607C7362O2060K8378G665J40246b6637A37692L52626e0726
12199E44507A70545M09941A97615p6687E2871a51801D71707a71099e524A36008
12188B42455C1812L3766M9413J6441J33048a4296G5636J76805A22116i1749b6482
12176D11251I25J39821B8755K13377D5411c3055C56972l8812f7589B37232a25262
12164C5882J2171f0597B61873H7679J44976G0531J5845b6010E5362Q3113J8791
$$ y = [-163893, 108139, 256410, -100364, 190036, -19559, -157216, 179317, 180988, -99012, 129542, -151685, 55108, -8996, 112661, 30677, 109980, -143447, -21538, 136742, 349491, 197133, 395649, 254791, 74857, 565980, 204351, 381735, 36068, -203675, 34775, -120031, -13095, 250126, -151939, 83607, 37362, 99422, 127800, 7665, 147911, -26637, 137692, 490318, -50726, 544507, 170545, 580486, 197615, 120928, 52871, -151801, 471707, -171099, -5524, 136008, 242455, 31812, 65578, 114991, 131432, 264480, -14296, 75636, 252441, 122116, -91749, -26482, 411251, 925, 140746, 28755, 242132, 45411, -33055, 356972, 318160, -67589, 237232, -125262, 35882, 48053, -60597, 261873, 87679, 232655, 70531, 86376, -26010, 55362, 138475, 157266]
12153A57266J7622i2166J643A05993l5846O6584b87286a06309L5208B3885J65570
12142A89455C9497b11196H1426J1075a27686G2051O8994J70277b56998A60580
12131F3837j6244b16941A65452L4407d98985B5719R2828b29726A67602L7551L4975
12120B40128a25715A39709j9796E3734b73211A17226a8177A66087G8474l3763
12110D4711a62198d191k89906a22514I1584M8252Q6997b19437A73788C1485a6966
12098B5369b07576f9582L0521j2373a5674r5683o3137q9371e1202D2571K56799
12087B99370A06338K71885a29144e4589k76578A67255a36437j07663g2139a563
12076G8233M49004A08888b154j41804C42081M87979J103316p15793D05405j1365
$$ y = [157266, 174888, -92166, -90523, 105993, 70147, 136731, -287286, -106309, -71101, 23885, 189455, 39497, -211196, 81426, 92501, -127686, 72051, 141045, 311322, -256998, 160580, 63837, 47593, -216941, 165452, 199859, -498985, 25719, 118547, -229726, 167602, 205153, 240128, -125715, 139709, 119913, 53734, -273211, 117226, -18177, 166087, 78474, 44711, -162198, -4191, -294097, -122514, 91584, 139836, 226833, -219437, 173788, 31485, -16966, 25369, -207576, -69582, -39061, -51434, -15674, -111357, -174494, -263865, -51202, 42571, 299370, 106338, 378223, -129144, -54589, -331167, 167255, -136437, -244100, -72139, -1563, 78233, 527237, 108888, -2154, -143958, 342081, 830060, 1933376, 1217583, 405405, 394040]
12066C94040R2150f5062p0409B11663r6103A6941a99043A04639B8695R5451a01743
12054c02321F6934c34618C39128b36906B5221n362J34279f1477F831J72524q3531
12043I5824f5255A41296j8046b35051C6935b82921a12095A23221m5803P4192N9998
12032B11608b25508A92903m0806G1654i1557j20430B3825J38051h4197A69465
12021a09941a3946A10072b3652D69060j00063H0193J90894f0138A40412i2503
12010b37172j46110i7073k49251C33044c16498a13679m483L4470F8807b58213
11999A23363J13777h2940D3029J16860c03046i3707n920o0450d6645l08492d1086
11987B37888A9488P9360D7537d1964J4999k15514r669g8946A12802J01066e6734
$$ y = [394040, 486190, -65062, -135471, 211663, 115560, 16941, -199043, 104639, 28695, 124146, -101743, -302321, 66934, -334618, 339128, -236906, 25221, 19859, 154138, -61477, 6831, 179355, 95824, -65255, 141296, 123250, -235051, 36935, -282921, -112095, 123221, 77418, 151610, 211608, -225508, 192903, 152097, 71654, -91557, -211987, 23825, 161876, -84197, 169465, -109941, -13946, 110072, -23652, 469060, 368997, 80193, 271087, -60138, 140412, -92503, -237172, -383282, -97073, -346324, 333044, -316498, -113679, -118162, -83692, 68807, -258213, 123363, 237140, -82940, 43029, 159889, -303046, -93707, -99627, -160077, -46645, -355137, -41086, 237888, 19488, 98848, 47537, -41964, -26965, -242479, -252148, -78946, 112802, 213868, -56734]
11975G6323L2336b22763D9848b73648I271J0509P8666a82999C462J26945O1064
11964A91471k0110G424B322L12133a84754A9900a72353E4642a16046D4100b38213
11952b08397g5003G5885a67768D4190a23055A30319B7350g217A66913a82806A19612
11940B65965B030f4888j02026f3610j2206o5831C19771b3879a395A88881K5891
11929B14772B9532a89918B46502F0385J94296d2843p7780K1975k6798C8996N7799
11918I6795a70292M1592H7984b2674j40593j08805B78594g115o8877B96852d60543
11906A59204J74748a6751G1043R0949p9755J4361N7729n1129O3204b513l63727
11895c66240B16866c1435A18484a45306D4918c32927B2971a78433n9256A1600
$$ y = [76323, 108659, -222763, 49848, -273648, 9271, 19780, 98446, -182999, 3462, 130407, 191471, 171361, 7424, 2322, 314455, -184754, 19900, -172353, 54642, -116046, 44100, -238213, -208397, -75003, 75885, -167768, 44190, -123055, 130319, 27350, -7217, 166913, -182806, 119612, 265965, 2030, -64888, -166914, -63610, -75816, -141647, 319771, -23879, -1395, 188881, 214772, 29532, -189918, 246502, 60385, 254681, -42843, -120623, -98648, -125446, 38996, 96795, -170292, -128700, 87984, -22674, -163267, -272072, 278594, -7115, -75992, 296852, -460543, 159204, 333952, -16751, 71043, 161992, 82237, 96598, 154327, 103198, 166402, -2513, -366240, 216866, -31435, 118484, -145306, 44918, -332927, 22971, -178433, -237689, 11600]
11884E5635A5780b86145B5931K0121a13225A58167n1664a0486r9971d099l07801
11873c11900c6436A17897a21214C21186j50988c19500B43278a23402j26455i612
11862a27638K9517r0053i3176D6728J51825a05797a7806j56837G032K54033g0704
11850a75737B2423c5320C9286b87601B79548c5930G5644P8186N080e6695B145
11838c1892A94444A152J67706n7439m83l2228a09661G5307R1996b04426A84192
11826A21588c39987a51939f9749E0825c7827p4650r5861c5885o8414k94856a16180
11814d8491d801k07584k25671C9639b2848n5121f07D6459b27270j01822M8198
11803b80894J10486A59696F5458c6931B18364c12596F4629f148A25460b06436
$$ y = [55635, 15780, -286145, 25931, 46052, -113225, 158167, 106503, -10486, -110457, -4099, -311900, -36436, 117897, -121214, 321186, 170198, -319500, 243278, -123402, -249857, -9612, -127638, -98121, -188174, -93176, 46728, 198553, -105797, -17806, -174643, 7032, 261065, -70704, -175737, 22423, -35320, 39286, -287601, 279548, -35930, 75644, 153830, 158910, -56695, 2145, -31892, 194444, 1152, 168858, 111419, 110936, 78708, -109661, 75307, 167303, -204426, 184192, 121588, -339987, -151939, -69749, 50825, -37827, -112477, -208338, -35885, -104299, -399155, -116180, -48491, -4801, -212385, -438056, 39639, -22848, -77969, -607, 46459, -227270, -329092, -280894, -170408, 159696, 65458, -36931, 218364, -312596, 64629, -6148, 125460, -206436]
11792F7733b41552A3089a03343H1192K47711r5470A16172a23691j2250n4806A45823
11780A13842d36761A30324K2528g8658I6552Q8274a77924A39268d9768G9384a88887
11768A94406b05269B41243B2780b3196C37212b68259a32555A24378b5232j95609
11758b20841A83425H8434j0034k8260B175N1262L6287I198g0829E5770a1702A1976
11745A9989J7752J20437c88840a34345B03567b7552C06857j34862M1148A2319
11734A37781I325K9322J36432a37814d9347G5901k4795a56428A19406N13E747
11722A01997b7758G3329N5575g1541j04875J6995A56173J75642p5077E973K22103
11711B28076o5513g8802A5445b6825A10570c3649b483j6258B0679P5016e5371
$$ y = [67733, -241552, 13089, -103343, 81192, 328903, 233433, 116172, -123691, -135941, -190747, 145823, 113842, -436761, 130324, 152852, -78658, 96552, 184826, -177924, 139268, -49768, 79384, -188887, 194406, -205269, 241243, 22780, -23196, 337212, -268259, -132555, 124378, -25232, -220841, 183425, 88434, 78400, 50140, 2175, 53437, 89724, 9198, -70829, 55770, -11702, 11976, 19989, 37741, 158178, -388840, -134345, 203567, -27552, 306857, 171995, 213143, 12319, 137781, 9325, 38647, 175079, -137814, -49347, 75901, 51106, -156428, 119406, 119919, 5747, 101997, -27758, 73329, 128904, -71541, -176416, -159421, 156173, 331815, 256738, 5973, 228076, 162563, -78802, 15445, -26825, 110570, -33649, -2483, -18741, 20679, 95695, -55371]
11699b7580A14532L47348g401o4617A28380g0290A96637F9820k5731K05119D9703
11687C81691a38641M8424A33743M9510L9040N2533a75202g7285C90248b18201
11676A07863g8456A07934J19192A09730N9454p073L5592q9497a57688f9686k09106
11665b78792J06184A77825h5836j49595C2667a69082B22723k7170b1250j46803
11655a68053d3204q7346L1233l0854o5632B47069o3984a39753A5361K86159a34597
11643e1013C777b47017R9967h233B11431d15294A5195J48333d680D6950P798M7535
11631A02283K6300B2068N9272J40253a8261A04685a77481C04622a52605e3822
11620G8049a15451e0230A35082d3493A47745E977d2024A35699N1684c14310D3177
$$ y = [-27580, 114532, 461880, -7401, -72018, 128380, -70290, 196637, 69820, 44089, 249208, 49703, 381691, -138641, -90217, 133743, 183253, 222293, 274826, -175202, -77285, 390248, -218201, 107863, -78456, 107934, 227126, 109730, 169184, 162111, 197703, 108206, -157688, -69686, -278792, -172608, 177825, -85836, -235431, 32667, -169082, 222723, 195553, -21250, -168053, -43204, -130550, -99317, -130171, -195803, 247069, 183085, -139753, 15361, 301520, -134597, -51013, 3777, -247017, -147050, -8233, 211431, -415294, 15195, 163528, -4680, 46950, 54748, 102283, 128583, 22068, 81340, 221593, -18261, 104685, -177481, 304622, -152605, -53822, 78049, -115451, -50230, 135082, -43493, 147745, 5977, -42024, 135699, 187383, -314310, 43177]
11608a95669j42961J42890d0150k56856e5950K7224k4115l66178R7450A40268
11597A56342a5857E8556b16734N2434K8639C33252j02776F6250M6799K25084j43666
11586A94467D5976J13561n5291J08173J734q9906P5847b69976A77937J46234j56360
11575A67811a466j42540A28379A1750Q0812J11399n5481D3863P6765f7992B30473
11563c9226A84225a22420a2842j03654g370j09927A55004M0618E4916M9351J12498
11552B16765d1164C1142b0150B54185K0249g4461p837p1337k3431j06973H4219
11540h2517C5815K86074A15041g1666A80994F7918N25738G7772j6250K69226G4053
11528b00318g411l25965B51135a1961H4530j9975M1548l294H453L05662a16867
$$ y = [-195669, -338630, -195740, -40150, -297006, -55950, -28726, -52841, -419019, -321569, 140268, 156342, -15857, 58556, -216734, -164300, -135661, 333252, 230476, 66250, 113049, 338133, 194467, 45976, 159537, 104246, 212419, 214153, 124247, 200094, -269976, 177937, 324171, 167811, -1466, -144006, 128379, 11750, 92562, 203961, 148480, 43863, 120628, -67992, 230473, -39226, 184225, -122420, -12842, -116496, -7370, -117297, 155004, 195622, 54916, 104267, 216765, -41164, 31142, -20150, 254185, 274434, -74461, -82298, -153635, -177066, -284039, 84219, -82517, 35815, 321889, 115041, -71666, 180994, 67918, 593656, 77772, 61522, 330748, 74053, -200318, -7411, -333376, 251135, -11961, 84530, 64555, 106103, 102809, 8453, 314115, -116867]
11516B22867j07539c82581A46267J8618J24656n9921a16976B73532q9250H6456
11505B75501i1368B01977F4565K59791A48077K38156A64549Q2067r3795J13634
11495B66455A14616K52849A39938D9233K09853j11955a55476A31627i825A01658
11484A27188g7868B82591r7514M2034a69698A58283J45796i6627B30779J31092
11474C61871A10107Q450a31436E3643b22477A54949a54537A39095p628c09107
11463F9781P0768a18043B1745J24497n1574a40800I9123N909M53957k1232d4901
11451B25952H219d6172E6673K96733A07818C1924H827e1887q3830H7037a17761
11439B25576N9853n3894A05837c9205C14737a60959A77236R3167C9903K2505d4108
$$ y = [222867, 115328, -382581, 146267, 164885, 289541, 229620, -116976, 273532, 184282, 86456, 275501, -91368, 201977, 64565, 324356, 148077, 386233, 164549, 246616, 152821, 266455, 114616, 367465, 139938, 49233, 259086, 147131, -155476, 131627, -9825, 101658, 127188, -77868, 282591, 185077, 227111, -169698, 158283, 304079, -96627, 230779, 361871, 110107, 118557, -131436, 53643, -222477, 154949, -154537, 139095, 131467, -309107, 69781, 140549, -118043, 21745, 146242, 94668, -140800, 99123, 105032, 558989, 537757, -44901, 225952, 8219, -46172, 56673, 353406, 107818, 31924, 8827, -51887, -135717, 87037, -117761, 225576, 285429, 231535, 105837, -39205, 314737, -160959, 177236, 270403, 39903, 62408, -44108]
11427C71605q4351A16339D9380c36164a32782A03988b89936M3827c3700C4392
11416A90417a16731J9607B83697I4434b21215I465g415r3699a816A05645d7466
11404b00894A88664G0193J49440q0738L75358i809j35567I6150B5385K70558b5239
11392H6269O6678d3316j31043E4944J79559a14445j13212J10105a1666N250F0606
11380B16139B6927e9036A8772J39978m7390b07931L6836D06385C1790O7896k1758
11369G7928g6031L6947j2732n6830J3362B35930d1065A05794l6914b41151n2382
11358b93533G4578h0970j6647K4513B09120K50147b1122i052B16378c617k55555
11347b59172A73612J23868a92507J248B5636r75i7622H0883k3488J30218H5153
$$ y = [371605, 287254, 116339, 49380, -336164, -132782, 103988, -289936, -246109, -33700, 34392, 190417, -116731, -97124, 283697, 94434, -221215, 9465, -7415, -101114, -1816, 105645, -47466, -200894, 188664, 70193, 219633, 138895, 514253, -9809, -145376, 96150, 25385, 295943, -25239, 86269, 152947, -43316, -174359, 54944, 234503, -114445, -227657, -117552, -11666, -6416, 60606, 216139, 26927, -59036, 18772, 158750, 111360, -207931, -171095, 406385, 31790, 99686, 77928, -76031, -39084, -51816, -108646, -95284, 235930, -41065, 105794, 68880, -241151, -293533, 74578, -80970, -97617, -73104, 209120, 459267, -21122, -9052, 216378, -3617, -259172, 173612, 297480, -192507, -191259, 25636, 24661, -97622, 80883, 57395, 187613, 85153]
11335A80256e6390j00149F6182a5832k42115C8921a03755j56216c5585r9300B91735
11323B79216b31368A3108b06632a02799j66493h6486a4007j08901B72291j05776
11313A66515a03024A61132E4595g3692E1176a63230M6107B07566A7970L4608i1063
11301G199d9604o3615G3521J73685I526R7662b34050k8137b8323j7232G2140g0737
11288B49529a61094n0467N0127N1382j34419b3719A75315b692A61140h9511E5236
11276h0002k3026F6221h884A95075H6923K9932c17837a34342A38779a0076A15257
11264c50887a01778j1806e0422C12077A3583J73684a91045Q3095A44317F4350
11253a56104b0403k44180g9898o1769a1285n0977A11884K8241o7971J69547p7216
$$ y = [180256, -56390, -156539, 66182, -15832, -257947, 38921, -103755, -259971, -35585, -134885, 291735, 279216, -231368, 13108, -206632, -102799, -269292, -86486, -14007, -122908, 272291, 166515, -103024, 161132, 54595, -73692, 51176, -163230, -117123, 207566, 17970, 52578, -91063, 7199, -49604, -113219, 73521, 247206, 9526, 107188, -234050, -262187, -28323, -45555, 72140, -70737, 249529, -161094, -211561, -161434, -110052, -244471, -23719, 175315, -2692, 161140, -89511, 55236, -80002, -103028, 66221, -8884, 195075, 86923, 116855, -317837, -134342, 138779, -10076, 115257, -350887, -101778, -113584, -50422, 312077, 13583, 187267, -191045, -107950, 144317, 64350, -156104, -20403, -264583, -79898, -141667, -11285, -62262, 111884, 140125, 72154, 241701, 164485]
11242A64485C9902a53075B54419a13534L5850j02534A85169M9171a24634D6843
11231B15665P9962b01637A3583b98243J32082m5486A08674P1802b50389A15318
11220a7977C07476a22563C0975h8602m1058B70112A23344a61693L1290I8500D5930
11208E1870b21915E2696P6607h5370A49785a00464k10444l6151b4160A51402C8598
11196b24343j34304a01818C0407a71944a5390m665j43633A35322i3451j22504
11186b15955M3589A48084n3401A3771b58921h9089A94518B3967a39973L8922r653
11175a10704B33624G2455L6598m2504A937c45724E6661L9789d01373n900B00549
11163A09380Q5605r4844d64620I3630g4557j63169A420e8694C4195a42956j29220
$$ y = [164485, 39902, -153075, 254419, -113534, -77684, -180218, 185169, 234340, -124634, 46843, 215665, 295627, -201637, 13583, -298243, -166161, -211647, 108674, 180476, -250389, 115318, -17977, 307476, -122563, 30975, -88602, -129660, 270112, 123344, -161693, -130403, 98500, 45930, 51870, -221915, 52696, 129303, -85370, 149785, -100464, -310908, -347059, -24160, 151402, 38598, -224343, -358647, -101818, 30407, -171944, -15390, -20055, -163688, 135322, -93451, -215955, -172366, 148084, 94683, 13771, -258921, -89089, 194518, 23967, -139973, -101051, -110704, 233624, 72455, 109053, 66549, 1937, -345724, 56661, 96450, -401373, -407273, 200549, 109380, 194985, 100141, -464620, 93630, -74557, -237726, 1420, -58694, 34195, -142956, -272176]
11152b72176c9204p127m7123A00482c16236C10355A46432D0376A862K26547b66707
11140f920A11419C3631K8539A0434K20968a7295G1361f593B11663J0101m4457
11129A77307q4459c71864h1144A84635g1243C9389j3762N5685P8923K53321A86289
11117H1901M30170a08811E4409E687a23869I273J8657a97146D46521A26649N3558
11106A80207N4916B34e3342A03302b4923j66605N6521A37748m346J53872o1825
11095B25449O8358q0621j3730O7964I3166J78863r8476b3523A78343M6215O3349
11084B87907F5537L07291C5967K48209p2990J28415j58693o6657J40677L11813
11074E66741k06669O083j27372k0338M1539m7658N5106K54911J3590j35321A46154
$$ y = [-272176, -39204, -46331, -93454, 100482, -316236, 310355, 146432, 40376, 1862, 228409, -266707, -6920, 111419, 33631, 62170, 10434, 231402, -17295, 71361, -6593, 211663, 221764, 177307, 92848, -371864, -81144, 184635, -71243, 39389, 25627, 81312, 160235, 413556, 186289, 81901, 512071, -108811, 54409, 5687, -123869, 9273, 27930, -197146, 446521, 126649, 180207, 235123, 234, -53342, 103302, -24923, -191528, -135007, 137748, 133402, 287274, 225449, 293807, 213186, 199456, 267420, 93166, 272029, 173553, -23523, 178343, 224558, 287907, 65537, 372828, 35967, 284176, 211186, 339601, 180908, 114251, 254928, 566741, 360072, 366155, 238783, 218445, 259984, 212326, 267432, 522343, 535933, 400612, 146154]
11062f2987E55635k17504J62933J35620k76021n2449J95887B10405L46542K34683
11052G91630j31243L4053C44752L54507K46855l97815l1116r7364l8632M18979
11042H00166k62935j20081J18458J93386m2407O1841k02852P5821j29543j51057
11032C40797K20381l1788K70671j55377K51113j84471K18086j79108k76537K67122
11022G40889l32069J643Q6592K5520K47486C57891K54258Q3270B86875L8623P2453
11011C97951K57978N2102k44937J26970m4834j4220J66778J22189C43260p126
11001C36134K83670p5131K1895K54637l12601k27190N04336C79140K52518j92476
10991D39182N92638D95007P4879K3321M53839k69724l7203m2701L25795D43571
$$ y = [-62987, 555635, 338131, 501064, 636684, 360663, 308214, 504101, 210405, 556947, 791630, 660387, 694440, 344752, 699259, 946114, 548299, 517183, 419819, 381187, 800166, 537231, 417150, 535608, 728994, 686587, 748428, 545576, 621397, 491854, 340797, 561178, 529390, 800061, 644684, 895797, 711326, 929412, 750304, 473767, 740889, 408820, 410463, 497055, 522575, 770061, 357891, 612149, 695419, 286875, 325498, 397951, 655929, 708031, 463094, 590064, 545230, 531010, 697788, 819977, 343260, 336134, 619804, 544673, 566568, 821205, 508604, 281414, 785750, 379140, 631658, 439182, 1031820, 495007, 569886, 593207, 1047046, 777322, 740119, 697418, 1023213, 443571]
10980F55089N69980J71516l80763O44599o4467L21434J06069L32648O5188R8338
10970B519631j52956r3160J40517m9285m57252q9305l65432L37501J30440l94599
10960A526100k5410K27760O1603J79199j3697k03648j24184l51666R1765k55444
10950A112378k06822k64375j54118q8789J91390k55085A66248J41410L13587B35129
10939B53967e9967A21510J68002j32142A9321c2398G00J90327n640B5314g9670
10927C49781p4920B7819J9584c04361F6974J54962I2347a24917A5928f221j18312
10916a24533K0381j20496E0906P3400a82655B01751a72158N857f3193n7630H7994
10904A74365J8857M832F1713a70575b2498A83358i2989E4765d2511r7798p7504
$$ y = [655089, 1225069, 1396585, 1015822, 1660421, 1595954, 1917388, 2023457, 2356105, 2421293, 2519631, 2366675, 2273515, 2414032, 2364747, 1907495, 1818190, 1452758, 1790259, 1920699, 1526100, 1500690, 1728450, 1790053, 1969252, 1955555, 1751907, 1627723, 1276057, 1367822, 1112378, 905556, 641181, 487063, 398274, 589664, 334579, 166248, 307658, 621245, 235129, 253967, -59967, 121510, 289512, 157370, 19321, -32398, 700, 191027, 185387, 25314, -79670, 349781, 274861, 27819, 47403, -304361, 66974, 221936, 92347, -124917, 15928, -6221, -124533, -104152, -224648, 50906, 124306, -182655, 201751, -172158, -166301, -63193, -120823, 87994, 174365, 193222, 198054, 61713, -170575, -22498, 183358, -92989, 54765, -42511, -140309, -217813]
10893b17813o3439g5488K8766a103B17994R4388I5882b73452J06865B1746J99324
10882B21070I5087a25213B34423c8134j09691A55983c07346a19724M0023J7158
10872f2543l94090A51048C4364a5608D53530b6477j61798C68346H2285l4644g3609
10860f3709J1848m1925D1911J78548I1629g1474k41940A93387b37144N6203J6644
10849a64297K2487A74982c64141I6046b18572A54263b1763j20409E6808N0143
10839A06951K51436c74396j21357a75343A81680D4578a67512A246K05615F548
10828b1558m634o6094I0914h5508j64604g6751j12191D4938K88559a29491A6277
10816d38020A4317d16779i4503c2911A10498i1585b0647H7131d2112a7897B026
$$ y = [-217813, -281252, -75488, -46722, -1103, 217994, 312382, 95882, -273452, -166587, 21746, 221070, 95087, -125213, 234423, -38134, -147825, 155983, -307346, -119724, -79701, -62543, -456633, 151048, 34364, -15608, 453530, -26477, -188275, 368346, 82285, 47641, -73609, -63709, -51861, -93786, 41911, 220459, 91629, -71474, -313414, 193387, -237144, -180941, -164297, -141810, 174982, -364141, 96046, -218572, 154263, -21763, -142172, 56808, 106951, 358387, -374396, -495753, -175343, 181680, 44578, -167512, 1246, 206861, 6548, -21558, -26192, -92286, 90914, -85508, -250112, -76751, -188942, 44938, 333497, -129491, 16277, -438020, 14317, -416779, -94503, -32911, 110498, -91585, -20647, 87131, -42112, -17897, 2026]
10804D3152h3716k12994A27119a25209j47330a31039p3030F6786B2553a09301
10793A00768a77384b2350O312j24795A91035b0899B3332a00570l67660F2054b23445
10781b61475b1043n8473H1672O6490o6906K7891n1003i2633c7121j23964G4866
10769A7948d6297D6024a20904l6069B04968g2286K0534A01729b24360R1172B98673
10757a47221h345E0636r80b19029P1361o846D5966a70113O8151B58338c2670l10424
10745c43094G3871G25N6349L6964b0496j81680l1585F6045a66172j68599F3134
10733a5778B17914k2707g6096C6174K44737d31485G1897g3044b4839A30244D182
10721g4923A51402c37284B2350a29810A47659b8880p9115m373j77463C86584b64843
$$ y = [43152, -83716, -296710, 127119, -125209, -272539, -131039, -204069, 66786, 22553, -109301, 100768, -177384, -22350, -16038, -140833, 191035, -20899, 23332, -100570, -468230, 62054, -223445, -261475, -21043, -79516, 81672, 148162, 81256, 109147, 58144, -92633, -37121, -161085, 74866, 17948, -46297, 46024, -120904, -156973, 204968, -72286, -51752, 101729, -224360, -133188, 298673, -147221, -8345, 50636, 49656, -219029, -147668, -154514, 45966, -170113, -101962, 258338, -32670, -343094, 73871, 725, 57074, 94038, -20496, -202176, -233761, 66045, -166172, -334771, 63134, -15778, 217914, 195207, -76096, 36174, 280911, -431485, 71897, -73044, -24839, 130244, 4182, -74923, 151402, -337284, 22350, -129810, 147659, -28880, -107995, -112368, -289831, 386584, -264843]
10709e3350B64521K8239e9229l8738L2619N448k96422B84252j10436q1627g4185
10697b23059M4835a9041k13402c6101j91277f2882A34450P3423I1653i8970d1992
10685h2780l85943e2649q4820A8352c09682A28539J64571d9780J8834j38373N1783
10674a17536N149e2531C46276b37546F8546b98853A32610d0912o0034G49J19711
10663A20460k0240a07998A29457h9256p4610b1446o83791G6288j7050c09936N9162
10652b50774j5452j12673a57892j15347F4434a38267G7234b1748j92002C2079
10641A2189J03182b63572P008I1645Q2259e1035B7871a75274I0495J35410b90162
10629a27391c4309j00847l819k3008l2826j29316C9725a6303j71369B18532a7381
$$ y = [-53350, 264521, 292760, -59229, -97967, -65348, -59900, -356322, 284252, 173816, 92189, -74185, -223059, -178224, -19041, -232443, -36101, -227378, -62882, 134450, 207873, 91653, -98970, -41992, -82780, -468723, -52649, -137469, 18352, -309682, 128539, 293110, -49780, -30946, -169319, -117536, -112387, -52531, 346276, -237546, 68546, -298853, 132610, -40912, -100946, 749, 120460, 100220, -107998, 129457, -89256, -163866, -21446, -705237, 76288, 59238, -309936, -250774, -266226, -378899, -157892, -273239, 64434, -138267, 77234, -21748, -213750, 32079, 12189, 115371, -263572, -256564, 91645, 173904, -51035, 27871, -175274, 90495, 225905, -290162, -127391, -34309, -135156, -138975, -161983, -194809, -324125, 39725, -16303, -187672, 218532, -17381]
10617d238C7666K85594i2497A14063a49396H1073a92735h5803k6830j83962A64088
10605B59050c68972d3210D8557b312A85127J35769a10126Q032l4023b0406O192
10594a4214G6839d9270j00458A03309i2765C41481l3495J8198a52971k15840F2840
10582A30430O376K02208b20465A04056b14165K6288A22774M7030b06496d630q4304
10571h8934A1685b6162A88238b13129A63433a58671O5326j3458A70376N0530H4403
10559C0454a22703j23354b626n1344C2602a8935l1948A07752c47859R7709e9013
10547b07932f8064k16571B87087b41053i5247J0551j8615I1637P2202h8585M4048
10536d4537n7503D4752a80268p8424P9065A92723o0313F744O8246g8021j04305
$$ y = [-4238, 37666, 323260, -92497, 114063, -149396, 81073, -192735, -85803, -112633, -296595, 164088, 259050, -368972, -43210, 48557, -2312, 185127, 320896, -110126, -102094, -136117, -20406, -14214, 76839, -49270, -149728, 103309, -92765, 341481, 307986, 326184, -152971, -368811, 62840, 130430, 136806, 339014, -220465, 104056, -214165, -187877, 122774, 169804, -206496, -4630, -88934, 11685, -26162, 188238, -213129, 163433, -158671, -93345, -106803, 170376, 220906, 84403, 30454, -122703, -246057, -2626, -53970, 32602, -18935, -50883, 107752, -347859, -250150, -59013, -207932, -68064, -284635, 287087, -241053, -95247, -84696, -103311, 91637, 163839, -88585, -44537, -102040, 44752, -180268, -258692, -179627, 192723, 132410, 6744, 74990, -78021, -182326]
10525a82326O3749l5407e1030k23498H5153a16312J780j314A24900l7643B3198
10513B63959j19138b14931C4894M13157d34705J96911A96661a87929Q5879j25815
10503b27865F8422L29289j38215b1341r2032A92006n1752o7072A9281h3380n8380
10492a41760A9248N89661F7893O3688E1148a69657N5529A47634a312A38902M45544
10481E84446B27264R0904M5033j26056L45587A51333B2390J37372J38480A03491
10470a50482n7698p9893B34820C7246J9636R9639c03013e8214N004j73293B61958
10458A18519A9986M88a30459C41138b18952Q6334B07467a52870I0503K09165b28914
10446D7113b68560A9867J22420b48684a08063n3206B05972b18959A28219m8179
$$ y = [-182326, -118577, -153984, -51030, -274528, 85153, -116312, -114532, -115846, 124900, 87257, 23198, 263959, 144821, -214931, 34894, 448051, -434705, -237794, 196661, -187929, -102050, -227865, 68422, 397711, 259496, -21341, -113373, 192006, 140254, 73182, 19281, -83380, -141760, 19248, 608909, 67893, 131581, 51148, -169657, -114128, 147634, -1312, 138902, 584446, 227264, 318168, 363201, 237145, 582732, 151333, 22390, 159762, 298242, 103491, -150482, -208180, -288073, 234820, 37246, 56882, 156521, -303013, -58214, -53210, -226503, 261958, 118519, 19986, 20474, -130459, 341138, -218952, -132618, 207467, -152870, 90503, 299668, -228914, 47113, -268560, 19867, 142287, -248684, -108063, -161269, 205972, -218959, 128219, 80040]
10436H0040J33677J08291f3806k23907a0572G862L17636F262c01356E0093q013
10425D2080J30987a88012l44109c3510h230n5390m1895m1140A40372a37500H8772
10413d4629K0359m0621I0856d8172D2137c39010a17802A02293B4327J85266a81305
10401G8546M1567A5229f9088k9490E1727J26702d6152r4728J5281q4320B3742
10389D13926j67297B8612J85352g5660B44943C1931J728J83849r4022j0292K12572
10378C25766b25548g3270A46245J18317C7149K89032J07625A88887a9076B42559
10367F95501j16265j71287j89996L8319D6785K85105A05883L31941q4775j03679
10357B49370N2199b93427A20907O7420L09647K1618O2918N5052k2472l03811a09313
$$ y = [80040, 213717, 322008, -63806, -287713, -10572, 7862, 325498, 6262, -301356, 50093, 42080, 173067, -188012, -532121, -33510, -8230, -63620, -105515, -146655, 140372, -137500, 88772, -44629, -24270, -64891, 90856, -48172, 42137, -339010, -117802, 102293, 24327, 209593, -181305, 78546, 120113, 15229, -69088, -98578, 51727, 178429, -46152, -140880, -125599, -209919, 23742, 413926, 246629, 28612, 213964, -75660, 244943, 31931, 33659, 217508, 123486, 113194, 325766, -225548, -73270, 146245, 264562, 37149, 326181, 433806, 188887, -19076, 242559, 695501, 579236, 407949, 217953, 256272, 46785, 331890, 105883, 437824, 353049, 249370, 301569, -293427, 120907, 188327, 497974, 519592, 582510, 637562, 615090, 311279, -109313]
10345B34007f0590D80281k30605c1937A46209J59612a81601H731J27717K6399
10335A62847a03427j3263E34829B30979G2159q667O0613i0333r5392C27884b62077
10323B71204N5794j42776E821a9667b814D84136C0979b01619p7383A5558N52133
10312E67691H5982p249a72172j69597A0368K62293a23082M7932j10801P4284m1691
10301a53358e3618B8002a19523d4337B84999a94888d9728k55357E0119b94011
10290c9018k06124A49201a97216A64620M1245a41169D2533f5983m5117j50086
10280b61186a30546d5478j36603D7287J36697k9437R56A3511a20070a7017m21569
10269d38586A73828b46360a08696d4647R063A85889J2749f3690C29901k3611r1227
$$ y = [234007, -60590, 480281, 249676, -31937, 146209, 305821, -181601, 8731, 136448, 162847, -103427, -116690, 534829, 230979, 72159, 63492, 124105, -90333, -185725, 327884, -262077, 271204, 326998, 184222, 5821, -19667, -2814, 484136, 30979, -201619, -279002, 15558, 567691, 85982, 78733, -172172, -341769, 10368, 272661, -123082, -75150, -185951, -111667, -153358, -53618, 28002, -119523, -44337, 284999, -194888, -49728, -305085, 50119, -294011, -39018, -245142, 149201, -197216, 164620, 205865, -141169, 42533, -65983, -111100, -261186, -130546, -45478, -182081, 47287, 183984, 154547, 155503, 13511, -120070, -17017, -438586, 173828, -246360, -108696, -44647, -35584, 185889, 198638, -63690, 329901, 306290, 215063]
10258B15063O7243O6377m2364m5371b26496h8479j37635b5058r8905K3254I8603
10246a55795j60834a27592m073K1576F6648i4328G7540J42728a45263f2198b3449
10234E6668J90243J02151e381j92308f9569j60154k3285a05736d8853m06761a95802
10222c7538k50280A04478Q8534a46666d168l9641k10320g5126E8508A3845J48445
10211A62290J555B2457M5926c58668g4094A440c8596E9354b86117D00687e8226
10199b01268N0888A26467B1954h6673A91267h4700I6769A0911a14146b4052G6984
10187C2278a22655N5089j36118A91296N459J04224I1320d8997H1919a64269g8886
10175D7060J27887f3390m2150A08828a86067O2533M6155A04240J1497n2461h6334
$$ y = [215063, 282306, 348683, 306319, 260948, -226496, -88479, -226114, -25058, -123963, -100709, 98603, -155795, -316629, -127592, -131665, -110089, 66648, -94328, 77540, 220268, -145263, -62198, -23449, 56668, 246911, 349062, -5381, -197689, -69569, -229723, -253008, -105736, -48853, -455614, -195802, -37538, -287818, 104478, 193012, -146666, -4168, -43809, -254129, -75126, 58508, 13845, 162290, 163845, 22457, 68383, -358668, -74094, 1440, -38596, 59354, -286117, 400687, -58226, -201268, -150380, 126467, 21954, -86673, 191267, -84700, 96769, 10911, -114146, -24052, 76984, 32278, -122655, -67566, -203684, 191296, 196755, 300979, 91320, -48997, 81919, -164269, -78886, 47060, 174947, -63390, -105540, 108828, -186067, -123534, -77379, 104240, 115737, 63276, -86334]
10163a02690c8786r2454j79121a19382A63544D7627J11156b19325R0224H5826
10152d4050F828J77342d07939h6042A10327b760B13374D4822b8766l5773b8487
10140b0215p4458k18419g2731B69472J23463a008o5391j95383N0841a4451E6695
10128a75847Q2807c3472B2793K64239h3298C0808P715N6762h0796b3716k68732
10117b92448J6614d5027j0924k5068K2971k04111a10338p0535e6151a9103A80234
10105c8348k10180a21715q9707B86967D5389N9844M9294o8122c74669c9704E7841
10093A5997c1595l25689J18818R6691j91073f0127J9857k83935A03403D50b67998
10081a90017b8852P212C9651N119b86958J27526P3845B73011b03483A7627d4645
$$ y = [-102690, -38786, -131240, -310361, -119382, 163544, 47627, 158783, -219325, -129101, 85826, -44050, 6828, 184170, -407939, -86042, 110327, -2760, 213374, 44822, -28766, -64539, -28487, -20215, -94673, -313092, -72731, 269472, 392935, -1008, -66399, -261782, -210941, -14451, 56695, -175847, -93040, -33472, 22793, 287032, -83298, 30808, 38523, 95285, -80796, -23716, -292448, -275834, -45027, -55951, -81019, -58048, -262159, -110338, -180873, -56151, -19103, 180234, -38348, -248528, -121715, -211422, 286967, 45389, 105233, 154527, 86405, -374669, -39704, 57841, 15997, -31595, -357284, -238466, -141775, -332848, -60127, -40270, -324205, 103403, 450, -267998, -190017, -28852, -21640, 39651, 44770, -286958, -159432, -85587, 273011, -203483, 17627, -44645]
10069A06166a9091k79611R1910I8a6028H162K20140j08868l1275a1937k25464
10058b37401j00613F0001k2122a6821r0024n4354J764B05000f6457k26963D2088
10046d8634j53558M9688l23873a3125O084B1639a81364c8088n1209q7085F2054
10034a55249g0594K0184r0097F1349K55895a01675A18274b49731a18558P874A42572
10022A52034c89062a04277m8891o247f0546j56010h9183j84147D2941a85714Q8410
10011i7304b5070j26964g2717F9038d8775I6523b16502B65776f5193C19626f1121
9999b96630r865R9369k60797A2005a69775f5012J9138m069a9678p5084o5656j54684
9987c15102G1606l1510c37752o4394b9844i497l13276J15309G5358a50151l73137
$$ y = [106166, -19091, -298702, -206792, 98, -16028, 8162, 228302, 119434, 88159, -11937, -237401, -338014, 60001, 37879, -16821, -106845, -161199, -159435, 205000, -66457, -293420, 42088, -48634, -202192, -152504, -476377, -13125, -7041, 21639, -181364, -38088, -89297, -176382, 62054, -155249, -70594, -50410, -140507, 61349, 317244, -101675, 118274, -249731, -118558, -110684, 142572, 152034, -389062, -104277, -153168, -159415, -60546, -216556, -89183, -273330, 42941, -185714, -97304, -25070, -152034, -72717, 69038, -48775, 96523, -216502, 265776, -65193, 319626, -61121, -296630, -306495, -207126, -467923, 12005, -169775, -65012, -45874, -49943, -19678, -94762, -160418, -315102, 71606, 40096, -337752, -402146, -29844, -9497, -322773, -207464, 75358, -150151, -523288]
9976e23288B8811M495L50365h0684C56522b07201L4320c9652k3810k61126e530
9964a44137A1410i9950c5193N377H7304b09676e2575p6230N419q6505B51574G6234
9951d7820k12201C75929c00093E5356R1408c9583k16008B80140j29492J1592a87074
9939b0661C97729c31341J50380P8729A079J19366H213K6721b19704C2206a65446
9927g2213q3513g4476I6239d9366A48981c93953M7866H3980b51742q3943A05474
9915I3528a66476g4847n1033D0238P403b07849d2899j1425j01277A07538b04067
9903H87M7613M3506a55026r179Q1286B02061B6407a68972N5590I6696G159b28420
9890f5314G5056a69597e0114p7584N6876I3404J81203l5311f61p9101r4638j7015
$$ y = [-523288, 28811, 33306, 383671, -80684, 356522, -207201, -172881, -39652, -63462, -324588, -5530, -144137, 11410, -99950, -35193, -29816, 87304, -209676, -52575, -128805, -123386, -209891, 251574, 76234, -47820, -260021, 375929, -300093, 55356, 146764, -39583, -255591, 280140, 150648, 162240, -187074, -20661, 397729, -331341, -180961, -102232, 1079, 120445, 8213, 34934, -219704, 32206, -165446, -72213, -155726, -74476, 96239, -49366, 148981, -393953, -346087, 83980, -251742, -335685, 105474, 93528, -166476, -74847, -125880, 40238, 47641, -207849, -42899, -54324, -155601, 107538, -204067, 887, 48500, 92006, -155026, -164205, -82919, 202061, 26407, -168972, -113382, 96696, 7159, -228420, -65314, 75056, -169597, -50114, -127698, -70822, 93404, 274607, 239296, -661, -79762, -174400, -191415]
9878a91415j40815D8034d5775j59717B19180q4631c5669A83571i7963a6398k54705
9867b71103m0323N5719e0073p1745L655j8345H258R6047a54044B55674a82691
9855a36943A16660j1709a444G7650A4699N8686b40615N2200Q1878A52435a59340
9843A20109C9686a89051Q3078j89430J32021f2592G3791a24341A71937e0642j74628
9832b25270r0H8609a09316K0610k57523A27131N155l3810b18968B23228G5381
9820a80050B2310a68468A21152F480J95005L9157b00559b4890A82849b25024L3535
9809a91489O2955j99168J05623A76786c74196K9771G6723R1488b53973m9676Q2208
9798b21441d0966D9793b09802R9601c9641j0222k02231a05312j65441H8539c61480
$$ y = [-191415, -332230, 48034, -45775, -205492, 219180, 134549, -35669, 183571, -97963, -16398, -271103, -311426, -255707, -50073, -121818, -118163, -136508, 8258, 104305, -154044, 255674, -182691, -136943, 116660, 104951, -1444, 77650, 14699, 73385, -240615, -188415, -106537, 152435, -159340, 120109, 39686, -189051, -105973, -295403, -163382, -62592, 73791, -124341, 171937, -50642, -225270, -225360, 88609, -109316, -88706, -346229, 127131, 132286, 98476, -218968, 223228, 75381, -180050, 22310, -168468, 121152, 6480, 201485, 240642, -200559, -24890, 182849, -225024, -191489, -128534, -327702, -222079, 176786, -374196, -344425, 76723, 168211, -253973, -303649, -221441, -40966, 49793, -209802, -110201, -39641, -49863, -252094, -105312, -270753, 88539, -361480]
9786A04271b17349n3911Q8323n3015a01466b94n326k18531H9171c7225o9629I9593
9773A77210a81112A42369C7461L58883d7512m6095A68797a5636j74182b2143A32838
9761F8805a276A6003b13186o3213a37290K0433pj08705i0834j14563B8665b30761
9748g0319j52825j01528F3670N575e3445B02202a5805j04212p3536C4238J67201
9737B01439I1280K1891c07243h4333B2429J00831k9035e6632D7241E476K25843
9726B31319A10412a7153j95366j2507j9487i608j63206e2589L932B00705a64870
9714b08985d9153p8598j34884n5995G2999P0239A0242c37369a07128j01467i9777
9702c64698A01956c66608K9262a16636j57028A979g7868A00864B3088b10312B8743
$$ y = [104271, -217349, -271260, -182937, -235952, -101466, -294, -5620, -224151, 89171, -37225, -106854, 99593, 177210, -181112, 142369, 37461, 396344, -47512, -93607, 168797, -15636, -189818, -22143, 132838, 68805, -1276, 16003, -213186, -276399, -137290, -116857, -116864, -225569, -90834, -205397, 28665, -230761, -70319, -223144, -324672, 63670, 69245, -53445, 202202, -15805, -120017, -193553, 34238, 201439, 91280, 113171, -307243, -84333, 22429, 123260, 94225, -56632, 47241, 5476, 231319, 110412, -17153, -212519, -225026, -244513, -9608, -172814, -52589, -48657, 200705, -164870, -208985, -49153, -127751, -262635, -318630, 72999, 143238, 10242, -337369, -107128, -208595, -99777, -364698, 101956, -366608, -337346, -116636, -273664, 1979, -77868, 100864, 23088, -210312, 28743]
9690b87262h8365I2299M840i1448G8018N6144b71347m9188B72572P4562E6243
9678i7742j28959i6619B9374c07702E754b6620G0528e3034p9001j7501C7383N2558
9666H9941c54541b9993p2183d2378j35246r3353m745c5219m3848K3262E9407J7334
9654G6741R5123a49540k45466A32672C2662K89062e714j77799f9971G4h6767B43718
9641a8261j9977j93028J09975l24339F7843a78755Q8683l2705A9154K12592b59143
9629G3985J68634g815A06496a18439l6452B28834c2419F0599c6648H2513A9826
9617c68730a64090m4673A49397A7289a22058A1277b1144C69684c49028h1881J3790
9606f8091b131B851d24905D7620b02427q1847e8310j41642A18078a21420B39506
$$ y = [-287262, -88365, 92299, 97139, -91448, 78018, 134162, -271347, -320535, 272572, 347134, 56243, -97742, -226701, -96619, 29374, -307702, 5754, -26620, 70528, -53034, -132035, -149536, 37383, 89941, -354541, -29993, -102176, -42378, -177624, -270977, -275722, -35219, -79067, -55805, 59407, 76741, 171864, -149540, -395006, 132672, 32662, 321724, -5714, -183513, -69971, 74, -86767, 243718, -18261, -38238, -231266, -121291, -445630, 67843, -178755, -90072, -122777, 19154, 231746, -259143, 73985, 242619, -7815, 106496, -118439, -154891, 228834, -32419, 60599, -36648, 82513, 19826, -368730, -164090, -208763, 149397, 17289, -122058, 11277, -21144, 369684, -349028, -81881, -68091, -2131, 2851, -424905, 47620, -202427, -284274, -58310, -199952, 118078, -121420, 239506]
9594B32779C7850K30329j24713a54680m0858p3167e3711j9343j35440a02811C00064
9582h7017j71164i8343k925B16108q1369a67166c708o0065m2360b9084r0668G1986
9569C3626f7422r6833j04694i5431A3787a28178b4822l52918k4430C6580a9035
9557A81622G5972b05252c8439j2089l6911b3337A3363J6642a27494j4822A10176
9545a69749d3965j49871d832j03802A24531Q436E7945d16595C1514a06772A18138
9533b4496r0553n9963k5959n1861Q8079j36879h6460n7743j46082c5282A65730
9521b68909e0271m2990o230N029K7350L3019a6559C181M2326R5982b3813k9853
9509e3666I8118J0709n3521M8004a02056B44972p6456a25495a7536A84663a25778
$$ y = [232779, 37850, 268179, 143466, -154680, -195538, -268705, -53711, -73054, -208494, -102811, 300064, -87017, -258181, -98343, -101268, 216108, 134739, -167166, -3708, -63773, -106133, -29084, -119752, 71986, 33626, -67422, -164255, -268949, -95431, 13787, -128178, -24822, -377740, -402170, 36580, -19035, 181622, 75972, -205252, -38439, -50528, -87439, -23337, 13363, 30005, -127494, -142316, 110176, -169749, -43965, -193836, -4832, -108634, 124531, 132967, 57945, -416595, 31514, -106772, 118138, -24496, -115049, -175012, -200971, -252832, -164753, -301632, -86460, -144203, -290285, -35282, 165730, -268909, -50271, -93261, -99491, -94462, -67112, -34093, -16559, 3181, 45507, 141489, -23813, -53666, 98118, 108827, 55306, 103310, -102056, 244972, 168516, -125495, -17536, 184663, -125778]
9497I0631a90496A80043a51386C6703L25824d628C4084b08477m7969C5770A0179
9485c9894m0289j8785r9420A69913b18022j14678g600l92725M144I9782e0173
9473A82699k7177i5049G2532h3110A03818c6445B48997g3341K2552A84629b42085
9461e5395A35673b44901n5648b5357j13882K6398B04026A9689h8627f22j25479
9450a26101b6190C3485A4989L15134a65000a8226B69084a98669f5113G1048J40172
9439B11220a18961A94027a17640j11606A02153b58630C364K77890F6868c4143
9428A10500B4578E956K8908L3660d4874m05678h3804m3720O004k6240A79128a96434
9415a20916L7054g686A01797c9284j39168a3215j2961B263m38J6464a62102C07012
$$ y = [90631, -190496, 180043, -151386, 36703, 362527, -4628, 34084, -208477, -256446, 35770, 10179, -39894, -80183, -98968, -198388, 169913, -218022, -332700, -7600, -400325, -396181, 99782, -50173, 182699, 155522, -95049, 72532, -83110, 103818, -36445, 248997, -73341, -50789, 184629, -242085, -55395, 135673, -244901, -300549, -25357, -139239, -112841, 204026, 19689, -88627, -622, -126101, -26190, 33485, 14989, 330123, -165000, -18226, 269084, -198669, -65113, 71048, 211220, -118961, 194027, -117640, -229246, 102153, -258630, 3364, 281254, 66868, -34143, 110500, 24578, 5956, 34864, 68524, -44874, -450552, -83804, -127524, -121520, -147760, 179128, -196434, -120916, -83862, -7686, 101797, -39284, -178452, -13215, -26176, 2263, 1825, 18289, -162102, 307012]
9402a61587p2814J02857L7934l71127I4834i2127E4024i4960F5705f054o5891
9391g1945G2088c71193i6205B0285a0175F6845a44001n4307C6375K1491d9654
9379A46155c94194a63761l7752j59175a09815C5915K75093c7934H80K4813g4920
9367C85368C2122O122a36209F1632c1409B42824h2371J7736k20398P1434C31940
9355C27479H2721b05386e8229o8221A68626b71959A64257H1185K58058G7921f6363
9343A810a48920e5471C19762c5623j86731I4889b55727B7367J52448D2403a38922
9331A02742J62578b8536k69496e3163r234B63776I6878a29338j36026n8433J55452
9320a68345k80586d2418k05055q6187J54755A53363H395l237K1843B606d73463
$$ y = [-161587, -234401, -131544, -93610, -464737, 94834, -92127, 54024, -94960, 65705, -6054, -71945, 72088, -371193, -96205, 20285, -10175, 66845, -144001, -198308, 36375, 57866, -49654, 146155, -394194, -163761, -201513, -360688, -109815, 35915, 311008, -37934, 880, 25693, -74920, 385368, 32122, 38244, -136209, 61632, -31409, 242824, -82371, -64635, -285033, -213599, 331940, 327479, 82721, -205386, -58229, -126450, 168626, -271959, 164257, 81185, 339243, 77921, -66363, 1810, -148920, -55471, 319762, -35623, -222354, 94889, -255727, 27367, 179815, 42403, -138922, 102742, 265320, -28536, -298032, -53163, -62397, 263776, 96878, -129338, -265364, -323797, -168345, -448931, -42418, -247473, -333660, -178905, 153363, 8395, 5158, 27001, 2606, -473463]
9308a91855A60175a95886a791k76853a704l29506A55283J34935a09170K4514j05463
9297a90119b7309j53106m2702k2943e0478k00787G2336a11333B9082b48633p11
9286b49344l0244i2013k86071J06909a30956I8672b16319d7757p2078m1888B05459
9274B80553a5229B96933g2139A11159c1803n6642A13147e16901A17145a15573
9263D7358P2853b01319d1594A03789m4613g8995o6567B9318b12735n1494E3534
9251a84375D6893d1311D96046D9567J82536c2393p7089l638h308C5246a05934
9239f0297C65059E2577K56162b91714B11206c9909b649k37056k4271k2453i4600
9227c6864D8939O9024b65970a26260H0264a61588b0447A02437a99330C2791a86067
$$ y = [-191855, 160175, -195886, -1791, -278644, -1704, -331210, 155283, 290218, -109170, -84656, -190119, -27309, -180415, -223117, -246060, -50478, -251265, 72336, -111333, 29082, -248633, -249344, -279588, -92013, -378084, -271175, -130956, 98672, -216319, -47757, -119835, -161723, 205459, 280553, -15229, 296933, -72139, 111159, -31803, -88445, 113147, -516901, 117145, -115573, 47358, 120211, -201319, -41594, 103789, 59176, -78995, -145562, 29318, -212735, -264229, 53534, -184375, 46893, -41311, 496046, 49567, 232103, -32393, -109482, -113120, -8308, 35246, -105934, -60297, 365059, 52577, 308739, -291714, 211206, -39909, -2649, -239705, -263976, -286429, -94600, -36864, 48939, 117963, -265970, -126260, 80264, -161588, -20447, 102437, -199330, 32791, -186067]
9215g4249B44717J4661A2180a20596l06278A95089b99585f5529l7406D5779b04054
9203a38027O4354k25947A31960a75520l4889A54702b21382A91175M9589m6044
9193A94720d54554a1218k4382l16533j29393B5184a61858a2149r3655l5452j55775
9182b97031L5334A05638n2775J1343a94319B66185b48511F172a02582C4551f1680
9170a44642c7286o473p3959B80419c141q3541A2265J17584a38970b9662k11840
9159b41502A25435a21198J3555k19766Q0636h7504j05699A56131B6219c8466j57824
9148a96290f6529A871b87508C3902l826R8719j930c86A68708a46876c063k85327
9136b88390O0764R1852d3460n8136p8794c0416m48054b19958F7224J63396i616
$$ y = [-74249, 244717, 259378, 12180, -120596, -426874, 195089, -299585, -65529, -102935, 45779, -204054, -138027, -73673, -299620, 131960, -175520, -210409, 154702, -221382, 191175, 240764, 194720, -454554, -11218, -35600, -352133, -481526, 25184, -161858, -12149, -105804, -141256, -297031, -261697, 105638, 52863, 64206, -194319, 266185, -248511, 6172, -102582, 34551, -61680, -144642, -37286, -43759, -117718, 280419, -3141, -86682, 12265, 129849, -138970, -29662, -241502, 125435, -121198, -107643, -327409, -246773, -87504, -193203, 156131, 26219, -38466, -196290, -66529, 1871, -287508, 33902, 30076, 128795, 126865, -386, 168708, -146876, -3063, -288390, -227626, -135774, -43460, -101596, -180390, -30416, -478470, -219958, 67224, 230620, -9616]
9124b88074k3132A9888h1761A14425e5438k00406H6424R4514J46813A06268i6214
9112c2946j81232M4487d5113j43182J0715l6606E78K31385b46986A80427h0169
9100C29230F9040K06753a49087b0778L001F816L6565d728G4643O839d4304H4741
9087A85566H1240k0432c22277J60371n138P8128c6635k59804F3585A2849h9896
9075A45156b64848A48577K04114a47825l725g71H9627J99159e8649e389o2076
9064f7465j7767j83546n657J30230B421a04030d2247k872k0450A96227c0706a4534
9051b51758M7655J00172r0749B32545p4844Q6717q0562g041k03493A21850g7539
9039H465J2732K8195a16253j03525h9950j48569j11750c0668p1866G1848c05850
$$ y = [-288074, -311206, 19888, -81761, 114425, -55438, -255844, 86424, 180938, 327751, 106268, -96214, -32946, -214178, -169691, -45113, -188295, -177580, -214186, 578, 231963, -246986, 180427, -80169, 329230, 69040, 275793, -149087, -20778, -17777, 6816, 43381, -4728, 74643, 81482, -44304, 84741, 185566, 81240, 60808, -322277, -161906, -167044, -88916, -36635, -296439, 63585, 12849, -89896, 145156, -264848, 148577, 352691, -147825, -151550, -771, 89627, 288786, -58649, -5389, -67465, -85232, -268778, -274435, -144205, 2421, -104030, -42247, -45119, -65569, 196227, -30706, -14534, -251758, -204103, -103931, -194680, 232545, 157701, 244418, 163856, -7041, -210534, 121850, -77539, 8465, 21197, 49392, -116253, -219778, -89950, -238519, -350269, -30668, -102534, 71848, -305850]
9027f8384C56905d9233B8461K20579e980F9799a04657j96121P6626E5309a86683
9015A15969b16160A60739F7175a48504H5578L7465k3471k9641b57418A50953C2234
9003a88931B17349M0893b5697m0898b5227l66046k1729i3509m2939E4434a61971
8991A74452a62607j14166f4078C1988M3274B3323a52950n7907B53a34518A93864
8979d1792j68593A25243G967a28610k23947J36584b2595n9114L5652q7934M1715
8968i2276B45640A11234a08114A2752a40435B00307A2347K0956a24874B94355
8957a40625K7007A74237l1958c5773j4613q105A56014B2054J63707a03760B45388
8945g3060H0005k4713a09621A85862J2726I5414D2184b69024I6645c2358E32927
$$ y = [-68384, 356905, -49233, 28461, 249040, -5980, 69799, -104657, -300778, -224152, 55309, -186683, 115969, -216160, 160739, 67175, -148504, 85578, 123043, 99572, 69931, -257418, 150953, 32234, -188931, 217349, 258242, -25697, -66595, -25227, -391273, -413002, -93509, -136448, 54434, -161971, 174452, -162607, -276773, -64078, 31988, 75262, 23323, -152950, -210857, 253, -134518, 193864, -41792, -210385, 125243, 7967, -128610, -352557, -215973, -22595, -81709, -46057, -133991, -92276, 245640, 111234, -108114, 12752, -140435, 200307, 12347, 33303, -124874, 294355, -140625, -113618, 174237, 142279, -35773, -50386, -58491, 156014, 22054, 185761, -103760, 245388, -73060, 80005, 55292, -109621, 185862, 198588, 95414, 42184, -269024, 96645, -32358, 532927]
8933A80789a78448D5072e6443J7321A27545J42874G2357L2852M64547O04494J844807
8922C019057M691958K349506C125122D13377o627N9545j19325G6194c68188C221
8911F5655h1389A84975H7147K64557A02357C7661j7279a86486m428A62363L7500
8900A99863a36228m9551l0183N9174B81227D4919J6357a93068A60108M0043A4274
8888F3489K017c36754g2222l14901J47763N5384G5341i8293j58471b005k89983
8877b91988h9280J4563j93075J27860K6694k3865P587f034j78419B10947b76611
8865A30759b2722B6871a83064A82247a11235l90294a25839I669a37036m906G8528
8853F6731c43438h1829A77390a74463o3352L0525L7868A00792a72771H3087a32034
$$ y = [180789, -178448, 45072, -56443, -39122, 127545, 270419, 72357, 105209, 569756, 1174250, 3019057, 7711015, 10060521, 3125122, 413377, 406750, 466295, 346970, 76194, -368188, 3221, 65655, -81389, 184975, 87147, 351704, 102357, 37661, 20382, -186486, -190914, 162363, 199863, -136228, -185779, -215962, -156788, 281227, 44919, 61276, -193068, 160108, 200151, 14274, 63489, 65506, -336754, -72222, -387123, -239360, -183976, 75341, -98293, -256764, -2005, -291988, -89280, -74717, -267792, -139932, -113238, -137103, -129516, -6034, -184453, 210947, -276611, 130759, -22722, 26871, -183064, 182247, -111235, -501529, -125839, 9669, -137036, -141942, 78528, 66731, -343438, -81829, 177390, -174463, -237815, -207290, -169422, 100792, -172771, 83087, -132034]
8841f17F7886a08157a340j01047i126m7689H5195h914H2325a85191k13752A93156
8828e2075H462a02697K6584k30712g6213E842J91971B9267b5611C9184i8486j43461
8816b41947Q7811K637f4024p7899k5293b6921B10058a1037k7826k19369C27985
8804a06949c3770J1715B7934J61935f1782D6877b61237J07811g4587A00554m2467
$$ y = [-617, 67886, -108157, -1340, -102387, -9126, -56815, 85195, -8914, 82325, -185191, -398943, 193156, -52075, 8462, -102697, -76113, -306825, -76213, 5842, 197813, 29267, -25611, 39184, -98486, -241947, -154136, -151499, -64024, -141923, -167216, -26921, 210058, -11037, -38863, -258232, 327985, -106949, -33770, -22055, 27934, 189869, -61782, 46877, -261237, -153426, -74587, 100554, 58087]
$$ [...]
##END NTUPLES=NMR SPECTRUM
##END=
