##TITLE=AC1615_BRAAN13346_8317375_tVIwYc4zw2
##JCAMPDX= 6.0         $$ Bruker NMR JCAMP-DX V2.0
##DATA TYPE= NMR SPECTRUM
##DATA CLASS= NTUPLES
##ORIGIN= BRUKER
##OWNER= Administrator
$$ 1.72 TOPSPIN		Version 2.1
$$ 2013-11-13 22:00:37.489 -0800  Administrator@X
$$ Compression mode = diff/dup
##.OBSERVE FREQUENCY= 400.02188249412
##.OBSERVE NUCLEUS= ^1H
##.ACQUISITION MODE= SIMULTANEOUS (DQD)
##.ACQUISITION SCHEME= undefined
##.AVERAGES= 64
##.DIGITISER RES= 22
##SPECTROMETER/DATA SYSTEM= spect
##.PULSE SEQUENCE= noesygpps1d.comp
##.SOLVENT NAME= COFFEE_meoh
##.SHIFT REFERENCE= INTERNAL, COFFEE_meoh, 1, 14.96094
##AUDIT TRAIL= $$ (NUMBER, WHEN, WHO, WHERE, PROCESS, VERSION, WHAT)
$$ ##TITLE= Audit trail, TOPSPIN		Version 2.1
$$ ##JCAMPDX= 5.01
$$ ##ORIGIN= Bruker BioSpin GmbH
$$ ##OWNER= Administrator
$$ $$ E:\/data/COFFEE/nmr/AC1615_BRAAN13346_8317375_tVIwYc4zw2/12/pdata/1/auditp.txt
$$ ##AUDIT TRAIL=  $$ (NUMBER, WHEN, WHO, WHERE, PROCESS, VERSION, WHAT)
(   1,<2013-11-13 22:00:31.777 -0800>,<Administrator>,<X>,<go>,<TOPSPIN 2.1>,
      <created by zg
	started at 2013-11-13 21:49:02.079 -0800,
	POWCHK enabled, PULCHK disabled,
       configuration hash MD5:
       C8 4E 4E 5D D3 5C D8 9E 9F 52 82 E0 59 8A DE 15
       data hash MD5: 64K
       DA E1 36 03 FF FF ED 35 A4 F1 E3 10 32 6D 68 01>)
(   2,<2013-11-13 22:00:35.039 -0800>,<Administrator>,<X>,<proc1d>,<TOPSPIN 2.1>,
      <Start of raw data processing
       efp LB = 0.3 FT_mod = 6 PKNL = 1 PHC0 = 0 PHC1 = 0 SI = 128K 
       data hash MD5: 128K
       4C 12 C2 A0 EF 6D 5B B6 41 2C BC 19 21 EF 83 87>)
(   3,<2013-11-13 22:00:36.187 -0800>,<Administrator>,<X>,<proc1d>,<TOPSPIN 2.1>,
      <pk PHC0 = -82.65564 PHC1 = 0 
       data hash MD5: 128K
       D6 4C 3C 39 39 8E FC 97 31 B0 2A E1 08 BD 43 7D>)
(   4,<2013-11-13 22:00:36.647 -0800>,<Administrator>,<X>,<proc1d>,<TOPSPIN 2.1>,
      <abs ABSG = 1 
       data hash MD5: 128K
       BE 83 87 07 CF 2D E1 EC FE A4 84 17 72 6F 71 1E>)
(   5,<2013-11-13 22:00:36.800 -0800>,<Administrator>,<X>,<proc1d>,<TOPSPIN 2.1>,
      <abs ABSG = 2 
       data hash MD5: 128K
       91 3C E1 9D 37 7F 7F 13 E8 08 90 A2 C8 1E 7F 72>)
(   6,<2013-11-13 22:00:36.907 -0800>,<Administrator>,<X>,<proc1d>,<TOPSPIN 2.1>,
      <abs ABSG = 3 
       data hash MD5: 128K
       EC AE 9C 83 A3 39 16 9A CD 6A 77 A5 59 EE 96 14>)
(   7,<2013-11-13 22:00:37.091 -0800>,<Administrator>,<X>,<proc1d>,<TOPSPIN 2.1>,
      <abs ABSG = 4 
       data hash MD5: 128K
       A7 85 71 EA 5A E2 C8 5A 4B 05 9D 9B ED FD 45 F3>)
(   8,<2013-11-13 22:00:37.244 -0800>,<Administrator>,<X>,<proc1d>,<TOPSPIN 2.1>,
      <abs ABSG = 5 
       data hash MD5: 128K
       C2 D0 E0 54 19 2E D3 A8 92 2C B1 70 C3 FE 12 5A>)
$$ ##END=
$$ 
$$ $$ hash MD5
$$ $$ BA 87 24 A8 34 AC D6 80 EB AF C5 02 8C C0 39 DB
##$RELAX= 
##$RELAX= 
##$RELAX= 
##$RELAX= 
##$RELAX= 
##$RELAX= 
##$RELAX= 
##$RELAX= 
$$ Bruker specific parameters
$$ --------------------------
##$DU= <E:\>
##$EXPNO= 12
$$ [...]
##$TP07= 0
##$TPNAME0= <>
##$TPNAME1= <>
##$TPNAME2= <>
##$TPNAME3= <>
##$TPNAME4= <>
##$TPNAME5= <>
##$TPNAME6= <>
##$TPNAME7= <>
##$TPOAL= (0..7)
0.5 0.5 0.5 0.5 0.5 0.5 0.5 0.5
##$TPOFFS= (0..7)
0 0 0 0 0 0 0 0
##$TUNHIN= 0
##$TUNHOUT= 0
##$TUNXOUT= 0
##$USERA1= <user>
##$USERA2= <user>
##$USERA3= <user>
##$USERA4= <user>
##$USERA5= <user>
##$V9= 5
##$VALIST= <valist>
##$VCLIST= <CCCCCCCCCCCCCCC>
##$VD= 0
##$VDLIST= <DDDDDDDDDDDDDDD>
##$VPLIST= <PPPPPPPPPPPPPPP>
##$VTLIST= <TTTTTTTTTTTTTTT>
##$WBST= 1024
##$WBSW= 4
##$XGAIN= (0..3)
0 0 0 0
##$XL= 0
##$YL= 0
##$YMAX_a= 5612087
##$YMIN_a= -12164879
##$ZGOPTNS= <>
##$ZL1= 120
##$ZL2= 120
##$ZL3= 120
##$ZL4= 120
##$ABSF1= 14.96094
##$ABSF2= -5.597241
##$ABSG= 5
##$ABSL= 3
##$ALPHA= 0
##$AQORDER= 0
##$ASSFAC= 0
##$ASSFACI= 0
##$ASSFACX= 0
##$ASSWID= 0
##$AUNMP= <proc_prof1d_extract.lims>
##$AXLEFT= 0
##$AXNAME= <>
##$AXNUC= <1H>
##$AXRIGHT= 0
##$AXTYPE= 0
##$AXUNIT= <>
##$AZFE= 0.1
##$AZFW= 0.1
##$BCFW= 0
##$BC_mod= 0
##$BYTORDP= 0
##$COROFFS= 0
##$CY= 15
##$DATMOD= 1
##$DC= 0
##$DFILT= <>
##$DTYPP= 0
##$F1P= 0
##$F2P= 0
##$FCOR= 0.5
##$FTSIZE= 131072
##$FT_mod= 6
##$GAMMA= 0
##$GB= 0
##$INTBC= 1
##$INTSCL= 1
##$ISEN= 128
##$LB= 0.3
##$LEV0= 0
##$LPBIN= 0
##$MAXI= 10000
##$MC2= 0
##$MEAN= 0
##$ME_mod= 0
##$MI= 0
##$NCOEF= 0
##$NC_proc= -2
##$NLEV= 6
##$NOISF1= 0
##$NOISF2= 0
##$NSP= 0
##$NTH_PI= 0
##$NZP= 0
##$OFFSET= 14.96094
##$PC= 1
##$PHC0= -82.65564
##$PHC1= 0
##$PH_mod= 1
##$PKNL= yes
##$PPARMOD= 0
##$PPDIAG= 0
##$PPIPTYP= 0
##$PPMPNUM= 2147483647
##$PPRESOL= 1
##$PSCAL= 4
##$PSIGN= 0
##$PYNMP= <proc.py>
##$REVERSE= no
##$SF= 400.020009662713
##$SI= 131072
##$SIGF1= 0
##$SIGF2= 0
##$SINO= 400
##$SIOLD= 131072
##$SPECTYP= <>
##$SREGLST= <1H.CDCl3>
##$SSB= 0
##$STSI= 131072
##$STSR= 0
##$SW_p= 8223.68421052631
##$SYMM= 0
##$S_DEV= 0
##$TDeff= 65536
##$TDoff= 0
##$TI= <>
##$TILT= no
##$TM1= 0
##$TM2= 0
##$TOPLEV= 0
##$USERP1= <user>
##$USERP2= <user>
##$USERP3= <user>
##$USERP4= <user>
##$USERP5= <user>
##$WDW= 1
##$XDIM= 131072
##$YMAX_p= 368512334
##$YMIN_p= -12039
##$CURPLOT= <Network HP LaserJet P1505>
##$CURPRIN= <$Network HP LaserJet P1505>
##$DFORMAT= <normdp>
##$LAYOUT= <+/1D_H.xwp>
##$LFORMAT= <normlp>
##$PFORMAT= <normpl>
##$SURQMSG= 1
$$ End of Bruker specific parameters
$$ ---------------------------------
##NTUPLES= NMR SPECTRUM
##VAR_NAME=  FREQUENCY,     SPECTRUM/REAL,   SPECTRUM/IMAG
##SYMBOL=    X,             R,               I
##VAR_TYPE=  INDEPENDENT,   DEPENDENT,       DEPENDENT
##VAR_FORM=  AFFN,          ASDF,            ASDF
##VAR_DIM=   131072,        131072,          131072
##UNITS=     HZ,            ARBITRARY UNITS, ARBITRARY UNITS
##FACTOR=    0.0627417313425164, 1,          1
##FIRST=     8223.62146879497, 854,          -59947
##LAST=      0,             3097,            -59830
##MIN=       0,             -12039,          0
##MAX=       8223.62146879497, 368512334,    0
$$ Real data points
##PAGE= N=1
##DATA TABLE= (X++(R..R)), XYDATA
$$ [...]
65257 136130 136779 136784 136128 135376 135024 135240 136104 137583 139117 139782 139197 137919 136638 135357 133779 132096 130810
65240 130810 129938 129014 127852 126773 126006 125406 124845 124413 124024 123320 122261 121410 121229 121407 121306 120903 120848 121626
65222 121626 123079 124740 126305 127652 128715 129483 129923 129849 129096 127954 127068 126673 126228 125165 123831 123194
65206 123194 123628 124478 124959 125022 125044 125065 124829 124398 124208 124505 125126 125861 126654 127328 127478 126860 125713 124559 123847
65187 123847 123861 124657 125927 127173 128284 129723 131912 134586 137074 139086 140904 142788 144500 145515 145593
65172 145593 145047 144499 144334 144381 144250 144002 144235 145326 146900 148387 149846 151807 154460 157530 160923 164887
65156 164887 169319 173501 176903 179898 183325 187589 192523 197837 203309 208741 214259 220591 228568 238254
65142 238254 248929 259972 271394 283379 295666 307665 318998 329738 340209 350684 361139
65131 361139 371204 380355 388178 394334 398396 400002 399193 396395 392016 386326 379657 372323 364250 355136
65117 355136 345105 334787 324445 313507 301374 288349 275281 262647 250455 238811 227909
65106 227909 217676 208018 199348 192180 186227 180579 174854 169517 164984 161072 157555 154545 152044 149744
65092 149744 147625 146135 145407 144896 144180 143552 143357 143464 143948 145586 148753 152298 154530 155105 155093 155333 155610
65075 155610 155460 154878 154071 153199 152545 152405 152686 153069 153556 154276 154819 154483 153307 152144 151569 151362 151256 151498
65057 151498 152352 153620 154976 156254 157175 157393 157133 157166 157824 158554 158813 158759 158671 158347 157648 157046 156944 156919 156306
65038 156306 155160 153921 152467 150321 147622 145089 143060 141227 139386 137739 136351 134891 133160 131445
65024 131445 130138 129384 129194 129534 130130 130507 130504 130567 131331 132967 135046 136957 138351 139224 139651 139604 139197 138967
65006 138967 139560 141052 142953 144983 147371 150080 152229 152882 152197 151300 151185 152114 153862 155949 157767 159080
64990 159080 160403 162340 164561 166062 166498 166643 167283 168304 169279 170450 172462 175286 177935 179431 179758
64975 179758 179717 179932 180180 179758 178354 176315 174062 171609 168867 166055 163426 160776 157681 154131 150564
64960 150564 147324 144492 142197 140640 139751 139199 138762 138371 137847 137062 136385 136421 137184 137968 138205 138027 137818 137672
64942 137672 137546 137537 137644 137551 136955 135962 134991 134470 134707 135738 137155 138395 139339 140305 141389 142276 142906 143740
64924 143740 144942 145821 145637 144660 143833 143541 143255 142320 140669 138881 137936 138751 141366 144549 146694 147317 147409
64907 147409 148288 150386 153172 155852 157965 159547 160990 162722 165032 168201 172542 178036 184094 189997
64893 189997 195516 200727 205350 208831 211176 213154 215413 217757 219615 220879 221948 223117 224343 225469
64879 225469 226327 226618 225961 224162 221301 217613 213456 209378 205923 203274 201126 199016 196717 194337 192157
64864 192157 190406 189126 188194 187452 186784 185993 184726 182691 180026 177311 175077 173363 171761 169832 167349
64849 167349 164266 160646 156719 152911 149696 147407 146168 145920 146448 147456 148706 150018 151089 151507 151191
64834 151191 150736 150967 152001 153045 153309 152874 152351 151935 151327 150509 150064 150511 151821 153820 156587 159991 163246
64817 163246 165615 167428 169706 172756 175855 178546 181560 185955 191802 198286 204813 211471 218529 226000
64803 226000 233625 240856 246873 251057 253394 254115 253084 250031 245274 239544 233132 225892 218216 211244
64789 211244 205703 201142 196744 192382 188408 184936 181925 179629 178345 177975 178350 179702 182171 185101 187486
64774 187486 189053 190295 191597 193037 194989 198037 202088 206337 210455 215192 221343 228580 235747 241958
64760 241958 247071 251392 255386 259441 263574 267444 270845 273896 276536 278210 278463 277627 276483 275373 274075
64745 274075 272515 271137 270350 269822 268496 265320 260065 253523 246888 240882 235483 230388 225422 220461 215388
64730 215388 210436 206300 203523 201901 200813 199981 199516 199315 198949 198297 197897 198377 199730 201362 202719 203730
64714 203730 204766 206336 208720 211682 214547 216772 218421 219895 221153 221506 220382 218116 215594 213167
64700 213167 210332 206635 202478 198686 195533 192585 189381 185899 182407 179276 176935 175585 174896 174302 173686
64685 173686 173422 173736 174454 175526 177288 179946 183232 186905 191200 196357 202049 207762 213495 219598 226093
64670 226093 232720 239566 247030 255048 262831 269519 274681 277995 278924 277103 272886 267165 260754 254118
64656 254118 247524 241150 235062 229304 224057 219608 216126 213587 211930 211159 211248 212061 213467 215481 218214
64641 218214 221741 226125 231478 237808 244812 252111 259725 268060 277274 286986 296888 307254 318261 328964
64627 328964 337590 342985 345306 345223 343017 338749 332721 325272 316444 306278 295221 283861 272473 261195
64613 261195 250431 240667 232066 224647 218639 214161 210716 207546 204530 202221 200941 200296 199733 199134 198714
64598 198714 198640 198966 199701 200858 202614 205360 209183 213335 216714 219077 221261 224009 227061 229897 232844
64583 232844 236764 241775 246979 251605 255895 260542 265589 270239 273705 275927 277391 278370 278573 277605 275687
64568 275687 273645 272031 270386 267594 262972 256832 249984 242947 235787 228518 221352 214580 208410 202962
64554 202962 198292 194408 191330 189124 187686 186549 185194 183658 182588 182530 183390 184743 186313 187816 188688
64539 188688 188601 188151 188387 189540 190763 191236 190975 190270 189002 187005 184689 182668 181055 179624 178493 178026
64523 178026 178185 178522 178844 179375 180233 181247 182365 183774 185425 186862 187732 188155 188430 188710 189206 190390 192651
64506 192651 195837 199414 203033 206799 211110 216369 222751 230081 237890 245684 253209 260486 267650 274699
64492 274699 281307 286901 291006 293455 294173 292976 289787 284963 279086 272520 265518 258778 253416 250107
64478 250107 248459 247357 245758 243056 239100 234246 229300 225059 221821 219446 217796 216891 216607 216460 215941
64463 215941 215132 214794 215629 217420 219118 219963 220313 221143 222900 225156 227281 229015 230257 230749 230312 229301
64447 229301 228587 229002 230770 233334 235806 237775 239719 242438 246142 250330 254596 259185 264638 271258 279144
64432 279144 288462 299347 311722 325548 341266 359763 381857 407970 438301 473182 513185 558918
64420 558918 610807 669166 734497 807370 887648 973720 1062792 1152033 1239367 1323271 1402251
64409 1402251 1474720 1539071 1593542 1636142 1665021 1679005 1677850 1662149 1633148 1592426 1541475
64398 1541475 1481507 1413577 1338706 1257960 1172703 1085010 997608 913164 833613 760038 692859
64387 692859 631965 576998 527822 484683 447792 416980 391830 371788 355931 342955 331779
64376 331779 321984 313420 305687 298403 291724 286020 281147 276485 271669 266810 262009 257237 252751 249041
64362 249041 246025 242760 238394 233169 228137 224082 221123 219218 218548 219288 221327 224362 228082 232169 236343
64347 236343 240571 245054 249800 254370 258267 261465 264226 266355 267047 265688 262588 258659 254543 250352
64333 250352 246114 242042 238357 235264 233209 232739 233799 235409 236430 236599 236612 237213 238430 239676 240432 240721
64317 240721 240972 241464 241956 241936 241203 239999 238594 236998 235235 233631 232505 231654 230372 228031 224553 220402
64301 220402 216252 212565 209351 206330 203395 200804 198836 197453 196485 196013 196319 197512 199445 201949 204878
64286 204878 207937 210707 213052 215340 218185 222019 226929 232727 239072 245615 252204 258921 265813 272537
64272 272537 278436 283108 286888 290569 294544 298331 301048 302230 302009 300703 298581 296047 293692 291877
64258 291877 290439 288983 287424 286131 285544 285653 285808 285072 282859 279194 274309 268214 260955 253084 245453
64243 245453 238581 232609 227766 224296 221817 219400 216609 213985 212210 211235 210611 210230 210236 210579 211185 212313
64227 212313 214236 216706 219182 221372 223177 224317 224500 223882 222923 221940 221115 220651 220447 219894 218579 216949
64211 216949 215648 214397 212320 209353 206553 204882 204359 204553 205185 206019 206759 207428 208379 209675 210925 211967
64195 211967 213281 215436 218548 222492 227187 232483 238293 245160 254121 265541 278458 291498 304061
64182 304061 316159 327419 336867 343594 347286 348128 346453 342372 335649 326191 314763 302745 291004
64169 291004 279492 268253 258191 250193 243931 238249 232543 227114 222373 218418 215312 213081 211294
64156 211294 209312 207126 205547 205365 206618 208704 210778 212031 212218 212172 213432 216957 222314 228244 233737
64141 233737 238448 242383 245548 247891 249415 250314 250891 251221 250949 249655 247390 244645 241850 239199 236922
64126 236922 235327 234527 234466 235277 237193 239958 242814 245402 248296 252214 257003 261980 267174 273632 282254
64111 282254 292740 303918 314876 325441 335658 345209 353487 360089 365073 368806 371742 374325 376969
64098 376969 380005 383707 388368 394204 401140 408827 416924 425159 432949 439205 442889 443788 442531 439851
64084 439851 436054 431216 425569 419441 412926 405795 397795 388953 379544 369770 359637 349311 339548 331383
64070 331383 325168 320156 315365 310632 306505 303305 300819 298854 297562 297010 296869 296783 296760 297039 297826 299326
64054 299326 301681 304704 307945 311282 315156 320036 325947 332781 340732 349972 360196 370993 382521
64041 382521 395346 409595 424673 439790 454350 467805 479574 489326 497058 502751 506153 506959 505003
64028 505003 500209 492730 483314 473263 463739 455203 447618 441008 435552 431247 427740 424526 421165 417301
64014 417301 412571 406608 399227 390714 381805 373189 365004 357065 349564 343208 338492 335141 332515 330329
64000 330329 328667 327513 326689 326187 326133 326385 326589 326741 327336 328794 331070 334061 337987 342923 348217 352944
63984 352944 356979 361144 366228 372310 379185 386925 395621 404929 414458 424455 435530 447698 460235
63971 460235 472613 485098 498168 511865 526172 541619 558980 578455 599713 622688 647777
63960 647777 675215 704877 737063 773069 814543 862482 917266 979550 1050710 1132387 1225977
63949 1225977 1332781 1454491 1593266 1751108 1928988 2126523 2342506 2575654 2824587
63940 2824587 3087166 3360259 3640438 3924474 4208598 4487330 4753619 5000341 5221464
63931 5221464 5411897 5566983 5682824 5756985 5788420 5776687 5721645 5624081 5486323 5311966
63921 5311966 5105209 4870888 4615107 4345248 4068722 3791443 3517528 3250317 2993238
63912 2993238 2749533 2521465 2310185 2116324 1940402 1782613 1642440 1518694 1409899
63903 1409899 1314760 1232429 1162349 1103685 1054907 1014078 979655 950786 926735 906235 887692
63892 887692 869986 852853 836307 819825 802318 783004 762252 741399 721746 703872 687894
63881 687894 674060 662787 654275 648422 645147 644544 646685 651511 658940 668843 680844 694410 709302
63868 709302 725784 744238 764674 786661 809441 832034 853536 873607 892538 910582 927342
63857 927342 942003 953965 962961 968755 971164 970444 967225 961874 954111 943464 929979 914321 897195
63844 897195 878797 858777 836706 812541 786663 759571 731696 703560 675850 649026 622884
63833 622884 596795 570473 544374 519278 495623 473374 452456 433164 416103 401653 389437
63822 389437 378364 367436 356574 346518 337855 330323 323194 316143 309459 303524 298408 293994 290182
63809 290182 286802 283631 280739 278579 277394 276612 275267 273028 270414 267914 265388 262590 259793 257391
63795 257391 255165 252613 249891 247774 246521 245339 243313 240440 237397 234572 231767 228756 225754 223257
63781 223257 221555 220447 219404 218145 217049 216783 217471 218509 219300 219810 220172 220087 219059 217078 214734 212755
63765 212755 211634 211488 211873 211896 210983 209605 208861 209281 210327 211157 211498 211636 211818 211990 212092 212408 213411 215186
63747 215186 217117 218438 219112 219835 221047 222334 223183 223978 225675 228589 232020 235111 237618 239777 241791
63732 241791 243647 245233 246579 248151 250755 254774 259543 263851 267123 269812 272718 276355 280864 285929
63718 285929 290680 294226 296527 298319 300050 301447 302294 302951 303638 303771 302643 300464 298141 296169 294288
63703 294288 292207 290185 288803 288462 289120 290354 291625 292713 293887 295647 298349 302075 306573 311153 314974
63688 314974 317745 319984 322341 324830 326923 328162 328352 327363 325196 322247 319178 316470 314226 312437 311224
63673 311224 310822 311389 312730 314164 314923 314872 314644 314870 315500 316111 316541 316845 316829 316122 314708 312938 310990 308607
63655 308607 305423 301337 296573 291619 287031 283019 279254 275389 271736 269074 267791 267528 267720 268133 268783
63640 268783 269686 270864 272382 274205 276188 278341 280909 284050 287591 291238 294913 298773 302982 307598
63626 307598 312619 318078 324041 330475 337098 343504 349591 355805 362735 370523 378920 387947 398231 410543
63612 410543 425117 441531 459178 477794 497565 518732 541142 564344 588155 612792 638035
63601 638035 662414 683727 700513 712639 720418 723737 722508 717604 710652 702858 694453 685410 676192
63588 676192 667392 658812 649359 637934 624185 608386 590945 572300 553120 534222 516287 499806
63576 499806 485232 472832 462329 453023 444506 437160 431848 429180 429061 430755 433331 436243 439617 443801
63562 443801 448695 453801 458968 464618 470985 477506 483369 488532 493882 500544 509282 520425 534069 550322
63548 550322 569428 591546 616421 643612 673107 705192 739376 773820 806037 833720 854659
63537 854659 866853 869742 865088 855785 843973 830915 818113 807140 798185 789923 781204 771960 762108
63524 762108 750543 735907 717638 695740 670275 641907 612377 583531 556085 529995 505644
63513 505644 483815 464608 447300 431431 417293 405139 394527 384847 376074 368521 362099 356248
63501 356248 350594 345386 341155 338111 335993 334435 333284 332505 331895 331093 329880 328367 326907 325899 325646
63486 325646 326179 327152 327990 328273 328040 327859 328591 330828 334342 338226 341767 345004 348248 351389 354043 356144
63470 356144 357808 358744 358396 356664 354025 350907 347463 343899 340470 337112 333681 330536 328248 326714 325371
63455 325371 324330 324370 325563 326968 328171 330121 333744 338606 343740 348972 354537 360193 365836 372324 380477
63440 380477 389706 398843 408040 418575 430970 444726 459912 477583 498221 520972 544794 569201
63428 569201 593292 615104 632717 645380 653155 656470 656755 656613 658330 662570 669198 678782 692398
63415 692398 710424 732403 757831 786112 815806 844793 871228 893729 910811 921115 924502 922306
63403 922306 916194 907241 896280 884432 872714 861337 849761 837228 822952 806033 785741 762099
63391 762099 736005 708647 680803 652694 624431 596506 569874 545546 524083 505403 489035
63380 489035 474614 462197 452143 444656 439491 436099 433983 432901 432938 434560 438366 444439 452015 460125
63366 460125 468588 477994 488825 501058 514681 529966 546969 565297 584775 605906 629245 654726
63354 654726 682043 711246 742251 774018 804896 833623 859345 880813 896501 905767 909269 907992
63342 907992 902502 893433 882104 870068 858308 847096 836224 825017 812438 797577 779940 759273
63330 759273 735683 710229 684746 660542 637635 615802 595830 578935 565316 554179 545115 538493
63318 538493 534456 532428 531775 531971 531635 528317 520105 507118 490987 473364 455470 438425 422998
63305 422998 409105 396295 384743 375200 368010 362738 358795 355796 353260 350641 347907 345605 344077
63292 344077 342971 341747 340258 338633 336985 335468 334303 333414 332324 330627 328325 325597 322625 319870
63278 319870 318030 317369 317381 317461 317544 317743 317795 317464 317150 317449 318259 318975 319510 320429 321959 323533 324569 325290 326517
63259 326517 328943 332748 337540 342538 347150 351509 356133 361018 365580 369695 374214 380018 386982 394414
63245 394414 402267 411327 422191 434567 447706 461259 475592 491545 509966 531236 554994 580358
63233 580358 606561 633476 661518 690944 721246 751352 780485 808694 836318 863129 888464
63222 888464 912221 935235 958416 981955 1005735 1030122 1055691 1082163 1108117 1131858 1152242
63211 1152242 1168678 1180810 1188499 1191741 1190151 1182643 1168065 1146329 1118690 1086740 1051277 1012530
63199 1012530 971468 930450 892146 857857 827227 799556 774987 754235 737619 724843 715596
63188 715596 709922 707949 709599 714641 722791 733593 746437 760825 776498 793214 810568 828240
63176 828240 846292 864965 884149 903252 921652 939129 955669 970987 984475 995639 1004353 1010567
63164 1010567 1013918 1013859 1010007 1002150 990005 973305 952236 927560 900159 870628 839411 807177
63152 807177 774929 743756 714473 687336 662092 638520 616920 597859 581442 567199 554781
63141 554781 544343 536004 529395 524092 520168 517825 516718 516105 515542 514989 514403 513712 513108 512836 512767 512698 513028
63124 513028 514534 517353 520823 524459 528473 533129 538135 543052 547795 552342 556415 559895 563119 566336
63110 566336 569237 571495 573369 575223 576798 577590 577695 577628 577495 577086 576656 576754 577195 577039 575828 574217 573072
63093 573072 572622 572825 573876 575779 577877 579469 580613 581820 583204 584528 585910 587860 590614 593938 597622
63078 597622 601704 606097 610463 614712 619364 625193 632598 641363 650903 660778 671199 682968 696654
63065 696654 711865 727732 744196 762377 783524 807994 835556 866255 900474 938355 979722
63054 979722 1024547 1073032 1125155 1180595 1239237 1301307 1366724 1434646 1503983 1574180 1645138
63043 1645138 1716557 1787758 1858076 1927054 1994273 2059464 2122942 2185524 2247735 2309285 2369468
63032 2369468 2427712 2483337 2534982 2580608 2618017 2645101 2659857 2660735 2647098 2619027 2576656 2520222
63020 2520222 2450932 2371353 2284634 2193532 2100382 2007589 1917682 1832881 1754788 1684310 1621669
63009 1621669 1566726 1519691 1481347 1452254 1431841 1418779 1412302 1412728 1420500 1435004 1454592 1477615
62997 1477615 1503224 1531221 1561288 1592488 1623573 1653782 1683162 1712032 1740338 1767748 1794106
62986 1794106 1819400 1843206 1864470 1881876 1894260 1900736 1900700 1893706 1879131 1856078 1824046 1783735
62974 1783735 1736807 1684810 1628721 1569578 1508955 1448411 1388838 1330721 1274818 1222199 1173663
62963 1173663 1129305 1088499 1050254 1013968 980089 949698 923090 899048 875863 852797 830206
62952 830206 808593 788178 769092 751251 733984 716523 699021 682490 667527 653665 640269
62941 640269 627486 615861 605491 596135 587870 580988 575355 570440 566032 562435 559873 558151 557097
62928 557097 556892 557657 558985 560296 561454 562679 563916 564627 564255 562590 559665 555714 551358 547512 544676
62913 544676 542411 539723 535908 530876 524909 518512 512446 507452 503702 500672 497682 494423 490982 487616
62899 487616 484599 482130 480284 479135 478831 479274 479819 479659 478643 477320 476128 474961 473727 472863 472890 473794
62883 473794 475139 476465 477289 477189 476446 476181 477161 478667 479279 478651 477749 477320 476974 476003 474366 472432 470412
62866 470412 468519 467166 466402 465519 463829 461685 460190 459971 460747 462005 463533 465127 466303 466708 466624 466694
62850 466694 467168 467662 467744 467533 467491 467738 467891 467678 467380 467376 467430 466782 464910 461910 458268 454713 452227 451524 452234
62831 452234 453042 453058 452691 452843 453640 454591 455717 457755 461092 465093 468817 471984 474888 477662 480114 482277
62815 482277 484679 487849 491761 496041 500623 505913 512162 518935 525485 531526 537377 543377 549531 555906
62801 555906 563040 571595 581632 592456 603249 613833 624927 637695 652906 670423 689582 710159
62789 710159 732841 758748 788717 823187 862470 906799 956284 1011138 1071943 1139404 1213862
62778 1213862 1295308 1383761 1479175 1580831 1687061 1795831 1905445 2014564 2121602 2224206
62768 2224206 2319226 2403225 2473193 2526994 2563180 2580572 2578347 2556642 2516772 2460619 2389933
62757 2389933 2306458 2212520 2111071 2005011 1896688 1788106 1681271 1578001 1479469 1386217
62747 1386217 1298693 1217527 1143123 1075152 1012722 955197 902735 855974 815167 779708 748430
62736 748430 720293 694744 671572 650616 631765 615142 601048 589536 580080 571848 564326 557637
62724 557637 552203 548206 545476 543773 543030 543291 544531 546676 549744 553869 559191 565780 573710 583138 594316
62709 594316 607610 623493 642303 663913 687872 714169 743704 777693 816572 859819 906843
62698 906843 957667 1012546 1071369 1133822 1199848 1269429 1341855 1415549 1488640 1559425 1626224
62687 1626224 1687083 1739904 1782832 1814504 1833961 1840435 1833325 1812496 1778602 1732967 1677198 1613122
62675 1613122 1543017 1469405 1394287 1318837 1244062 1171396 1102298 1037547 977391 922053 871612
62664 871612 825606 783351 744615 709456 677540 648290 621697 598322 578341 561166 546096
62653 546096 532735 520644 509240 498325 488180 478875 470066 461706 454307 448077 442418 436799 431643
62640 431643 427778 425366 423833 422550 421156 419619 418459 418462 419657 420941 421323 421123 421270 421737 421576 420347
62624 420347 418683 417342 416472 415977 416017 416830 418411 420508 422788 425086 427790 431728 437218 443446 449386
62609 449386 455165 461861 470046 479323 489369 500561 513285 527449 543126 561112 582240 606541
62597 606541 633544 663134 695718 731823 771910 816306 864837 916555 970101 1024256 1077918
62586 1077918 1129724 1178087 1221648 1259450 1290572 1313668 1327047 1329430 1320891 1302932 1277376 1245195
62574 1245195 1206677 1162651 1114989 1065724 1016001 966140 916481 867917 821755 779134 740389
62563 740389 704920 671956 641509 614278 590656 570295 552768 537975 525529 514380 503708
62552 503708 493893 485947 480103 475518 471286 467194 463483 460410 458195 456926 456290 455680 454755 453678 452745
62537 452745 452051 451617 451537 451731 451759 451162 450021 449066 449229 451077 454535 459073 464273 470269 477602 486655 497441
62520 497441 509953 524491 541445 560994 583270 608611 637270 668895 702790 738759 777240
62509 777240 818308 860944 903663 945556 986215 1024849 1060169 1091113 1117078 1137322 1150835
62498 1150835 1157155 1156767 1150362 1138290 1121259 1100997 1079511 1058003 1037256 1018673 1004009 994067
62486 994067 988625 987777 992423 1003050 1018840 1038643 1062291 1090306 1122509 1157432 1192928 1226943
62474 1226943 1257798 1284140 1304741 1318360 1324112 1322028 1312814 1296671 1272712 1240064 1199405 1152921
62462 1152921 1102783 1050145 995699 940754 887298 836993 790342 747083 707367 672269 642852
62451 642852 618934 599214 582598 568881 558093 549915 544118 540972 540606 542332 545295 549495 555468
62438 555468 563076 571320 579365 586988 593887 599313 602789 604643 605296 604401 601170 595323 587252 577411 566056
62423 566056 553610 540874 528665 517420 507126 497412 487722 477773 468063 459636 453067 447765 442519
62410 442519 436706 430765 425561 421569 418626 416206 413773 411173 408841 407387 406861 406669 406424 406496 407336 408583
62394 408583 409453 409945 410965 413177 416291 419629 422739 425138 426183 425922 425676 426996 430121 434085 438269
62379 438269 443048 448744 454722 460134 465189 471044 478458 487038 495883 504587 513371 522539 532161 542361
62365 542361 553586 566385 581041 597574 616184 637520 662384 691167 723619 759166 797389
62354 797389 838109 881050 925570 970783 1015771 1059397 1099983 1135544 1164522 1186135 1200019
62343 1200019 1206033 1204711 1197512 1185994 1170793 1151783 1129102 1103539 1075963 1046951 1017080 987117
62331 987117 957758 929634 903717 881136 862194 845834 830495 815347 800532 786396 772749
62320 772749 758737 743377 726396 708563 690801 672913 653714 632704 611092 590767 572649
62309 572649 556489 541856 528704 517163 507423 499796 494383 490627 487651 485050 483020 481738 481042
62296 481042 480728 480724 480872 480913 480879 481226 482414 484511 487290 490522 494019 497528 500798 503792 506707 509627 512135
62279 512135 513480 513436 512890 513208 514960 517606 520506 523675 527317 531232 535279 540076 546529 554817 564379
62264 564379 574852 586535 599927 615396 633396 654610 679688 709092 743174 782036 825265
62253 825265 872023 921436 972578 1024093 1074165 1120984 1163077 1199317 1228916 1251391 1266311
62242 1266311 1273200 1271993 1263359 1248053 1226051 1196907 1161013 1119992 1075676 1029274 981681 934064
62230 934064 887706 843514 802040 763759 729085 698232 671270 648257 629263 614309 603212
62219 603212 595336 589675 585538 583010 582300 582743 583144 583201 583917 586252 589915 593804 597199 600008 602290 604082
62203 604082 605499 606562 606990 606547 605498 604381 603434 602558 601738 601122 600717 600286 599642 598918 598595 599309 601414
62186 601414 604593 608129 611806 616268 622156 629096 635965 642041 647431 652439 657091 661385 665533 669689
62172 669689 673794 678022 683144 690218 700085 713380 730691 752240 777498 805581 836045 868894
62160 868894 903662 938922 972912 1004304 1032022 1054697 1070966 1080428 1083922 1082768 1077925 1069739
62148 1069739 1057998 1042146 1021961 998280 972752 946697 920534 894463 869119 845205 822993
62137 822993 802803 785601 772393 763089 756531 751623 747903 745141 743006 741272 739869 738622 737333
62124 737333 736155 735412 735054 734841 735120 736764 740155 744806 750332 757160 765773 775561 784957 792473 797309
62109 797309 799201 798220 794681 789030 781948 774674 768808 765229 763251 761188 757805 753019 747389 741362
62095 741362 735185 729306 724616 722124 722236 724300 727056 729693 732396 735801 740145 745079 750140 755117
62081 755117 760055 765157 770780 777424 785586 795525 807128 820070 834160 849404 865646 882380 899169
62068 899169 915969 932695 948856 964220 979694 996665 1015378 1034798 1054323 1074647 1096233
62057 1096233 1117590 1136024 1149758 1158648 1163102 1163255 1159158 1150959 1138670 1122332 1102537 1080187
62045 1080187 1055499 1027778 996610 962866 928124 893363 858674 824144 790482 758565 728660
62034 728660 700450 673826 649345 627679 608748 591684 575706 560805 547471 536007 526256 517778
62022 517778 510000 502303 494298 486100 478169 470816 463942 457292 450872 445046 440209 436382 433186 430233
62008 430233 427472 425131 423505 422899 423550 425343 427735 430257 432937 435963 439235 442708 446891 452189 457794
61993 457794 462133 464633 466247 467884 469176 469391 468696 467620 465851 462623 458092 453346 449028 444837 440478
61978 440478 436297 432615 429069 425102 420852 417184 414895 413921 413327 412155 410404 408972 408432 408247 407549
61963 407549 406317 405192 404457 403910 403575 403595 403401 401996 399432 397184 396503 397043 397741 398432 399785 401983 404416
61946 404416 406751 409568 413662 419241 426060 433944 442815 452424 462453 472873 483949 495859 508410
61933 508410 521137 533505 545063 555627 565439 574949 584208 592580 599194 603626 605973 606492 605534 603703
61919 603703 601519 598775 594660 588821 582042 575659 570612 567263 565756 566150 568356 572250 577657 584122
61905 584122 591097 598661 607518 617719 627829 636054 641946 646184 648877 649124 646445 641739 636315 630617
61891 630617 624441 617897 611457 605304 599245 593341 588139 584103 580944 577661 573276 567596 561180 554534
61877 554534 547487 539574 530870 522063 513708 505843 498409 491620 485743 480860 477093 474700 473716 473823 474852
61862 474852 477093 480761 485412 490437 496011 503056 512189 523087 535046 547833 561731 577004 593660
61849 593660 611688 631168 651963 673471 694830 715358 734660 752434 768366 782158 793389
61838 793389 801404 805697 806548 804925 801466 795946 788134 778904 769923 762258 755882 750636 747142 746390 748722
61823 748722 753545 759887 766922 774025 780571 785799 788850 789001 785937 779754 770648 758731 744232 727772
61809 727772 710224 692207 673839 655182 636841 619809 604573 590637 577274 564534 553078
61798 553078 543125 534182 525927 518717 512884 508079 503776 499972 496870 494209 491534 488910 486729 484960
61784 484960 483146 481095 479065 477244 475505 473681 471727 469683 467838 466764 466693 467002 466862 466307 466136 466877
61768 466877 468432 470615 473360 476389 479390 482564 486356 490639 494850 498975 503596 508830 514062 518998
61754 518998 524197 530170 536574 542594 547442 550229 550222 547741 544130 540328 536099 531075 525700 520477 515034
61739 515034 508787 502036 495650 490106 485576 482409 480654 479505 478105 476654 475901 475835 475814 475747 476156 477107
61723 477107 478050 478858 480091 481996 484013 485613 487008 488706 490813 493012 494863 496013 496531 497064 498197
61708 498197 499523 499854 498474 495738 492431 489064 485925 483181 480675 478071 475431 473154 471192 468906
61694 468906 465989 463010 460587 458488 456006 452880 449368 445713 442004 438404 435010 431600 427894 424062
61680 424062 420648 418024 416108 414522 412852 410884 408791 406952 405388 403639 401450 399264 397601 396193
61666 396193 394327 392009 390154 389464 389632 389910 389971 389863 389539 388991 388680 389287 390995 393370 395980 398717 401432
61649 401432 403703 405269 406440 407731 409243 410689 411954 413319 415098 417286 419609 421724 423294 424029
61635 424029 423810 422821 421576 420744 420746 421376 421972 422073 421751 421090 419620 416718 412538 408048 404029 400416 396788
61618 396788 393112 389699 386678 383897 381226 378677 376218 373664 370788 367510 363956 360345 356830 353430
61604 353430 350131 346887 343444 339429 334881 330443 326679 323391 320081 316924 314626 313326 312326 311047
61590 311047 309596 308187 306706 305240 304301 304012 303651 302582 301094 299689 298102 295877 293527 292153 291977
61575 291977 292138 291922 291399 290720 289659 288199 286945 286497 286772 287284 287808 288520 289621 291042 292417 293358 293895
61558 293895 294573 295850 297492 298878 299815 300664 301764 303124 304700 306492 308295 309766 310868 311871 312824
61543 312824 313410 313464 313242 313037 312888 312900 313458 314838 316749 318444 319191 318666 317202 315749 315264 315860 316673 316671
61525 316671 315444 313275 310727 308273 306050 303909 301846 300321 299823 300126 300448 300467 300729 301821 303477 304813
61509 304813 305233 304922 304601 304943 306033 307271 307972 308053 307959 307976 308036 308181 308745 309902 311441 313167 315032 316715
61491 316715 317599 317564 317339 317642 318308 318719 318751 318799 319096 319514 319873 320035 319863 319551 319839 321358 323791 326149 327894
61472 327894 329292 330669 331842 332489 332628 332449 331974 331151 330124 329149 328363 327745 327240 326772 326216 325454 324492
61455 324492 323482 322644 322069 321569 320876 320171 320215 321623 324014 326280 327782 328931 330456 332433 334398 336149
61439 336149 337898 339677 341043 341667 341951 342730 344409 346578 348470 349562 349803 349537 349340 349717 350705 351797
61423 351797 352446 352611 352721 353193 354156 355592 357485 359742 362171 364583 366815 368571 369414 369128 368068 367035
61407 367035 366778 367522 368890 370218 371002 371149 370836 370249 369488 368633 367729 366747 365722 364883 364451 364326 364168 363823
61389 363823 363472 363284 363196 363142 363279 363794 364610 365511 366484 367766 369522 371623 373744 375598 377121 378496 380047
61372 380047 382013 384373 386785 388704 389720 389945 390022 390535 391438 392234 392721 393272 394338 395943 397882 400089
61356 400089 402562 405083 407389 409600 412189 415472 419385 423801 428807 434447 440334 445752 450155 453439
61342 453439 455812 457662 459574 462142 465444 468843 471619 473800 476047 478669 481173 482982 484215 485359
61328 485359 486441 487021 486905 486393 485789 485102 484386 483922 483884 484144 484697 486005 488623 492647 497808 503996 511430
61311 511430 520370 530877 542802 555786 569350 583224 597621 612953 629122 645252 660174 673089
61299 673089 683664 691714 697036 699573 699555 697344 693237 687422 680034 671170 660986 649885 638443 626966
61285 626966 615245 603034 590649 578761 567640 557084 547193 538746 532509 528519 526239 525061 524412
61272 524412 523793 523215 523221 524086 525277 526193 527057 528439 530224 531901 533777 536969 542028 548297 554868 561463
61256 561463 568001 573979 578817 582509 585510 588214 590779 593115 594851 595678 595990 596806 598736 601353 603817
61241 603817 605747 607207 608262 609016 609745 610590 611356 611969 612789 614047 615293 615987 616500 617980 621223 626086
61225 626086 631957 638402 645337 652864 660998 669384 677407 684816 692096 699900 708240 716502 724146 731022
61211 731022 737131 742494 747245 751475 754923 757175 758304 759070 760372 762688 766035 770282 775368 781415
61197 781415 788729 797679 808543 821385 835865 850994 865289 877467 887005 893963 898482 900666 900730
61184 900730 898905 895304 890229 884453 878705 872779 865586 856352 845516 834276 823410 812741 801655
61171 801655 789936 778068 766770 756198 745667 734269 721825 709053 696778 685157 673827
61160 673827 662624 651856 641795 632240 622832 613721 605658 599379 595107 592661 591793 592218 593574 595493
61146 595493 597493 598624 597630 593983 588586 582916 577580 572193 566567 561291 557000 553739 551403 550252
61132 550252 550542 551997 554126 556853 560542 565567 572106 580131 589394 599658 611174 624611 640270
61119 640270 657623 675946 695140 715684 737987 762011 787276 812943 838196 862755 886796
61108 886796 910210 932370 952871 971964 989832 1005851 1019075 1029075 1035802 1038967 1038213 1033690
61096 1033690 1025874 1014916 1000665 983286 963409 941802 919253 896513 873854 850876 827298
61085 827298 803731 781145 759762 739094 718868 699253 680326 662267 646041 632879 622635
61074 622635 613535 604190 595323 588800 585264 583437 581656 579399 577085 575004 573081 571562 571240 572659
61060 572659 575454 578959 583159 588440 594567 600706 606632 613110 620773 629389 638748 649491 662295 676808
61046 676808 692230 708589 726600 746483 767691 789653 812109 834878 858000 881978 907277
61035 907277 933762 961219 990049 1020669 1052571 1084951 1118126 1153357 1191305 1231598 1273883
61024 1273883 1318217 1364266 1411109 1458224 1505970 1554991 1606039 1660671 1721307 1790192 1868761
61013 1868761 1958036 2058924 2172169 2298998 2442341 2607247 2800728 3032424 3315256 3664058
61003 3664058 4093289 4617039 5250781 6011101 6913583 7973542 9210021 10646382 12302267
60994 12302267 14178545 16238124 18384974 20454096 22236110 23544653 24294353 24535836
60986 24535836 24424624 24153480 23893934 23760857 23783922 23882869 23875518 23542660 22724908 21389187
60976 21389187 19624848 17588450 15447123 13348215 11406754 9695904 8242663 7036996
60968 7036996 6049843 5247246 4596032 4066200 3633210 3278095 2985089 2740345 2532954
60959 2532954 2355396 2202028 2067884 1949033 1842870 1747435 1661323 1584456 1517733 1461138
60949 1461138 1412829 1370486 1332781 1298968 1267831 1237792 1207778 1177563 1147543 1118428 1090781
60938 1090781 1064613 1039726 1016477 995671 977542 961456 946892 934129 923656 915421 908983 903980
60926 903980 900134 897271 895670 895949 898290 902126 906837 912287 918429 924947 931713 939044 947004 954891
60912 954891 962012 968593 975280 981991 987951 992764 996766 1000249 1002847 1003865 1002876 999885 995272 989647
60898 989647 983405 976217 967159 955585 941867 927225 912880 899277 885993 872325 858102 843889
60886 843889 830372 817599 804946 791799 778091 764209 750538 737137 723799 710404 697277
60875 697277 685100 674331 664690 655370 645801 636054 626507 617347 608572 600289 592705 585819 579409 573450
60861 573450 568278 564134 560736 557545 554384 551455 548793 546017 542738 538959 534886 530521 525733 520679
60847 520679 515963 512236 509596 507431 504920 501686 497870 493588 488670 483122 477456 472098 466713 460660
60833 460660 454055 447782 442428 437867 433991 431100 429262 428003 427079 426983 428053 429620 430691 431117 431447
60818 431447 431934 432405 432888 433629 434546 435357 436198 437448 438903 439784 439751 439354 439265 439479 439435 438598 436842 434579
60800 434579 432543 431086 429698 427584 424675 421614 418833 416250 413926 412299 411475 410828 409701 408154 406633
60785 406633 405153 403229 400507 397136 393568 390103 386714 383241 379741 376467 373465 370493 367605 365472
60771 365472 364624 364590 364352 363584 362858 362689 363077 364064 365947 368579 371113 372892 374250 376014 378516 381374
60755 381374 384001 386066 387722 389595 392250 395525 398671 401284 403714 406370 409087 411435 413254 414551
60741 414551 415172 414916 413719 411526 408306 404359 400223 396000 391221 385666 379880 374483 369392 364199 358949
60726 358949 354059 349779 346221 343627 342045 340941 339644 338065 336511 334962 333117 331055 329333 328358
60712 328358 328003 327814 327315 326235 324824 323827 323712 324026 323917 323171 322314 321829 321822 322387 323684 325517 327307 328661
60694 328661 329597 330221 330607 331101 332209 333972 335912 337821 340174 343430 347301 351090 354515 357808 361211
60679 361211 364777 368627 373041 378160 383779 389490 394969 400105 404889 409268 413139 416455 419213 421193
60665 421193 421933 421178 419295 416964 414473 411595 408208 404683 401566 399142 397416 396213 395099 393525 391347
60650 391347 389068 387295 386123 385233 384444 383849 383523 383417 383493 383627 383316 381854 378968 375154 371224 367679
60634 367679 364599 361940 359668 357645 355683 353786 352236 351302 350963 350967 351118 351382 351708 351888 351736 351361 351204
60617 351204 351665 352726 353988 355070 355930 356711 357440 358036 358614 359438 360454 361114 361032 360660 360924 362112 363493
60600 363493 364225 364309 364418 364988 365852 366654 367367 368439 370546 374007 378151 381469 382880 382860 382925 384030 385904
60583 385904 387891 389691 390998 391193 390142 388855 388557 389255 389986 390385 391192 393091 395988 399786 404960 411706
60567 411706 419141 426280 433413 441623 451132 460998 470439 479560 488547 496931 503970 509097 511682 511095
60553 511095 507525 502231 496535 491007 486069 482641 481407 481862 483002 484712 487678 492137 497649 504126
60539 504126 512156 522083 533567 546341 560703 576829 594132 611746 629163 645990 661433 674468
60527 674468 684281 690280 692018 689468 683165 673914 662653 650684 639430 629506 620387 611441 602997
60514 602997 595980 590859 587398 585149 583703 582727 582288 582904 584841 587647 591011 595800 603456 614435 628030
60499 628030 643815 662455 684814 710939 740379 772975 808816 847646 888663 930651 972024
60488 972024 1011020 1046306 1077402 1104289 1126685 1143872 1155046 1159595 1157089 1147159 1129400 1103409
60476 1103409 1069249 1028075 982205 934270 886278 839413 794491 752285 713475 678499 647503
60465 647503 620365 596769 576280 558306 542095 527094 513419 501647 491964 483746 476248 469439
60453 469439 463734 459027 454475 449373 443890 438697 434134 429964 425854 421809 418135 415120 412816 411119
60439 411119 409974 409454 409561 409994 410253 410026 409384 408593 407780 406848 405641 404116 402395 400753 399528 398996 399219
60422 399219 399956 400734 401119 401029 400804 400867 401325 401938 402411 402630 402676 402789 403346 404639 406584 408761 410808 412609
60404 412609 414086 415150 416035 417338 419312 421307 422411 422677 423265 425206 428324 431550 434046 435828 437508
60389 437508 439648 442326 445195 447978 450820 453982 457337 460533 463643 467116 470893 474070 475863 476582
60375 476582 477197 478143 478987 479163 478649 477975 477888 478869 480551 481705 481302 479690 478337 478351 479555 481078 482461
60358 482461 483934 485871 488261 490730 493021 495395 498389 502137 506170 510178 514668 520462 527620 535282
60344 535282 542447 548475 552945 555657 556914 557298 556977 555616 553029 549444 544964 539362 532745 525956 519868
60329 519868 514527 509397 504292 499713 496315 494149 492415 489978 486397 482450 479345 477438 476103 474866
60315 474866 474084 474310 475525 477301 479319 481501 484054 487646 493064 500438 509288 519544 531809 546256
60301 546256 562034 578391 595621 613896 631698 646546 657077 663380 665371 662067 652850 638587
60289 638587 621047 601837 582288 563806 547676 534601 524636 517357 512027 507900 504490 501424 498168
60276 498168 494348 490303 486745 483751 480555 476516 471802 466893 461952 457033 452496 448729 445684 443077
60262 443077 440904 439390 438482 437682 436496 434923 433459 432594 432202 431555 430138 428351 427122 426856 427134 427421
60246 427421 427630 427881 428192 428670 429537 430647 431317 431114 430587 430773 432078 433973 435748 437230 438789 440902
60230 440902 443729 446918 449861 452299 454671 457679 461583 466061 470617 474875 478576 481708 484724 488354
60216 488354 492984 498377 504051 509757 515461 521112 526703 532465 538723 545482 552430 559440 566845 574963
60202 574963 583453 591420 598204 603819 608617 612810 616567 620252 624140 627874 630560 631620 631396 630748 630148
60187 630148 629320 627722 625177 621971 618484 614869 611062 606901 602185 596779 590847 584893 579444 574754
60173 574754 570980 568424 567172 566521 565232 562653 559318 556210 553683 551376 548951 546494 544223 542163
60159 542163 540183 538181 536166 534262 532614 531236 530051 529172 528985 529778 531384 533322 535187 536819 538268
60144 538268 539790 541697 544035 546542 549028 551560 554131 556558 559073 562646 568107 575052 582110 588306
60130 588306 593701 598722 603359 607248 610203 612463 614550 616880 619358 621406 622662 623594 625089 627480
60116 627480 630360 633299 636335 639681 643356 647258 651291 655205 658548 660940 662227 662348 661283 659140
60102 659140 656103 652261 647739 642970 638443 634154 629651 624767 620018 616119 613369 611610 610527 609849
60088 609849 609471 609477 609796 609835 608827 606721 604412 602858 602176 601800 601321 600946 601157 602044 602860 602266 599272 594075
60070 594075 587842 581565 575259 568287 560290 551635 543128 535424 528664 522595 516918 511471 506208 501291
60056 501291 497242 494536 492835 491049 488527 485778 483624 482168 481284 481589 483887 487770 491855 495511 499356
60041 499356 503860 508589 513357 519063 526424 534535 541625 546897 550764 553504 554610 553644 551131 548261
60027 548261 545899 543948 541539 537824 532701 526706 520274 513393 506090 498835 492195 486372 481328 477099
60013 477099 473603 470331 466629 462327 457933 454140 451139 448333 444884 440731 436874 434284 432748 431406
59999 431406 430259 430279 431872 434150 436137 437968 440346 443445 446972 450789 454870 459056 463367 468087 473020
59984 473020 477201 480057 482379 485301 488703 491445 492857 493066 492054 489498 485653 481476 477551 473632
59970 473632 469532 465793 463089 461455 460433 459604 458718 457708 456949 457222 459035 462042 465318 468176 470653
59955 470653 473288 476476 480066 483630 487029 490367 493337 495150 495503 495194 495229 495674 496007 496338 497396 499389
59939 499389 501668 503712 505646 507483 508598 508525 507817 507567 508272 509549 510773 511624 512224 513087 514902 517999
59923 517999 522003 526201 530205 534111 538107 542247 546670 551760 557825 564652 571571 577976 583608 588244
59909 588244 591439 592915 593079 592694 592000 590577 588165 585186 582242 579534 577085 575069 573540 572146 570619
59894 570619 569316 568773 568948 569413 570170 571733 574438 578203 582904 588473 594558 600567 606251 611897 617770
59879 617770 623673 629178 634101 638610 643012 647425 651576 654923 657056 657828 657098 654704 650893 646311 641139
59864 641139 634707 626602 617826 610072 603934 598590 593260 588167 583871 580404 577476 575023 573158 571959
59850 571959 571691 572894 575927 580561 586315 592968 600611 609364 619153 629481 639234 646906 651374 652591
59836 652591 651614 650072 649433 650386 652679 655462 657656 658126 656048 651557 645698 639272 632017 623469 614296
59821 614296 605931 598978 592828 586921 581522 576955 572916 569063 565697 563313 561872 560924 560149 559380 558378
59806 558378 556946 555044 552614 549612 546441 543952 542644 542130 541693 541070 540398 539688 538734 537439 535937 534523
59790 534523 533530 533089 532899 532539 532039 531826 531993 532133 532002 531784 531412 530262 527982 525205 522860 521138 519670
59773 519670 518377 517561 517355 517650 518472 519904 521683 523349 524724 525904 526880 527700 528930 531407 535367 540163
59757 540163 544978 549520 554002 558763 564038 569900 576288 583177 590621 598425 605943 612605 618629 624792
59743 624792 631350 637517 642232 645225 647069 648397 649366 649897 650078 650140 650128 649853 649270 648740 648751 649357 650104 650504
59725 650504 650471 650302 650382 650943 651930 652973 653642 653837 653837 653885 653836 653316 652216 651007 650592 651693 654178 657044 659348
59706 659348 661187 663521 667044 671575 676598 681897 687423 692976 698523 704605 711910 720430 729314 737602
59692 737602 744856 751132 756678 761735 766343 770179 772736 773789 773546 772269 769921 766440 762262 758228
59678 758228 754791 751504 747513 742515 736989 731503 726098 720466 714462 708264 702184 696510 691381 686705
59664 686705 682379 678704 676265 675168 674705 674125 673567 673852 675558 678627 682687 687276 691798 695753 699014
59649 699014 701602 703292 703787 703129 701532 698942 695208 690539 685219 679022 671506 662803 653505 643851 633788
59634 633788 623812 614927 607581 601355 595884 591327 587632 584127 580249 576099 571960 567861 563928 560409
59620 560409 556959 552689 547443 542324 538270 534726 530470 525267 519984 515489 512127 509880 508308 506624
59606 506624 504583 503081 503206 504866 506989 508841 510396 511531 511740 510909 509760 509208 509514 510232 510786 511065
59590 511065 511516 512552 513822 514387 513790 512564 511489 510798 510427 510436 510603 510100 508291 505584 502880 500417 497852
59573 497852 495198 492880 490946 488926 486550 484015 481504 478982 476526 474348 472523 471040 470058 469646 469421
59558 469421 469028 468844 469612 471343 473188 474429 475168 476042 477747 480777 485094 490024 495019 500523 507537
59543 507537 516317 526077 536018 546107 556762 568366 581248 595575 610988 626620 641505 654586
59531 654586 664423 669628 669845 665926 659117 650653 642131 635409 631504 629936 629519 629484 629583 629444 628358 625718
59515 625718 621549 616617 611872 607502 602629 596302 588716 580978 573686 566363 558482 550508 543609 538631
59501 538631 535556 533670 532128 530642 529706 529875 530898 531984 532864 533950 535335 536385 536691 536803 537536 538946
59485 538946 540508 541976 543584 545578 547923 550443 552988 555639 558874 563265 568781 574608 579912 584580
59471 584580 589003 593338 597267 600271 601910 601983 600709 598677 596464 594369 592594 591459 591299 592278 594457
59456 594457 597934 602805 609092 616697 625313 634419 643593 652784 662000 670800 678469 684692 689577 692963
59442 692963 694190 692790 688906 682845 674692 664818 654370 644747 636639 629822 623722 617903 612161 606486
59428 606486 600992 595800 591050 587071 584366 583399 584498 587930 593759 601674 611250 622413 635268 649540
59414 649540 664661 680494 697446 715727 734941 754382 772873 788018 796645 796950 789904 778022
59402 778022 763359 747536 733016 722824 718596 719736 724630 731740 739006 743172 740962 731145 715160
59389 715160 695788 675540 656055 638325 622982 610429 600871 594242 590103 587687 586251 585485 585610
59376 585610 587016 589785 593555 597811 602273 607015 612282 618215 624672 631295 637757 644010 650262 656741
59362 656741 663423 670017 676260 682285 688605 695584 702982 710253 717316 724762 733172 742561 752620 763238
59348 763238 774479 786284 798548 811372 824970 839363 854353 869510 883950 896401 905927 912467
59336 912467 916344 917550 915969 912011 906364 899235 890516 880606 870331 859932 848873 836947 824914
59323 824914 813661 803213 793022 782884 773154 764264 756358 749317 742969 737307 732464 728315 724311
59310 724311 720049 715852 712242 708971 705312 701353 698211 696720 696662 697651 699975 703959 709157 714952 721633
59295 721633 730074 740355 751165 760468 766366 767482 763150 753543 739570 722616 704283 686140 669485
59282 669485 655397 644791 638000 634298 632375 631521 632019 634338 638555 644702 652987 663208 674541 686409
59268 686409 699065 712678 726212 737904 746730 752912 757124 759662 760335 758756 754755 748686 741186
59255 741186 732513 722476 711222 699666 688843 679286 671351 665487 661491 658011 653698 648776 644812
59242 644812 643000 643224 644676 646703 648989 651465 654186 657068 659794 662284 664926 667868 670355 671439
59228 671439 671252 670812 670529 669596 667160 663474 659558 656052 652772 649169 645019 640774 637295 635139 634082
59213 634082 633519 633270 633710 635140 637340 639782 642041 643908 645311 646220 646590 646367 645570 644259 642447 640306
59197 640306 638449 637591 637714 638029 638082 638424 639694 641510 642993 644060 645429 647471 649916 652738 656368 660660
59181 660660 664410 666566 667544 668763 671036 673895 676448 678470 680415 682637 684955 687143 689613 693238
59167 693238 698387 704517 710909 717544 724906 733110 741582 749486 756133 761067 764083 765180 764338 761468
59153 761468 756761 750780 743827 735474 725310 714053 703343 694197 686071 677572 667899 657514 647635
59140 647635 639080 631436 623422 614301 604827 596547 590295 585697 581949 578606 575643 573236 571606 570812
59126 570812 570726 571478 573718 577925 583626 589898 596664 604736 614379 624582 634125 642804 651083 659107 666812
59111 666812 674706 683613 693449 702884 710575 716330 720731 723971 725617 725473 724171 722640 721272 719897
59097 719897 718339 716655 714837 712636 709783 706256 702341 698579 695522 693276 691358 689269 687100 685208
59083 685208 683455 681283 678457 675108 671059 665850 659644 653302 647233 640925 634037 627185 621072 615546
59069 615546 610279 605626 601934 598455 594050 588717 583516 579138 575489 572519 570383 568668 566431 563373
59055 563373 560239 557741 555663 553335 550504 547490 544881 543237 542650 542539 542230 541801 541840 542351 542486 541580
59039 541580 539998 538737 538567 539619 541415 543179 544496 545781 547865 551107 555322 560389 566386 573106
59025 573106 580147 587694 596624 607533 620002 633040 645872 658140 669709 680521 690339 698481
59013 698481 704057 706578 706197 703488 699317 694815 690858 687496 684300 681299 679108 678141 678281 679411 681701
58998 681701 685167 689438 694155 699159 704126 708447 711724 714008 715486 716325 716885 717584 718381 718832 718742 718322
58982 718322 717686 716861 716427 717377 719993 723534 727524 732738 740306 750282 761783 774264 787931 802945
58968 802945 818808 834738 850311 865542 880530 895121 908849 921048 931049 938443 943328 946240
58956 946240 947502 946546 942228 934054 922715 909192 893815 876709 858603 840418 822307 804026
58944 804026 786193 770288 757235 746583 737281 728666 720662 713632 708224 704775 702730 701190 700070
58931 700070 700163 701954 704922 708042 710351 711043 709788 707235 704542 702233 700043 697822 695790 693822 691433
58916 691433 688733 686531 685160 684040 682781 681848 681702 682189 683350 686000 690761 697171 704427 712459 721660
58901 721660 732150 743960 757382 772375 788035 803375 818339 833476 848971 864564 880117
58890 880117 895692 911335 927299 944150 962156 980804 999307 1017277 1034407 1049875 1062621
58879 1062621 1072060 1078136 1080905 1080458 1076991 1070616 1061332 1049459 1035826 1021323 1006578 992197 978748
58866 978748 966225 954031 941816 929891 918614 908000 898191 889570 881942 874228 865521 855924 845940
58853 845940 835736 825446 815475 805946 796501 787201 778826 771619 764546 756600 748082 739719 731321 722387
58839 722387 713345 704942 696858 688221 679263 671221 664699 659269 654689 651363 649426 648335 647598 647160 646981
58824 646981 647042 647897 650377 654478 659191 663670 667977 672476 677153 681809 686412 690886 694877 698041 700359
58809 700359 702013 703122 703701 703748 703318 702495 701168 698900 695349 690811 685873 680453 673851 665991 657898
58794 657898 650512 643760 637314 631469 626505 621899 617172 613049 610810 610763 612275 614956 618935 624161 630345
58779 630345 637399 645069 652411 658595 664001 669557 675114 679506 682005 682565 680726 675635 667543 658146
58765 658146 648902 639844 630501 621136 612491 604914 598316 592597 587722 583670 580577 578610 577552 576905
58751 576905 576484 576582 577479 579176 581622 584701 587982 591058 594270 598608 604686 612185 620409 628967 637808
58736 637808 646932 656206 665205 673351 680520 687376 694662 702223 709131 714625 718459 720517 720729 719329
58722 719329 716696 712978 708381 703723 700083 697946 697191 697744 699551 701970 704065 705667 707442 709649 711377
58707 711377 711342 709026 704817 699349 692939 685503 676867 667092 656268 643970 629452 612767 595277
58694 595277 578609 563564 550455 539765 531583 524888 518451 512224 506951 502657 498556 494265 490058
58681 490058 485932 481540 477233 474123 472748 472446 472298 472022 471784 471890 472894 475366 479294 484282 490363
58666 490363 497994 507189 517429 528508 540694 553747 566433 577220 585025 589230 589649 586714 581229
58653 581229 573806 564928 555368 545980 537125 528893 521654 515718 510644 505712 500946 496808 493067 488958
58639 488958 484505 480695 478251 477122 477201 478578 480887 483298 485359 487178 488745 489953 491221 493094 495111
58624 495111 496090 495714 494941 494655 494895 495584 497061 499606 503185 507827 513432 519206 524245 528718 533533 538838
58608 538838 543952 548689 553483 558100 561602 563805 565443 566676 566885 566292 566209 567117 567941 567897 567619 567716 567722 567431
58590 567431 567924 570136 573558 577468 582413 589314 598003 607808 618766 631085 644023 656441 668008
58577 668008 678951 689077 697856 705096 710956 715880 721039 728067 737628 748922 761167 774782 790491
58564 790491 808329 828337 851287 877607 906234 935411 963912 990693 1014287 1033676 1049044
58553 1049044 1060625 1067553 1069075 1066328 1061609 1056231 1050163 1043307 1035874 1027644 1018022 1006863 994415
58540 994415 980510 964550 946228 925666 903128 879239 855184 831989 809838 788676 769136
58529 769136 752202 738260 727079 718372 711713 706237 701140 696294 691907 687865 683911 680102 676587
58516 676587 673236 669914 666706 663574 660322 657237 655030 653661 652008 649368 646541 644672 643614 642311
58502 642311 640322 638215 636738 636157 636080 635532 633726 631158 629297 628818 628947 629039 629783 632084 635666 639761
58486 639761 644557 651085 660146 672026 686596 702977 719749 736260 753150 770953 788930 805922
58474 805922 821506 835406 846532 853531 855791 853289 846222 835586 823247 810594 797800 785062
58462 785062 773608 764604 758085 753928 752905 755660 761476 769207 778636 789792 801716 813072 823251
58449 823251 831849 837867 840606 840583 838396 833448 825012 813802 801297 788332 775485 763954 754626
58436 754626 747017 740428 735388 732679 731831 732031 733636 737165 741718 746129 751029 757913 766667 775817 784723
58421 784723 793747 802452 809431 813814 815502 814163 809591 802844 795518 787986 779642 770564 761540 752770
58407 752770 743984 735605 728376 722187 716584 712039 709234 707527 705655 703581 702180 701534 701175 701588 703679
58392 703679 707000 710174 712937 716146 719971 723682 727071 730529 733870 736679 739594 743727 749022 754612
58378 754612 760459 767042 773840 779816 785138 790765 796701 802357 808165 814987 822335 829164 836115 844839
58364 844839 855318 865999 876542 888250 901564 915163 927796 939209 949138 957219 964060 970592
58352 970592 976215 979265 979398 977896 975752 973301 971544 971795 973865 976450 979320 983367 988600 994131 1000121
58337 1000121 1007816 1017631 1029064 1042310 1057877 1074736 1090990 1106339 1121811 1137257 1151360 1163929
58325 1163929 1175683 1185884 1192772 1196539 1199323 1202042 1203740 1204339 1205416 1207825 1210932 1214655 1219810 1226054
58311 1226054 1231952 1237562 1244603 1253639 1263464 1273627 1285120 1298104 1311404 1324720 1339024 1354382
58299 1354382 1369751 1385109 1401378 1418071 1433634 1448273 1463741 1480295 1496704 1513344 1532083
58288 1532083 1552860 1573627 1594129 1616357 1640698 1665009 1688320 1712174 1737466 1763214 1789303
58277 1789303 1817242 1847262 1877808 1908666 1941479 1976543 2012418 2049291 2089130 2131847 2175052
58266 2175052 2218433 2264549 2314420 2366263 2419540 2476065 2535900 2596244 2655762 2716055 2777600
58255 2777600 2838337 2897606 2957307 3017957 3077918 3137830 3201314 3269858 3341557 3416211 3496741
58244 3496741 3584084 3675793 3771478 3874435 3986009 4103631 4226422 4357370 4497930 4646011
58234 4646011 4801509 4968218 5148058 5339174 5541893 5760390 5996305 6247194 6513633
58225 6513633 6800994 7111769 7443452 7796797 8178587 8593479 9041294 9525466 10055456
58216 10055456 10637337 11271202 11961894 12722859 13565599 14496063 15526364 16679327 17976963
58207 17976963 19437190 21088470 22976110 25149723 27660989 30583855 34025523 38114900
58199 38114900 43003457 48891567 56036858 64724705 75248552 87925160 103092636 121061463
58191 121061463 142074810 166299143 193745599 224055592 256264760 288698587 319003667
58184 319003667 344294909 361571691 368512334 364320221 350012164 327924752 300871561
58177 300871561 271509977 242032057 213985038 188179888 164818616 143806014 125003743
58170 125003743 108293187 93552977 80670186 69554016 60097755 52137909 45471074
58163 45471074 39896600 35230155 31301130 27966128 25121064 22686893 20591292 18773175
58155 18773175 17191546 15814776 14607396 13536535 12582092 11729746 10960727 10257395 9611946
58146 9611946 9020844 8476623 7972634 7509374 7088197 6704037 6350972 6029182 5739478
58137 5739478 5476210 5232258 5006097 4797563 4601373 4411426 4227573 4052243 3884265
58128 3884265 3721653 3566653 3422243 3286729 3157048 3034356 2921402 2817185 2718872 2626322
58118 2626322 2540403 2459479 2381685 2308194 2240469 2176863 2115416 2057242 2003597 1952434 1901402
58107 1901402 1851545 1804611 1759491 1714717 1671578 1631225 1591539 1550551 1510366 1474045 1441076
58096 1441076 1409515 1380123 1354520 1331353 1308040 1284587 1262332 1240744 1218788 1197649 1178834
58085 1178834 1161222 1143073 1125200 1109080 1093561 1076539 1058307 1040155 1021339 1000558 979011
58074 979011 958913 940266 921957 904673 889699 876000 861495 846295 832016 818869 805982
58063 805982 793680 782874 773014 762927 752850 743620 734780 725442 715880 706484 696555 686012 676680
58050 676680 669763 663682 656605 649444 643957 639602 634859 630130 626562 623371 619079 614169 609797 605128
58036 605128 598732 591498 585286 579711 573119 565846 559477 553577 546143 536917 527505 518590 509691 501344
58022 501344 494769 489482 483728 477220 471183 465893 460514 455190 450963 447654 444092 440397 437850 436511
58008 436511 435079 433144 431470 430013 427781 424847 422569 421524 420957 420448 420408 420797 420912 420624 420439 420368 420164
57991 420164 420396 421769 423583 424507 424686 425445 427026 428254 428372 427655 426282 424141 421722 419685 417655 414815
57975 414815 411515 408893 407246 406187 405930 406692 407319 406428 404729 404213 405108 405614 404728 403320 402116 400567
57959 400567 398305 396034 394326 392873 391437 390285 389250 387563 385046 382455 380375 378774 377774 377824 378923
57944 378923 380646 382970 386200 390183 394621 399903 406583 414240 422046 430163 439315 449188 458624 467196
57930 467196 475266 482602 488362 492368 495077 496328 495458 492553 488259 482518 474946 466337 458292 451311
57916 451311 444665 438069 431953 426161 420026 413860 408786 404915 401214 397378 394263 392213 390532 388907
57902 388907 387821 387146 385827 383484 380907 378480 375523 371791 368336 366241 365546 365874 367030 368555 369775
57887 369775 370747 372171 374127 375961 377581 379573 381721 382835 382506 381843 381864 382289 382412 382071 381199 379526
57871 379526 377318 375558 374815 374727 374861 375183 375410 374899 373543 371899 370269 368641 367626 368224 370393 373008
57855 373008 375500 378281 381255 383348 384035 384055 383974 383292 381657 379711 377937 375669 372138 367638 362940 358317
57839 358317 353841 349882 346674 343938 341479 339528 338152 337034 336141 335820 335953 335880 335472 335452 336305 337670
57823 337670 339039 340211 340941 341173 341769 343787 346781 349030 349824 350266 351415 352949 354196 355158 355771 355375
57807 355375 353632 350939 347385 342517 336767 331762 328372 325738 323070 321106 320711 321315 322006 323077 325090
57792 325090 327344 328725 329473 330680 332479 334030 334987 335877 337167 338934 341267 344206 347437 350726 354278
57777 354278 358058 361214 362923 363455 363668 363796 363385 362109 359954 356918 353155 349177 345366 341509 337249
57762 337249 332643 327937 323263 318968 315774 314139 313802 314208 314917 315384 315131 314589 315078 317453 321280 325601
57746 325601 329710 332925 334619 335131 335772 337258 338898 339892 340457 340913 340633 338924 336330 334057 332574 331551
57730 331551 330644 329574 328016 326153 324794 324307 323999 323226 322317 321701 320943 319564 318028 316870 315577 313455
57714 313455 311025 309349 308430 307436 306094 304641 302692 299488 295282 291404 288748 287019 285464 283635 281425
57699 281425 279025 276919 275465 274552 274019 274018 274513 274960 275096 275532 276767 278123 278533 278043 277655 278038 279254
57682 279254 281439 284855 289369 294828 301878 311742 325272 342885 365166 392784 425956 464708 509540
57669 509540 561093 619131 682248 748074 812910 871226 916370 942234 944688 922670 879078 820254
57657 820254 753496 684716 618345 558185 506848 464540 429629 400590 376793 357727 342581
57646 342581 330716 321787 315303 310667 307561 305611 303831 301210 297858 294890 293167 292740 293332 294619
57632 294619 296013 296846 296889 296276 295034 293194 291148 289273 287375 285046 282410 279951 277795 275740 273769
57617 273769 271984 270306 268769 267774 267424 266980 265638 263538 261333 259237 257261 255884 255530 255692 255571 255266
57601 255266 255376 255691 255391 254409 253513 253073 252719 252206 251616 250694 249050 247056 245591 244748 243735 242153 240469
57584 240469 239020 237493 235664 233843 232311 230974 229765 228729 227560 225732 223215 220467 217699 214842
57570 214842 212189 210232 208751 206913 204455 202037 200311 199304 198858 198920 199175 199101 198633 198256 198338 198877 199875
57553 199875 201297 202698 203633 204470 206015 208231 210127 211047 211358 211702 212237 212784 213090 212875 212166 211644 211991
57536 211991 213032 214191 215607 217795 220281 221699 221455 220257 218777 216928 214873 213670 214093 215507 216597
57521 216597 216779 216352 215731 215043 214259 213407 212819 213146 214747 217058 219037 220194 220779 221125 221431 222042 223165
57504 223165 224392 225214 225865 226773 227361 226546 224446 222429 221183 219887 217687 214890 212140 209414 206535
57489 206535 203940 202230 201474 201466 202199 203634 205373 206890 207774 207781 207159 206797 207265 207767 207008 205113 203574 203115
57471 203115 202822 201819 200570 199890 199705 199557 199442 199373 198884 197753 196614 196149 196265 196645 197446 198738 199855
57454 199855 200056 199515 199059 199298 200320 201780 202896 202959 202277 202041 202893 204206 205139 205636 205968 206111 206181 206772
57436 206772 208147 209722 210953 212159 213882 216018 218166 220170 221714 222115 221269 220198 219851 219897 219516 218835
57420 218835 218638 218987 219066 218319 217061 215997 215614 215891 216263 216072 215345 214839 215091 215907 216926 218025 218838 218656
57402 218656 217395 215960 215096 214540 213906 213654 214329 215487 216257 216553 216891 217396 217818 218253 219046 220185 221501
57385 221501 223280 226044 229797 233927 237651 240257 241355 241375 241414 242044 242689 242579 241864 241220 240893 240732 240727 240849
57367 240849 240679 239811 238376 236768 235268 234258 234237 235126 236154 236885 237750 239136 240778 242609 245274 248915
57351 248915 252354 254534 256067 258233 261053 263545 265380 266996 268389 269116 269384 270018 271316 272875 274467
57336 274467 276152 277558 277994 277372 276327 275439 274999 275353 276685 278502 280037 280989 281345 280870 279583 278373
57320 278373 278177 278747 279126 279115 279324 279924 280377 280374 280163 279981 280006 280819 282968 286026 288864 290864 292154 292855
57302 292855 293063 293465 294897 297154 299144 300370 301371 302628 303903 304905 305780 306693 307568 308418 309343 310153
57286 310153 310654 311279 312701 314773 316639 317936 319133 320610 322251 324101 326633 330099 334319 339258 345132
57271 345132 351773 358564 365129 371405 376976 381150 383985 386448 389216 391975 394227 396161 398329 401022
57257 401022 404348 408395 412828 416756 419500 421433 423721 427251 431909 436791 441098 444858 448712 453053
57243 453053 457683 462454 467702 473783 480598 487969 495930 504158 511702 518017 523876 530580 538656 547925
57229 547925 558309 569667 581266 592390 603274 614619 626450 638184 649459 660043 669421 677553
57217 677553 685649 695105 705891 717020 728188 739721 751281 762109 772449 783290 794723 805984
57205 805984 817286 830091 845242 862122 880029 899107 919512 940928 963458 987933 1014789
57194 1014789 1043542 1073773 1105675 1139306 1174264 1210417 1247902 1286028 1323264 1358748 1392862
57183 1392862 1425976 1457779 1488374 1518904 1550349 1582573 1615088 1647873 1680838 1713367 1745052
57172 1745052 1776204 1807066 1837237 1866361 1894766 1922905 1950807 1978367 2005555 2032053 2057340
57161 2057340 2081350 2104353 2126169 2146417 2165701 2185550 2206938 2229843 2254397 2281325 2310951
57150 2310951 2342859 2376833 2412952 2450452 2487796 2524391 2561049 2598321 2635665 2672814 2710580
57139 2710580 2749529 2789046 2828577 2868774 2910660 2954670 3001288 3051601 3106400 3165500 3228559
57128 3228559 3295776 3367370 3443394 3524680 3612981 3709596 3814533 3927168 4046700 4171923
57118 4171923 4301947 4437377 4579467 4728151 4882705 5044471 5216795 5401798 5599539
57109 5599539 5811098 6040178 6290554 6564245 6863695 7194010 7562077 7975786 8445749
57100 8445749 8986177 9613263 10345129 11205043 12223355 13436658 14889042 16635628 18740581
57091 18740581 21267690 24272479 27799908 31880136 36520480 41704528 47400771 53565827
57083 53565827 60137915 67039098 74187361 81476331 88695976 95454402 101204682 105396235
57075 105396235 107645949 107811043 105951177 102255214 96993426 90495157 83128584 75274377
57067 75274377 67296122 59509905 52159351 45406199 39337695 33981159 29318442 25300959
57059 25300959 21865000 18942350 16464795 14367187 12591427 11088250 9815373 8735618
57051 8735618 7817183 7033719 6362741 5784670 5283569 4847243 4465550 4129271 3830932
57042 3830932 3565442 3328976 3117711 2928050 2757248 2603084 2463405 2336507 2221679
57033 2221679 2118990 2028715 1951083 1886188 1833924 1794157 1767117 1753459 1753940 1769112 1799156
57022 1799156 1843578 1900314 1963917 2023502 2063102 2066703 2025604 1941993 1825990 1690145 1546520
57011 1546520 1406121 1277507 1164766 1067765 984805 914571 855883 806912 765362 729044 696265
57000 696265 666190 638839 614212 591486 569699 548998 530346 513996 499148 485260 472809
56989 472809 462451 454312 448576 445954 446758 449922 453620 456635 458579 458934 456559 450335 439940 425843
56975 425843 408843 389876 370094 350754 332855 317005 303698 293484 286599 282544 280532 280399
56963 280399 282777 288277 296902 308373 322496 338794 356092 372776 387212 397610 402042 399293
56951 399293 389660 374505 355262 333355 310723 289443 270616 254184 240098 229116 222156 219348
56939 219348 220177 224294 231809 242929 257655 275776 296865 320271 345193 370552 394504 414173
56927 414173 426327 428657 420616 403278 378713 349475 318207 287235 258347 232844 211444 193892
56915 193892 178963 165379 152832 141847 132737 125128 118560 112998 108507 104932 102211 100517 99673
56902 99673 98864 97573 96435 96536 98136 100745 104221 108927 114892 121760 129751 139807 152466 167253
56888 167253 183507 201102 219868 238900 256884 272643 284908 292186 293593 289685 281947 271721
56876 271721 259993 247876 236657 227410 220963 218079 219199 224157 232648 245046 262352 285291 313765
56863 313765 347185 384936 426290 470032 514286 556548 593726 622245 638569 640401 627992 604314
56851 604314 573536 539191 503802 469774 439689 415443 397819 387343 385040 391833 407714 432181
56839 432181 465202 507035 557302 614940 679007 748559 821189 892019 954429 1001697 1028260
56828 1028260 1030603 1008211 964019 903607 833585 760355 689588 625690 571126 526456 491453
56817 491453 466195 450936 445331 448488 459887 479697 507912 543632 585466 632056 681569 730774
56805 730774 775065 809327 828778 829878 811622 776253 728234 672408 613203 554776 500655 452937
56793 452937 412474 379917 355879 340085 331262 328223 330381 337075 347355 360919 378454 400362
56781 400362 425556 451802 476472 496423 508054 508756 498315 478426 451138 418334 382243 345434
56769 345434 310092 277639 248903 224187 203242 185605 170886 158498 147515 137334 128264 120902
56757 120902 115110 110142 105620 101781 98811 96484 94497 92689 90861 88836 86748 84999 83871 83442
56743 83442 83725 84481 85013 84656 83508 82312 81563 81119 80749 80601 80973 81916 83228 84603 85687 86250 86443
56726 86443 86707 87329 88194 89040 89822 90733 92003 93699 95672 97620 99285 100608 101717 102813 104058 105423
56710 105423 106595 107144 106914 106210 105613 105670 106603 108098 109418 110096 110553 111650 113500 115133 115580 114936 114087
56693 114087 113708 113883 114358 114742 114592 113776 112777 112333 112791 113964 115455 116908 118001 118527 118552 118412 118530 119152
56675 119152 120065 120590 120109 118741 117238 116183 115599 115439 115950 117230 118811 120125 121160 122269 123511 124606
56659 124606 125413 126113 126970 128213 130068 132547 135221 137506 139253 140879 142848 145140 147252 148655 149191
56644 149191 149071 148596 148026 147682 147859 148475 149137 149812 151056 153113 155182 156237 156244 155819 154929 153022 150402
56627 150402 148317 147307 146530 145129 143317 141490 139285 136352 133257 130748 128668 126486 124380 122981
56613 122981 122397 122316 122671 123369 123754 123198 122115 121606 122239 123750 125662 127405 128172 127550 126261 125514 125691
56596 125691 126335 127226 128572 130091 130853 130374 129276 128550 128619 129341 130487 131873 133182 133939 133803 133017 132497
56579 132497 133099 134616 135943 136435 136592 137152 138130 139283 140897 143439 146813 150637 154885 159661 164747
56564 164747 169979 175651 181910 188334 194875 202580 212339 223267 233330 241241 246783 249829 250385 249435
56550 249435 248330 247244 245346 242499 239493 236616 233373 229963 227581 226652 225964 224334 222112 220214 218488
56535 218488 215976 212304 208105 204372 201810 200352 198921 196227 192270 188588 186647 186456 187132 188106 189192
56520 189192 189994 190013 189163 187735 186033 184367 182991 181666 179626 176475 172887 169946 167992 166528 165086
56505 165086 163800 163101 163163 163648 163905 163498 162631 161954 161868 162142 162247 161894 161202 160512 160104 160006 160118 160496 161321
56486 161321 162473 163472 164101 164732 165629 166307 166136 165320 164673 164642 165138 166122 167619 169261 170520 171416 172362 173383
56468 173383 174139 174639 175177 175588 175397 174764 174500 175004 175910 176857 177805 178422 178053 176667 175175 174474 174763 175968
56450 175968 178057 180603 182730 183939 184548 185079 185755 186740 188144 189517 190049 189619 189021 188801 188566 187796 186729
56433 186729 185965 185755 186072 186891 187997 188964 189600 189943 189681 188342 186323 184945 184945 185606 185910 185893 186233 187061
56415 187061 187911 188479 188766 188718 188322 187931 188026 188724 189751 190761 191524 192036 192561 193254 193759 193615 193169 193461 195079
56396 195079 197614 200379 202981 205008 205943 205872 205715 206293 207583 209129 210592 211633 211932 211772 211999 212984
56380 212984 214139 214835 215156 215354 215246 214757 214431 214760 215473 216103 216835 218135 219844 221277 222048 222360 222682
56363 222682 223457 224880 226591 227863 228390 228712 229632 231483 234022 236645 238626 239632 240152 240913 241907 242586
56347 242586 242997 243818 245152 246337 247267 248822 251397 253942 255291 255652 256031 256825 257827 259052 260738 262871
56331 262871 265331 268150 271180 274043 276924 280733 285801 291031 295059 297796 300061 302261 304225 305943
56317 305943 307611 309121 310213 310978 311663 312216 312500 312705 313128 313850 315059 317215 320477 324310 328122 331956
56301 331956 336223 341220 347183 354229 361857 369127 375694 381987 388034 393001 396525 399560 403117 406949
56287 406949 410401 413913 418682 425276 433422 442756 452958 463534 474218 485257 496778 508383 519997
56274 519997 532428 546370 561500 577322 594226 612829 632953 654268 677349 703023 731206
56263 731206 761534 794755 832319 874838 922092 974449 1033265 1099982 1175690 1261386 1357738
56252 1357738 1464694 1582221 1711265 1853057 2007475 2172935 2347859 2531343 2722223
56243 2722223 2918054 3115105 3308868 3494614 3667977 3825036 3961679 4073332 4155908 4206887
56233 4206887 4225264 4211002 4165058 4089541 3987300 3861708 3717014 3558166 3389624 3214836
56223 3214836 3037151 2860285 2687145 2519065 2356996 2202667 2057718 1922476 1796543
56214 1796543 1679921 1572663 1474260 1384373 1303381 1231077 1165668 1105338 1050055 1000514 955994
56203 955994 914811 876427 841496 810069 781265 754661 730612 709142 689723 672215 656952
56192 656952 643789 631988 621078 611106 602188 594487 588312 583478 579030 574373 570117 566909 564164
56179 564164 561050 558071 556333 555746 555281 554625 554265 554263 554272 554501 555450 556893 558269 559813 562142 565116 568239
56162 568239 571865 576763 582852 589525 596879 605478 615382 626507 639413 654435 670737 687658 706443
56149 706443 729117 756172 786941 821721 861882 908262 961214 1021938 1091976 1171458 1259168
56138 1259168 1353844 1453700 1555024 1653066 1744307 1826614 1898032 1957548 2006813 2049074 2086322
56127 2086322 2118946 2147433 2172079 2191219 2202073 2203677 2197265 2183987 2164195 2138682 2108078 2070728
56115 2070728 2023332 1964186 1894052 1814025 1724972 1629521 1532400 1438041 1349381 1268961 1198943
56104 1198943 1139521 1089256 1047409 1014188 988575 968104 951286 938308 928992 922038 916694 913189
56092 913189 911181 909790 909390 911170 914579 917517 919582 922820 928585 935825 943167 950504 957809 964528
56078 964528 970991 978502 987291 996176 1004816 1014267 1024857 1035636 1046468 1058437 1071578 1084503 1097081
56065 1097081 1111185 1127893 1145952 1163895 1181668 1199478 1216994 1234348 1251968 1268977 1283827
56054 1283827 1296813 1309726 1322824 1334798 1346098 1359364 1375678 1393045 1409482 1425193 1441032
56043 1441032 1457412 1475377 1496101 1518652 1540895 1563067 1587547 1614686 1642222 1669513 1698867
56032 1698867 1731646 1766450 1802261 1839975 1879636 1919495 1959117 2000176 2043032 2085885 2128348
56021 2128348 2172327 2218383 2265022 2312640 2364017 2419607 2476611 2534195 2595160 2660778 2728671
56010 2728671 2797809 2870919 2949550 3031386 3114988 3202707 3296255 3393865 3494518 3600519 3713206
55999 3713206 3830703 3952629 4082328 4221642 4368397 4521854 4685495 4861349 5047035
55990 5047035 5241794 5450025 5675304 5916415 6172839 6448394 6745724 7063295 7401887
55981 7401887 7767871 8166039 8595948 9059677 9566083 10122661 10730772 11394142 12124330
55972 12124330 12932419 13824001 14808838 15907280 17141287 18529199 20097115 21886398
55964 21886398 23944074 26319119 29079447 32324273 36176017 40780268 46329520 53073261
55956 53073261 61290819 71268286 83310561 97744684 114878370 134961854 158184859
55949 158184859 184619987 214025575 245592283 277795191 308385489 334495259 352982501
55942 352982501 361169119 357748670 343271403 319842267 290320635 257611638 224304060
55935 224304060 192491051 163615407 138407855 117004407 99161843 84441264 72333679
55928 72333679 62355492 54101830 47243403 41505252 36665577 32558205 29054875 26046436
55920 26046436 23445006 21188928 19230252 17521686 16021898 14703241 13543920 12518712
55912 12518712 11604600 10787860 10057498 9398002 8795769 8246285 7747640 7292333 6871953
55903 6871953 6484335 6129314 5802199 5497632 5215331 4955995 4715707 4490007 4279435
55894 4279435 4085595 3905526 3735214 3575028 3426637 3287989 3156267 3032612 2919171
55885 2919171 2814432 2715887 2624350 2541390 2465412 2394449 2329850 2272917 2220516 2168085 2114452
55874 2114452 2059949 2002643 1940733 1876308 1812640 1749841 1686929 1625862 1569402 1516875 1465984
55863 1465984 1417187 1372565 1331926 1293646 1258049 1226457 1198092 1171134 1145712 1122839 1101505
55852 1101505 1079666 1056977 1034033 1010261 985223 960521 937691 915496 891958 867720 844770
55841 844770 823229 802108 781926 763822 747192 730858 715524 702512 691089 679569 668028
55830 668028 657526 647671 637406 627250 618372 610341 602047 593808 586302 578491 569028 558753 549393
55817 549393 540728 531393 521560 512392 503753 494997 487286 482499 480327 478814 477321 476694 477025 477611 478854
55802 478854 481903 486561 491530 496422 501637 506612 510152 512191 513327 512966 509844 504143 497249 489705
55788 489705 481178 472162 463886 456733 450376 445109 441378 438291 434338 429332 424100 418718 412767 407034
55774 407034 403158 401794 402647 406004 412550 421912 432926 444960 457282 467460 472288 470377 462531
55761 462531 449930 433588 415222 396848 379384 362982 348392 336393 326230 316383 306752 298517
55749 298517 292041 286606 281997 278550 275687 272261 268475 265738 264446 263562 262575 262172 262613 263049 262887 262399
55733 262399 261526 259454 255905 251701 247668 243996 240859 238420 235963 232262 227216 222069 217658 213576
55719 213576 209417 205766 203357 202078 201380 201138 201756 203788 207537 212611 218036 223289 228886 235280 241526
55704 241526 245840 247223 245847 242330 237495 232338 227197 221360 214453 207588 201950 196881 190925 184363
55690 184363 179052 175883 174066 172957 172957 174238 176083 177981 180306 183495 187456 191999 196904 201506 205182
55675 205182 208273 211505 214540 216205 216151 215120 213542 211162 208212 205680 204088 203053 202323 202172 202526
55660 202526 202730 202498 202251 202388 203096 204813 207792 211176 213605 214814 215500 215617 214214 211148 207620 204593
55644 204593 201893 199190 196599 193839 190059 185138 180107 175713 171530 167053 162674 158979 155922 153258
55630 153258 151000 148970 146714 144353 142759 142375 142520 142267 141389 140161 138955 138243 138224 138180 137027 134738
55614 134738 132409 130725 129294 127691 126051 124300 121899 118932 116399 114814 113450 111602 109696 108409
55600 108409 107513 106416 105178 104239 103595 102937 102224 101561 100898 100253 99873 99801 99722 99490 99371 99520 99790 100218 101071
55581 101071 102136 102668 102379 101909 101998 102810 104297 106548 109394 112310 115051 117899 121065 124394 127782 131216
55565 131216 134274 136381 137705 138974 140225 140621 139757 138154 136209 133669 130592 127766 125552 123266 120377
55550 120377 117429 115110 113195 111204 109421 108511 108607 109391 110547 111664 112355 113016 114756 117963 121526 124105
55534 124105 125519 126315 126661 126406 125736 125010 124314 123582 122743 121408 119086 116119 113594 111872 110074 107647
55518 107647 105419 104190 103160 100949 97598 94369 91924 89875 87947 86515 85871 85758 85747 85563 85088 84474
55502 84474 84140 84259 84460 84364 84094 83922 83871 84032 84727 85826 86482 86167 85487 85297 85520 85488 84975 84102 82722
55483 82722 80820 79197 78788 79446 80234 80785 81558 82825 84163 84982 84938 83913 82232 80872 80698 81361 81490
55466 81490 80184 77883 75714 74298 73352 72231 70795 69739 69829 70790 71453 71208 70728 70873 71450 71669 71302
55449 71302 70705 70096 69581 69679 70966 73184 75220 76030 75305 73529 71799 71239 71999 73051 73408 73211 73162 73400
55431 73400 73660 74085 75004 76110 76742 76841 76858 76831 76437 75875 75850 76538 77355 77861 78221 78645 79122 79919 81541 83812
55411 83812 85620 86054 85432 84783 84576 84361 83581 82388 81511 81384 81563 81273 80458 79853 79812 79606 78346 76236
55393 76236 74370 73527 73686 74442 75288 75635 75240 74614 74489 74919 75387 75638 75807 75805 75276 74282 73374 72844 72386
55374 72386 71707 71001 70639 70711 71045 71409 71580 71428 71010 70467 69917 69614 69925 70834 71787 72410 73069 74159 75178
55355 75178 75237 74349 73433 73055 72892 72554 72173 71983 71973 72194 72857 73842 74599 74818 74751 74654 74412 73952 73562 73447
55335 73447 73357 72977 72380 71832 71443 71292 71611 72514 73760 75026 76185 77066 77207 76242 74499 72889 72117 72141
55317 72141 72382 72393 72246 72315 72783 73466 74083 74544 74928 75358 75977 76778 77354 77100 75940 74552 73613 73152 72926
55298 72926 73053 73693 74401 74483 74038 74013 75096 76961 78764 80070 81158 82588 84457 86026 86340 85459 84682
55281 84682 85074 86110 86366 85250 83385 81467 79654 78031 76809 75902 75026 74412 74667 75679 76469 76457 76176
55264 76176 76315 76771 77188 77762 78808 79970 80589 80583 80370 80155 79861 79591 79499 79361 78929 78686 79563 81656 83723
55245 83723 84316 83146 81068 79010 77357 76270 76094 77061 78760 80281 81021 81100 80874 80370 79499 78625 78378
55228 78378 78803 79104 78456 76882 75173 74111 73891 74162 74461 74668 75072 75942 77067 77889 78091 77918 77940 78569
55210 78569 79762 80978 81514 81131 80354 79990 80354 81152 82012 82782 83322 83373 82822 81923 81142 80824 80969 81227 81196
55191 81196 80867 80614 80562 80228 79194 77906 77275 77607 78447 79410 80499 81500 81819 81313 80685 80604 80837 80768 80457
55172 80457 80586 81463 82623 83417 83632 83415 82912 82164 81266 80479 80106 80205 80470 80571 80603 81057 82236 83877 85430
55153 85430 86520 87063 87096 86724 86112 85370 84479 83477 82653 82362 82617 82979 82940 82397 81680 81158 80934 80979 81335
55134 81335 81967 82522 82632 82520 82945 84347 86319 88113 89357 90016 90007 89307 88314 87685 87767 88355 88887 88721 87505
55115 87505 85607 83963 83248 83356 83930 84929 86250 87236 87318 86908 86958 87678 88385 88567 88473 88594 89221 90533 92463
55096 92463 94421 95756 96578 97491 98546 99240 99630 100485 101955 103018 102837 101980 101591 101925 102356 102452 102305 102044
55078 102044 101666 101285 101016 100644 99796 98446 97068 96316 96613 97828 99217 100005 100198 100490 101204 101780 101608
55061 101608 100946 100556 100720 100992 100737 99611 97734 95678 94070 92986 91963 90786 89860 89500 89379 89111
55045 89111 88975 89487 90578 91728 92720 93638 94288 94233 93462 92529 91980 91995 92508 93223 93554 93035 91942 91158 91228
55026 91228 91776 91938 91229 89965 89016 89107 90156 91324 91838 91710 91530 91727 92253 92850 93302 93494 93483 93508 93715
55007 93715 93963 94094 94240 94593 94976 95046 94935 95282 96488 98164 99529 100191 100389 100534 100755 100975 101303 102044
54989 102044 103193 104119 104085 103083 101869 101174 101110 101380 101649 101632 101166 100416 99771 99385 99108 98925 99079 99562 99921
54970 99921 99855 99617 99542 99610 99835 100600 102077 103649 104538 104839 105318 106228 106930 106787 105974 105210 104942 104950 104673 103957
54950 103957 103518 104353 106540 108933 110367 110791 110804 110566 109884 109112 109018 109657 110137 109826 109155 108942 109427 110335
54932 110335 111449 112697 113969 115298 116980 119139 121324 122975 124306 126373 130177 135870 142845 150357
54918 150357 157897 165196 172126 178651 184666 189756 193213 194509 193684 191057 186642 180171 171863 162813
54904 162813 154320 146976 140640 135123 130520 126936 124216 122064 120269 118805 117804 117427 117642 118136 118588
54889 118588 118980 119515 120275 121073 121698 122274 123377 125698 129406 133878 138356 142899 148331 155060 162316 168921
54873 168921 174541 179780 185143 190294 194299 196248 195646 192524 187311 180500 172452 163619 154850 147193
54859 147193 141288 137013 133679 130559 127341 124197 121363 118777 116329 114386 113553 113791 114181 113891 112963
54844 112963 111865 110704 109375 108166 107590 107674 107901 107782 107176 106171 105074 104381 104280 104288 103841 103165 103057 103789
54826 103789 104809 105675 106698 108314 110136 111161 110912 110065 109724 110096 110158 108864 106489 104353 103219 102602
54810 102602 101851 101244 101459 102435 103457 104064 104295 104269 104172 104451 105350 106367 106815 106811 107025 107527 107699 107352 107162
54791 107162 107762 109068 110713 112542 114382 115877 116859 117486 117806 117664 117213 117019 117381 118002 118609 119427 120720
54774 120720 122296 123837 125447 127572 130605 134689 139591 144711 149660 154981 161714 169991 178578 186161
54760 186161 192526 198082 202782 206110 207754 207619 205427 200949 194554 187014 178879 170492 162531 155941
54746 155941 151164 147769 144928 142001 138724 135225 132068 130009 129426 129936 130583 130476 129388 127859 126719
54731 126719 126502 127364 129330 132291 135754 139047 142045 145412 149929 155846 163027 171281 180159 188706 195901
54716 195901 201223 204434 205071 202817 198361 193216 188296 183116 176721 169099 161203 153821 147061 141043
54702 141043 136420 133754 132675 132191 131706 131253 130795 130035 129069 128552 128708 128694 127538 125389 123251 121747 120803
54685 120803 120283 120144 119985 119275 118226 117707 118029 118442 118112 117089 115933 114941 114132 113581 113347 113307 113357 113463
54667 113463 113355 112604 111325 110362 110327 110818 110980 110504 109681 108779 107898 107302 107345 108029 108901 109432 109404 109058 108939
54648 108939 109359 109964 110191 110180 110691 111889 112831 112631 111615 110747 110315 109908 109440 109489 110527 112299 114029 114978
54630 114978 114893 114163 113391 112660 111504 109859 108534 108256 108717 109168 109509 110028 110422 110087 109324 109274 110423 112040
54612 112040 113407 114769 116539 118221 118870 118356 117554 117272 117418 117287 116441 115153 114033 113292 112542 111419
54596 111419 110191 109485 109509 109939 110419 110767 110684 109797 108225 106751 106160 106592 107645 108822 109699 109997 109807 109650
54578 109650 110010 110804 111501 111782 111957 112608 113856 115040 115299 114431 113114 112221 112175 112959 114386 116056 117347
54561 117347 117906 118020 118219 118624 118998 119195 119150 118665 117724 116900 116788 117071 116841 115968 115456 116154 117778 119548
54543 119548 121191 122733 123841 124194 124337 125393 127766 130630 132858 134052 134484 134371 133653 132357 130830
54528 130830 129482 128494 127930 127883 128260 128480 127821 126216 124399 123074 122222 121562 121272 121774 122936 124092 124835
54511 124835 125226 125234 124613 123586 122980 123250 123783 123648 122784 121979 121811 122033 121982 121259 120003 118709 117862 117580 117612
54492 117612 117685 117775 118000 118434 119113 120005 120869 121356 121455 121648 122395 123579 124704 125483 126035 126550 126988 127117 126768
54473 126768 126116 125773 126424 128238 130725 133204 135246 136641 137348 137692 138260 139200 139853 139520 138442 137550 137319
54456 137319 137328 136992 136244 135316 134243 132883 131277 129733 128580 127909 127510 127084 126614 126448 126819 127371 127461 126942
54438 126942 126315 126041 126088 126265 126596 127080 127408 127306 126953 126686 126419 125832 125057 124716 125152 126055 127054 128315 130205
54419 130205 132557 134684 136103 136944 137567 138010 137965 137199 135868 134423 133272 132524 132036 131688 131563 131813 132406
54402 132406 133120 133783 134419 135127 135947 136916 138109 139483 140719 141422 141563 141604 142023 142800 143508 143894 144137 144421
54384 144421 144448 143659 141968 140047 138756 138414 138723 139229 139670 139963 140112 140248 140629 141500 142881 144485 145848
54367 145848 146634 146895 146978 147175 147581 148307 149542 151206 152782 153870 154806 156395 158978 162143 165372 168617
54351 168617 172087 175767 179378 182589 185119 186818 187829 188480 188835 188500 187031 184370 180784 176657 172494
54336 172494 168863 165985 163551 161206 159059 157408 156140 154797 153172 151525 150194 149303 148862 148821 148937
54321 148937 148839 148366 147707 147147 146797 146584 146361 146000 145480 144867 144191 143441 142770 142437 142368 142011 140984 139705 138955
54302 138955 138881 138907 138587 138059 137553 137001 136365 135901 135743 135612 135287 135052 135288 135868 136418 137001 138011 139449 140837
54283 140837 141938 143099 144639 146288 147532 148225 148553 148611 148386 148069 147958 148022 147878 147287 146440 145710 145381 145642
54265 145642 146485 147472 148012 148132 148570 149705 150781 150768 149819 149163 149607 150792 151994 152922 153469 153390 152741 152124
54247 152124 151955 151842 151193 150162 149442 149324 149469 149499 149332 148959 148339 147564 146850 146381 146320 146806 147636 148177 147934
54228 147934 147084 146145 145409 145025 145281 146206 147129 147319 146994 147098 148095 149585 151056 152338 153262 153567 153377 153195
54210 153195 153176 152887 152037 150922 149948 149146 148436 147938 147779 147888 148131 148263 147712 145972 143429 141270 140328 140403
54192 140403 140874 141401 141775 141795 141708 142196 143434 144644 145136 145297 145934 147015 147755 147713 147188 146692 146545 146940 147905
54173 147905 149215 150619 152005 153128 153491 152923 151920 150965 149854 148269 146679 145876 145760 145387 144296 143078
54157 143078 142448 142323 142134 141640 141127 141031 141534 142413 143236 143835 144460 145263 145905 146054 146011 146259 146577 146261 145273
54138 145273 144449 144402 144841 145237 145574 146071 146657 147149 147603 148102 148430 148328 147832 147074 146028 144850 144181 144648
54120 144648 146156 148039 149888 151790 153736 155212 155656 155222 154896 155780 158192 161369 164073 165566 165997
54105 165997 165921 165668 165235 164521 163412 161790 159854 158406 158365 159738 161307 161692 160699 159396 158879 159165 159430
54088 159430 159051 158230 157666 157899 158940 160336 161451 161890 161842 162002 162996 164862 167085 169137 170943 172874
54072 172874 175376 178632 182497 186667 190883 195046 199259 203736 208524 213276 217428 220619 222724 223460
54058 223460 222362 219461 215646 211842 208088 203938 199630 196124 193921 192588 191674 191402 192048 193274 194633
54043 194633 196267 198497 201029 203260 205268 207909 211948 217400 223648 229857 235438 240544 245962 252154
54029 252154 258516 264032 268437 272246 275808 278937 281480 283617 285471 286972 288249 289722 291520 293158
54015 293158 294007 293781 292461 290063 286676 282542 277949 273145 268338 263627 258980 254451 250298 246590 242931
54000 242931 238994 235133 231960 229428 226921 224225 221753 219752 218020 216562 215775 215560 215021 213597 212016
53985 212016 211443 212043 212971 213589 214071 214904 216323 218275 220460 222273 223000 222279 220288 217533 214539 211690
53969 211690 209179 207051 205332 204005 202875 201667 200347 199205 198502 198208 198159 198274 198517 198809 199118 199474
53953 199474 199897 200504 201664 203704 206367 208987 211339 213926 217171 220767 224185 227524 231436 236363 242144
53938 242144 248224 254016 259217 264028 268837 273505 277335 280052 282469 285676 289829 294259 298621 303327
53924 303327 308841 315041 321508 328130 335296 343641 353610 365132 377764 391244 405641 420649 434887
53911 434887 446359 453730 457033 457328 455861 453360 449767 444701 438375 431878 426245 421532 417179 412961
53897 412961 408978 404935 400200 394643 388770 382953 377101 371168 365321 359352 352684 345270 337879 331040
53883 331040 324267 316874 309050 301514 294493 287774 281526 276278 272042 268182 264278 260569 257301 254116
53869 254116 250460 246309 242221 238797 236255 234322 232338 229685 226359 223031 220352 218300 216429 214552
53855 214552 212876 211488 210110 208461 206555 204473 202177 199827 198058 197452 197769 198099 197816 197055 196187 195308
53839 195308 194541 194365 195144 196505 197662 198264 198511 198550 198306 197956 197995 198571 199194 199383 199257 199184 199196 199106 198984 199091
53819 199091 199500 200145 201098 202403 203765 204843 205880 207537 209981 212547 214479 215699 216674 217914 219837
53804 219837 222773 226649 230866 234895 238972 243812 249644 255916 262023 267920 273796 279452 284390 288388
53790 288388 291658 294396 296480 297752 298414 298927 299539 300101 300420 300667 301172 301775 301602 299782 296387 292356
53774 292356 288431 284448 279895 274891 270174 266151 262376 258175 253422 248418 243270 237832 232321 227502
53760 227502 223962 221399 219015 216508 214357 213003 212158 211185 209859 208368 206763 204945 203218 202200 201923
53745 201923 201522 200343 198972 198609 199543 200881 201786 202392 203266 204424 205188 204851 203294 201163 199550 199261
53729 199261 200188 201478 202355 202602 202366 201891 201596 201982 203141 204609 205953 207265 208793 210336 211332 211468
53713 211468 210959 210392 210381 211224 212625 213985 215101 216415 218360 220823 223501 226389 229470 232297 234511
53698 234511 236595 239430 243103 246743 249653 252119 254905 258391 262324 266050 268803 270139 270312 270034 269792
53683 269792 269671 269721 269951 269881 268700 266240 263385 261164 259794 258878 258148 257539 256838 255839 254815 254379 254847
53666 254847 255917 256935 257276 256648 255335 254097 253565 253776 254430 255378 256519 257431 257628 257242 257075 257758 259080
53649 259080 260216 260450 259613 258105 256578 255494 254903 254714 255119 256459 258692 261260 263615 265645 267468
53634 267468 269075 270414 271693 273248 275054 276587 277304 277228 277001 277385 278745 280888 283281 285359 286787
53619 286787 287580 288108 288922 290481 292967 296312 300347 304922 309884 314953 319701 323815 327473 331270 335504
53604 335504 339690 343084 345692 348389 351920 356130 360353 364208 367734 371022 374097 376972 379367 380514
53590 380514 379683 377020 373504 370057 366990 364328 362229 360821 359907 359102 358138 356860 355061 352596 349702
53575 349702 347067 345469 345226 345892 346550 346515 345780 344794 343979 343598 343790 344329 344530 343949 343215 343614 345573 348002
53557 348002 349456 349611 349259 349226 349781 350895 352465 354225 355888 357512 359441 361786 364223 366383 368229
53542 368229 369940 371632 373370 375298 377621 380532 384211 388798 394199 399976 405532 410530 415164 419955
53528 419955 425228 430873 436760 443288 451155 460525 470738 481117 491700 502930 514871 527165 539586
53515 539586 552195 565085 578433 592714 608327 625018 642216 660009 679159 699956 721623
53504 721623 743177 764354 785297 805867 825853 845490 865102 884432 902920 920512 937614
53493 937614 954350 970463 985997 1001398 1016841 1032049 1047005 1062246 1078114 1094264 1110355
53482 1110355 1126728 1143764 1160947 1177360 1193030 1208982 1225661 1241962 1256255 1267968 1277644
53471 1277644 1285651 1291502 1294568 1294960 1293347 1290124 1285149 1278306 1270038 1261108 1251892 1242064 1231119 1219179
53457 1219179 1207131 1195779 1184903 1173376 1160326 1145955 1131033 1115834 1099926 1082979 1065373
53446 1065373 1047898 1031118 1015167 999965 985422 971554 958547 946699 936321 927775 921484 917545
53434 917545 915336 913902 912829 912391 912760 913583 914617 916227 918756 921852 925069 928828 934078 941134 949485
53419 949485 958684 968695 979408 990633 1002809 1016920 1033320 1051262 1070039 1089909 1111337 1133883
53407 1133883 1156703 1179886 1204473 1231136 1259473 1288791 1319032 1350650 1383925 1418764 1455087
53396 1455087 1493157 1533461 1576263 1621256 1667647 1714572 1761414 1807863 1853963 1900106 1946613
53385 1946613 1993149 2038843 2083211 2126560 2169143 2210206 2248424 2283149 2314751 2343757 2370131
53374 2370131 2393426 2413181 2429046 2440898 2448997 2453602 2454244 2449738 2439291 2423370 2403116 2379043
53362 2379043 2350684 2317580 2280347 2240628 2200098 2159570 2118927 2077793 2036247 1994980 1954854
53351 1954854 1916374 1879534 1844032 1809574 1776024 1743384 1711637 1680571 1649788 1618958 1588160
53340 1588160 1557904 1528695 1500603 1473411 1447264 1422886 1400906 1381134 1362876 1345968 1331034
53329 1331034 1318569 1308107 1298550 1288979 1278780 1267305 1254049 1239284 1224041 1209199 1194750 1180185
53317 1180185 1165417 1151070 1137887 1126038 1115116 1104725 1094906 1086058 1078612 1072884 1068987 1066595
53305 1066595 1064953 1063514 1062606 1063103 1065388 1069077 1073847 1080024 1088020 1097701 1108812 1121707 1137055 1154950
53291 1154950 1174802 1195954 1217902 1240006 1261694 1283014 1304429 1325817 1346167 1364534 1380927
53280 1380927 1395971 1409950 1422523 1433147 1441514 1447605 1451499 1453112 1452135 1448333 1441918 1433403 1423081
53267 1423081 1410902 1396879 1381312 1364463 1346263 1326599 1305708 1284105 1262233 1240313 1218469
53256 1218469 1196840 1175526 1154381 1132900 1110554 1087493 1064795 1043623 1024130 1005519 987122
53245 987122 968902 950848 932512 913568 894376 875476 856765 837723 818386 799586 782182
53234 782182 766481 752520 740446 730216 721203 712638 704523 697660 692387 687569 681370 673004 663205
53221 663205 652843 641710 629119 615172 600679 586038 570971 555385 539776 524629 510025
53210 510025 496090 483235 471656 461088 451371 442750 435239 428147 420670 412637 404315 395944 387912
53197 387912 380851 374828 368697 361069 351948 342760 334680 327541 320548 313503 306943 301414 296972 293262
53183 293262 289847 286521 283468 281100 279629 278825 278155 277114 275460 273305 271020 269023 267559 266610 265905
53168 265905 265003 263559 261572 259335 257142 255202 253843 253462 254071 255057 255593 255257 254197 252889 251779 250946
53152 250946 249983 248437 246474 244831 243953 243529 243025 242337 241598 240756 239766 238947 238673 238926 239515 240506 241955
53135 241955 243452 244525 245343 246410 247565 247934 247078 245641 244620 244370 244561 244801 244991 245244 245671 246237 246824
53118 246824 247515 248674 250435 252250 253330 253575 253635 253978 254285 254002 253128 252176 251458 250661 249117 246476 243208
53101 243208 240360 238678 238001 237696 237481 237458 237449 236876 235511 233962 233094 233164 233672 233869 233284 231959 230414 229336
53083 229336 229151 229786 230727 231240 230769 229422 228009 227341 227535 228240 229297 230752 232328 233471 234030 234393 234863
53066 234863 235348 235732 236045 236069 235342 233832 232177 230903 229803 228470 227080 226221 226142 226600 227299 228177 229305
53049 229305 230674 232005 232754 232603 232027 231948 232666 233521 233865 233865 234025 234402 234764 235072 235227 234702 233115 230979
53031 230979 229246 228243 227673 227524 228192 229600 230933 231533 231554 231489 231566 231869 232589 233701 234712 235163 235279 235771
53013 235771 237039 238799 240479 241749 242684 243574 244642 245910 247246 248537 249719 250691 251268 251319 250964 250589
52997 250589 250578 250914 251146 250918 250488 250434 250812 250970 250398 249391 248632 248477 249007 250381 252546 254792 256320 257269
52979 257269 258638 261034 263987 266663 268783 270639 272645 275136 278158 281117 282953 283071 281987 280798
52965 280798 280158 279987 279962 280006 280360 281329 282820 284016 283800 281816 278992 276723 275651 275375 275121 274333 272775
52948 272775 270526 268003 265723 263957 262660 261612 260434 258700 256428 254499 254094 255521 257742 259209
52934 259209 259071 257644 256023 255308 255901 257263 258448 258984 259103 259113 258857 258039 256887 256069 255972 256327 256634 256716
52916 256716 256724 256741 256597 256103 255374 254837 254883 255505 256316 256945 257363 257711 257859 257354 255974 254237 253093 252994 253403
52897 253403 253410 252740 251933 251566 251612 251751 251930 252235 252373 251869 250868 250288 250816 252093 253235 253889 254320 254588 254273
52878 254273 253146 251649 250410 249604 249159 249381 250879 253756 257154 259809 261090 261488 262137 263786 266146
52863 266146 268214 269270 269499 269598 269933 270240 270133 269660 269226 269091 269060 268708 267801 266377 264475 261967 258834
52846 258834 255460 252409 249874 247528 244986 242193 239302 236418 233675 231356 229669 228483 227506 226652 226002
52831 226002 225540 225164 224939 225074 225630 226437 227316 228147 228739 228877 228547 227905 227043 226031 225206 225065 225732 226828
52813 226828 228005 229354 231030 232767 234056 234723 234965 234908 234489 233889 233736 234528 235856 236490 235456 232989
52797 232989 230276 228296 227104 226258 225541 224972 224370 223389 221996 220546 219349 218452 217902 217827 218192 218807 219723
52780 219723 221267 223493 225910 227960 229452 230369 230636 230413 230244 230553 231226 231961 232683 233174 232760 231025 228676
52763 228676 226990 226400 226251 225899 225407 225027 224723 224541 224778 225385 225690 225257 224610 224558 225042 225281 224897 224311 224042
52744 224042 224201 224776 225905 227604 229579 231578 233646 235820 237871 239641 241416 243532 245744 247446 248562
52729 248562 249771 251643 253822 255359 255684 254976 253767 252543 251718 251609 252177 252958 253440 253478 253267 252981 252597
52712 252597 252057 251491 251084 250664 249522 246960 243184 239490 237300 237046 238111 239665 241210 242471 243365 244209
52696 244209 245488 247118 248361 248745 248727 249059 249849 250692 251443 252225 252825 252732 251898 250945 250459 250468 250762 251263 251822
52677 251822 252025 251597 250788 250101 249786 249820 250139 250553 250571 249694 247934 245838 244004 242784 242399 243017 244490 246222
52659 246222 247538 248276 248920 250098 252001 254232 256158 257379 257942 258286 258956 260237 261909 263448 264542
52644 264542 265331 266057 266597 266557 265763 264435 262893 261301 259816 258738 258312 258417 258640 258696 258654 258732 258951 259122
52626 259122 259205 259499 260301 261391 262120 262077 261433 260486 259156 257322 255499 254653 255175 256344 257074 257012 256729 256976
52608 256976 257990 259445 260828 261769 262153 262107 261916 261879 262090 262322 262209 261652 260974 260620 260757 261283 262091 263135
52590 263135 264258 265186 265721 265820 265461 264629 263539 262745 262876 264194 266307 268369 269685 270250 270609 271117 271599
52573 271599 271855 272117 272605 272874 272206 270634 269002 267936 267304 266880 266855 267267 267456 266747 265413 264380 264038
52556 264038 263942 263633 263203 262832 262264 261084 259295 257316 255506 253878 252282 250707 249411 248759 248958 249870
52540 249870 251091 252132 252521 251887 250252 248279 246995 246983 247821 248499 248488 248306 248949 250829 253383 255684 257256
52523 257256 258283 259253 260574 262307 264031 265056 265092 264737 264990 266297 268350 270851 273987 277875 281912
52508 281912 285186 287437 289141 290681 291824 292189 291805 290917 289427 286958 283506 279699 276183 272940 269509
52493 269509 265865 262767 261024 260644 260912 261151 261113 260788 260286 259969 260304 261334 262637 263907 265248 266656
52477 266656 267652 267942 268178 269384 271595 273635 274481 274393 274398 275014 275978 277042 278485 280612 283160 285542 287596
52460 287596 289721 292178 294481 295701 295292 293453 290673 287204 283138 278800 274795 271534 268838 266182
52446 266182 263350 260762 259034 258219 257659 256715 255489 254600 254332 254300 254033 253524 252995 252380 251468 250496 250193 251001
52428 251001 252440 253484 253540 252866 252117 251694 251705 252283 253609 255577 257682 259404 260532 261062 261074 260907 261216
52411 261216 262500 264728 267692 271571 276659 282618 288573 294122 299830 306437 313947 321714 329034 335239
52397 335239 339527 341234 340310 337255 332589 326634 319763 312575 305779 300053 295897 293360 291912 290869
52383 290869 290044 289803 290419 291570 292590 293174 293712 294922 297200 300321 303765 307282 311078 315462 320353
52368 320353 325221 329486 333012 336164 339255 341947 343407 343260 342126 340934 339938 338788 337452 336458 336202
52353 336202 336547 337307 338568 340335 342332 344466 346931 349503 351227 351447 350820 350769 352113 354747 358380 362912
52337 362912 368101 373459 378628 383607 388653 394310 401366 410284 420702 431867 443525 456002 469510
52324 469510 483874 498931 514751 531381 548741 566718 585041 603171 620803 638418 656786
52313 656786 675965 695400 714980 735289 756633 778543 800566 822854 845564 868211 890185
52302 890185 911536 932681 953587 973698 992482 1009659 1025018 1038363 1049564 1058449 1064793 1068599
52290 1068599 1070150 1069553 1066523 1060919 1053274 1044493 1035221 1025795 1016562 1007873 999922 992860 986868 981809
52276 981809 977115 972471 968454 965989 965339 966108 968228 972249 978543 986719 996116 1006469 1017841 1030265
52262 1030265 1043733 1058288 1073766 1089612 1105296 1120891 1136928 1153703 1171004 1188530 1206197
52251 1206197 1223825 1240748 1256037 1269068 1279647 1287609 1292664 1294722 1294077 1291061 1285767 1278312 1269191
52238 1269191 1259002 1247922 1235785 1222621 1208744 1194328 1179250 1163469 1147271 1131056 1115156
52227 1115156 1099946 1085786 1072708 1060389 1048611 1037432 1026848 1016628 1006725 997548 989593 983028
52215 983028 977837 974058 971553 969849 968567 967883 968268 969976 973038 977448 982885 988411 992989 996353 999034
52200 999034 1001614 1004310 1007286 1010884 1015425 1021030 1027682 1035096 1042493 1048928 1054081 1058426 1062484 1066219
52186 1066219 1069367 1071965 1074047 1075004 1073852 1070241 1064856 1058549 1051415 1043057 1033564 1023724 1014252 1005267
52172 1005267 996729 988910 982008 975640 969382 963686 959675 957915 957950 959082 960996 963431 965989 968739
52158 968739 972332 976859 981088 983612 984447 984648 984582 983618 981641 979877 979640 980898 982659 984341 986199 988561
52142 988561 991275 993946 996378 998644 1000948 1003461 1006172 1008823 1011090 1012927 1014817 1017660 1022325 1029202
52128 1029202 1038231 1049390 1063022 1079514 1098766 1120160 1143078 1167274 1192819 1219830 1248226
52117 1248226 1277576 1307199 1336556 1365487 1393909 1421416 1447383 1471405 1493460 1513739 1532537
52106 1532537 1550203 1566926 1582584 1597004 1610225 1622298 1633086 1642624 1651407 1659752 1667036 1672164
52094 1672164 1674681 1674700 1671757 1664673 1652948 1637526 1619631 1599517 1577055 1553024 1528937 1505735
52082 1505735 1483419 1461997 1442098 1424435 1409143 1395938 1384681 1375574 1368937 1364935 1363466 1364259
52070 1364259 1367127 1372045 1379046 1388129 1399313 1412471 1427017 1442111 1457445 1473538 1490937 1509365
52058 1509365 1528030 1546485 1564672 1582269 1598670 1613710 1627800 1641022 1652465 1660834 1665592 1667187
52046 1667187 1666269 1662894 1656587 1647039 1634639 1620212 1604284 1586810 1567616 1546839 1524736 1501431
52034 1501431 1477269 1453228 1430445 1409314 1389473 1370640 1352927 1336190 1319636 1302481 1284675
52023 1284675 1266717 1249019 1231738 1214949 1198665 1182823 1167595 1153477 1140780 1129172 1118042
52012 1118042 1107182 1096793 1086913 1077262 1067562 1057575 1046802 1034595 1020796 1005936 990559 974559
52000 974559 957457 939199 920419 901939 884208 867312 851402 836903 824166 812928 802321
51989 802321 791529 780321 768787 756752 743829 729973 715600 701096 686581 672273 658627
51978 658627 645748 633007 619660 605725 591929 578985 567311 557290 549322 543602 540205 539315
51966 539315 540822 543747 546769 549626 553467 559359 566878 574536 581120 586039 588834 589231 587632 584798
51952 584798 580929 575704 569353 562957 557409 552723 548829 546380 546115 547870 551021 555670 562561 571840
51938 571840 582687 594338 606680 619515 631903 642797 651868 659134 664110 666018 664699 660689 654389
51925 654389 645783 635088 623074 610362 596859 582330 567292 552902 540079 529133 520176 513446
51913 513446 509052 506765 506312 507770 511499 517757 526536 537757 551441 567555 585630 604469 622196
51900 622196 636636 645866 648773 645405 636865 624627 609708 592458 573122 552463 531732 512040
51888 512040 493883 477179 461747 447891 436592 428917 425012 423825 424104 425490 428340 432659 437779
51875 437779 443209 449273 456522 464820 473278 480942 487233 491896 494871 496266 496242 494893 492248 488392 483608
51860 483608 478554 474285 471688 470704 470367 469908 469621 470288 471995 473942 475344 476042 476159 475575 473993 471207
51844 471207 467099 461509 454460 446527 438719 431780 425602 419514 413302 407757 403951 402016 401036 400233 399906
51829 399906 400941 403713 407684 411763 414789 416003 415560 414407 413257 411838 409503 406253 402679 399160
51815 399160 395870 393389 392417 392773 393451 393997 395041 397074 399389 400873 401374 401592 401889 401854 401024 399552 398103
51798 398103 397364 397602 398458 399197 399373 399134 398751 398105 396905 395232 393490 391874 390173 388118 385740 383403
51782 383403 381528 380249 379255 378179 377117 376518 376521 376847 377472 378918 381548 385083 389278 394649 401826 410439
51766 410439 419309 427703 435770 443759 451449 458462 464562 469320 471912 471601 468356 462926 456401 449631
51752 449631 442775 435488 427813 420642 414847 410125 405400 400403 396109 393397 391990 391128 390684 391008 392112
51737 392112 393675 395666 398383 402020 406657 412532 419664 427128 433347 437449 440018 442218 444399 445931
51723 445931 446290 445930 445867 446536 447292 447083 445426 442599 439013 434797 430112 425550 421896 419536 418286 417653
51707 417653 417043 415845 413808 411515 410153 410473 412057 413857 415385 417077 419402 421919 423521 423527 422235
51692 422235 420380 418362 416226 414128 412419 411183 409963 408123 405440 402203 398748 394961 390380 384931
51678 384931 379590 376032 375330 376989 379463 381529 382930 383810 384153 384018 384006 384955 387250 390702 395075 400433
51662 400433 406892 414218 421773 428709 434161 437470 438411 437254 434560 430929 426965 423414 421191 421149 423649
51647 423649 428280 434003 439632 444233 447171 448041 446740 443488 438569 432083 424237 415890 408358 402324
51633 402324 397170 391825 386200 381300 377831 375248 372560 369747 367824 367595 368813 370639 372497 374334
51619 374334 376287 378279 379803 380106 378869 376719 374735 373419 372491 371736 371471 371880 372474 372719 372832 373329
51603 373329 374092 374592 374915 375825 377681 379973 382194 384579 387662 391600 396378 402349 409995 419156 428789
51588 428789 437402 443602 446445 445737 442108 436653 430402 424063 418126 413055 409431 407946 409139 413082
51574 413082 419430 427878 438425 451106 465613 481292 497464 513717 530193 547642 566857 587723
51562 587723 608965 629260 648683 668842 691475 717015 744524 772728 800776 827892 852607
51551 852607 872760 886407 892518 890694 880675 862652 837908 808526 776308 742380 707818 673966
51539 673966 641767 611333 582736 556815 534608 516200 500737 487493 476279 466867 458693 451379
51527 451379 444981 439406 434003 428159 421995 416100 410827 406244 402567 400037 398347 396738 394858 393153
51513 393153 392153 391751 391592 391831 392921 394772 396771 398750 401249 404451 407425 409022 409140 408498 407384
51498 407384 405470 402842 400336 398522 396956 394855 392126 389353 387131 385788 385421 385720 385942 385440 384167
51483 384167 382436 380391 378007 375424 372890 370466 368013 365402 362550 359490 356584 354353 352747 350903
51469 350903 348081 344627 341555 339349 337655 335936 333871 331259 328217 325490 323926 323500 323450 323493 324240 326126
51453 326126 328575 330718 332482 334499 337235 340669 344615 348936 353593 358871 365385 373513 382931 393093
51439 393093 403991 415891 428297 439685 448522 454301 457394 458268 457212 454649 451189 447181 442415
51426 442415 436382 428744 419531 409162 398547 388959 381366 375806 371671 368582 366592 365489 364500 363082
51412 363082 361640 361001 361496 362986 365491 369072 373188 376935 380030 383014 386346 389902 393532 397417 401501
51397 401501 405144 407881 410136 412673 415672 418898 422500 426981 432466 438588 445286 453302 463677 477002
51383 477002 493237 512161 533918 559242 589018 623398 661397 701591 743142 785910 829541
51372 829541 872746 913414 949110 977352 995819 1002860 998071 982388 957537 925296 887180 844644
51360 844644 799367 753117 707390 663331 621976 584308 550944 521919 496896 475424 456994
51349 456994 441107 427474 416029 406638 398974 392722 387615 383210 378974 374810 371137 368248 365908
51336 365908 363803 361953 360330 358561 356515 354743 353647 352580 350562 347702 345043 343058 341198 339061
51322 339061 337021 335396 333899 332424 331630 332060 333238 334322 335224 336398 337879 339276 340542 342033 343823
51307 343823 345606 347262 348933 350466 351386 351619 351808 352636 354101 355608 356565 356810 356637 356462 356288 355545 353693
51290 353693 350869 347640 344262 340671 337168 334550 333361 333407 334193 335417 336875 338391 340188 342921 346884
51275 346884 351431 355528 358655 360846 362192 362761 362858 362806 362595 362152 361942 362785 364997 368082 371278 374048
51259 374048 376023 376970 377032 376702 376322 375816 374974 373740 372084 369906 367212 364171 360953 357750 355041 353308
51243 353308 352331 351181 349349 347525 346808 347357 348279 348716 348609 348396 348430 348791 349336 349743 349658 348916 347587 345881
51225 345881 344153 342876 342351 342465 342860 343234 343370 343124 342663 342462 342755 343221 343632 344515 346531 349313 351633
51208 351633 352821 353365 353979 354880 356296 358910 363134 368421 373860 379098 384133 388598 391975 394317 396039
51193 396039 397038 396663 394632 391391 387490 383113 378422 373898 370144 367572 366315 366026 365707 364268 361549
51178 361549 358504 356202 354942 354459 354485 354753 354917 355002 355687 357593 360310 362576 363572 363763 364384 366283 369300
51161 369300 372573 375368 377645 379830 382061 383896 384919 385417 386100 387228 388278 388537 387753 386239 384566
51146 384566 383240 382412 381822 381208 380727 380745 381193 381510 381314 380732 379914 378657 376890 375138 373969 373183 372069
51129 372069 370388 368529 366768 365039 363628 363411 364930 367647 370544 373183 375776 378488 381207 383882
51115 383882 386582 389204 391513 393499 395397 397392 399598 402229 405355 408522 411052 412823 414388 416318
51101 416318 418791 421819 425301 428675 431101 432322 432966 433689 434385 434576 434135 433235 431912 430181 428306 426540
51085 426540 424808 423049 421598 420764 420289 419802 419567 420114 421268 422220 422558 422621 422742 422888 423168 424030 425623
51068 425623 427525 429430 431613 434372 437505 440772 444544 449526 456080 464138 473570 484256 496008 508587
51054 508587 521493 533525 543157 549992 555554 562056 570535 580674 592046 604566 617665 630005
51042 630005 640445 648719 654745 657878 657442 653691 647583 639799 630605 620645 611137 602891 595461 587582
51028 587582 578205 566948 553983 540092 526791 515740 507687 502234 498778 497314 498033 500468 503606
51015 503606 506844 510406 514823 520360 527041 534798 543385 552404 561538 570559 579049 586554 593267 600196
51001 600196 608342 617858 628221 638885 649453 659501 668762 677400 685779 694068 702430 711358 721293
50988 721293 731857 741933 750596 757678 763523 768710 774063 780418 788134 797249 808271 822309 840027
50975 840027 860807 883307 906580 930328 954548 979673 1007058 1038606 1075561 1117887 1165006
50964 1165006 1216875 1274112 1337240 1406052 1479629 1556692 1635890 1715941 1795671 1873948 1949561
50953 1949561 2021159 2087310 2146673 2198133 2240884 2274503 2298994 2314733 2322333 2322566 2316428 2305148
50941 2305148 2290107 2272728 2254420 2236300 2218713 2201106 2182590 2162630 2141073 2117681 2092075
50930 2092075 2064249 2034744 2004080 1972134 1938173 1901351 1861055 1817067 1769591 1718996 1665429
50919 1665429 1608975 1550395 1491362 1433540 1377606 1323555 1271741 1223059 1178122 1136913 1099386
50908 1099386 1065829 1036265 1009965 986055 964333 945022 927974 912645 898837 886772 876310
50897 876310 866645 857131 848087 840356 834236 829272 825087 821961 820334 819964 819895 819372 818690 818984 821072 824579
50881 824579 828326 831603 834892 839203 844865 851269 857777 864605 872658 882661 894657 908281 923253
50868 923253 939506 956994 975591 995329 1016632 1040157 1066371 1095406 1127461 1163182 1203426
50857 1203426 1248705 1299142 1355056 1417355 1487221 1565574 1652995 1749972 1856951 1974235 2101990
50846 2101990 2240279 2388888 2547175 2714180 2888662 3068719 3251578 3434142 3613711
50837 3613711 3787653 3952298 4102752 4234228 4343366 4428174 4487310 4520177 4527616 4511904
50827 4511904 4475949 4422863 4356353 4280923 4201256 4121494 4045216 3975706 3915578 3865961 3826107
50816 3826107 3793800 3766024 3739428 3710545 3675982 3632651 3578050 3510556 3429527 3335110 3227936
50805 3227936 3109078 2980226 2843821 2702903 2560699 2420202 2283950 2154080 2032416
50796 2032416 1920350 1818649 1727522 1646940 1576680 1516021 1463712 1418672 1380668 1349989 1326369
50785 1326369 1308502 1294621 1283306 1273660 1265163 1257720 1251675 1247311 1244211 1241220 1237114 1231290 1224000
50772 1224000 1216053 1208176 1200320 1191591 1181082 1168772 1155471 1141866 1127927 1113275 1097858 1082072
50760 1082072 1066414 1051286 1037082 1024258 1013198 1004008 996451 990235 985548 983291 984510 989431 997229
50747 997229 1006839 1017884 1030812 1046500 1065926 1089898 1118656 1151824 1189130 1231093 1278680 1332330
50735 1332330 1391802 1456986 1528260 1605733 1688603 1775796 1866948 1962080 2060333 2159646 2257945
50724 2257945 2354226 2448195 2539200 2625895 2706694 2779972 2843908 2896574 2936318 2961662 2970797
50713 2970797 2961867 2934445 2890713 2834879 2771416 2704051 2636003 2570328 2509599 2455549 2409327
50702 2409327 2371814 2343291 2322885 2308727 2298735 2291060 2283751 2274244 2259402 2236157 2202252 2156713
50690 2156713 2099973 2033702 1960357 1882570 1802668 1722630 1644356 1569739 1500322 1437052 1380571
50679 1380571 1331636 1290903 1258278 1232748 1213100 1198738 1189830 1186837 1189895 1198345 1210768 1225653
50667 1225653 1242149 1259999 1278776 1297618 1315785 1333019 1349107 1363549 1376149 1387576 1398812
50656 1398812 1410177 1421316 1432013 1442499 1453047 1463747 1474766 1486426 1499001 1512821 1528535
50645 1528535 1546889 1568073 1591689 1617433 1645557 1676653 1711258 1749606 1791310 1835311 1880571
50634 1880571 1926782 1973836 2020677 2065498 2107439 2147399 2186726 2225673 2263640 2300360 2335936
50623 2335936 2369714 2399566 2422195 2434020 2432471 2417467 2391840 2359935 2325731 2292386 2262806
50612 2262806 2239426 2223143 2213128 2207906 2206075 2205891 2205041 2201587 2194765 2184246 2168818 2146383 2115306
50599 2115306 2075353 2027305 1972180 1911081 1845504 1777344 1708555 1640881 1575838 1514643 1457966
50588 1457966 1405833 1357953 1314157 1274492 1239002 1207594 1180064 1156010 1134733 1115488 1097979
50577 1097979 1082371 1068713 1056624 1045792 1036570 1029752 1025858 1024899 1026658 1030808 1036731 1043685 1051391
50564 1051391 1060340 1071364 1084886 1100618 1117911 1136407 1156395 1178405 1202439 1227815 1253921
50553 1253921 1280840 1308854 1337505 1365602 1392107 1416557 1438685 1458247 1475529 1491515 1507117
50542 1507117 1522529 1537772 1553680 1571853 1593673 1619775 1650521 1686492 1728168 1775414 1827683
50531 1827683 1884730 1946803 2014077 2086278 2163109 2244785 2331718 2423738 2520022 2619763 2722337
50520 2722337 2826515 2929963 3029966 3124415 3211707 3289977 3357060 3411113 3450781 3474790 3481980
50509 3481980 3471903 3445054 3402513 3345890 3277683 3201014 3118687 3032957 2946495 2863002 2786350
50498 2786350 2719408 2664030 2621693 2593470 2579521 2579137 2591166 2613893 2644602 2679776 2715768 2748932
50486 2748932 2775287 2790729 2791770 2775846 2741223 2687460 2616249 2531034 2435316 2331658 2222523
50475 2222523 2111300 2001627 1895959 1795521 1701498 1615367 1537903 1468646 1406851 1352429
50465 1352429 1305434 1265103 1230161 1199954 1174558 1153732 1136529 1122272 1111291 1104147 1100588 1099958
50453 1099958 1102384 1108740 1119233 1132703 1147648 1163434 1180032 1197013 1213494 1229062 1244256 1259971
50441 1259971 1276742 1294663 1313561 1332800 1351090 1366886 1379196 1387883 1393221 1395448 1394985 1392869
50429 1392869 1390495 1388773 1387745 1387242 1387645 1389726 1393857 1399755 1406963 1415295 1424841 1435874 1448914 1464603
50415 1464603 1483347 1505270 1530601 1559839 1593356 1630974 1671950 1715198 1759549 1804167 1848833
50404 1848833 1893491 1937387 1979092 2017578 2052764 2084631 2112247 2134243 2149899 2159068 2161165 2154905
50392 2154905 2139084 2113101 2076807 2030669 1976367 1916674 1854332 1791297 1729206 1669990 1615582
50381 1615582 1567354 1526259 1493284 1469321 1454631 1448728 1450637 1458952 1471798 1487221 1503707 1520040
50369 1520040 1534536 1544754 1548199 1543308 1529706 1507720 1477929 1441237 1399179 1353829 1307258 1261040
50357 1261040 1216175 1173223 1132316 1093242 1055848 1020450 987625 957602 930092 904786 881779
50346 881779 861388 843810 829159 817636 809363 804127 801579 801702 804855 811235 820426 831624 844325
50333 844325 858731 875419 894575 915539 937025 957641 976126 991307 1002228 1008475 1010323 1008594
50321 1008594 1004509 999593 995302 992473 991206 991284 992483 994318 995878 996293 995376 993596 991450 989083 986501
50306 986501 983949 981945 980996 981283 982572 984455 986692 989283 992283 995750 999883 1004989 1011149 1018182 1026107
50291 1026107 1035434 1046640 1059485 1073244 1087735 1103844 1122799 1144817 1168305 1190150 1206760
50280 1206760 1215134 1213440 1201249 1179813 1152227 1122719 1095062 1071412 1052538 1038713 1029891 1025218
50268 1025218 1023105 1022121 1021574 1021135 1020354 1018840 1016659 1014220 1011799 1009403 1006959 1004371 1001442 997991 994148
50253 994148 990405 987268 984869 982976 981376 980348 980672 983076 987595 993627 1000657 1008885 1019066 1031851
50239 1031851 1047370 1065276 1084961 1105689 1126675 1147229 1166943 1185759 1203793 1220985 1236938
50228 1236938 1251192 1263598 1274193 1282628 1287871 1288631 1284061 1274016 1258797 1238849 1214741 1187324
50216 1187324 1157831 1127747 1098534 1071467 1047680 1028120 1013092 1001851 992916 984941 977072 968365
50204 968365 957348 942697 924355 903614 882021 860478 839431 819531 801732 786731 774481
50193 774481 764287 755325 747123 739583 732611 725816 718703 711150 703531 696297 689527 682951 676372 669961
50179 669961 664155 659278 655220 651394 647123 642128 636750 631669 627418 624116 621578 619590 618035 616780
50165 616780 615555 614121 612606 611543 611432 612306 613846 615805 618139 620788 623682 627105 631774 638282 646454
50150 646454 655434 664327 672683 680433 687586 694029 699483 703619 706293 707681 708078 707649 706546 705257 704607
50135 704607 705348 707888 712522 719617 729315 741183 754538 769225 785891 805395 828095 853815 882312
50122 882312 913554 947483 983664 1021250 1059406 1097757 1136387 1175270 1213822 1251263 1287475
50111 1287475 1323114 1358559 1392900 1424299 1451213 1472766 1487872 1494649 1491307 1477594 1455000 1425597
50099 1425597 1390965 1352177 1310337 1266749 1222747 1179592 1138510 1100597 1066629 1036948 1011527
50088 1011527 990052 972028 956970 944529 934365 925934 918556 911792 905645 900360 896140 893165 891707
50075 891707 891936 893535 895730 897864 899818 901760 903612 904979 905545 905303 904354 902681 900210 896920 892850
50060 892850 888125 883063 877997 872854 867063 860144 852329 844396 836972 830285 824525 820056 817010 814880
50046 814880 812884 810804 809318 809437 811662 815736 821075 827319 834447 842574 851789 862137 873477 885286
50032 885286 896777 907432 917352 927023 936761 946437 955578 963637 970308 975741 980314 984017 986231 986367
50018 986367 984572 981542 977815 973602 969142 964571 959358 952596 944251 935709 928668 923824 921079 920623
50004 920623 923054 928491 936342 946334 959320 976569 998343 1023424 1050040 1077063 1104202 1131262
49992 1131262 1157475 1181688 1203039 1221176 1235811 1246366 1252056 1251944 1244724 1228959 1204102 1171227
49980 1171227 1132396 1089539 1044347 998926 955595 915707 879243 845890 816033 790273 768449
49969 768449 749765 733686 720098 708640 698489 688995 680120 672053 664747 658151 652634 648729 646483
49956 646483 645460 645475 646949 650264 654999 660262 665741 671992 679543 688079 696801 705207 713008 719516 723764
49941 723764 725483 725485 724862 724052 722841 720933 718136 714173 708646 701182 691548 679794 666463 652538 638952
49926 638952 626210 614557 604267 595522 588210 582135 577347 573983 571879 570702 570473 571587 574117 577278
49912 577278 579854 581204 581854 583071 585798 589997 595060 600747 607448 615535 624832 634930 645636 656767
49898 656767 667819 678379 688742 699478 710254 719632 726259 729969 731452 731183 729011 724641 718195
49885 718195 710183 701068 690929 679671 667578 655440 643842 632498 620774 608912 598204 589686
49873 589686 583093 577466 572417 568283 565251 563009 561347 560560 560937 562149 563515 564819 566623 569764 574609
49858 574609 580852 587953 595701 604373 614355 625720 638117 650960 663588 675352 685734 694501 701702
49845 701702 707385 711337 713158 712701 710363 706797 702230 696239 688385 678917 668605 657989 647183 636548
49831 636548 627036 619502 613872 609402 605667 602895 601347 600844 601148 602488 605313 609597 614750 620383 626907
49816 626907 635101 645095 656025 666701 676391 684857 691963 697721 702598 707271 711841 715642 718001 718914
49802 718914 718733 717481 714880 710874 705731 699661 692652 684653 675698 665968 655980 646574 638261 630644
49788 630644 622949 615121 607862 601564 595842 590408 585776 582574 580634 579367 578710 578972 579899 580669 580956
49773 580956 581404 582818 585356 588761 592937 597961 603853 610653 618385 626621 634363 640814 646059 650583
49759 650583 654399 657210 659317 661643 664565 667262 668481 667528 664142 657951 648816 637698 626477 616587
49745 616587 608107 600409 593354 587511 583335 580624 578906 578054 578206 579180 580247 580648 580243 579571 579368 580155
49729 580155 582156 585351 589497 594202 599066 603782 608265 612926 618817 627044 637783 650037 662619
49716 662619 675205 688140 701407 714225 725599 734739 740821 742904 740646 734939 727398 719119 710178
49703 710178 700357 690076 680457 672636 667152 663885 662337 661820 661497 660457 657997 653916 648599 642851
49689 642851 637621 633669 631322 630505 631102 633222 637050 642560 649628 658360 668964 681220 694430 708167
49675 708167 722927 739818 759630 782136 805856 828169 846006 857152 861219 859359 853202 844369
49663 844369 834763 826590 821544 820082 821664 825468 830646 836095 840294 841434 837652 827485 810650 788626
49649 788626 764225 740297 718638 699878 684055 671066 660726 652707 646635 642281 639569 638334
49637 638334 638126 638407 638952 639931 641424 642975 643752 643077 640658 636435 630568 623651 616589 610026 603977 598152
49621 598152 592471 587104 582235 578056 574838 572646 571054 569445 567708 566355 565920 566491 567896 570028 572804
49606 572804 576015 579354 582467 584950 586598 587798 589293 591286 593050 593748 593417 592759 592236 591837 591653 592111
49590 592111 593524 595727 598263 600635 602437 603629 604797 606748 609695 613135 616585 620007 623350 626194
49576 626194 628328 630351 633188 637101 641586 646220 651185 656891 663433 670675 678623 687432 697013 706857
49562 706857 716322 724990 732593 738723 742882 744894 744962 743187 739355 733512 726461 719277 712530 706446 701633
49547 701633 698882 698193 698658 699559 700984 703091 705423 707376 708904 710302 711732 713414 715813 719071 722665
49532 722665 726288 730750 737304 746366 757564 770794 786318 803877 822608 842084 862577 883953
49520 883953 904953 923976 940029 952627 961392 966403 968570 969101 968781 968168 968222 970059 974007 979335
49506 979335 984977 990176 994213 995754 992897 984161 969574 950727 929699 907928 886115 864861 844957
49493 844957 827010 811206 797557 786114 776748 768961 762217 756357 751561 747972 745453 743656 742258
49480 742258 741244 740986 741911 744024 746797 749499 751562 752769 753349 753887 754847 756103 757144 757787 758514 760087
49464 760087 762961 766953 771234 774755 777070 778752 780660 782853 784615 785500 785752 785510 784234 781315 776928
49449 776928 771916 767053 762571 758128 753043 746923 740325 734471 730122 727074 724849 723358 722594 722349 722770
49434 722770 724724 728936 735057 742183 750062 759229 770189 783105 798095 815166 833959 854154 876101
49421 876101 900413 926987 955009 983719 1012154 1037941 1057388 1067599 1068261 1061208 1048943 1034173
49409 1034173 1020076 1009735 1004832 1005209 1009840 1017904 1028851 1041838 1055628 1069148 1081977 1094085
49397 1094085 1105272 1115122 1123574 1131118 1138178 1144531 1149656 1153475 1156304 1158128 1158338 1156300 1151880 1145316
49383 1145316 1136859 1126681 1114975 1102087 1088674 1075630 1063595 1052613 1042578 1033900 1027319 1023161
49371 1023161 1021273 1021575 1024037 1028022 1032367 1036427 1040462 1044629 1048255 1050688 1052253 1053551 1054113 1052633
49357 1052633 1048575 1042824 1036573 1030236 1023713 1017215 1011302 1006299 1002073 998419 995463 993588 992995 993412
49343 993412 994356 995627 997296 999089 1000143 999764 998207 996180 993649 989730 983947 977035 970151 963692 957344
49328 957344 951042 945335 940850 937864 936519 936980 939090 942102 945151 947983 951041 954810 959353 964511
49314 964511 970345 977015 984249 991199 997139 1002311 1007869 1014884 1023451 1032835 1042392 1052208 1062859 1074746
49300 1074746 1087688 1101060 1114216 1126916 1139423 1152037 1164285 1174563 1180814 1181782 1177680 1169739
49288 1169739 1159273 1147221 1134276 1121071 1108069 1095404 1082929 1070465 1058025 1045932 1034792
49277 1034792 1025243 1017596 1011662 1007070 1003809 1002316 1002850 1004830 1007050 1008664 1009773 1010949 1012360 1013660
49263 1013660 1014570 1015208 1015751 1016072 1015906 1015212 1014303 1013795 1014545 1017471 1023251 1032128 1043953 1058139 1073540
49248 1073540 1088614 1101960 1112600 1119671 1122121 1119010 1110103 1096097 1078462 1059187 1040353 1023421
49236 1023421 1008773 996053 984946 975590 968459 964079 962736 964147 967458 971769 976661 982079 987889
49223 987889 993848 999948 1006448 1013516 1021071 1028943 1037008 1045228 1053783 1063130 1073600 1084894 1096198
49210 1096198 1106783 1116325 1124843 1132749 1140912 1150185 1160726 1172080 1183989 1196680 1210251 1224218
49198 1224218 1238015 1251670 1265643 1280107 1294583 1308145 1319915 1329628 1337892 1345734 1353667 1361244
49186 1361244 1367610 1372400 1376214 1380444 1386551 1395081 1405354 1416575 1429284 1445097 1464803 1487518
49174 1487518 1512218 1539422 1570532 1605970 1644968 1686998 1732140 1779518 1826156 1868018 1901914
49163 1901914 1926171 1940262 1944836 1942190 1935884 1929241 1924089 1920893 1919724 1920763 1923885 1928189 1932347
49150 1932347 1935590 1938223 1941078 1944553 1948400 1952481 1957484 1964632 1974595 1986824 2000109 2013743 2028012
49137 2028012 2043535 2060412 2078235 2096708 2115861 2135576 2155303 2174455 2192922 2211008 2229033
49126 2229033 2247117 2265249 2283347 2301330 2319225 2337139 2355111 2373208 2391920 2412256 2435232
49115 2435232 2461388 2490966 2524436 2562721 2607059 2658911 2719908 2791698 2875851 2973733 3085649
49104 3085649 3209252 3338776 3466806 3587808 3700452 3806488 3906766 3997312 4068473 4108493
49094 4108493 4109618 4072432 4004940 3917404 3817386 3708431 3591921 3469521 3344447 3221410
49084 3221410 3105547 3000941 2909739 2832478 2768936 2718409 2679346 2649327 2625797 2606838 2591236
49073 2591236 2578026 2566239 2555095 2544240 2533670 2523428 2513449 2503741 2494573 2486261 2478650 2470964
49061 2470964 2462441 2453128 2443853 2435309 2427325 2419179 2410446 2401329 2392304 2383741 2375833 2368542 2361441 2353979
49047 2353979 2346183 2338937 2333231 2329231 2326381 2324353 2323543 2324574 2327649 2332522 2338802 2345984 2353408 2360495
49033 2360495 2367036 2372964 2377852 2380872 2381481 2379988 2377250 2373783 2369396 2363782 2357253 2350637 2344550 2339050
49019 2339050 2333990 2329349 2325107 2321223 2317974 2316034 2315818 2316978 2318852 2321255 2324474 2328662 2333631 2339078
49005 2339078 2344569 2349464 2353427 2356957 2360858 2365191 2369317 2372908 2376156 2378891 2380383 2380423 2379804 2379153 2377953
48990 2377953 2375454 2371948 2368272 2364355 2359283 2352874 2346313 2340939 2336913 2333393 2329681 2325876 2322570 2320123
48976 2320123 2318283 2316488 2314484 2312397 2310171 2307287 2303301 2298354 2292809 2286707 2280091 2273738 2268929 2266330
48962 2266330 2265397 2265031 2264655 2264710 2266335 2270519 2277323 2285831 2294987 2304392 2314263 2324946 2336751 2349958
48948 2349958 2364608 2380407 2397113 2414825 2433542 2452710 2471693 2490525 2509670 2529131 2548370
48937 2548370 2567317 2587057 2609307 2635248 2664806 2696931 2730768 2766680 2805818 2848496 2893503
48926 2893503 2939499 2986580 3035764 3087295 3140252 3193741 3247596 3301866 3356329 3410702 3464800
48915 3464800 3518416 3571466 3624100 3676095 3726342 3773726 3818437 3861530 3903235 3942658 3979250
48904 3979250 4013517 4045984 4076497 4104958 4131819 4157220 4180499 4201197 4219844 4237148 4253115
48893 4253115 4267533 4280619 4292443 4302356 4309754 4314838 4317946 4318671 4316430 4311338 4303666 4293016 4278995
48880 4278995 4262244 4243722 4223292 4200195 4174725 4148190 4121029 4092069 4059957 4024463 3986110
48869 3986110 3945376 3902709 3858675 3813604 3767600 3721167 3675358 3630910 3587630 3544936 3502633
48858 3502633 3460973 3420349 3381263 3344235 3309475 3276827 3246219 3217905 3192192 3169232 3149164
48847 3149164 3132073 3117670 3105502 3095664 3088839 3085291 3084223 3084608 3086353 3090128 3096149 3103746 3112301
48834 3112301 3122195 3134422 3149351 3166246 3184098 3202618 3222053 3242199 3262196 3281457 3300324
48823 3300324 3319448 3338957 3358659 3378641 3399066 3419662 3440116 3460788 3482272 3504276 3525770
48812 3525770 3546395 3566961 3588262 3610158 3632157 3654202 3676334 3698191 3719439 3740367 3761565
48801 3761565 3783289 3805557 3828474 3852042 3875954 3899968 3924089 3947925 3970319 3990213 4007538
48790 4007538 4022681 4035537 4045868 4054290 4061923 4069125 4075306 4079857 4082270 4081353 4075508 4064278 4048797
48777 4048797 4030209 4008431 3982932 3953864 3921655 3886233 3847668 3807167 3766329 3725486 3683692
48766 3683692 3640435 3596481 3552849 3509627 3466234 3422406 3378656 3336038 3295553 3257424 3220910
48755 3220910 3185231 3150764 3118766 3089893 3063615 3039383 3017639 2999052 2983277 2969201 2956232
48744 2956232 2944753 2935350 2928194 2923240 2920548 2920275 2922524 2927207 2933835 2941544 2949609 2957822 2966091 2973853
48730 2973853 2980330 2985333 2989434 2993328 2997414 3002009 3007517 3014155 3021671 3029366 3036230 3041274 3044144 3045406
48716 3045406 3045790 3045237 3043091 3039251 3034519 3029680 3024801 3019640 3014259 3008940 3003926 2999556 2996245 2994019
48702 2994019 2992450 2991360 2991185 2992255 2994119 2996079 2998055 3000431 3003358 3006762 3010775 3015439 3020042 3023401
48688 3023401 3024993 3025372 3025317 3025035 3024402 3023626 3023272 3023752 3025009 3026724 3028648 3030670 3032596 3034021 3034549 3034132
48672 3034132 3033024 3031444 3029533 3027607 3026012 3024537 3022279 3018316 3012181 3003398 2990952 2973758 2951508
48659 2951508 2924683 2893932 2859861 2823250 2784872 2745002 2703594 2661093 2618762 2578092 2540153
48648 2540153 2505538 2474551 2447246 2423420 2402674 2384345 2367440 2350913 2334141 2317035 2299734
48637 2299734 2282444 2265551 2249531 2234517 2220047 2205392 2190074 2174063 2157603 2140929 2124180
48626 2124180 2107475 2091016 2075030 2059625 2044873 2031007 2018342 2006946 1996623 1987353 1979527 1973666
48614 1973666 1970083 1968852 1969802 1972360 1975724 1979375 1983152 1986665 1989087 1989767 1988762 1986541 1983590 1980609
48600 1980609 1978518 1977720 1977760 1978221 1979537 1982276 1985962 1989339 1991515 1992105 1990589 1986513 1980301 1972981 1964964
48585 1964964 1955866 1945630 1934920 1924173 1913082 1901404 1889602 1878237 1867273 1856441 1845911
48574 1845911 1836248 1828081 1822034 1818512 1817224 1817318 1818260 1820258 1823650 1828373 1834228 1841039 1848079 1853842 1856896
48559 1856896 1856635 1852897 1845360 1833999 1819858 1804656 1789608 1774993 1760791 1747207 1734488 1722528
48547 1722528 1710807 1698657 1685706 1672125 1658340 1644403 1629928 1614761 1599431 1584672 1570770
48536 1570770 1557654 1545478 1534779 1526055 1519325 1514023 1509271 1504501 1499999 1496713 1495405 1496160 1498762
48523 1498762 1503174 1509377 1516984 1525293 1533505 1540542 1544709 1543997 1537101 1524367 1507836 1490195 1473448
48510 1473448 1458504 1445997 1436970 1432221 1431219 1432488 1435243 1440005 1447317 1456504 1466265 1475996 1485953
48497 1485953 1496292 1506507 1515719 1522959 1527040 1526545 1520318 1508122 1490904 1470404 1448368 1426050
48485 1426050 1404372 1384198 1366000 1349431 1333793 1319103 1306229 1295812 1287463 1280205 1273372 1266862
48473 1266862 1260901 1255872 1252061 1249313 1247105 1245093 1243416 1242400 1242267 1243088 1244644 1246303 1247558 1248821
48459 1248821 1251252 1255657 1261938 1269531 1277690 1285182 1290495 1292778 1292107 1288727 1282748 1274884 1266567 1258753
48445 1258753 1251232 1243619 1236283 1229595 1222932 1215271 1206317 1196308 1185273 1173356 1161483 1150720 1141104
48432 1141104 1131934 1123103 1115244 1108617 1102677 1096970 1091740 1087438 1084036 1081022 1077846 1074332 1070891 1068160
48418 1068160 1066219 1064352 1061857 1058689 1055000 1050575 1045354 1040092 1035681 1031956 1027891 1022923 1017458 1012115
48404 1012115 1007106 1002402 997902 993339 988551 983905 980043 977122 974658 972110 969187 965568 960799 954664
48390 954664 947461 939813 932326 925331 918799 912577 906773 901734 897639 894429 892113 890641 889372 887358
48376 887358 884452 881527 879233 877209 874912 872486 870230 867929 865454 863344 862018 860990 859637 858152
48362 858152 856897 855500 853617 851963 851445 851687 851608 851184 851417 852713 854418 855885 856948 857376 856928 856099
48346 856099 855968 857197 859795 863712 868883 874897 881442 888943 898050 908783 920908 934663 950225
48333 950225 966903 983869 1001122 1018524 1034450 1046815 1055235 1060918 1064846 1067506 1070122 1074497 1081549
48320 1081549 1091221 1103593 1118692 1135475 1152625 1170310 1189749 1211333 1234720 1260506 1290037
48309 1290037 1323778 1361544 1404106 1452790 1507944 1569901 1641127 1725317 1824785 1941228 2078819
48298 2078819 2244298 2444962 2689959 2993305 3372164 3842429 4419557 5122851 5973592
48289 5973592 6988734 8182203 9572882 11182432 13016339 15040504 17161111 19205111
48281 19205111 20917612 22013356 22283198 21686810 20356541 18518851 16409540 14234742
48273 14234742 12161730 10307318 8726975 7423300 6369312 5526777 4854602 4315293
48265 4315293 3880248 3528442 3241608 3003873 2804638 2637731 2497475 2377931 2275170
48256 2275170 2187216 2111570 2044959 1985372 1932309 1885065 1842496 1804241 1770510 1740769 1714049
48245 1714049 1690196 1669446 1651166 1634432 1619393 1606637 1595615 1585220 1575576 1567753 1561923 1557302
48233 1557302 1553731 1551834 1551613 1552247 1553253 1554398 1554290 1550490 1541440 1527277 1508523 1485160 1457506 1427020
48219 1427020 1395431 1363546 1331411 1299274 1268015 1238746 1212088 1187565 1163699 1139002 1113054
48208 1113054 1086605 1060806 1036401 1013341 990957 968788 947326 927480 909172 891228 873023
48197 873023 855490 839919 826481 814624 804223 795392 787681 780457 773787 768003 762601 756584 749899
48184 749899 743680 738903 735402 732230 728496 723912 719086 715217 713038 712059 711179 709765 707788 705362 702721
48169 702721 700301 698235 696076 693598 691453 690371 690118 689986 689858 689916 689779 688989 688083 688011 688602 688725 687968
48152 687968 686981 686097 684840 683081 681527 680588 679821 679073 679179 680823 683443 686048 688483 691091 693622 695318
48136 695318 695942 696024 696151 696507 697149 698300 700247 703053 706368 709540 712118 714366 717039 720548 724545 728456
48120 728456 732224 736337 741298 747190 753695 760484 767605 775341 783652 792039 800256 808826 818428 829030
48106 829030 840155 851812 864509 878366 892889 907677 922800 938408 954578 971606 989781
48095 989781 1008719 1027594 1046256 1065402 1085335 1105271 1124414 1143030 1161833 1180740 1198919
48084 1198919 1215809 1231479 1246168 1260076 1273507 1286694 1299460 1311438 1322617 1333332 1343721
48073 1343721 1353506 1362323 1370012 1376595 1382225 1387229 1392069 1397222 1403065 1409709 1416803 1423693 1429997 1435862
48059 1435862 1441438 1446284 1449615 1451100 1451114 1450160 1448265 1445042 1440111 1433318 1424654 1414147 1401960 1388497
48045 1388497 1374229 1359330 1343621 1326959 1309526 1291531 1272744 1252681 1231218 1208763 1185879
48034 1185879 1163061 1140850 1119623 1099047 1078158 1056392 1034302 1012878 992346 972002 951218
48023 951218 930206 909683 890029 871019 852390 834496 818211 804079 791718 780268 769325
48012 769325 759120 749831 741181 732943 725479 719383 714732 710999 707657 704601 702011 700075 698865 698304
47998 698304 698120 697979 697740 697568 697773 698575 699966 701713 703497 705174 706983 709381 712525 715868 718441 719666
47982 719666 719791 719394 718583 717004 714610 711977 709669 707594 705299 702585 699591 696502 693535 690937 688625
47967 688625 686081 683029 679966 677457 675189 672485 669649 667805 667275 667026 666149 665063 664616 664712 664645 664401
47951 664401 664725 666047 668122 670816 674618 680141 687463 696082 705236 714254 722967 731872 741647 752412
47937 752412 763687 775089 786733 798828 811140 823094 834328 844896 854845 863742 870872 876021
47925 876021 879910 883491 886807 888854 888668 886255 882248 877033 870570 862830 853954 844085 833465 822781
47911 822781 812994 804579 797003 789164 780379 771007 762103 754382 747591 741051 734711 729273 725194 722142
47897 722142 719810 718746 719745 722628 726321 730129 734290 739241 744949 751253 758307 766278 774903 783756
47883 783756 792734 802028 811803 822178 833312 845170 857264 868872 879503 888986 897234 904173 909895
47870 909895 914610 918335 920748 921392 920031 916841 912249 906468 899174 889863 878668 866507 854131 841228
47856 841228 827040 811814 797025 783880 772094 760598 749075 738181 728405 719452 710956 703204
47844 703204 696730 691504 687048 683225 680490 679285 679468 680403 681474 682547 684096 686822 690920 695705 700179
47829 700179 703973 707537 711426 715689 720013 724159 728088 731853 735574 739427 743507 747795 752285 757016
47815 757016 761969 767181 773030 780151 788894 799107 810577 823423 837797 853417 869797 886759
47803 886759 904359 922303 939827 956237 971249 984639 995830 1004082 1009047 1011021 1010672 1008602 1005056
47790 1005056 999956 993249 985375 977387 970425 965005 960800 957211 954040 951506 949695 948252 946695 944890
47776 944890 943090 941625 940565 939546 937827 934813 930700 926342 922202 917771 912407 906429 900707 895298
47762 895298 889283 882106 874421 867217 860672 854251 847542 840606 833892 828105 823737 820315 816569 811913
47748 811913 807394 804631 804124 805198 807241 810182 813903 818165 823280 830103 839032 849645 861540 874966
47734 874966 890223 906998 924721 943180 962359 981996 1001761 1021604 1041434 1060646 1078464
47723 1078464 1094676 1109577 1123130 1134632 1143377 1149354 1153052 1154738 1154196 1151124 1145507 1137483 1126979
47710 1126979 1113728 1097762 1079743 1060669 1041301 1021964 1002786 983926 965649 948391 932726
47699 932726 919046 907223 896903 888161 881550 877335 875013 873867 873773 875093 877973 882202 887780 895121
47685 895121 904460 915384 927299 940159 954334 969827 986039 1002505 1019421 1037131 1055292 1072973
47673 1072973 1089468 1104636 1118446 1130630 1140906 1149207 1155474 1159573 1161615 1162003 1160847 1157540 1151283
47660 1151283 1141851 1129637 1115189 1099089 1082030 1064523 1046566 1028001 1009145 990696 973066
47649 973066 956282 940484 926029 913039 901327 890944 882396 876139 872179 870283 870214 871616 874083
47636 874083 877532 882215 888146 894889 902137 910186 919587 930599 943171 957160 972346 988502 1005747
47623 1005747 1024525 1044985 1066615 1088674 1110656 1132027 1151866 1169176 1183321 1193833 1200096
47612 1200096 1201672 1198660 1191312 1179469 1162859 1141745 1116816 1088672 1057978 1025875 993481 961044
47600 961044 928375 896154 865934 838509 813143 788910 766076 745407 726747 709289 693068
47589 693068 679134 667965 658571 649607 640883 633199 627014 621947 617567 614002 611446 609403 606917 603533
47575 603533 599757 596462 594102 592613 591798 591478 591298 590764 589619 588028 586280 584455 582538 580674 579099
47560 579099 577794 576429 574681 572477 569888 566902 563428 559413 554861 549877 544856 540578 537838 536801
47546 536801 536728 536493 535412 533618 531728 530241 529271 528740 528680 529202 530234 531441 532514 533361 533852 533638 532621
47529 532621 531505 531364 532481 534101 535539 537033 539044 541190 542631 543334 544107 545298 546215 546169 545429 544723
47513 544723 544259 543834 543573 543901 544806 545604 545637 544971 544332 544426 545305 546263 546449 545649 544460 543675 543655 544290 545191
47494 545191 545792 545675 545086 544794 545097 545240 544261 542150 539694 537408 535247 533272 531908 531402 531624 532636
47478 532636 534860 538297 542018 545004 547242 549569 552504 555701 558540 560890 563149 565773 568904 572247
47464 572247 575189 577213 578398 579411 580803 582340 583332 583642 584015 585123 586578 587383 587297 587206 587995 589590
47448 589590 591505 593919 597649 603152 610068 617797 626131 635219 645233 656298 668650 682697 698794
47435 698794 716851 736197 756002 775940 796166 816591 836513 855148 872119 887094 899441
47424 899441 908776 915532 920367 923276 923937 922584 919700 915001 907781 898345 888102 877939 867454 856190
47410 856190 844617 833299 822045 810715 800017 790406 780837 769895 757897 746686 737342 729237
47398 729237 721468 714032 707183 700652 694306 688928 685490 683896 683014 681923 680751 680450 682038 685914 691575
47383 691575 697998 704457 710987 718055 726064 735137 745029 754957 763901 771397 777893 784101 790167 795652
47369 795652 800017 802771 803427 801807 798299 793418 787147 779148 769583 759191 748393 736828 724111
47356 724111 710676 697395 684486 671298 657351 643248 630267 619061 609012 598998 588704
47345 588704 578974 570795 564209 558444 552968 548017 544004 540821 537980 535221 532664 530494 528821 527838
47331 527838 527720 528268 528947 529466 530177 531678 534091 536883 539427 541641 544052 547241 551210 555343 559020
47316 559020 562195 565215 568171 570732 572660 574134 575365 576208 576445 576232 575862 575194 573824 571815 569899
47301 569899 568784 568584 569088 570307 572439 575424 578835 582314 586012 590522 596239 602785 609289 615441 622108
47286 622108 630469 640569 651154 661048 670267 679563 689286 699124 708735 718219 728001 738455 749538
47273 749538 760574 770580 779102 786584 793682 800439 806446 811579 816023 819654 821979 822853 822823 822536 822140
47258 822140 821462 820500 819532 818956 819236 820755 823456 826786 830201 833544 836641 838582 837756 832766 823295 810168
47242 810168 794758 778394 762241 747460 735142 725832 719172 714267 710477 707771 706327 706087 706873
47229 706873 708715 711814 716243 721843 728378 735635 743371 751290 759165 767065 775443 784931 795794 807494
47215 807494 818919 829087 837589 844376 849408 852646 854148 853928 851811 847607 841463 833913 825715 817632
47201 817632 810168 803262 796339 788919 781130 773488 766310 759694 754073 750379 749389 751046 754569 759101
47187 759101 764087 769229 774479 780276 787547 797111 808981 822451 836920 852428 869224 887145 905857
47174 905857 925503 946476 968462 990359 1011523 1032451 1053614 1074040 1091958 1106744 1119367
47163 1119367 1130755 1140561 1147959 1152900 1155828 1156608 1154620 1149874 1143309 1135801 1127437 1118056 1108069 1098266
47149 1098266 1088937 1079613 1069793 1059715 1050241 1042055 1035109 1028873 1023000 1017622 1013104 1009698 1007480 1006461
47135 1006461 1006609 1007891 1010372 1014175 1019266 1025385 1032320 1040080 1048583 1057289 1065388 1072335 1077987 1082184
47121 1082184 1084424 1084019 1080532 1074087 1065366 1055237 1044194 1032180 1019089 1005259 991195 976926
47109 976926 962094 946711 931382 916617 902368 888495 875317 863323 852531 842509 832817 823178
47097 823178 813434 803689 794336 785616 777394 769741 763452 759335 757063 755461 754020 753456 754514 756842
47083 756842 759574 762554 766394 771499 777530 783837 790042 796216 802690 809659 816871 823828 830353 836692
47069 836692 842856 848251 852320 855264 857660 859558 860528 860525 860176 860112 860439 860982 861649 862450 863533 865317 868222
47052 868222 872102 876309 880516 885131 890640 896867 903220 909437 915799 922679 930172 938082 946059 953822
47038 953822 961396 969080 977122 985560 994421 1003828 1013737 1023806 1033739 1043538 1053260 1062790 1072177 1081922
47024 1081922 1092523 1103796 1114970 1125397 1134811 1142963 1149451 1154064 1156994 1158538 1158735 1157404 1154405
47011 1154405 1149829 1144018 1137423 1130301 1122578 1114110 1105086 1096036 1087499 1079835 1073207 1067576 1062776 1058876
46997 1058876 1056374 1055720 1056626 1058162 1059587 1060867 1062384 1064517 1067590 1071832 1077122 1083059 1089495 1096733
46983 1096733 1104997 1113979 1123269 1133039 1143917 1156231 1169693 1183827 1198367 1213231 1228398 1243971
46971 1243971 1260138 1276887 1293805 1310259 1325707 1339830 1352510 1363778 1373706 1382247 1389253 1394741
46959 1394741 1399079 1402743 1405912 1408410 1410023 1410712 1410480 1409385 1407910 1407104 1407885 1410106 1412684 1414809 1416789
46944 1416789 1419521 1423488 1428583 1434612 1441514 1449173 1457498 1466731 1477222 1488817 1500822 1512740 1524707
46931 1524707 1537052 1549720 1562392 1574942 1587557 1600495 1613816 1627094 1639275 1649092 1655877 1659810
46919 1659810 1661260 1660172 1656276 1649605 1640409 1628803 1614851 1598842 1581128 1561824 1541153 1520033
46907 1520033 1499828 1481385 1464677 1449496 1436161 1425303 1417226 1411750 1408615 1407925 1410152 1415756 1424772
46894 1424772 1436873 1451893 1470090 1491643 1516047 1542334 1569811 1598172 1626910 1655170 1682317
46883 1682317 1708218 1732650 1754909 1774432 1791509 1806851 1820657 1832561 1842373 1850268 1856285 1860319
46871 1860319 1862857 1865132 1868149 1871908 1876038 1880841 1887158 1895424 1905514 1917443 1931447 1947190 1963567
46858 1963567 1979810 1996228 2013339 2030691 2047237 2062608 2077232 2091249 2104127 2115445 2125233
46847 2125233 2133231 2138618 2141000 2141085 2139726 2136767 2131502 2123859 2114348 2103139 2090148 2076069 2062402
46834 2062402 2050142 2039127 2029019 2020294 2013862 2010135 2008983 2010252 2013919 2019980 2028613 2040250 2055007
46821 2055007 2072115 2090289 2108712 2127363 2146434 2165672 2184353 2201680 2217110 2230358 2241097
46810 2241097 2248735 2252724 2253172 2250866 2246428 2239606 2229716 2216683 2201311 2184599 2167112 2149096 2130809
46797 2130809 2112516 2094291 2076048 2057760 2039601 2022015 2005689 1991275 1978940 1968239 1958625
46786 1958625 1950088 1943140 1938150 1934879 1932781 1931566 1931224 1931628 1932412 1933255 1933958 1934239 1933835 1933011 1932503 1932637
46770 1932637 1932889 1932746 1932669 1933570 1935616 1938279 1941500 1945903 1951716 1958331 1965365 1973387 1983104 1994428 2006942
46755 2006942 2020702 2035767 2051367 2066371 2080565 2094723 2109427 2124422 2139067 2152814 2165179
46744 2165179 2175901 2185300 2193962 2201904 2208526 2213576 2217645 2221465 2225114 2228215 2230621 2232611 2234657 2237168
46730 2237168 2240266 2243684 2247148 2250946 2255808 2262056 2269241 2276805 2284749 2293405 2302868 2312882 2322982
46717 2322982 2332405 2340164 2345633 2348957 2350641 2350853 2349268 2345364 2338622 2328756 2316137 2301708 2286029
46704 2286029 2268577 2248437 2225560 2200800 2174805 2147566 2119225 2090659 2062744 2035376 2007795
46693 2007795 1979802 1952217 1926011 1901279 1877304 1853523 1830244 1808321 1788267 1769879 1752741
46682 1752741 1736832 1722438 1709548 1697661 1686191 1674953 1664206 1654466 1646268 1639853 1634930 1630963
46670 1630963 1627814 1625957 1625825 1627211 1629675 1633470 1639546 1648466 1659678 1672220 1685885 1701250 1718625
46657 1718625 1737452 1756883 1776459 1795868 1814341 1830815 1844695 1856140 1865539 1873028 1878601 1882322
46645 1882322 1884214 1884250 1882753 1880678 1879103 1878446 1878486 1879227 1881389 1885852 1892881 1902269 1914179 1929363 1948367
46630 1948367 1970838 1995915 2023018 2051811 2081531 2110987 2139372 2166508 2191956 2214326 2232041
46619 2232041 2244525 2252097 2254915 2252665 2245318 2233535 2218019 2198934 2176215 2150125 2121247 2090205
46607 2090205 2057665 2024392 1991094 1958359 1926808 1897030 1869214 1843141 1818722 1796176 1775552
46596 1775552 1756488 1738749 1722523 1707798 1693839 1679896 1666181 1653554 1642308 1631838 1621384
46585 1621384 1610522 1598968 1586613 1573978 1562062 1551340 1541212 1530751 1519756 1508888 1499029
46574 1499029 1490719 1483983 1478406 1473483 1469057 1465327 1462379 1459969 1457885 1456303 1455509 1455352 1455296 1455010 1454792
46559 1454792 1455287 1456781 1458816 1460596 1461818 1462993 1464883 1467826 1471816 1476894 1482971 1489413 1495437 1501036
46545 1501036 1507020 1513977 1521719 1529971 1539004 1549147 1560188 1571782 1584110 1597520 1611816 1626618
46533 1626618 1642273 1659730 1679470 1701169 1724448 1749276 1775465 1802449 1829898 1858032 1886936
46522 1886936 1916126 1945234 1974609 2004596 2034553 2063287 2090264 2115634 2139099 2159608 2176474
46511 2176474 2190102 2201224 2209941 2216042 2219876 2222339 2224061 2225049 2225070 2223980 2221736 2218420 2214301 2209597
46497 2209597 2204206 2198001 2191333 2184843 2178644 2172041 2164215 2154926 2144363 2132656 2119755 2105535 2089712
46484 2089712 2071775 2051324 2028430 2003422 1976374 1947050 1915378 1881801 1847025 1811569 1775638
46473 1775638 1739486 1703793 1669496 1637176 1606775 1578113 1551477 1527322 1505530 1485617 1467797
46462 1467797 1453242 1442868 1436329 1432676 1431601 1433438 1438288 1445861 1456111 1469226 1484910 1502255
46450 1502255 1520483 1539194 1557739 1575035 1590509 1604788 1618963 1633345 1647244 1659664 1669873
$$ [...]
##END NTUPLES=NMR SPECTRUM
##END=
