##TITLE=AC1616_BRASL13347_8317329_hloSlhI3Su
##JCAMPDX= 6.0         $$ Bruker NMR JCAMP-DX V2.0
##DATA TYPE= NMR SPECTRUM
##DATA CLASS= NTUPLES
##ORIGIN= BRUKER
##OWNER= Administrator
$$ 1.72 TOPSPIN		Version 2.1
$$ 2013-11-13 23:38:52.839 -0800  Administrator@X
$$ Compression mode = diff/dup
##.OBSERVE FREQUENCY= 400.02188249412
##.OBSERVE NUCLEUS= ^1H
##.ACQUISITION MODE= SIMULTANEOUS (DQD)
##.ACQUISITION SCHEME= undefined
##.AVERAGES= 8
##.DIGITISER RES= 22
##SPECTROMETER/DATA SYSTEM= spect
##.PULSE SEQUENCE= zg30
##.SOLVENT NAME= COFFEE_meoh
##.SHIFT REFERENCE= INTERNAL, COFFEE_meoh, 1, 14.98509
##AUDIT TRAIL= $$ (NUMBER, WHEN, WHO, WHERE, PROCESS, VERSION, WHAT)
$$ ##TITLE= Audit trail, TOPSPIN		Version 2.1
$$ ##JCAMPDX= 5.01
$$ ##ORIGIN= Bruker BioSpin GmbH
$$ ##OWNER= Administrator
$$ $$ E:\/data/COFFEE/nmr/AC1616_BRASL13347_8317329_hloSlhI3Su/10/pdata/1/auditp.txt
$$ ##AUDIT TRAIL=  $$ (NUMBER, WHEN, WHO, WHERE, PROCESS, VERSION, WHAT)
(   1,<2013-11-13 23:38:45.761 -0800>,<Administrator>,<X>,<go>,<TOPSPIN 2.1>,
      <created by zg
	started at 2013-11-13 23:37:39.902 -0800,
	POWCHK enabled, PULCHK disabled,
       configuration hash MD5:
       C8 4E 4E 5D D3 5C D8 9E 9F 52 82 E0 59 8A DE 15
       data hash MD5: 64K
       20 9B E2 59 72 41 85 4D C8 44 A1 18 EC 11 08 8E>)
(   2,<2013-11-13 23:38:48.855 -0800>,<Administrator>,<X>,<proc1d>,<TOPSPIN 2.1>,
      <Start of raw data processing
       efp LB = 0 FT_mod = 6 PKNL = 1 PHC0 = 0 PHC1 = 0 SI = 32K 
       data hash MD5: 32K
       AC 14 4F 55 0A 39 29 E5 D1 CF DB 7B B7 CE BC E5>)
(   3,<2013-11-13 23:38:49.152 -0800>,<Administrator>,<X>,<proc1d>,<TOPSPIN 2.1>,
      <pk PHC0 = 92.21375 PHC1 = 0 
       data hash MD5: 32K
       0A 9C 0C E3 FD 29 07 70 A8 3F D7 7E 39 5D 40 BC>)
(   4,<2013-11-13 23:38:49.370 -0800>,<Administrator>,<X>,<proc1d>,<TOPSPIN 2.1>,
      <abs ABSG = 1 
       data hash MD5: 32K
       F1 BB 30 A9 83 58 8B 08 C6 08 13 CB 8B 40 BB F5>)
(   5,<2013-11-13 23:38:49.558 -0800>,<Administrator>,<X>,<proc1d>,<TOPSPIN 2.1>,
      <abs ABSG = 2 
       data hash MD5: 32K
       67 F6 33 2A 31 97 62 B5 53 12 6F 66 40 D1 AF BC>)
(   6,<2013-11-13 23:38:49.683 -0800>,<Administrator>,<X>,<proc1d>,<TOPSPIN 2.1>,
      <abs ABSG = 3 
       data hash MD5: 32K
       B6 A3 79 F1 70 5E 51 B0 F5 37 1D BC 6C 40 1E B7>)
(   7,<2013-11-13 23:38:49.730 -0800>,<Administrator>,<X>,<proc1d>,<TOPSPIN 2.1>,
      <abs ABSG = 4 
       data hash MD5: 32K
       03 3A 53 FA 64 AB BD F4 CC 35 01 DA 3F 58 F7 B7>)
(   8,<2013-11-13 23:38:49.792 -0800>,<Administrator>,<X>,<proc1d>,<TOPSPIN 2.1>,
      <abs ABSG = 5 
       data hash MD5: 32K
       DD 59 AC 6D 9E 6A 5E 7C BD DA F3 C2 20 7D 62 48>)
$$ ##END=
$$ 
$$ $$ hash MD5
$$ $$ DA 17 47 85 CA 9A 7F EE B2 6B 53 39 4A 73 86 AC
##$RELAX= 
##$RELAX= 
##$RELAX= 
##$RELAX= 
##$RELAX= 
##$RELAX= 
##$RELAX= 
$$ Bruker specific parameters
$$ --------------------------
##$DU= <E:\>
##$EXPNO= 10
##$NAME= <AC1616_BRASL13347_8317329_hloSlhI3Su>
$$ [...]
##$TP= (0..7)
150 150 150 150 150 150 150 150
##$TP07= 0
##$TPNAME0= <>
##$TPNAME1= <>
##$TPNAME2= <>
##$TPNAME3= <>
##$TPNAME4= <>
##$TPNAME5= <>
##$TPNAME6= <>
##$TPNAME7= <>
##$TPOAL= (0..7)
0.5 0.5 0.5 0.5 0.5 0.5 0.5 0.5
##$TPOFFS= (0..7)
0 0 0 0 0 0 0 0
##$TUNHIN= 0
##$TUNHOUT= 0
##$TUNXOUT= 0
##$USERA1= <user>
##$USERA2= <user>
##$USERA3= <user>
##$USERA4= <user>
##$USERA5= <user>
##$V9= 5
##$VALIST= <valist>
##$VCLIST= <CCCCCCCCCCCCCCC>
##$VD= 0
##$VDLIST= <DDDDDDDDDDDDDDD>
##$VPLIST= <PPPPPPPPPPPPPPP>
##$VTLIST= <TTTTTTTTTTTTTTT>
##$WBST= 1024
##$WBSW= 4
##$XGAIN= (0..3)
0 0 0 0
##$XL= 0
##$YL= 0
##$YMAX_a= 637349
##$YMIN_a= -543339
##$ZGOPTNS= <>
##$ZL1= 120
##$ZL2= 120
##$ZL3= 120
##$ZL4= 120
##$ABSF1= 14.98509
##$ABSF2= -5.573092
##$ABSG= 5
##$ABSL= 3
##$ALPHA= 0
##$AQORDER= 0
##$ASSFAC= 0
##$ASSFACI= 0
##$ASSFACX= 0
##$ASSWID= 0
##$AUNMP= <proc_prof1d_extract_pilot.lims>
##$AXLEFT= 0
##$AXNAME= <>
##$AXNUC= <1H>
##$AXRIGHT= 0
##$AXTYPE= 0
##$AXUNIT= <>
##$AZFE= 0.1
##$AZFW= 0.1
##$BCFW= 0
##$BC_mod= 0
##$BYTORDP= 0
##$COROFFS= 0
##$CY= 15
##$DATMOD= 1
##$DC= 0
##$DFILT= <>
##$DTYPP= 0
##$F1P= 0
##$F2P= 0
##$FCOR= 0.5
##$FTSIZE= 32768
##$FT_mod= 6
##$GAMMA= 0
##$GB= 0
##$INTBC= 1
##$INTSCL= 1
##$ISEN= 128
##$LB= 0
##$LEV0= 0
##$LPBIN= 0
##$MAXI= 10000
##$MC2= 0
##$MEAN= 0
##$ME_mod= 0
##$MI= 0
##$NCOEF= 0
##$NC_proc= -8
##$NLEV= 6
##$NOISF1= 0
##$NOISF2= 0
##$NSP= 0
##$NTH_PI= 0
##$NZP= 0
##$OFFSET= 14.98509
##$PC= 1
##$PHC0= 92.21375
##$PHC1= 0
##$PH_mod= 1
##$PKNL= yes
##$PPARMOD= 0
##$PPDIAG= 0
##$PPIPTYP= 0
##$PPMPNUM= 2147483647
##$PPRESOL= 1
##$PSCAL= 4
##$PSIGN= 0
##$PYNMP= <proc.py>
##$REVERSE= no
##$SF= 400.02
##$SI= 32768
##$SIGF1= 0
##$SIGF2= 0
##$SINO= 400
##$SIOLD= 32768
##$SPECTYP= <>
##$SREGLST= <1H.CDCl3>
##$SSB= 0
##$STSI= 32768
##$STSR= 0
##$SW_p= 8223.68421052631
##$SYMM= 0
##$S_DEV= 0
##$TDeff= 65536
##$TDoff= 0
##$TI= <>
##$TILT= no
##$TM1= 0
##$TM2= 0
##$TOPLEV= 0
##$USERP1= <user>
##$USERP2= <user>
##$USERP3= <user>
##$USERP4= <user>
##$USERP5= <user>
##$WDW= 1
##$XDIM= 32768
##$YMAX_p= 460317159
##$YMIN_p= -755725
##$CURPLOT= <Network HP LaserJet P1505>
##$CURPRIN= <$Network HP LaserJet P1505>
##$DFORMAT= <normdp>
##$LAYOUT= <+/1D_H.xwp>
##$LFORMAT= <normlp>
##$PFORMAT= <normpl>
##$SURQMSG= 1
$$ End of Bruker specific parameters
$$ ---------------------------------
##NTUPLES= NMR SPECTRUM
##VAR_NAME=  FREQUENCY,     SPECTRUM/REAL,   SPECTRUM/IMAG
##SYMBOL=    X,             R,               I
##VAR_TYPE=  INDEPENDENT,   DEPENDENT,       DEPENDENT
##VAR_FORM=  AFFN,          ASDF,            ASDF
##VAR_DIM=   32768,         32768,           32768
##UNITS=     HZ,            ARBITRARY UNITS, ARBITRARY UNITS
##FACTOR=    0.250966925370066, 1,           1
##FIRST=     8223.43324360094, -318123,      -49046
##LAST=      0,             20615,           66124
##MIN=       0,             -755725,         0
##MAX=       8223.43324360094, 460317159,    0
$$ Real data points
##PAGE= N=1
##DATA TABLE= (X++(R..R)), XYDATA
$$ [...]
19557d52692i0616A02805B7669a42474C3221e6057l46774d7133A07424a34238
19546F6539g9105B78587q1255c7435A85026b46846g2343k48455g1744J2025N655
19535e4064p6841D20632c29708F7506b97154B906P7308e4003J3797l8380j72465
19524b51051a9895A11282n2195O981L65253a1644n9393k91485J66638Q5661j5218
19513a25441A54119f6853r0908j78798J36110L8759m5789A23014J05739A05394
19502B8118c18091I2078a53934j74933a42799d529m1854k2097k26250R0088l8289
19491b42931A8584L5171j4703L4301a36864D5231J07003b75789A70136N1187a06714
19479A18268J45a85377L9353D6236J472a77483C1630b78131c9970I1959R5302
$$ y = [-452692, -90616, 102805, 27669, -142474, 33221, -56057, -402831, -47133, 107424, -134238, 66539, -79105, 278587, 197332, -37435, 185026, -246846, -72343, -320798, -71744, -59719, -54064, -130905, 420632, -329708, 67506, -297154, 2906, 80214, -54003, -40206, -78586, -251051, -19895, 111282, 59087, 66068, 431321, -11644, -71037, -362522, -195884, -110223, -125441, 154119, -66853, -157761, -336559, -200449, -161690, -207479, 123014, 228753, 105394, 28118, -318091, 92078, -153934, -328867, -142799, -4529, -46383, -68480, -294730, -204642, -242931, 18584, 53755, 39052, 73353, -136864, 45231, 152234, -275789, 170136, 221323, -106714, 118268, 118413, -185377, -146024, 46236, 47708, -177483, 31630, -278131, -39970, 91959, 187261]
19468A87261e6639o3034k71657H1980J86047g5622k4188A28874a03910n978o7259
19457a77147j63125D0310a29264B36118b19554r042k24356H437a24465M9757k51866
19446c26574l2649J47112A94298b29163B71059a98774R3340a5848a820l58733
19436c60553Q9841j70250d5741p7649c7915k05852k39361J15145a44581r682A34440
19424b45045J20961j20859i705A05874K982a86505H1268b65506J19077A91570
19413A62392F410L3218a36585H7618l1714d782l9117K1657k35966c1741o0133
19402i1874A18148a87963G9165o474A157N8188c3638A01437a4542j20266C0618
19390f5383A93696f2434B66560e4490k54250A4537b22860H154c14480M1213A8310
$$ y = [187261, -56639, -119673, -391330, 81980, 268027, -75622, -99810, 128874, -103910, -109888, -177147, -340272, 40310, -129264, 236118, -219554, -228596, -452952, 8437, -124465, -74708, -326574, -359223, -212111, 194298, -229163, 271059, -198774, -105434, -15848, -1820, -360553, -270712, -440962, -45741, -123390, -37915, -243767, -483128, -367983, -144581, -154263, 134440, -245045, -124084, -244943, -9705, 105874, 108856, -186505, 81268, -265506, -146429, 191570, 162392, 6410, 39628, -136585, 87618, 55904, -4782, -43899, -22242, -258208, -31741, -91874, 118148, -187963, 79165, 72691, 1157, 59345, -33638, 101437, -14542, -134808, 30618, -65383, 193696, -62434, 266560, -54490, -308740, 14537, -222860, 8154, -314480, -273267, 18310]
19378b55862B5542a47521j6205K7982a3579j24507j4892A90200b5278A86578a70635
19366A40941b72305E3733d3367o4874M1935l40051a17513A48920g372A06245K77705
19355C83950b66847A36254e8213I4112e7440j83361A16670j7600Q2183E8717d47481
19343d4960l522j55318k8839A77478h9111A06859b0460q4405A6150h4567l09890
19332c94457A35150b43423J7041m0591B08794H4093d8827l4543A03415k8131a69859
19320a98075Q5383j03946B83924b82958A74086c63209c5164D6328b10500a1154
19309a26125B93519j41505M3478a50892j43076a23605H8216R9677c15526A84218
19298f5664l12480a16794J1806D72374c9212k49259P4229k2290l0110B24896m964
$$ y = [-255862, 25542, -147521, -163726, -135744, -13579, -138086, -152978, 190200, -25278, 186578, -170635, 140941, -272305, 53733, -43367, -108241, -66306, -406357, -117513, 148920, -7372, 106245, 383950, -266847, 136254, -58213, 94112, -57440, -240801, 116670, 99070, 181253, 58717, -447481, -44960, -48482, -203800, -232639, 177478, -89111, 106859, -20460, -104865, 16150, -84567, -394457, 135150, -243423, -226382, -266973, 208794, 84093, -48827, -83370, 103415, 75284, -169859, -198075, -112692, -216638, 283924, -282958, 174086, -363209, -35164, 46328, -210500, -11154, -126125, 293519, 152014, 195492, -150892, -293968, -123605, 88216, 187893, -315526, 184218, -65664, -378144, -116794, -104988, 472374, -39212, -288471, -214242, -236532, -266642, 224896, 219932]
19287B19932j01138c51111E9372J5389a67768f2205A17242b21203c3494I8758
19276c78163g1353C8336b5689J2093A63336c3749D57e9179k56485J4854B9927
19264H5278a49223L6953j8633j53781A7562a27075B52609h3708A88475h8400A7945
19252a29251M4824j63385d5912E1764a64351e5691o596j38766b5836j21988B32605
19240b51379e7126j34282C92601B9314K5781b16464e2479k121k48884B7321J40375
19229A67696J00181k0094b22292B5814d2779A87613a0142l58509B35245g8359
19218a67851M2103k9030q0932B60246F0328k4277J35059a04934j22124A4182b2603
19206c5919l6807j739F8197a2151C2925J90766b5003B63821e3192A9276e2960
$$ y = [219932, 118794, -351111, 59372, 74761, -167768, -62205, 117242, -221203, -33494, 98758, -378163, -71353, 38336, -25689, -13596, 163336, -33749, 457, -59179, -315664, -300810, 29927, 85278, -149223, -112270, -130903, -284684, 17562, -127075, 252609, -83708, 188475, -88400, 17945, -129251, -84427, -247812, -45912, 51764, -164351, -55691, -62287, -201053, -25836, -147824, 232605, -251379, -57126, -191408, 392601, 29314, 55095, -216464, -52479, -54600, -303484, 27321, 167696, 267877, 247783, -222292, 25814, -42779, 187613, -10142, -368651, 235245, -78359, -167851, -125748, -154778, -235710, 260246, 60328, 36051, 171110, -104934, -227058, 14182, -22603, -35919, -72726, -74465, 68197, -12151, 32925, 223691, -25003, 263821, -53192, 19276, -52960]
19194d47109A17666h8630j17948H1095e6993l68422b1416A74952B0250g9290k04285
19183b83575P7279a7314j21465j89044H1225b60975I8427D176b06226d0580k0471
19172f1051k96831a50311n7002O3034j5962F0498b74939N4843B17367b4315k4915
19161d9230k86701n0892a13635B57220b32421h7278b4487A07255b76457C0668
19150D7986Q0301n6946a05429b1588F5333L1763a69968M5684l6830j76246B4292
19138b05048f6340B10189G0350a13562d3685l1005j24012g3831B80247d519H8139
19126a30590L2636A61278a14054m0385D8380J13012b21554f3661J6396j1827E287
19114b28800A6065P9967a02116C3916J8283a01226b5963F8760a66838E852b26599
$$ y = [-447109, 117666, -88630, -206578, 81095, -56993, -425415, -21416, 174952, 20250, -79290, -283575, -206296, -17314, -138779, -327823, 81225, -260975, 98427, 4176, -206226, -40580, -61051, -357882, -150311, -207313, -144279, -160241, 60498, -274939, -220096, 217367, -24315, -49230, -335931, -386823, -113635, 257220, -232421, -87278, -24487, 107255, -276457, 30668, 47986, 128287, 71341, -105429, -21588, 65333, 97096, -169968, -124284, -161114, -337360, 24292, -205048, -66340, 210189, 70350, -113562, -43685, -74690, -198702, -73831, 280247, -4519, 88139, -130590, -97954, 161278, -114054, -154439, 48380, 161392, -221554, -63661, -47265, -59092, 5287, -228800, 16065, 96032, -102116, 33916, 52199, -101226, -25963, 68760, -166838, 5852, -226599]
19102B15723B1453b62653P6362a9779m22289b3314n45005a24179r7541A09840
19091a27391H3771g2021A39819b02277A38229l7309a80529A47358a51540r7823
19081b49363f6553A03280K07517j04277i5560A8423b1117k31074d6945a6139C7206
19069A40548h2907a4838l22197C1634F823R8987E2836c16131J22309d5614b2690
19057d24077J95304A05269d0075r8133E2526a06330A53540a7567A11856J3999
19047A25855K6277f1977j10063N2852c0527B05607c2031a0191j48372K7508C50055
19035i6429c0185j23354J1697C777J15377c38431a47289B12398E1620K35466i3645
19023A94608B8215Q3631k9744B6980e3742A3147a57747J5549J6891k53400B15339
$$ y = [215723, 21453, -262653, -186291, -19779, -442068, -23314, -568319, -124179, -221720, 109840, -127391, 83771, -72021, 139819, -202277, 138229, 100920, -180529, 147358, -151540, -249363, -66553, 103280, 310797, 206520, -95560, 18423, -21117, -252191, -46945, -16139, 37206, 140548, -82907, -14838, -337035, 31634, 6823, 105810, 52836, -316131, -193822, -45614, -22690, -424077, -228773, 105269, -40075, -138208, 52526, -106330, 153540, -17567, 111856, 125855, 152132, -61977, -172040, -119188, -30527, 205607, -32031, -10191, -158563, -131055, 350055, -96429, -30185, -153539, -141842, 3777, 119154, -338431, -147289, 212398, 51620, 287086, -93645, 194608, 28215, 111846, 82102, 26980, -53742, 13147, -157747, -142198, -125307, -378707, 215339]
19011a03195j24786j00536i1301j10994A11789b58488Q9771O4461B04379o7016
19001A37363A3608O7290c68921k5591a11363B06023d9931k6026A53245b36140
18990B93a01885M2360j1924A1216M8050p166a26160p339A73204N1675b15735j09881
18978c25616B1368d71212a48229J8f1729A33765h2892H2834b16028D53451i6704
18966a89487r0828A17715b61598r6010a21143J9516j54385A3786K41937b13523
18955b06691C7477J03539M9520b2251n6005L8539H230i0283B4986c19308A09294
18943A00531J18452a63032B9213j1067a71955O9700L9002D554b0054k50843A44521
18931a39988f1271J7858j19862N0665E7245e5052j85561c9231P440k05759B5186
$$ y = [-103195, -227981, -328517, -91301, -202295, 111789, -258488, -168717, -104256, 204379, 137363, 13608, 80898, -368921, -394512, -111363, 206023, -49931, -75957, 153245, -236140, 293, -101885, -59525, -71449, 11216, 59266, 52100, -126160, -133499, 173204, 224879, -215735, -325616, 21368, -471212, -148229, -148211, -61729, 133765, -82892, 82834, -216028, 453451, -96704, -189487, -280315, 117715, -261598, -357608, -121143, -101627, -256012, 13786, 255723, -213523, -206691, 37477, 141016, 190536, -22251, -78256, -39717, 8230, -90283, 24986, -319308, 109294, 100531, 218983, -163032, 29213, 18146, -171955, -102255, -63253, 4554, -20054, -270897, 144521, -139988, -61271, -43413, -163275, -112610, 57245, -55052, -240613, -39231, -31791, -237550, 25186]
18919B53022a37541j31543P8167n8373K568C0107a38970p0420e1345B64056h104
18907c52144F8011J12456B9893g4143b4353A30922c36833A42483b25278A82189
18896a74787A19822E9771K07281a4482j04842b576n167j7994B48908g4109F5551
18884a78442O2868B17874c76708a57336F8239Q8784e6374m9058j50533f0105g211
18872b38422a15467a3621l9420k21962f5925j67897B1615i5291j16086A46709
18861a74173e2219k6764q2134I0348e5681j70612B4261a44469A70816F4973e8709
18849C6117b80084E1956d7068L804A45739c7894m1122B22547F8757l3297e6115
18837b4643j03802C5193Q1326h0693F2643J89348j21228D5060P3259G154i2876
$$ y = [253022, -137541, -269084, -190917, -249290, -246722, 30107, -138970, -209390, -51345, 264056, -8104, -352144, 68011, 180467, 29893, -74143, -24353, 130922, -336833, 142483, -225278, 182189, -174787, 119822, 59771, 267052, -14482, -119324, -2576, -7743, -25737, 248908, -74109, 65551, -178442, -115574, 217874, -376708, -157336, 68239, 157023, -56374, -105432, -255965, -60105, -7211, -238422, -115467, -13621, -53041, -275003, -65925, -233822, 21615, -95291, -211377, 146709, -174173, -52219, -78983, -161117, 90348, -55681, -226293, 24261, -144469, 170816, 64973, -58709, 36117, -280084, 51956, -47068, -43264, 145739, -37894, -79016, 222547, 68757, 35460, -56115, -24643, -128445, 35193, 116519, -80693, 62643, 251991, 130763, 45060, 118319, 7154, -92876]
18825a52973e1156p6082E7581d3947B83324E698N7984c82946a33785E6006a26668
18813f7618m9982B44431J0456P652m2526F54a24049D17806j51213a63535N0519
18802a13016G7124d7044F8432b29139C08379h6500C9675h2657B77858a76675A85639
18790a78327G9910g6341F100b21852F3342i4318n2937J3257j81293c26l5556r2933
18778a28815A21929b08745b0813k30149q2097g0951k18849E3189c27942f0458
18767A06231e2536A44360a65055G0147A5675o424P1109C8334K05591M9993I7935
18755h7333F3135c19787a36305A47079i7834B58322b0320H242K78351H3748C3321
18743c0625j5325q517j57475A78560F419a68361f3212a2365o3528c3870j65918
$$ y = [-152973, -51156, -127238, 57581, -43947, 283324, 5698, 63682, -382946, -133785, 56006, -126668, -67618, -117600, 244431, 254887, 262539, 220013, 654, -124049, 417806, 266593, -163535, -113016, 77124, -47044, 68432, -229139, 308379, -86500, 39675, -82657, 277858, -176675, 185639, -178327, 79910, -76341, 6100, -221852, 63342, -94318, -147255, -133998, -315291, -326, -35882, -128815, 121929, -208745, -20813, -250962, -333059, -70951, -289800, 53189, -327942, -60458, 106231, -52536, 144360, -165055, 70147, 15675, 9251, 80360, 38334, 243925, 293918, 97935, -87333, 63135, -319787, -136305, 147079, -97834, 258322, -20320, 8242, 286593, 83748, 33321, -30625, -45950, -54467, -211942, 178560, 6419, -168361, -63212, -12365, -75893, -33870, -199788]
18732a99788l4234f3361l8349A94893L8520a84594f6878n0687c5682A55446b21514
18720b01657n6488g1122E7255b29894M438O3549H7806a69482b0989k38235h4855
18708A93350a94359J0812l7778M7687a9263A5983J21148i2555l36922A17077k3523
18697I3554c29302F2854b21524b2893G0369B4717c9604k97199i3714j8920B66058
18685a87627L9386N3198j14374I385e5490L054A41378a12107m4805P2986b7875
18673a12554e5363m8123d9284j55326a3780k01788J2861O6274I9663h4071n1668
18662a35739B72471B8911a19801e6164B98116c5145m26746A83702J3104b20557
18651A1208K04424C8238c1375Q284A904L3104b6642q0741B4599b11801h1073J3842
$$ y = [-199788, -234022, -63361, -101710, 194893, 233413, -184594, -66878, -117565, -35682, 155446, -221514, -201657, -258145, -71122, 57255, -229894, -225456, -161907, 87806, -169482, -20989, -259224, -84855, 193350, -194359, -183547, -221325, -173638, -19263, 15983, 137131, -92555, -429477, 117077, 93554, -329302, 62854, -221524, -22893, 70369, 24717, -39604, -336803, -93714, -112634, 266058, -187627, -148241, -95043, -209417, 9385, -55490, -52436, 141378, -112107, -156912, -83926, -27875, -112554, -55363, -103486, -49284, -204610, -13780, -215568, -202707, -136433, 99663, -84071, -135739, 272471, 28911, -119801, -56164, 298116, -35145, -461891, 183702, 196806, -220557, 11208, 215632, 38238, -31375, -23091, 1904, 35008, -26642, -107383, 24599, -211801, -81073, -67231]
18639f7231m64388a99080l21335b13064I9825b48466e4730j01224a3598E0096
18628b13076j52177A24123n1427b00133D8267d0217k05814D7931M155a34345j5614
18617a49959n4348l4008B38869f6045m9051l7591D53079j69511j11905O8750A01463
18605G4037f2301r2847A15349a72486B19456c40774A75123c2733j82721q3753
18595b99207c3054A66312d634m5360q0528L3765j62795A07339b12839l8883F219
18583i0795o0093B87025A3105e5894i699k1636j36490C02385a63774l22483A8725
18571a26353F5795E452b7180B36893a81907e4373a0043A8625c5912A38600b97986
18559B47063f8476A05833N4085G6421M58398a43330n2082B17148q3612M2182c41304
$$ y = [-67231, -531619, -199080, -520415, -213064, 99825, -248466, -54730, -155954, -13598, 50096, -213076, -365253, 124123, 72696, -200133, 48267, -40217, -246031, 47931, 52086, -134345, -149959, -204307, -238315, 238869, -66045, -115096, -152687, 453079, 283568, 171663, 240413, 101463, 74037, -62301, -155148, 115349, -172486, 219456, -340774, 175123, -32733, -215454, -299207, -33054, 166312, -4634, -49994, -130522, -96757, -259552, 107339, -212839, -251722, 6219, -90795, -150888, 287025, 13105, -55894, -9699, -31335, -167825, 302385, -163774, -486257, 18725, -126353, 65795, 5452, -27180, 236893, -181907, -54373, -10043, 18625, -35912, 138600, -297986, 247063, -68476, 105833, 159918, 76421, 534819, -143330, -195412, 217148, 133536, 175718, -341304]
18547D2708b25271H4240b00432A28810a46473B4065h9079B48577c11938a6537
18536A03028a85353B07142D738f9118B891a91949l0162A25989J05162d1458B23726
18524b9978C7527J5240b28061l1461A01365a20284A73560b46579G0468a40916
18513i0184a5996I0707j4670J52502a58644l9882I8289L284b59318A17494a12293
18501G094a27446A1415a97831e3799a8928A00355b08923j2229F2376B1930c50694
18489a61673j68295a45381e5815l1032k18840a39359L6435L8145J7459H7033b83839
18477D7525J5932J04551b36119C8089a75695K4133j35970J33581A92872f7494
18466c15491g0021K6212j78578B35492b24494D3274K314d0834j57059e0624C05818
$$ y = [42708, -225271, 84240, -200432, 128810, -146473, 24065, -89079, 248577, -311938, -16537, 103028, -185353, 207142, 4738, -69118, 2891, -191949, -222111, 125989, 231151, -41458, 223726, -29978, 37527, 52767, -228061, -259522, 101365, -120284, 173560, -246579, 70468, -140916, -90184, -15996, 90707, 76037, 228539, -158644, -198526, 98289, 101573, -259318, 117494, -112293, 7094, -127446, 11415, -197831, -53799, -18928, 100355, -208923, -221152, 62376, 21930, -350694, -161673, -329968, -145381, -55815, -86847, -305687, -139359, -102924, -64779, -47320, 87033, -283839, 47525, 63457, 168008, -236119, 38089, -175695, -151562, -287532, -153951, 192872, -67494, -315491, -70021, -43809, -222387, 235492, -224494, 43274, 45588, -40834, -197893, -50624, 305818]
18454B5971N3215R4377n6284b64353j1435E9513M836a31602D1235o846h5385k33129
18442c18514A9014b45542A3232c66670a39043B11761a05011A6348b84489J10798
18432a73691E4300P5068q646d93329b40627H0893K16800f5052I0932J50682b2409
18420b12554j67629a74214m5836A5099c7678k59385A6503a27965e517j49266D0217
18408i2685q4871A98782f435j22143j4966B03591K4395a56493F998Q2618f3916
18396c8245F093J19349d4945A80996k8207O3149N2393A7628b59313a16846R844
18385a07002A12366f4418k08347J0723a6286C2992b43572B447J573a61578A47714
18373B09271e8040j97005B72711C3707A0408L8950J41985b68356C36431H5878
$$ y = [25971, 79186, 173563, 117279, -264353, -275788, 59513, 64349, -131602, 41235, 34389, -85385, -318514, 19014, -245542, 13232, -366670, -139043, 211761, -105011, 16348, -284489, -173691, 54300, 129368, 120722, -493329, -240627, 80893, 297693, -65052, 90932, 241614, -22409, -212554, -380183, -174214, -220050, 15099, -37678, -297063, 16503, -127965, -5517, -154783, 40217, -92685, -177556, 198782, -6435, -128578, -143544, 203591, 227986, -156493, 6998, 89616, -63916, -38245, 6093, 125442, -44945, 180996, 152789, 215938, 268331, 17628, -259313, -116846, -107002, 112366, -64418, -272765, -262042, -16286, 32992, -243572, 2447, 4020, -161578, 147714, 209271, -58040, -255045, 272711, 33707, 10408, 49358, 191343, -268356, 336431, 85878]
18362C3425a70265j11262a5163E5335b08853j89191D5315b30817a04179A05088
18351A09933b93038a23489M4085j07054A19530m8636e2186A88569a14659e1855
18340a3731j3017n5506j28244N6228j03882F1757a444k47139B32434f1220r5190
18329a56410G8958a7958A00962a82912l4443f8438j52074O3100A0995A498P1819
18318G3317C4602b5678k84253A38492a49013o8088B69112b9284l3260n771C77821
18306b31206f0864g830k51608A19943M823g3630j38142a04794A19028h6556A70442
18294a17843G0167J72953d9979A07323c70683h6406n7797a2007k03591A17587
18283c6463o671B12987b11743j30512I9957m0453j8287f7503B04305q7970C23
$$ y = [33425, -170265, -281527, -15163, 55335, -208853, -398044, 45315, -230817, -104179, 105088, 109933, -293038, -123489, -79404, -186458, 119530, 70894, -52186, 188569, -114659, -51855, -13731, -26748, -82254, -210498, -154270, -258152, 61757, -1444, -248583, 232434, -61220, -156410, 78958, -17958, 100962, -182912, -217355, -68438, -220512, -157412, 10995, 1498, 73317, 34602, -25678, -309931, 138492, -149013, -217101, 269112, -29284, -62544, -68315, 377821, -231206, -60864, -7830, -259438, 119943, 124766, -73630, -211772, -104794, 119028, -86556, 170442, -117843, 70167, 243120, -49979, 107323, -370683, -86406, -144203, -12007, -215598, 117587, -36463, -43134, 212987, -211743, -342255, 99957, 59504, 41217, -67503, 204305, 116335, 323]
18271a07390A22646b14429C7969a16094n1887k79711A42051E2628i2227L0471
18261f1756B61030G7440a76887H5761L5812O577d52346G1558J56622a03790L1939
18250g1851A19760a66427j10870c6464q6358j90339B6726i6774g710A42909h7262
18238A13816a9633A00750C7758a56343A7095J97176o6372a62769O5889p0451j65471
18227c32802h8614N655J3041P821l3746B17806A6062a90956g6766D3233a73350
18215B41767C8662i5326l2644G6980O2870a3784j80323I4549C5322A7126b3144
18203a81918d0994D6422a64221A23497a80366A9463c98150a60492l20365E0151
18192C4324L4695b10167d3744j75104k95240A31380a46357k1707P3310c629A25386
$$ y = [-107390, 122646, -214429, 37969, -116094, -167981, -447692, 142051, 52628, -92227, -61756, 261030, 77440, -176887, 85761, 121573, 128150, -452346, 71558, 228180, -103790, -71851, 119760, -166427, -277297, -36464, -122822, -313161, 26726, -96774, -7710, 142909, -87262, 113816, -19633, 100750, 37758, -156343, 17095, 214271, 147899, -162769, -96880, -167331, -332802, -88614, -82959, -69918, -62097, -95843, 217806, 16062, -190956, -76766, 43233, -173350, 241767, 38662, -95326, -127970, 76980, 139850, -13784, -194107, 94549, 35322, 17126, -23144, -181918, -40994, 46422, -164221, 123497, -180366, 19463, -398150, -160492, -480857, 50151, 34324, 69019, -210167, -43744, -218848, -514088, 131380, -146357, -168064, -94754, -3629, 125386]
18180e6097H8658A7211J24586a03484p6729C6238g7935c2437A65417e5936K4997
18169c0939C28387d8239A31960N620a29394G2482c88562j0892C9053M7969R8546
18158A85568c8840A58245b73413h494B83580a80985O8697G4179a33350D3648a88443
18146C7690l192J16117c0602a3861j73128N1691A56381a33305A15491B9697b63806
18134c427H560b94956A13898b80331J28211c9224A25429K32230e6836j01657G7253
18122e5795A87856o5498b27652P1114l13222K01696b6028l22784A66861E8894
18111a21147B12119a89583j0688G0459R15a36551c7854j60902J64c4923J0003
18100b4920j86766m8634p5101A09514K23671j24010b03295B73966d5001k20290
$$ y = [-56097, 88658, 17211, 141797, -103484, -180213, 36238, -77935, -32437, 165417, -55936, -30939, 328387, -48239, 131960, 137580, -129394, 72482, -388562, -399454, 39053, 87022, 185568, -38840, 158245, -273413, -8494, 283580, -180985, -112288, 74179, -133350, 43648, -188443, 37690, 34498, 150615, -30602, -13861, -186989, -135298, 156381, -133305, 115491, 29697, -263806, -3427, 8560, -294956, 113898, -280331, -152120, -39224, 125429, 357659, -56836, -158493, 77253, -55795, 187856, 122358, -227652, -156538, -469760, -268064, -26028, -348812, 166861, 58894, -121147, 212119, -189583, -200271, 70459, 71374, -136551, -37854, -198756, -198592, -34923, -24920, -211686, -260320, -335421, 109514, 333185, 209175, -203295, 273966, -45001, -265291]
18090b65291A18308J56029r0441c36104J26814c9327A82497b51194C54751A21874
18079a32336k16387A46703m9191J05538J97494j75988c6390j16442l6566C92378
18068C26312c34701b5715j68961C3398a17532N4298A4233c5175C9490K4505J15668
18057A79663G0177O492c20001D9015a63362p2851F4311i4801j19359L2368k7405
18046b09197A699L1358d107A20602a24612B37464q4020a46164G4262j1930J03631
18035A65963a04125j14992N8544q2335H2872a0252j86661Q7115c8508j29070l3474
18024b01052h0221K9708l27714C0154e2129k68669B49419G4555b36960J03812
18014a33148e279m3534l22288j58610J02560a14766k99931A57381N3637Q6577
$$ y = [-265291, 118308, 274337, 183896, -336104, -209290, -39327, 182497, -251194, 354751, 121874, -132336, -348723, 146703, 97512, 203050, 400544, 224556, -36390, -152832, -189398, 392378, 326312, -334701, -25715, -194676, 33398, -117532, -63234, 14233, -35175, 39490, 63995, 179663, 70177, 76669, -320001, 49015, -163362, -236213, 64311, -94801, -214160, -181792, -209197, 1699, 33057, -4107, 120602, -124612, 237464, 153444, -146164, 74262, 62332, 165963, -104125, -219117, -160573, -242908, 82872, -10252, -196913, -109798, -38508, -167578, -201052, -80221, -50513, -378227, 30154, -52129, -320798, 249419, 74555, -236960, -133148, -5279, -48813, -371101, -529711, -427151, -114766, -414697, 157381, 211018, 297595]
18004B97595E4685i9907a0924q6700k82937D1627a0580B1580e6445K2902A43737
17992H3308K29870A26454J35544F1330a72371C55934A28038j8393d1688A1136
17981b00380c2914I0315K1663J46139A9650a74020C1518b11809I6469D0115b46635
17969C4851h1283f788F1072A3314m950b94921B3243g3991I9741C6509e05984C7319
17956B7822J69009b89489a21552H002a93145M747K6021A08248d20265f6949O461
17945f0488a5509r6765j99036B57549a82186B330a00937r1913a1757j0214G1923
17933e1254j0529A38063K33739i2547L5404j07843R657P149k45293c3689B77057
17921a46050B62784p9201a67510j96435C947Q4684a64197K0097B9259a1449j60055
$$ y = [297595, 54685, -99907, -10924, -97624, -380561, 41627, -10580, 21580, -56445, -33543, 143737, 83308, 313178, 126454, 261998, 61330, -172371, 355934, 128038, 109645, -41688, 11136, -200380, -32914, 90315, 111978, 258117, 19650, -174020, 31518, -211809, 96469, 40115, -246635, 34851, -81283, -6788, 61072, 13314, 8364, -294921, 23243, -73991, 99741, 36509, -505984, 37319, 27822, 196831, -289489, -121552, 8002, -193145, -188398, -162377, 108248, -420265, -66949, -60488, -15509, -112274, -311310, 257549, -182186, 2330, -100937, -192850, -11757, -21971, 71923, -51254, -61783, 138063, 371802, -92547, -57143, -164986, -155329, -148180, -393473, -33689, 277057, -146050, 262784, 183583, -167510, -363945, 3947, 88631, -164197, -144100, 29259, -11449, -171504]
17910a71504j33690a06713l2642C24638A14755a9374D4086b2574m7571j25468
17900a95613D9166J25806b12663B69839i1055C6017J45581a94297B97319d2612
17889B26405j04924a30109G7408B5316l439M8432P8351A7245J62014p696b80265
17877b16596g3698R508m7683M9564j54743G5809J76454c50778A03862c13227A9110
17865a39830b8592r4960A07000D7231j9111b13057O5120I7177b50234B69186j14229
17854A54957B905J94209a85475F893J02685J67100a59999e4661q0621h79p7534
17843g8413q6519F9812i1174j71057j1916F9914a32787j13949h6219D6045b8102
17831a6510A33749l8579b04594e9777k2308A06190a61396D8672J9516b10439F8605
$$ y = [-171504, -305194, -106713, -139355, 324638, 114755, -19374, 44086, -22574, -70145, -195613, 49166, 174972, -212663, 269839, -91055, 36017, 181598, -194297, 297319, -42612, 226405, 121481, -130109, 77408, 25316, 21877, 70309, 148660, 17245, 179259, 171563, -280265, -216596, -73698, -64190, -111873, -62309, -217052, 75809, 252263, -350778, 103862, -313227, 19110, -139830, -28592, -123552, 107000, 47231, 28120, -213057, -147937, 97177, -250234, 269186, 154957, 2905, 197114, -185475, 6893, 109578, 276678, -159999, -54661, -135282, -879, -78413, -164932, 69812, -91174, -262231, -274147, 69914, -132787, -246736, -86219, 46045, -28102, -16510, 133749, 95170, -204594, -59777, -82085, 106190, -161396, 48672, 68188, -210439, 68605]
17819A92065a58152K2480A44312b155k72736O2716A57549J0326f6887K7864k92256
17808c31279B79774i6565I2150R8064a70899d6917A72635A1579g3643B2741a27716
17796e9877A58625a21045n5060A40641B2827c848C12327a45761j01284I6890J42036
17785B38926D6572a52209m1127B1564K98531b3605q7266I3110f6606H0949b5250
17773a11566F6193a96123G8030d6198l7026q0904g2140A61044D0639O1954b6394
17761A9274q54a04878I6126g437B58697A25869h4172c670A9779b41499G7128a59435
17748i5729o0313H0259b22561n7138e9572j8009b6702j40175K3220J3207A9292
17736C4069K29301g2885k0750q9135h041j91069m7787f6711A45456M0671a49897
$$ y = [192065, -158152, -135672, 144312, -2155, -274891, -212175, 157549, 167875, -66887, -39023, -331279, 279774, -96565, 92150, 190214, -170899, -46917, 172635, 11579, -73643, 22741, -127716, -59877, 158625, -121045, -176105, 140641, 22827, -3848, 312327, -145761, -247045, 96890, 238926, 46572, -152209, -193336, 21564, 320095, -23605, -110871, 93110, -66606, 80949, -25250, -111566, 66193, -196123, 78030, -46198, -83224, -164128, -72140, 161044, 40639, 102593, -26394, 19274, 18420, -104878, 96126, -7437, 258697, 125869, -84172, -3670, 19779, -241499, 77128, -159435, -95729, -156042, 80259, -222561, -279699, -59572, -77581, -26702, -166877, -143657, -130450, 19292, 34069, 263370, -72885, -93635, -182770, -8041, -199110, -246897, -66711, 145456, 186127, -149897]
17724b03905L3232g7053B19851C9272h6516c3700C707K10342b01809H2933h6830
17712d4897C7500L5520K61083A17730b46302I3900c42284B21278a28094A21608
17701b32254H121J53217c5233C4668J46584e6351E1395k2571K70J39797J1853
17690A80744a71982A99360o6444a18840A39916O5700a19258A40282J22559p3795
17680A89046i3414E5000K36766j28047J03425j17667a72862B5781J60004G7727
17669A41922G221R3224K38222b26910K9832D5859a44516B25601B387c6880A53611
17657e5165D2901j4054P7334J28489E0113O2681B6537a38093c5161E6774b6534
17645G1640J50960o0086k4504b61207B57241J63235A53196c6319D250a2004A10695
$$ y = [-203905, -170673, -77053, 219851, 39272, -86516, -33700, 3707, 214049, -201809, 82933, -86830, -44897, 37500, 73020, 334103, 117730, -246302, 93900, -342284, 221278, -128094, 121608, -232254, 8121, 161338, -35233, 34668, 181252, -56351, 51395, 28824, 29094, 168891, 180744, -171982, 199360, 132916, -118840, 139916, 205616, -119258, 140282, 262841, 189046, -93414, 55000, 291766, 163719, 267144, 149477, -172862, 25781, 185785, 77727, 141922, 7221, 100445, 338667, -226910, -197078, 45859, -144516, 225601, 2387, -36880, 153611, -55165, 42901, 28847, 106181, 234670, 50113, 112794, 26537, -138093, -35161, 56774, -26534, 71640, 222600, 162514, 138010, -261207, 257241, 420476, 153196, -36319, 4250, -12004, 110695]
17633d2687k0738C15877i48A56163a08411E013L5630b6062B98874e1033k2881
17622g3914C69350A28500E668K35623k281h7863G3317K91727a12676q0138j69884
17611c62698a32251D443M7301b41459c9999b427A48930L2020L1003b609A68339
17599A46414a36655j02993A46914K8223c18775G2039a6915B6748i2586a4620I9298
17587e3194E184c18495A49027l6078b31852B04047a23962M6531p4362c960A03514
17575d3694D1579a95242k3605D1662g6180B46561i5494A69567a7278D01092j19029
17564B82063i2948B6061a75532F8622I447e8182l1190A159L79997f0309D11122
17552a653B974Q5689b09212I4157j241k5003J5834h1902L876G5942P4795J34048
$$ y = [-42687, -63425, 315877, -948, 156163, -108411, 5013, 40643, -26062, 298874, -51033, -73914, 369350, 128500, 5668, 241291, 239010, -87863, 73317, 365044, -112676, -192814, -362698, -132251, 4443, 51744, -241459, -39999, -2427, 148930, 180950, 211953, -2609, 168339, 146414, -136655, -239648, 146914, 175137, -318775, 72039, -16915, 26748, -92586, -14620, 99298, -53194, 5184, -318495, 149027, 112949, -231852, 204047, -123962, -77431, -151793, -3960, 103514, -43694, 41579, -195242, -218847, 41662, -76180, 246561, -95494, 169567, -17278, 401092, 282063, -92948, 26061, -175532, 68622, 9447, -58182, -89372, 1159, 381156, -60309, 411122, -1653, 2974, 88663, -209212, 94157, 92916, 67913, 83747, -81902, -78026, 75942, 150737, 284785]
17540B84785b23926F5103a06218A4760K1584K40140a19674l5306K1105K4377a0541
17528D1448K59356q8471a69665A95470H8657e0384B43854q7671F8592k1327R6514
17517A43779D1282O9880h8147k9796B67345n7739J63792C8136O6652A7982J6034
17506C4016K16627g2766B86919c5106j54298G9701b0078I2079a46818A52023J83317
17495C35340D6632J46156g3742A49653e8089C20179j27356c16771a34675B58375
17484a04748B60948a97086A86655l8434J69663j05332F2969J19091l8369J98405
17474C42096j56446n2533B8231J92968a99657i5799D0541f2487A60847D1012a3891
17462B236R8930D0801K25101b8780e511B42516j13830c9597A11067L02950j80192
$$ y = [284785, -223926, 65103, -106218, 14760, 36344, 276484, -119674, -154980, -133875, -109498, -10541, 41448, 300804, 212333, -169665, 195470, 88657, -50384, 243854, 156183, 68592, 47265, 143779, 41282, 111162, -88147, -117943, 267345, 209606, 373398, 38136, 104788, 17982, 34016, 250643, -72766, 286919, -35106, -189404, 79701, -20078, 92079, -146818, 152023, 335340, 46632, 192788, -73742, 149653, -58089, 320179, 192823, -316771, -134675, 258375, -104748, 260948, -197086, 186655, 148221, 317884, 212552, 62969, 182060, 143691, 342096, 185650, 133117, 28231, 221199, -199657, -95799, 40541, -62487, 160847, 41012, -13891, 2236, 101166, 40801, 265902, -28780, -5511, 242516, 128686, -39597, 111067, 414017, 233825]
17451B33825e6121I2154J1103R4465F2947K30422I8953J85303D6287K76132J4636
17440C37055C5814P6105K02690j4777A46486J16285a88477C1589a2188C22498
17429H9461J47680J64712j86600J28409l039p2620K33553A8467K50227j31681
17419A37013O9954j6681M19703E7266K93465H4051J69561B6272J85758O7764R0962
17408C70756A8581A155L371f2288a7847B32033r2707l141L30616j50434a63319
17396A86202J36064G4612a42377A19526Q2128l7791b30371B9510b7799A52852
17385b9124B14241A6994N15977A22597K25830E9230K84222A8717J33920R8011
17375B50648I8821i7683G1181M7156h2431B05267b49916A21645b18466G2321J28046
$$ y = [233825, -56121, 92154, 103257, 197722, 62947, 293369, 98953, 284256, 46287, 322419, 337055, 35814, 111919, 314609, 299832, 146486, 262771, -188477, 31589, -12188, 322498, 89461, 237141, 401853, 215253, 343662, 340623, 268003, 501556, 18467, 268694, 137013, 206967, 190286, 609989, 57266, 350731, 84051, 253612, 26272, 212030, 279794, 370756, 18581, 1155, 4526, -62288, -17847, 232033, 139326, 136185, 466801, 316367, -163319, 186202, 322266, 74612, -142377, 119526, 201654, 163863, -230371, 29510, -27799, 152852, -29124, 214241, 16994, 532971, 122597, 348427, 59230, 343452, 18717, 152637, 250648, 98821, -97683, 71181, 118337, -82431, 205267, -249916, 121645, -218466, 72321, 200367]
17364B00367K09362P1588a01704C3898L2588Q8221K5247c2499r7994A74643J15218
17353B89861j09970b1085Q739A49905j5092A413J51682K1973d7799J7637D1894
17341a04759D69529A88592R6273a32287B8076J86540L4430g6489A7907J74382
17331A92289K73478F6051N7617J92114f5196F2500b2420k05395B36040G5489R8529
17320A74018Q8660A23429j0983d8670B09182I6725d657G9220R6029D4353L13000
17309C57353A28032a5353A42020N560a56218A24599n5123f1054C49014j26580
17299B22434k360A10003K1480a71831n7505B86859l1448j25406B1194K39546I8489
17287G0606J64077j00318J28637F760J59666K8297I3729K53237H3348J48803L36155
$$ y = [200367, 409729, 481317, -101704, 33898, 66486, 154707, 179954, -32499, -130493, 174643, 289861, 179891, -21085, -12346, 149905, 134813, 1413, 153095, 175068, -47799, -30162, 41894, -104759, 469529, 188592, 284865, -132287, 28076, 214616, 249046, -76489, 17907, 192289, 465767, 66051, 123668, 315782, -65196, 62500, -22420, -227815, 236040, 75489, 174018, 262678, 123429, 112446, -48670, 209182, 96725, -4657, 79220, 175249, 44353, 357353, 128032, -15353, 142020, 147580, -156218, 124599, 69476, -61054, 349014, 222434, 220074, 110003, 131483, -171831, -229336, 286859, 255411, 130005, 21194, 260740, 98489, 70606, 234683, 134365, 263002, 6760, 166426, 194723, 93729, 346966, 83348, 232151, 568306]
17276E68306A11702K03848J4933A18506J80194a62467c5913C61018A06434L55348
17266D61782b8319B11048G3267c526E2490J84803H6419a86232G3449K9686J9745
17255A22880h174E64619e2216D10582i3182C24914l3692L4223A58421m6606g9653
17243F35643B67453A10583R6412Q6860J5614A48822A2787f9495A56261a1442A39418
17231h2843A15409D1547L31841O7280a27681E07248A12039J58902q4963K06019
17221C91997A04077M43569k50759J0238a85544C63230f1774A6340l825O126L9565
17210E8206J05871M69270l13791L4939B2976N88322B02181J2029d427l22192a52988
17198e6918B94047J77466H6800M54699I7284p549K42491j36736r648B6903K53965
$$ y = [568306, 111702, 315550, 330483, 118506, 298700, -162467, -35913, 361018, 106434, 461782, -28319, 211048, 73267, -3526, 52490, 237293, 86419, -186232, 73449, 103135, 122880, -8174, 564619, -52216, 410582, -93182, 324914, 291222, 325445, 158421, 111815, -79653, 635643, 267453, 110583, 206995, 293855, 309469, 148822, 12787, -69495, 156261, -11442, 139418, -82843, 115409, 41547, 373388, 440668, -127681, 507248, 112039, 270941, 185978, 391997, 104077, 547646, 296887, 307125, -185544, 363230, -61774, 16340, 12515, 18641, 58206, 164077, 633347, 319556, 354495, 22976, 611298, 202181, 214210, -4427, -326619, -152988, -56918, 294047, 471513, 86800, 541499, 97284, 89735, 332226, 195490, 185842, 26903, 280868]
17187B80868r4453M4556p0645p5905L39278A39445J03535m0190k7876D3591M11304
17176D54895j93403H2330J91323A01017g8045B25994M5997A06186J57383K09798
17166D73367L5580k26901j25607J26563F9520J83020K62150k40543j08918n2399
17156A12830K79802A81801J14906q4894K45150K41124A85508F1822M50945j16146
17146C96621j61970A02341J84233g5268C05043J72223A56335K13399P6847L2459
17136D79040a47072B74988J56555D3841M83240p6577j25627J30952B21688M6767
17126B68455K77248j49650j12709J97871J14753j37231J97156H0781K36480A32123
17115B70422M6612j20245L15743j73128l2190J3727J40148B5115N89437A79182
$$ y = [280868, 186415, 230971, 160326, 84421, 423699, 139445, 242980, 202790, 174914, 43591, 454895, 261492, 82330, 273653, 101017, -78045, 225994, 271991, 106186, 263569, 473367, 508947, 282046, 156439, 283002, 69520, 252540, 514690, 274147, 165229, 112830, 392632, 181801, 296707, 211813, 456963, 698087, 185508, 61822, 512767, 396621, 234651, 102341, 286574, -75268, 305043, 477266, 156335, 369734, 446581, 479040, -147072, 274988, 431543, 43841, 527081, 450504, 324877, 455829, 221688, 268455, 545703, 396053, 283344, 481215, 595968, 458737, 655893, 80781, 317261, 132123, 270422, 317034, 196789, 512532, 339404, 307214, 320941, 461089, 25115, 614552, 179182]
17104B57765G5096L22591k8417A25558L28626L57057k56391B30948L29394P6627
17094F36969N3446l9530B99057M20542j50744o6301A61664K47597L5410I1181
17083C81444j29147m2825N0505J06536o8590o9168L71145j87889N2906J53124
17073F18041n6188B67203K39266R7795B97932k8124J08436j77819P0922K62934
17063E34281j96044L37101B57781m5019M25283B92669J07464J20149r1841l1924
17053C96517O6119j76476L90457C15041J50903a0942D87485J56425O3493N5984
17043G63387k60504J47622m6185B55946P4247J04726j01467K76443k86768J90931
17033E14058K8212k29579L19209p933M5457j55534P3999K6752j0061N4896j01727
$$ y = [257765, 75096, 397687, 369270, 125558, 454184, 811241, 554850, 230948, 560342, 636969, 690415, 650885, 299057, 719599, 568855, 502554, 161664, 409261, 444671, 91181, 381444, 252297, 209472, 259977, 366513, 297923, 228755, 599900, 412011, 464917, 618041, 561853, 267203, 506469, 604264, 297932, 269808, 378244, 200425, 271347, 534281, 338237, 675338, 257781, 212762, 638045, 292669, 400133, 520282, 428441, 396517, 462636, 286160, 676617, 315041, 465944, -10942, 487485, 643910, 707403, 763387, 502883, 650505, 604320, 255946, 330193, 434919, 333452, 609895, 323127, 514058, 542270, 312691, 631900, 623967, 669424, 513890, 587889, 614641, 604580, 659476, 557749]
17022E57749P8447j7271j82622j23323K64052o8304o2170L84300j41608k06409
17012D82841L2290M4887P4709J46838p9038j90734K34447j18629r2659M8258K7171
17001F10381l5540R3446R0072j37766j85049P0964m0564K83997k88912K10129
16991F71158P8872L4598k82431L23840j17826k66076N44189J1474p1215k58986
16981F67597J92239k28562L29753j90221P9332J21805k99306j24863J05287L43492
16971I96553k32512k51667L40945O239j995K8551K65315n19812M39933k50335
16961H21215J64676k51549J62687j56203K82794M6593Q516k73978j412j05378
16951F97961J0614J81545K62814M5687M300j98645J96045l85140K80810J37358
$$ y = [557749, 636196, 618925, 436303, 312980, 577032, 508728, 446558, 830858, 689250, 482841, 515131, 560018, 634727, 781565, 702527, 511793, 746240, 627611, 534952, 583210, 610381, 574841, 668287, 758359, 620593, 435544, 506508, 465944, 749941, 461029, 671158, 750030, 784628, 502197, 826037, 708211, 442135, 986324, 997798, 926583, 667597, 859836, 631274, 961027, 770806, 850138, 971943, 672637, 547774, 653061, 996553, 764041, 512374, 853319, 859558, 857563, 886114, 1151429, 631617, 1071550, 821215, 985891, 734342, 897029, 740826, 1023620, 1070213, 1078729, 804751, 803339, 697961, 708575, 890120, 1152934, 1198621, 1202921, 1004276, 1200321, 815181, 1095991, 1233349]
16941A233349j39812j95540J36874k11218K9188J37714O8143K12641P5115K8335
16931A374789k78917L10784J77893m82718J31040J19684m1139l16502N42055m02621
16921A134348K71731k52611M53595k73087l07364M58386k09895K8682j02548K04812
16911A406049o0678L0460J43829k27734K41953Q2948k19668J71048k57473L64965
16901A675699l60034J32038J33328L8590m9476j20454J58452L90842k29603o4868
16891A704514K18237j15679k04459O075L339N32336n84147J23250J02022R6604
16881A882092o756k1493P9031R6481J42068p5887j13325K97776j10374N42828
16871B712441l24923n9956j69315l739M28666L975j20989R5544l89214O06443
$$ y = [1233349, 1093537, 897997, 1034871, 823653, 852841, 990555, 1058698, 1271339, 1346454, 1374789, 1095872, 1406656, 1584549, 1101831, 1232871, 1352555, 1311416, 994914, 1536969, 1134348, 1406079, 1153468, 1607063, 1333976, 1026612, 1484998, 1275103, 1303785, 1201237, 1406049, 1345371, 1375831, 1519660, 1291926, 1533879, 1616827, 1397159, 1568207, 1310734, 1675699, 1315665, 1447703, 1581031, 1619621, 1570145, 1449691, 1608143, 1998985, 1769382, 1704514, 1922751, 1807072, 1602613, 1608688, 1612027, 2144363, 1560216, 1683466, 1785488, 1882092, 1875336, 1853843, 1932874, 2029355, 2171423, 2095536, 1982211, 2279987, 2169613, 2712441, 2387518, 2327562, 2158247, 2154508, 2583174, 2587149, 2466160, 2561704, 2172490, 2778933]
16861B778933q4872p3512J87018J08423k52170J85808j45839K08657p9504K57562
16851C090504p3894q1891m4816K08786q3036J70008k85969O14038m13293K74418
16841C374855K4524m1591q5670J00432L98925r6530k89419M81125l11986K45577
16831C800242O0437K4982K78620p1348L31177o6374K36086k73409N18088K41572
16821E080073j48819k56945K95840J93271n1732J64522J46629k00719L20437K85295
16811E827852j31366N43815j99381N14096n65504M75164K90144j35365m4498N72168
16801G147125K44144L3907L79256Q7774J63336j27850O34588O4814K25008L49023
16791I201125K27671J4213K79206K25857Q6395K59602O60313J18933M43853j05750
$$ y = [2778933, 2694061, 2620549, 2807567, 2915990, 2663820, 2849628, 2703789, 2912446, 2832942, 3090504, 3016610, 2934719, 2889903, 3098689, 3015653, 3185661, 2899692, 3513730, 3100437, 3374855, 3399379, 3357788, 3272118, 3372550, 3771475, 3674945, 3385526, 3866651, 3554665, 3800242, 3860679, 3885661, 4164281, 4092933, 4424110, 4357736, 4593822, 4320413, 4838501, 5080073, 4931254, 4674309, 4970149, 5163420, 5111688, 5276210, 5422839, 5222120, 5542557, 5827852, 5696486, 6240301, 6040920, 6555016, 5989512, 6464676, 6754820, 6619455, 6574957, 7147125, 7391269, 7425176, 7804432, 7892206, 8055542, 7927692, 8562280, 8627094, 8852102, 9201125, 9428796, 9443009, 9722215, 9948072, 10034467, 10294069, 10954382, 11073315, 11517168, 11411418]
16781A1411418R57036Q1491O24771N6916N05856K47048N49541L77742K54399P22236
16771A5788454L63801Q01214O02331N66079J90681P47740P87103Q21385N42029
16762B1210817J175185O44903Q06397J226826N18055J317104J045580J314183
16754B9259050J085078J290340J768250J439258J461527J524541K053687J919755
16746D1801486K079277K583172K021299K613094L056116L044206K760754L480639
16738F3440043L517633L544303M356530M558828M997393M719902N585258N812137
16730A00532027O188077O357954O761581P040381O852771P527963P312254P035233
16722A55608241P448493O730732O131299N655831M743698L538620K772523J214551
$$ y = [11411418, 12368454, 12449945, 13074716, 13131632, 13637488, 13884536, 14434077, 14811819, 15066218, 15788454, 16152255, 16953469, 17555800, 18121879, 18312560, 19060300, 19847403, 20668788, 21210817, 22386002, 23030905, 23837302, 25064128, 25582183, 26899287, 27944867, 29259050, 30344128, 31634468, 33402718, 34841976, 36303503, 37828044, 39881731, 41801486, 43880763, 46463935, 48485234, 51098328, 54154444, 57198650, 59959404, 63440043, 66957676, 70501979, 74858509, 79417337, 84414730, 89134632, 94719890, 100532027, 106720104, 113078058, 119839639, 126880020, 133732791, 141260754, 148573008, 155608241, 163056734, 169787466, 175918765, 181574596, 186318294, 189856914, 192629437, 193843988]
16714A93843988K32613q00316k675248m074797m717373n555923o261853o675658
16706A63315433p318311p301243p874809p535746p161423p252840o881021o475447
16698A05514593n994474o146057n452368n237181m738640m471387m574169l545333
16690F5354984l683654l393272k713526l350454k639824k731877k190017k419760
16682D2232600k046579k113969j555601j971337j501716j252161j489151j560270
16674B8741816p59684j436692j418053r37091j176651p24566j125116m33888p67322
16665A9962753p78630n71857p81984n87146o33249o97650n70024l97650o37312
16656A4307251j4392q75639k1927o46917o03387k20656m33754p6863l29094m47725
$$ y = [193843988, 194076601, 193276285, 190601037, 186526240, 181808867, 176252944, 169991091, 163315433, 155997122, 148695879, 140821070, 133285324, 126123901, 118871061, 111990040, 105514593, 99520119, 93374062, 87921694, 82684513, 77945873, 73474486, 68900317, 65354984, 61671330, 58278058, 55564532, 52214078, 49574254, 46842377, 44652360, 42232600, 40186021, 38072052, 36516451, 34545114, 33043398, 31791237, 30302086, 28741816, 27982132, 26545440, 25127387, 24190296, 23013645, 22289079, 21163963, 20730075, 19962753, 19184123, 18612266, 17830282, 17243136, 16609887, 15912237, 15342213, 14944563, 14307251, 14292859, 13417220, 13395293, 12748376, 12144989, 11924333, 11490579, 11413716, 11084622, 10636897]
16646A0636897l48090N5021l40610m60949m65404j52168q0599l29578l40001M5233
16636H219752k82446n252m54345n95509M08579j65462m06364O4739j48476k20004
16626F415212j59435J6314j04893l73369l7248n39175L46234l97109J40911m68041
16616D839401L32794m12662p6300K42943p61168K48319P9103j80360j44518l49433
16606C818119M5972J70329P6247m5314k79982J98158j20506k74198J25630k20378
16596C494077l40002M22051m02491K34902n62056j984K98397m91225M66877p2087
16586C046459k37164o5675Q1207m0730j79708k6277K86136m21347j25602M9188
16576B366487K34158N0350m51368J50191L60260n36073M12689J81466n06917k25154
$$ y = [10636897, 10288807, 10343828, 10003218, 9542269, 9076865, 8924697, 8844098, 8514520, 8174519, 8219752, 7937306, 7932054, 7477709, 6882200, 7290779, 7125317, 6718953, 6783692, 6635216, 6415212, 6255777, 6272091, 6167198, 5793829, 5756581, 5217406, 5563640, 5166531, 5307442, 4839401, 5172195, 4759533, 4683233, 4926176, 4165008, 4413327, 4492430, 4312070, 4167552, 3818119, 3864091, 4034420, 4110667, 4065353, 3785371, 3983529, 3863023, 3588825, 3714455, 3494077, 3154075, 3576126, 3173635, 3408537, 2846481, 2844497, 3142894, 2651669, 3118546, 3046459, 2809295, 2743620, 2824827, 2784097, 2604389, 2578112, 2864248, 2442901, 2317299, 2366487, 2600645, 2650995, 2199627, 2349818, 2710078, 2174005, 2586694, 2768160, 2261243, 2036089]
16566B036089j62671J30598L7509K81537j84357p39060M23521J86229K8132M9719
16556B087246l3181k26915L0627J72162n6356q0091M6083k26648o3511j67503
16546A481913Q6061K38469k03265K56219l86106J1681l28168N30988J8636k77362
16536A429066k6763j92510J84756K52705n0352j12246P1429m54793K73542n7413
16526A317421L3348k28068K78591l25335J8406l8573L97454m06998L16870j53618
16516A209498m5138l8640m1916q2019M7980K3202j94534K49846J26705r7647m8857
16505A108480n6167j60147k27564J11226J37679Q8872k44100J09780K35592J59672
16495A263323j85265n4375j42595K23083l73857R1217J84752k66187l1974l7832
$$ y = [2036089, 1873418, 2004016, 2041525, 2323062, 2138705, 1399645, 1823166, 2009395, 2037527, 2087246, 2054065, 1827150, 1857777, 2029939, 1973583, 1893492, 1939575, 1712927, 1649416, 1481913, 1567974, 1806443, 1603178, 1859397, 1473291, 1484972, 1156804, 1687792, 1706428, 1429066, 1402303, 1209793, 1394549, 1647254, 1596902, 1484656, 1556085, 1101292, 1374834, 1317421, 1350769, 1122701, 1401292, 1075957, 1094363, 1055790, 1453244, 1046246, 1363116, 1209498, 1164360, 1125720, 1083804, 1001785, 1049765, 1072967, 878433, 1128279, 1254984, 1157337, 1108480, 1052313, 892166, 664602, 775828, 913507, 1002379, 758279, 868059, 1103651, 1263323, 1078058, 1023683, 881088, 1104171, 730314, 821531, 1006283, 740096, 708122, 670290]
16485F70290J90989j48776L73859m27962J97499J39188Q6337m66414K13499j58194
16475F70315k6644J47021j25534R2650J95555l7968k18854j34767L81893j26609
16465H17058j14959K53012k06321P1328J48819m17114j77236K20400j2289L00054
16455H82752m26907J65910J42835j31351k4554p6983A77752L38382p8016R1151
16445E29269j69226K73839l02545q7419L89375k07232K36227J02818j85591J33333
16435G12848m7848j19113q0012J89040l16423L63872q4803m390j56877K32493
16425F88787l29108l2013K46277A30155M62084B36094L85120k16617m8514L37123
16415F93206k33354j25463m0505q0696q655K48327q0067J58386A73223L71887
$$ y = [670290, 861279, 712503, 1086362, 658400, 855899, 995087, 1081424, 615010, 828509, 670315, 643671, 790692, 665158, 757808, 953363, 915395, 696541, 561774, 943667, 817058, 702099, 955111, 748790, 820118, 968937, 551823, 374587, 594987, 582698, 882752, 455845, 621755, 764590, 633239, 608685, 531702, 177752, 516134, 438118, 529269, 360043, 633882, 331337, 243918, 633293, 426061, 662288, 765106, 579515, 712848, 665000, 545887, 465875, 654915, 338492, 702364, 617561, 613171, 456294, 688787, 359679, 327666, 573943, 130155, 592239, 236094, 621214, 404597, 356083, 693206, 459852, 334389, 293884, 213188, 204533, 452860, 372793, 531179, 173223, 545110]
16405E45110A55700K69414j9353n3240K56220B21623G5448M18536j66767K06432
16395E33649J01608B25225M2168K68966j34066L27303l06960j23616L69543J9491
16385F88054J9945a8541C75515N9260j85889M6573A05284L70630J57526A13347
16374f59F7921b4327E21545k38038M24590C45633j7043K4590G5804O9783a1536
16362B60134H8724K90266A87156J54958j1579J21589J53057A20757N7163K19792
16352C97712j41868L35834K7793k38053b65099E05392B14309L0563M826l3028
16342B16670J22015K51566A50448O8584k5165O1760M8400j7732e633E7643K06950
16331B64593J68951n9632K3031r5719G4002a13063C63802n3828E5171J87670j18670
$$ y = [545110, 155700, 425114, 405761, 352521, 608741, 221623, 75448, 493984, 327217, 533649, 635257, 225225, 267393, 536359, 402293, 729596, 422636, 299020, 668563, 688054, 707999, -18541, 375515, 434775, 248886, 295459, 105284, 475914, 633440, 113347, -659, 67921, -24327, 521545, 283507, 708097, 345633, 328590, 353180, 75804, 145587, -11536, 260134, 88724, 378990, 187156, 342114, 330535, 452124, 605181, 120757, 177920, 397712, 255844, 591678, 619471, 381418, -265099, 505392, 214309, 244872, 249698, 216670, 338685, 590251, 150448, 219032, 193867, 255627, 304027, 286295, -5633, 57643, 264593, 433544, 373912, 396943, 301224, 74002, -113063, 363802, 309974, 55171, 242841, 124171]
16320A24171d5880C46098A38025K02740j14468J47265r100j33976J10471j08642
16310B32315j7972O8985H5027L5374J03785K59569A27669K39192A5812J60555
16300A76367J01113L7363J04399c1036B46981J13972n6350a82927f1116B87330
16289A26934J46033A29924k2361N4672J78088M3499l3974A70574j2201P8723o2007
16278A75089Q514C848M34543A15428i5446A68826P0663J95423B13371j4697q675
16267A89999D1441P700N8918K12674a80765B49491J991j13920N8015i1335C78979
16255a30794c8179F1207l474J53290n566J81079A86373h5292L4734E8060K21399
16244B79459o0745e872j52052A10508i3804H6301M02234k14987a36365B57568
$$ y = [124171, -45880, 346098, 138025, 340765, 226297, 373562, 364462, 230486, 340957, 232315, 214343, 283328, 85027, 120401, 224186, 483755, 127669, 366861, 15812, 176367, 277480, 314843, 419242, -31036, 246981, 360953, 304603, -182927, -61116, 287330, 126934, 272967, 129924, 107563, 162235, 340323, 383822, 349848, 170574, 158373, 237096, 175089, 183603, 3848, 438391, 115428, -95446, 168826, 239489, 434912, 213371, 198674, 189999, 41441, 49141, 108059, 320733, -180765, 249491, 251482, 137562, 195577, -91335, 378979, -130794, -38179, 61207, 57733, 211023, 205457, 386536, 186373, -85292, -50558, 58060, 279459, 218714, -5872, -157924, 110508, -93804, 86301, 488535, 273548, -136365, 257568]
16233D0953c8040E19308a0365A65455F0400K1487K51574G8141h5235G1526P687
16222G9213K39924j44937P9107K5018J33030C5768e7579I9948J98757D1812a85842
16210I8114K25961h7219A36701j9019A5996a35479C15707M8528b6481a0288A19193
16198B10536J96175h3731j6021B29953b88036m9061B37644B0646d95106B27239
16187B43038A08396K02302l2679K06609A08807a65141a4567q7812d3998q6934
16177a30932e7019E9103A8028G472J35230c2130H4063a11590m1055C47340o925
16166C40415a02033B2883N3760B9609c00697A0229c8936A98641N033c4906B85987
16154A12804a0300J925j3856A89792a8219j451A34248P3451c01046J26825B1797
$$ y = [40953, -38040, 519308, -10365, 165455, 60400, 81887, 333461, 78141, -85235, 71526, 79213, 319137, 174200, 253307, 278325, 411355, 35768, -57579, 99948, 298705, 41812, -185842, 98114, 324075, -87219, 136701, 117682, 15996, -135479, 315707, 364235, -26481, -10288, 119193, 210536, 406711, -83731, -99752, 229953, -288036, -337097, 237644, 20646, -495106, 227239, 243038, 108396, 310698, 278019, 484628, 108807, -165141, -14567, -102379, -43998, -130932, -57019, 59103, 18028, 7472, 142702, -32130, 84063, -111590, -152645, 347340, 340415, -102033, 22883, 76643, 29609, -300697, 10229, -38936, 198641, 203674, -34906, 285987, 112804, -10300, -8375, -22231, 189792, -18219, -19670, 134248, 207699, -301046, -174221, 21797]
16142A2005a46494C31448f5910p9916A91720I1593k2953a15060C32299a9455B76786
16130C67727a48939P207l3497I0462A071K47241f0763m3654C13764A6646L25505
16119C42151d3672E9849A8431R9146n8256a13651E144M2815B652K22695H4419
16107a38365C52240l3006e2840B68561A9398a604j46798r5121A7860K08394D9052
16095i6087n865j4599a1967k63635B40599d5678j89410b0939j04367C15309c8271
16083b4978j53905b8750B64461G5062J3346K52017d2405H592L56879b8016A74603
16071b3125B01452b07485e264C7010J47656A5010a73143K4255A62775B7856J75896
16060B03752K2720h1395B1073M1851d04696A06795r431a08189A38702C6501K5805
$$ y = [12005, -146494, 331448, -65910, -145826, 191720, 91593, 68640, -115060, 332299, -19455, 276786, 367727, -148939, -141732, -175229, 90462, 1071, 248312, -60763, -104417, 313764, 16646, 342151, -43672, 59849, 18431, 117577, 59321, -113651, 5144, 47959, 2652, 225347, 84419, -138365, 352240, 319234, -52840, 268561, 19398, -1604, -148402, -243523, 17860, 226254, 49052, -96087, -101952, -116551, -11967, -275602, 240599, -45678, -235088, -20939, -125306, 315309, -38271, -24978, -178883, -28750, 264461, 75062, 88408, 340425, -42405, 8592, 365471, -28016, 174603, -23125, 201452, -207485, -5264, 37010, 184666, 15010, -173143, -148888, 162775, 27856, 203752, 226472, -81395, 21073, 62924, -404696, 106795, 97364, -108189, 138702, 36501, 62306]
16049F2306b4694p2932C0849r524b25203d1460A04357c23199A60469K0135G3420
16037F7910e37127a58904A84778c2437D3147d615m617k29402d5681A1219Q2719
16026I3938b18953K7209N0847B3518Q1420B3986Q6869D3752K5151K47092a65195
16014c28557i8041A8797a92229p6763A00641b90589H6238J22942a76982e3620
16003F4401b2718k82545k2592B74582c9978l61122C2182d1236C588g0397A55463
15991A3114a46091A98311N0931e1802B6319J10400J34164j04331K00834p1831
15981B95555A37672N2360A303J18192J3953b8101j9334l2322b0356j07178B79186
15969a88220A05760f5988A2242a07078k120A71490k2503e2527A47626l5892m4199
$$ y = [62306, -24694, -97626, 30849, 21325, -225203, -41460, 104357, -323199, 160469, 180604, 73420, 67910, -537127, -158904, 184778, -32437, 43147, -4615, -9232, -238634, -45681, 11219, 93938, -218953, -191744, -140897, 23518, 104938, 23986, 110855, 43752, 68903, 315995, -165195, -328557, -98041, 18797, -192229, -268992, 100641, -290589, 86238, 209180, -176982, -53620, 64401, -22718, -305263, -327855, 274582, -39978, -401100, 32182, -41236, 3588, -70397, 155463, 13114, -146091, 198311, 249242, -51802, 26319, 136719, 270883, 166552, 367386, 295555, 137672, 190032, 1303, 119495, 133448, -28101, -47435, -79757, -20356, -127534, 279186, -188220, 105760, -65988, 12242, -107078, -109198, 171490, 148987, -52527, 147626, 111734, 67535]
15958F7535a37661G97a33497a5639m01288A18222K64831e8223B49034e5692A658
15946A36919b14824h9957n83550a66715a6178A97086a32458p2835m134d5425A23300
15934c79792J86313B90992b90592b5756B95380r3451r9043m6570a85729O1259
15924a24470K4672J744n2080K8087A9008a94701o7828d5019k40893A19441i8569
15912A34533F1542c1248p0255B13378b19346n053B05557E057b05650q2145B68570
15900b42324D2317b55847a25471L6951p222j59398c4897B9992b88017p4236c6675
15888c22384A22355a07995k49797A22489b41018P5728b4476A29430b3284k75540
15878b98824c4966m9284L9330C6228c76870a58609A8659c36846a35075k48884
$$ y = [67535, -137661, 797, -133497, -15639, -416927, 118222, 383053, -58223, 249034, -55692, 1658, 136919, -214824, -89957, -673507, -166715, -16178, 197086, -132458, -205293, -209427, -45425, 123300, -379792, -193479, 290992, -290592, -25756, 295380, 201929, 102886, 56316, -185729, -124470, -99798, -98054, -150134, -122047, 19008, -194701, -262529, -45019, -285912, 119441, -98569, 134533, 61542, -31248, -101503, 213378, -219346, -224399, 205557, 5057, -205650, -287795, 268570, -242324, 42317, -255847, -125471, -88520, -95742, -255140, -34897, 29992, -288017, -362253, -36675, -322384, 122355, -107995, -357792, 122489, -241018, -165290, -24476, 129430, -23284, -298824, -34966, -84250, -44920, 36228, -376870, -158609, 18659, -336846, -135075, -383959]
15868c83959A2381a65730j5517D1316a23154p6340P5608A08564d0385B49776E5113
15856C19142j33368E5821h1001k08935a37465k2145B58130f0547j64971i3276
15845i6254I0193J1290h176k9701j23406B5113M7408j8005q272a15329k0686L0452
15833a05563B30791A3979J12491b37327f4018C50600E9227H674c22911P644R9164
15822b16103i0492B06197j01527j4262h0669k12048A20996p471b14028R978b6996
15810c5462k00684g0556B96231a61131p5727A26307j4061d1409n496m4122q0310
15799a71337A61436a98044I3610g361B8614J32130Q6082j22836A9717c89954B29056
15787b66428J13736D5974g5408e585j20712d313j06842A12189b44493f0161j2602
$$ y = [-383959, 12381, -165730, -181247, 41316, -123154, -199494, -123886, 108564, -40385, 249776, 55113, 319142, 185774, 55821, -81001, -289936, -137465, -159610, 258130, -60547, -225518, -93276, -96254, 90193, 101483, -8176, -37877, -161283, 25113, 72521, 54516, 46244, -115329, -136015, -105563, 230791, 13979, 126470, -237327, -64018, 350600, 59227, 8674, -322911, -315267, -216103, -90492, 206197, 104670, 90408, -80669, -292717, 120996, 113525, -214028, -204050, -26996, -35462, -236146, -70556, 296231, -161131, -236858, 126307, 112246, -41409, -46905, -91027, -171337, 161436, -198044, 93610, -7361, 28614, 160744, 246826, 123990, 19717, -389954, 229056, -266428, -152692, 45974, -75408, -5585, -126297, -4313, -111155, 112189, -244493, -60161, -72763]
15776g2763J5791k00121d3759l31046c1516B7105M8595L39895d71221Q1921B3794
15764a8220m3314r5504A50307l9781K20863O0041b2096R644j55301Q2252A09272
15752b47546C9129a2044j26907C46465C323g1508G7889L7402C6380a39920e8300
15740h1546k12276A24478n0961b49527a12304L3034G1072k5513K26482b412C03511
15728A62238a94009C5260H075d7259j15317e7271G1915d42259A91485D8041J03417
15717A51458A0228J5895J30097a51517k97008C4407R4646b76707a16362j24424
15707b40786C19711d7965n2813j0159A11402b00768a5612j84501A89089h2363
15696C0570N7640j1139B9666K85123A32835J4469J57044g390C5780b39316A14003
$$ y = [-72763, -56972, -257093, -43759, -374805, -31516, 27105, 75700, 415595, -471221, -389300, 23794, -18220, -61534, -157038, 150307, 110526, 331389, 391430, -22096, -12452, -167753, -85501, 109272, -247546, 39129, -12044, -138951, 346465, 3323, -71508, 77889, 115291, 36380, -139920, -58300, -81546, -293822, 124478, 73517, -249527, -112304, -79270, 71072, 45559, 272041, -2412, 303511, 162238, -194009, 35260, 8075, -47259, -162576, -57271, 71915, -442259, 191485, 48041, 151458, 10228, 26123, 156220, -151517, -448525, 34407, 129053, -276707, -116362, -240786, 319711, -47965, -100778, -110937, 111402, -200768, -15612, -200113, 189089, -82363, 30570, 88210, 77071, 29666, 314789, 132835, 147304, 304348, -7390, 35780, -239316, 114003]
15684B17757d5458D5047d55811c3913k41506A1099a04059j12419A663N64649b4179
15672D0935K35656B9184E019L07661I4315K520K5691O7621b088G3480c59706F4722
15659b07026h5636b9912k76117E5674a64492C173b16104g9400L6962A17535f38257
15647B4122J67505a08638j50019E2246a31979k18820B70966f0337A49154a5455
15636b6485A6235M5149H627b73924a6494B57322a69561a5911n96451K98689C0636
15624A74171a77500j0808h0641r2799e9674A60446n2589l1690a8576k39500E7315
15612A33559c54279Q9913J20794A19843b3952D9234J41284a56875A85667a33213
15601c0550j32829C86282e6131q9293j9449c7775a0692j46578p5272C48948a37781
$$ y = [217757, -45458, 45047, -455811, -33913, -275419, 11099, -104059, -216478, 1663, 566312, -24179, 40935, 276591, 29184, 5019, 312680, 94315, 96835, 122526, 190147, -2088, 73480, -359706, 64722, -207026, -85636, -29912, -306029, 55674, -164492, 3173, -216104, -79400, -42438, 117535, -638257, 24122, 191627, -108638, -258657, 52246, -131979, -350799, 270966, -60337, 149154, -15455, -26485, 16235, 61384, 8627, -273924, -16494, 257322, -169561, -15911, -612362, -313673, 30636, 174171, -177500, -188308, -80641, -173440, -59674, 160446, 107857, 76167, -18576, -258076, 57315, 133559, -354279, -264366, -143572, 119843, -23952, 49234, 190518, -156875, 185667, -133213, -30550, -163379, 386282, -56131, -145424, -164873, -37775, -10692, -157270, -232542, 348948, -137781]
15589a2055A22361a72792g5971A22990H099K40834N4079A34856J12177h3199J3095
15578g0104B8342d33554a80174K7033B51365P2726h2421l13649f7816K4443B5868
15566a13673e2754A25177b47036a9698q7499A09716h7662J9324m08908b0597A07965
15554h4282D1107c97097a97933k15719F4654b64849a7289k7311j62284j57269
15544c64153A22464a44595m7683B93062G0005K61525C5281o972K91302a04606
15533A94897b15184c1404B47448D6163a91395G8981J56864P2239C9276P6418a17117
15521A54276J41768A11133E0237a85423B45338a60482J5916A0468a03895b890
15510A93155l648e77794g4165F6786i5653n8206j80888A95120b06945L3385c6647
$$ y = [-12055, 122361, -172792, -75971, 122990, 8099, 248933, 303012, 134856, 247033, -83199, -70104, 28342, -433554, -180174, -153141, 251365, 324091, -82421, -396070, -67816, -43373, 25868, -113673, -52754, 125177, -247036, -19698, -107197, 109716, -87662, -68338, -477246, -20597, 107965, -84282, 41107, -397097, -197933, -413652, 64654, -264849, -17289, -44600, -206884, -364153, 122464, -144595, -192278, 293062, 70005, 331530, 35281, 28309, 319611, -104606, 194897, -215184, -31404, 247448, 46163, -191395, 78981, 235845, 308084, 39276, 115694, -117117, 154276, 296044, 111133, 50237, -185423, 245338, -160482, -144566, 10468, -103895, -2890, 193155, 189507, -577794, -74165, 66786, -95653, -153859, -334747, 195120, -206945, -173560, -36647]
15498b64712A20182a83752O7728C38578A08635n973b41616B94905I1452h8992
15487A7160M1242N092a05144D3683A317R9750l775g0213k13464a25664B2813K83264
15475C06077a57786L5242L8959B60367K5356g2195l545D8780a7558F1445a40251
15463a53987j42132M9076A18699a14094A53630d6500G2910c82769P5084a29714
15452c91829B23878b2248r2069A31674E2817b41110j01888J61117C60382b38951
15441b16223G0972a99305H2449c2997B67746A40J51627a52101O555e1887B33068
15429a39815H143J43762K47291a4796m056k7461A31776f7247B1131J84264K6722
15418B32117m6443D5667J0784a11230k09658C2599f8339k05324A81896f7235j77163
$$ y = [-264712, 120182, -183752, -116024, 338578, 108635, 102662, -241616, 294905, 91452, -88992, 17160, 58402, 63494, -105144, 43683, 1317, 101067, 97292, -70213, -283677, -125664, 22813, 306077, -157786, -122544, -83585, 260367, 285723, -72195, -75740, 48780, -17558, 61445, -140251, -153987, -296119, -247043, 118699, -114094, 153630, -46500, 72910, -382769, -307685, -129714, -391829, 223878, -22248, -114317, 131674, 52817, -241110, -342998, -181881, 360382, -238951, -216223, 70972, -199305, 82449, -32997, 267746, 140, 151767, -152101, -145546, -51887, 233068, -139815, 8143, 151905, 399196, -14796, -18852, -46313, 131776, -67247, 21131, 205395, 232117, 185674, 45667, 56451, -111230, -320888, 32599, -68339, -273663, 181896, -67235, -244398]
15407b44398A55699h054C09518A12334J70790L06129e574G0012O1937b20416H2103
15395a83018K4419G9567K9331J1855N3412L7644K3488c1411B1130L3543a23751
15383g3655l6188M5192p4927H9680b16860J02338C655a87554J791C9595c15334
15371A5317b40636J5764i4406a5193l00632J54575m8021A85276i3675j97097A78236
15359b62044J02632B59196g9546L9478A06787L70078i4125I3129a60720A7743
15348D5408j2830K5714L52030A62751c69477g7133r197a0434j55715H7909K03594
15337B91503r5975c9341A38279J31010a90471q0221H5858O5212Q2465J3662b15530
15325A49729j803a833H7804b68817f1873D01283b48822B18172Q6828G8910a89582
$$ y = [-244398, 155699, -8054, 309518, 112334, 283124, 589253, -5574, 70012, 131949, -220416, 82103, -183018, -158599, 79567, 108898, 120753, 174165, 211809, 235297, -31411, 21130, 54673, -123751, -73655, -109843, -64651, -139578, 89680, -216860, -114522, 3655, -187554, -185763, 39595, -315334, 15317, -240636, -224872, -94406, -15193, -315825, -161250, -209271, 185276, -93675, -290772, 178236, -262044, -159412, 259196, -79546, -40068, 106787, 476865, -94125, 93129, -160720, 17743, 45408, 32578, 58292, 410322, 162751, -369477, -77133, -86330, -10434, -166149, 87909, 291503, 195528, -39341, 138279, 269289, -190471, -270692, 85858, 151070, 233535, 247197, -215530, 149729, 147926, -1833, 87804, -268817, -61873, 401283, -248822, 218172, 305000, 78910, -189582]
15313f4310k97848A81782h1709d0273B36139A14426d7421j56130E8547a81871
15302f8911b1489F7103A5894a6415A39409a0807B2316q252i5233B00213O4089
15291B64302H8184J4663L335e476j87545H44b124B2714J88100i7083B24102b7642
15278e4801A67564N0574A06262G447a01241J2811k76432a49793k4245e4274J7974
15267c6300k08004C19567a34120c7970C1919a730C74145j85206c4923C2582e7369
15255b6458A03416K94947A74488B1117E449J02749N95490M79022N61352l61761
15245A382301J23973n79430i047A6353L95783g9495D69192a0772H7551K56987
15235C44538A42614n1768J09363c01083I5668A0970J78598N10l8520a16738B90850
$$ y = [-64310, -362158, 181782, -81709, -40273, 236139, 114426, -47421, -203551, 58547, -181871, -68911, -21489, 67103, 15894, -16415, 139409, -10807, 22316, 14064, -95233, 200213, 264302, 88184, 102847, 106182, -5476, -193021, 844, -2124, 22714, 210814, -97083, 224102, -27642, -54801, 167564, 218138, 106262, 7447, -101241, -88430, -364862, -149793, -174038, -54274, -36300, -244304, 319567, -134120, -37970, 31919, -1730, 374145, 188939, -34923, 32582, -57369, -26458, 103416, 398363, 174488, 21117, 5449, 108198, 703688, 1182710, 1744062, 1382301, 1506274, 926844, -9047, 16353, 412136, -79495, 469192, -10772, 87551, 344538, 142614, 90846, 200209, -301083, 95668, 10970, 189568, 190078, 151558, -116738, 290850]
15223C6255c8126D35040B11416l3091a32978e4910j24747H9753a27750L9523D3972
15211b73176D079R3554K92791E168a90455B4023J68018c4736n2369A39743J361
15200A41104b80327A56597b37666J16500j35094a03590E26167A45934o6177K78788
15190C58545A37239C7366N2975d0207E8652J69520C2805N52764a76689A67353
15179H0838J92761C6182c06380f5417k2639L1337b7001m2458A72278a26656A66349
15167a68491b9595A21204l6892O3678j29k6433E3035a46007c7265D9030K42107
15156B91137H5811C2774i0613A78342k381A2272e4489C8128a491F2180J16211
15145A78391J6764J5132l9715a02112n7119l1181B16717a52468G9207M6551O4779
$$ y = [36255, -38126, 435040, 211416, 178325, -132978, -54910, -179657, 89753, -127750, -88227, 43972, -273176, 4079, 97633, 390424, 5168, -190455, 24023, 192041, -34736, -87105, 139743, 141104, -280327, 156597, -237666, -121166, -256260, -103590, 526167, 145934, 79757, 358545, 137239, 37366, 90341, -40207, 58652, 228172, 32805, 585569, -176689, 167353, 80838, 273599, 36182, -306380, -65417, -88056, -56719, -27001, -69459, 172278, -126656, 166349, -168491, -29595, 121204, 84312, 147990, 147861, 121428, 53035, -146007, -37265, 49030, 291137, 85811, 32774, -90613, 178342, 175961, 12272, -54489, 38128, -1491, 62180, 178391, 195155, 210287, 170572, -102112, -159231, -190412, 216717, -152468, 79207, 125758, 190537]
15134A90537a8015F0878J09271K6780A4060b09086d9206B97403A19673K56938
15124C76611A81599D2253J70933q3211K29588j49241N6006b3149r3594B20336
15113A57689L2767J68321j18776b44394A10174J96672A36754j0910B3657K5965
15103D9622N1388a17512A63190o0310b9088k6076A66361J11465p4481e0036A07114
15091D6029j6070b9669n4999K7833A83585r0251L5656o0979R2740P3551M840E846
15078A31900g0050A85532F4081b29429A76564K38557j48869m9944j7066N5280
15068B54522R3398j29180n6260l1036P0225R4735j10219K37696a15886J0167F6494
15056A87419h9860c7520C57980b4728n469D83167A50858F9214j3320c4268B49291
$$ y = [190537, -18015, 60878, 170149, 196929, 14060, -209086, -49206, 297403, 119673, 376611, 181599, 42253, 213186, 129975, 359563, 210322, 266328, -23149, -116743, 220336, 157689, 190456, 358777, 240001, -244394, 110174, 306846, 136754, 125844, 23657, 49622, 101010, -117512, 163190, 102880, -29088, -55164, 166361, 277826, 203345, -50036, 107114, 46029, 29959, -29669, -84668, -56835, 183585, 93334, 128990, 68011, 160751, 234302, 239142, 5846, 131900, -70050, 185532, 64081, -229429, 176564, 415121, 266252, 216308, 199242, 254522, 347920, 218740, 162480, 131444, 201669, 296404, 186185, 423881, -115886, -105719, 66494, 187419, -89860, -37520, 357980, -24728, -30197, 483167, 150858, 69214, 55894, -34268, 249291]
15044C47542a0046B83630q8518k6889D2027K26848d5341H8859j8839M12283A94383
15032A75952M1513A01943D7689c343A28578J34229k5428c59689F59648I6769L09465
15021D06234F941M51248E889a40875j56024C70287l600A01406L40437B79K02565
15010B02844E6949a390C24333A44308K8071J80820l6786D1402J16090d83124F6345
14998E2325J95983N2437j37040l6786K50763A57140A2103P4796O5038j8963p275
14987A25699n0498K37268K5133j51235K30417h7662C42082p4285D7106K02898
14977B50004l4258N6549j32945D0206i2948A61177J32992E7293K2716L04070F3414
14965B88066A15060m4088J73548n8820L03105C1030K07333N1311L65139k32207
$$ y = [347542, -10046, 283630, 195112, 168223, 42027, 268875, -45341, 88859, 70020, 482303, 194383, 175952, 217465, 101943, 47689, -3343, 128578, 262807, 237379, -359689, 659648, 96769, 406234, 6941, 458189, 5889, -140875, -296899, 370287, 366687, 101406, 441843, 279, 202844, 56949, -1390, 324333, 144308, 172379, 353199, 316413, 41402, 157492, -483124, 66345, 52325, 248308, 300745, 163705, 126919, 377682, 157140, 12103, 86899, 151937, 132974, 125699, 75201, 312469, 337602, 186367, 416784, -87662, 342082, 267797, 47106, 250004, 215746, 272295, 139350, 40206, -92948, 161177, 294169, 57293, 80009, 384079, 63414, 288066, 115060, 70972, 244520, 185700, 488805, 31030, 238363, 289674, 654813, 422606]
14955D22606l5407I2876J84102c6471B23655N3885J2803F1547J6558M8286K2867
14944A49258A5130L08026A30449L18610l8740A53453c2683A32035J66283A40705
14933B62777L97489I389J58567k9226E4014L77638p1093N3904k8854j15124A01515
14921C45670m8283j05246J36642p8442J71874m9163j42718H107K50002j04585
14911A53524K75832P8632J32280B80465I1956L46721J61311A45818L34246C0325
14900C0408M7412P3041K29120A76752M05576k31390K31186A04778L35389p0520
14890C69647Q5885j46814J63850A7559M17962O7594j42719O7212j11158j43344
14880A73106J95167H3007l694M81416j88543j25309M4320L19734j34826A96054
$$ y = [422606, 387199, 92876, 276978, -36471, 223655, 277540, 290343, 61547, 78105, 126391, 149258, 15130, 323156, 130449, 449059, 410319, 153453, -32683, 132035, 298318, 140705, 262777, 660266, 9389, 167956, 138730, 54014, 431652, 360559, 414463, 385609, 270485, 101515, 345670, 297387, 192141, 328783, 250341, 422215, 373052, 230334, 8107, 258109, 153524, 429356, 507988, 640268, 280465, 91956, 438677, 599988, 145818, 480064, 30325, 30408, 77820, 150861, 379981, 176752, 582328, 350938, 582124, 104778, 440167, 369647, 455532, 308718, 472568, 17559, 435521, 503115, 360396, 427608, 316450, 173106, 368273, 83007, 79313, 560729, 372186, 246877, 291197, 610931, 476105, 196054]
14869B61672J20599Q4468B20976J80337K58228k73244J31854D815J46416k1580
14859A29651L42708A85521M28828k18791M021R4122e9318F25606D4483L83546
14849D28029m5735J35927o0762j88003L6605L65640f036A30119N78682j18194
14839E90607A33011k0383N44467r7044N643k01263j33172J56661o0263R0328j93812
14828B24173N28868B05455K78864j45946l393p6863M86840j09721k54394P1210
14818D52052p1012k7497I7669L82624r7390L29219B89284L87698C30545J40010
14808D70555J55950j5113B91956K20764K16568j77437k19104J50051L76941B24308
14797D84251l4596N482k0178p4424J58107q0753m5762P203r509P71M9646J21015
$$ y = [261672, 382271, 466739, 220976, 401313, 659541, 386297, 518151, 4815, 151231, 129651, 472359, 185521, 614349, 395558, 399579, 493701, -59318, 625606, 44483, 428029, 382294, 518221, 457459, 269456, 306061, 671701, -6036, 130119, 708801, 590607, 133011, 112628, 657095, 560051, 565694, 364431, 231259, 387920, 327657, 417985, 224173, 753041, 205455, 484319, 338373, 334980, 258117, 744957, 635236, 380842, 452052, 381040, 353543, 97669, 480293, 382903, 712122, 289284, 676982, 330545, 470555, 626505, 611392, 291956, 512720, 729288, 551851, 332747, 482798, 859739, 224308, 484251, 449655, 455137, 434959, 360535, 518642, 437889, 392127, 399330, 389821, 390592, 440238, 561253]
14785E61253j3356l7225j29571K08894K80586j8464C55801n1471K03466L40910
14775H48706M0327D32674o7150L6253N1681K01351C11028K71824o7918j4557M3417
14764E43794l6170Q8115k5743j54323J67772q155j02761J24310j74643p6503r4881
14753B50812L20486K05387j35915M39316l50823J84309R0995D13038j6319M06340
14743H03059n9784r1425j2409J52234l47047K41424M1232j71262L32191n4998
14733H33215j48781j47000L20627J74575D46812K28257N4283J17861p8592K12100
14723I80721l68433J88431P310l06386L78691j31728j42876N30142k31679N8320
14713I62513j75925M0946K47227n24965k1948J36310L88388l07647J27349j62633
$$ y = [561253, 547897, 510672, 381101, 589995, 870581, 852117, 355801, 304330, 507796, 848706, 889033, 432674, 365524, 401777, 453458, 654809, 311028, 582852, 514934, 500377, 543794, 507624, 595739, 569996, 415673, 583445, 575290, 472529, 596839, 422196, 345693, 250812, 571298, 776685, 640770, 1080086, 729263, 913572, 1004567, 413038, 396719, 803059, 743275, 651850, 639441, 791675, 444628, 686052, 727284, 556022, 888213, 833215, 684434, 537434, 858061, 1032636, 446812, 675069, 729352, 847213, 768621, 980721, 612288, 800719, 808029, 501643, 880334, 748606, 605730, 1135872, 904193, 962513, 786588, 827534, 1074761, 549796, 527848, 664158, 1052546, 744899, 872248, 709615]
14703G09615p20Q0429k90430L31788j92583M09765L9015k27564p817n6866J60421
14692I55053m06029J13333J91909k7611J40709m9381J65021m10466K20567M3963
14682I37068J05031L0982J14901k12497n4238k22566k10984M80523L8268L74242
14672A380730m75337K29251k26187K8150K51680l07607K1523K58408O3972j67986
14662A056597O7336k54615K25661L36935l85849K65223q2489k52014j77421L24018
14652A123382K21013k42305j31356m1492R9827Q2735J79578k16202Q8868L06577
14642A470625n40454M9745p6074L76116k22064J72344j48639J31950q9779N00711
14632A624481j40653O0005m79760J03238q2731J21195N20302l19157l58520L18910
$$ y = [709615, 708895, 789324, 498894, 830682, 638099, 1047864, 1086879, 859315, 851498, 794632, 955053, 549024, 662357, 854266, 826655, 967364, 917983, 1083004, 672538, 893105, 937068, 1042099, 1073081, 1187982, 975485, 921247, 698681, 487697, 968220, 1006488, 1380730, 905393, 1134644, 908457, 936607, 1188287, 880680, 902203, 1160611, 1224583, 1056597, 1123933, 869318, 1094979, 1431914, 1046065, 1311288, 1228799, 976785, 799364, 1123382, 1344395, 1102090, 970734, 929242, 1029069, 1111804, 1291382, 1075180, 1164048, 1470625, 930171, 979916, 903842, 1279958, 1057894, 1230238, 1081599, 1213549, 1123770, 1624481, 1483828, 1543833, 1064073, 1167311, 1084580, 1205775, 1726077, 1406920, 1048400, 1367310]
14622A367310j42084O5665L72621j17098j50736j77535L97024J2451m43572N05161
14612A689207m361j54116J87721j98700j40743P9711K52552o54344N31094k55355
14602A332666M54736j29915k05316J66932k87510K93158j4834R6034J9830O1860
14592A787641k60775K69764N5747N7451J52802j89616o925q9806m2449k03851
14582A529983J18500L76433k87222K35470J09963k6064P3726l36280L90113j86037
14572A998585J761L34600j29272K39245K7954j38840L47580m97054L45174j04465
14562B425268N50169j81984k74937N8705M62266O6097K48816j27119N43504Q5707
14552C856492N19098P00101J176981K313023N781898R578891J2399424P32810
$$ y = [1367310, 1225226, 1290891, 1663512, 1546414, 1395678, 1218143, 1615167, 1627618, 1184046, 1689207, 1684846, 1530730, 1718451, 1519751, 1379008, 1458719, 1711271, 1056927, 1588021, 1332666, 1787402, 1657487, 1452171, 1619103, 1331593, 1624751, 1609917, 1705951, 1725781, 1787641, 1526866, 1796630, 1852377, 1909828, 2062630, 1873014, 1866089, 1776283, 1733834, 1529983, 1648483, 2024916, 1737694, 1973164, 2083127, 2057063, 2130789, 1794509, 2184622, 1998585, 2000346, 2334946, 2205674, 2444919, 2472873, 2334033, 2681613, 2184559, 2529733, 2425268, 2975437, 2793453, 2518516, 2577221, 3039487, 3105584, 3354400, 3227281, 3770785, 3856492, 4375590, 5075691, 6252672, 8565695, 14347593, 23926484, 36325908, 37058718]
14544C7058718j3996568j1294426E627560k067633r75019m30448k50265r3809
14536A810386p6372J47731K4647m2394K83478l31956K60862k48234L80238j2907
14526B195479J31718n0064j03852L25582k13708j33299M25520n0369j2137j97547
14516B317323K31152O2433K29289K35938k02468J68421k35688M039O0224O4359
14506B935022k18155L29955o7813p9133K5475n366L109k7596K20566N3214J08999
14495C278277N3151M7728l7288r8215J78838L38390k07030j11917L3607l56000
14485C119541O91526o8591j38393J49798l22575N12639P0194j12297r1967j1290
14475C798585j22097o89M43276J52784k99282J6348N53465j48398j89201L91733
$$ y = [37058718, 23062150, 11767724, 5627560, 3559927, 2584908, 2154460, 1904195, 1810386, 1734014, 1881745, 1906392, 1863998, 2147476, 1815520, 2076382, 1828148, 2208386, 2195479, 2327197, 2277133, 2173281, 2498863, 2285155, 2151856, 2577376, 2527007, 2514870, 2317323, 2548475, 2610908, 2840197, 3076135, 2873667, 3042088, 2806400, 2810439, 2870663, 2935022, 2716867, 3046822, 2979009, 2899876, 2925351, 2919985, 2923094, 2895498, 3116064, 3169278, 3278277, 3331428, 3379156, 3341868, 3243653, 3422491, 3760881, 3553851, 3441934, 3475541, 3119541, 3811067, 3742476, 3604083, 3753881, 3431306, 3943945, 4014139, 3901842, 3809875, 3798585, 3676488, 3675799, 4119075, 4271859, 3972577, 3988925, 4542390, 4393992, 4204791, 4596524]
14465D596524J41459l5150K6645q6181j90394q6585J095726m57924l21956O00297
14455E282461k99071k82776M17165L6340Q6224K40144J06649K20399k71489K1742
14445E557788j7255J60046J13585l8702K48328o1295J10907K34781k19391Q5061
14435F173853K37559j34893M36356k3148O9222J4229j1753K08606K73026K06445
14425G449502n54864L60454L61905j34457M5190N07052j25532J21507J24472M79236
14415H634465k70894K06827j08975O1730N03987l5455K72447k17078L55939l9771
14405I363222L80469M17072k8973Q6881R3422J76947M9893N24762N7780K8804
14395A1150279K05069K15212J51647L72405K91776K09633N8359K42199K17709
$$ y = [4596524, 4737983, 4702833, 4729478, 4643297, 4452903, 4366318, 5462044, 5004120, 4682164, 5282461, 4983390, 4700614, 5117779, 5154119, 5240343, 5480487, 5587136, 5807535, 5536046, 5557788, 5540533, 5700579, 5814164, 5775462, 6023790, 5962495, 6073402, 6308183, 6088792, 6173853, 6411412, 6276519, 6712875, 6689727, 6758949, 6773178, 6761425, 6970031, 7243057, 7449502, 6894638, 7255092, 7616997, 7482540, 7527730, 8034782, 7909250, 8030757, 8155229, 8634465, 8363571, 8570398, 8461423, 8523153, 9027140, 8991685, 9264132, 9047054, 9402993, 9363222, 9743691, 10160763, 10131790, 10218671, 10312093, 10489040, 10538933, 11063695, 11121475, 11150279, 11355348, 11570560, 11722207, 12094612, 12386388, 12596021, 12654380, 12896579, 13114288]
14386A3114288N3078N56858K83772L41743j97728N86508L42764J40649K06121
14377A5428053M51148p0816O03400J50554O56977P6106K3141P74066K05638O06069
14367A8904336O68419N1394L69025J18927P34207N65549L86066K71113O98007
14358B2767043M21853M40503O74133M30989P61119M15005R85231M95308N50867
14349B7942051O65804N00937J094134Q69083N60395J045198Q19253P88116R70679
14340C5255650Q81187J280724Q54904J461080O33137J833029Q84394J238887J312908
14331D5635900J484639J453321J690424J510259J651729J722357J962670K004758
14323E9116057J539258K291899K463657K301445K434097K362952L099470K612854
$$ y = [13114288, 13167366, 13724224, 14007996, 14349739, 14152011, 14738519, 15081283, 15221932, 15428053, 15879201, 15808385, 16411785, 16562339, 17219316, 17295422, 17318563, 18092629, 18298267, 18904336, 19572755, 19624149, 19993174, 20112101, 20846308, 21411857, 21797923, 22069036, 22767043, 23188896, 23629399, 24303532, 24734521, 25495640, 25910645, 26895876, 27391184, 27942051, 28607855, 29108792, 30202926, 31072009, 31632404, 32677602, 33496855, 34284971, 35255650, 36136837, 37417561, 38272465, 39733545, 40366682, 42199711, 43084105, 44322992, 45635900, 47120539, 48573860, 50264284, 51774543, 53426272, 55148629, 57111299, 59116057, 60655315, 62947214, 65410871, 67712316, 70146413, 72509365, 75608835, 78221689]
14315G8221689L442962K987773K828219L747447L926223L842467M006331M842108
14307A07845219M487768M990496N315617N320669O152087O066155P024014P187079
14299A54389104P316901P914803Q793749Q379895R405444J0126737J0218153J1424435
14291B27969221J1863285J1999818J2674656J3539097J3906640J4481733J4737676
14284C21172126J4906454J5165658J5073739J4996797J4139430J3644240J2429866
14277D21528310J1019297R933358P958467O384048L493679r09967l289075l103806
14269D53014311k327699j461026l425209o930168r716957j1283895j3194131j4386711
14261C90288515j5115013j5119679j5659112j5547185j5415930j5089752j4020433
$$ y = [78221689, 81664651, 84652424, 87480643, 91228090, 95154313, 98996780, 103003111, 107845219, 112332987, 117323483, 122639100, 127959769, 134111856, 140178011, 147202025, 154389104, 161706005, 169620808, 178414557, 186794452, 196199896, 206326633, 216544786, 227969221, 239832506, 251832324, 264506980, 278046077, 291952717, 306434450, 321172126, 336078580, 351244238, 366317977, 381314774, 395454204, 409098444, 421528310, 432547607, 442480965, 450439432, 456823480, 460317159, 459407192, 456118117, 453014311, 450686612, 449225586, 445800377, 438870209, 429153252, 417869357, 404675226, 390288515, 375173502, 360053823, 344394711, 328847526, 313431596, 298341844, 284321411]
14254B84321411j3688883j2918576j2818188j2319137j1535611j0796961j0516400
14247A99727655r724598r324664q507204q202437p572424p570286o743453o323597
14239A35758992o014959n468902n257420n307177m941450m486863m357749l917347
14231I6007125l697254l507201l684692l046574l451440l009216k753599k592692
14223G0264457k361772k506634k388198k188053j796894j556781k291313j533692
14215E3641120j949960j197196j322521j651778j415925j722008j331673p88878
14207D2261181j299531r13180j127501j308651o87964j198106r14184q29040o27291
14198C3355733j167221r81548o46663q09442k75308j227080l70799r52952l57995
$$ y = [284321411, 270632528, 257713952, 244895764, 232576627, 221041016, 210244055, 199727655, 190003057, 180678393, 172171189, 163968752, 156396328, 148826042, 142082589, 135758992, 129744033, 124275131, 119017711, 113710534, 108769084, 104282221, 99924472, 96007125, 92309871, 88802670, 85117978, 82071404, 78619964, 75610748, 72857149, 70264457, 67902685, 65396051, 63007853, 60819800, 59022906, 57466125, 55174812, 53641120, 51691160, 50493964, 49171443, 47519665, 46103740, 44381732, 43050059, 42261181, 40961650, 40048470, 38920969, 37612318, 36924354, 35726248, 34812064, 33983024, 33355733, 32188512, 31206964, 30560301, 29750859, 29475551, 28248471, 27877672, 26924720, 26566725]
14189B6566725r19629k80128o63132m92447r51882j05459m33414p62049m10138
14180B1548447l79971l22394m79657m65680k91708n33265o68316k55554j60443
14171A7991459r4515m61088k66523k21976n85702j42195l38502n06449j56063
14162A5218446o66950J71577j33236o47266l2083q3477o28583K0580l9391k06665
14152A2972952l92476o7009k16711j88546j47252j13098m35864j0934m91275J21704
14142A1031491k14649O8572o84990k8467j12068m2774N4431m29638j14403k44424
14132I283081J38481J25790p48352J83344j75951j23844j78897Q0896l74475j72399
14122H037674p2063L26185j89310n3241m13741j05120l1259J12149k24583l67687
$$ y = [26566725, 25647096, 25366968, 24703836, 24211389, 23259507, 23154048, 22720634, 21958585, 21548447, 21168476, 20846082, 20366425, 19900745, 19609037, 19075772, 18407456, 18151902, 17991459, 17896944, 17435856, 17169333, 16947357, 16361655, 16219460, 15880958, 15374509, 15218446, 14551496, 14723073, 14589837, 13942571, 13910488, 13827011, 13198428, 13219008, 13179617, 12972952, 12580476, 12513467, 12296756, 12108210, 11960958, 11847860, 11411996, 11401062, 10909787, 11031491, 10816842, 10885414, 10200424, 10171957, 10059889, 10017115, 10071546, 9641908, 9527505, 9283081, 9421562, 9547352, 8799000, 8982344, 8806393, 8682549, 8503652, 8584548, 8210073, 8037674, 7965611, 8291796, 8102486, 8049245, 7635504, 7530384, 7499125, 7611274, 7386691, 7019004]
14112G019004K10594O3926j15103l1251l38350l9746P1470l08455K43509m08264
14102F367334J47862l72030j45863j03043o0395K81121k07344J32041l21237M4365
14092E762811J83018o44509J94450j48602j89852J71587k76942R28K43705o2695
14082E233899m27564O8405q4314n3875N1268k23193O0281k0197J89381j8393l03921
14071D471777O575J7267m58907M29252j85022J79933k41732k00568K95471k63862
14061D050184P0022P3768k67560J51387R1512k70764J1448k0418J86826l05532
14051C770873m0963q8270k74739K0414L76899j20749k00186P8617l98150L94267
14041C518013j63752k06254j16731J39151j7545J77094m54892M28904j82121K66663
$$ y = [7019004, 7229598, 7293524, 7178421, 7147170, 6808820, 6769074, 6840544, 6532089, 6775598, 6367334, 6515196, 6143166, 5997303, 5894260, 5833865, 6114986, 5907642, 6039683, 5718446, 5762811, 5945829, 5301320, 5495770, 5347168, 5157316, 5328903, 5051961, 5052889, 5296594, 5233899, 4806335, 4874740, 4790426, 4736551, 4787819, 4564626, 4624907, 4604710, 4794091, 4775698, 4471777, 4478352, 4495619, 4036712, 4465964, 4280942, 4460875, 4219143, 4018575, 4314046, 4050184, 4120206, 4193974, 3926414, 4077801, 4169313, 3898549, 3909997, 3889579, 4076405, 3770873, 3729910, 3641640, 3366901, 3387315, 3764214, 3643465, 3443279, 3521896, 3123746, 3518013, 3354261, 3148007, 3031276, 3170427, 3152882, 3329976, 2875084, 3303988, 3121867, 3388530]
14031C388530J4009l50555K58028m28624K02547m46853L69829p8561l03476j56437
14021B468437K49327p3807O9586l35717L7915N978m8767K98979p0513k47704j3616
14010B340098J41240K65922k76497k6715r1064k33855J13439M768P1012j31606
14000B176742k56314O43940l25142k48295J84658l2973j3060K05143O4248J72193
13990B571140J90813J687854M253816R037547J3309566O004579j0589010j1887709
13982A4578596n940074k322623j375912o27388p62093l45779k46856j37998M27741
13973C247614n91657L0236j27348N278j04107M40032j83722l18293l1853l9502
13963B326678K4289k24766l6212J92921j81057J8240J57114k85695n4893j74677
$$ y = [3388530, 3402539, 3051984, 3310012, 2881388, 3083935, 2637082, 3006911, 2928350, 2624874, 2468437, 2717764, 2643957, 2713543, 2377826, 2415741, 2421719, 2372952, 2671931, 2601418, 2353714, 2340098, 2481338, 2747260, 2470763, 2444048, 2352984, 2119129, 2232568, 2237336, 2308348, 2176742, 1920428, 2564368, 2239226, 1990931, 2175589, 2142616, 2129556, 2334699, 2398947, 2571140, 2761953, 4449807, 8703623, 17741170, 31050736, 37055315, 26466305, 14578596, 8638522, 6315899, 4939987, 4312599, 3550506, 3204727, 2957871, 2819873, 3247614, 2655957, 2686193, 2558845, 2564123, 2460016, 2900048, 2716326, 2398033, 2366180, 2326678, 2350967, 2126201, 2089989, 2282910, 2101853, 2120093, 2277207, 1991512, 1936619, 1761942]
13953A761942K39257j72496J95742m6324J9454Q632k7680J29263k21396P4836
13943A961230K04967p2253l9398L1564k22039j45492R2389J7365k46673J47334
13933A728994k03610K90300P5346l33545J01907K3897N6146m66773K32546L93168
13923A898376k31143j378j47478o0863N6067M0197k11004l7092J62124M5229k5630
13912A487405j63357L74407J02809n16044N2282L20367k98447J73425J23894k93830
13902A362911J92031k10461K51075l42750O2814J09560k45766M11350m47517L28538
13892A471785J76918o70543N54091J5416p7191n48360M5254J27735K57262o5026
13882A287341J2263M14717H46195K34358J79120L20796n37467L1666k40206M86777
$$ y = [1761942, 2001199, 1828703, 2024445, 1978121, 1997575, 2006207, 1978527, 2107790, 1886394, 1961230, 2166197, 2093944, 2054546, 2086110, 1864071, 1718579, 1810968, 1828333, 1581660, 1728994, 1525384, 1815684, 1891030, 1557485, 1659392, 1683289, 1739435, 1272662, 1505208, 1898376, 1667233, 1665855, 1518377, 1457514, 1513581, 1553778, 1342774, 1305682, 1467806, 1513035, 1487405, 1324048, 1698455, 1801264, 1285220, 1337502, 1657869, 1359422, 1532847, 1656741, 1362911, 1554942, 1344481, 1595556, 1252806, 1315620, 1425180, 1179414, 1590764, 1143247, 1471785, 1648703, 978160, 1532251, 1547667, 1470476, 922116, 967370, 1095105, 1352367, 1287341, 1299604, 1714321, 846195, 1080553, 1259673, 1580469, 1043002, 1074668, 834462, 1321239]
13872A321239O110Q8792L9546n58477m6257K61357J80270J5530P9767j44091j31699
13861A112087m6605J13292K51709m14433J56950P2440n15022N42905m09739L43795
13851A207379j57072j37870J94646J6136j31770L04537k06794j58684J20938l285
13841A048161K00137l12395o4779K2435p2884L86492k23207l34314O15432m31419
13831H33659p9688L23602J44609k93544r0890j83108L29069k12754K29702k39628
13821G61029K72373k44953J60488j632j8536Q1909K01387l22509L0826L51078
13811A271460n77413J78289m8641K08359m37956r9620J94860L4121K71955k63918
13801G31496K41286j34410P7359j66254M16953m58719k4332M8742M1731j35806
$$ y = [1321239, 1327349, 1416141, 1455687, 897210, 850953, 1112310, 1292580, 1308110, 1387877, 1243786, 1112087, 1065482, 1178774, 1430483, 1016050, 1173000, 1245440, 730418, 1273323, 863584, 1207379, 1050307, 912437, 1107083, 1123219, 991449, 1295986, 1089192, 930508, 1051446, 1048161, 1248298, 935903, 871124, 893559, 820675, 1207167, 983960, 649646, 1265078, 833659, 753971, 1077573, 1222182, 928638, 837748, 654640, 983709, 770955, 1000657, 761029, 1033402, 788449, 948937, 947305, 928769, 1010678, 1212065, 889556, 920382, 1271460, 694047, 872336, 823695, 1032054, 594098, 494478, 689338, 723459, 995414, 731496, 972782, 838372, 915731, 749477, 1166430, 707711, 683379, 732121, 773852, 638046]
13791F38046k17467K55087J70127R4127j56410j97402M74757k57947j82747J06658
13781G26829J03301j05862K49142m36202J62834Q9982q4587K79106j43590K45138
13771A086091k91138j33720J9592J09788k9365j3157Q4341l55060J56158l1291
13761F02239J61739k22842J81139O495K4179K4677p8265K52801k40625l12202
13751C99335K63520k24441J23397P1715L5780K01938l46202R4144J78954J83019
13741I81159l73166J7735k85250J36525J86970j33029L16149j44301k0474k84313
13731C98005J36804J00452M4010j89282P3724j27536J23175J62305j75408J94044
13721G40293N0195j79548K12024o0623l52200J66147J0401j96396J01300j52935
$$ y = [638046, 420579, 675666, 845793, 939920, 783510, 586108, 1060865, 802918, 620171, 726829, 830130, 724268, 973410, 537208, 700042, 790024, 705437, 984543, 840953, 1086091, 794953, 661233, 680825, 790613, 761248, 748091, 832432, 477372, 633530, 602239, 763978, 541136, 722275, 728770, 752949, 777626, 699361, 952162, 711537, 399335, 662855, 438414, 561811, 633526, 669306, 871244, 525042, 619186, 798140, 981159, 607993, 625728, 340478, 477003, 663973, 530944, 847093, 702792, 682318, 398005, 534809, 635261, 679271, 489989, 563713, 436177, 559352, 721657, 546249, 740293, 790488, 610940, 822964, 762341, 410141, 576288, 586689, 390293, 491593, 338658]
13711C38658K17580N00032l54692J60740o1323R2709A99933M89161j57489L1401
13701E63006K49640B59502K07034K64090p2532k35619J33724q115J18033A66279
13690G09262k53177O9955R7249o129k05378J08096j02687J45129N0198k43140
13680C69378k6081J94200n8946J61099B97868M6663Q2495M2264K01684q8882A63099
13668E91547j55392J79576L7893l23201M24725j26418n8409B66852L90300j24630
13658E32522J59049j44801J56591B07695K69825p4211L0726k6074R7996R5371
13648F01328k54255K0551j09626K23847k19808N0593J08338L2368j54647J33182
13638D31871J02255k09078d2998F34503k01018j65699J03667J28533k21371j28486
$$ y = [338658, 556238, 1056270, 701578, 862318, 800995, 893704, 199933, 689094, 531605, 563006, 812646, 259502, 466536, 730626, 658094, 422475, 556199, 548084, 666117, 166279, 709262, 456085, 526040, 623289, 617160, 411782, 519878, 417191, 562320, 612518, 369378, 343297, 537497, 478551, 639650, 297868, 344531, 427026, 469290, 670974, 582092, 163099, 591547, 436155, 615731, 653624, 330423, 755148, 628730, 570321, 266852, 657152, 532522, 691571, 546770, 703361, 207695, 477520, 403309, 434035, 407961, 505957, 601328, 347073, 367624, 257998, 481845, 262037, 312630, 420968, 453336, 298689, 431871, 534126, 325048, -42998, 634503, 433485, 267786, 371453, 499986, 278615, 150129]
13628A50129K96706j33984K14429j65405J45570A91187F7627L20902j1163J55703
13618E33069k04623J1113j06636K02820J73047j33025A06850d8669C94723K73175
13608F67898k55731n1221G5007M08307j10328L42734A37308Q5348M832K99704
13598E27192E0499J77070L58891j01083k08500J16498j44562M2983M09232A43868
13587A66704K68180j07379c242C33380L523o8074J23821J02244j85241N1392F3750
13575D62605Q2530a5627A99928L23856J29664B68957k1305J92438A97984J24669
13565C22653A6377L95277A90807J50876J62936j29617j46948J05295j20210J76503
13555C89642j80104J80988q3914J36743Q8438b52309B60096J03537j12602P1397
$$ y = [150129, 446835, 312851, 527280, 361875, 507445, 191187, 67627, 388529, 377366, 533069, 328446, 339559, 232923, 435743, 608790, 475765, 106850, -48669, 394723, 667898, 412167, 360946, 75007, 483314, 372986, 715720, 137308, 222656, 227488, 527192, 50499, 227569, 586460, 485377, 276877, 393375, 248813, 291796, 701028, 143868, 166704, 434884, 327505, -3242, 333380, 336903, 268829, 392650, 494894, 309653, 361045, 63750, 462605, 545135, -15627, 199928, 523784, 653448, 268957, 247652, 440090, 197984, 322653, 16377, 411654, 190807, 341683, 504619, 375002, 228054, 333349, 213139, 389642, 209538, 390526, 306612, 443355, 531793, -252309, 260096, 363633, 251031, 322428]
13545C22428J98569j32425q993o6601j31766J04502P8656J07637k09876J10368
13535C72499r6333m260M5091I1316k0150J63954J4494J79683N1285o1952F2209
13523E79895j98621j20499n504q3814M5883Q5668g860C82412n1226H9405K02109
13512B91514O31563B36765J24999H2873K57011A25014K66370L1888j18365o803
13502B98104j39030J06756l2310R7761j33925o8767R5526O3296D8866L64848K5665
13491D39379A35723P1571n094J56224j5591A31773n8145K74546K05330j13283
13481D40221k08911K8929I0297l9716Q9885K44902F4116J7001c813B08386B2904
13469D54485A28918J86407J35842k23594a53851b1170A39401M3838C5459o235
$$ y = [322428, 520997, 388572, 379579, 312978, 181212, 285714, 364370, 472007, 262131, 372499, 276166, 271906, 316997, 91316, 71166, 235120, 249614, 429297, 480582, 418630, 62209, 579895, 381274, 260775, 255271, 171457, 217340, 303008, -7860, 382412, 331186, 89405, 291514, 923077, 236765, 361764, 82873, 339884, 125014, 391384, 423272, 304907, 298104, 159074, 265830, 233520, 331281, 197356, 128589, 224115, 287411, 48866, 413714, 439379, 135723, 207294, 202200, 358424, 342833, 131773, 73628, 348174, 553504, 440221, 231310, 260239, 90297, 50581, 140466, 385368, 64116, 81117, -3813, 208386, 22904, 454485, 128918, 315325, 451167, 227573, -153851, -21170, 139401, 183239, 35459, 29224]
13459B9224N6561M95171B49814K24769A72973O0027P1123j14542a08901B44296
13448B14037j8889P5206b4289B36949Q0600A23687P9521K86069B44259Q1969r4617
13437B31611P8303m896a40374B91181D7353j12J45192J62070k9624O3171A02222
13425d2965B10964j5956O6917C9398a7322A30216K0825F0762g2626C12939A31601
13413a03952D07432a59367B92998J48883A26872a0025A21934J50233E0322J21152
13403A71474N8597A5276a30030A93479R701G6618L05723a4810C9621J64340C680
13391A01080f8827A0014g341o7317I9953k0202K23249J21934n8669B3486L54453
13380C77939B8573c7051A24390J10483J22536G2216M14899i7735C18021N897f7166
$$ y = [29224, 85785, 580956, 249814, 474583, 172973, 233000, 304123, 189581, -108901, 244296, 214037, 195148, 270354, -24289, 236949, 317549, 123687, 203208, 489277, 244259, 326228, 231611, 309914, 305018, -140374, 291181, 47353, 47241, 192433, 354503, 324879, 388050, 102222, -42965, 210964, 195008, 261925, 39398, -17322, 130216, 151041, 60762, -72626, 312939, 131601, -103952, 407432, -159367, 292998, 441881, 126872, -10025, 121934, 272167, 50322, 171474, 230071, 15276, -130030, 193479, 203180, 76618, 382341, -14810, 39621, 203961, 3680, 101080, -68827, 10014, -7341, -74658, 99953, 79751, 303000, 424934, 366265, 23486, 377939, 28573, -37051, 124390, 234873, 357409, 72216, 487115, -97735, 318021, 323918, -67166]
13368H9050K61543C5050J20881K75202B03977n5486o2042M1893K08298n1196J6088
13357C01532l0131I0009K21404e9047C9000K49466L0997O7160q485P6716J70646
13346F25500A44574L88226A77422K16255M4984B18148a01119I9851M02562A80856
13335B06654b996H1993J16128J87788j59937J65804o1376r2474O1455G6576K74223
13324C50799i9154D19359m8478a13864B85889J3626k9872E0057J56987A6962J48260
13313A65222m9144a6554D95080A92788O2141E4472N0864J14904J10112j37714
13303A92638a19212B1692O631a76395B77184J39350b6433A540L20802b47435g2884
13291A93942N0458a27816D0459M685L4674J88183A19422M54941A97556e6182A24742
$$ y = [89050, 350593, 35050, 155931, 431133, 203977, 148491, 86449, 128342, 336640, 285444, 301532, 271401, 90009, 311413, -59047, 39000, 288466, 319463, 386623, 378138, 454854, 625500, 144574, 532800, 177422, 393677, 438661, 218148, -101119, 99851, 502413, 180856, 206654, -2996, 81993, 198121, 385909, 225972, 391776, 330400, 237926, 299381, 76576, 350799, -99154, 419359, 370881, -113864, 285889, 299515, 269643, 50057, 207044, 16962, 165222, 116078, -16554, 495080, 192788, 254929, 54472, 105336, 220240, 330352, 192638, -119212, 21692, 28323, -176395, 277184, 416534, -26433, 1540, 322342, -247435, -72884, 193942, 244400, -127816, 40459, 45144, 79818, 268001, 119422, 574363, 197556, -56182, 124742]
13279E3594f742B29557k4428R4003e9700j39535I3640M1027J55202q6329G4374
13267D56813G1069J53795a22801B14488g2966b7277F45717a21224C04978n2489
13257B52489j00013b7994C69855c4480A31098J82787J0102e8003J8983j68435
13247b07455a8819C40645l3224E051P1363J62668a76261R964A99093A060b27200
13235d3147A54116L7908J84752f9859B80786R1772J3513E6610J17960J10325A38168
13223b13162A75455G3657K22226A6063C027L95927A37502b02985B59134a33003
13212a61231B72814F0237M2557a4927A03439B6763L46426l3540K4867c3663D7434
13200B64861c36282I3604B0395J07402b20330A25152J21368j18698c7926n9866
$$ y = [53594, -6742, 229557, 205129, 299132, -59700, -199235, 93640, 134667, 289869, 203540, 74374, 456813, 71069, 224864, -122801, 214488, -72966, -27277, 645717, -121224, 304978, 252489, 152476, -27994, 369855, -34480, 131098, 313885, 323987, -58003, -39020, -207455, -18819, 340645, 307421, 5051, 76414, 239082, -176261, -166297, 199093, 1060, -227200, -43147, 154116, 192024, 376776, -69859, 280786, 372558, 386071, 56610, 174570, 284895, 138168, -213162, 175455, 73657, 295883, 16063, 3027, 398954, 137502, -202985, 259134, -133003, -161231, 272814, 60237, 102794, -14927, 103439, 26763, 373189, 339649, 364516, -33663, 47434, 264861, -336282, 93604, 20395, 127797, -220330, 125152, 246520, 127822, -37926, -97792]
13190i7792A84758h2547D9450b75155A74255j0180g6217G8778b83387C60564j47879
13179B12685m6063n5731K7701K67745j45017a813B19035B6936M9896J56475a75648
13167A57916c95264a44221n1358D12632j03805a6271q5200D4516L60598i4774
13156A28719e9707A14375A9796J55811d246j85614B01619m5099L3869K52030A99560
13144a00600L3516E3951a18447M5577A21424a22635A41085d5194A00774J09458
13134B10232J15203j0576A08130l1393K93452F799i6019J8067D07141j00010K37905
13123E45036b23036A74096P2489d5582C22511p0013a81933D84652b57720D42586
13112e0068j17449d333A29264m0857h972A76539h1537k18153a00158p7792A02696
$$ y = [-97792, 184758, -82547, 49450, -275155, 174255, 164075, -76217, 78778, -283387, 360564, 212685, 166622, 110891, 138592, 406337, 261320, -1813, 219035, 26936, 76832, 233307, -175648, 157916, -395264, -144221, -195579, 412632, 308827, -16271, -101471, 44516, 405114, -94774, 128719, -59707, 114375, 19796, 175607, -4246, -189860, 201619, 156520, 190389, 442419, 199560, -100600, -67084, 53951, -118447, -72870, 121424, -122635, 141085, -45194, 100774, 210232, 325435, 314859, 108130, 76737, 370189, 6799, -96019, -77952, 407141, 307131, 545036, -223036, 174096, 246585, -45582, 322511, 252498, -181933, 484652, -257720, 442586, -50068, -167517, -4333, 129264, 88407, -8972, 176539, -81537, -299690, -100158, -177950, 102696]
13100A62207l4573h3816F3870K57456a84794k7843A19788A7028J28605F3527G061
13088A07450n2523J84381F8608i2326K7621J6867E3324c1530O197c614C23387
13076h2435B98662j21078o0065J59694a82074I8777f9484A28750C5979b03898
13065h7375A77372E890a07268j5020L0900B50915A3467L34078E2229J68190C6045
13053H6415B7550K54155h4722L9013G203J82817l0984g4062B88770a63884a4693
13041C22658j46706d0783G0803L28400m5206Q0005I900K81343j5802k1540a980
13029A43634J67123I1796K31226B4180K41963l8060N0300o0734I4321C2556J05170
13018A37726R0512J3396Q9351m6416b4506A60984K54165g9708C53801k1812a46506
$$ y = [162207, 127634, -83816, 63870, 321326, -184794, -212637, 119788, 17028, 145633, 63527, 7061, 107450, 54927, 239308, 68608, -92326, -64705, -47838, 53324, -31530, -25333, -3614, 323387, -82435, 298662, 177584, 117519, 277213, -182074, 98777, -69484, 128750, 35979, -203898, -87375, 177372, 5890, -107268, -122288, -91388, 250915, 13467, 347545, 52229, 220419, 36045, 86415, 27550, 281705, -84722, -45709, 7203, 190020, 159036, -74062, 288770, -163884, -14693, 322658, 175952, -40783, 70803, 399203, 353997, 434002, 9900, 291243, 275441, 253901, -1980, 143634, 310757, 91796, 323022, 24180, 266143, 228083, 278383, 217649, 94321, 32556, 137726, 228238, 241634, 330985, 284569, -24506, 160984, 415149, -79708, 353801, 331989, -146506]
13006a59679D2907d6403B71056a80454n7824B50417b75338J07666B41382I3492
12995a6646k28503l1996A08257L06851e6733B81292j08496g8741B37105b42512
12984e155A78237A4548a71682L8729r9067B4898l644J07019m0455R5130a570F4729
12971B42138a03739n972p0854Q0148c9225G2361A7994g49B56820I3998J93034
12960B87032a37133B73248a62714M0313A55719b50544E6510J64733h800B2841
12949A21514h1399j12307k2243A35819D7922P3003J84505D4842B738a11507e0773
12937a3449A35268a62717B93290r7758R5938b5282k49866I9901N175K6820b29341
12925d511A93429G0862m021a09744j35699J05197A86000C2505c15939J02716C80830
$$ y = [-159679, 42907, -46403, 271056, -180454, -238278, 250417, -275338, -167672, 241382, 93492, -16646, -245149, -277145, 108257, 415108, -56733, 281292, 172796, -78741, 237105, -242512, -5155, 178237, 14548, -171682, -132953, -232020, 24898, 21254, 128273, 87818, 182948, -1570, 64729, 242138, -103739, -109711, -180565, -100417, -39225, 72361, 17994, -749, 256820, 93998, 287032, -137133, 273248, -162714, -122401, 155719, -250544, 56510, 221243, -8800, 22841, 121514, -81399, -193706, -215949, 135819, 47922, 120925, 305430, 44842, 2738, -111507, -50773, -13449, 135268, -162717, 293290, 195532, 291470, -25282, -275148, 99901, 105076, 131896, -229341, -4511, 193429, 70862, 66841, -109744, -245443, -140246, 186000, 32505, -315939, -213223, 380830]
12913a73232Q475A30286d4104C88962A13574k9670L66499a74367C0081b4541A05478
12901C6602c40981i0204L5844j39510B90941A36403B3987J73229a00583C85906
12890A50234K31456j73211E5651A9387a27291j00067D7827d7251A66423h2785
12879i2768C39243a48873A76817Q9518F2482O2381c20570C1466o984L2209i129
12867a24863H0190J87007d6838H1963J6189C4718K39580H1288J53677a82501r650
12856a92151n1784c9147B6182o436K47119e5711J5876O128D3971J36338h714C727
12843A17325J01379f2764D6206c9342E0945d0214A73281a27669K7300L3781k6614
12832i3202H8999A0649J21286a74861A08211a8833j42056M6652E2092O7057a23394
$$ y = [-173232, -164757, 130286, -44104, 388962, 113574, 83904, 450403, -174367, 30081, -24541, 105478, 36602, -340981, -90204, -54360, -193870, 290941, 136403, 23987, 197216, -100583, 385906, 150234, 381690, 208479, 55651, 19387, -127291, -227358, 47827, -47251, 166423, -82785, -92768, 339243, -148873, 176817, 266335, 62482, 124863, -320570, 31466, 24482, 56691, -9129, -124863, 80190, 267197, -46838, 81963, 98152, 34718, 274298, 81288, 234965, -182501, -192151, -243935, -39147, 26182, 19746, 266865, -55711, -39835, -33707, 43971, 180309, -8714, 3727, 117325, 218704, -62764, 46206, -39342, 50945, -40214, 173281, -127669, -100369, -66588, -93202, 88999, 10649, 131935, -174861, 108211, -18833, -160889, -114237, 52092, 119149, -123394]
12820a9259q6244K8092B9184b18659G6505a16138c1568o0010j3142n2045A51464
12808e1038l4770B49782n502b4439B81748K628A39183P4379R8995b64353C9866
12796a04898E5251L6072Q4941i1246A0403b51902L8457E6311K29411n6838f3937
12784a65128e3074a59H7582a81828B23005h5720K186C27895b4806p1517G7043
12772b4377R50H9658j344a96790A78859b7665E9579j6992J5922b50646F5872a30036
12759B74592g1186j00507R395A95029G090K06211H7903N5973R7616O1217j35838
12748A66871h6864B09590H461J08469b739p1958B02893a89739B14889a71189B65020
12736A96725L5896r1469M6692h5491B31221A02600P4664O4618i9635j475I5768
$$ y = [-19259, -105503, -77411, 29184, -218659, 76505, -116138, -31568, -91578, -104720, -156765, 151464, -51038, -85808, 249782, 244280, -24439, 281748, 284376, 139183, 213562, 312557, -264353, 39866, -104898, 55251, 91323, 176264, -91246, 10403, -251902, -213445, 56311, 285722, 228884, -63937, -165128, -53074, -159, 87582, -181828, 223005, -85720, -83534, 327895, -24806, -96323, 77043, -24377, -23427, 89658, 88314, -196790, 178859, -27665, 59579, 42587, 58509, -250646, 65872, -130036, 274592, -71186, -171693, -162298, 195029, 7090, 213301, 87903, 143876, 241492, 302709, 166871, -86864, 209590, 8461, 116930, -2739, -74697, 202893, -189739, 214889, -171189, 265020, 196725, 232621, 141152, 187844, -85491, 231221, 102600, 177264, 241882, -99635, -101110, 95768]
12724B68542b7146D36808A45025o8572a58329A67592c92263H4070i6968G5413
12713e966B34778P8170K5143b8493J3259A70882E0847L76018C2799m068L78443
12702D07174Q173A16941C7833b5350k5651J4354A51645e1522q4822p5442I1113
12690B31135D9300f6039B12932a25083A15740E4405A7924j275M79607B24712K62429
12679D87141A3559M22031B0581c5236n7029c7046j24556I9173N9446h9558b967
12667H9542c2633H8531R4457r839o3604N8912N9999E484N0515Q6177k450f1847
12654C65885a2207i46B31201r6845M0210K96795a07098r3167D55851E5281e5788
12642B04779i1372B17002I7526a72066O0336h679C8121R9797P3855n850a26347
$$ y = [268542, -27146, 436808, 145025, 76453, -158329, 167592, -392263, 84070, -96968, 75413, -5966, 234778, 312948, 338091, -28493, -15234, 170882, 50847, 426865, 32799, 28731, 407174, 415347, 116941, 37833, -25350, -51001, -36647, 151645, -51522, -136344, -211786, 91113, 231135, 49300, -66039, 212932, -125083, 115740, 54405, 17924, 16649, 496256, 224712, 487141, 13559, 435590, 20581, -35236, -92265, -37046, -161602, 99173, 158619, -89558, -2967, 89542, -32633, 88531, 182988, 173149, 109545, 168457, 228456, 5484, 55999, 142176, 139726, -61847, 365885, -12207, -946, 231201, 134356, 174566, 471361, -107098, -200265, 455851, 55281, -55788, 204779, -91372, 217002, 97526, -172066, -111730, -8679, 38121, 137918, 211773, 205923, -126347]
12630F6201h7749A49477J91236h2516C0652K44631n2004M0917I3389c89B21227
12618G9555J15463b36998A85567a29310j1652a9344I2690a09222E3241Q4828J19959
12607B58028F7368J13723a23089A75176K607h4798A88902D0483R0140g67B34573
12595c2778j09658l523B49876M5583A22727a75260G911e3368B14400g4803k80478
12584c55281C89506j08932b10743j05764a09727A20813C8116K7292P3385h7295
12573a49988b5401A8373b7571I1955a98430C8732K49510a2708C4497L7388a28016
12561d29420i7456B64565N4923f1176D09027h6616H8006l9966M466b89774H8954
12549a20536H0515M6481d1515k23591P8651M6962G3218h0612k09943M1526D1913
$$ y = [66201, -87749, 149477, 340713, -82516, 30652, 275283, 223279, 264196, 93389, -389, 221227, 79555, 195018, -236998, 185567, -129310, -140962, -19344, 92690, -109222, 53241, 138069, 258028, 67368, 181091, -123089, 175176, 177783, -84798, 188902, 40483, 130623, -767, 234573, -32778, -142436, -145959, 249876, 295459, 122727, -175260, 7911, -53368, 214400, -74803, -355281, 389506, 280574, -210743, -316507, -109727, 120813, 38116, 65408, 138793, -87295, -149988, -25401, 18373, -27571, 91955, -198430, 38732, 288242, -12708, 34497, 71885, -128016, -429420, -97456, 264565, 319488, -61176, 409027, -86616, 88006, 48040, 52506, -289774, 88954, -120536, 80515, 126996, -41515, -265106, -186455, -139493, 73218, -80612, -290555, -249029, 41913]
12537b17414a4509I7693a03688A54228a31474B47148m4863a0156A27741A6726
12526B57018a10851D3752K23738j16029c0476E32L23713j56519b93870H0783a01526
12514A52115L5438a4573A80644B1425b81219B07354H0288J60048j17692J37763
12504B60407q3216A4007J91690e1821C9986d10971B10567k4861N9042C5111a2304
12492a84320l0766H8203J76713d18244a59196l34798B4707c05741f2458j55874
12482b18332j01175A14641b77286D14057F0936J47335b5929j32072I9394K1819
12472A21213c817j0032A2963g7268J4552I9701J7075a32305O2268a159B09791
12460c8827A48332J18682j15315E0757J68800B5433P8588l112c38609B0945M10330
$$ y = [-217414, -14509, 97693, -103688, 154228, -131474, 247148, 202285, -10156, 127741, 16726, 257018, -110851, 43752, 267490, 151461, -30476, 532, 324245, 167726, -293870, 80783, -101526, 152115, 187553, -14573, 180644, 21425, -281219, 207354, 80288, 240336, 122644, 260407, 177191, 14007, 205697, -51821, 39986, -410971, 210567, 185706, 244748, 35111, -12304, -184320, -215086, 88203, 264916, -418244, -159196, -493994, 24707, -305741, -62458, -218332, -319507, 114641, -277286, 414057, 60936, 208271, -25929, -158001, 99394, 121213, -3817, -13849, 12963, -77268, -62716, 99701, 116776, -132305, -70037, -1159, 209791, -38827, 148332, 267014, 151699, 50757, 219557, 25433, 104021, 100909, -338609, 20945, 431275]
12449D31275b35548f7181p6696c4965C02443c4327k96367C239L71470b12842i0375
12437a76530d6364j75523B12336M5927b0042B69879J28156A02075j5928N559a8577
12425b37747a06425B63466B2394M3195e4529A75113f8363j28775I9625L0327L95055
12414E25007f8519B47916E2699M539B0806P875K78132d4524k52808A53084h4050
12402f7862D8768J0254a04399d6966C570J53702i6562c6801j79546l9358A05545
12390D8991n77c0794k14422J08034A62434p9773B318a31690B1181K90048f9086
12378A78841p9338K5488C8350K00228F8222J76673A03351j1645f1579r4093r9275
12367b54947g9714A57369K67703B06006G1555b7704C1640K653L8859h4541A88012
$$ y = [431275, -235548, -67181, -143877, -34965, 302443, -34327, -330694, 3239, 374709, -212842, -90375, -176530, -46364, -221887, 212336, 258263, -20042, 269879, 398035, 102075, 86147, 91706, -18577, -237747, -106425, 263466, 22394, 65589, -54529, 175113, -68363, -197138, 99625, 129952, 525007, -68519, 247916, 52699, 57238, 20806, 28681, 306813, -44524, -297332, 153084, -84050, -67862, 48768, 59022, -104399, -46966, 3570, 157272, -96562, -36801, -216347, -255705, 105545, 48991, 48414, -30794, -245216, -137182, 162434, 82661, 2318, -131690, 21181, 311229, -69086, 178841, 99503, 124991, 38350, 238578, 68222, 244895, 103351, 91706, -61579, -155672, -254947, -79714, 157369, 425072, 206006, 71555, -27704, 31640, 34293, 73152, -84541, 188012]
12355A6004g1987A917b20152i0643K220B53641F239g9570A65143n3733J29373
12344B40783O7714L4033a22472e3393D4752e9940m6694r3414c0761B03126G8020
12332b52324G7369b3346r4134L2449I4522N009f8681c0835j78906I2411R1483
12321A83894I1205a05071L9977l5171J1158j2724A59644l312a58087N8649B74154
12309b81752F3824k1797c8702p8352M0718A72878a44691B77466H5702A7588b13558
12297g4538A22264c63855C61904B8962N2362c3911B38165E8380L0076f8140p8998
12286a47138E1263J38804K09338b44325K5997d2159p4976K2426l1015i271A93564
12274A23851A7281P3620J53457I36i362j65042A41956b37062A21712K01159j10522
$$ y = [16004, -71987, 1917, -220152, -90643, -88423, 253641, 6239, -79570, 165143, 111410, 240783, 308497, 342530, -122472, -53393, 44752, -59940, -106634, -200048, -30761, 203126, 78020, -252324, 77369, -23346, -117480, -85031, 94522, 99531, -68681, -30835, -209741, 92411, 183894, 91205, -105071, -65094, -100265, -89107, -101831, 159644, 156332, -158087, -99438, 274154, -281752, 63824, 42027, -38702, -117054, -76336, 172878, -144691, 277466, 85702, 17588, -213558, -74538, 122264, -363855, 361904, 28962, 81324, -33911, 238165, 58380, 88456, -68140, -147138, 51263, 190067, 399405, -244325, -218328, -42159, -117135, -94709, -125724, -9271, 193564, 123851, 17281, 90901, 244358, 936, -9362, -174404, 141956, -237062, 121712, 322871, 212349]
12263B12349o2359J23895A20967g4864D891b225A25942D3154L1740J133L87187
12252D63214K1792a42669B01883F0762J8033O5784J5690p1766J54458J11382A27848
12240c6505C5419Q8153d9172k31198A02983Q4775H9628J29888p6250A547L50179
12229C51726A61579b3809A43773K04187a46178B48985A22500J46020F6851O9419
12219A36270l1275K10454E5536L3227N344b81347A73004K70456a3537q4260C17483
12207i6623G0642L57706D6725a13692M8690D12976f0038A52837M13179A71394
12196H5960O6674J94658H0460k5855a03711C05826A23832a02375D96501A961i0205
12184i6044a6125A21622J45072N9713c9016C717J82849a51413A93712Q6324G1955
$$ y = [212349, 149990, 273885, 120967, -74864, 4891, -2225, 125942, 43154, 74894, 76027, 463214, 485006, -142669, 201883, 60762, 78795, 144579, 160269, 88503, 242961, 354343, 127848, -36505, 35419, 123572, -49172, -280370, 102983, 187758, 89628, 219516, 143266, 1547, 351726, 161579, -23809, 143773, 347960, -146178, 248985, 122500, 268520, 66851, 136270, 104995, 315449, 55536, 88763, 94107, -281347, 173004, 443460, -13537, -97797, 317483, -96623, 70642, 428348, 46725, -113692, -65002, 412976, -60038, 152837, 566016, 171394, 85960, 152634, 347292, 80460, 54605, -103711, 305826, 123832, -102375, 496501, 1961, -90205, -96044, -16125, 121622, 266694, 326407, -39016, 3717, 186566, -151413, 193712, 280036, 71955]
12172C94260F8953R3406q196P1681f6846p8028O3630A72389P2133a8109j27567
12161a45676A92035M896J39694C9600R7091J47950f3232B00531b04436b7543C5208
12149a07838C8237d3549A59656c07290J12274J6957C4135a57341K5347A63897
12138b09972A37317b0406A16580a93886r1351e3946J4240j70868A44235h7308
12127c7292o7166K1597j22023i5936j00975a9585q7480A09046d8656C9833b74286
12115a50758k6929B14456j5968p9911g4891A78162p4331J779D0918a54124c9391
12103a49770f1227D8486b55360B99206A15482O8374A6010J96610R0033d44061
12092a20953L7975A29071b35979B35575f2276A23125a94046A3123a77387H9803
$$ y = [394260, 68953, 162359, 154163, 225844, -66846, -144874, -81244, 172389, 244522, -18109, -145676, 192035, 196931, 336625, 39600, 136691, 284641, -63232, 200531, -204436, -27543, 35208, -107838, 38237, -43549, 159656, -307290, -195016, -178059, 34135, -157341, -131994, 163897, -209972, 137317, -20406, 116580, -193886, -285237, -53946, -39706, -210574, 144235, -87308, -37292, -104458, -82861, -204884, -95936, -196911, -19585, -107065, 109046, -48656, 39833, -274286, -150758, -177687, 214456, 198488, 118577, -74891, 178162, 103831, 105610, 40918, -154124, -39391, -149770, -61227, 48486, -255360, 299206, 115482, 183856, 16010, 212620, 302653, -444061, -120953, -82978, 129071, -235979, 235575, -62276, 123125, -194046, 13123, -177387, 89803]
12081e1099E1788e882F588K94208a43930I0588f4015I2198c0599A17289O73770
12070G91059J60781M59118o70422B50812a24098B1594K4088K38844b8588B19224
12059A38809a11423B43869f2509A87306L377b94375a02203H3455J23226a88345
12048B3654J60556j7410p0251a11361A75647d4083j39629i0383o760F4604d8210
12036a13221j39701I6361J9955a4483A53467M1322b65837J801a14831H6582l6187
12025E0395J85552a81085L0332C4477M4014c8073C2393a43836q3448B01242q9626
12014A11616c18099O9868A79912q7053J43270b31182J02088A2005R4901e5006
12003B9160b10583f3782C09665r4898b9001A12229E915a22657A36324F5321a19019
$$ y = [-51099, 51788, -5882, 6588, 300796, -143930, 90588, -64015, 92198, -30599, 117289, 791059, 951840, 1410958, 740536, 250812, -124098, 21594, 45682, 284526, -28588, 219224, 138809, -111423, 243869, -62509, 187306, 190683, -294375, -102203, 83455, 206681, -188345, 23654, 184210, 166800, 96549, -111361, 175647, -44083, -183712, -90383, -97143, 64604, -48210, -113221, -252922, 96361, 116316, -14483, 153467, 194789, -265837, -264036, -114831, 86582, 50395, 235947, -181085, -150753, 34477, 78491, -38073, 32393, -143836, -227284, 201242, 111616, -318099, -248231, 179912, 92859, 236129, -231182, -129094, 12005, 106906, -55006, 29160, -210583, -63782, 309665, 214767, -29001, 112229, 5915, -122657, 136324, 65321, -119019]
11991b33856f2047c0321D8331a00727H6730J05262r4413j4298K557A3524a28259
11979e9186B36501b88535B7018h4636j07976A02376m3916J0272O6397a96758b6865
11967a85441B90930d5824l1780B6432i5266A34611b64656B75223n3490c9224G2784
11955c28579c4897M001B46266L7605c37380J66783J2156E6636f0928A5986M1476
11944E7462M8584a14750a2084j39795A9636M730L92454j97846m402H3590n280
11933G8310b1425j99017R1241j44661k5371J20646N7262I238a05750k399B38507
11921A62435a23234F4573J77819b52652E671J14692b69728J21155C1222f091D271
11909a1119q206D3116L9689a25372B6552J74980r5427b6220j74181B34277H8268
$$ y = [-233856, -62047, -30321, 48331, -100727, 86730, 191992, 97579, 83281, 85838, 13524, -128259, -59186, 236501, -288535, 27018, -84636, -192612, 102376, 58460, 68732, 135129, -196758, -26865, -185441, 290930, -45824, -77604, 26432, -95266, 134611, -264656, 275223, 221733, -39224, 72784, -328579, -34897, -30896, 246266, 283871, -337380, -170597, -158441, 56636, -60928, 15986, 57462, 106046, -114750, -12084, -151879, 19636, 24366, 416820, 218974, 214572, 83590, 78310, -21425, -220442, -129201, -273862, -299233, -178587, -121325, 9238, -105750, -108149, 238507, 162435, -123234, 64573, 242392, -252652, 5671, 120363, -269728, -148573, 31222, -6091, 4271, -11119, -19325, 43116, 82805, -125372, 26552, 201532, 106105, -26220, -200401, 234277, 88268]
11897b57689C55393A17852d5783b861k29766O9779f6897a0317A2386Q6673L04639
11886D03698C894O4083d3289a6520n231j82142A50394B5665J43712l2293m6305
11875I0779F060h70j13717e5768o3166b7717F743a83367j02371B35176i235j92105
11863b01340H8100Q5316b53953A08911K329J7017m9029K6448b0865l0591j13985
11852a65441q5372a14874A83412E3371f217k4199d316B80620F874k563P8081O200
11840H8592b90478h8415a8815H6022k6421b01292C1428a41548l461k3033O1303
11829a06739I2026b930j17916A63003l6246f3791H8935g4321A47768f7984b2652
11817A24892Q211L01889e3194j32869O4507e6362I058J16552a04563L8446N216
$$ y = [-257689, 355393, 117852, -45783, -2861, -232627, -162848, -66897, -10317, 12386, 99059, 403698, 3894, 67977, -43289, -16520, -21751, -203893, 150394, 25665, 169377, 137084, 90779, 6060, -870, -114587, -55768, -118934, -27717, 6743, -183367, -285738, 235176, -9235, -201340, 88100, 173416, -253953, 108911, 111240, 128257, 79228, 105676, -20865, -51456, -165441, -250813, -114874, 183412, 53371, -6217, -30416, -4316, 280620, 6874, 4311, 82392, 88592, -290478, -88415, -18815, 86022, 59601, -201292, 31428, -141548, -145009, -168042, -106739, 92026, -2930, -120846, 163003, 126757, -63791, 88935, -74321, 147768, -67984, -22652, 124892, 133103, 434992, -53194, -186063, -121556, -56362, 9058, 125610, -104563, -66117, -60901]
11806f0901j00219H7293J64552l4915F3220b52479B61361G558N1394a2924H3452
11794I1538d0562A53574a51752K1845d8779k37060e0797L933j33906I3298J97594
11783B90892L5305d9024K1567j10795j5401o2722A48996e4077j91902h3571j63736
11772b47307p3157a46004K8081B80984k4430C1257J92747a50986A64980F5021
11761F3990k0244a49140D6413c5956q5508A3673J67872j1827R3497a21859Q053
11750a13806A51196F6200g115B79264A21623a34717A47205a45201P0876j1982
11740h6307p8702j84023A25690M4459B4042b90397c809m1814l53597I1501a4689
11728G8836L0616b20603A07048J12428I9986L250h616I6282K29123c4181G5148
$$ y = [-60901, -161120, 87293, 251845, 216930, 63220, -252479, 261361, 7558, 58952, -12924, 83452, 91538, -40562, 153574, -151752, -129907, -48779, -285839, -50797, -46864, -180770, 93298, 290892, 326197, -49024, -27457, -138252, -153653, -216375, 148996, -54077, -245979, -83571, -247307, -320464, -146004, -117923, 280984, 256554, 31257, 224004, -150986, 164980, 65021, 63990, 43746, -149140, 46413, -35956, -121464, 13673, 181545, 169718, 263215, -121859, -113806, 151196, 66200, -7115, 279264, 121623, -134717, 147205, -145201, -74325, -86307, -165009, -349032, 125690, 170149, 24042, -290397, -3809, -45623, -399220, 91501, -14689, 78836, 109452, -220603, 107048, 219476, 99986, 103236, -8616, 96282, 325405, -34181, 75148]
11716a13593j40094Q6598H4251a49593C31797p0129r6689K80045A23263a3392
11705a10687j49073A0609J21868N9539d02896E66180d8707C61741g2176B29207
11694B64414j15053i0920H0307b87730j22027C03783a0445H336K13868p9446o1596
11683H1162i7441B47065L2168M0390A5729K95587a51750A47560A9689i268m6616
11672e5884I6714a19023I5358J7264J69942K13443a02696n9374A02891h1612A70395
11660B34477a619A33700a42807B58062a49131n261B07116b9020d848B72046A6454
11648a57329A60589B2772M5281d03724A39943g2564k38948A3482a2412k67122
11638b79534B12677A0453b2184r7888E9207d4288j51022E00818e9936I6903a76115
$$ y = [-113593, -253687, -167089, 84251, -149593, 331797, 261668, 164979, 445024, 123263, -13392, -110687, -259760, 10609, 132477, 192016, -402896, 566180, -48707, 361741, -72176, 229207, 264414, 149361, -90920, 80307, -287730, -409757, 303783, -10445, 8336, 222204, 142758, 81162, -97441, 247065, 279233, 319623, 15729, 311316, -151750, 147560, 19689, -9268, -55884, 96714, -119023, 95358, 112622, 282564, 496007, -102696, -162070, 102891, -81612, 170395, 234477, -1619, 133700, -142807, 258062, -149131, -154392, 207116, -29020, -4848, 272046, 16454, -157329, 160589, 22772, 68053, -403724, 139943, -72564, -311512, 13482, -12412, -279534, 212677, 10453, -22184, -120072, 59207, -44288, -195310, 500818, -59936, 96903, -176115]
11626D06720f2291j74453R5623A1640b17133B59042J24084A70059a05161c8543
11615A62086K15181j47952f4879K9369B52975J80957C7416K66458f7048C72762
11604g692B7011a83410G680J20277q251d6871B63846a32030A66403C7720O4852
11593A02572C7145J414c0147A04325J66126J13342G7840a69282c2824C55976j45580
11582B10396r1602J45476c12271h1431H0370J07403D7785K09894h7972L9537a0308
11570g5599k3381A66731B0509J83834a3535B37166a02262D48961A73694M1880
11560B15574K11545H6176b5128G3833c5976C27227G1760a2467A58297a97646e3622
11548a00473E7922a01555F2403a32678K9154C19138j22284r0054i9017E6074k2410
$$ y = [406720, -62291, -236744, -141121, 11640, -217133, 259042, 383126, 170059, -105161, -38543, 162086, 377267, 229315, -64879, -35510, 252975, 433932, 37416, 303874, -67048, 372762, -7692, 27011, -183410, 7680, 127957, 119706, -46871, 263846, -132030, 166403, 37720, 102572, 37145, 38559, -30147, 104325, 270451, 383793, 77840, -169282, -32824, 355976, 210396, 118794, 264270, -312271, -81431, 80370, 187773, 47785, 257679, -87972, -48435, -10308, -75599, -98980, 166731, 20509, 204343, -13535, 237166, -102262, 448961, 173694, 215574, 427119, 86176, -25128, 73833, -35976, 327227, 71760, -12467, 158297, -197646, -53622, -100473, 57922, -101555, 62403, -132678, -103524, 319138, 196854, 106800, -99017, 56074, 33664]
11537C3664Q7339C2299e5871B77251k3086d1738F1317L24284A70954o4806K42395
11526C48543a23627C93882A03949a10972n8954D1594J04705o0604a42453B13493
11515g27H3872a61144B68516J79204d0135m3977D1955O8956l7462e6697A25454
11503a31807B19040E9221b36038p6250A35391c0193A7751L4523K24135M28073
11493G04482C27011B6750K58163J72581a37807E2574L19836j55394a24208E75312
11482a16889B31486j13493J68637A1687K85516h7647j07843F92280i2987E6986
11471i6634A21592C9342R9204J43432A22496m6431B3168j413a04325E16898k27535
11460B89363A00610D9111O7105m6463P1569E5664B0792a32911b3337B24460a3766
$$ y = [33664, 121003, 32299, -55871, 277251, 254165, -41738, 61317, 385601, 170954, 106148, 348543, -123627, 393882, 103949, -110972, -169926, 41594, 146299, 85695, -142453, 213493, -727, 83872, -161144, 268516, 447720, -40135, -84112, 41955, 110911, 73449, -56697, 125454, -131807, 219040, 59221, -236038, -312288, 135391, -30193, 17751, 52274, 276409, 704482, 327011, 26750, 284913, 457494, -137807, 52574, 372410, 217016, -124208, 575312, -116889, 231486, 117993, 286630, 11687, 297203, -87647, -195490, 692280, -92987, 56986, -96634, 121592, 39342, 138546, 281978, 122496, 76065, 23168, 21755, -104325, 516898, 289363, 100610, 49111, 116216, 69753, 141322, 55664, 20792, -132911, -23337, 224460, -13766]
11448A46847J83059l1571b199A22856f5014B12115J15288G6585K22144j02276
11438A96453a8317E2319O976h9503A03664O5099b14799d4974B500J71703b1581
11426c22926c1136A73137J82533a91108A30002k0732R9612b10525e2998K74k46591
11415b99315I003M0416A612a00B58838q3651d4098B99465j48288G2542P4038J28357
11403B74937G3654B3194J92457I6535R670J18076l8691b73088E0745K10918g107
11391I5881j9123K2756g1738A13734b81445A01074B6707c8768j2301j68542A15148
11379A7075J83215i0436B02360b79512E58160F6139J36910a32469j39320E284
11368a75551M4503j9826I2789h3969F8908k6355L00775C2442g7126k03011h3358
$$ y = [146847, 329906, 298335, -2199, 122856, -65014, 212115, 327403, 76585, 298729, 196453, -18317, 52319, 59295, -89503, 103664, 168763, -214799, -44974, 2500, 174203, -21581, -322926, -31136, 173137, 355670, -191108, 130002, 109270, 208882, -210525, -52998, -52724, -299315, 9003, 49419, 1612, -100, 258838, 175187, -44098, 299465, 151177, 72542, 146580, 274937, 73654, 23194, 215651, 96535, 106205, 224281, 185590, -273088, 50745, 261663, -7107, 95881, 76758, 99514, -71738, 113734, -281445, 101074, 26707, -38768, -51069, -219611, 115148, 17075, 200290, -90436, 202360, -279512, 558160, 66139, 203049, -132469, -271789, 5284, -175551, -131048, -150874, 92789, -83969, 68908, 42553, 343328, 32442, -77126, -280137, -83358]
11356A82464L9244a58631a5477k81610g4533j77347C29238E5713b42108H7229
11345A43509J0264f0873J3181B24917a32302j42166J11490p9746a15127d5599
11334d45378E7225J09520C6417L8941b17068A40298n5744b09908H1140a0621j15688
11323a26309j64311q859g1331b6106o4953k33662D00849E3230a26078a1022k51442
11312b62464N7603A16715k5430N8175b38932d6362j02100B40181c53126d3492
11301b74251a02654q7488G5217c914A62767c5154F9462a39343B26596c53746i5069
11289A45585E637R962L38316a19372j79113I6162c06615A24811k1437B6926H04
11277b14022c4009j71605l4606A81685c58658A74901a2783D70562B548a37401
$$ y = [182464, 221708, -158631, -15477, -297087, -74533, -251880, 329238, 55713, -242108, 87229, 143509, 153773, -60873, -47692, 224917, -132302, -274468, -162978, -242724, -115127, -45599, -445378, 57225, 166745, 36417, 75358, -217068, 140298, 84554, -209908, 81140, -10621, -126309, -290620, -299479, -71331, -26106, -91059, -324721, 400849, 53230, -126078, -11022, -262464, -204861, 116715, 91285, 149460, -238932, -46362, -148462, 240181, -353126, -43492, -274251, -102654, -190142, 75217, -3914, 162767, -35154, 69462, -139343, 226596, -353746, -95069, 145585, 5637, 15599, 353915, -119372, -298485, 96162, -306615, 124811, 103374, 26926, 804, -214022, -34009, -205614, -240220, 181685, -358658, 174901, -12783, 470562, 2548, -137401]
11266A78022D6010c31223B33237f9705r151p6889R494A11241J09081C6100a24206
11254a88663A8414J07064d53428a18450A57282J10930a36686A55162c23915a17381
11243a85120f7032j42844A84007c08160a45364B16629a79094f282B89104r5540
11233A93564b01867i6661d4086A30590c18811d8631m8673B7653d61170A10893
11222e9884A19568a21304A924b153j59867c5997D0305l519b47803N3805K7218
11211a66780j43704J7047B24807L3353A05926a45005e8186O250n4109c7260m0311
11200g7571k80428a33480N655L5358k0415j6556A05433b54624i4741C10078a20910
11188b64312A44839c65516J27584d8573H7601Q9432e2950r6215B59056a3767A28802
$$ y = [178022, 46010, -331223, 233237, -69705, -78856, -155745, -146251, 111241, 220322, 36100, -124206, -188663, 18414, 125478, -453428, -118450, 157282, 268212, -136686, 155162, -323915, -117381, -185120, -67032, -209876, 184007, -308160, -145364, 216629, -179094, -6282, 289104, 193564, -201867, -96661, -44086, 130590, -318811, -48631, -97304, 27653, -461170, 110893, -59884, 119568, -121304, 1924, -2153, -162020, -35997, 40305, 36786, -247803, -193998, -166780, -310484, -293437, 224807, 258160, 105926, -145005, -58186, -51936, -106045, -37260, -77571, -357999, -133480, -127825, -92467, -112882, -129438, 105433, -254624, -94741, 310078, -120910, -264312, 144839, -365516, -237932, -48573, 87601, 177033, -52950, -149165, 259056, -13767, 128802]
11176a55910c6230A04332m2022A2240c86592g692m28809a40603e2178b2018k96050
11165c18068b8933F0327a02953j59564B0283b89572F8790b86915A66488E2396
11154h5115o9225n091I7669a71833j62860A63247O16i2134A2183L66964D4990
11142B02511i0635B16359H1417O8387E7759J60442A5161D250K66637a50769A56625
11130A05526e8594B64871A992K22185c8618j58225B13386a3785B12976a00554
11119A21970Q6831j2481a03133A86069c0637I4190l8878P3588R8748L4870A00131
11107A48682c1303B7936K01061p7652L62904C7477J16090F2655g7093A85258K86034
11096D71292l8611F9419i6948C14777q1466p0161h867p8034B67666r9382C2304
$$ y = [-155910, -36230, 104332, 62310, 12240, -386592, -7692, -436501, -140603, -52178, -22018, -318068, -28933, 60327, -102953, -262517, 20283, -289572, 68790, -286915, 166488, 52396, -85115, -154340, -159431, 97669, -171833, -334693, 163247, 163863, -92134, 12183, 379147, 44990, 202511, -90635, 216359, 81417, 149804, 57759, 218201, 15161, 4250, 270887, -150769, 156625, 105526, -58594, 264871, 1992, 224177, -38618, -196843, 213386, -13785, 212976, -100554, 121970, 208801, 196320, -103133, 186069, -30637, 94190, 55312, 128900, 227648, 262518, 100131, 148682, -31303, 27936, 228997, 151345, 514249, 37477, 153567, 62655, -77093, 185258, 471292, 432681, 69419, -96948, 314777, 233311, 163150, -8867, -86901, 267666, 168284, 32304]
11084C23714J85151a14998H7296J46724I8002J28714P8565J2944D2084K68377
11074C10461j25845n2140M82274A47945O2050K3382D5035J6294L27157L78376
11064G66862C45958j52765J76212Q7959A47537N35533k78599j94119O19244k72823
11054E56773L28630j31522k66950K03180J28081j14662j22540K79382k07740j63352
11044D89280L44384j87851q9874K7970J21213l10846L50384k29747k01318L18956
11034F32551j4256K17972k85271M0783J51287L9475j86078j24338K44257k14143
11024E02239K06172j13108J39998q6240k69648L05437j76935L75613l55385j06173
11014D21970J30100L85124m44809J06722q1370k27097Q6266J11495K78822j86377
$$ y = [323714, 508865, -114998, 87296, 234020, 98002, 226716, 305281, 318225, 42084, 310461, 184616, 132476, 614750, 147945, 209995, 233377, 45035, 61329, 388486, 766862, 345958, 193193, 369405, 457364, 147537, 683070, 404471, 210352, 829596, 556773, 885403, 753881, 486931, 690111, 818192, 703530, 580990, 860372, 652632, 489280, 833664, 645813, 555939, 583909, 705122, 394276, 744660, 514913, 313595, 632551, 618295, 836267, 550996, 591779, 743066, 782541, 596463, 472125, 716382, 502239, 708411, 595303, 735301, 649061, 379413, 684850, 507915, 883528, 528143, 421970, 552070, 937194, 492385, 599107, 517737, 290640, 376906, 488401, 767223, 580846]
11004E80846J29436j03167j1834j26349P5397m1010K19429j70986j08423J30441
10994E73780B84238L21893P8160k21814K01364Q6734R4605j04655J55182K71451
10984A167158j06734j65613M524K80492L44008m20248J55447j16220O56769L68395
10974B167978K40609K46185j59866J06771L66401o2840p91617j6750L3263O915
10964B137049l54511k17545M2422J55213J6584K52074P7533r9568j31209L29171
10954B207213p14183j3311J25564o01254J93333l53664j38796l31781n5248M29638
10944G47511A20081D8776K52003Q6855j05120N1942A25433J40235j10515O9837
10934B24990L19377g0858B8952L7309L52603p0286c2882A58199Q8929p3866c5077
$$ y = [580846, 710282, 607115, 595281, 468932, 544329, 503319, 722748, 551762, 443339, 573780, 284238, 606131, 684291, 462477, 663841, 750575, 845180, 740525, 895707, 1167158, 1060424, 894811, 899335, 1179827, 1523835, 1103587, 1259034, 1142814, 1799583, 2167978, 2408587, 2654772, 2494906, 2601677, 2968078, 2905238, 2113621, 2096871, 2130134, 2137049, 1782538, 1564993, 1607415, 1762628, 1779212, 2031286, 2108819, 2009251, 1878042, 2207213, 1493030, 1479719, 1605283, 1004029, 1197362, 843698, 704902, 373121, 317873, 747511, 120081, 48776, 300779, 387634, 282514, 334456, 125433, 265668, 155153, 224990, 544367, -70858, 28952, 66261, 418864, 348578, -32882, 158199, 247128, 173262, -35077]
10922C93240i5110A23099M3878j7410O8303c91094G8093h458k59435I2791b12498
10910b28646e08k7981j40542H8104J08909B7130b67132J11565D2332A8903K45630
10899B64533B3837a84432j0865L6855H0732J40393b20718H2301b30446G5665c34830
10887b7573a2897r5731M7768k02129C14784g7283k9258M7891j57564d517k00882
10876b05399B7161h9693A35997a4534A07281K03792K8834g0181A60609g7801b6130
10864a66504g0257A73681b860B91353j14232q4267a59855j19583A90862a58674
10853h9268j09042h6844B90495D7938R8119M9453a44305G1336A8160J51083i8100
10841c80572A2922K65661a16365b350I9693f8369A29072b8638A91330a44728j8917
$$ y = [393240, -95110, 123099, 166977, 149567, 217870, -391094, 78093, -8458, -267893, 92791, -212498, -228646, -508, -28489, -169031, 88104, 197013, 27130, -267132, -155567, 42332, 18903, 264533, 23837, -184432, -195297, -158442, 80732, 221125, -220718, 82301, -230446, 75665, -334830, -27573, -12897, -108628, -60860, -262989, 314784, -77283, -106541, -58650, -216214, -4517, -205399, 27161, -89693, 135997, -14534, 107281, 311073, 339907, -70181, 160609, -77801, -26130, -166504, -70257, 173681, -2860, 291353, 177121, 92854, -159855, -279438, 190862, -158674, -89268, -198310, -86844, 290495, 47938, 146057, 195510, -144305, 71336, 18160, 169243, -98100, -380572, 12922, 278583, -116365, -2350, 99693, -68369, 129072, -28638, 191330, -144728, -163645]
10830a63645B49240r4755K28699d2482H230a11375A13906c04604Q1135P7344j53075
10819b99200B35716d4560k45941P0459B84311b28127Q4571B43555a17570K1767
10809i5803j67610N6485E9247j0020b26805D1618c86621Q723F6309d055m0319
10798d4374A2427a24386L9042j64235m9415g5753q8394p4494b9280C1591a07748
10786c66280a31459A90655b87264i5516M2750F5600J8689a28881a3871C0523L4772
10775F5295a01962L3278F005N7431b35795N9169A10063J45756C3247L3000a94588
10763A47303J1907F4855c72690B33156A10315f5911D4054J66041b81437J01015
10753a80422M4576e9245g72j05731B74651a83651P3563m0927A62178B9724J90863
$$ y = [-163645, 249240, 154485, 383184, -42482, 8230, -111375, 113906, -304604, -223469, -146125, -299200, 235716, -44560, -290501, -220042, 284311, -228127, -143556, 243555, -117570, -95803, -263413, -206928, 59247, 49227, -226805, 41618, -386621, -377898, 66309, -4055, -44374, 12427, -124386, -85344, -249579, -298994, -75753, -164147, -238641, -29280, 31591, -107748, -366280, -131459, 190655, -287264, -95516, -52766, 65600, 84289, -128881, -13871, 30523, 65295, -101962, -68684, 6005, 63436, -235795, -176626, 110063, 255819, 33247, 66247, -194588, 147303, 159210, 64855, -372690, 233156, 110315, -65911, 44054, 210095, -281437, -180422, -135846, -59245, -772, -106503, 274651, -183651, -110088, -151015, 162178, 29724, 220587]
10742B20587m6389K3315a42849h396k03301B5443e3966k02187B01210a27156A56903
10730c2445q448q5773B31922l6446l2831a92834k7984J3279k1698A3668i7549
10718A62883E2467k3100a43420A66062n1257b68981J33488J4608G8255b21579
10707A1346a76733C2957b08988B3645r878J29710B6740I643i1987k29059J08314
10696b12732H3993c40642h7209I5717D3774g3767c3418C89659a63625j54124C36371
10684f5083E6549K636J53979b97276h8435D4112b17001q2458J37286A55246g5396
10672a417k07684A4807J27118A0365a55615N5924d8429j5182j09892j7988B34549
10660c3750E0015a84379K6500k9490k56100G9936K2867a0659E2994L3819b12703
$$ y = [220587, 174198, 197513, -142849, -8396, -211697, 25443, -53966, -256153, 201210, -127156, 156903, -32445, -40893, -126666, 231922, 195476, 162645, -192834, -220818, -207539, -229237, 13668, -97549, 162883, 52467, 29367, -143420, 166062, 114805, -268981, -135493, -120885, 78255, -221579, 11346, -176733, 32957, -208988, 23645, 13767, 143477, 26740, 9643, -91987, -321046, -212732, 83993, -340642, -87209, 95717, 43774, -73767, -33418, 389659, -163625, -317749, 336371, -65083, 56549, 59185, 213164, -297276, -88435, 44112, -217001, -299459, -162173, 155246, -75396, -1417, -209101, 14807, 141925, 10365, -155615, -99691, -48429, -63611, -173503, -191491, 234549, -33750, 50015, -184379, -157879, -187369, -443469, 79936, 102803, -10659, 52994, 86813, -212703]
10648e1251o4283J6742d119o4644a6492j31216j32057A22647a22471A77L8049
10637C8226d43762b05240h2947b8625B17671a82366M8794J4010c8008B99493a23656
10625a62467A24091a4335n6886p1918r5308m4255d7111A54360c8533B3392J51500
10614A74892m4610h9375g681q5822B69622b9635j61195N451j00349a35981a1610
10602d5466B62055a28807l87053B11469a87564P2586C9012L3998L1177b96983
10591b88821A22b31015R0523A40450J43152c34251d1746A73974a58286H5118b32795
10579B16710J25863g8298A62187J61652A16298K32371h1625r2732f4662P124r6256
10568a53794l7552B12474G9045b08419B55533a76841N1940k7233k9611g9647A48987
$$ y = [-51251, -115534, -98792, -4119, -68763, -16492, -147708, -279765, 122647, -122471, 177, 38226, -443762, -205240, -82947, -28625, 217671, -182366, -133572, -119562, -38008, 299493, -123656, -162467, 124091, -14335, -71221, -143139, -238447, -282702, -47111, 154360, -38533, 23392, 174892, 130282, -89375, -7681, -93503, 269622, -29635, -190830, -185379, -285728, -135981, -11610, -45466, 262055, -128807, -515860, 211469, -187564, -114978, 39012, 73010, 104187, -296983, -288821, 122, -231015, -140492, 140450, 283602, -334251, -41746, 173974, -158286, 85118, -232795, 216710, 342573, -78298, 162187, 323839, 116298, 348669, -81625, -174357, -64662, -57538, -153794, -191346, 212474, 79045, -208419, 255533, -176841, -124901, -152134, -181745, -79647, 148987]
10556E7913b05565n6040J4449g8856l69838A12024b18524C2887J17218E0290a72006
10544D04385G5282J89440e7021B01397e93817a05765E7780f896A07039c44326
10533I5095d7707j00316C10982c47762M4546f1600q8311j52822M0439B4783R981
10522C4764a02323J6480j6093j44337q7821c5960n2179A82409e4597H1850a48220
10510H7000b69210B6587d1368i920A8234d9001j45116D4954J57215A6684a46787
10498c03707A02802a5538j76598P4201H6879d1661m58060H5358a03617j18107
10488b21724b7423D0524c1659A94338l4099D0983L94794A64612K34292l035D5495
10476A06173J86971a18372E6188J09220K829j9950M615a0386l3443n1082c944
$$ y = [57913, -205565, -261605, -247156, -78856, -448694, 112024, -218524, 32887, 150105, 50290, -172006, 404385, 75282, 264722, -57021, 201397, -593817, -105765, 57780, -6896, 107039, -344326, 95095, -47707, -148023, 310982, -347762, -303216, -61600, -149911, -302733, -262294, 24783, 34764, -102323, -85843, -101936, -246273, -334094, -35960, -88139, 182409, -54597, 81850, -148220, 87000, -269210, 26587, -41368, -9920, 18234, -49001, -194117, 44954, 202169, 16684, -146787, -303707, 102802, -15538, -192136, -117935, 86879, -41661, -499721, 85358, -103617, -221724, -27423, 40524, -31659, 194338, 160239, 40983, 435777, 164612, 398904, 395869, 45495, 106173, 293144, -118372, 56188, 165408, 168237, 148287, 152902, -10386, -43829, -94911, -3944]
10464D20236C4241K20305q7746f9568A3894K03635c623m6310B6733c27543h6097
10452B1380a28772m7736a9781I4975b79146h5534p8501D6250P3037E2301b7139
10440A48897a73112D0677a30277n4B48221p3312o0752O7591A2234K36143c40502
10428e2117A3366O333J14646O1373N4372a29680c4592B93711a67285A67016a00756
10416g679j26907a3091j02295r3145B73561e13619b43363A01473c11380c8696
10405h7606B54935I2703d7314j33663A13750D5691A8160c30063J41834B73695
10394a65165C08969M6129k9821n8517b1246A34528h5085B21283j5768q4250C170
10382B6370e810p6301E1389r754R6084f1268A87187P1993K1514p8623E6532K41443
$$ y = [420236, 34241, 254546, 166800, -69568, 13894, 217529, -3623, -49933, 26733, -327543, -86097, 21380, -128772, -176508, -19781, 94975, -279146, -85534, -164035, 46250, 119287, 52301, -27139, 148897, -173112, 40677, -130277, -130331, 248221, 174909, 114157, 181748, 12234, 248377, -340502, -52117, 13366, 19699, 134345, 195718, 250090, -129680, -34592, 293711, -167285, 167016, -100756, -7679, -134586, -13091, -115386, -208531, 273561, -513619, -243363, 101473, -311380, -38696, -87606, 254935, 92703, -47314, -180977, 113750, 45691, 18160, -330063, -188229, 273695, -165165, 308969, 355098, 325277, 266760, -21246, 134528, -85085, 221283, 205515, 121265, 3170, 26370, -5810, -82111, 51389, 41635, 137719, -61268, 187187, 259180, 280694, 202071, 56532, 297975]
10370B97975A17911j8647K61916K0291K74138B74483P7619j45470J15051A14142
10359B4238M01819M1612A53691p5459J77571J00317a1678D40943j76800P5711
10349C39854O4893j70124q0428J02427F0490N43324m4447k45401F6202a38273
10338D37141A94259J12836R9286C1820b19460B45700k7668N3610B0538a00071
10327A0418f000A04495a00824L6042j08852B97747R2068A73135K9067N5246I7671
10315G9069J3997j9569a12939J782D800a2096B58825d2965K747B65158F6973a00725
10302C5487a57136K2390B31492B9621a79941g4117C16135B5544K29714a70017
10291a57937A71751b38238e5478A07753A0524c3832j43986B06039A00134a54116
$$ y = [297975, 117911, 99264, 361180, 381471, 655609, 274483, 352102, 206632, 321683, 114142, 24238, 426057, 467669, 153691, 78232, 255803, 356120, -11678, 440943, 264143, 339854, 404747, 234623, 154195, 256622, 60490, 603814, 559367, 313966, 66202, -138273, 437141, 194259, 307095, 406381, 31820, -219460, 245700, 218032, 271642, 20538, -100071, 10418, -6000, 104495, -100824, -64782, -173634, 297747, 389815, 173135, 202202, 257448, 97671, 79069, 93066, 73497, -112939, -111157, 4800, -12096, 258825, -42965, -40218, 265158, 66973, -100725, 35487, -157136, -134746, 231492, 29621, -179941, -74117, 316135, 25544, 255258, -170017, -157937, 171751, -238238, -55478, 107753, 10524, -33832, -177818, 206039, 100134, -154116]
10280h9824k9131d3745A45782b0390k15223A63030b27036J3692g163I0596I030
10268a86000C06546j35388O2765K4180A9974K91757a2577D01306M2756j89855
10258B54207K0196K12522A78362J04514c3324C22202a14352B88862c08171n7138
10248c65309f5753F9509J95160e0955l41223a01418M5437D4382K8078c18580g4670
10236A1103K6573e5679m276k99327a40569C0540b10770Q2292c1131G7881J46110
10225B23991b06259g8136C3685K6676b22213R1583n7481h2076b0120c998A42968
10213F1159K1791K873K66171b24245A68010c4241A22077c7978j68706L7484C3195
10201b51799q2099a21343j02521C169O602a74357c7715A68247D3969d4643l28738
$$ y = [-89824, -118955, -43745, 145782, -20390, -235613, 163030, -227036, -213344, -7163, 90596, 9030, -186000, 306546, 171158, 233923, 258103, 19974, 311731, -12577, 401306, 444062, 254207, 274403, 486925, 178362, 282876, -33324, 322202, -114352, 288862, -308171, -365309, -65753, 69509, 264669, -50955, -392178, -101418, -55981, 44382, 72460, -318580, -74670, 11103, 37676, -55679, -59955, -359282, -140569, 30540, -210770, -128478, -31131, 77881, 223991, -206259, -78136, 33685, 60361, -222213, -130630, -188111, -82076, -20120, -3998, 142968, 61159, 82950, 85823, 351994, -224245, 168010, -34241, 122077, -37978, -206684, -169200, 33195, -251799, -333898, -121343, -223864, 3169, 9771, -174357, -37715, 168247, 43969, -44643, -373381]
10190c73381J57998j73306a00337j51866a03224m6743j6906B3169e4025B93384
10179G941N746O6362a20642q177A17899L1191h7497k57765r0954G7513a61594
10167a81569K5299A39334J05195D929c07861A10510b06650G6364L4417a62243
10156a88518A12753a3634m3212k39328A13543a02985j22904a0795j67554A90632
10145a18707A81497b8468r8697B17061B5188M0175A3191Q1323e7851o1135B22984
10133A9262K2977a28067H349J10346a43530B4580d5679l51709a50574e5759j76463
10122b32222A59329b09404c3447l10485C1136C853g2361A98205c5239o6454j10635
10111b12328c0043k2938H6540a25906b2203F2529a40888k58042c0936l3895p3064
$$ y = [-373381, -215383, -388689, -100337, -252203, -103224, -149967, -166873, 23169, -54025, 293384, 7941, 13687, 80049, -120642, -128819, 117899, 149090, -87497, -345262, -436216, 77513, -161594, -181569, -156270, 139334, 244529, 4929, -307861, 110510, -206650, 76364, 110781, -162243, -188518, 112753, -13634, -56846, -296174, 113543, -102985, -225889, -10795, -178349, 190632, -118707, 181497, -28468, -127165, 217061, 25188, 65363, 13191, 94514, -57851, -118986, 222984, 19262, 42239, -128067, 8349, 118695, -143530, 24580, -45679, -397388, -150574, -55759, -232222, 159329, -209404, -33447, -343932, 31136, 3853, -72361, 198205, -35239, -101693, -212328, -30043, -52981, 86540, -125906, -22203, 62529, -140888, -398930, -30936, -64831, -137895]
10100a37895B96932g5697k42349f7965e431j0214C7812g5021l62312B764g1563
10088B49022h4122C5059K60541a49250L8695F1246a4560C82380f2299A81084e9004
10076e9842B7843b81258A99475c12814e2002k70214J56671a5026C8340e5309E9365
10064a84116N9984B07569a81498E1764c6498A64608G7947k2904J83046E9954r046
10053E0908P1427b53860k9408A9718f6905j72606Q9555j22135j13615g2634B44
10041C5965h7769A20200b14778d6369J9799K21k25997B6480L4222k7336b97649
10029a35165p512H6925c03809D220a45676J7805G9552a61695e4363A62277L1300
10018A93577a12399N2610F6016a76446O0735I8988g6963R979L1935D3449O9901
$$ y = [-137895, 296932, -75697, -318046, -67965, -5431, -15645, 37812, -75021, -437333, 2764, -71563, 249022, -84122, 35059, 295600, -149250, -110555, 61246, -14560, 382380, -62299, 181084, -59004, -59842, 27843, -281258, 199475, -312814, -52002, -322216, -165545, -15026, 38340, -55309, 59365, -184116, -124132, 207569, -181498, 51764, -36498, 164608, 77947, 55043, 238089, 59954, 50908, 122335, -253860, -283268, 19718, -66905, -239511, -149956, -272091, -385706, -72634, 244, 35965, -87769, 120200, -214778, -46369, -26570, -26349, -252346, 26480, 60702, 33366, -297649, -135165, -142677, 86925, -303809, 4220, -145676, -127871, 79552, -161695, -54363, 162277, 193577, -112399, -59789, 66016, -176446, -115711, 98988, -76963, -66984, -35049, 43449, 113350]
10007A13350h2413l56313I0522J94648c18043B43386h0144A68823p2763g224l3446
9996d0670B874Q1095M2984D7670f6538j45863J01775j87125E0912a3808r8820
9985a12628B12262a82802f6885H3204K62967a71506A68171g5529D46394b91477
9974b5727l68199Q9992a26242d1483B5674k722d7694n5848j1052k25731Q6241
9963b54084A65250c25095H7695c77861A38120a54166j32657A84470a36805B41399
9952d8067j5607b4611F1437b60822N1838f4880j04295d7688A68358D6857e2508
9940B42977B2821a34014e2310A36450f5875l035G2842A5088a04815K2464q6671
9929a69022A45183G2101a347j21064I4711b36153a15475A2072b33601j00503J18790
$$ y = [113350, -82413, -438726, 90522, 285170, -318043, 243386, -80144, 168823, 96060, -7224, -40670, 2874, 83969, 126953, 47670, -66538, -212401, -110626, -297751, 50912, -13808, -112628, 212262, -182802, -66885, 83204, 346171, -171506, 168171, -75529, 446394, -291477, -25727, -393926, -303934, -126242, -41483, 25674, 22952, -47694, -103542, -114594, -340325, -254084, 165250, -325095, 87695, -377861, 138120, -154166, -286823, 184470, -136805, 241399, -48067, -63674, -24611, 61437, -260822, -208984, -64880, -169175, -47688, 168358, 46857, -52508, 242977, 22821, -134014, -52310, 136450, -65875, -68910, 72842, 15088, -104815, -82351, -169022, 145183, 72101, -1347, -122411, 94711, -236153, -115475, 12072, -233601, -334104, -215314]
9918b15314k03275C3740g233C81285h1189l7139J5045H58L56450j14031a18712
9906B7822c9141j52353g4809k1808k9400E4222A5265i7409A15803a9994j01372
9895a21366p8024r4615b4848C40244b29825K9104J2108j10248F9397K722e2661
9883a11194A41926a73450A74844a05454J1633l3169m9369j43530C90541A25888
9872h7703D3444M8977J01442f5147K2575j97684g8934l60771J56152Q1367H2195
9860d2305G6449C8196J27514M1225E5767k968b42804j5027i1270m02430c7269
9848a06455j13834L0422a777n8639B9201P0718b87052A92969b73442m6585d1169
9836i178j27373C35665F8759M4645b77911a2223n2192q2398J2841G0478d30371
$$ y = [-215314, -418589, 33740, -7233, 381285, -81189, -118328, -103283, 858, 357308, 243277, -118712, 27822, -39141, -191494, -74809, -96617, -126017, 54222, 15265, -97409, 115803, -19994, -121366, -199390, -294005, -24848, 340244, -229825, -200721, -188613, -298861, 69397, 72119, -52661, -111194, 141926, -173450, 174844, -105454, -93821, -126990, -176359, -319889, 390541, 125888, -87703, 43444, 92421, 193863, -65147, -42572, -240256, -78934, -439705, -283553, -202186, 82195, -42305, 76449, 38196, 165710, 206935, 55767, 52799, -242804, -257831, -91270, -493700, -37269, -106455, -220289, -189867, -1777, -60416, 29201, 99919, -287052, 192969, -273442, -320027, -41169, -9178, -136551, 335665, 68759, 113404, -277911, -12223, -64415, -146813, -133972, 70478, -430371]
9824g3906R718B33813m8109a98233j53631R083A21965b28824B8107i4697K1434
9813g3263e465l38277p7791a63853j70158M9242J20083q2619B6746i1138p5595
9802a66733j04216O4243J4155P3366D60291j69652A935e4944K7362H8053N5521
9791A43574o5946a85060g111A17031A413L28312a70035A39446a26290A02991d20548
9779a16520A01132b84958B79312M0031B6381J53269d37862b0604k20613G5678
9768H120J9382a26438b8228E1556e1398j2358H7480B5227a45310g890j29518j9539
9756a56947m0874P4883A42239b85213A23959c09855a21712q3725i7733k3082O20
9745a20195k91079a05277k3610A20118g4845A90169a44211M4741f498j59794j17733
$$ y = [-73906, -64188, 233813, 185704, -198233, -351864, -342781, 121965, -228824, 28107, -94697, -73263, -5465, -343742, -421533, -163853, -334011, -284769, -164686, -247305, 26746, -91138, -166733, -270949, -206706, -192551, -119185, 460291, 290639, 1935, -54944, -27582, 88053, 143574, 77628, -185060, -7111, 117031, 1413, 329725, -170035, 139446, -126290, 102991, -420548, -116520, 101132, -284958, 279312, 319343, 26381, 179650, -437862, -20604, -241217, 75678, 8120, 27502, -126438, -28228, 51556, -51398, -63756, 87480, 25227, -145310, -7890, -137408, -156947, -197821, -122938, 142239, -285213, 123959, -309855, -121712, -205437, -97733, -120815, -120195, -411274, -105277, -128887, 120118, -74845, 190169, -144211, -99470, -6498, -166292, -284025]
9734b84025h2765c303o2723l00196J48307k43410B30077A06299N0352l4174a76121
9722g970n5631j35937i3069l9769E3926N6636b38414f6322k93173A00203a29864
9710b35771K732i5517j32085A89928O2450a01190k7597D7679c71840a81396A75365
9698a15423C469b41970B92895a94799o1222B85899G9241J37934J20963i6667B6970
9686b04500A91781c76594i2410M5604q8421B65526a88967J6648H410J92442g5602
9674h1966k42157B36052c95755a7488k00346f6479c641j22159C17261c9391A57678
9662c5332o4658k0206A651K5335e77A13080J0973b0510j46528o5988k63527K10640
9650b85913J06381j944l1097D459e6417A50313J6897a35922N9054j00123g2607
$$ y = [-284025, -82765, -3303, -66026, -366222, -217915, -461325, 230077, 106299, 156651, 122477, -176121, -7970, -63601, -199538, -93069, -132838, 53926, 110562, -238414, -66322, -359495, 100203, -129864, -235771, -233039, -95517, -227602, 189928, 252378, -101190, -128787, 47679, -371840, -181396, 175365, -115423, 3469, -241970, 292895, -194799, -256021, 285899, 79241, 217175, 338138, -96667, 26970, -204500, 191781, -376594, -92410, -46806, -135227, 265526, -188967, -172319, 8410, 200852, -75602, -81966, -324123, 236052, -395755, -17488, -217834, -66479, -3641, -125800, 317261, -39391, 157678, -35332, -99990, -120196, 1651, 26986, -577, 113080, 124053, -20510, -167038, -233026, -496553, -285913, -179532, -181476, -212573, 4459, -56417, 150313, 167210, -135922, -76868, -176991, -72607]
9638C4596b09991C03209e3945E5663h6245c1071j62735c4516R64B01960B3697
9626a77166j96378J5664A71628b56963j45410R0914E6577j3256N750h4197j319
9615h5516j21655O7345C99393e7328a8793C4496c51226a13424k18922h9455l480
9604i2935A54194i9786G9847d18497C0413J53372f1447b4520p1718m2383A45682
9592a68336B3128g8967A07378d8229j36538A78212a95553l19184A59352L7590
9582A96942G3765L8936K7272D8905b34426F0459O6101c4809j08561C4172j4274
9571A9898A270a89687n5763p1943A81248c08866Q9519b3476l89649a84438K9800
9560a54638L4226m1790a320n3378O907e172H8119j2288q920a49473D9307L8044
$$ y = [34596, -209991, 303209, -53945, 55663, -86245, -31071, -193806, -34516, -33552, 201960, 23697, -177166, -373544, -357880, 171628, -256963, -402373, -311459, 56577, 43321, 49071, -84197, -85516, -207171, -139826, 399393, -57328, -18793, 34496, -351226, -113424, -332346, -89455, -92935, 154194, -99786, 79847, -418497, 30413, 183785, -61447, -24520, -96238, -138621, 145682, -168336, 23128, -78967, 107378, -48229, -184767, 178212, -195553, -514737, 159352, 196942, 73765, 112701, 139973, 48905, -234426, 60459, 126560, -34809, -143370, 34172, 19898, 1270, -189687, -245450, -317393, 181248, -308866, -219347, -23476, -413125, -184438, -154638, -120412, -162202, -1320, -54698, -47791, -5172, 88119, 75831, 66911, -149473, 49307, 87351]
9548H7351a72059i966q0302b8691A18365M1838b3276q8157M2245b3968G732J24333
9536A32065J02341l1581a71507A185K15018b9517B02847p6544C4453O6921R1136
9525A92510c38737J63479Q0248c2834B68097c57601D156J11892E4081a12095M6362
9514f5733l2778c9700B799a27255j0285E5097a76843q978N4341B34358C9357K0703
9502F0060b077j3072A87599C0672J15007o8014b71834m9695A10078B3387J07551
9491A30938A7850b28206Q9676e9087l0265B4292f4844j67245B12247a27217p1632
9480a98849L7712e9673j06290A86727b47370A7066c54211a61740N8518O156B8992
9468b71503G398R0635a04630d2508l05505a28312a4067m32683F4275e9141r96
$$ y = [87351, -172059, -9966, -90268, -28691, 118365, 160203, -23276, -111433, -69188, -23968, 7732, 132065, 234406, 202825, -171507, 1185, 216203, -29517, 202847, 126303, 34453, 101374, 192510, -338737, -175258, -95010, -32834, 268097, -357601, 4156, 116048, 54081, -112095, -65733, -98511, -39700, 2799, -127255, -137540, 55097, -176843, -185821, -131480, 234358, 39357, 60060, -2077, -15149, 187599, 30672, 145679, 77665, -271834, -321529, 110078, 23387, 130938, 17850, -228206, -138530, -59087, -89352, 24292, -64844, -232089, 212247, -127217, -198849, -161137, -59673, -165963, 186727, -247370, 17066, -354211, -161740, -103222, -97066, 28992, -271503, 7398, 98033, -104630, -42508, -348013, -128312, -14067, -446750, 64275, -59141, -60137]
9457f0137j26241C5863a3862m16981A42516F7858O6783a77261l9700H3247b23125
9445F3697a27630l09782J04341D0711b0248j15213k30487a72165m3258e8248j2207
9434g0455J4352b4103A74499J75508a80700G0102a78698I1427k6949g9915j0419
9423i0334j17004c4777k17746a05332m4076j0627C30522G3610b68458A12675C5293
9411a09962N766A82116g1885A07396J9532d6204p9381I9647b057j65431f4617
9399b15494J0570R714b2535C3261c00756l2309C45668A26227k1696L3855M0904
9388A79290H0020k1312M7832R2174b82788h4764F7642b29831B34518a72460m516
9377a76976C5677P7775L2533e7509k8733k05129Q0655P9982I6245a17029j9368
$$ y = [-60137, -186378, 35863, -13862, -430843, 142516, 67858, 134641, -177261, -216961, 83247, -223125, 63697, -127630, -437412, -333071, 40711, -20248, -135461, -365948, -172165, -215423, -58248, -70455, -56103, -24103, 174499, 350007, -180700, 70102, -178698, 91427, 64478, -79915, -90334, -207338, -34777, -252523, -105332, -149408, -160035, 330522, 73610, -268458, 112675, 35293, -109962, -104196, 182116, -71885, 107396, 126928, -46204, -125585, 99647, -2057, -167488, -64617, -215494, -204924, -195210, -22535, 33261, -300756, -333065, 345668, 126227, 104531, 138386, 179290, 80020, 58708, 106540, 198714, -282788, -84764, 67642, -229831, 234518, -172460, -176976, 35677, 113452, 145985, -57509, -86242, -291371, -210716, -130734, 96245, -117029, -136397]
9366a36397B9984Q2000b97471e0428m8299d4979j90008O4252A32597b04401a3949
9354b08636e6793B22775a77495E2453c01842k46037h6677j74423j97021d4936
9343I37R7011h4556h01A36762b04560a3488o4292k1661H4606l405R7464F6450
9330b78136G889e9539j2336I3451f26157b24962j74685a15839I931M4838e3003
9318B14436I4985J39131N2399a27441B99240A1854b36903c9018j01395H7778h7130
9306a49552A90046F0610A179M0627d29399O6590C6107c73270a23408m5480g8347
9294D4352a99529k05996I2579j44a94654q0180C8857a33741j71727j419J26436
9283a80451A80325P7715A11478a40651H4033d153A945c8796o545C8431J45717
$$ y = [-136397, 29984, 111984, -297471, -50428, -98727, -44979, -234987, -170735, 132597, -204401, -13949, -208636, -56793, 222775, -177495, 52453, -301842, -547879, -86677, -261100, -458121, -44936, 937, 97948, -84556, -801, 136762, -204560, -13488, -77780, -99441, 84606, 81201, 178665, 66450, -278136, 7889, -59539, -71875, 93451, -626157, -224962, -399647, -115839, 9931, 54769, -53003, 214436, 94985, 234116, 286515, -127441, 299240, 11854, -236903, -39018, -140413, 87778, -87130, -149552, 190046, 60610, 1179, 41806, -429399, -362809, 36107, -373270, -123408, -168888, -78347, 44352, -199529, -405525, 92579, 92435, -194654, -274834, 38857, -133741, -305468, -306887, -180451, 180325, 258040, 111478, -140651, 84033, -4153, 1945, -38796, -45341, 38431, 184148]
9272A84148a50427H1949a12423A32119a92238b4520j66541a9460k37641d8589
9261b47644C18064j29654a50663D9353M9690d34390a34215N1368A44910A3957
9250a8227B15253a82191C8344b61298Q3459B58194b50706A73415d0793A97053
9239c74352a288k09138B24760J19630b34206J11553e9060A039a27538d6955H2891
9227h6901m9946j65300A45444a59818G6398j3382a00544A11062a75851A73108
9216a36806j5450O9209F5173b4404m2465j33150E7029k455j9788J17656B5242
9204c0356l5422k8635m2999q0375B42202a81719Q1281K1793l5809a339k39395
9193b40734D6480P9139b45143d2577J2653j33248M5327l3640A10465a87426j60554
$$ y = [184148, -150427, 81949, -112423, 132119, -192238, -24520, -191061, -19460, -257101, -48589, -247644, 318064, 188410, -150663, 49353, 99043, -434390, -134215, -82847, 144910, 13957, -18227, 215253, -182191, 38344, -261298, -177839, 258194, -250706, 173415, -40793, 197053, -374352, -1288, -210426, 224760, 344390, -234206, -122653, -59060, 1039, -127538, -46955, 82891, -86901, -136847, -302147, 145444, -159818, 76398, 63016, -100544, 111062, -175851, 173108, -136806, -152256, -83047, 65173, -24404, -66869, -200019, 57029, 54574, 34786, 152442, 25242, -30356, -65778, -94413, -137412, -217787, 242202, -181719, -100438, -78645, -114454, -1339, -240734, 46480, 125619, -245143, -42577, -29924, -163172, -117845, -151485, 110465, -187426, -347980]
9182c47980a06848G256b29369k7527D1181a62502j11543N6807f7394A77525G6643
9170B6319K7814g9333A98948F6792a35232a8294j839j79725G1433f36656K63311
9159c73345O7094A91817A6959a80771Q5803B93434j08685b42481D8617g4088F1970
9147E3806K12331g2510b6804j42907H6179b4059B71538A26520b04071A41386d2374
9135c81551A42411n7472f6443B46798c33943A03444B4427b7849j7453F6018J99638
9124B65656d40803K5037J93202c2645Q731n8258a7607j83064O4827q9456A68696
9112C25456a76741m2417G233K75842d00437a22311A21986a02216C24M754d17146
9100b6251H6380p42c71324N5273d7504o4453A60144E1394b0892k84743j8107d5912
$$ y = [-347980, -106848, 7256, -229369, -256896, 41181, -162502, -274045, -217238, -67394, 177525, 76643, 26319, 54133, -79333, 198948, 66792, -135232, -18294, -20133, -199858, 71433, -636656, -373345, -306251, 191817, 16959, -180771, -94968, 293434, 184749, -242481, 48617, -74088, 61970, 53806, 266137, -72510, -26804, -169711, 86179, -24059, 271538, 126520, -204071, 141386, -42374, -381551, 142411, 84939, -66443, 246798, -333943, 103444, 24427, -27849, -45302, 66018, 265656, -440803, -415766, -222564, -32645, -23914, -82172, -17607, -200671, -135844, -225300, 168696, 325456, -176741, -219158, 7233, 283075, -400437, -122311, 121986, -102216, 324, 5078, -417146, -26251, 86380, 85638, -371324, -316051, -47504, -111957, 160144, 51394, -20892, -305635, -323742, -45912]
9087c3457B20421a56650H5557J2977i168j16492o1875a1316j1646A53833d71280
9075a82717K6954C19756a49514j03457a13486D6527b3265o5325k5630A93518i2478
9063b47952A90079c2452A17842E585K2263c07483a49964K123j5895B54141b20863
9051b15728A05271c45116P8717D3847J42354b02695q3868A13691a68859j49623
9041c18482b4177m9301Q629K3956l67757a74479A5664J43414G5246a63495i536
9029f6344m3853A3851e8423K1637D9148O645b045k1674j43502l2597A77564b51780
9016A21493p708a12596A46417R9353a52198E9986k0605a79681H2894g9239q8246
9005a67485N2047J478b0442j87472j27495B548c46496a46769J3262o379k58939
$$ y = [-33457, 220421, -156650, 85557, 98534, -9168, -125660, -187535, -11316, -22962, 153833, -471280, -182717, -155763, 319756, -149514, -252971, -113486, 46527, -23265, -88590, -114220, 193518, -92478, -247952, 190079, -32452, 117842, 5585, 27848, -307483, -149964, -147841, -163736, 254141, -220863, -215728, 105271, -345116, -266399, 43847, 186201, -202695, -286563, 113691, -168859, -318482, -24177, -73478, -64849, -40893, -408650, -174479, 15664, 159078, 75246, -163495, -9536, -66344, -110197, 13851, -58423, -36786, 49148, 55793, -2045, -23719, -167221, -199818, 177564, -251780, 121493, 113785, -112596, 146417, 245770, -152198, 59986, 39381, -179681, 82894, -79239, -167485, -115438, -113960, -20442, -207914, -335409, 2548, -346496, -146769, -133507, -139886, -398825]
8994c98825a51379a7430A48319A7415b14434Q7232f3224J6047A80401h9872A43046
8982A39825F5326b85071j50432P3201I2271L3089e5353a5040j63901D6179a19697
8970D95605A65424J75203C7314Q3051B0613b1286j84530O1763G6260M984k4076
8959E7168O937f6520C3092L8269g6757B3914F171f381E3493N6259L8524K00354
8947C48630a88133j86752P3673h0784l2234A8871J33930b11421H0160H300i1604
8935A78525R579I154i8878B00949H3250J6546J19485J85637a25844C17584A57979
8923A561564K555934M197905J132108C569182H06127k96127C0185K62855C5582
8913B35235e5612D3919L9039g424A08221J48171A01640m3959a46728r4709E7145
$$ y = [-398825, -151379, -17430, 148319, 17415, -214434, -127202, -63224, -47177, 180401, -89872, 143046, 139825, 65326, -285071, -435503, -362302, 92271, 125360, -55353, -15040, -178941, 46179, -119697, 495605, 165424, 340627, 37314, 120365, 20613, -21286, -205816, -144053, 76260, 81244, 57168, 64105, -66520, 33092, 71361, -76757, 23914, 6171, -6381, 53493, 109752, 148276, 348630, -188133, -374885, -301212, -80784, -113018, 18871, 152801, -211421, 80160, 8300, -91604, 178525, 188104, 9154, -98878, 200949, 83250, 99796, 219281, 404918, -125844, 317584, 157979, 1561564, 4117498, 8315403, 9447511, 3569182, 806127, 510000, 30185, 293040, 35582, 235235, -55612, 43919, 82958, -7424, 108221, 256392, 101640, 57681, -146728, -241437, 57145]
8901A74057b24062P4611K0560A02082c92043P5781B04028P7212a43005G5380C2529
8889H3405d7116m00554K20440R7053l03302b7065A31499F1844d6099r9526j1497
8878a57122P0649k57568M2057D0353K1311b39261J04387G9529B6915c22098C93245
8866d899A10626K787Q4509g962n7255A31820a78788A05745J33686b95575a29942
8854g0237B11913b44951d0433B69676c0589o5050C2140c4260m0324m105j99961
$$ y = [174057, -224062, -149451, -128891, 102082, -392043, -316262, 204028, 281240, -143005, 75380, 32529, 83405, -47116, -447670, -227230, -130177, -433479, -27065, 131499, 61844, -46099, -145625, -157122, -86473, -344041, -301984, 40353, 61664, -239261, -134874, 79529, 26915, -322098, 393245, -4899, 110626, 113413, 197922, -7962, -65217, 131820, -178788, 105745, 239431, -295575, -129942, -70237, 211913, -244951, -40433, 269676, -30589, -95639, 32140, -34260, -74584, -78689, -278650]
$$ [...]
##END NTUPLES=NMR SPECTRUM
##END=
