##TITLE=AC1616_BRASL13347_8317329_hloSlhI3Su
##JCAMPDX= 6.0         $$ Bruker NMR JCAMP-DX V2.0
##DATA TYPE= NMR SPECTRUM
##DATA CLASS= NTUPLES
##ORIGIN= BRUKER
##OWNER= Administrator
$$ 1.72 TOPSPIN		Version 2.1
$$ 2013-11-13 23:51:53.497 -0800  Administrator@X
$$ Compression mode = diff/dup
##.OBSERVE FREQUENCY= 400.02188249412
##.OBSERVE NUCLEUS= ^1H
##.ACQUISITION MODE= SIMULTANEOUS (DQD)
##.ACQUISITION SCHEME= undefined
##.AVERAGES= 64
##.DIGITISER RES= 22
##SPECTROMETER/DATA SYSTEM= spect
##.PULSE SEQUENCE= noesygpps1d.comp
##.SOLVENT NAME= COFFEE_meoh
##.SHIFT REFERENCE= INTERNAL, COFFEE_meoh, 1, 14.96093
##AUDIT TRAIL= $$ (NUMBER, WHEN, WHO, WHERE, PROCESS, VERSION, WHAT)
$$ ##TITLE= Audit trail, TOPSPIN		Version 2.1
$$ ##JCAMPDX= 5.01
$$ ##ORIGIN= Bruker BioSpin GmbH
$$ ##OWNER= Administrator
$$ $$ E:\/data/COFFEE/nmr/AC1616_BRASL13347_8317329_hloSlhI3Su/12/pdata/1/auditp.txt
$$ ##AUDIT TRAIL=  $$ (NUMBER, WHEN, WHO, WHERE, PROCESS, VERSION, WHAT)
(   1,<2013-11-13 23:51:48.122 -0800>,<Administrator>,<X>,<go>,<TOPSPIN 2.1>,
      <created by zg
	started at 2013-11-13 23:40:18.027 -0800,
	POWCHK enabled, PULCHK disabled,
       configuration hash MD5:
       C8 4E 4E 5D D3 5C D8 9E 9F 52 82 E0 59 8A DE 15
       data hash MD5: 64K
       0F A8 37 5C B9 B9 F3 7B 2A F1 1E DD 08 FA D0 D9>)
(   2,<2013-11-13 23:51:51.122 -0800>,<Administrator>,<X>,<proc1d>,<TOPSPIN 2.1>,
      <Start of raw data processing
       efp LB = 0.3 FT_mod = 6 PKNL = 1 PHC0 = 0 PHC1 = 0 SI = 128K 
       data hash MD5: 128K
       73 37 D9 5F 9A 11 08 CA 97 AD 1B C4 83 A3 AE F2>)
(   3,<2013-11-13 23:51:52.357 -0800>,<Administrator>,<X>,<proc1d>,<TOPSPIN 2.1>,
      <pk PHC0 = -85.26489 PHC1 = 0 
       data hash MD5: 128K
       18 9D 0F 56 91 DF BD 96 97 5F 65 88 BB DB 1D 7B>)
(   4,<2013-11-13 23:51:52.857 -0800>,<Administrator>,<X>,<proc1d>,<TOPSPIN 2.1>,
      <abs ABSG = 1 
       data hash MD5: 128K
       59 B3 63 40 D4 40 0B 5B DF E9 81 88 EB 1D 6D FD>)
(   5,<2013-11-13 23:51:52.966 -0800>,<Administrator>,<X>,<proc1d>,<TOPSPIN 2.1>,
      <abs ABSG = 2 
       data hash MD5: 128K
       C9 76 1F 37 4E E6 A1 7E 55 06 6E 16 9A 30 EC D3>)
(   6,<2013-11-13 23:51:53.044 -0800>,<Administrator>,<X>,<proc1d>,<TOPSPIN 2.1>,
      <abs ABSG = 3 
       data hash MD5: 128K
       A4 DA F4 3E C3 F2 7C 10 58 92 26 93 C9 69 B2 59>)
(   7,<2013-11-13 23:51:53.122 -0800>,<Administrator>,<X>,<proc1d>,<TOPSPIN 2.1>,
      <abs ABSG = 4 
       data hash MD5: 128K
       93 0D 1A C4 5C 23 B1 48 71 0F 17 87 EE DB 33 35>)
(   8,<2013-11-13 23:51:53.185 -0800>,<Administrator>,<X>,<proc1d>,<TOPSPIN 2.1>,
      <abs ABSG = 5 
       data hash MD5: 128K
       41 F5 31 30 D7 6D 41 76 91 E0 C4 65 92 99 C6 12>)
$$ ##END=
$$ 
$$ $$ hash MD5
$$ $$ E1 5E 89 14 63 4F 04 7E BF E4 53 B9 6C D7 96 6A
##$RELAX= 
##$RELAX= 
##$RELAX= 
##$RELAX= 
##$RELAX= 
##$RELAX= 
##$RELAX= 
##$RELAX= 
$$ Bruker specific parameters
$$ --------------------------
##$DU= <E:\>
##$EXPNO= 12
$$ [...]
##$TP07= 0
##$TPNAME0= <>
##$TPNAME1= <>
##$TPNAME2= <>
##$TPNAME3= <>
##$TPNAME4= <>
##$TPNAME5= <>
##$TPNAME6= <>
##$TPNAME7= <>
##$TPOAL= (0..7)
0.5 0.5 0.5 0.5 0.5 0.5 0.5 0.5
##$TPOFFS= (0..7)
0 0 0 0 0 0 0 0
##$TUNHIN= 0
##$TUNHOUT= 0
##$TUNXOUT= 0
##$USERA1= <user>
##$USERA2= <user>
##$USERA3= <user>
##$USERA4= <user>
##$USERA5= <user>
##$V9= 5
##$VALIST= <valist>
##$VCLIST= <CCCCCCCCCCCCCCC>
##$VD= 0
##$VDLIST= <DDDDDDDDDDDDDDD>
##$VPLIST= <PPPPPPPPPPPPPPP>
##$VTLIST= <TTTTTTTTTTTTTTT>
##$WBST= 1024
##$WBSW= 4
##$XGAIN= (0..3)
0 0 0 0
##$XL= 0
##$YL= 0
##$YMAX_a= 6068270
##$YMIN_a= -12616131
##$ZGOPTNS= <>
##$ZL1= 120
##$ZL2= 120
##$ZL3= 120
##$ZL4= 120
##$ABSF1= 14.96093
##$ABSF2= -5.597252
##$ABSG= 5
##$ABSL= 3
##$ALPHA= 0
##$AQORDER= 0
##$ASSFAC= 0
##$ASSFACI= 0
##$ASSFACX= 0
##$ASSWID= 0
##$AUNMP= <proc_prof1d_extract.lims>
##$AXLEFT= 0
##$AXNAME= <>
##$AXNUC= <1H>
##$AXRIGHT= 0
##$AXTYPE= 0
##$AXUNIT= <>
##$AZFE= 0.1
##$AZFW= 0.1
##$BCFW= 0
##$BC_mod= 0
##$BYTORDP= 0
##$COROFFS= 0
##$CY= 15
##$DATMOD= 1
##$DC= 0
##$DFILT= <>
##$DTYPP= 0
##$F1P= 0
##$F2P= 0
##$FCOR= 0.5
##$FTSIZE= 131072
##$FT_mod= 6
##$GAMMA= 0
##$GB= 0
##$INTBC= 1
##$INTSCL= 1
##$ISEN= 128
##$LB= 0.3
##$LEV0= 0
##$LPBIN= 0
##$MAXI= 10000
##$MC2= 0
##$MEAN= 0
##$ME_mod= 0
##$MI= 0
##$NCOEF= 0
##$NC_proc= -2
##$NLEV= 6
##$NOISF1= 0
##$NOISF2= 0
##$NSP= 0
##$NTH_PI= 0
##$NZP= 0
##$OFFSET= 14.96093
##$PC= 1
##$PHC0= -85.26489
##$PHC1= 0
##$PH_mod= 1
##$PKNL= yes
##$PPARMOD= 0
##$PPDIAG= 0
##$PPIPTYP= 0
##$PPMPNUM= 2147483647
##$PPRESOL= 1
##$PSCAL= 4
##$PSIGN= 0
##$PYNMP= <proc.py>
##$REVERSE= no
##$SF= 400.020009664183
##$SI= 131072
##$SIGF1= 0
##$SIGF2= 0
##$SINO= 400
##$SIOLD= 131072
##$SPECTYP= <>
##$SREGLST= <1H.CDCl3>
##$SSB= 0
##$STSI= 131072
##$STSR= 0
##$SW_p= 8223.68421052631
##$SYMM= 0
##$S_DEV= 0
##$TDeff= 65536
##$TDoff= 0
##$TI= <>
##$TILT= no
##$TM1= 0
##$TM2= 0
##$TOPLEV= 0
##$USERP1= <user>
##$USERP2= <user>
##$USERP3= <user>
##$USERP4= <user>
##$USERP5= <user>
##$WDW= 1
##$XDIM= 131072
##$YMAX_p= 356494482
##$YMIN_p= -11483
##$CURPLOT= <Network HP LaserJet P1505>
##$CURPRIN= <$Network HP LaserJet P1505>
##$DFORMAT= <normdp>
##$LAYOUT= <+/1D_H.xwp>
##$LFORMAT= <normlp>
##$PFORMAT= <normpl>
##$SURQMSG= 1
$$ End of Bruker specific parameters
$$ ---------------------------------
##NTUPLES= NMR SPECTRUM
##VAR_NAME=  FREQUENCY,     SPECTRUM/REAL,   SPECTRUM/IMAG
##SYMBOL=    X,             R,               I
##VAR_TYPE=  INDEPENDENT,   DEPENDENT,       DEPENDENT
##VAR_FORM=  AFFN,          ASDF,            ASDF
##VAR_DIM=   131072,        131072,          131072
##UNITS=     HZ,            ARBITRARY UNITS, ARBITRARY UNITS
##FACTOR=    0.0627417313425164, 1,          1
##FIRST=     8223.62146879497, 642,          -64388
##LAST=      0,             3616,            -63941
##MIN=       0,             -11483,          0
##MAX=       8223.62146879497, 356494482,    0
$$ Real data points
##PAGE= N=1
##DATA TABLE= (X++(R..R)), XYDATA
$$ [...]
67908 93526 91441 88950 86137 83286 81090 79975 79480 78833 77916 77140 76688 76463 76600 77313 78276 78748 78400
67891 78400 77551 76564 75514 74475 73658 73176 73015 73239 73796 74216 73999 73384 73149 73596 74179 74330 74166 74186 74669
67872 74669 75643 77111 78971 80849 82239 82793 82507 81819 81429 81763 82552 83209 83524 83703 83779 83443 82532 81299
67854 81299 80075 78931 77819 76771 75879 75243 74911 74608 73707 71884 69809 68650 68758 69265 69102 68043
67838 68043 66580 65259 64440 64370 65065 66185 67219 67817 67972 68075 68720 70131 71759 72772 72981 72988 73484 74818
67820 74818 77188 80540 84038 86290 86618 85787 85088 85003 85146 85122 84899 84478 83747 82719 81510 80054 78146
67803 78146 75878 73746 72196 71237 70635 70371 70685 71569 72388 72252 70868 68856 67059 65768 64833 64253 64201
67786 64201 64527 64812 65009 65550 66584 67517 67600 66742 65509 64606 64557 65539 67140 68412 68609 67908 67263 67517
67768 67517 68754 70388 71738 72578 73245 74213 75558 76916 77962 78746 79524 80410 81313 82063 82506 82518 81968
67751 81968 80736 78900 76984 75771 75610 76083 76582 76993 77469 77857 77885 77777 77989 78375 78267 77500 76673 76188
67733 76188 75718 74866 73760 72575 71084 69116 67076 65521 64579 64108 63969 63764 62827 61085 59541 59266
67717 59266 60123 61031 61317 61197 61122 61226 61494 61951 62528 63049 63416 63611 63574 63251 62691 61936 61000 60105 59647 59727
67697 59727 59983 60166 60521 61248 61943 62060 61624 61000 60227 59210 58417 58702 60301 62430 64003 64455 63967 63245
67679 63245 63100 63825 64900 65510 65353 64739 64050 63435 62876 62257 61416 60462 59880 60037 60753 61633 62589 63665
67661 63665 64608 65112 65275 65375 65425 65465 66007 67545 69767 71849 73369 74280 74229 72802 70453 68296 66825
67644 66825 65627 64489 63893 64048 64284 63911 63102 62448 62190 62300 62792 63510 64090 64588 65640 67578 69862
67627 69862 71884 73775 75831 77628 78472 78488 78502 78934 79355 79113 77904 75874 73669 72315 72477 73782 75201
67610 75201 76084 76472 76560 76372 76002 75672 75416 75003 74278 73289 72108 70833 69803 69435 69761 70344 70712 70624 69972
67591 69972 68796 67479 66574 66213 65929 65231 64160 63144 62464 62018 61534 60939 60560 60883 61950 63042 63278
67574 63278 62628 62081 62645 64332 66247 67479 67747 67305 66526 65580 64461 63184 61959 61083 60729 60931 61727
67557 61727 63047 64408 64941 63987 61713 59115 57389 57161 58086 59161 59606 59565 59753 60418 60951 60713 59913
67540 59913 59284 59125 59117 58999 58864 58702 58172 57132 55987 55195 54779 54685 55265 56778 58601 59626 59489 58806
67522 58806 58033 56827 54938 53175 52710 53622 54735 54909 54058 52878 52077 52010 52634 53497 53938 53598 52739 52036
67504 52036 52074 52969 54268 55219 55364 54925 54547 54656 55284 56351 57717 58945 59494 59360 59185 59407 59662 59359
67486 59359 58551 57780 57268 56844 56618 57124 58553 60264 61393 61679 61459 61082 60684 60380 60269 60205 59891 59325
67468 59325 58942 59147 59896 60847 61726 62309 62214 61138 59440 58206 58451 60227 62608 64467 65233 65042 64385
67451 64385 63668 63010 62406 62022 62154 62820 63558 63871 63757 63574 63489 63420 63505 64166 65472 66794 67446 67457 67372 67474
67431 67474 67643 67895 68511 69455 70127 70011 69254 68279 67110 65556 63917 62928 62923 63491 64085 64552 64867 64799 64247
67412 64247 63554 63077 62700 62217 61935 62275 62920 63025 62337 61449 60771 59965 58757 57677 57454 58091 59093 60227
67394 60227 61413 62177 62054 61476 61449 62144 62474 61502 59755 58657 58855 59645 59964 59574 59086 59090 59516 59847 59776
67375 59776 59459 59221 59218 59447 59857 60322 60691 61017 61563 62413 63242 63706 63870 64019 64219 64325 64300 64237 64187 64233 64575
67354 64575 65228 65763 65691 65012 64074 63073 62110 61537 61747 62621 63635 64497 65249 65874 66297 66693 67234 67624 67568
67335 67568 67614 68650 70428 71507 71064 69933 69320 69300 69280 69249 69645 70425 71161 71857 72785 73610 73467 72054 70060
67316 70060 68408 67619 67883 69111 70647 71521 71365 70817 70751 71372 72303 73323 74657 76501 78522 79982 80397
67299 80397 79972 79248 78440 77354 75998 74904 74558 74796 75033 74928 74513 73856 73000 72159 71640 71504 71545 71601 71659
67280 71659 71710 71735 71797 71901 71804 71180 70039 68825 68097 68172 68926 69842 70460 70916 71816 73361 74962 76031 76799
67261 76799 77829 78992 79568 79363 79062 79335 80029 80448 80059 78839 77249 76004 75557 75718 75980 76166 76418
67244 76418 76654 76576 76273 76279 76851 77624 78170 78424 78346 77716 76640 75833 75925 76738 77631 78327 78965 79569 79876 79630
67224 79630 78726 77222 75518 74350 74217 74878 75736 76567 77516 78488 79082 79173 79091 79117 79176 79200 79447 80192 81325
67205 81325 82424 83116 83273 83072 82977 83387 84213 85054 85885 87156 88909 90288 90498 89956 89784 90257 90508 89946
67187 89946 89168 89045 89534 89991 90174 90227 90004 89240 88313 88033 88567 89238 89585 89937 90620 91272 91428 91326 91573
67168 91573 92361 93414 94411 95020 94824 93803 92695 92383 93017 94125 95326 96439 97207 97542 97910 98759 99703
67151 99703 100005 99760 99691 99682 98599 96091 93642 93059 94450 96464 98047 99148 99982 100574 101104 101951 103111
67134 103111 104058 104387 104247 103955 103580 103122 102844 103083 103820 104589 104830 104366 103701 103752 105048 107159 109115 110411
67116 110411 111261 111891 112126 111952 112044 113142 115060 116875 118076 119010 120068 121020 121486 121569 121518 121072 119785 117983
67098 117983 116797 117072 118578 120463 122143 123604 125145 127070 129366 131517 132831 133175 133177 133582 134632 136193
67082 136193 138060 139870 141113 141649 141995 142690 143596 144232 144562 144929 145431 145917 146502 147491 148803 150062 151339
67065 151339 153176 155696 158260 160305 162079 164156 166538 168578 169634 169597 168976 168622 169159 170501 172042
67050 172042 173335 174420 175529 176817 178401 180270 182141 183791 185530 187815 190366 192279 193266 194129 195660
67035 195660 197657 199419 200680 201574 202223 202949 204445 207035 210073 212690 214895 217303 220106 223038 226129
67020 226129 229643 233275 236248 238353 240203 242316 244604 246955 249578 252432 254918 256610 257878 259404
67006 259404 261508 264268 267863 272220 276683 280615 284231 288273 292920 297498 301341 304561 307774 311379
66992 311379 315275 319080 322481 325461 328356 331617 335437 339656 344034 348511 353084 357558 361688 365615
66978 365615 369882 374871 380326 385662 390685 395729 401124 406866 412921 419472 426570 433830 440877 447938
66964 447938 455538 463646 471556 478707 485203 491394 497345 503062 508901 515319 522266 529238 536001 543005
66950 543005 550954 560133 570221 580664 591133 601734 612842 624678 636961 649091 660765 672287
66938 672287 684170 696610 709574 723240 737856 753071 767901 781750 795228 809510 825031
66927 825031 841193 857282 873216 889364 906117 923823 942712 962582 982853 1003120 1023528
66916 1023528 1044487 1066261 1088890 1112196 1135759 1159325 1183424 1209109 1236759 1265598 1294744
66905 1294744 1324254 1354581 1385497 1416328 1447022 1478220 1510342 1543374 1577535 1613285 1650417
66894 1650417 1687837 1724694 1761301 1798607 1837165 1876920 1917622 1959003 2000759 2042695 2084809
66883 2084809 2127099 2169479 2211966 2254612 2297085 2338736 2379362 2419553 2459892 2500038 2539034
66872 2539034 2576380 2612364 2647383 2681339 2713798 2744386 2772834 2798819 2822056 2842645 2861193
66861 2861193 2878340 2893966 2907010 2916319 2921696 2923866 2923503 2920669 2915264 2907423 2897136 2883876 2867143
66848 2867143 2847298 2825382 2802042 2776930 2749213 2718516 2685335 2650668 2615255 2579082 2541680
66837 2541680 2502932 2463360 2423486 2383154 2341786 2299183 2255780 2212163 2168613 2125115 2081576
66826 2081576 2037987 1994545 1951623 1909489 1868065 1827140 1786762 1747242 1708786 1671368 1634926
66815 1634926 1599443 1564749 1530438 1496152 1461864 1427905 1394798 1363009 1332653 1303343 1274463
66804 1274463 1245730 1217460 1190175 1164004 1138499 1113067 1087565 1062412 1038049 1014436 991296
66793 991296 968769 947394 927305 907858 888409 869170 850810 833440 816546 799892 783848
66782 783848 768633 753727 738463 722928 707932 694186 681740 670087 658569 646696 634351
66771 634351 621783 609452 597904 587635 578786 570867 563021 554675 545755 536287 526177 515641 505500
66758 505500 496571 488826 481441 473659 465392 457069 449186 441985 435319 428791 422182 415676 409478 403345
66744 403345 396884 390265 384194 378999 374137 368894 363321 358126 353752 349893 345916 341510 336834 332206
66730 332206 327842 323850 320323 317305 314642 312000 309131 306045 302808 299257 295132 290490 285719 281095
66716 281095 276567 272143 268226 265314 263417 261984 260344 258155 255522 252863 250579 248673 246739 244416
66702 244416 241769 239119 236614 234199 231848 229592 227385 225147 222887 220510 217623 213923 209806 206246
66688 206246 203921 202660 201817 200817 199283 197050 194397 192042 190542 189750 189058 188078 186843 185496 184067
66673 184067 182579 181127 179784 178545 177363 176116 174566 172492 169962 167394 165267 163734 162514 161215
66659 161215 159798 158604 157776 156785 154928 152382 150314 149640 149865 149566 147966 145696 143974 143308 143147 142650
66643 142650 141561 140292 139248 138312 137149 135851 134913 134524 134237 133560 132568 131646 130858 129891 128514 126838
66627 126838 125219 124136 124004 124777 125816 126362 126098 125086 123412 121237 119014 117233 115954 114896 113944
66612 113944 113242 112870 112725 112688 112622 112322 111786 111332 111043 110345 108691 106582 105222 105167 105911 106776 107443 107559 106707
66593 106707 105183 104067 104034 104606 104971 104909 104500 103643 102511 101864 102114 102511 102104 101128 100562 100550 100273 99337 98331
66574 98331 97804 97540 97128 96504 95603 94159 92273 90644 89722 89089 88187 87329 87425 88818 90846 92514 93254
66557 93254 93067 92279 91314 90517 90020 89705 89266 88389 87072 85761 84964 84653 84293 83526 82574 81857 81510 81466 81748
66538 81748 82375 83102 83576 83687 83538 83196 82729 82403 82478 82745 82585 81652 80314 79303 79045 79432 80022 80265 79733
66519 79733 78466 77129 76554 76939 77648 77938 77778 77743 78169 78715 78828 78421 77875 77528 77387 77295 77129 76785 76191
66500 76191 75547 75404 76197 77595 78505 78021 76380 74789 74190 74399 74580 74343 74011 73910 73882 73632 73168 72669
66482 72669 72179 71766 71708 72190 72922 73415 73573 73659 73740 73501 72718 71619 70668 70169 70138 70348 70488 70458 70569 71214
66462 71214 72323 73340 73827 73830 73613 73342 73201 73502 74363 75391 76009 76051 75809 75483 74868 73717 72302 71367
66444 71367 71410 72029 72135 70927 68696 66597 65712 66353 68106 70220 71899 72552 72113 71143 70437 70384 70662 70538
66426 70538 69553 67996 66736 66510 67398 68954 70650 72048 72740 72524 71690 70827 70272 69917 69594 69296 68936
66409 68936 68270 67342 66726 66898 67512 67709 67153 66393 66069 66137 66144 66030 66216 66874 67533 67688 67517 67601 68004 68148
66389 68148 67787 67580 68278 69642 70665 70733 70013 68783 67061 65148 63931 64127 65470 66983 67893 68018 67492
66372 67492 66578 65693 65243 65361 65944 66872 67888 68352 67569 65598 63514 62552 62958 63863 64307 64190 64045 64096
66354 64096 63998 63580 63383 64069 65531 67041 68066 68488 68226 67290 66254 65841 65904 65479 64168 62751 62023 61773
66336 61773 61508 61464 62034 62747 62806 62371 62251 62469 62245 61470 61149 61960 63269 64036 64042 63780 63730 64168 65165 66281
66316 66281 66761 66493 66302 66824 67594 67815 67579 67566 67841 67744 66920 65746 64683 63772 62916 62213 61852 61947 62476
66297 62476 63088 63107 62166 60833 60144 60522 61514 62594 63647 64614 65261 65606 66059 66788 67281 66959 65949 64890
66279 64890 64192 63846 63794 64067 64543 64921 64985 64746 64343 63998 63999 64496 65301 66032 66439 66518 66395 66289 66467 67005 67600
66258 67600 67849 67678 67338 66996 66602 66186 65965 66046 66257 66417 66617 67033 67577 67908 67735 67030 66016 65068 64471
66239 64471 64204 64023 63897 64187 65151 66411 67215 67268 67030 67107 67604 68193 68589 68685 68355 67462 66144 64945 64485
66220 64485 64997 66196 67571 68737 69505 69704 69147 67861 66248 64830 63883 63455 63637 64506 65782 66929
66204 66929 67783 68738 70075 71365 71948 71818 71603 71767 72210 72625 72820 72656 72130 71636 71727 72439 73215 73683 74094
66185 74094 74739 75350 75477 75131 74629 74063 73404 72917 72925 73166 72879 71682 70020 68709 68302 68876 70091 71350
66167 71350 72187 72570 72702 72665 72537 72649 73223 73825 73768 73105 72645 72864 73372 73667 73787 73934 74064 74271 74987 76253
66147 76253 77331 77642 77615 77828 77789 76568 74445 72826 72389 72285 71601 70761 70879 72271 74214 75852 76823
66130 76823 77197 77273 77360 77463 77307 76841 76486 76620 77065 77402 77558 77693 77677 77195 76326 75603 75394 75561 75833 76210
66110 76210 76815 77561 78202 78640 78987 79334 79599 79707 79809 80156 80738 81225 81399 81472 81751 82166 82454 82689 83106
66091 83106 83383 82669 80736 78666 77956 79091 81291 83399 84626 84711 83946 83044 82588 82546 82586 82670 82941 83190
66073 83190 83020 82580 82512 83044 83642 83825 83823 84111 84645 84972 84815 84227 83429 82847 83093 84446 86409 88106 89076
66054 89076 89449 89482 89228 88660 87810 86782 85786 85152 85101 85584 86496 87815 89287 90267 90345 90027 90232 91105 91912
66035 91912 92230 92638 93865 95803 97758 99255 100100 100074 99285 98637 99188 100941 102800 103789 103837 103313 102472 101662
66017 101662 101461 102174 103500 105014 106604 108132 109174 109603 110040 111081 112422 113434 114332 115933 118347
66002 118347 120824 122991 125300 127927 130136 131358 132230 133846 136421 139356 142219 144989 147615 150131
65988 150131 153026 156702 160561 163331 164450 164525 164330 163997 163409 162769 162259 161521 159903 157075 153176 148570
65972 148570 143728 139203 135409 132404 129991 127944 126080 124276 122465 120544 118313 115734 113246 111532
65958 111532 110916 111203 112137 113680 115736 117965 120090 122056 123721 124650 124569 123853 123333 123679 125036 127045
65942 127045 129066 130618 131772 132948 134209 135099 135343 135375 135841 136888 138271 139942 142039 144434 146704
65927 146704 148593 150176 151602 152939 154240 155502 156597 157533 158736 160817 163967 167784 171637 175110
65913 175110 178208 181349 185012 189142 193018 195969 198109 200040 202000 203701 204925 205751 206178 206080 205711
65898 205711 205744 206450 207158 206909 205496 203574 201831 200366 198850 197029 194935 192646 189935 186298 181460
65883 181460 175834 170348 165731 162028 158711 155152 151027 146523 142197 138547 135689 133497 131905 130876
65869 130876 130226 129764 129541 129637 129749 129358 128359 127141 125999 124784 123270 121533 119859 118596 118148 118701 119827
65852 119827 120762 121337 122147 123567 125075 126019 126559 127310 128307 128994 129053 128667 128034 127251 126687 126855 127734 128715
65834 128715 129425 130132 131135 132179 132831 133161 133733 135097 137543 141126 145690 150895 156397 161864 166858
65819 166858 170991 174371 177622 181203 184891 188162 190756 192598 193406 192873 191213 189130 187205 185573 184100
65804 184100 182533 180495 177739 174525 171453 168793 166246 163458 160414 157237 153956 150761 148161 146494
65790 146494 145413 144188 142486 140675 139433 139288 140380 142368 144593 146664 148932 152139 156603 161954
65776 161954 167669 173555 179598 185665 191582 197295 202679 207235 210242 211297 210714 209251 207354 204689
65762 204689 200600 195132 189333 184250 179816 175199 170229 165905 163245 162124 161693 161662 162648 165316 169660
65747 169660 175245 181832 189519 198351 208014 217969 227892 237826 247730 256959 264534 270028 273912 276770
65733 276770 278466 278345 276021 271580 265145 256781 246927 236502 226328 216622 207189 197946 189045 180586
65719 180586 172427 164403 156710 149919 144452 140084 136179 132449 129206 126760 124945 123478 122447 121998
65705 121998 121775 121206 120296 119643 119587 119763 119579 118838 117779 116854 116487 116714 116981 116671 115883 115260 115043 114826 114450
65686 114450 114538 115696 117648 119692 121728 124259 127497 130998 134237 137172 140168 143658 147944 153059 158741
65671 158741 164662 170755 177316 184867 193939 204713 216644 228668 240113 251321 263079 275526
65659 275526 287902 299282 309154 317266 323388 327568 330353 332434 334025 334850 334798 334466 334858 336483 338855
65644 338855 341075 342827 344523 346384 347697 347290 344588 339907 333759 326231 317131 306486 294709 282344
65630 282344 269737 256913 243763 230406 217353 205245 194421 184749 175819 167246 158900 151045
65618 151045 144251 139041 135503 133184 131332 129276 126780 124163 122024 120731 120184 120000 119735 118901 117082
65603 117082 114370 111548 109598 108974 109461 110564 111847 112986 113854 114593 115417 116315 117069 117543 117809 118023 118359
65586 118359 119038 120231 121893 123850 126079 128766 132097 136084 140566 145298 150121 155224 161155 168429
65572 168429 177120 186939 197517 208365 218787 228273 237057 245916 255271 264672 273217 280185 285139
65559 285139 287710 287597 284788 279704 273069 265555 257330 248033 237374 225779 214238 203531 193869
65546 193869 185212 177508 170520 163888 157698 152612 149043 146400 143681 140756 138586 138041 138881 140142 141229
65531 141229 142272 143493 144652 145290 145340 145231 145361 145650 145611 144765 142971 140495 137815 135242 132679 129909
65515 129909 127131 124948 123690 123035 122511 122071 121854 121646 121107 120403 120038 120013 119725 118949 118421 119083 120947 123046
65497 123046 124397 124831 124989 125666 127079 128703 129877 130546 131216 132273 133748 135701 138307 141380 144290
65482 144290 146676 148790 150845 152472 153319 153768 154401 154967 154624 153159 151309 149731 148265 146460 144323
65467 144323 142115 139781 137049 134001 131186 129092 127705 126607 125380 123923 122510 121608 121574 122393 123575
65452 123575 124360 124269 123572 123113 123470 124302 124678 124011 122613 121416 121250 122247 123748 124834 125150 125154 125478 126217
65434 126217 127108 128227 130082 132974 136572 140167 143082 144845 145363 145078 144661 144366 143912 143050 141950 140840
65418 140840 139609 138078 136407 134959 133856 132973 132267 131885 131968 132457 133046 133251 132761 131881 131403 131802 132735
65401 132735 133572 134192 134941 136016 137309 138761 140447 142312 144245 146390 148938 151606 153799 155364 156695
65386 156695 157932 158552 158090 156796 155260 153795 152605 152111 152541 153404 153944 153991 153894 153809 153657 153637 154095 154842
65368 154842 155327 155611 156483 158320 160505 162321 163892 165753 168049 170723 174053 178335 183279 188413 193926
65353 193926 200429 207854 215209 221583 226931 231731 236229 240193 243149 244822 245452 245552 245113 243366 239821
65338 239821 235285 231137 227712 224187 220109 216113 212776 209610 205745 200979 195613 189831 183902 178547
65324 178547 174363 171204 168621 166535 164826 162817 160097 157540 156390 156377 155843 153923 151504 149684 148347
65309 148347 146942 145757 145427 145674 145514 144571 143384 142420 141516 140383 139157 138247 138015 138680 140191 142140
65293 142140 144120 146171 148538 151037 153163 154890 156762 158921 160586 161056 160828 161080 162149 163168 163307
65278 163307 162748 162138 161545 160483 158763 156816 155132 153787 152663 151782 151191 150693 149932 148765 147388 146091
65262 146091 144958 143807 142383 140644 138827 137202 135823 134727 134332 135252 137439 139751 140854 140551 139862
65247 139862 139710 139865 139411 137992 136241 134983 134311 133587 132291 130745 129941 130629 132587 134744 135978 135779
65231 135779 134392 132653 131677 132295 134372 136730 138016 137736 136412 134829 133359 132030 130906 130126 129629
65216 129629 129132 128518 128081 128250 129049 129942 130251 129725 128736 128030 128246 129500 131239 132560 132837 132175 131295 130989
65198 130989 131632 133029 134552 135473 135417 134711 134184 134479 135476 136477 136925 136855 136647 136550 136600 136881 137543 138511 139464
65179 139464 140277 141272 142766 144520 145932 146752 147291 147918 148658 149412 150243 151280 152516 153891 155382 156870
65163 156870 158114 159062 159971 161083 162419 164123 166666 170320 174545 178326 181143 183352 185685 188661 192420
65148 192420 196863 201921 207884 215232 223943 233215 242351 251688 262063 273508 285162 296465 307640
65135 307640 318807 329445 339177 348385 357490 366160 373850 380579 386444 390733 392410 391441 388845 385432
65121 385432 381165 375870 369843 363376 356156 347536 337194 325361 312672 299952 287885 276676 266111
65108 266111 255950 246007 235991 225759 215844 207253 200493 195150 190578 186551 182943 179321 175395
65095 175395 171567 168473 166132 164094 162235 160797 159736 158719 157869 157809 158661 159602 159797 159326 158750 158252
65079 158252 157800 157737 158406 159326 159601 159225 159227 160145 161135 161081 160092 159222 159064 159329 159620 159846 159820 159169 157914 156653
65059 156653 155900 155620 155653 156123 157100 158200 158995 159585 160424 161725 163373 165225 167072 168484 169119 169118 168748 167774
65041 167774 165772 163153 161155 160438 160104 158631 155557 151824 148592 146157 144043 141752 139277 137112 135854
65026 135854 135602 135659 135059 133578 132018 131330 131587 132059 132258 132564 133669 135596 137522 138545 138498 138019 137977 138910
65008 138910 140856 143481 146258 148629 150295 151485 152850 154859 157325 159668 161617 163383 165133 166638
64994 166638 167651 168298 168742 168754 168095 167182 166812 167185 167772 168307 169362 171523 174424 177073 178972 180492 182170
64977 182170 183965 185256 185432 184461 182902 181325 179743 177873 175859 174244 173089 171677 169465 166860 164579
64962 164579 162676 160777 158974 157698 156921 156168 155333 154726 154266 153362 151824 150241 149142 148398 147845 147851 148683
64945 148683 149690 149755 148481 146477 144549 143007 141788 140857 140282 140008 139771 139392 139217 139969 141869 144018
64929 144018 145110 144792 143895 143310 143109 142950 142760 142664 142625 142534 142477 142631 143137 144181 145840 147639 148780 149122
64911 149122 149468 150480 151766 152546 152776 153080 153907 155372 157596 160483 163383 165742 168000 171196 175668
64896 175668 180775 185821 190579 194957 198927 202863 207216 211668 215330 217992 220461 223319 226105 228183
64882 228183 229825 231795 234224 236454 237771 237872 236794 234742 231848 227987 223138 218097 214225 212087
64868 212087 210759 208998 206676 204517 202792 201065 199099 197288 196004 195011 193729 191800 189344 186849
64854 186849 184778 183025 180894 177840 174096 170303 166783 163570 160910 159127 158112 157519 157335 157616 157726
64839 157726 156705 154660 153019 152928 153974 154927 155275 155470 156022 156999 158242 159517 160543 161262 161958 162736 163126
64822 163126 162789 162429 163265 165477 167889 169446 170401 171643 173437 175512 178011 181568 186410 192010 197822
64807 197822 203851 210241 216712 222777 228286 233425 238261 242548 245891 247813 247801 245635 241806 237363 233193
64792 233193 229540 226182 222862 219488 216099 212785 209570 206356 203088 199967 197310 195189 193431 191974
64778 191974 190955 190368 189964 189714 190060 191409 193580 196077 198755 201880 205658 210102 215269 221227 227692
64763 227692 234090 240070 245674 250943 255677 259746 263376 266923 270545 274186 277694 280847 283470 285658
64749 285658 287591 289069 289578 289088 288412 288343 288614 288151 286248 283041 278841 273566 267113 259903 252722 246109
64733 246109 240144 234728 229834 225499 221731 218490 215690 213251 211186 209632 208687 208306 208368 208833 209680 210704
64717 210704 211551 212087 212641 213766 215695 218128 220569 222752 224668 226293 227520 228313 228702 228478 227201 224763
64701 224763 221832 219348 217508 215522 212507 208422 203971 199834 196307 193531 191635 190504 189720 188943 188212
64686 188212 187734 187515 187378 187224 187086 187028 187189 187897 189545 192278 195925 200121 204408 208390 212162 216535
64670 216535 222343 229368 236387 242497 248039 253816 259762 264897 268463 270483 271223 270628 268538 265051 260427
64655 260427 254957 249135 243669 238995 234935 231100 227449 224278 221861 220407 220178 221191 222895 224531
64641 224531 225930 227634 230195 233694 238066 243478 250078 257610 265743 274623 284674 295700 306611
64628 306611 316263 324354 331219 336919 340954 342858 342650 340490 336225 329698 321371 312251 303098 293958
64614 293958 284555 274924 265454 256522 248279 240785 234171 228555 223806 219504 215325 211508 208718 207190
64600 207190 206247 205118 204094 204256 205895 207884 209049 209639 210860 213281 216426 219727 223060 226322 229216
64585 229216 231736 234269 236953 239514 242090 245569 250494 256094 261099 265326 269711 274827 280054 284354
64571 284354 287240 288766 289132 288692 287878 286648 284258 280054 274353 268153 262099 256136 250044 243763 237165
64556 237165 230076 222847 216427 211502 207759 204405 201159 198283 195817 193382 190890 188934 188189 188685 189935
64541 189935 191470 192977 194156 194918 195676 197071 199270 201693 203493 204143 203610 202177 200147 197631 194625
64526 194625 191458 188974 187925 188146 188672 188765 188547 188578 189257 190786 193219 196101 198396 199336 199252 199114 199345
64509 199345 199614 199734 200120 201142 202563 204048 205878 208753 213062 218640 225085 231980 238998 246095 253518
64494 253518 261288 268793 275280 280626 285145 288657 290333 289705 287341 284225 280860 277326 273834 270665
64480 270665 267710 264627 261468 258666 256290 253771 250574 246826 243044 239508 236206 233230 230830 229069
64466 229069 227696 226513 225683 225558 226313 227885 230207 233246 236653 239574 241217 241698 242014 242903 244010 244532
64450 244532 244443 244513 245154 245967 246677 247867 250182 253258 256151 258700 261780 266103 271420 277106 283006 289321
64434 289321 296127 303508 312012 322511 335588 351384 369984 391584 416244 443837 474522 509084
64422 509084 548591 593760 644833 701958 765470 835598 911939 993184 1077272 1161839 1244733
64411 1244733 1324303 1399278 1468403 1530283 1583636 1627423 1660506 1681288 1688163 1680553 1659435 1626704
64399 1626704 1584109 1532742 1473184 1405881 1331631 1252088 1169774 1087296 1006553 928786 855137
64388 855137 786664 723815 666371 614131 567376 526439 491103 460620 434170 411063 390713
64377 390713 372717 356972 343616 332865 324765 318798 313617 307660 300406 292815 286132 280458 274934
64364 274934 269094 263394 258322 253636 248847 243951 239307 235122 231561 229115 228225 228496 228852 228728 228787 230138
64348 230138 233087 236967 241071 245358 250164 255480 260710 265082 268130 269789 270085 268891 266134 262299
64334 262299 258538 255923 254514 253366 251637 249526 247924 247295 247251 247188 246954 246699 246374 245725 244720 243714
64318 243714 243109 243004 243222 243530 243761 243784 243454 242618 241217 239459 237834 236713 235883 234631 232492 229802 227307
64301 227307 225274 223234 220634 217510 214361 211562 209178 207244 205957 205476 205719 206469 207592 209106 211116
64286 211116 213734 216988 220735 224673 228496 232040 235380 238880 243008 247867 252929 257494 261467 265452
64272 265452 270029 275214 280675 286103 291141 295343 298563 301141 303339 304776 304827 303478 301399 299363 297936
64257 297936 297496 297891 298120 297014 294509 291731 289634 287993 285920 282850 278638 273210 266698 259747 253203
64242 253203 247510 242581 238112 233793 229514 225647 222940 221766 221574 221414 220877 220295 220178 220780 222050 223641
64226 223641 225003 225818 226295 226855 227638 228550 229624 230896 232031 232446 231836 230312 228095 225379 222421 219406
64210 219406 216255 212933 209859 207620 206265 205315 204522 204212 204727 205947 207543 209404 211545 213818 215895
64195 215895 217500 218674 219966 222231 225877 230394 235107 240386 247566 257431 269252 281513 293129
64182 293129 303693 313084 321337 328514 334202 337398 337415 334727 330476 325264 318919 311302 302788 293885
64168 293885 284873 275987 267604 260062 253539 248169 243976 240532 236991 232763 228086 223826 220763 219097
64154 219097 218447 218215 218034 218006 218456 219476 220854 222494 224653 227592 231112 234678 237973 241056 243905 246081
64138 246081 247170 247436 247727 248583 249660 250173 249733 248538 246975 245338 243849 242576 241253 239589 237868
64123 237868 236943 237423 239087 241375 244191 247934 252793 258372 264081 269814 276146 283853 293113 303200
64109 303200 313063 322203 330799 339029 346670 353509 359719 365514 370739 375157 378999 382849 387147 392121
64095 392121 398010 404919 412484 420096 427437 434426 440724 445751 449211 451212 451738 450461 447221 442331
64081 442331 436178 428832 420286 410792 400727 390336 379927 370109 361486 354100 347385 340711 333954
64068 333954 327615 322426 318704 316024 313650 311322 309406 308189 307321 306230 304937 304185 304725 306633 309335
64053 309335 312201 315152 318698 323340 328971 334981 341001 347334 354614 363260 373421 385177 398464
64040 398464 412834 427546 441961 455748 468723 480582 490799 498717 503794 505793 504768 500979
64028 500979 495005 487844 480500 473323 465999 458311 450631 443546 437381 432351 428674 426091 423581 420212
64014 420212 416103 411920 407568 402152 395368 388090 381175 374408 367234 360074 354110 349877 346748 343833
64000 343833 340849 338005 335544 333685 332612 332195 331946 331571 331452 332318 334478 337613 341309 345476 350200
63985 350200 355425 361029 367085 373759 380875 387825 394140 400107 406622 414351 423170 432562 442418 453243
63971 453243 465540 479252 493950 509413 525723 542888 560737 579367 599415 621520 645660
63960 645660 671453 699113 729714 764320 803282 846721 895422 950810 1014235 1086782 1169753
63949 1169753 1264719 1372911 1495041 1632073 1785709 1957596 2148057 2355932 2579485 2817046
63939 2817046 3066676 3325564 3589921 3855329 4117150 4370792 4611731 4835260 5036289
63930 5036289 5209622 5350662 5455978 5523422 5551945 5541269 5491573 5403525 5278848 5120833
63920 5120833 4934041 4723391 4493667 4249805 3997186 3741266 3486933 3238197 2998224
63911 2998224 2769402 2553465 2351739 2165213 1994341 1839044 1699110 1574448 1464711
63902 1464711 1368900 1285648 1213815 1152451 1100243 1055440 1016522 982673 953426 928069 905616
63891 905616 885276 866654 849409 832791 815645 797088 777235 757187 738168 720753 705024
63880 705024 691209 679795 671088 665096 661966 662117 665699 672200 680935 691713 704739 720006 737109
63867 737109 755657 775540 796688 818675 840623 861485 880613 898233 915213 932011 947841
63856 947841 961132 970848 977125 980659 981834 980609 976872 970533 961407 949388 934763 918119 899870
63843 899870 880057 858649 835842 811906 786882 760656 733346 705465 677568 649820 622074
63832 622074 594361 567161 541168 516927 494792 474978 457308 440961 424900 408800 393341
63821 393341 379380 367027 355802 345457 336152 327848 320037 312348 305065 298744 293560 289345 286039
63808 286039 283661 281917 280318 278716 277321 276082 274557 272620 270828 269649 268617 266777 263810 260209
63794 260209 256523 253010 250060 248191 247187 245786 242890 238890 235266 232965 231623 230405 229024 227692
63780 227692 226494 225292 224170 223536 223634 224116 224326 224008 223561 223505 223745 223635 222798 221643 220837 220448 219994 219316
63762 219316 218981 219536 220635 221247 220697 219239 217627 216428 215783 215563 215513 215411 215286 215432 216062 217026 218056
63745 218056 219203 220773 222812 224922 226676 227982 228943 229626 230218 231166 232800 234884 236849 238493 240213
63730 240213 242496 245443 248802 252223 255381 258158 260855 264019 267898 272233 276668 281156 285807 290527
63716 290527 295032 299047 302285 304441 305458 305685 305498 304869 303599 301894 300344 299230 298142 296422 293890
63701 293890 291058 288763 287641 287818 288982 290728 292814 295122 297485 299706 301682 303447 305196 307306
63687 307306 310114 313463 316670 319134 320843 322011 322437 321647 319646 317045 314402 311823 309382 307501 306640
63672 306640 306821 307729 309053 310522 311785 312627 313299 314371 316129 318172 319662 320019 319384 318348 317167 315371
63656 315371 312347 308193 303727 299656 296037 292553 288957 285168 281275 277656 274798 272785 271231 269917
63642 269917 269235 269634 270831 271946 272395 272469 273078 275055 278583 283029 287461 291500 295604 300322 305428 310082
63626 310082 313799 317023 320718 325568 331589 338398 345811 354120 363634 374044 384640 395336 407043
63613 407043 420721 436347 453254 471192 490539 511588 534203 558136 583131 608599 633656
63602 633656 657624 680177 700903 719135 734254 745809 753298 756390 755586 752236 747586 742056 735557
63589 735557 728065 719564 709852 698710 686053 671685 655369 637417 618786 600161 581380 562207
63577 562207 543254 525503 509240 494217 480646 469235 460228 453250 448218 445592 445417 446788 448742
63564 448742 451117 454095 457498 461109 465317 470696 477165 484156 491469 499337 507758 516484 525818 536743
63550 536743 549961 565329 582597 602272 625224 651691 681142 712872 746138 779555 810883
63539 810883 837776 858734 873341 881902 885110 883886 879261 872258 863886 855107 846614 838528 830300
63526 830300 820950 809570 795801 779912 762258 742578 720004 694011 665296 635504 606101 577664
63514 577664 550246 524096 499877 478287 459596 443441 429000 415567 403081 391975 382473 374208
63502 374208 366673 359776 353735 348657 344521 341338 338936 336740 334307 332034 330785 330677 330838 330598 330328
63487 330328 330679 331491 332119 332522 333310 334797 336638 338477 340360 342328 344168 345834 347722 350175 353012
63472 353012 355783 358213 360109 361144 361142 360410 359422 358221 356411 353651 349901 345367 340535 336196 332976
63457 332976 330797 329109 327725 327094 327669 329382 331853 334751 337699 340240 342385 345028 349277 355265 362014
63442 362014 368631 375290 382854 391814 402048 413480 426465 441380 458204 476737 496948 518674
63430 518674 541083 562849 582983 601197 617364 630998 641584 649333 655311 660876 667146 675016
63418 675016 685362 698981 716300 737221 761313 788069 816851 846476 875102 900883 922826
63407 922826 940791 954603 963632 967487 966850 963112 957255 949450 939709 928399 915878 901935 885912
63394 885912 867382 846522 823863 799786 774290 747239 718850 689926 661518 634369 608735
63383 608735 584724 562667 543083 526287 512101 500008 489687 481311 475136 470851 467738 465630
63371 465630 465305 467568 472150 477976 484377 491606 500182 510301 521939 535056 549519 565240 582644
63358 582644 602645 625821 651812 679731 708878 738840 769173 799401 829133 857776 884127
63347 884127 906580 923896 935718 942438 944775 943445 939062 932212 923582 913846 903327 891783 878638
63334 878638 863439 846177 827262 807166 785991 763417 739292 714197 689229 665305 642980
63323 642980 622835 605495 591070 579057 569063 561236 555637 551476 547355 542073 534940 525636 514207
63310 514207 501111 486914 472066 457128 442925 430058 418438 407660 397639 388536 380335 373004
63298 373004 366878 362281 358844 355771 352759 350133 348044 346131 344093 342018 339945 337601 334819 331823
63284 331823 328877 326024 323403 321356 319949 318767 317520 316497 316039 315908 315588 314972 314319 313753 313283 313202
63268 313202 313938 315465 317268 318982 320705 322606 324595 326578 328795 331594 334977 338557 341931 345018
63254 345018 348117 351835 356824 363239 370393 377212 383355 389736 397632 407300 417808 428280 438863
63241 438863 450254 462748 476219 490818 507019 524994 544469 565341 587925 612314 637912
63230 637912 663942 690206 717019 744549 772555 800660 828561 855954 882500 908011 932638
63219 932638 956873 981315 1006247 1031361 1055971 1079500 1101589 1121690 1138818 1151919 1160324 1163697
63207 1163697 1161703 1153949 1140271 1120990 1097037 1069843 1040830 1010760 979724 947981 916605 887037
63195 887037 860206 836519 816547 801057 790089 782513 777035 773554 773154 776786 784299 794837 807749
63182 807749 822779 839585 857566 876275 895739 916234 937869 960441 983423 1006000 1027421
63171 1027421 1047609 1067184 1086532 1104900 1120759 1133026 1141624 1146906 1148899 1147135 1140868 1129357
63159 1129357 1112287 1090040 1063385 1032917 999132 962967 925776 888613 851987 816454 782860
63148 782860 751638 722424 694925 669780 647960 629477 613396 599037 586526 576070 567296 559630
63136 559630 552907 547227 542421 538049 533944 530500 528237 527108 526371 525321 524160 523950 525636 529184 533696
63121 533696 538096 541701 544506 547235 550842 555581 560594 564696 567417 569135 570517 572186 574629 577806
63107 577806 580948 583210 584548 585560 586581 587462 588122 588627 588708 587961 586782 586326 587126 588355 588962 588953 588932 588962
63089 588962 588729 588580 589411 591428 593747 595485 596747 598284 600693 604192 608758 614091 619615 624846 629765
63074 629765 634765 640395 647193 655450 664990 675379 686475 698527 711629 725496 740105 756235
63062 756235 774895 796397 820371 846607 875384 907028 941620 979225 1019912 1063439 1109446
63051 1109446 1158266 1211045 1268558 1330110 1394074 1459332 1525688 1592976 1660447 1727280 1793284
63040 1793284 1858753 1923819 1988289 2052006 2115111 2177816 2239984 2300925 2359577 2414816 2465523
63029 2465523 2510311 2547421 2575109 2592054 2597194 2589363 2567634 2532238 2484845 2427722 2362741 2291319
63017 2291319 2215030 2136001 2056791 1979919 1907195 1839319 1776426 1719334 1669938 1629883 1599020
63006 1599020 1575753 1559004 1549308 1547782 1554455 1568009 1586861 1610087 1637370 1668505 1703038 1740172
62994 1740172 1778881 1818221 1857570 1896522 1934688 1971860 2008325 2044490 2079885 2112790 2141213
62983 2141213 2164068 2180944 2190903 2192293 2184035 2166521 2140703 2106645 2063570 2011264 1950940 1884843
62971 1884843 1815481 1745143 1675415 1606763 1538982 1472381 1408322 1348341 1292907 1241255 1192352
62960 1192352 1145961 1102907 1064274 1030152 999194 969727 941211 914167 888786 864382 840433
62949 840433 817404 795988 776070 757113 739133 722569 707408 693120 679389 666247 653540
62938 653540 640950 628656 617411 607757 599581 592617 586913 582543 579158 576146 573085 569943 566980
62925 566980 564529 562744 561483 560526 559769 559072 558122 556789 555456 554565 553909 552843 551167 549270 547286 544670
62909 544670 540882 536104 531010 526131 521663 517582 513640 509507 505135 500813 496739 492863 489308 486568
62895 486568 484943 484036 483169 482142 481278 480913 481143 481904 482916 483615 483517 482703 481705 480938 480487 480435 481115 482820
62877 482820 485380 488123 490255 491366 491629 491523 491300 490798 489817 488510 487258 486236 485330 484519 484079 484268
62861 484268 484870 485271 485019 484273 483589 483299 483218 482974 482489 482009 481767 481796 482059 482580 483354 484191 484711 484600 483944
62842 483944 483300 483190 483432 483187 481879 479888 478068 476782 475715 474538 473339 472452 472209 472835 474207 475680
62826 475680 476564 476926 477619 479394 482206 485390 488215 490240 491583 492960 495160 498281 501803 505487 509779
62811 509779 515104 521130 527054 532374 537153 541839 547044 553289 560631 568694 577158 586043 595427 605329
62797 605329 616004 627943 641247 655384 669942 685357 702553 722120 744253 769261 797730
62786 797730 830299 867564 910033 957922 1011169 1069909 1134630 1205559 1282213 1363934 1450560
62775 1450560 1542136 1638295 1738242 1840772 1943591 2043095 2135800 2219856 2294306 2357092 2405035
62764 2405035 2436065 2450395 2448984 2431820 2398500 2349831 2287957 2215181 2133445 2044822 1951722
62753 1951722 1856405 1760575 1665484 1572136 1481466 1394604 1312802 1236790 1166271 1100454 1039087
62742 1039087 982650 931592 885840 845092 809119 777441 749076 723060 699207 678055 660018
62731 660018 644809 631760 620495 611081 603552 597491 592224 587436 583507 581119 580491 581054 582051 583472
62717 583472 586258 591446 599235 609030 620285 632971 647282 663280 681090 701166 723994 749663
62705 749663 778083 809677 845562 886781 933505 985170 1041389 1102471 1168899 1240503 1316473
62694 1316473 1396152 1479276 1565046 1651368 1735678 1816408 1892948 1964031 2026869 2078255 2115956
62683 2115956 2138739 2145770 2136867 2113057 2076067 2027251 1967491 1898021 1820712 1737602 1650753 1562574
62671 1562574 1475559 1391419 1310873 1234376 1162477 1095344 1032568 973832 919400 869665 824604
62660 824604 783961 747582 715207 686279 660286 637032 616293 597574 580531 565280 551854
62649 551854 539655 527933 516650 506405 497581 489895 482672 475264 467503 460099 454362 451002 449383
62636 449383 448389 447701 447582 447677 447070 445646 444402 444015 443900 443221 442100 441147 440441 439797 439595 440320 441478 442034
62618 442034 442037 442827 445276 448679 451984 455440 460242 466866 474475 481991 489141 496428 504505 513749 524189
62603 524189 535752 548659 563542 580951 600865 622961 647327 674620 705528 740326 778882
62592 778882 820720 865048 911048 958257 1006385 1054653 1101550 1145348 1184640 1218337 1245502
62581 1245502 1265395 1277529 1281501 1276954 1263769 1242193 1212842 1176922 1136413 1093486 1049445 1004530
62569 1004530 958922 913585 869817 828399 789544 753378 719996 689244 660885 634918 611474
62558 611474 590555 572201 556652 543854 532933 522674 512622 503387 495809 490067 485527 481216
62546 481216 476541 471797 467930 465523 464209 463302 462721 462825 463610 464704 466039 467893 470176 472307 473930
62531 473930 475310 476867 478830 481481 485239 490287 496521 504001 513031 523715 536007 550426 568082
62518 568082 589587 614420 641784 671664 704594 740842 780355 823115 868853 916589 965032
62507 965032 1013392 1061336 1108172 1152557 1192958 1227969 1256247 1276709 1289031 1293629 1291071 1281797
62495 1281797 1266488 1246339 1222755 1196990 1170179 1143499 1118087 1094854 1074436 1057281 1043834
62484 1043834 1034785 1031049 1033221 1041028 1053594 1070286 1090953 1115171 1141533 1168010 1192895 1215166
62472 1215166 1234060 1248655 1257989 1261386 1258600 1249709 1234953 1214489 1188220 1155978 1118042 1075467
62460 1075467 1029859 982916 936230 891167 848521 808261 770026 734057 701417 673119 649290
62449 649290 629357 612721 598947 587554 578147 570764 565744 563190 562833 564425 567875 572891 578847
62436 578847 585203 591792 598435 604471 608978 611438 612001 611073 608747 604704 598623 590598 581057 570431
62422 570431 559128 547829 537323 527746 518304 508232 497838 488109 479390 471105 462882 455339 449372
62409 449372 445086 441791 438817 435974 433266 430542 427536 424226 421042 418551 416889 415689 414731 414349 414890
62394 414890 416103 417569 419444 422067 424954 427039 428049 428867 430298 432177 433995 435654 437232 438760
62380 438760 440710 444013 449019 455027 461358 468255 476040 484150 491860 499385 507312 515472 523575 532535
62366 532535 543800 557364 571766 586276 601943 620058 640743 663669 689310 718642 752119
62355 752119 789556 830573 874549 920458 967214 1013918 1059405 1101944 1139859 1172163 1198244
62344 1198244 1217351 1228923 1233192 1231012 1223301 1211031 1195365 1177120 1156188 1132063 1104987 1076125
62332 1076125 1046739 1017684 989661 963290 938756 915849 894543 875063 857180 839923 822494
62321 822494 805096 788427 772500 756404 739192 720626 701083 681083 661049 641275 622005
62310 622005 603599 586543 571009 556518 542461 529112 517629 508769 501909 495794 490038 485375
62298 485375 482458 480942 479925 478956 478288 478326 479102 480276 481505 482746 484190 485962 488018 490375 493218
62283 493218 496623 500380 504292 508427 512737 516716 519896 522542 525322 528376 531312 534115 537377 541545
62269 541545 546543 552371 559389 567722 577091 587601 600013 614775 631487 649969 671180 696268
62257 696268 725263 757609 793535 833795 878179 925307 973927 1023438 1072924 1120618 1164733
62246 1164733 1204162 1238090 1265540 1285714 1298261 1302938 1299528 1288392 1270556 1246808 1217122 1181368
62234 1181368 1140239 1095101 1047324 998224 949357 902228 857680 815969 777399 742534 711746
62223 711746 684851 661295 640520 622074 605617 591043 578613 568720 561382 556035 551985 549024
62211 549024 547371 547073 547790 549212 551307 554062 557418 561674 567369 574382 581684 588491 595138 602178 609141
62196 609141 615090 620044 624820 629626 633883 637432 640804 644081 646610 648248 649901 652351 655349 658417
62182 658417 661639 665033 667958 669918 671361 672933 674505 675706 676904 678809 681560 685118 690302 698467
62168 698467 710221 725198 743023 763743 787328 813498 842148 873327 906657 941141 975491
62157 975491 1008184 1037435 1061829 1081073 1095591 1105469 1110333 1110189 1105546 1096607 1083147 1065535 1045096
62144 1045096 1022972 999222 973600 946776 920171 894907 871506 850356 831804 815730 801625
62133 801625 789276 779039 771306 765983 762587 760539 759249 758226 757394 757122 757666 758729 759870 761227
62119 761227 763439 766883 771375 776671 782683 788921 794325 798232 801090 803525 804996 804261 801157 797038
62105 797038 793226 789829 786356 782585 778228 772511 764984 756430 748267 741326 735827 732094 730387 730182
62091 730182 730529 731219 732843 735634 739010 742526 746534 751539 757478 764109 771658 780557 790814 802099
62077 802099 814282 827457 841479 855871 870286 884917 900336 916960 934654 952827 971004
62066 971004 989217 1007828 1027078 1047063 1068033 1090282 1113576 1136967 1159407 1180337 1199446
62055 1199446 1215992 1228746 1236747 1239988 1239265 1235372 1228431 1217864 1202861 1182944 1158326 1129946
62043 1129946 1098989 1066122 1031298 994546 956794 919452 883241 848040 813974 781872 752188
62032 752188 724188 696994 671008 647468 626904 608929 593383 580537 569997 560404 550705 540951
62020 540951 531388 521637 511484 501798 493653 486772 479788 471994 464125 457247 451624 446951 443139 440383
62006 440383 438702 437875 437757 438329 439417 440673 442022 443973 447235 451925 457311 462411 466709 470165 472730
61991 472730 474304 475126 475761 476378 476391 475108 472590 469546 466491 463329 459735 455586 451003 446316 442143
61976 442143 439178 437573 436641 435470 433859 432430 431745 431508 430876 429455 427708 426260 425036 423407 421156
61961 421156 418922 417473 416769 416133 415260 414667 414900 415611 415793 414926 413568 412743 413006 414270 416334 419280 423319
61944 423319 428410 434169 440203 446601 454012 463022 473372 484062 494374 504595 515502 527385 539864
61931 539864 552425 564711 576403 587293 597469 606990 615404 622020 626689 629830 631695 632230 631727
61918 631727 630895 629919 628062 624623 619817 614380 608991 604580 602495 603484 606863 611455 617042 624169 632817
61903 632817 642128 651341 660092 667852 673967 678369 681447 683068 682493 679514 674919 669493 663233 655973
61889 655973 648155 640549 633579 627320 621736 616569 611332 605726 599795 593544 586891 580128 573734 567390
61875 567390 559815 550184 539252 528528 518792 510019 502359 496349 492230 489730 488552 488592 489667 491468
61861 491468 493831 496720 500034 503808 508563 515095 523846 534742 547487 561704 576934 592981 610248
61848 610248 629326 650219 672270 694768 717153 738657 758370 775899 791542 805469 817026
61837 817026 825203 829647 830925 829880 827011 822490 816603 810060 803933 799285 796758 796401 797860 800731
61823 800731 804780 809831 815447 820826 825174 828189 829988 830422 828635 823521 814572 802184 787213 770429
61809 770429 752336 733334 713955 694940 677029 660566 645313 630749 616562 602870 590071
61798 590071 578559 568490 559658 551521 543460 535170 526985 519789 514350 510518 507223 503531 499565 496128
61784 496128 493590 491637 490045 489033 488586 488004 486590 484519 482616 481487 481174 481418 481878 482258 482611 483395
61768 483395 484881 486650 488021 488910 489894 491556 494078 497412 501461 506059 511034 516300 521713 526962 531826
61753 531826 536427 540920 545090 548535 551087 552720 553251 552552 550845 548280 544495 539220 533187 527617 522778
61738 522778 517918 512758 508171 504823 501966 498318 493676 488979 485144 482524 481217 481109 481612 482075 482535
61723 482535 483524 485064 486464 487353 488377 490454 493599 496850 499262 500756 502039 503847 506145 507969 508186
61708 508186 506516 503775 501047 498791 496788 494722 492526 490266 488007 485889 484133 482810 481570 479718
61694 479718 476702 472611 468171 464109 460553 457163 453752 450475 447343 443973 440116 436203 432974 430707
61680 430707 429127 427961 427058 426009 424233 421673 418965 416661 414614 412434 410139 407963 405836 403571
61666 403571 401423 399966 399414 399418 399465 399165 398304 397031 395947 395549 395692 395982 396573 398030 400378 402934 405160
61649 405160 407089 408815 410239 411611 413606 416457 419526 422161 424435 426548 428109 428728 428883 429390 430238
61634 430238 430657 430248 429310 428115 426596 424855 423285 422006 420680 419085 417381 415589 413273 410043 406107
61619 406107 402120 398686 396104 394260 392611 390585 388141 385673 383292 380583 377243 373545 369854 366030
61605 366030 361707 356968 352348 348229 344553 341124 337884 334852 332013 329363 326891 324453 321779 318782
61591 318782 315808 313427 311913 311040 310408 309771 308870 307251 304680 301748 299536 298543 298359 298559 299261 300405
61575 300405 301119 300551 299013 297509 296352 295090 293701 292814 292593 292397 291995 292194 293631 295628 297059 297836
61559 297836 298698 299899 301033 302072 303530 305401 306721 306745 306025 305821 306642 307883 308784 309320 310014 311213
61543 311213 312775 314345 315703 316852 317960 319271 320930 322789 324494 325860 327006 327953 328317 327743 326576
61528 326576 325665 325399 325275 324637 323587 322825 322658 322476 321323 318950 316181 314161 313246 312817 312235 311686 311807
61511 311807 312734 313929 314820 315166 314885 314077 313278 313153 313718 314333 314567 314580 314519 314197 313746 313939 315300 317366
61493 317366 319375 321245 323205 324861 325499 325214 324930 325195 325669 325973 326343 327111 328048 328661 328833 328848 328996 329460
61475 329460 330400 331812 333360 334612 335501 336390 337603 338943 339737 339506 338588 337934 338221 339304 340629 341883
61459 341883 342945 343403 342619 340352 337163 334211 332714 333261 335219 336992 337400 336822 336610 337484 339011 340607
61443 340607 342274 344047 345434 345920 345721 345548 345893 346859 348382 350173 351674 352542 353099 353956 355324 356929
61427 356929 358379 359213 358962 357793 356963 357910 360740 364116 366736 368352 369262 369618 369766 370634 372947 376178
61411 376178 378900 380209 380368 380090 379726 379284 378779 378257 377658 376871 375863 374684 373459 372379 371514 370679 369692
61394 369692 368780 368448 368880 369709 370432 370734 370396 369376 368174 367656 368128 368994 369762 371019 373695 377537 381054
61377 381054 383204 384488 386103 388492 391159 393588 395835 398158 400390 401889 402190 401622 401083 401064 401169 400943
61361 400943 400862 401811 403562 404607 403926 402397 401939 403552 406726 410477 414360 418485 423080 428202 433628
61346 433628 438944 443867 448400 452559 456147 459077 461701 464449 467300 469945 472336 474652 476825 478667
61332 478667 480440 482780 485833 488928 491356 493116 494625 495997 496932 497117 496512 495412 494453 494375 495536 497742
61316 497742 500685 504352 508873 514249 520601 528427 538117 549186 560489 571461 582845 595880 610877
61303 610877 626806 642224 656319 669059 680601 690742 698872 704352 707010 707326 706020 703332 698818
61290 698818 692016 683155 672989 662051 650461 638469 626747 615951 606254 597413 589011 580494 571466
61277 571466 562301 554168 548000 543692 540630 538673 537979 538103 538043 537306 536359 535854 535904 536349 537329 539302 542714
61260 542714 547724 553913 560234 565671 570148 574430 579027 583682 588055 592309 596592 600449 603327 605392
61246 605392 607365 609721 612475 615480 618456 620844 622182 622632 622817 623130 623507 623798 624034 624458 625519 627678
61230 627678 630839 634228 637285 640528 644999 650961 657710 664631 671830 679608 687928 696602 705399 713765
61216 713765 721014 727187 733209 739781 746549 752826 758668 764663 770899 776744 781515 784904 786969 788312
61202 788312 790162 793611 798628 804341 810363 817246 825489 834732 844371 854420 865188 876346 886889
61189 886889 896000 903471 909340 913578 916227 917422 917095 914953 911006 905887 900335 894471 887740 879521
61175 879521 869701 858805 847757 837353 827680 818078 807895 797219 786650 776422 766134 755342
61163 755342 744022 732279 720022 707283 694600 682669 671738 661651 652370 644050 636661 629990
61151 629990 624153 619723 617143 616189 616080 615910 614932 612770 609592 605909 602030 597885 593495 589276 585653
61136 585653 582564 579657 576858 574486 572931 572467 573317 575607 579316 584450 591193 599635 609434 620056
61122 620056 631372 643795 657830 673707 691485 711263 733070 756574 780949 805133 828486
61111 828486 851327 874599 898703 922820 945704 966968 987227 1007048 1026170 1043696 1058560
61100 1058560 1069773 1076799 1079993 1080269 1078037 1072707 1063461 1050225 1033745 1015024 994940 973996 952087
61087 952087 928730 903939 878722 854434 831778 810650 790717 771727 753488 736011 719698
61076 719698 705045 692117 680567 670131 660823 652677 645584 639473 634421 630583 628071 626903 626885 627663
61062 627663 629038 631120 634043 637693 641930 646859 652593 658964 665825 673456 682227 692005 702380 713448
61048 713448 725864 740058 755853 772981 791484 811407 832490 854446 877302 901273 926552
61037 926552 953412 982286 1013528 1047178 1083003 1120549 1159198 1198567 1239037 1281591 1326902
61026 1326902 1374708 1424202 1474813 1526533 1579778 1635219 1693652 1755922 1822987 1896078 1976608
61015 1976608 2065970 2165593 2277122 2402288 2542853 2701348 2882281 3092793 3342579 3643816
61005 3643816 4010881 4459183 5003876 5660123 6444323 7373980 8465784 9733489 11184251
60996 11184251 12809413 14571265 16396501 18185405 19831857 21241113 22341442 23097585
60988 23097585 23527884 23709043 23750957 23748514 23741305 23705881 23575724 23266382 22694205 21795404
60978 21795404 20550389 19001105 17244202 15400751 13582339 11871804 10320285 8951832
60970 8951832 7769610 6762850 5913626 5201409 4605395 4106221 3687230 3334409 3035617
60961 3035617 2780620 2561479 2371905 2206265 2059963 1930440 1816521 1716471 1627664 1548337
60951 1548337 1478495 1418328 1366479 1320507 1278466 1239333 1202477 1167573 1134834 1104512 1076139
60940 1076139 1048854 1022445 997576 974871 954233 935259 917871 902232 888206 875277 863019
60929 863019 851480 841012 831869 824115 817843 813241 810341 808838 808319 808587 809679 811686 814671 818622
60915 818622 823413 828937 835371 843024 851754 860846 869712 878437 887317 896221 904823 913091 920964 927804
60901 927804 932930 936551 939459 941736 942529 941217 938092 933666 928042 921282 913701 905383 896009 885647
60887 885647 875151 865206 855398 844818 833184 820743 807423 792925 777610 762535 748421 735058
60875 735058 721949 709121 697031 685907 675517 665503 655765 646480 637839 629937 622852 616601 610861
60862 610861 604956 598492 591880 585841 580462 575200 569801 564620 559829 554926 549436 543678 538400 533954
60848 533954 530192 526869 523722 520361 516503 512174 507444 502223 496602 491022 485673 480019 473416 466006
60834 466006 458523 451452 444898 439104 434389 430566 427050 423711 421138 419823 419504 419573 419831 420510 421716
60819 421716 423080 424010 424194 423843 423420 423145 422899 422575 422272 422018 421594 420822 419826 418795 417791 416985 416721 416991
60801 416991 417260 417257 417549 418664 419961 420148 418867 416979 415279 413759 412288 411101 410093 408415 405490 402015
60785 402015 399252 397495 395865 393547 390645 387715 384969 382240 379439 376705 374159 371727 369260 366698
60771 366698 364054 361380 358909 357142 356497 356772 357250 357543 358119 359650 362009 364267 365698 366464 367273 368635
60755 368635 370561 372756 374937 377004 378964 380779 382483 384504 387488 391459 395338 397785 398522 398545 399052
60740 399052 400420 402117 403149 402616 400269 396705 392783 388866 384858 380772 376768 372696 368262 363732
60726 363732 359840 356763 353773 350248 346563 343513 341247 339196 336825 334053 331120 328406 326249 324698
60712 324698 323552 322782 322615 322951 323044 322204 320603 319049 318114 317769 317674 317414 316624 315405 314604 315213 317300 319837
60694 319837 321656 322437 322711 323202 324258 325785 327547 329474 331618 333862 335867 337491 339108 341366 344634
60679 344634 348750 353160 357282 360946 364637 369061 374321 379755 384753 389385 393916 398040 401110 402976
60665 402976 404113 404959 405502 405465 404501 402285 398908 395268 392568 391283 390931 390912 391108 391468 391473 390489 388506 386236
60647 386236 384527 383793 383873 384258 384505 384533 384437 384089 383107 381226 378463 374895 370563 365746 361025 356929 353660
60630 353660 351261 349737 348829 347964 346751 345367 344284 343759 343809 344352 345093 345506 345333 344970 345041 345680 346545 347404
60612 347404 348251 348968 349381 349691 350377 351512 352561 353031 352993 352853 352948 353555 354849 356564 358073 359112 360192
60595 360192 361922 364188 366387 368270 370121 372238 374657 377271 379776 381571 382208 381982 381675 381721 382069 382806
60579 382806 384188 385895 386984 387083 387076 388078 390187 392956 396626 401965 408886 416191 422996 429760 437467
60564 437467 446289 455563 464685 473439 481580 488648 494265 498284 500556 500863 499228 496138 492375 488693
60550 488693 485616 483320 481668 480542 480168 480973 483049 486067 489866 494912 501840 510661 520754 531708
60536 531708 543878 557922 573953 591250 608651 625057 639671 651993 661628 668115 671010 670275
60524 670275 666473 660502 653181 645169 637027 629100 621450 614196 607801 602654 598495 594694 591183 588577
60510 588577 587211 586581 586141 586268 587929 591642 597251 604651 614140 625972 640057 656361 675398 698056
60496 698056 724964 756032 790458 827108 864956 903245 941335 978591 1014476 1048493 1079719
60485 1079719 1106581 1127457 1141513 1148680 1148906 1141859 1127456 1106297 1079310 1047164 1010247 969127
60473 969127 924895 879120 833542 789692 748675 711233 677867 648699 623258 600695 580318
60462 580318 561862 545251 530359 517056 505276 494894 485588 476914 468475 460165 452377 445871 441099
60449 441099 437665 434689 431695 428807 426141 423469 420659 418062 416142 414973 414355 414116 414028 413656 412684 411266
60433 411266 409783 408356 406897 405517 404509 403948 403674 403707 404352 405648 406963 407389 406558 404981 403581 402928
60417 402928 402839 402606 401625 399939 398297 397685 398607 400698 403102 405286 407380 409575 411444 412259 412035 411785
60401 411785 412492 414067 415660 416755 417558 418402 419289 420258 421809 424520 428297 432375 436124 439493 442552
60386 442552 445039 446867 448776 451741 455632 459210 461802 464245 467584 471391 474243 475538 475844 475601 474640
60371 474640 473261 472682 473710 475638 477176 477955 478423 478742 478642 478210 478009 478390 479258 480557 482370 484499
60355 484499 486487 488304 490533 493624 497305 501076 505056 509950 516112 522868 528900 533335 536344 538669
60341 538669 540744 542495 543761 544385 543789 541122 536304 530535 525195 520495 515768 510811 506243 502462 499040
60326 499040 495441 491824 488761 486455 484576 482701 480632 478462 476502 475067 474181 473633 473356 473551 474304
60311 474304 475371 476587 478386 481637 486986 494487 503849 514884 527625 542004 557440 572893 587469
60298 587469 600905 613231 623925 631727 635465 634919 630710 623540 613831 601979 588577 574292 559829
60285 559829 546158 534408 525078 517437 510168 502822 496280 491568 488532 486043 483291 480380 477677 475138
60271 475138 472472 469525 466305 462856 459281 455671 451883 447774 443809 440985 439775 439467 438957 437907 436753
60256 436753 435782 434765 433385 431611 429618 427701 426220 425323 424763 424234 423778 423582 423634 423963 424964 426917
60240 426917 429323 431303 432618 433668 434570 435030 435254 436146 438159 440571 442445 443831 445566 448255 451974
60225 451974 456596 461770 466701 470579 473402 476025 479317 483519 488381 493581 498915 504285 509723 515365
60211 515365 521311 527470 533560 539412 545341 552061 559884 568096 575459 581404 586375 591000 595419 599692
60197 599692 604246 609327 614310 618206 620807 622811 624777 626397 626966 626178 624305 621887 619446 617239 615037
60182 615037 612234 608398 603761 599051 594902 591431 588288 585006 581337 577406 573638 570484 568132 566362
60168 566362 564673 562611 560021 557008 553732 550325 546988 543999 541513 539437 537607 536040 534898 534182
60154 534182 533625 533012 532573 532843 534001 535506 536627 537323 538269 539911 541862 543497 544884 546708 549369 552582
60138 552582 555835 558889 561785 564783 568390 573053 578607 584313 589568 594283 598481 601985 604787 607299
60124 607299 609833 612086 613602 614499 615349 616465 617810 619485 621797 624739 627843 630703 633311 635765 638061
60109 638061 640386 643235 646835 650596 653487 654899 654918 653850 651832 648999 645695 642238 638636 634778 630866
60094 630866 627399 624690 622635 621023 619853 619197 618903 618700 618454 618048 617107 615182 612320 609232 606805 605531
60078 605531 605340 605684 605726 604796 602859 600336 597343 593420 588227 582231 576256 570514 564450 557576 550102
60063 550102 542675 535792 529612 524095 519087 514330 509610 504999 500818 497263 494116 490933 487608 484641
60049 484641 482748 482275 483088 484903 487456 490450 493644 497122 501218 506081 511546 517430 523591 529550 534472
60034 534472 537870 540080 541709 542867 543343 543302 543206 543058 542175 539887 536144 531347 525918 520129 514088 507744
60018 507744 501112 494539 488542 483330 478739 474636 471059 467865 464733 461708 459351 457924 456764 454953
60004 454953 452470 450148 448548 447363 446084 444703 443488 442455 441528 441025 441496 442983 444833 446454 448034
59989 448034 450300 453619 457571 461452 465039 468696 472787 477099 480903 483502 484683 484761 484304 483794 483354
59974 483354 482668 481238 478825 475665 472318 469361 467204 465946 465237 464416 463087 461566 460609 460671 461545 462728
59958 462728 463973 465424 467355 469808 472411 474594 476136 477440 479027 480814 482230 483123 484164 486097
59944 486097 488807 491472 493538 495241 497178 499572 502054 504112 505662 507057 508456 509357 509112 507885 506720
59929 506720 506565 507530 509173 511084 513007 514869 517007 519932 523545 527008 529836 532619 536135 540195 544077
59914 544077 547760 551903 556786 562079 567620 573502 579260 583755 586187 586693 585799 583898 581472 579182 577345
59899 577345 575714 573932 571840 569330 566527 564213 563400 564220 565883 567932 570766 574591 578728 582571 586491
59884 586491 591037 595785 599829 603067 606254 609960 614153 618627 623193 627493 631175 634226 636774 638632
59870 638632 639398 638855 637019 634018 630248 626312 622349 617790 612205 606095 600294 594938 589658 584567 580311
59855 580311 577251 575242 574219 574383 575768 578187 581618 586196 591751 597883 604524 611922 619952 627840
59841 627840 634688 639990 643623 645725 646660 646868 646708 646551 646726 647008 646432 644104 640114 635236 629939 624198
59825 624198 618067 611806 605520 599214 593162 587679 582602 577562 572670 568366 564729 561586 559185 557927
59811 557927 557437 556764 555603 554502 553718 552758 551388 550174 549510 548805 547227 544717 541813 538985 536562 534780
59795 534780 533382 531651 529261 526697 524496 522671 521280 520802 521267 521655 521044 519919 519412 519613 519612 519077 518624
59778 518624 518432 517552 515210 512101 509732 508787 508715 508724 508617 508613 508836 509311 510220 511792 513863 515889 517610 519500
59760 519500 522273 526051 530331 534714 539168 543594 547656 551325 555184 559902 565617 572034 578805 585555
59746 585555 591876 597645 603168 608713 614120 619077 623498 627317 630235 632056 633039 633525 633432 632584 631385
59731 631385 630620 630610 631013 631520 632226 633157 633849 633748 632912 632046 631774 631967 631891 631050 629830 629083 629104 629310 629087
59712 629087 628622 628632 629498 631060 633071 635479 638234 641217 644435 648078 652294 657055 662247 667770 673584
59697 673584 679782 686572 694022 701883 709806 717602 725067 731651 736630 739730 741407 742428 743219 743590 742996
59682 742996 741182 738663 736410 734843 733226 730351 725795 720282 714841 709929 705365 700744 695629 689578
59668 689578 682415 674571 667011 660664 655865 652296 649429 647045 645455 645241 646722 649616 653311 657509
59654 657509 662449 668260 674250 679303 683130 686663 690787 695011 697890 698649 697773 695995 693260 688967 682811
59639 682811 675085 666406 657412 648558 639972 631550 623258 615226 607618 600653 594747 590303 587228 584899
59625 584899 582660 580113 577006 573244 569094 564904 560524 555440 549599 543596 537832 532068 526173 520778
59611 520778 516665 513858 511750 509853 508017 506205 504558 503486 503242 503542 503893 504138 504355 504482 504421 504272
59595 504272 504129 503871 503482 503322 503691 504385 505073 505840 506915 508130 509105 509695 509838 509235 507735 505771 503836
59578 503836 501709 498736 494712 489939 484728 479538 475299 472681 471079 469197 466743 464678 463563 462597
59564 462597 460765 458276 456203 455096 454574 454113 453740 453892 454835 456305 457726 458789 459707 460873 462457 464534
59548 464534 467267 470636 474258 477890 481863 486600 492029 498097 505521 515225 527147 540383 554427
59535 554427 569353 584728 599280 611867 622013 629280 633057 633385 631211 627436 622516 617293 613239
59522 613239 611117 610119 609086 607913 607042 606234 604806 602682 600269 597466 593627 588383 581839 574159 565658
59507 565658 557154 549478 542633 536021 529437 523236 517655 512664 508454 505325 503009 500832 498783 497770
59493 497770 498524 500708 503404 506027 508504 510936 513482 516344 519586 523103 526880 531021 535419 539682
59479 539682 543645 547796 552966 559612 567409 575415 582607 588414 592812 595911 597626 597997 597651 597453 597646
59464 597646 597645 596823 595197 593304 591763 591093 591657 593606 597020 602172 609304 618065 627522 636966 646369 655875
59448 655875 665226 674012 682134 689492 695476 699280 700743 700359 698408 694552 688497 680749 672416 664400
59434 664400 656939 649815 642794 635874 629245 623077 617366 612074 607363 603584 600973 599517 599189 600231
59420 600231 603120 608282 615840 625613 637355 651058 666924 684834 703864 722618 740163 756322
59408 756322 770808 782368 789224 790486 786850 779942 771271 761959 753125 746062 741825 740603 741491 742841
59394 742841 742949 740478 734457 724303 710217 693437 675761 658640 642865 628896 617022 607079
59382 607079 598506 591008 584954 580931 579138 579441 581651 585343 589638 593657 597173 600511 603877 607131
59368 607131 610139 613015 615997 619428 623885 629928 637548 646041 654499 662375 669667 676842 684498 692797
59354 692797 701284 709572 718139 727972 739356 751488 763440 775073 786774 798785 811217 824354
59342 824354 838447 853227 867908 881514 892995 901365 906297 908526 909220 908811 906818 902809 897044
59329 897044 889907 881168 870350 857724 844474 831717 819654 807895 796352 785481 775689 766882
59317 766882 758748 751266 744708 739203 734489 730104 725704 721228 716876 712941 709593 706867 704879 703900
59303 703900 704123 705472 707852 711538 717068 724640 733676 743036 751585 758601 763613 765924 764474 758465
59289 758465 748178 734938 720197 704911 689821 675744 663168 651986 642184 634523 629900 628174
59277 628174 628282 629522 632050 636074 641331 647710 655716 665734 677199 688996 700494 711741 722731
59264 722731 732855 741154 746928 750097 751041 750064 747087 742071 735562 728418 720948 712724 703438 693540
59250 693540 683847 674934 667150 660814 655916 651897 648208 644961 642702 641635 641416 641657 642324 643597 645576
59235 645576 648111 650784 653121 654986 656667 658407 659995 661001 661345 661380 661412 661272 660366 658172 654766 650900
59219 650900 647345 644127 640619 636474 632212 628750 626578 625577 625351 625488 625698 626032 626832 628232 629779
59204 629779 630778 630940 630542 630006 629472 628740 627588 626242 625490 626076 627851 629809 631072 631638 632056 632723 633697
59187 633697 634953 636521 638512 641102 644243 647397 649954 652054 654516 657719 661069 663906 666412 669132
59173 669132 672065 674819 677330 679794 682177 684451 687166 691118 696428 702505 708867 715470 722216 728694
59159 728694 734509 739454 743280 745688 746626 746237 744475 741084 735981 729392 721696 713391 705065 696985 688855
59144 688855 680394 671994 664317 657364 650526 643470 636376 629292 621940 614312 606884 600095 594148 589357
59130 589357 586038 583823 581779 579551 577879 577598 578656 580477 582846 585998 590238 595877 603135 611708
59116 611708 620740 629665 638720 648274 658065 667612 676901 685934 693913 699730 703308 705749 708090 710539
59102 710539 712990 715476 717729 718956 718645 717234 715444 713245 710101 706124 702300 699412 697217 694965
59088 694965 692346 689583 686844 683992 680898 677671 674434 671080 667347 663015 658015 652459 646600 640673
59074 640673 634749 628817 622941 617193 611543 606046 601050 596888 593304 589565 585283 580839 576842 573474
59060 573474 570548 567927 565563 563307 560961 558399 555518 552293 549051 546353 544362 542628 540805 539207
59046 539207 538274 537850 537524 537346 537546 537706 537028 535513 534169 533763 533939 533939 533738 534055 535431 537699 540314 542975
59028 542975 545890 549561 554375 560481 567966 576858 586794 596993 606942 616951 627646 638986 650098
59015 650098 659942 667831 673477 677052 679135 680100 679571 676988 672746 668243 664682 662312 660873 660257 660478
59000 660478 661498 663402 666438 670622 675529 680594 685379 689468 692489 694416 695554 696171 696460 696864 697863
58985 697863 699276 700268 700344 699952 699838 700207 700836 701720 703314 706283 711192 718206 727003 737233 749032 762705
58969 762705 777902 793637 809216 824584 839632 853901 867290 880376 893502 905989 916699
58958 916699 924877 930081 931882 930304 926112 920037 911970 901534 889079 875453 861014 845556 829131
58945 829131 812349 795847 779922 764648 750023 736123 723398 712563 703856 696704 690594 685818
58933 685818 682852 681363 680582 680351 680986 682317 683756 685136 686563 687480 686906 684804 682261 680056 677996
58918 677996 676035 674973 675282 676024 675888 674853 674033 674187 675152 676604 678609 681367 684989 689596 695281 701952
58902 701952 709616 718696 729715 742604 756682 771251 785895 800385 814781 829629 845470 861972
58890 861972 878059 893195 908136 924063 941283 959177 977138 994963 1012308 1028303 1042029
58879 1042029 1053167 1061937 1068458 1072422 1073425 1071447 1066850 1059909 1050523 1038592 1024659 1009982 995832
58866 995832 982791 970730 959233 947877 936338 924666 913406 903100 893612 884245 874561 864704
58854 864704 854800 844528 833672 822704 812315 802552 792960 783512 774789 767020 759416 750824 740894
58841 740894 730295 719936 710248 701200 692686 684611 676722 668657 660391 652439 645368 639191 633628 628925
58827 628925 625838 624560 624194 623779 623465 624150 626223 629377 633492 638892 645532 652605 659270 665374 671155
58812 671155 676648 681677 686182 690219 693831 697080 699994 702294 703356 702646 700135 696260 691696 687080
58798 687080 682623 677846 671946 664613 656401 648309 641190 635382 630562 625993 621329 617140 614292 612914
58784 612914 612469 612684 613703 615361 617220 619570 623524 629601 636845 643849 649990 655093 658552 659699 658724
58769 658724 656457 653266 648808 642840 635804 628532 621645 615147 608452 601003 593079 585736 579763 575096
58755 575096 571401 568646 566675 564856 562814 561136 560680 561495 563058 565226 568168 571612 575030 578577 583076
58740 583076 588926 595655 602601 609458 616024 621996 627294 632280 637501 643353 649848 656361 661804 665547
58726 665547 668132 670611 673314 675711 677297 677972 677661 676327 674527 673334 673484 674996 677649 681237 685237
58711 685237 688853 691710 694035 695933 696948 696593 694870 691922 687536 681376 673442 663958 653015 640636
58697 640636 627164 613331 599927 587364 575439 563641 551872 540804 531206 523004 515427 508063
58685 508063 501294 495529 490502 485628 480714 476077 472179 469373 467799 467218 467061 466816 466376 465998 466100 467084
58669 467084 469116 471993 475447 479706 485496 493312 502720 512512 521473 528994 535017 539503 542068 542331
58655 542331 540622 537929 534881 531131 526120 520234 514606 509861 505662 501533 497555 494036 491009 488424
58641 488424 486473 485332 484736 484078 482905 481161 479135 477343 476351 476471 477493 478811 479876 480585 481217 481925
58625 481925 482379 482130 481330 480819 481349 482949 485193 487799 490730 493961 497403 500945 504456 508016 512219
58610 512219 517710 524105 529945 534213 537421 540608 543736 545889 546765 547034 547267 547305 546863 546048 545148 544390
58594 544390 544007 544084 544330 544525 545132 546948 550192 554538 559925 566612 574400 582583 590856 599595 609024 618760
58578 618760 628373 637760 646723 654814 661895 668357 674537 680501 686638 693868 702847 713458 725380 738697
58564 738697 753642 770226 788453 808416 829752 851409 872390 892435 911600 929393 944689
58553 944689 956406 964109 968125 969289 968444 966159 962864 958924 954269 948261 940515 931585 922146 911707
58539 911707 898987 883592 866379 848114 828747 808349 787750 767718 748285 729497 712169
58528 712169 697274 685063 675234 667475 661322 656009 651054 646715 643442 641231 639793 638875 638048 636682
58514 636682 634554 632080 629617 627067 624498 622514 621476 620903 620183 619433 619072 619014 618862 618552 618194 617592 616495
58497 616495 615094 613802 612717 611693 610741 610041 609871 610724 613113 616970 621651 626796 632700 639632 647468
58482 647468 656342 666876 679208 692563 706472 721625 738507 755743 770943 782994 792553 800351
58470 800351 806052 808948 808936 806389 801607 794826 786604 777968 770127 763971 759723 757173 756253 757163 759960
58455 759960 764413 770338 777650 785974 794636 803083 810808 816887 820364 821242 820243 817375 811763 803281 793289
58440 793289 783062 772567 761671 751524 743546 737723 733144 729758 728320 728844 730368 732265 734821
58427 734821 738456 743221 749128 756252 764369 772976 781601 789730 796654 801856 805312 806998 806604 804265
58413 804265 800967 797429 793110 787178 779977 772537 765098 757304 749623 743299 738806 735440 732636 730707
58399 730707 729969 729986 730091 730143 730477 731505 733453 736103 738834 741324 744076 747727 751975 755732 758256 759631
58383 759631 760314 760816 761712 763319 765297 767053 768562 770419 773159 776850 781133 785420 789327 793292 798359
58368 798359 805030 812754 820875 829372 838204 846820 855174 864542 876177 889577 902982 915269 926422
58355 926422 936582 945639 953535 960111 964853 967647 969442 971359 973505 975547 977910 981357 985816 990788
58341 990788 996569 1003869 1012467 1021439 1030545 1040256 1050600 1061249 1072648 1085712 1100288 1114989 1128738
58328 1128738 1141510 1153578 1165020 1176009 1186567 1195971 1203293 1208594 1212829 1216693 1220406 1224359 1228992
58315 1228992 1234166 1239549 1245395 1252003 1258873 1265543 1272884 1282251 1293563 1305508 1317466 1329987 1343539
58302 1343539 1358044 1373478 1389676 1405730 1420862 1435695 1451395 1467885 1484354 1501129 1519341
58291 1519341 1538884 1558457 1577650 1597370 1618155 1639672 1661975 1685614 1710350 1735313 1760507
58280 1760507 1786742 1814116 1842143 1871221 1902217 1934653 1967175 1999954 2034793 2072815 2113780
58269 2113780 2157650 2204749 2254331 2305116 2357546 2413470 2473303 2535577 2599485 2665619 2733797
58258 2733797 2802465 2870857 2939663 3009094 3078514 3148513 3221031 3296750 3374485 3453786 3535941
58247 3535941 3621858 3711288 3804787 3904096 4009879 4121433 4239231 4365292 4500327 4643086
58237 4643086 4793320 4952891 5123200 5304117 5496194 5701232 5919929 6151781 6398009
58228 6398009 6661678 6944381 7246106 7569084 7918147 8296402 8704333 9144358 9622270
58219 9622270 10142784 10707783 11320645 11988396 12718038 13515147 14388094 15349548 16412231
58210 16412231 17588042 18893608 20352317 21989661 23832846 25918248 28294926 31020607
58202 31020607 34163567 37814794 42096165 47160242 53197114 60449570 69211618 79800315
58194 79800315 92525709 107674314 125485333 146104982 169533246 195554013 223604651
58187 223604651 252612159 280951196 306653226 327780144 342733527 350396100 350210307
58180 350210307 342294478 327514917 307364343 283643926 258104018 232192827 206958550
58173 206958550 183079112 160964816 140860683 122893963 107077462 93319001 81455720
58166 81455720 71288712 62602451 55181712 48831805 43387673 38707737 34668826 31169718
58158 31169718 28130997 25485843 23174014 21145090 19359995 17784923 16387486 15140554
58150 15140554 14024579 13022951 12118693 11297837 10551901 9874224 9256878 8693100 8179318
58141 8179318 7712340 7287018 6898294 6542878 6217319 5916994 5638307 5379292 5136914
58132 5136914 4906656 4686187 4476801 4279928 4094786 3920552 3757773 3605961 3462523
58123 3462523 3325909 3197421 3078171 2966542 2860475 2760141 2666422 2578580 2495309 2416577
58113 2416577 2342724 2273046 2206768 2144124 2085221 2029078 1974994 1923522 1874996 1828412 1782847
58102 1782847 1738680 1696362 1655347 1615287 1576968 1540986 1506752 1473792 1442757 1414094 1386941
58091 1386941 1360403 1334755 1310432 1287029 1264268 1242823 1223095 1204225 1185289 1166524 1148423
58080 1148423 1130545 1112117 1092997 1073340 1053213 1033191 1014306 996723 979395 961621 943884
58069 943884 926608 909347 891977 875494 860724 847264 834505 822699 812233 802798 793984 785759
58057 785759 777694 768846 759130 749705 741218 732712 723098 712665 702337 692556 683759 676874 672151 668333
58043 668333 663908 658515 652443 645723 638582 631838 625880 620004 613573 607008 600799 594450 587317 579710
58029 579710 572262 564895 557246 549390 541426 533116 524625 516721 509564 502262 494421 487056 481065 475902
58015 475902 470838 466444 463515 461391 458729 455313 451850 448576 445292 442235 439694 437181 434188 431396
58001 431396 429992 430121 430993 432115 433398 434448 434863 434982 435362 435750 435486 434615 433705 432828 431604 429957 427957
57984 427957 425300 421824 418174 415013 411901 407914 403123 398554 394958 392463 391021 390189 388804 386094
57970 386094 382953 381069 380780 380836 380205 379115 378171 377491 377026 376921 377194 377551 377716 377583 376964 375645 373736
57953 373736 371649 369801 368432 367459 366260 364144 361473 359776 360167 362151 364555 367120 370402 374636 379595
57938 379595 385198 391398 397779 404088 410865 418696 427138 435261 442893 450339 457148 462302 465561 467548
57924 467548 468427 467514 464411 459684 454100 447878 440984 433631 426331 419697 414118 409248 404113 398259 392476
57909 392476 387790 384127 380730 377543 375180 373683 372259 370315 367913 365202 362180 359048 356096 353196
57895 353196 350139 347351 345553 344770 344449 344467 345173 346479 347826 349098 350653 352347 353444 353721 353853 354434
57879 354434 355401 356623 358223 359934 360865 360356 358625 356319 353912 351716 349948 348531 347222 346055 345239
57864 345239 344629 343815 342769 341933 341633 341894 342790 344378 346345 348273 350153 352047 353465 353883 353718 353916
57848 353916 354630 355236 355595 356200 356916 356684 354826 351711 347843 343338 338736 335234 333386 332321 330928 329128
57832 329128 327419 325858 324268 322911 322189 321998 321988 322184 322885 324194 326067 328481 331176 333549 335260 336647
57816 336647 338193 339810 340995 341509 341585 341608 341775 341863 341285 339572 336865 333656 330121 326141 321933 318064
57800 318064 314765 311794 309145 307378 306948 307617 308636 309271 309230 309006 309629 311482 313598 314868 315717 317534
57784 317534 320526 323297 324750 325189 325273 325128 325061 325963 328155 330739 332825 334562 336255 337440 337735 337749 338136
57767 338136 338371 337476 335395 332725 329627 325977 322152 318653 315300 311746 308452 306235 305123 304590 304604
57752 304604 305475 306879 308080 309069 310555 312805 315369 317944 320639 323349 325627 327325 328652 329600 329990
57737 329990 330046 330163 330114 329291 327820 326600 326079 325842 325619 325806 326495 326787 325731 323526 321193 319365 317880
57720 317880 316322 314508 312546 310739 309349 308252 306964 305221 303350 301844 300711 299468 297777 295785
57706 295785 293777 291691 289196 286162 282818 279374 275880 272757 271152 272054 274994 278190 280251 281279
57692 281279 282097 283009 283716 283914 283396 281977 279949 278311 277942 278684 279783 281039 283038 286511 292113 300653
57676 300653 312834 328746 348227 371746 400381 434916 475497 522079 574413 631213 689668
57665 689668 745882 795492 834102 858008 865109 855197 829553 790756 742679 689797 635987 584070
57653 584070 536279 494369 458913 429100 403719 382143 364181 349430 337194 326913 318338 311409
57641 311409 306076 302110 298989 296189 293639 291671 290451 289738 289254 288999 289039 289263 289470 289457 288926 287562 285350
57624 285350 282637 279783 276970 274369 272173 270333 268496 266366 263933 261343 258750 256370 254393 252729
57610 252729 251096 249406 247828 246421 245053 243774 242876 242392 241861 240853 239452 238022 236719 235464 234159
57595 234159 232692 230900 228832 226879 225375 224155 222716 220754 218396 215988 213880 212361 211554 211315 211341
57580 211341 211395 211328 210883 209679 207547 204855 202289 200196 198262 195932 193027 189736 186157 182306 178637
57565 178637 176044 175016 175060 175257 175083 174412 173176 171579 170337 170037 170376 170629 170796 171532 172910 174054 174288
57548 174288 174036 174192 175098 176548 178307 180074 181257 181417 180889 180543 180909 181842 183036 184503 186330 188173
57532 188173 189300 189268 188477 187782 187530 187208 186281 185090 184531 184965 185889 186715 187442 188442 189975 192046 194371
57515 194371 196327 197279 197221 196849 196842 197302 198025 199011 200407 202189 204099 205797 206958 207430 207414 207253 206910 205941
57497 205941 204140 201941 199937 198258 196639 194893 193018 191033 189000 187131 185659 184648 184049 183788 183657
57482 183657 183305 182562 181635 180786 179956 178877 177423 175663 173734 171918 170665 170217 170200 169901 169048 168121 167796
57465 167796 168211 168846 169076 168646 167670 166376 165118 164504 165074 166593 168009 168487 168325 168440 169117 169804 170100
57448 170100 170279 170619 170806 170489 170052 170325 171651 173527 175087 175684 175182 174043 173123 173084 173931 175207 176510
57431 176510 177679 178566 178905 178522 177609 176751 176604 177420 178797 179921 180202 179708 179086 179013 179668 180634 181412 182050
57413 182050 183056 184572 185983 186655 186830 187338 188549 190004 191012 191148 190256 188511 186597 185302 184783 184552
57397 184552 184244 183958 183840 183843 184101 184984 186496 188032 188990 189336 189400 189496 189948 191089 193003 195499 198399 201454
57379 201454 204013 205396 205783 206141 207000 207901 208272 208228 208110 207926 207685 207701 208017 208074 207515 206807 206456 206187 205533
57360 205533 204801 204658 205078 205443 205448 205223 204821 204293 204092 204723 206156 208145 210791 214061 217093 218942 219854
57343 219854 220825 221919 222114 221043 219865 219876 221027 222381 223460 224489 225649 226711 227402 227736 227921 228085
57327 228085 228172 228109 228082 228494 229524 230862 232065 232970 233543 233645 233312 233064 233492 234652 236195 237908 239710
57310 239710 241385 242854 244496 246617 248775 250315 251501 253403 256525 260168 263319 265608 267224 268396
57296 268396 269257 269954 270735 272085 274587 278273 282268 285641 288529 291889 296165 300795 305024 308582 311597
57281 311597 314528 318242 323425 329674 335786 341070 345832 350469 354839 358739 362277 365392 367671 369048
57267 369048 370186 371778 373890 376266 378764 381229 383469 385715 388620 392476 396905 401542 406445 411523
57253 411523 416258 420489 424888 430129 436093 442409 449236 456848 464859 472559 479750 486662 493318 499658
57239 499658 506116 513461 522048 531606 541676 551895 561996 571913 581848 591974 602282 612893 624211
57226 624211 636453 649314 662425 675775 689327 702720 715898 729703 745135 762199 780144
57215 780144 798718 818487 839823 862278 885253 908810 933486 959496 986461 1013880 1041653
57204 1041653 1070019 1099041 1128363 1157645 1186984 1216583 1246083 1274743 1302326 1329333 1356269
57193 1356269 1383162 1409870 1436269 1461912 1486201 1509290 1532197 1555585 1578991 1601740 1624001
57182 1624001 1646276 1668359 1689556 1709581 1728537 1746319 1762786 1778289 1793358 1808079 1822439
57171 1822439 1837080 1852926 1870150 1888135 1906322 1924478 1942288 1959563 1976915 1995545 2016236
57160 2016236 2039059 2064059 2091485 2121209 2152589 2185301 2219920 2257383 2298063 2341455 2386597
57149 2386597 2432813 2480282 2529851 2582242 2637732 2696736 2760206 2829040 2903570 2984121 3071545
57138 3071545 3166502 3268585 3376834 3490634 3609226 3730749 3852931 3974629 4095766 4215995
57128 4215995 4334749 4452792 4572426 4695571 4822316 4951647 5082842 5215944 5351820
57119 5351820 5492347 5639928 5796197 5961299 6134362 6314153 6499412 6689520 6885327
57110 6885327 7089006 7303266 7531437 7778346 8050320 8354354 8698240 9091755 9547010
57101 9547010 10077955 10701014 11436987 12311807 13355501 14601383 16085991 17847788 19923959
57092 19923959 22347008 25141689 28321575 31886848 35825886 40118712 44737873 49647263
57084 49647263 54803022 60155289 65646158 71206313 76754837 82190920 87358488 91996695
57076 91996695 95732731 98160977 98976682 98074977 95556143 91658756 86682985 80940485
57068 80940485 74727244 68306767 61900924 55687879 49802322 44335875 39340647 34836817
57060 34836817 30820351 27268692 24146522 21412506 19024464 16941470 15124944 13540175
57052 13540175 12156923 10948334 9890018 8960599 8142412 7420842 6783186 6218297 5716716
57043 5716716 5270452 4872534 4516835 4198051 3911713 3654281 3423102 3215895 3030311
57034 3030311 2864346 2717065 2588381 2478011 2385074 2308759 2248903 2205823 2179874 2170966 2177478
57023 2177478 2194860 2215522 2230528 2231603 2212093 2167458 2096333 2001444 1889008 1766679 1641603
57012 1641603 1519593 1405008 1300697 1207908 1126483 1055377 993246 938811 890920 848502 810606
57001 810606 776521 745774 718068 693148 670588 649662 629630 610411 592771 577581 564929
56990 564929 554256 545285 538412 534060 532053 531811 532841 534716 536716 537808 537064 534008 528536 520596
56976 520596 510007 496714 481316 465137 449478 434826 421099 408606 398323 391074 386861 385275
56964 385275 386190 389669 395540 403608 414132 427516 443355 460134 475960 489294 498893 503542 502382
56951 502382 495536 484169 469769 453431 435820 417654 399947 383697 369556 358012 349678 344971
56939 344971 343472 344189 346787 352246 361851 375782 393044 412466 433085 453545 471892 486246 495299
56926 495299 498018 493499 481668 463853 442137 418179 392937 367330 342674 320303 300982 284740
56914 284740 271070 259264 248752 239259 230666 222786 215384 208436 202248 197307 193963 192168 191405 190934
56900 190934 190261 189489 189238 190261 192998 197369 203012 209849 218431 229508 243275 259200 276551 294760
56886 294760 313192 330958 347209 361378 372841 380613 383734 381928 375742 366274 355010 343620
56874 343620 333408 324931 318407 314361 313528 316291 322684 332976 347814 367746 392971 423550 459358
56861 459358 499538 542270 585167 625575 660513 686939 702673 707026 700527 684425 660722 632255
56849 632255 602182 573241 547538 526643 511433 502047 498526 501612 512625 532511 561347 598822
56837 598822 644808 699127 760714 827044 894233 957595 1012268 1053728 1078343 1084058 1070948 1041084
56825 1041084 997674 944294 884817 823572 764878 712036 666768 629663 600960 580916 569688
56814 569688 567230 573320 587612 609669 639020 675024 716385 760580 803834 841842 870701 887430
56802 887430 890127 878174 852540 815689 770865 721284 669821 619179 571917 530046 494559 465430
56790 465430 442235 424867 413689 409003 410531 417547 429435 445795 465889 488188 510550 530603
56778 530603 545895 554199 554223 546037 530580 508918 482243 452203 420648 388976 358125 329039
56766 329039 302561 278864 257634 239002 223665 211767 202195 193491 185129 177521 171081 165769 161308
56753 161308 157353 153478 149453 145529 142204 139674 137707 135977 134315 132726 131364 130386 129694 128983 128181
56738 128181 127558 127220 126842 126242 125868 126214 127033 127712 128235 129117 130374 131277 131298 130744 130241 130104 130486 131581
56720 131581 133240 134758 135538 135897 136833 138994 142026 144883 146691 147461 148042 149227 150864 152099 152525 152667
56704 152667 153156 153871 154288 154387 154673 155436 156447 157409 158251 158894 159076 158641 157825 157148 157073 157713 158697 159343 159231
56685 159231 158672 158402 158781 159513 160195 160801 161431 161919 161988 161661 161183 160643 160035 159621 159787 160425 160847 160576 159916
56666 159916 159438 159247 159172 159469 160653 162553 164191 164922 165267 166182 167899 169946 172033 174220 176324 177892
56650 177892 178938 180080 181619 183016 183710 184036 184786 186075 187179 187438 186866 185933 185185 185104 185814 186817 187399
56633 187399 187433 187405 187541 187423 186772 186111 186118 186531 186246 184438 181250 177502 174168 172058 171442 171752 171958 171448
56615 171448 170331 168945 167438 166007 165096 164966 165292 165449 165082 164233 163110 162039 161434 161469 161791 161808 161308
56598 161308 160654 160380 160682 161279 161688 161763 161979 162948 164621 166283 167532 168800 170519 172218 173074 173136 173244
56581 173244 173736 173987 173478 172691 172524 173246 174486 175904 177443 179082 180822 182890 185609 188910 192211 194958
56565 194958 197366 200506 205495 212466 220476 228537 236556 244973 253718 262012 269204 275273 280333 284114
56551 284114 286236 286714 285966 284552 283029 281732 280517 278972 277028 275047 273202 271226 268998 266831 264837
56536 264837 262498 259383 255908 252796 250146 247641 245442 244028 243188 241938 239710 237054 234870 233374
56522 233374 232120 230723 229164 227560 225955 224332 222614 220656 218328 215682 213026 210765 209066 207719
56508 207719 206438 205328 204779 204874 205168 205229 205081 204860 204331 203131 201366 199575 198122 196934 195810 194750
56492 194750 194000 193904 194666 196040 197383 198185 198396 198151 197506 196717 196413 196999 198090 198985 199546 200132 200858 201464
56474 201464 201899 202446 203236 204116 205052 206193 207509 208883 210542 212767 214992 215871 214705 212343 210263 209078
56458 209078 208419 207942 207855 208446 209576 210892 212274 213862 215636 217147 217799 217383 216248 214966 214015 213793
56442 213793 214613 216409 218680 220934 223005 224767 225887 226272 226480 227085 227796 227738 226558 224755 222966 221498
56426 221498 220576 220381 220682 220951 221021 221218 221737 222409 223258 224657 226612 228365 229106 228757 227852 227021 226825 227600
56408 227600 229108 230634 231736 232596 233425 233996 234063 233825 233574 233309 233158 233740 235450 237584 238810 238518 237289
56391 237289 236105 235567 235831 236791 238122 239421 240498 241408 242228 242924 243444 243774 243982 244311 245186 246862 249088
56374 249088 251255 252936 254231 255620 257555 260101 262839 265153 266651 267364 267642 267986 268821 270166 271555
56359 271555 272546 273315 274430 276022 277550 278489 278904 279162 279388 279539 279775 280401 281480 282660 283452 283678 283730
56342 283730 284351 285937 288090 290039 291492 292830 294559 296875 299726 302869 305891 308624 311595 315490
56328 315490 320046 323992 326406 327702 329014 331119 334188 338062 342232 345914 348693 350942 353258 355655
56314 355655 357663 359008 359878 360687 361940 364138 367426 371314 374988 377942 380342 382974 386831 392407 399170
56299 399170 405935 411828 416749 421040 425169 429653 434587 439152 442355 444572 447584 452622 459066 465629
56285 465629 472136 479301 487357 495846 504587 514019 524563 536241 548867 562089 575384 588562 602207
56272 602207 617121 633499 651137 670209 691169 713985 738197 763843 791758 822770 857075
56261 857075 894617 935766 981468 1032916 1091062 1156248 1228398 1307813 1395626 1493163 1601045
56250 1601045 1719358 1848545 1989527 2142830 2307882 2483213 2666957 2857010 3050869
56241 3050869 3245402 3436670 3620064 3790857 3944672 4077553 4185965 4267069 4318896 4340202
56231 4340202 4330518 4290650 4222798 4129838 4014654 3880397 3730949 3570532 3402887 3231120
56221 3231120 3058143 2886822 2719740 2558955 2405801 2260681 2123274 1993330 1871141
56212 1871141 1757224 1651887 1555278 1467306 1387164 1313428 1245097 1182225 1125167 1073643 1026939
56201 1026939 984549 946138 911244 879507 850798 824731 800573 778141 758131 740963 725886
56190 725886 711880 698795 686823 675574 664804 655456 648702 644120 640105 635987 632575 630502 629190
56177 629190 627790 626237 624996 624400 624470 624861 624904 624241 623474 623684 625370 628266 631944 635946 639749 643421
56161 643421 648046 654571 662439 670320 678020 686596 696680 707901 720060 733680 749110 766239 785512
56148 785512 808277 835624 867641 904226 945862 993227 1046801 1107151 1174819 1249411 1329335
56137 1329335 1412703 1497843 1582702 1664624 1741289 1811425 1874378 1929738 1977864 2020113 2057857
56126 2057857 2091399 2120066 2142962 2159459 2169313 2172612 2169348 2159005 2140897 2114863 2081210 2039980
56114 2039980 1990805 1933452 1868069 1795089 1715661 1632313 1548670 1468295 1393904 1327205 1268741
56103 1268741 1217994 1174232 1137136 1106245 1080424 1058728 1041289 1028338 1018804 1011004 1004434 999713
56091 999713 997016 995819 995978 997725 1000633 1003934 1007852 1013269 1020049 1027064 1033955 1041427 1049727 1058233
56077 1058233 1066834 1076245 1086685 1097551 1108666 1120510 1133081 1145965 1159706 1175461 1192997 1210620
56065 1210620 1227482 1244336 1261668 1278947 1296276 1314865 1334984 1355182 1374426 1393381 1412622
56054 1412622 1431257 1448493 1465106 1482195 1499755 1517509 1535864 1555001 1574269 1593399 1613131
56043 1613131 1633794 1654594 1675213 1696750 1720184 1745261 1771791 1800532 1831787 1864597 1898343
56032 1898343 1933758 1971442 2010926 2052155 2096185 2143326 2192304 2242382 2294551 2349374 2405502
56021 2405502 2461715 2518713 2577455 2637512 2698563 2761744 2827909 2896365 2966925 3041285 3120563
56010 3120563 3203361 3288328 3376844 3471050 3570841 3674928 3783359 3896862 4015244 4138653
56000 4138653 4269063 4408405 4556493 4712697 4878103 5054132 5240650 5437470 5645986
55991 5645986 5867409 6101327 6348206 6611287 6893803 7196432 7519873 7867660 8243872
55982 8243872 8650416 9089271 9564967 10081936 10642040 11248026 11907021 12627485 13415558
55973 13415558 14278065 15226454 16274238 17433750 18719825 20154200 21762801 23572878
55965 23572878 25618451 27946707 30616551 33697684 37279841 41483408 46461974 52407138
55957 52407138 59562658 68227809 78732268 91401286 106535730 124394505 145155596
55950 145155596 168860918 195343604 224095633 254080419 283636842 310648016 332940111
55943 332940111 348664919 356494482 355711468 346344143 329291103 306236800 279302380
55936 279302380 250609179 221960748 194697519 169672788 147308375 127704594 110757898
55929 110757898 96245537 83881765 73366346 64420169 56795196 50271708 44662478
55922 44662478 39818580 35622466 31975154 28792816 26009179 23571228 21431467 19547543
55914 19547543 17885904 16419381 15121698 13968091 12939319 12020342 11196021 10451699
55906 10451699 9776599 9162916 8602587 8088044 7614764 7179776 6778734 6407152 6063120
55897 6063120 5745747 5452166 5178916 4924985 4690513 4473585 4271137 4082094 3906802
55888 3906802 3744189 3592251 3450663 3320279 3200500 3089481 2986377 2891082 2802324 2718160
55878 2718160 2637818 2560889 2485337 2408668 2330768 2253472 2177737 2103276 2030640 1961319 1895663
55867 1895663 1832673 1772053 1714885 1662106 1613727 1569518 1529066 1491209 1454722 1419573 1386377
55856 1386377 1354874 1324188 1294291 1265909 1239030 1212689 1186164 1159413 1132520 1105686 1079485
55845 1079485 1054168 1029009 1003287 977516 952810 929479 907258 886392 867345 849800 832984
55834 832984 816588 800498 784235 767775 752385 739419 728695 719080 710076 701576 692714 682489
55822 682489 671280 660318 649867 639221 628291 617824 608110 598787 589899 581925 574703 567497 560250
55809 560250 553701 548202 543423 539315 536381 534867 534523 535251 537212 540248 543904 547955 552235 556126 558904
55794 558904 560337 560265 558094 553658 548100 542765 537545 531480 524674 518308 512876 507774 502678 497960 493570
55779 493570 488675 482787 476285 469690 463444 458532 456246 457063 460636 466867 475781 486219 495964 503624
55765 503624 509217 512470 511896 506369 496605 484215 470100 454672 438925 424189 411012 399048 387880
55752 387880 377422 367688 358603 349907 341050 331520 321558 312107 303763 296142 288702 281792 276351 272794
55738 272794 270596 268903 267156 265178 262979 260618 258153 255675 253296 250980 248429 245364 241882 238350
55724 238350 234921 231358 227434 223410 220043 218050 217409 217211 216551 215591 215440 216844 219513 222941 227220
55709 227220 232486 238049 242778 246140 248316 249583 250152 250234 249569 247195 242462 236113 229610 223537 217464
55694 217464 211204 205242 199878 194916 190472 187235 185484 184480 183303 181938 181209 181937 184320 187826 191576
55679 191576 195074 198553 202341 206092 209099 211214 212846 214127 214755 214688 214364 214041 213468 212397 211028 209877
55663 209877 209465 210026 211069 211483 210646 209307 208679 208875 209054 208975 209346 210432 211356 211215 210161 208920 207880
55646 207880 207083 206484 205800 204542 202590 200321 197943 195197 191970 188595 185211 181388 176813 171918 167402
55631 167402 163506 160079 157016 154299 151912 149957 148559 147547 146614 145863 145651 145731 145169 143372 140692 137717
55615 137717 134604 131432 128646 126622 125219 124143 123359 122791 122102 121154 120256 119597 118905 118047 117452 117474 117790
55598 117790 117967 118182 118776 119419 119354 118305 116655 114886 113250 111886 110838 110048 109582 109648 110229 110965 111659
55581 111659 112501 113543 114453 115173 116312 118338 120826 123189 125793 129577 134669 140157 145244 150014 154819
55566 154819 159484 163434 166399 168645 170433 171368 170565 167702 163695 159823 156295 152342 147796 143666 140733
55551 140733 138449 135957 133479 131777 130746 129626 128301 127336 126795 126141 125395 125355 126331 127532 128161 128374
55535 128374 128699 129127 129339 129331 129227 128832 127896 126611 125403 124425 123673 123322 123438 123464 122601 120715 118456 116336
55517 116336 114123 111351 108073 104835 102124 100132 98892 98221 97542 96174 93991 91592 89665 88390 87575
55502 87575 87106 86979 87093 87366 87972 89045 90239 90985 91204 91374 91830 92407 92825 92952 92560 91326 89430 87722
55484 87722 86827 86396 85618 84267 82806 81673 81012 80953 81622 82815 84085 85306 86737 88385 89588 89533 88089
55467 88089 85986 84208 83267 82998 82963 82967 83046 83032 82496 81393 80477 80594 81551 82087 81187 79151 77201 76264 76371
55448 76371 77041 77852 78608 79288 80053 81102 82279 82932 82520 81354 80430 80400 80979 81494 81676 81632 81432 81182 81254
55429 81254 81882 82550 82429 81481 80614 80520 80890 81075 81127 81682 83079 84941 86608 87718 88368 88880 89448 89998
55411 89998 90405 90774 91311 92001 92678 93271 93662 93382 91975 89708 87480 85896 84835 83958 83109 82092 80752
55394 80752 79525 79309 80322 81639 82294 82360 82415 82449 82018 81174 80537 80567 81228 82240 83128 83247 82362 81140 80539
55375 80539 80724 81051 81049 80920 81013 81303 81500 81376 80898 80249 79709 79336 78868 78144 77406 76944 76715 76625 76895 77685
55355 77685 78601 79081 79073 78870 78523 78007 77759 78304 79367 80041 79955 79633 79611 79791 79875 79873 79863 79650 79058 78330 78030
55334 78030 78583 79883 81153 81437 80542 79383 78935 79095 79135 79035 79494 80598 81456 81498 81302 81553 81870 81361
55316 81361 79958 78495 77656 77374 77214 76896 76479 76315 76796 77957 79422 80851 82187 83309 83752 83181 81985
55299 81985 81030 80803 81034 81157 80976 80823 81076 81577 81695 81140 80576 81051 82849 85253 87417 88910 89388 88478
55281 88478 86480 84629 83976 84239 84340 83895 83560 83922 84707 85298 85609 86063 86942 88025 88851 89140 88982 88696
55263 88696 88562 88600 88559 88143 87340 86529 86150 86201 86185 85730 85100 84869 85179 85555 85357 84207 82140 79796 78314
55244 78314 78495 79942 81473 82526 83590 85103 86538 87057 86594 85784 85139 84779 84704 84745 84385 83154 81226
55227 81226 79253 77689 76613 76071 76143 76723 77638 78929 80522 81696 81536 80104 78680 78503 79552 80851
55211 80851 81700 82299 83245 84650 85855 86036 85186 84329 84512 85627 86635 86910 86906 87307 88022 88381 87978 86927
55193 86927 85550 84328 83964 84919 86802 88591 89582 89835 89708 89407 89083 88887 88671 88023 86914 85970 85687
55176 85687 85697 85331 84708 84606 85216 85710 85382 84678 84621 85501 86588 87082 86916 86577 86492 86789 87480 88595 90033
55157 90033 91342 91928 91675 91255 91488 92380 93139 93195 92842 92670 92769 92843 92773 92674 92595 92500 92380 92066 91237 89997 89112
55136 89112 89113 89505 89524 89420 90070 91374 92057 91361 90010 89029 88433 87761 87192 87229 87638 87626 87024 86569 86898 87795
55116 87795 88593 88891 88746 88481 88406 88578 88795 88955 89288 89988 90800 91271 91345 91364 91609 92241 93575 95898 98882
55097 98882 101631 103535 104776 105813 106670 107045 106899 106595 106489 106572 106550 106180 105554 105121 105373 106389 107696 108618
55079 108618 108773 108286 107618 107194 107128 107224 107255 107267 107540 108234 109124 109725 109753 109526 109842 111253 113325 114804 114724 113291
55059 113291 111469 109795 108008 105875 103951 103038 103083 103071 102169 100638 99373 98783 98557 98453 98800 99897 101227
55042 101227 101708 100752 98818 96938 95950 96150 97327 98968 100623 102195 103721 104912 105220 104542 103488 102757
55026 102757 102506 102612 103177 104273 105375 105608 104697 103295 102268 101957 102230 102837 103412 103438 102572 101052 99529
55009 99529 98489 97941 97663 97600 97926 98763 99936 101082 102035 102985 104177 105488 106462 106819 106727 106538 106388 106251
54991 106251 106235 106578 107293 108046 108534 108831 109168 109445 109257 108477 107611 107368 107945 108870 109473 109409 108827 108215 108010
54972 108010 108156 108131 107634 107175 107616 109111 110876 112160 113035 113889 114523 114298 113145 111914 111542 112131 113041
54955 113041 113627 113686 113365 112976 112950 113615 114784 115622 115231 113505 111274 109549 108721 108576 108789 109166 109582 110072
54937 110072 110895 112156 113410 114079 114247 114565 115254 115816 116008 116484 117951 120188 122534 125067 128437 132668
54921 132668 137002 141134 145848 151964 159234 166757 174006 180847 186822 191196 193761 195002 195225 193959
54907 193959 190591 185305 179050 172716 166701 161152 156186 151728 147538 143595 140179 137370 134790 132167
54893 132167 129887 128538 128019 127624 126982 126420 126317 126594 127050 127763 128884 130409 132458 135368 139191 143420
54877 143420 147643 152166 157551 163742 170175 176588 183137 189642 195217 198830 200003 198948 196314 192853
54863 192853 189028 184808 179962 174473 168536 162327 156087 150309 145379 141083 136906 132861 129595 127559
54849 127559 126469 125676 124685 123087 120529 117194 114074 112267 112004 112603 113273 113699 113860 113620 112728 111133
54833 111133 109154 107315 106092 105833 106721 108561 110618 112020 112492 112471 112361 112013 111260 110522 110355 110543 110303
54816 110303 109376 108332 107678 107262 106788 106427 106584 107408 108840 110761 112824 114452 115346 115776 116079 116172 115860
54799 115860 115379 115207 115493 115998 116467 116781 116861 116737 116653 116812 117082 117153 116860 116245 115553 115357 116313 118353 120345
54780 120345 121129 120829 120664 121556 123423 125812 128528 131419 134163 136676 139362 142570 146179 150145 155086
54765 155086 161648 169339 176691 182828 188353 194344 200780 206499 210536 212926 214019 213521 210715 205496
54751 205496 198728 191530 184514 177866 171798 166505 161814 157253 152589 148086 144137 140846 138169 136308
54737 136308 135565 135733 135925 135334 134090 133075 132861 133130 133316 133462 134115 135548 137523 139866 142860 146956
54721 146956 152340 158910 166373 174163 181465 187578 192177 195195 196681 196880 196174 194662 191946 187646 181994
54706 181994 175714 169413 163377 157818 152924 148702 145056 142084 140018 138794 137914 136882 135626 134459
54692 134459 133771 133713 133912 133485 131723 128911 126223 124528 123573 122612 121617 121359 122272 123677 124439 124096 123059
54675 123059 121844 120589 119390 118665 118752 119305 119506 118979 118155 117545 116978 115914 114383 113182 113019 113737 114528
54658 114528 114770 114506 114183 114120 114238 114223 113984 113853 114268 115193 116003 116002 115016 113393 111698 110584 110724 112330 114621
54639 114621 116235 116564 116443 117093 118485 119309 118597 116813 115079 113844 112912 112407 112883 114393 116111 117196
54623 117196 117617 117848 118155 118543 119045 119605 119857 119515 118927 118820 119428 120235 120597 120326 119621 118812 118283 118299 118687
54604 118687 118922 118740 118439 118411 118526 118287 117451 116285 115265 114721 114737 115155 115652 115972 116161 116547 117506 119199
54586 119199 121419 123565 124954 125344 125100 124735 124447 124268 124397 124985 125626 125564 124539 123074 121769 120687 119666
54569 119666 118905 118814 119450 120445 121444 122283 122839 123036 122986 122873 122698 122429 122337 122796 123712 124535 124940 125144 125418 125658
54549 125658 125657 125434 125075 124614 124346 124888 126459 128382 129768 130564 131450 132800 134237 135198 135448 135012 134105 133300
54531 133300 133249 133947 134599 134465 133604 132523 131391 129941 128072 126269 125337 125741 127068 128185 128153 127080 125858
54514 125858 125035 124277 123132 121860 121144 121288 122136 123569 125485 127290 128035 127349 125927 124768 124181 123834
54498 123834 123554 123644 124311 125215 125859 126271 126942 128104 129407 130434 131250 132155 133091 133603 133367 132498 131337 130269
54480 130269 129663 129615 129635 128995 127599 126242 125795 126415 127728 129425 131326 133123 134536 135670 136855 138125
54464 138125 139167 139749 139975 140094 140301 140703 141237 141634 141691 141478 141053 140087 138212 135814 134006 133585 134183 134666
54446 134666 134122 132381 129865 127351 125710 125459 126379 127720 128846 129569 129936 129970 129796 129792 130261 130953 131208 130724
54428 130724 129926 129350 128895 128075 126963 126415 127131 128823 130574 131821 132766 133980 135860 138361 140999 143150
54412 143150 144516 145302 145843 146195 146197 145698 144530 142515 139931 137778 137100 137951 139392 140583 141500 142474 143486
54395 143486 144274 144926 145948 147679 149804 151537 152239 151866 150850 149616 148326 147113 146310 146221 146753 147498
54379 147498 148129 148542 148703 148666 148693 149013 149420 149444 148988 148546 148642 149354 150383 151351 151957 152264 152941 154770 157631
54360 157631 160340 161826 162171 162200 162462 163067 164180 166012 168417 171105 174252 178269 182882 186992 189706
54345 189706 191129 191925 192582 193310 194176 194872 194652 192997 190171 186827 183260 179513 175972 173209 171210 169337
54329 169337 167223 165256 163924 163111 162337 161421 160538 159818 159277 159051 159367 160181 161053 161415 160952 159804 158502
54312 158502 157594 157166 156790 155963 154529 152688 150860 149568 149082 148934 148191 146569 144935 144258 144417 144589 144512
54295 144512 144577 144822 144771 144476 144788 146134 147724 148540 148590 148553 148703 148904 149353 150467 152013 153084 153141 152591 152150
54276 152150 152004 151886 151680 151575 151641 151543 150855 149661 148624 148319 148662 149239 149979 151047 152174 152764 152866 153369
54258 153369 154858 156804 158331 159253 159859 160229 160490 161278 163074 165202 166329 165990 164970 164240 164139 164526
54242 164526 164970 164768 163510 161816 160865 161061 161739 162188 162199 161485 159526 156474 153479 151574 150724 150405 150544
54225 150544 151302 152404 153293 153715 153659 152977 151530 149609 147847 146863 147084 148583 150782 152679 153699 154090
54209 154090 154340 154593 154824 155077 155212 154910 154280 153903 153841 153280 151806 150376 150161 150914 151474 151548 151841 152484 152571
54190 152571 151607 150398 149928 150025 149791 148943 148149 148181 149152 150503 151508 151869 151895 152067 152495 152981 153478 154106 154732
54171 154732 155033 155039 155235 155891 156626 156892 156653 156373 156497 157087 157882 158531 158820 158695 158082 156867 155230 153778
54153 153778 152957 152504 151873 151120 150800 151026 151258 151228 151433 152304 153361 153706 153102 152082 151214 150747 150876 151827
54135 151827 153465 155174 156329 156866 157265 157965 158824 159225 158737 157604 156480 155785 155495 155487 155796 156472 157462 158677
54117 158677 159942 160884 161244 161364 161977 163334 164914 166229 167436 168791 169906 170135 169521 168743 168129 167284
54101 167284 165801 163971 162541 161985 162135 162400 162310 162016 162172 163140 164411 165135 165165 165129 165472 165952 166294 166804
54083 166804 167913 169467 170934 172126 173216 174202 174841 175192 175696 176596 177625 178482 179318 180557 182493 185210
54067 185210 188699 192806 197289 202093 207391 213166 218952 224240 228892 232892 235947 237732 238378 238230 237281
54052 237281 235352 232804 230439 228595 226879 225031 223463 222610 222281 222162 222593 224226 227119 230705 234600
54037 234600 238942 243918 249390 255124 261047 267218 273694 280431 287125 293246 298436 302890 307097 311273
54023 311273 315260 318773 321499 323145 323831 324331 325391 326794 327569 327192 326015 324416 322112 318709 314444
54008 314444 309879 305118 299843 294057 288366 283421 279339 275691 271955 267964 263998 260398 257097 253691
53994 253691 250036 246545 243720 241551 239587 237454 235073 232450 229594 226664 224028 222081 221014 220772
53980 220772 221072 221476 221557 221121 220341 219680 219649 220485 222026 223932 226012 228257 230597 232817 234756 236436 237826
53963 237826 238612 238384 237106 235284 233569 232213 230973 229631 228439 227850 227840 227885 227736 227862 228803 230394 232085
53946 232085 233813 235992 238705 241545 244396 247764 252075 257085 262325 267685 273193 278555 283362 287561
53932 287561 291358 294876 298251 301883 306193 311122 316156 320856 325196 329556 334563 340727 347985 355770
53918 355770 363794 372555 382820 394767 408007 422211 437252 452747 467935 482110 494874 505879
53906 505879 514565 520210 522190 520321 515185 508007 499948 491591 483274 475547 468774 462511 455896 448744
53892 448744 441679 435115 428665 421796 414546 407213 399731 391772 383292 374624 366088 357722 349354 340866
53878 340866 332531 325107 319264 314771 310507 305472 299612 293526 287710 282351 277537 273234 269188 265193
53864 265193 261439 258308 255841 253636 251279 248654 245859 243047 240460 238409 236993 235854 234359 232174
53850 232174 229722 227869 227002 226488 225262 222844 219557 215946 212460 209717 208444 208785 210060 211518 212959
53835 212959 214308 215100 214952 214263 213841 213983 214500 215460 217123 219118 220454 220627 220172 219852 219811 219861 220088 220667
53817 220667 221381 221838 221981 222053 222209 222531 223292 224768 226829 229067 231340 233962 237329 241635 246954 253309
53801 253309 260475 267875 274854 281115 286841 292321 297510 302129 306300 310788 316155 321742 326087 328550
53787 328550 329950 331315 332622 333324 333570 334048 334774 334934 333958 332023 329393 326019 322062 318058 314077 309331
53771 309331 303208 296344 290103 285192 281272 277692 274024 269996 265518 260948 256929 253719 250866 247702
53757 247702 244059 240446 237546 235508 233682 231235 228058 224932 222638 221122 219732 218083 216389 215071
53743 215071 214353 214203 214399 214654 214811 214847 214630 213916 212854 212158 212387 213226 213970 214544 215499 217002 218479 219405
53725 219405 219915 220356 220736 220980 221334 222026 222777 223170 223431 224341 226235 228451 230021 230796 231586 233164 235396
53708 235396 237526 239134 240441 241688 242736 243572 244733 246683 249047 251126 253071 255785 259570 263594
53694 263594 267006 269944 272951 275958 278513 280676 282929 285234 286858 287260 286747 286070 285663 285425 284994 284111
53678 284111 282854 281548 280301 278705 276320 273491 271302 270466 270489 270238 269220 267973 267234 267087 267121 267057 266883
53661 266883 266555 266020 265560 265668 266406 267275 267971 268830 270144 271377 271650 270838 269629 268579 267754 267325 267767
53644 267767 269159 270809 271918 272277 272096 271650 271369 271804 273015 274384 275468 276719 278862 281823 284797
53629 284797 287210 289086 290591 291716 292490 293124 293882 295013 296680 298652 300292 301304 302401 304692 308380
53614 308380 312516 316143 319292 322703 326929 331907 337105 341883 345870 349224 352500 356165 360236 364321
53600 364321 367964 371073 374127 377772 382049 386177 389338 391484 393086 394322 394916 394647 393548 391609 388752
53585 388752 385256 381800 378882 376398 373933 371237 368373 365631 363390 361889 361032 360496 359987 359299 358272
53570 358272 356966 355757 354955 354481 354195 354352 355233 356441 357152 357144 357010 357208 357453 357377 357297 357927 359600 362029
53552 362029 364596 366595 367508 367429 367125 367417 368550 370310 372528 375238 378448 382004 385695 389418 393244
53537 393244 397286 401470 405581 409717 414519 420560 427583 434810 441997 449653 458154 467247 476684 486705
53523 486705 497447 508363 518847 529172 540245 552574 565937 580000 594749 610296 626671
53512 626671 643929 662174 681400 701439 722115 743258 764612 785917 807143 828495 850153
53501 850153 872045 893881 915321 936174 956521 976635 996729 1016771 1036464 1055336 1073059
53490 1073059 1089931 1106968 1125078 1144116 1163073 1181275 1198985 1216701 1234379 1251687 1268659
53479 1268659 1285644 1302757 1319714 1336073 1351408 1365432 1378158 1389744 1399961 1408032 1413188 1415155
53467 1415155 1413924 1409549 1402573 1394233 1385657 1376960 1367538 1357083 1345860 1334172 1322021 1309234 1295479
53454 1295479 1280340 1263817 1246639 1229522 1212272 1194193 1175307 1156474 1138288 1120559 1103139
53443 1103139 1086542 1071373 1057653 1045129 1033847 1024001 1015570 1008571 1003369 1000185 998432 997062 995593
53430 995593 994416 994012 994283 994908 996071 998482 1002617 1008200 1014632 1021821 1030330 1040627 1052452 1065154
53416 1065154 1078458 1092680 1108283 1125541 1144600 1165487 1187945 1211516 1235953 1261464 1288431
53405 1288431 1317043 1347256 1378970 1412161 1446918 1483453 1521975 1562566 1605144 1649492 1695248
53394 1695248 1742036 1789796 1838855 1889366 1940763 1992138 2043158 2094178 2145301 2195747 2244508
53383 2244508 2291369 2336863 2381211 2423667 2463072 2498914 2531713 2562321 2590925 2616732 2638612
53372 2638612 2655914 2668665 2677105 2681207 2680559 2674602 2662999 2645895 2623716 2596664 2564600 2527719
53360 2527719 2487206 2444864 2402029 2359009 2315534 2271481 2227190 2183355 2140683 2099419 2059191
53349 2059191 2019563 1980753 1943517 1908210 1874194 1840242 1805341 1769153 1732090 1695189 1659631
53338 1659631 1626133 1594791 1565453 1538012 1512405 1488631 1466833 1446980 1428426 1410265 1392316
53327 1392316 1375331 1359878 1345396 1330736 1315304 1299254 1282852 1266232 1249715 1233814 1218768
53316 1218768 1204391 1190483 1177190 1164930 1154234 1145660 1139516 1135474 1132621 1130089 1127660 1125786 1125169
53303 1125169 1126294 1129205 1133655 1139479 1146803 1155815 1166466 1178593 1192280 1207842 1225412 1244752
53291 1244752 1265576 1287851 1311579 1336378 1361461 1386090 1409948 1433028 1455242 1476220 1495436
53280 1495436 1512434 1526911 1538760 1548207 1555776 1561836 1566086 1567680 1566012 1561256 1554009 1544581 1532823
53267 1532823 1518603 1502199 1484175 1465014 1444938 1424019 1402395 1380333 1358091 1335733 1313140
53256 1313140 1290239 1267121 1243912 1220641 1197335 1174166 1151393 1129166 1107421 1085921 1064330
53245 1064330 1042342 1019963 997676 976147 955577 935401 914835 893799 873142 853794 835797
53234 835797 818454 801406 785177 770498 757423 745440 734174 723537 713345 703338 693593 684394
53222 684394 675472 665859 654779 642358 629115 615092 599902 583516 566616 550149 534769 520672
53210 520672 507715 495632 484248 473549 463543 454170 445400 437258 429696 422565 415701 408782 401105
53197 401105 392002 381750 371646 362774 354975 347451 340045 333318 327506 322190 317086 312521 308795 305556
53183 305556 302247 298830 295640 292654 289432 285874 282631 280477 279337 278250 276442 274224 272568 271875
53169 271875 271582 271061 270353 269629 268426 266177 263374 261381 260833 260842 260173 258763 257581 257292 257561 257619 257101 256220
53151 256220 255389 254747 254036 252955 251668 250782 250694 251119 251452 251430 251216 250981 250701 250347 249995 249713 249537 249610 250122
53132 250122 251061 252075 252641 252355 251156 249472 248050 247373 247215 246975 246467 246094 246191 246528 246721 246858 247382 248472
53114 248472 249855 251205 252352 253089 253155 252630 252064 251954 252212 252438 252530 252688 252815 252326 250793 248543 246360
53097 246360 244651 243144 241403 239436 237736 236812 236752 237184 237644 237973 238358 238950 239542 239782 239701 239816 240587 241850
53079 241850 242988 243596 243744 243569 242894 241578 240054 239177 239361 240126 240656 240587 240048 239169 237918 236449 235189
53062 235189 234431 234069 233873 233780 233731 233449 232704 231705 230926 230507 230182 229842 229829 230415 231221 231568 231420 231594 232832
53043 232832 234883 236780 237882 238325 238433 238078 236891 234920 232815 231347 230873 231174 231674 231909 231963 232418 233703
53026 233703 235549 237243 238303 238686 238467 237693 236607 235671 235242 235406 236185 237584 239366 241051 242333 243267
53010 243267 243990 244490 244776 244904 244708 243892 242672 241942 242415 243836 245399 246726 247942 249012 249572 249541 249434
52993 249434 249880 251057 252670 254237 255362 255907 256028 255949 255766 255600 255821 256792 258444 260294 261888 263002
52977 263002 263562 263724 264018 265069 266995 269301 271400 273062 274428 275837 277611 279698 281530 282553 282895
52962 282895 283162 283578 283765 283437 282811 282152 281344 280223 278922 277609 276198 274674 273392 272612 271971 270860
52946 270860 269228 267591 266397 265775 265815 266490 267194 266873 265012 262273 259885 258481 257781 257234 256688 256361 256413
52929 256413 256700 256917 256858 256548 256230 256180 256439 256731 256791 256822 257398 258713 260089 260533 259750 258373 257164 256297 255513
52910 255513 254645 253813 253275 253317 254089 255293 256181 256168 255441 254722 254407 254196 253689 253123 253180 254072 255115 255479 255208
52891 255208 255125 255668 256296 256367 256221 256770 258149 259446 259856 259475 258684 257433 255686 254057 253253 253098 252809 252231
52873 252231 252083 252851 254028 254793 255037 255324 256104 257305 258544 259490 260085 260605 261451 262722 264111 265309 266389
52856 266389 267590 268898 270031 270709 270718 269877 268256 266315 264416 262201 258914 254505 249986 246393 243710
52841 243710 241217 238612 236286 234585 233374 232444 231880 231753 231786 231612 231148 230490 229683 228861 228401 228605 229275
52824 229275 229956 230488 231053 231671 232013 231833 231375 231142 231362 231767 231871 231401 230527 229700 229342 229694 230836 232599
52806 232599 234484 236032 237390 239184 241583 243822 244982 244943 244161 242765 240515 237529 234471 231851 229627
52791 229627 227576 225658 223914 222398 221305 220759 220420 219751 218836 218467 219236 220930 222953 224837 226121 226328
52775 226328 225515 224516 224199 224712 225740 227085 228568 229718 230122 229968 229828 230009 230429 230947 231413 231550 231205
52758 231205 230636 230195 229793 229011 227689 226152 224924 224449 224894 225868 226485 226107 225024 224169 224287 225582 227872
52741 227872 230679 233306 235294 236836 238448 240349 242455 244741 247157 249360 251003 252236 253385 254293
52727 254293 254610 254694 255553 257634 260230 262327 263563 264115 264138 263671 262770 261393 259390 256879 254383 252310
52711 252310 250517 248631 246562 244442 242307 240246 238783 238657 239998 241916 243177 243350 243189 243751 245195
52696 245195 246664 247403 247649 248142 249026 249708 249750 249443 249372 249734 250255 250569 250586 250606 251064 251974 252733 252737 252132 251604
52676 251604 251501 251545 251408 251072 250558 249777 248831 248073 247582 246974 246014 245083 244726 244964 245395 245885 246838 248736 251488
52657 251488 254274 256119 256826 257251 258402 260369 262527 264659 267190 270171 272673 273653 273025 271467 269574
52642 269574 267664 266091 265103 264370 263201 261367 259480 258422 258528 259321 259983 260098 259981 260241 261112 262369
52626 262369 263783 265225 266351 266727 266513 266527 267236 268096 268266 267662 266791 265862 264680 263330 262387 262279 262837
52609 262837 263581 264167 264455 264390 263952 263170 262171 261309 261101 261856 263382 265136 266601 267476 267746 267718 267828 268268
52591 268268 268916 269631 270338 270714 270296 269211 268386 268669 269973 271685 273498 275341 276824 277463 277357 277038 276677
52574 276677 276075 275419 275379 276201 277271 277891 278105 278411 278901 279017 278085 275993 273408 271324 270175 269397 268042
52557 268042 265811 263262 261121 259689 258889 258494 258178 257696 257189 257081 257579 258450 259346 260134 260851 261532 262123
52540 262123 262351 261770 260207 258171 256536 255802 255914 256691 257988 259481 260755 261755 262699 263465 263559 262911 262193
52523 262193 262022 262289 262664 263313 264601 266329 267892 269118 270441 272170 274118 276111 278484 281700 285584
52508 285584 289188 291477 292096 291529 290649 290116 290006 289807 288782 286598 283735 281146 279332 277902 276172 274032
52492 274032 271935 270208 268737 267386 266355 265997 266431 267370 268241 268582 268543 268837 269862 271046 271515 271332 271435
52475 271435 272299 273318 273828 274115 274943 276518 278403 280195 281807 283307 284895 286839 289052 290885 291815
52460 291815 292246 293154 294914 296845 297906 297547 295865 293332 290536 287943 285706 283726 281875 280070 278198
52445 278198 276202 274215 272504 271251 270464 270047 269857 269825 270066 270684 271346 271335 270329 268888 267794 267046 265992
52428 265992 264446 263167 263016 264027 265533 266979 268296 269585 270759 271569 271859 271710 271385 271137 271079 271163 271289
52411 271289 271500 272194 274052 277533 282365 287756 293217 298972 305403 312303 318915 324518 328707 331278 332301
52396 332301 332242 331588 330211 327468 323127 317947 313088 309135 305910 303090 300648 298644 296926 295339 294130
52381 294130 293819 294554 295864 297237 298747 300785 303307 305829 308218 310987 314595 318876 323443 328233 333293
52366 333293 338430 343530 348860 354376 358976 361229 360937 359377 357903 356939 356463 356715 357904 359653 361284
52351 361284 362444 363186 363688 364268 365384 367242 369517 371787 374065 376632 379528 382631 386124 390461 395804
52336 395804 401814 408056 414425 421166 428652 437173 446782 457338 468794 481278 494765 508937 523673
52323 523673 539519 557177 576571 596856 617433 638523 660480 682906 704833 725690 745873
52312 745873 766305 787559 809355 830892 851692 872105 892835 914036 935129 955512 975150
52301 975150 994306 1012941 1030594 1046713 1060977 1073456 1084569 1094636 1103241 1109264 1111790 1110903
52289 1110903 1107345 1101713 1094319 1085640 1076393 1067161 1058278 1050022 1042466 1035175 1027603 1020043 1013745 1009874
52275 1009874 1008607 1009398 1011699 1015161 1019574 1025062 1032123 1041064 1051575 1063171 1075842 1089784 1104682
52262 1104682 1119782 1134740 1149889 1165582 1181661 1197765 1213797 1229822 1245707 1261109 1275760
52251 1275760 1289599 1302615 1314580 1324942 1333067 1338721 1342206 1343897 1343756 1341500 1337097 1330754 1322502
52238 1322502 1312168 1299870 1286217 1271951 1257610 1243560 1230031 1216972 1204134 1191406 1178906
52227 1178906 1166770 1155141 1144320 1134613 1125952 1118045 1110945 1105028 1100343 1096485 1093330 1091368 1090997
52214 1090997 1091915 1093500 1095363 1097217 1098794 1100454 1103344 1108148 1113971 1119226 1123505 1127782 1132811 1138201
52200 1138201 1143285 1148130 1153185 1158492 1163751 1168861 1173932 1178974 1184048 1189612 1196199 1203620 1210818 1216760
52186 1216760 1221328 1225084 1228175 1229832 1229160 1226190 1221700 1216108 1209125 1200676 1191536 1182541 1173625 1164270
52172 1164270 1154660 1145703 1137926 1131020 1124584 1118710 1113676 1109606 1106709 1105405 1105865 1107691 1110304 1113350
52158 1113350 1116541 1119425 1121630 1123105 1123916 1124071 1123758 1123445 1123405 1123390 1123086 1122722 1122857 1123717 1125098 1126808 1128836
52141 1128836 1131071 1133188 1134931 1136299 1137406 1138331 1139174 1140137 1141510 1143686 1147144 1152270 1159211 1168022 1178936
52126 1178936 1192352 1208509 1227304 1248476 1271857 1297362 1324772 1353636 1383409 1413640 1444029
52115 1444029 1474344 1504426 1534250 1563756 1592446 1619287 1643314 1664386 1683146 1700185 1715437
52104 1715437 1728519 1739428 1748745 1757196 1765173 1772607 1779206 1784765 1789203 1792208 1792929 1790319 1783975 1774541
52090 1774541 1763110 1750275 1735849 1719425 1701040 1681245 1660686 1639778 1618867 1598683 1580455
52079 1580455 1565372 1553828 1545209 1538512 1533213 1529636 1528525 1530220 1534274 1539967 1547203 1556642 1568827
52066 1568827 1583416 1599436 1616105 1633162 1650586 1668359 1686415 1704470 1721890 1738039 1752747
52055 1752747 1766171 1778231 1788524 1796782 1803106 1807668 1810463 1811269 1809594 1804744 1796404 1785159 1772019
52042 1772019 1757332 1740594 1721382 1700022 1677243 1653680 1629861 1606157 1582523 1558741 1535202
52031 1535202 1512930 1492499 1473417 1454971 1437189 1420526 1404995 1390191 1375824 1361683 1347328
52020 1347328 1332449 1317454 1303145 1289837 1277126 1264508 1251868 1239435 1227523 1216225 1205159
52009 1205159 1193724 1181806 1169802 1157582 1143942 1127807 1109653 1090967 1072396 1053230 1032733
51998 1032733 1011146 989129 967019 945079 923974 904393 886415 869686 854037 839579 826217
51987 826217 813411 800530 787328 773970 760607 747064 733090 718887 705073 691958 679106
51976 679106 665850 652043 638069 624408 611533 600040 590347 582394 576026 571625 569799 570413 572387
51963 572387 574678 577150 580320 584516 589410 594228 598300 601489 604017 605848 606480 605544 603263 599983 595618
51948 595618 590209 584801 581005 579573 579970 581453 584005 588054 593795 601085 609615 619004 628993 639606
51934 639606 650761 661759 671617 679949 686926 692292 695069 694503 690728 684158 674811 662684 648418
51921 648418 633097 617564 602224 587252 572787 559158 547120 537524 530538 525547 522067 520358
51909 520358 520916 523802 528820 535930 545088 555995 568373 582109 596655 610529 621889 629523 633086
51896 633086 632684 628634 621390 611273 598408 583232 566869 550643 535285 520845 507174 494289
51884 494289 482554 472742 465630 461277 459005 458277 459207 461964 466205 471526 477911 485148 492253 498240
51870 498240 503195 507906 512617 516771 519796 521372 521060 518516 514212 509361 504950 501270 498306 496014
51856 496014 494145 492445 491198 491062 492161 493767 495050 495762 496037 495869 494934 492648 488451 482418 475586
51841 475586 469293 464087 459569 455215 450870 446535 442283 438540 435935 434663 434331 434546 435230 436280 437379
51826 437379 438291 438926 439056 438350 436786 434647 432116 429357 426952 425583 425137 424806 424192 423657 423400 423032 422450
51809 422450 422322 423104 424217 424814 424828 424674 424418 423917 423325 422736 421753 420196 418874 418770 419620 420140 419632 418534
51791 418534 417368 415986 414122 411991 409995 408289 406846 405622 404519 403513 402857 402725 402626 401759 400056
51776 400056 398367 397435 397197 397331 397924 399206 401143 403783 407625 413103 419882 427204 434821 443116 452242
51761 452242 461549 469950 476618 481274 483945 484567 482846 478646 472559 465810 459305 452983 446410 439883
51747 439883 434402 430513 427610 424684 421468 418528 416392 414954 413805 412903 412734 413881 416571 420593 425575
51732 425575 431267 437631 444681 452118 459031 464160 466774 467406 467482 468071 469175 470334 471505 472900 474152
51717 474152 474233 472450 469165 465345 461646 458100 454380 450096 445052 439576 434452 430244 426840 423925 421733
51702 421733 420877 421485 422926 424472 425806 426756 426984 426313 425106 423972 423142 422349 421241 419685 417739 415587
51686 415587 413530 411918 410911 410229 409119 406795 403202 399300 396282 394464 393274 392365 392242 393525 396024
51671 396024 399021 402172 405575 409053 412019 414306 416788 420846 427203 435265 443527 450652 456159 460118
51657 460118 462360 462369 460056 456200 451858 447723 444372 442632 443058 445216 448062 450959 453841 456506 458363
51642 458363 458898 457875 455117 450616 444884 438595 431889 424592 417118 410363 404594 399240 394078 389815
51628 389815 387026 385232 383631 382124 381062 380518 380533 381546 383733 386163 387423 387039 385684 384115 382599
51613 382599 381267 380301 379601 378851 378082 377661 377639 377568 377138 376644 376634 377467 379287 382117 385706 389526 393107 396357
51595 396357 399625 403575 408899 415795 423694 431648 438856 444692 448526 449999 449377 447220 443834 439472
51581 439472 434909 431172 428630 426942 426067 426805 430074 436062 444260 453957 464576 475964 488569 502923
51567 502923 518784 535238 551890 569472 588889 610050 632016 654012 676050 698889 723723
51556 723723 751413 781496 812088 841128 867387 889941 907255 917619 920404 916080 905075 887380
51544 887380 863504 835088 804099 771783 738771 705864 674173 644548 617137 591636 567939
51533 567939 546571 528404 513725 501675 490908 480806 471665 463674 456310 449136 442719 438084 435370
51520 435370 433557 431560 429086 426332 423375 420288 417517 415645 414800 414591 414613 414722 414828 414754 414526 414564 415291
51503 415291 416624 418053 419204 420099 420825 421177 420821 419730 418251 416733 415199 413442 411374 409191 407198
51488 407198 405527 404017 402404 400596 398778 397144 395586 393732 391359 388639 385880 383189 380562 378153
51474 378153 376132 374253 371941 369004 365995 363581 361727 359756 357047 353385 348846 343864 339395 336466
51460 336466 335325 335264 335456 335680 336133 336897 337880 339060 340504 342265 344441 347188 350529 354345 358649 363625
51444 363625 369313 375636 382870 391611 401875 412611 422516 431065 438386 444592 449743 454043 457343 458778
51430 458778 457692 454759 451318 447655 442926 436804 430155 423708 417064 409672 402016 395075 389125 383803
51416 383803 378954 374792 371553 369600 369490 371285 374042 376693 379199 382205 385754 389180 392239 395467
51402 395467 399208 403024 406411 409534 412857 416455 420138 423945 428078 432468 436706 440457 443860 447602
51388 447602 452599 459506 468467 479466 492777 508816 527681 549218 573604 601507 633548 669906
51376 669906 710399 754440 800652 846949 891331 932347 968583 998180 1019412 1031516 1034459 1028062
51364 1028062 1012037 986995 954856 917917 877790 835448 791959 748686 706837 667223 630532
51353 630532 597454 568236 542310 518801 497493 479020 463923 451755 441390 432032 423550 415893
51341 415893 408706 401799 395653 391073 388326 386839 385667 384114 381935 379203 376118 372893 369727 366806
51327 366806 364216 361850 359566 357445 355738 354480 353380 352230 351174 350342 349471 348288 347140 346758 347340
51312 347340 348280 348969 349456 350137 351134 352294 353567 355033 356696 358515 360532 362713 364775 366484 368004
51297 368004 369650 371349 372673 373381 373558 373255 372380 371000 369332 367252 364342 360704 357354 355319 354603
51282 354603 354441 354417 354861 356205 358466 361400 364709 367928 370477 372116 373155 374010 374701 374971 374775 374413
51266 374413 374218 374321 374780 375810 377645 380070 382246 383374 383613 384008 385213 386565 386890 385974 384675 383618
51250 383618 382487 380807 378762 376724 374449 371376 367557 363779 360797 358880 358041 358192 358945 359647 359889
51235 359889 359787 359662 359608 359480 359112 358377 357171 355491 353521 351531 349720 348187 347052 346474 346503 346935 347382
51218 347382 347538 347388 347151 347123 347681 349264 352052 355586 359013 361904 364658 367899 371609 375137 378002 380476
51202 380476 383306 386949 391080 394801 397412 399066 400564 402440 404379 405587 405556 404265 401890 398703 395255
51187 395255 392212 389809 387579 384858 381622 378797 377571 378222 379618 380145 379208 377613 376409 375755 375182
51172 375182 374586 374383 374786 375432 375819 375741 375320 374931 375175 376459 378503 380546 382231 383987 386377 389328 392239
51155 392239 394625 396409 397668 398366 398341 397508 396110 394785 394197 394468 395038 395155 394499 393335 392215 391599 391633
51138 391633 392133 392686 392810 392122 390578 388603 386838 385582 384577 383435 382123 380922 380124 379981 380643 381841
51122 381841 382858 383237 383316 383704 384488 385485 387050 389794 393491 397047 399803 402146 404596 407053 409392 412013
51106 412013 415112 418029 420225 422533 426459 432183 438137 442774 446089 449070 452194 454983 456785 457457
51092 457457 457268 456447 455061 453271 451443 449816 448125 445904 443239 440930 439627 439016 438229 436957 435801
51077 435801 435471 435955 436622 436979 437115 437430 438109 439000 439978 441204 442905 445004 447272 449832 453230 458008
51061 458008 464455 472696 482600 493456 504217 514379 524349 534684 545268 555499 565019 573998 583022
51048 583022 593032 604968 618951 633875 648111 660496 670466 677727 682351 684875 685673 684342 680293
51035 680293 673848 666160 658051 649474 640125 629943 618889 606791 593716 580179 566813 554138
51023 554138 542718 533178 525930 521091 518686 518547 520100 522773 526662 532283 539535 547441 555155 562788
51009 562788 570990 580089 589851 599695 608956 617345 625405 634069 643521 652910 661510 669733 678594 688548
50995 688548 699228 709988 720239 729543 737916 745925 754122 762457 770575 778438 786305 794273 802329
50982 802329 810763 820118 830699 842454 855274 869131 883939 899620 916320 934367 954064 975718
50970 975718 999744 1026616 1056906 1091547 1131620 1177449 1228205 1282945 1341752 1405159 1472682
50959 1472682 1542903 1615109 1689815 1766975 1844433 1918962 1988613 2053279 2113118 2167316 2214702
50948 2214702 2254982 2288787 2316663 2338499 2354083 2363953 2369511 2372303 2373307 2372914 2371362 2368949 2365769
50935 2365769 2361360 2354805 2345223 2332153 2315524 2295433 2272032 2245544 2216052 2183247 2146550 2105628
50923 2105628 2060568 2011397 1957843 1899987 1838911 1776122 1712326 1647484 1582169 1518152 1457202
50912 1457202 1399914 1346239 1296570 1251454 1210568 1172918 1138119 1106703 1079025 1054595 1032727
50901 1032727 1013150 995576 979276 963686 949107 936264 925347 915918 907597 900351 894205 889141
50889 889141 885362 883215 882631 882954 883500 884102 884967 886212 887839 890062 893339 897953 903710 910210 917332
50874 917332 925324 934456 944781 956231 968731 982125 996187 1010957 1026997 1045095 1065684 1088715
50862 1088715 1114108 1142124 1173247 1207934 1246605 1289780 1338063 1392054 1452429 1520026 1595701
50851 1595701 1679999 1773089 1875088 1986380 2107471 2238500 2379011 2528191 2685150 2848718
50841 2848718 3017150 3188307 3360118 3530560 3697127 3856631 4005643 4140875 4259141
50832 4259141 4357627 4434769 4490712 4526506 4543131 4541848 4525335 4497788 4463615 4426306 4388548
50821 4388548 4352821 4321399 4295822 4276475 4262496 4251998 4242547 4231534 4216022 4192544 4157531
50810 4157531 4108254 4043277 3962155 3865107 3752995 3627208 3489439 3341889 3187706 3030658
50800 3030658 2874057 2720210 2570996 2428389 2294129 2169299 2054717 1951359 1859891 1779917
50790 1779917 1710174 1649382 1596667 1551371 1512938 1481007 1455217 1434849 1418798 1405848 1394863
50779 1394863 1384926 1375632 1367122 1359471 1352131 1344211 1335254 1325504 1315522 1305760 1296272 1286477 1275347 1262313
50765 1262313 1247925 1233229 1218544 1203313 1187179 1170691 1154753 1139864 1126147 1113723 1102696
50754 1102696 1092998 1084654 1078150 1074272 1073551 1076016 1081451 1089698 1100661 1114148 1129960 1148263 1169814
50741 1169814 1195619 1226276 1261795 1302071 1347317 1397885 1453980 1515798 1583681 1657692 1737085
50730 1737085 1820538 1906881 1995331 2085153 2175474 2265426 2354161 2440776 2524503 2604843 2681034
50719 2681034 2751460 2814049 2867238 2909973 2940892 2958404 2961971 2952680 2932175 2901689 2862760 2818365
50707 2818365 2772492 2728616 2689029 2655292 2628480 2608759 2595319 2586931 2582332 2579982 2577881 2573824
50695 2573824 2565666 2551240 2528348 2495102 2450337 2393841 2326439 2249943 2166732 2079223 1989731
50684 1989731 1900685 1814544 1733225 1657786 1588882 1527401 1474362 1430188 1394395 1366148 1344984
50673 1344984 1330714 1322771 1320098 1321875 1327963 1338231 1351667 1366631 1382011 1397679 1413699 1429572
50661 1429572 1444507 1458056 1470159 1480861 1490369 1499204 1508008 1517277 1527468 1539036 1552012 1565747
50649 1565747 1579539 1593495 1608503 1625456 1644831 1666903 1691918 1720053 1751572 1786963 1826457
50638 1826457 1869353 1914265 1960223 2007207 2055454 2104627 2153915 2202600 2250126 2295817 2339057
50627 2339057 2379856 2418861 2456442 2491681 2522408 2546303 2561891 2568442 2565348 2552340 2530609 2503168
50615 2503168 2473542 2444170 2416366 2391372 2370633 2354908 2343664 2335528 2328979 2322564 2314948 2304962
50603 2304962 2291320 2272347 2246566 2213678 2174380 2129005 2077053 2018446 1954613 1887754 1819521
50592 1819521 1751083 1683978 1619954 1559956 1504077 1452534 1406051 1365057 1329099 1297263 1268753
50581 1268753 1242822 1218625 1195610 1173940 1154275 1137218 1122951 1111154 1101079 1092019 1083965 1077794
50569 1077794 1074670 1075269 1079472 1086491 1095237 1104948 1115765 1128492 1143581 1160528 1178495 1197325 1217619
50556 1217619 1239952 1264380 1290663 1318483 1347232 1375905 1403554 1429821 1454836 1478615 1500786
50545 1500786 1520989 1539399 1556766 1573947 1591586 1610252 1630776 1654206 1681436 1713007 1749385
50534 1749385 1791199 1838977 1892695 1951879 2016308 2086387 2162591 2244664 2331710 2423134 2519174
50523 2519174 2620205 2725620 2833620 2942090 3049401 3154258 3255107 3349917 3436444 3512394
50513 3512394 3575389 3623250 3654645 3669358 3667724 3649938 3616276 3568002 3507594 3437770 3360637
50502 3360637 3278231 3193753 3111512 3035332 2967369 2908745 2860851 2825413 2803423 2794611 2797931 2811921
50490 2811921 2834379 2862180 2891773 2919536 2941527 2953524 2952023 2935122 2902096 2852459 2786143
50479 2786143 2704575 2610911 2508841 2401453 2291217 2180473 2071485 1966257 1866611 1774171
50469 1774171 1689925 1613869 1545412 1483983 1429102 1380135 1336481 1298037 1265034 1237350 1214368
50458 1214368 1195660 1181429 1171980 1167046 1165919 1168020 1172965 1180233 1189210 1199626 1211577 1225042 1239735
50445 1239735 1255420 1271997 1289127 1306189 1322870 1339385 1355780 1371362 1385234 1397124 1407209
50434 1407209 1415376 1421321 1425231 1427720 1429023 1428940 1427748 1426537 1426340 1427444 1429842 1433773 1439389 1446453 1454909
50419 1454909 1465415 1478743 1495034 1514185 1536586 1562685 1592101 1624060 1658659 1696743 1738365
50408 1738365 1782209 1826995 1872671 1919679 1967557 2014925 2060524 2103643 2143711 2180025 2211861
50397 2211861 2238393 2258467 2270857 2274758 2269731 2255162 2230266 2194932 2150379 2098775 2042315 1982770
50385 1982770 1921781 1861244 1803244 1749627 1701716 1660368 1626185 1599593 1580800 1569756 1566115
50374 1566115 1569102 1577417 1589332 1602943 1616298 1627409 1634363 1635578 1630047 1617390 1597677 1571173
50362 1571173 1538278 1499840 1457409 1412770 1366965 1320111 1272463 1225377 1180690 1139279 1100746
50351 1100746 1064524 1030715 999704 971556 946168 923633 904074 887412 873625 863084 856244
50340 856244 853047 852862 854985 859115 865437 874294 885612 898612 912405 926951 943022 961015 980072
50327 980072 998600 1015223 1028985 1039215 1045909 1049982 1052508 1053796 1053806 1053282 1053607 1055276 1057211 1057989
50313 1057989 1057364 1056127 1054853 1053364 1051373 1049144 1047272 1045943 1044634 1042641 1039924 1037373 1036118 1036638
50299 1036638 1038568 1041250 1044267 1047555 1051335 1056068 1062255 1070090 1079357 1089716 1100958 1112987 1125736
50286 1125736 1139301 1154051 1170372 1188148 1206394 1223421 1237376 1246796 1250777 1248938 1241494 1229417
50274 1229417 1214216 1197357 1179975 1163203 1148393 1136605 1127902 1121443 1116302 1112022 1108436 1105248
50262 1105248 1101883 1097673 1092253 1085903 1079467 1073759 1069074 1065286 1062174 1059415 1056630 1053811 1051571 1050558
50248 1050558 1050787 1051946 1054236 1058317 1064455 1072377 1082024 1093863 1108183 1124590 1142459 1161437 1181237
50235 1181237 1201435 1221815 1242438 1262970 1282340 1299524 1314361 1327199 1338081 1346791 1353293 1357425
50223 1357425 1358323 1354871 1346802 1334738 1319072 1299431 1275573 1248384 1219613 1190865 1163133 1137092
50211 1137092 1113417 1092675 1075041 1060172 1047394 1035974 1025164 1014040 1001549 986959 970219
50200 970219 951767 932179 912201 892899 875302 859767 845898 833156 821327 810406 800283
50189 800283 790634 781011 771028 760697 750597 741491 733679 726854 720559 714520 708546 702454 696224 690000
50175 690000 683780 677335 670575 663766 657257 651218 645845 641539 638594 636765 635398 633966 632369 630873
50161 630873 629946 629994 630987 632401 633761 635259 637582 641202 646073 652027 659067 667070 675444 683390 690424
50146 690424 696451 701385 705074 707644 709579 711185 712195 712283 711937 712345 714247 717304 721007 725834 732932
50131 732932 742694 754371 767283 781851 798999 818936 841092 865021 890868 919012 949793 983524
50119 983524 1020173 1058851 1098137 1137194 1176225 1215624 1255145 1294250 1332840 1370994 1408065
50108 1408065 1442549 1472889 1498057 1517360 1530184 1536084 1534790 1526007 1509557 1485952 1456506 1422626
50096 1422626 1385264 1345377 1304622 1265019 1227925 1193725 1162611 1135204 1112081 1092988 1076915
50085 1076915 1062994 1050998 1040914 1032444 1025236 1019505 1015900 1014598 1014760 1015210 1015471 1015803 1016366 1016857 1017119
50070 1017119 1017565 1018515 1019382 1019041 1017051 1014084 1011025 1007901 1003897 998218 990770 982142 973138 964310 955735
50055 955735 947168 938451 929904 922310 916448 912466 909700 907207 904538 902004 900247 899807 901080 904347
50041 904347 909539 916171 923833 932651 942937 954397 966004 976789 986579 995869 1005120 1014267 1022824
50028 1022824 1030485 1037579 1044701 1051759 1057634 1061119 1062023 1060949 1058255 1053836 1047910 1041290 1034566 1027520
50014 1027520 1019651 1010881 1001463 991695 982153 973816 967453 963088 960471 959791 961507 965690 972145 981151
50000 981151 993495 1009659 1029349 1051935 1076907 1103707 1131388 1158717 1184662 1208708 1230793
49989 1230793 1250877 1268461 1282526 1291964 1295965 1293892 1285070 1269021 1245915 1216586 1182147 1143761
49977 1143761 1102703 1060419 1018462 978353 941212 907341 876429 848444 824020 803557 786244
49966 786244 770555 755704 742072 730223 720023 710925 702629 695229 689027 684465 681995 681820 683759
49953 683759 687315 691666 695860 699511 703397 708858 716432 725334 734303 742523 749679 755701 760726 764852
49939 764852 767643 768341 766889 764260 761256 757278 750913 741564 730047 717608 704853 691737 678179
49926 678179 664527 651539 640021 630402 622615 616361 611387 607457 604306 601777 599891 598700 598209 598463
49912 598463 599480 601009 602665 604422 606702 609860 613901 618893 625149 632724 641145 650029 659559 669918
49898 669918 680656 691230 701789 712724 723599 733276 741053 746931 750741 751850 750079 746232 741257
49885 741257 735280 727833 718708 708253 697094 685852 674872 663934 652503 640571 629032 618895
49873 618895 610358 602971 596452 590861 586077 581695 577643 574556 573237 573846 575832 578562 581787 585519
49859 585519 589739 594513 600249 607437 616029 625361 634961 645158 656567 669090 681835 693947 705063
49846 705063 714880 722764 728139 731064 732142 731927 730507 727559 722708 715976 707941 699325 690430 681139
49832 681139 671483 661899 652868 644623 637378 631550 627530 625435 625221 626765 629624 633078 636797 641244
49818 641244 647061 654177 661890 669680 677594 685886 694646 703752 712844 721287 728488 734313 739043 742896
49804 742896 745784 747516 747992 747257 745560 743308 740612 736895 731310 723663 714712 705493 696546 687736 678495
49789 678495 668273 657169 646250 636902 629613 623703 618358 613528 609558 606391 603640 601248 599596
49776 599596 598943 599092 599641 600341 601291 602956 605892 610156 615081 619972 624974 630923 638286 646542 654687
49761 654687 662037 668438 673952 678577 682176 684600 685896 686327 685972 684379 680891 675321 668039 659474 650039
49746 650039 640643 632615 626561 621653 616607 611197 606270 602441 599416 596750 594586 593324 592979 593328 594414
49731 594414 596428 599191 602173 605101 608216 611815 615761 619648 623336 627161 631650 637200 644091 652620
49717 652620 663012 675106 688275 701746 714880 726979 736974 743755 746966 747229 745364 741608 735869
49704 735869 728558 720679 713047 705772 698720 692168 686720 682715 679969 678014 676280 674077 670781 666272
49690 666272 661120 656168 652013 648914 647071 646753 648168 651367 656292 662855 670983 680660 691966 704946
49676 704946 719422 734958 751076 767503 784236 801292 818206 833655 845774 853198 855931 855127
49664 855127 852173 848221 844472 842215 842199 844141 847136 850305 852794 853429 850923 844473 833909 819420
49650 819420 801613 781812 761782 742851 725514 709914 696344 685027 675731 667924 661290 655889
49638 655889 651917 649438 648290 648121 648501 649009 649174 648476 646632 643843 640524 636819 632622 627960 622977
49623 622977 617526 611293 604526 598198 593138 589336 586278 583608 581177 578868 576761 575185 574240 573631 573319
49608 573319 573901 575790 578426 580976 583556 586926 591048 594793 597304 598916 600444 602074 603363 603979 604126
49593 604126 604463 605705 608007 610610 612419 613021 612863 612508 612275 612653 614331 617398 620991 624199 626951 629663
49577 629663 632434 635151 638036 641433 645185 648796 652283 656432 662032 669113 677002 684945 692629 700255
49563 700255 708163 716342 724359 731691 737875 742346 744571 744674 743565 742008 739777 736187 731362 726465
49549 726465 722674 720292 718865 717753 716461 714879 713459 712995 713951 716095 718814 721726 724835 728243 731820
49534 731820 735254 738406 741607 745566 751028 758551 768466 780745 794905 810399 827247 845900 866240
49521 866240 887035 906706 924353 939739 952679 963014 970955 976852 980734 982706 983770 985538 988890
49508 988890 993429 998393 1003556 1008886 1013708 1016627 1016142 1011261 1001850 988527 972052 952875 931689
49495 931689 910259 890815 874179 859223 844711 831133 820020 811896 805780 800541 795879 791862
49483 791862 788345 785186 782550 780612 779235 778183 777415 777021 777021 777349 777802 778046 777919 777800 778315 779598 781189
49466 781189 782785 784679 787207 790158 793094 796009 799283 803076 807074 810660 813106 813758 812478 809911
49452 809911 807000 804202 801296 797825 793436 787995 781868 776027 771345 767649 763929 759695 755659 752767
49438 752767 751011 749705 748639 748402 749598 752253 756131 761273 768005 776594 787065 799303 813303 829263
49424 829263 847340 867268 888532 911020 935148 960865 986809 1010915 1031737 1048616 1060690
49413 1060690 1066693 1066175 1060493 1052258 1044107 1038099 1035547 1036737 1041067 1047931 1057283 1068989 1082094 1095384
49399 1095384 1108475 1121665 1134864 1147360 1158755 1169356 1179379 1188305 1195475 1200883 1204958 1207790
49387 1207790 1208947 1207944 1204589 1198981 1191446 1182546 1172927 1163022 1152880 1142339 1131435 1120698 1110899
49374 1110899 1102444 1095231 1089272 1085097 1083100 1082691 1082780 1083098 1084403 1087134 1090577 1093715 1096293 1098340 1099123
49359 1099123 1097520 1093428 1088048 1082541 1076942 1070675 1063639 1056341 1049254 1042547 1036358 1030881 1026071 1021645
49345 1021645 1017641 1014690 1013328 1013130 1012903 1011835 1010159 1008501 1006955 1005045 1002337 998656 993923 988289
49331 988289 982413 977090 972483 968147 963936 960407 958162 957262 957563 959168 962120 965947 970035 974266 978850
49316 978850 983699 988476 993221 998448 1004478 1011031 1017634 1024133 1030648 1037252 1043914 1050678 1057708 1065108
49302 1065108 1072777 1080587 1088786 1098094 1109170 1121883 1135301 1148365 1160367 1170753 1178909 1184361
49290 1184361 1186883 1186146 1181726 1173849 1163848 1153359 1143180 1133268 1123551 1114141 1104865 1095329 1085589
49277 1085589 1076316 1068152 1061317 1055930 1052260 1050455 1050340 1051585 1053763 1056239 1058497 1060688 1063341 1066340
49263 1066340 1068706 1069728 1069826 1069883 1070134 1070227 1070135 1070444 1071822 1074669 1079312 1086183 1095542 1107085 1119803 1132240
49247 1132240 1143111 1151802 1158098 1161399 1160578 1154871 1144725 1131458 1116368 1100428 1084493 1069301
49235 1069301 1055283 1042802 1032516 1025126 1020781 1019004 1019139 1020575 1022738 1025342 1028669 1033112 1038391
49222 1038391 1043695 1048778 1054409 1061428 1069718 1078439 1087116 1096145 1106300 1117974 1130767 1143678 1155772
49209 1155772 1166883 1177644 1188756 1200338 1212066 1223737 1235507 1247710 1260663 1274522 1289108
49198 1289108 1303928 1318518 1332736 1346660 1360320 1373736 1387003 1400057 1412452 1423695 1433849
49187 1433849 1443497 1453058 1462395 1471280 1479978 1489192 1499566 1511400 1524729 1539535 1555982 1574677
49175 1574677 1596565 1622413 1652341 1685951 1722739 1762226 1803824 1846782 1890132 1932304 1970848
49164 1970848 2003087 2027422 2043949 2053844 2058545 2059679 2059184 2058761 2059151 2060339 2062437 2065922 2070864 2076368
49150 2076368 2081185 2084812 2087812 2091163 2095497 2100952 2107561 2115608 2125514 2137421 2151009 2165819 2181651
49137 2181651 2198515 2216266 2234522 2252927 2271339 2289833 2308701 2328284 2348509 2368693 2388249
49126 2388249 2407591 2427846 2449530 2471996 2494384 2516559 2538758 2560890 2582888 2605550 2630355
49115 2630355 2658391 2689844 2724492 2762341 2803966 2850777 2904947 2968501 3042274 3125893 3218486
49104 3218486 3318821 3424887 3534140 3644244 3752695 3855448 3946885 4021961 4077902 4113192
49094 4113192 4125631 4112690 4073975 4012588 3933888 3843377 3745598 3643920 3540615 3437427 3336569
49083 3336569 3241117 3154200 3077933 3013113 2959410 2915441 2879041 2848189 2821865 2799810 2781535
49072 2781535 2765909 2751768 2738582 2726359 2715093 2704508 2694288 2684478 2675577 2668088 2661837 2655824
49060 2655824 2649089 2641673 2634439 2627821 2621187 2613638 2605079 2596102 2587093 2578085 2569437 2561963 2556080 2551231
49046 2551231 2546537 2541829 2537681 2534617 2532632 2531499 2531243 2532207 2534736 2538841 2544161 2550310 2557186 2564649
49032 2564649 2571856 2577344 2580190 2580831 2580405 2579435 2577560 2574336 2569731 2563883 2557030 2549859 2543343 2537935 2533224
49017 2533224 2528666 2524310 2520625 2518013 2516824 2517408 2519634 2522586 2525245 2527469 2529972 2533387 2537651 2542203
49003 2542203 2546416 2549876 2552579 2554959 2557504 2560282 2562911 2564883 2565834 2565689 2564758 2563448 2561665 2558721 2554158
48988 2554158 2548438 2542446 2536562 2530676 2524882 2519500 2514464 2509362 2504193 2499546 2495841 2492986 2490935 2489972
48974 2489972 2490141 2490949 2492025 2493541 2495474 2496939 2496886 2495268 2493003 2490999 2489711 2489425 2490283 2492039 2494364
48959 2494364 2497489 2502067 2508275 2515576 2523441 2531868 2541009 2550834 2561530 2573747 2587932 2603626 2619938
48946 2619938 2636657 2654409 2673682 2694127 2715009 2736025 2757455 2779753 2803323 2828560 2855788
48935 2855788 2885103 2916491 2950128 2986296 3024996 3065925 3109018 3154763 3203718 3255871 3310665
48924 3310665 3367470 3425720 3484775 3544167 3603985 3664578 3725788 3786909 3847496 3907711 3967567
48913 3967567 4026263 4082690 4136323 4187189 4235252 4280396 4322939 4363573 4402639 4439817 4474597
48902 4474597 4506722 4536125 4562835 4587194 4609818 4631072 4650711 4668232 4683400 4696240 4706704
48891 4706704 4714739 4720640 4724994 4728051 4729314 4727934 4723461 4716057 4705988 4693180 4677415 4658769 4637568
48878 4637568 4613953 4587840 4559323 4528787 4496419 4461915 4424906 4385494 4344011 4300385 4254100
48867 4254100 4204870 4153212 4100344 4047596 3995780 3944937 3894748 3845264 3797064 3750617 3705832
48856 3705832 3662624 3621624 3583814 3549553 3518373 3489696 3463252 3438844 3416303 3395888 3378241
48845 3378241 3363728 3352164 3343330 3337312 3334067 3333082 3333873 3336530 3341440 3348658 3357891 3368904 3381632
48832 3381632 3395974 3411737 3428628 3446169 3463865 3481706 3500223 3519731 3539743 3559577 3579329
48821 3579329 3599754 3621209 3643211 3665135 3686892 3708692 3730498 3752003 3773055 3793825 3814527
48810 3814527 3835095 3855128 3874190 3892220 3909750 3927757 3947258 3968899 3992657 4017830 4043439
48799 4043439 4068816 4093827 4118558 4142985 4166974 4190322 4212616 4233272 4251996 4269015 4284612
48788 4284612 4298608 4310611 4320602 4328766 4334813 4337994 4337935 4335024 4329616 4321180 4308561 4290939 4268246
48775 4268246 4240881 4209404 4174537 4137101 4097746 4056838 4014587 3971100 3926274 3879939 3832345
48764 3832345 3784354 3736873 3690115 3643651 3597250 3551418 3507048 3464778 3424838 3387322 3352336
$$ [...]
##END NTUPLES=NMR SPECTRUM
##END=
