##TITLE=AC1617_BRASL13348_8317431_PXtfBHKYYE
##JCAMPDX= 6.0         $$ Bruker NMR JCAMP-DX V2.0
##DATA TYPE= NMR SPECTRUM
##DATA CLASS= NTUPLES
##ORIGIN= BRUKER
##OWNER= Administrator
$$ 1.72 TOPSPIN		Version 2.1
$$ 2013-11-14 01:05:43.350 -0800  Administrator@X
$$ Compression mode = diff/dup
##.OBSERVE FREQUENCY= 400.02188249412
##.OBSERVE NUCLEUS= ^1H
##.ACQUISITION MODE= SIMULTANEOUS (DQD)
##.ACQUISITION SCHEME= undefined
##.AVERAGES= 64
##.DIGITISER RES= 22
##SPECTROMETER/DATA SYSTEM= spect
##.PULSE SEQUENCE= noesygpps1d.comp
##.SOLVENT NAME= COFFEE_meoh
##.SHIFT REFERENCE= INTERNAL, COFFEE_meoh, 1, 14.96105
##AUDIT TRAIL= $$ (NUMBER, WHEN, WHO, WHERE, PROCESS, VERSION, WHAT)
$$ ##TITLE= Audit trail, TOPSPIN		Version 2.1
$$ ##JCAMPDX= 5.01
$$ ##ORIGIN= Bruker BioSpin GmbH
$$ ##OWNER= Administrator
$$ $$ E:\/data/COFFEE/nmr/AC1617_BRASL13348_8317431_PXtfBHKYYE/12/pdata/1/auditp.txt
$$ ##AUDIT TRAIL=  $$ (NUMBER, WHEN, WHO, WHERE, PROCESS, VERSION, WHAT)
(   1,<2013-11-14 01:05:37.912 -0800>,<Administrator>,<X>,<go>,<TOPSPIN 2.1>,
      <created by zg
	started at 2013-11-14 00:54:08.762 -0800,
	POWCHK enabled, PULCHK disabled,
       configuration hash MD5:
       C8 4E 4E 5D D3 5C D8 9E 9F 52 82 E0 59 8A DE 15
       data hash MD5: 64K
       C9 4B 51 0F 3E 0F 86 22 C4 9C 6A CC 8D 63 21 F0>)
(   2,<2013-11-14 01:05:41.147 -0800>,<Administrator>,<X>,<proc1d>,<TOPSPIN 2.1>,
      <Start of raw data processing
       efp LB = 0.3 FT_mod = 6 PKNL = 1 PHC0 = 0 PHC1 = 0 SI = 128K 
       data hash MD5: 128K
       76 3D D8 BB 8D C4 D5 A9 DD 9D 56 82 40 A0 FB 1D>)
(   3,<2013-11-14 01:05:42.272 -0800>,<Administrator>,<X>,<proc1d>,<TOPSPIN 2.1>,
      <pk PHC0 = -84.16626 PHC1 = 0 
       data hash MD5: 128K
       52 3D 81 BC 6C E2 BB E1 08 1B 52 57 1D 4F 4F 62>)
(   4,<2013-11-14 01:05:42.834 -0800>,<Administrator>,<X>,<proc1d>,<TOPSPIN 2.1>,
      <abs ABSG = 1 
       data hash MD5: 128K
       AA 9E 85 DC 11 EF 83 69 9E 21 88 DF 23 6A 9E E9>)
(   5,<2013-11-14 01:05:42.943 -0800>,<Administrator>,<X>,<proc1d>,<TOPSPIN 2.1>,
      <abs ABSG = 2 
       data hash MD5: 128K
       F9 75 1E 12 35 29 3F 8C 2A 7F 95 9C 04 F6 DA 9B>)
(   6,<2013-11-14 01:05:43.022 -0800>,<Administrator>,<X>,<proc1d>,<TOPSPIN 2.1>,
      <abs ABSG = 3 
       data hash MD5: 128K
       D2 06 79 6E 74 46 25 F9 DA 09 DA 46 04 AC 9D 0A>)
(   7,<2013-11-14 01:05:43.115 -0800>,<Administrator>,<X>,<proc1d>,<TOPSPIN 2.1>,
      <abs ABSG = 4 
       data hash MD5: 128K
       E4 EA 0C 0D EC 4E 18 2D DD DE 5B 0E 44 FE ED 07>)
(   8,<2013-11-14 01:05:43.178 -0800>,<Administrator>,<X>,<proc1d>,<TOPSPIN 2.1>,
      <abs ABSG = 5 
       data hash MD5: 128K
       E7 C0 7D B1 BC 59 C0 39 32 53 65 FC 16 B3 F3 AA>)
$$ ##END=
$$ 
$$ $$ hash MD5
$$ $$ 37 E7 AE BB 11 FF 49 C5 57 7D FC C6 25 32 77 C6
##$RELAX= 
##$RELAX= 
##$RELAX= 
##$RELAX= 
##$RELAX= 
##$RELAX= 
##$RELAX= 
##$RELAX= 
$$ Bruker specific parameters
$$ --------------------------
##$DU= <E:\>
##$EXPNO= 12
$$ [...]
##$TP07= 0
##$TPNAME0= <>
##$TPNAME1= <>
##$TPNAME2= <>
##$TPNAME3= <>
##$TPNAME4= <>
##$TPNAME5= <>
##$TPNAME6= <>
##$TPNAME7= <>
##$TPOAL= (0..7)
0.5 0.5 0.5 0.5 0.5 0.5 0.5 0.5
##$TPOFFS= (0..7)
0 0 0 0 0 0 0 0
##$TUNHIN= 0
##$TUNHOUT= 0
##$TUNXOUT= 0
##$USERA1= <user>
##$USERA2= <user>
##$USERA3= <user>
##$USERA4= <user>
##$USERA5= <user>
##$V9= 5
##$VALIST= <valist>
##$VCLIST= <CCCCCCCCCCCCCCC>
##$VD= 0
##$VDLIST= <DDDDDDDDDDDDDDD>
##$VPLIST= <PPPPPPPPPPPPPPP>
##$VTLIST= <TTTTTTTTTTTTTTT>
##$WBST= 1024
##$WBSW= 4
##$XGAIN= (0..3)
0 0 0 0
##$XL= 0
##$YL= 0
##$YMAX_a= 5920909
##$YMIN_a= -12621864
##$ZGOPTNS= <>
##$ZL1= 120
##$ZL2= 120
##$ZL3= 120
##$ZL4= 120
##$ABSF1= 14.96105
##$ABSF2= -5.597132
##$ABSG= 5
##$ABSL= 3
##$ALPHA= 0
##$AQORDER= 0
##$ASSFAC= 0
##$ASSFACI= 0
##$ASSFACX= 0
##$ASSWID= 0
##$AUNMP= <proc_prof1d_extract.lims>
##$AXLEFT= 0
##$AXNAME= <>
##$AXNUC= <1H>
##$AXRIGHT= 0
##$AXTYPE= 0
##$AXUNIT= <>
##$AZFE= 0.1
##$AZFW= 0.1
##$BCFW= 0
##$BC_mod= 0
##$BYTORDP= 0
##$COROFFS= 0
##$CY= 15
##$DATMOD= 1
##$DC= 0
##$DFILT= <>
##$DTYPP= 0
##$F1P= 0
##$F2P= 0
##$FCOR= 0.5
##$FTSIZE= 131072
##$FT_mod= 6
##$GAMMA= 0
##$GB= 0
##$INTBC= 1
##$INTSCL= 1
##$ISEN= 128
##$LB= 0.3
##$LEV0= 0
##$LPBIN= 0
##$MAXI= 10000
##$MC2= 0
##$MEAN= 0
##$ME_mod= 0
##$MI= 0
##$NCOEF= 0
##$NC_proc= -2
##$NLEV= 6
##$NOISF1= 0
##$NOISF2= 0
##$NSP= 0
##$NTH_PI= 0
##$NZP= 0
##$OFFSET= 14.96105
##$PC= 1
##$PHC0= -84.16626
##$PHC1= 0
##$PH_mod= 1
##$PKNL= yes
##$PPARMOD= 0
##$PPDIAG= 0
##$PPIPTYP= 0
##$PPMPNUM= 2147483647
##$PPRESOL= 1
##$PSCAL= 4
##$PSIGN= 0
##$PYNMP= <proc.py>
##$REVERSE= no
##$SF= 400.020009616637
##$SI= 131072
##$SIGF1= 0
##$SIGF2= 0
##$SINO= 400
##$SIOLD= 131072
##$SPECTYP= <>
##$SREGLST= <1H.CDCl3>
##$SSB= 0
##$STSI= 131072
##$STSR= 0
##$SW_p= 8223.68421052631
##$SYMM= 0
##$S_DEV= 0
##$TDeff= 65536
##$TDoff= 0
##$TI= <>
##$TILT= no
##$TM1= 0
##$TM2= 0
##$TOPLEV= 0
##$USERP1= <user>
##$USERP2= <user>
##$USERP3= <user>
##$USERP4= <user>
##$USERP5= <user>
##$WDW= 1
##$XDIM= 131072
##$YMAX_p= 342486199
##$YMIN_p= -12341
##$CURPLOT= <Network HP LaserJet P1505>
##$CURPRIN= <$Network HP LaserJet P1505>
##$DFORMAT= <normdp>
##$LAYOUT= <+/1D_H.xwp>
##$LFORMAT= <normlp>
##$PFORMAT= <normpl>
##$SURQMSG= 1
$$ End of Bruker specific parameters
$$ ---------------------------------
##NTUPLES= NMR SPECTRUM
##VAR_NAME=  FREQUENCY,     SPECTRUM/REAL,   SPECTRUM/IMAG
##SYMBOL=    X,             R,               I
##VAR_TYPE=  INDEPENDENT,   DEPENDENT,       DEPENDENT
##VAR_FORM=  AFFN,          ASDF,            ASDF
##VAR_DIM=   131072,        131072,          131072
##UNITS=     HZ,            ARBITRARY UNITS, ARBITRARY UNITS
##FACTOR=    0.0627417313425164, 1,          1
##FIRST=     8223.62146879497, 1722,         -65274
##LAST=      0,             3846,            -64683
##MIN=       0,             -12341,          0
##MAX=       8223.62146879497, 342486199,    0
$$ Real data points
##PAGE= N=1
##DATA TABLE= (X++(R..R)), XYDATA
$$ [...]
63912C247909k36222k23942k10869j96989j82015j66322j50605j35211j20400
63903A625334j06794r4876q4253p4191o4767n6761n0297m4531l8977l4356l1392
63892I44139k9466k7308k4734k2680k1628k0992k0276j9807j9729j9167j7298
63881G01054j4762j2907j1808j0124p193m117k206j119M77K904N147O501P501
63868F59348Q891J0482J1556J1928J1972J1933J1714J1253J0622R806Q750P570
63856G85825O388M985L057Q89p61j582k210l523n669q048j0102j1842j3472j4818
63842G29117j5408j5259j5279j6483j8703k0560k0952k0226j9500j9301j9358
63831E28088j9387j9263j8581j7040j5332j4650j5010j4981j3650j1915j1038
$$ plain form
63912 3247909 3011687 2787745 2576876 2379887 2197872 2031550 1880945 1745734 1625334
63903 1625334 1518540 1423664 1339411 1265220 1200453 1143692 1093395 1048864 1009887 975531 944139
63892 944139 914673 887365 862631 839951 818323 797331 777055 757248 737519 718352 701054
63881 701054 686292 673385 661577 651453 644260 640143 637937 636818 637295 640199 645346 651847 659348
63868 659348 668239 678721 690277 702205 714177 726110 737824 749077 759699 769505 778255 785825
63856 785825 792213 797198 800255 801144 800383 798801 796591 793068 787399 779351 769249 757407 743935 729117
63842 729117 713709 698450 683171 666688 647985 627425 606473 586247 566747 547446 528088
63831 528088 508701 489438 470857 453817 438485 423835 408825 393844 380194 368279 357241
63820C57241j0758r928q435p229o634n931m801l948l876m013l629k906k446k256
63806B80451j874j163m13Q1J19m06j189j507j108p25j177k190k767k585k217k078
63790B59252j882j435j112j217j372j112o85o99j210j679j788j841k215k764k941
63775B35300k383j317l92j11l31m45j31K76L13J63M26J174J663J217J32o59p00
63758B34195m10l64n74o58n40o16j142j731j696q47K25P64N82Q8j89M5Q89K197
63740B30218L407L740K946J755J236J715K545K960K822K495K314K435K855L309
63726B66752L284K586J784J695K405L235L676L887M095M034L467K793K541K453
63712C08687J746L09j020j508j364j249j438j768k044k074j605o74K06O01P42
$$ plain form
63820 357241 346483 336555 328120 320891 314257 308326 303525 299577 295701 291688 288059 285153 282707 280451
63806 280451 278577 277414 277001 277082 277201 276795 275606 274099 272991 272266 271089 268899 266132 263547 261330 259252
63790 259252 257370 255935 254823 253606 252234 251122 250437 249738 248528 246849 245061 243220 241005 238241 235300
63775 235300 232917 231600 231208 231097 230766 230321 230190 230466 230779 230942 231368 232542 234205 235422 235554 234895 234195
63758 234195 233785 233421 232847 232189 231649 231033 229891 228160 226464 225617 225842 226606 227188 227276 227087 227132 228021 230218
63740 230218 233625 237365 240311 242066 243302 245017 247562 250522 253344 255839 258153 260588 263443 266752
63726 266752 270036 272622 274406 276101 278506 281741 285417 289304 293399 297433 300900 303693 306234 308687
63712 308687 310433 310742 309722 308214 306850 305601 304163 302395 300351 298277 296672 295998 296204 296805 297547
63697B97547J128J677J875J598J272J109Q29L71L27J209K653L748L912L135J607
63682C23997l29j994k696k355j521p24r0L69N36M53M73Q40J248J128M11k26j3
63665C19507J099K287K622J889O42m79j296j871k135k017j862k209l040l664l560
63650C05913l058k875l156l340k938k066j171n43k39k48m09l40L26J482K504K809
63634B92651K435K031K220L027L885M240M012L565L262L234L530M277N452O634
63620C44455P289P417P666Q551R798J0764J1394J2279J3677J5030J5842J6587
63608D80749J8116K0333K2161K2871K2837K2669K2212K0953J8945J6709J4424
63597G02979J1797Q761N710K911K02k525m982o878q301r386j0014j0167j0382
$$ plain form
63697 297547 298675 300352 302227 303825 305097 306206 307035 307406 307733 308942 311595 315343 319255 322390 323997
63682 323997 323668 321674 318978 316623 315102 314378 314288 314657 315193 315646 316119 316959 318207 319335 319746 319520 319507
63665 319507 320606 322893 325515 327404 328046 327567 326271 324400 322265 320248 318386 316177 313137 309473 305913
63650 305913 302855 299980 296824 293484 290546 288480 287309 286766 286527 286279 285870 285530 285856 287338 289842 292651
63634 292651 295086 297117 299337 302364 306249 310489 314501 318066 321328 324562 328092 332369 337821 344455
63620 344455 351744 359161 366827 375378 385176 395940 407334 419613 433290 448320 464162 480749
63608 480749 498865 519198 541359 564230 587067 609736 631948 652901 671846 688555 702979
63597 702979 714776 723537 729247 732158 732360 729835 724853 717975 709674 700288 690274 680107 669725
63584F69725j1317j2940j4569j5679j6257j6416j6074j5244j4252j3395j2521
63573E11061j1250r540p781o297m910l159j015Q65J800K000K377L345M279M520
63559D86295M481N055O191O969P098P461Q851J0896J2748J4211J5677J7453J9664
63546F23050K2278K4756K6192K6414K6340K6497K5880K3288J9256J5324J1685
63535H70960P193J691l211o238p878r027r553r245r030r967j1737j3388j5027
63522G75543j7467k0554k3084k4413k4994k5306k5230k4645k3734k2514k0847
63511E22755j9020j7545j6303j4704j2795j1342j0601r919q893p987p516o894
63499C79236n564l980k950k497k127j759j640j643j428j073q89p43k37N85J313
$$ plain form
63584 669725 658408 645468 630899 615220 598963 582547 566473 551229 536977 523582 511061
63573 511061 499811 490271 482490 476193 471283 468124 467109 467974 469774 471774 474151 477496 481775 486295
63559 486295 490776 495831 502022 508991 516089 523550 532401 543297 556045 570256 585933 603386 623050
63546 623050 645328 670084 696276 722690 749030 775527 801407 824695 843951 859275 870960
63535 870960 878153 879844 876633 870395 862517 853490 843937 834692 825662 815695 803958 790570 775543
63522 775543 758076 737522 714438 690025 665031 639725 614495 589850 566116 543602 522755
63511 522755 503735 486190 469887 455183 442388 431046 420445 410526 401633 393646 386130 379236
63499 379236 373672 369692 366742 364245 362118 360359 358719 357076 355648 354575 353686 352943 352706 353291 354604
63484C54604J837K288K383J689O10K82J139K240K532K248K339K920L085K260J029
63469C83485K84N9l31j297k569l658m303m431m087l531l004k334j160K71J037
63454C54431O21l00o30o2J000K321L852N131N560N432N822P170Q725R625R930
63439D18628J0188J0678J1492J2746J4193J5182J5509J5851J6761J7798J8243
63428E77269J8168J7958J7263J5367J2462R652P680O545O264P147R116J1535J3990
63415G30416J6561J9084K0929K1887K2569K3332K3336K1380J7451J2804Q591M949
63403I43289J498j798m583o701q472j0274j2083j3627j4997j6684j8878k1065
63391H15625k2668k3760k4678k5250k5088k4474k4187k4222k3509k1320j8316
$$ plain form
63484 354604 356441 358729 361112 362801 363411 363693 364832 367072 369604 371852 374191 377111 380196 382456 383485
63469 383485 383769 383828 383497 382200 379631 375973 371670 367239 363152 359621 356617 354283 353123 353394 354431
63454 354431 355052 354752 354122 354060 355060 357381 361233 366364 371924 377356 383178 390348 399073 408698 418628
63439 418628 428816 439494 450986 463732 477925 493107 508616 524467 541228 559026 577269
63428 577269 595437 613395 630658 646025 658487 668139 675819 682364 688628 695775 704891 716426 730416
63415 730416 746977 766061 786990 808877 831446 854778 878114 899494 916945 929749 938340 943289
63403 943289 944787 942989 938406 931705 923233 912959 900876 887249 872252 855568 836690 815625
63391 815625 792957 769197 744519 719269 694181 669707 645520 621298 597789 576469 558153
63380E58153j5696j3782j1982r852p547n394l562k081p60Q34K892M900O187O918
63366E09228P985R759J1479J2287J2523J3379J5393J7730J9289K0116K1275K3325
63354F93768K5440K6363K5916K5071K4578K4047K2627K0060J6706J2836Q458L829
63342I29699m14l824o495q672j0321j1308j1835j2337j3090j4220j5946j8363
63330H02874k0935k2608k2775k1837k0555j9213j7739j6365j5428j4599j3021
63319E97799j0493p943o412o004o160o519p050p760q773j0401j2504j4088j4214
63306D79478j3155j1967j1063r951q404o971o071n343m334l246k543k258k149
63293C92023k160k310k393k219j933j798j889k205k730l145k982k384k190k781
$$ plain form
63380 558153 542457 528675 516693 506841 499294 493900 490338 488257 487497 488331 491223 496123 502310 509228
63366 509228 517213 526972 538451 550738 563261 576640 592033 609763 629052 649168 670443 693768
63354 693768 719208 745571 771487 796558 821136 845183 867810 887870 904576 917412 925870 929699
63342 929699 929285 925461 918966 910294 899973 888665 876830 864493 851403 837183 821237 802874
63330 802874 781939 759331 736556 714719 694164 674951 657212 640847 625419 610820 597799
63319 597799 587306 579363 572951 566947 560787 554268 547218 539458 530685 520284 507780 493692 479478
63306 479478 466323 454356 443293 433342 424938 417967 411896 406553 402219 398973 396430 394172 392023
63293 392023 389863 387553 385160 382941 381008 379210 377321 375116 372386 369241 366259 363875 361685 358904
63279C58904l307k799j633j072j496j940j525n65O6J10P4M60J187J708J625J187
63263C50984J085J575K073J995J698J978K832L400L243K939L161L818M470M991
63249C90242N397N521N401N626O667Q153R389J0346J1493J2784J3610J3904J4510
63236E13043J6062J8028J9379J9939K0546K1961K3908K5349K5478K4492K3412
63225G51597K3150K3691K4242K4171K3539K2779K2219K2109K2626K3395K3318
63214A006836K1548J8643J6049J4323J2467R319N036O94l124o685j0306j3873
63202A070927j7188k0190k2701k4376k5066k4867k3751k1532j8380j4982j1976
63191H45918r448p126m715j939J332M732P612R895J2313J5370J8507K0766K2043
$$ plain form
63279 358904 355597 352798 351165 350093 348597 346657 345132 344567 344633 344743 344817 345277 346464 348172 349797 350984
63263 350984 352069 353644 355717 357712 359410 361388 364220 367620 370863 373802 376963 380781 385251 390242
63249 390242 395639 401160 406561 412187 418854 427007 436396 446742 458235 471019 484629 498533 513043
63236 513043 529105 547133 566512 586451 606997 628958 652866 678215 703693 728185 751597
63225 751597 774747 798438 822680 846851 870390 893169 915388 937497 960123 983518 1006836
63214 1006836 1028384 1047027 1063076 1077399 1089866 1099185 1104221 1104915 1101791 1095106 1084800 1070927
63202 1070927 1053739 1033549 1010848 986472 961406 936539 912788 891256 872876 857894 845918
63191 845918 836470 829344 824629 822690 824022 828754 836366 846261 858574 873944 892451 913217 935260
63178I35260K3000K3966K4592K4620K4260K3669K2655K1194J9707J8480J7172
63167A178575J5310J2928J0301P349L759m72n043r844j4940k0087k4704k8481
63155A124651l1661l4510l6773l7946l7828l6672l4908l2974l1166k9390k7188
63144G53635k4387k1607j9645j8358j6680j3968j0879q519p159o186n105l960
63132E97182k907j994j398j333j547j417o86L32J441K823M310N088M723L985L911
63117F12513M392M509M089L946M475M876M247K791J415O09K64K19L36K37m06j252
63101F47260j551j136p03r08j544j932j785j371r56n60k61l07p27j116j071o31
63085F30701o4O03J549K682L618M154M478M848N275N675N992O129O042O104O938
$$ plain form
63178 935260 958260 982226 1006818 1031438 1055698 1079367 1102022 1123216 1142923 1161403 1178575
63167 1178575 1193885 1206813 1217114 1224463 1228222 1227750 1222707 1212863 1197923 1177836 1153132 1124651
63155 1124651 1092990 1058480 1021707 983761 945933 909261 874353 841379 810213 780823 753635
63144 753635 729248 707641 687996 669638 652958 638990 628111 619592 612433 606247 601142 597182
63132 597182 594275 592281 590883 589550 588003 586586 585900 586232 587673 590496 594806 599894 604617 608602 612513
63117 612513 616905 621414 625503 629449 633924 638800 643047 645838 647253 647862 648126 648345 648681 648918 648512 647260
63101 647260 645709 644573 643870 642962 641418 639486 637701 636330 635374 634814 634553 634246 633519 632403 631332 630701
63085 630701 630637 631240 632789 635471 639089 643243 647721 652569 657844 663519 669511 675640 681682 687786 694724
63070F94724Q634J0389J1331J1528J1787J2650J3986J5504J7206J9224K1526K3931
63058H72420K6278K8505L0790L3453L6559L9685M2396M4846M7576N0676N3557
63047A306741N5619N6838N7635N8407N9258N9972O0211N9912N9372N8750N7715
63036A950430N5962N3903N2204N0740M8641M5385M1193L6217L0149K2935J5084
63025B402843O856k214j2354k2773l2477m1297m9354n6066o0598o3057o4233o4237
63013A941039o2341n8253n2688m6456l9783l2760k5733j8856j1861m691K186Q460
63001A598263J4473K0572K6382L1250L5028L7965M0118M1421M2130M2604M2757
62990A972963M2190M0917L9421L7946L6100L3257K9115K3793J7669J1179M454
$$ plain form
63070 694724 703358 713747 725078 736606 748393 761043 775029 790533 807739 826963 848489 872420
63058 872420 898698 927203 957993 991446 1028005 1067690 1110086 1154932 1202508 1253184 1306741
63047 1306741 1362360 1419198 1476833 1535240 1594498 1654470 1714681 1774593 1833965 1892715 1950430
63036 1950430 2006392 2060295 2112499 2163239 2211880 2257265 2298458 2334675 2364824 2387759 2402843
63025 2402843 2409699 2407485 2395131 2372358 2339881 2298584 2249230 2193164 2132566 2069509 2005276 1941039
63013 1941039 1878698 1820445 1767757 1721301 1681518 1648758 1623025 1604169 1592308 1587617 1589803 1598263
63001 1598263 1612736 1633308 1659690 1690940 1725968 1763933 1804051 1845472 1887602 1930206 1972963
62990 1972963 2015153 2056070 2095491 2133437 2169537 2202794 2231909 2255702 2273371 2284550 2289004
62979B289004k926j1472k0972l0407l8873m6380n3445o0110o5680o9475p1558
62968A817706p2566p2949p2540p0831o7587o3100n8005n3031m8781m5483m2823
62957A150010m0216l7432l4778l2590l0732k8895k7215k6129k5593k4897k3466
62946H18067k1524j9750j8446j7391j6325j5267j4320j3490j2752j2061j1174
62935F45567r734p746n848m842m836n102m849m067l339k921k380j368m19m26j384
62920E86306k214k111j555j536k167k691k721k727l139l720m124m518n049n210
62906E42824m469l329k987l782m689m552l388k117j449j406j716k139k483k605
62892E01713k415j798p08M49Q82K23q49j241p10n1pm37p42o39k69J49L61P7p14
$$ plain form
62979 2289004 2286078 2274606 2253634 2223227 2184354 2137974 2084529 2024419 1958739 1889264 1817706
62968 1817706 1745140 1672191 1599651 1528820 1461233 1398133 1340128 1287097 1238316 1192833 1150010
62957 1150010 1109794 1072362 1037584 1004994 974262 945367 918152 892023 866430 841533 818067
62946 818067 796543 776793 758347 740956 724631 709364 695044 681554 668802 656741 645567
62935 645567 635833 628087 622239 617397 612561 607459 602610 598543 595204 592283 589903 588535 588116 587690 586306
62920 586306 584092 581981 580426 578890 576723 574032 571311 568584 565445 561725 557601 553083 548034 542824
62906 542824 538355 535026 532039 528257 523568 519016 515628 513511 512062 510656 508940 506801 504318 501713
62892 501713 499298 497500 496792 497241 498123 498346 497497 496256 495546 495495 495488 495051 494309 493670 493401 493550 493911 493988 493274
62873D93274j478j595j068n01m04p27j081j095o10J75P48P52M72M94Q23P94J08
62856D89081n07j74Q77J519J123K27l02k64l6J35K87M04L16n2n74j133j712k195
62838D87020k302j905j338j153j519k021k131j733j068l16N26J342J861K025K108
62823D79396K243K107J455P01N88J293K337L271L978M242L753K790K333K960M051
62808E17498M645M749N141O058O888P205P363P753Q107Q025P826Q315R838J1894
62794F21305J3706J4915J5805J7026J9082K1840K4610K6945K9254L2410L6792
62783H73690M1934M7110N1966N6485O0717O4834O9225P4104P8952Q2645Q4366
62772A586028Q4201Q2714Q0129P6168P0587O3483N4954M4794L2867J9642O018
$$ plain form
62873 493274 491796 490201 489133 488632 488228 487501 486420 485325 484715 484890 485638 486390 486862 487356 488179 488973 489081
62856 489081 488574 488400 489277 490796 491919 492146 491844 491580 491544 491679 491966 492370 492686 492634 492060 490927 489215 487020
62838 487020 484718 482813 481475 480322 478803 476782 474651 472918 471850 471534 472060 473402 475263 477288 479396
62823 479396 481639 483746 485201 485902 486490 487783 490120 493391 497369 501611 505364 508154 510487 513447 517498
62808 517498 522143 526892 532033 538091 544979 552184 559547 567300 575407 583432 591258 599573 609411 621305
62794 621305 635011 649926 665731 682757 701839 723679 748289 775234 804488 836898 873690
62783 873690 915624 962734 1014700 1071185 1131902 1196736 1265961 1340065 1419017 1501662 1586028
62772 1586028 1670229 1752943 1833072 1909240 1979827 2043310 2098264 2143058 2175925 2195567 2201585
62761B201585p426k0716l3902m6388n7109o5396p1498p6155p9678q1717q1963
62750A579637q0839p9180p7212p4319o9978o4658n9466n5055n1167m7195m2858
62739H77710l8352l4109l0517k7644k5140k2571j9866j7302j5045j2929j0719
62728F23516q455o427m946m103l580k765j280N30J882K465K875L997O080Q581
62714F18370J0789J2503J4078J5951J8175K0467K2678K5076K8092L1909L6403
62703H54491M1292M6159N0553N4379N8075O2117O6549P1231P6184Q1095Q4793
62692A546918Q6098Q5229Q3550Q1627P8384P2535O4099N3897M2265K9063J4554
62681B238219n47j5685l0460m4197n6212o6436p5115q2003q6455q8360q8383q7181
$$ plain form
62761 2201585 2194159 2173443 2139541 2093153 2036044 1970648 1899150 1822995 1743317 1661600 1579637
62750 1579637 1498798 1419618 1342406 1268087 1198109 1133451 1073985 1018930 967763 920568 877710
62739 877710 839358 805249 774732 747088 721948 699377 679511 662209 647164 634235 623516
62728 623516 615061 608634 603688 599585 596005 593240 591960 592490 594372 596837 599712 603709 609789 618370
62714 618370 629159 641662 655740 671691 689866 710333 733011 758087 786179 818088 854491
62703 854491 895783 941942 992495 1046874 1104949 1167066 1233615 1304846 1381030 1462125 1546918
62692 1546918 1633016 1718245 1801795 1883422 1961806 2034341 2098440 2152337 2194602 2223665 2238219
62681 2238219 2237672 2221987 2191527 2147330 2091118 2024682 1949567 1867564 1781109 1692749 1604366 1517185
62669A517185q4895q1507p7207p2354o7445o3049n9284n5408n0569m5035m0029
62658H20403l6205l2974k9582k6148k3227k0935j9056j7535j6312j5049j3564
62647E69816j2318j1792j1575j0723r031p338o471o332o262n846n101m096k814
62634D70117j376j65M35M06Q5k30n90j206k016k641k802k558k035j191n7R48J263
62617D56387Q42L40N34J583K958M074M868N664O552P186P339P405Q008R293J0893
62602E33926J2522J4127J5565J6786J8350K1094K4884K8349L0387L1469L2869
62591G80328L4990L7158L8789L9856M0218L9369L7141L3934K9996K5001J8775
62580A155555J1912N167j366p945j4376k0081k4863k8988l2565l5308l7060l8038
$$ plain form
62669 1517185 1432290 1350783 1273576 1201222 1133777 1070728 1011444 956036 905467 860432 820403
62658 820403 784198 751224 721642 695494 672267 651332 632276 614741 598429 583380 569816
62647 569816 557498 545706 534131 523408 514377 507039 500568 494236 487974 482128 477027 472931 470117
62634 470117 468741 468576 469011 469417 469502 469272 468682 467476 465460 462819 460017 457459 455424 454233 454176 455124 456387
62617 456387 457229 457569 458103 459686 462644 466718 471586 477250 483802 490988 498327 505732 513740 523033 533926
62602 533926 546448 560575 576140 592926 611276 632370 657254 685603 715990 747459 780328
62591 780328 815318 852476 891265 931121 971339 1010708 1047849 1081783 1111779 1136780 1155555
62580 1155555 1167467 1172634 1171268 1163323 1148947 1128866 1104003 1075015 1042450 1007142 970082 932044
62568I32044l8407l8041l6918l5419l3839l1904k9214k6076k3331k1299j9339
62557E98257j6768j3843j1439r935q888p784o716o058n827n638n167m372l413
62544D92409k522j889j435p61L91J697K496K506K062J613J337J292J620K284K879
62529E05979L077L191L941N638P873J0065J2029J3899J5791J7807K0204K3155
62517F42649K6398K9386L1917L4338L7038L9978M2870M5557M7956M9737N0456
62506A078280M9964M8435M5908M2121L6965L0859K4495J8282J2152N856o54o938
62494A385725j2140j5555j7231j7856j7823j6735j4058j0041n496q06M336J0107
62482A272427J5942K1043K5169K8673L1806L4356L5795L5604L3471K9377K3646
$$ plain form
62568 932044 893637 855596 818678 783259 749420 717516 688302 662226 638895 617596 598257
62557 598257 581489 567646 556207 546272 537384 529600 522884 516826 510999 505361 500194 495822 492409
62544 492409 489887 487998 486563 485802 486193 487890 490386 492892 494954 496567 497904 499196 500816 503100 505979
62529 505979 509056 512247 516188 521826 529699 539764 551793 565692 581483 599290 619494 642649
62517 642649 669047 698433 730350 764688 801726 841704 884574 930131 978087 1027824 1078280
62506 1078280 1128244 1176679 1222587 1264708 1301673 1332532 1357027 1375309 1387461 1393317 1392663 1385725
62494 1385725 1373585 1358030 1340799 1322943 1305120 1288385 1274327 1264286 1258790 1257984 1262320 1272427
62482 1272427 1288369 1309412 1334581 1363254 1395060 1429416 1465211 1500815 1534286 1563663 1587309
62471A587309J6809R336J397p081j6094k5165l3417m0252m5850n0850n5431n9028
62459A281683o0919o0892n9253n6524n3235m9712m5841m1297l6249l1514k7669
62448G58578k4265k0397j5905j1562q129n674l899k562j410j57J177K155K458
62435F70408K308K188K245K221J764O14j305l694n937p580q715r723j0726j1490
62421F22578j1784j1630j1235j0839j0553j0264r801r256q902q681q100o951n736
62408D98846n018m643m111l511l369l643l621k949k129j708j555j290q48k48P04
62393D60907J964K885K940K466K183K178K035J747J798K277K654K606K563L122
62379D94325M285N518O249O235N731N494O237P822R332J0168J0699J1591J2797
$$ plain form
62471 1587309 1604118 1613454 1614851 1607770 1591676 1566511 1533094 1492842 1446992 1396142 1340711 1281683
62459 1281683 1220764 1159872 1100619 1044095 990860 941148 895307 854010 817761 786247 758578
62448 758578 734313 713916 698011 686449 678320 672646 668747 666185 664775 664618 665795 667950 670408
62435 670408 672716 674904 677149 679370 681134 681748 680443 676749 670812 663232 654517 644794 634068 622578
62421 622578 610794 599164 587929 577090 566537 556273 546472 537216 528314 519633 511533 504582 498846
62408 498846 493828 489185 485074 481563 478194 474551 470930 467981 465852 464144 462589 461299 460451 460203 460907
62393 460907 462871 465756 468696 471162 473345 475523 477558 479305 481103 483380 486034 488640 491203 494325
62379 494325 498610 504128 510377 516612 522343 527837 534074 541896 551228 561396 572095 583686 596483
62366E96483J3728J4203J4739J5854J7584J9794K2560K5912K9388L2271L4349
62355H36865L6120L8095M0089M1448M1869M1569M0553L8239L4152K8719K2989
62344A240707J7600J2431P137J636l953r398j4324j8392k1630k4241k6101k6895
62332A134577k6823k6641k6713k6549k5550k3906k2248k0816j9443j8196j7466
62321H80226j7444j7882j8374j8631j8528j8187j7993j8242j8755j9099j9058
62310F78033j8730j8148j7220j5931j4426j2770j0939r059p424o220n337m551
62298E37278l739k955k339j916j458o62M02J255J566J565J698K130K817L784M928
62283E44354N749N785N304N092N514O207O734P159P817Q817R900J0627J0775J0729
$$ plain form
62366 596483 610211 624414 639153 655007 672591 692385 714945 740857 770245 802516 836865
62355 836865 872985 911080 951169 992617 1034486 1076055 1116608 1154847 1188999 1217718 1240707
62344 1240707 1258307 1270738 1277875 1279511 1275558 1266160 1251836 1233444 1211814 1187573 1161472 1134577
62332 1134577 1107754 1081113 1054400 1027851 1002301 978395 956147 935331 915888 897692 880226
62321 880226 862782 844900 826526 807895 789367 771180 753187 734945 716190 697091 678033
62310 678033 659303 641155 623935 608004 593578 580808 569869 560810 553386 547166 541829 537278
62298 537278 533539 530584 528245 526329 524871 524209 524611 525866 527432 528997 530695 532825 535642 539426 544354
62283 544354 550103 555888 561192 566284 571798 578005 584739 591898 599715 608532 618432 629059 639834 650563
62269F50563J1344J3044J5159J6606J7189J7723J8891K0583K2456K4528K6869
62258H54955K9219L1318L3285L5336L7365L9066M0262M0879M0786L9839L7895
62247A260205L4714L0222K4853J9235J3375O746o58p905j4179j9632k4775k9591
62235A292610l3867l7852m1782m5040m6654m6525m5428m3882m1671l8535l4742
62224H36632l0844k7295k4367k1948j9487j6673j4114j2753j2528j2289j1150
62213F33184r340p452n644l914k639k196k319k309j773q72M6P99J454K209L076
62198F02310L723L874L863M317N220N816N693N441N830O763P579Q009Q316Q636
62184F85390Q778Q673Q511Q389Q171P782P371P119P030P001O892O671O590P116
$$ plain form
62269 650563 661907 674951 690110 706716 723905 741628 760519 781102 803558 828086 854955
62258 854955 884174 915492 948777 984113 1021478 1060544 1100806 1141685 1182471 1222310 1260205
62247 1260205 1294919 1325141 1349994 1369229 1382604 1389350 1388692 1380787 1366608 1346976 1322201 1292610
62235 1292610 1258743 1220891 1179109 1134069 1087415 1040890 995462 951580 909909 871374 836632
62224 836632 805788 778493 754126 732178 712691 696018 681904 669151 656623 644334 633184
62213 633184 623844 616392 610748 606834 604195 601999 599680 597371 595598 594726 594772 595571 597025 599234 602310
62198 602310 606033 609907 613770 618087 623307 629123 634816 640257 646087 652850 660429 668438 676754 685390
62184 685390 694168 702841 711352 719741 727912 735694 743065 750184 757214 764215 771107 777778 784368 791484
62170G91484Q471J0329J2256J4279J6668J9266K1472K3002K4278K5888K7783K9191
62158A024367K9246K7647K4811K1417J7820J3952R676N055K27m627r035j2342
62146A148214j4444j6118j8142k0260k1528k1599k1070k0549j9992j9096j7762
62135I37654j5955j3583j0956q824p558o680n644m732m575n011n183m787m467
62122H39699m760n134m641l177j596o55k85K6M74Q75J146J502K042K300J515n81
62106H28750l314n532o573o704o644o755o830o601o255o189o443o621o437o069
62092G41783n752n296m319k838j279Q2J341K557L490M009M465N336O649Q039R316
62077G67583J0658J2195J3707J4854J5570J6086J6651J7287J7792J7959J7810
$$ plain form
62170 791484 799955 810284 822540 836819 853487 872753 894225 917227 941505 967393 995176 1024367
62158 1024367 1053613 1081260 1106071 1127488 1145308 1159260 1168936 1173991 1174218 1169591 1160556 1148214
62146 1148214 1133770 1117652 1099510 1079250 1057722 1036123 1015053 994504 974512 955416 937654
62135 937654 921699 908116 897160 888336 880778 874098 868454 863722 859147 854136 848953 844166 839699
62122 839699 834939 829805 825164 821987 820391 819736 819451 819477 819951 820826 821972 823474 825516 827816 829331 828750
62106 828750 825436 819904 813331 806627 799983 793228 786398 779797 773542 767353 760910 754289 747852 741783
62092 741783 736031 730735 726416 723578 722299 722381 723722 726279 729769 733778 738243 743579 750228 758267 767583
62077 767583 778241 790436 804143 818997 834567 850653 867304 884591 902383 920342 938152
62066I38152J7648J7756J8089J8375J8548J8872J9460J9864J9359J7679J5234
62055A139036J2592R934P075L877M50k994o291r444j2660j6236k0188k4036k7061
62042A054054k8891k9790l0402l1242l2339l3166l3067l1916l0345k9081k8158
62031G15657k7042k5408k3410k1233j8888j6632j4955j3886j2741j0992q984p424
62019E14062o523o138o315o962p298o464m723l289k849k850k432j486m79L33J113
62004D57700K073L115L775L644L058L050M113N331N443M579L920L749L115J719
61990E08384P52J038J472M69j853m075n515o547p293p351o871o683p046p225o635
61975D45021n644m862m343l838l321k954k843l060l505l722l239k209j276p86
$$ plain form
62066 938152 955800 973556 991645 1010020 1028568 1047440 1066900 1086764 1106123 1123802 1139036
62055 1139036 1151628 1161562 1168637 1172514 1172964 1169970 1163679 1154235 1141575 1125339 1105151 1081115 1054054
62042 1054054 1025163 995373 964971 933729 901390 868224 835157 803241 772896 743815 715657
62031 715657 688615 663207 639797 618564 599676 583044 568089 554203 541462 530470 521486 514062
62019 514062 507539 501401 495086 488124 480826 474362 469639 466350 463501 460651 458219 456733 456254 456587 457700
62004 457700 459773 462888 466663 470307 473365 476415 480528 485859 491302 495881 499801 503550 506665 508384
61990 508384 509136 510174 511646 512115 510262 506187 500672 494125 486832 479481 472610 465927 458881 451656 445021
61975 445021 439377 434515 430172 426334 423013 420059 417216 414156 410651 406929 403690 401481 400205 399419
61961C99419o01o49r96j347j205o74m45o91o96O5J119J741J919K070K329K621
61945D03979L018L539L884L939M224N296O884Q142Q636Q700Q865R283R712R789
61931D97890R383Q768Q331Q057P533O567N431M424L545K773K225J874J522J262
61917E69585J381J655J397N91K27R96K340L399M231N266O219O577O710P382Q394
61902F26350Q744Q114P176O402N509M204K614R18p09j745j793j475j887k968l454
61887F56000k722j678j371j658j876j963k205k619l252m469o251p830q718r472
61873E99916j0636j1577j1336j0148r087q449p586o211m761l451j987m19O82J247
61859E16197K037L468M833N332N340N983P751J0106J2217J3608J4123J3842J3186
$$ plain form
61961 399419 398818 398169 397173 395826 394621 393947 393502 392811 392115 392180 393299 395040 396959 399029 401358 403979
61945 403979 406997 410536 414420 418359 422583 427879 434763 442905 451541 460241 469106 478389 488101 497890
61931 497890 507273 516041 524372 532429 539962 546529 551960 556384 559929 562702 564927 566801 568323 569585
61917 569585 570966 572621 574018 574609 574836 575832 578172 581571 585802 591068 597287 603864 610574 617956 626350
61902 626350 635094 643208 650384 656786 662295 666499 669113 670031 669322 667577 665784 664309 662422 659454 656000
61887 656000 653278 651600 650229 648571 646695 644732 642527 639908 636656 632187 625936 618106 609388 599916
61873 599916 589280 577703 566367 556219 547132 538683 531097 524886 520125 516674 514687 514268 514950 516197
61859 516197 518234 521702 526535 531867 537207 543190 550941 561047 573264 586872 600995 614837 628023
61846F28023J2820J3172J3980J4398J3662J1773R504P563N883M011K037N92q6
61833G37332o36j723l094l929l813k993j833n25P37J769K705L816M901N255M477
61818G42446L033J672N26q70k748m727o277p275p962q583r220r824j0276j0479
61804F69436j0449j0231r733q851p800p053o809o772o639o557o771p087p091o810
61790E60783o617o483n875m574l186k458k445k551k275j585q12l80n19r83j181
61775E18859p86r1L87N26N54O90J070J886L168M523N396N617N521N522N882O785
61759E65509Q234R861J1092J1601J1438J0755R672Q358O923N202K963L86k063
61746F59931m231o387q545j0102j0498r967r345r267r680j0073r906q987p583
$$ plain form
61846 628023 640843 654015 667995 682393 696055 707828 717332 724895 730778 734789 736826 737418 737332
61833 737332 736696 734973 731879 727950 724137 721144 719311 718786 719523 721292 723997 727813 732714 737969 742446
61818 742446 745479 747151 747677 746807 744059 739332 733055 725780 717818 709235 700015 690191 679915 669436
61804 669436 658987 648756 639023 630172 622372 615319 608510 601738 595099 588542 581771 574684 567593 560783
61790 560783 554166 547683 541808 537234 534048 531590 529145 526594 524319 522734 521922 521542 521023 520040 518859
61775 518859 518073 517982 518369 518895 519449 520139 521209 523095 526263 530786 536182 541799 547320 552842 558724 565509
61759 565509 573743 583604 594696 606297 617735 628490 638162 646520 653443 658645 661608 661994 659931
61746 659931 655700 649313 640768 630666 620168 610201 600856 591589 581909 571836 561930 552943 545360
61733E45360o144m869l716k810k469k678k870k563j938j472j260j071q56p46o43
61718E09255k99J94M62M25L91M40J97n87j565k118j976j351p62q26j901l587m882
61701D91510n086m437l658l099k693k435k502k903l410l816m068m140m079m041
61687D41143m059l880l383k958l021l217k777j714r59j058j422j335j073j306
61673D08981j832j789j044m62o85j293j551j324r32n59k56k12m45m41L94J836
61657C98386K929L047K575K357K657K991K939K750K833K887K048J67j482j405
61643D25679K50J696J518J59r56j153q26l79K14Q62J067N68k30p14o97m04j33
61626D26521j58o43j367j816j823j872k382l004l071k627k478l079l923m191l725
$$ plain form
61733 545360 539216 534347 530631 527821 525352 522674 519804 517241 515303 513831 512571 511500 510644 509898 509255
61718 509255 508956 509150 509612 510037 510428 510868 511065 510478 508913 506795 504819 503468 502706 501880 499979 496392 491510
61701 491510 486424 481987 478329 475230 472537 470102 467600 464697 461287 457471 453403 449263 445184 441143
61687 441143 437084 433204 429821 426863 423842 420625 417848 416134 415175 414117 412695 411360 410287 408981
61673 408981 407149 405360 404316 403854 403169 401876 400325 399001 398069 397510 397254 397042 396597 396156 396550 398386
61657 398386 401315 404362 406937 409294 411951 414942 417881 420631 423464 426351 428399 428566 427084 425679
61643 425679 425929 427625 429143 429302 428346 427193 426367 425988 426202 427064 428131 428699 428469 427755 427058 426654 426521
61626 426521 426363 425720 424353 422537 420714 418842 416460 413456 410385 407758 405280 402201 398278 394087 390362
61611C90362l013k506k312k407k797l330l650l536l195l091l380l694l567l017
61597C46867k504k299k177j949j935k508l301l423k587j501r13p02l27K24M10
61582C21375l9p96j346j386q63o3M53L94K30O23J368J508O57m18q05n28j40K35
61564C20459Q17J482J831J893K102K530K683K176J284O13M82P47R86Q71N15L97
61548C41868O93R08N27r4q5O84J337J207P12N80O64K17q12j427p61P90J967K028
61530C51003J409R20N75k31j478k118j377LN69l2q43j218j617k453l017k382p74
61513C36939O75J338J493J534J524J475J426J163M24m40n25O18K395L734L956
61498C57729L065J622N48N59J459K215K084J431J126J368J534J133M23n0j27L4
$$ plain form
61611 390362 387349 384843 382531 380124 377327 373997 370347 366811 363616 360525 357145 353451 349884 346867
61597 346867 344363 342064 339887 337938 336003 333495 330194 326771 324184 322683 321770 321068 320741 320965 321375
61582 321375 321336 320540 319194 317808 316945 316882 317335 317729 317959 318582 319950 321458 322115 321697 320892 320364 320224 320459
61564 320459 321276 322758 324589 326482 328584 331114 333797 335973 337257 337870 338352 339099 340085 340956 341471 341868
61548 341868 342561 343469 343996 343902 343817 344501 345838 347045 347757 348337 349001 349218 348406 346979 346218 347008 348975 351003
61530 351003 352412 353332 353907 353676 352198 350080 348703 348706 349275 349243 348400 347182 345565 343112 340095 337713 336939
61513 336939 337614 338952 340445 341979 343503 344978 346404 347567 347991 347551 347026 347644 350039 353773 357729
61498 357729 360794 362416 362964 363523 364982 367197 369281 370712 371838 373206 374740 375873 376296 376246 376119 376153
61482C76153L93R94J504J375O46J65O87J898K762K660J773N28o87j305q67K47
61466C88926R91R74R00J250J314L17j063j357k81R69J317P97n7q09r75k38Q03
61449C93778J030L31o7O94J887K282J724R29L74K13P04J766K471J934N62m18n04
61432D09690j76J93O23Q24K76p07r91j66P23N54m06r29k79J227K678L178K386
61415D18698Q85l10q07j026j177q82j67O6o17j139l34J091J282k13j928k542k241
61398D08639j691r43k9L97l6n46k02P04J206J221J497K160K374J743J139J597
61382D19230K896L842L740L086K805L151L647L859L887M010M103L851L327K949
61368D68383K765K373J675J133R48O30j37o99k89P74J549J803K047K393K405K111
$$ plain form
61482 376153 376546 377540 379044 380419 381065 381230 381917 383815 386577 389237 391010 391538 390851 389546 388679 388926
61466 388926 389917 390891 391791 393041 394355 394672 393609 392252 391971 392940 394257 395054 394997 394188 393213 392975 393778
61449 393778 394808 395139 395072 395766 397653 399935 401659 402588 402962 403175 403879 405645 408116 410050 410612 410194 409690
61432 409690 409514 409707 410330 411154 411430 410723 409732 409566 410289 410843 410437 409508 409229 410456 413134 416312 418698
61415 418698 419583 419273 418466 417440 416263 415381 415214 415280 414663 413524 413190 414281 415563 415350 413422 410880 408639
61398 408639 406948 406005 405976 406373 406337 405791 405589 406293 407499 408720 410217 412377 414751 416494 417633 419230
61382 419230 422126 425968 429708 432794 435599 438750 442397 446256 450143 454153 458256 462107 465434 468383
61368 468383 471148 473521 475196 476329 477277 477907 477770 477071 476782 477556 479105 480908 482955 485348 487753 489864
61352D89864K203K904L528L506L130K924K932K995L072K947K272J381J238K039
61338E26935K624J981O90K5K20N27N51M89L56k0l31j18K65j3r24j498j249p37
61320E29773m36M4J110K332K970K950K840L193M272N997P872R298J0260J1294
61306E93769J2587J3569J3734J3346J2890J2284J1063R124O789M411K227L61j317
61293G04837l044m584n270n069n048o119p676q304p689o939o929p193o839n849
61279F18285m935m493m277l943l436k839k159j354m15N61J349J662J411Q73M83
61264E96773M37N94P99J127J727K493L059L162K919K679K674K876L135L346L492
61249F31292L569L503L183K636K142J997K083J866R95k16j116j404j319j239j390
$$ plain form
61352 489864 492067 494971 498499 502005 505135 508059 510991 513986 517058 520005 522277 523658 524896 526935
61338 526935 529559 531540 532230 532255 532475 533002 533553 534042 534398 534378 534047 533929 534194 534181 533257 531759 530510 529773
61320 529773 529337 529381 530491 532823 535793 538743 541583 544776 549048 555045 562917 572215 582475 593769
61306 593769 606356 619925 633659 647005 659895 672179 683242 692366 699155 703566 705793 706154 704837
61293 704837 701793 697209 691939 686870 681822 675703 668027 659723 652034 645095 638166 630973 624134 618285
61279 618285 613350 608857 604580 600637 597201 594362 592203 590849 590434 590995 592344 594006 595417 596290 596773
61264 596773 597210 597804 598603 599730 601457 603950 607009 610171 613090 615769 618443 621319 624454 627800 631292
61249 631292 634861 638364 641547 644183 646325 648322 650405 652271 653266 653050 651934 650530 649211 647972 646582
61234F46582j814k326k490j954q35M21J563K606L469L966M187M508N089N723O251
61219F74946O775P338P766Q039Q336Q531Q148P162O340O269O380N670M188L079
61205G68967L100L730M011L787L730M417N707O987P797Q192Q578R147R597R498
61191H57245Q909Q325P931P252N796L851K233J225J96j503l551n022n616o023
61177H81248o937q181r127r565r788r987j0100j0117j0142j0163j0128j0172j0409
61164G56432j0612j0537j0398j0546j0731j0365r502q853q671q359p484o440n724
61151F38210n171m395l448k583j826j305j411k168k950l409m044n150n824n045
61137E89481l281j959j517j118k80M61P85J340K715M476N882O904P966R131J0208
$$ plain form
61234 646582 644768 642442 639952 637998 637163 637584 639147 641753 645222 649188 653375 657883 662972 668695 674946
61219 674946 681721 689059 696825 704864 713200 721731 729879 737041 743381 749650 756030 761700 765888 768967
61205 768967 772067 775797 779808 783595 787325 791742 797449 804436 812233 820425 829003 838150 847747 857245
61191 857245 866154 874479 882410 889662 895458 899309 901542 902767 902963 901460 897909 892887 887271 881248
61177 881248 874311 866130 857003 847438 837650 827663 817563 807446 797304 787141 777013 766841 756432
61164 756432 745820 735283 724885 714339 703608 693243 683741 674888 666217 657858 650374 643934 638210
61151 638210 633039 628644 625196 622613 620787 619482 618071 615903 612953 609544 605500 600350 594526 589481
61137 589481 586200 584241 582724 581606 581326 581787 582572 583912 586627 591103 596985 603889 611855 620986 631194
61122F31194J1350J2894J4759J6471J7786J8889K0029K1200K2142K2511K2166
61111H31391K1468K1087K1285K1502K0952J9525J7847J6433J5100J3282J0780
61100A030652P959N238K553m43l766o899r362j1289j3150j5032j6467j7067j7066
61087I35861j7059j7339j7620j7443j6723j5808j5041j4419j3768j3033j2183
61076G65425j0995r269p248n460m133l133k442k118j699l65J862L796M491M518
61062G33230N124O513P783Q323Q568R292J0765J2654J4258J4996J5028J5307J6535
61049H78376J8312J9836K1050K2378K3670K4495K5283K7016K9560L1488L2036
61038A153500L2237L3381L5220L6553L7113L7835L9380M1238M2501M3146M4095
$$ plain form
61122 631194 642544 655438 670197 686668 704454 723343 743372 764572 786714 809225 831391
61111 831391 852859 873946 895231 916733 937685 957210 975057 991490 1006590 1019872 1030652
61100 1030652 1038611 1043849 1046402 1045959 1042193 1035294 1025932 1014643 1001493 986461 969994 952927 935861
61087 935861 918802 901463 883843 866400 849677 833869 818828 804409 790641 777608 765425
61076 765425 754430 745161 737913 732453 728320 725187 722745 720627 718928 718563 720425 724221 728712 733230
61062 733230 738354 744867 752650 760973 769541 778833 789598 802252 816510 831506 846534 861841 878376
61049 878376 896688 916524 937574 959952 983622 1008117 1033400 1060416 1089976 1121464 1153500
61038 1153500 1185737 1219118 1254338 1290891 1328004 1365839 1405219 1446457 1488958 1532104 1576199
61027A576199M6091M8732N1046N2865N5081N8084O0820O2293O3447O6363P1658
61016B212679P8030Q4562R2062J01708J13670J27941J45408J67148J93585K25493
61006C542286K65214L15755L78897M54696N42090O39184P43900Q55788R76892
60997H714702J109498J252543J399371J535771J637961J676383J630111J502312
60989B0458652J318470J104915Q70923O16853L58099J30707l5221j45903k40679
60980B4436816l57287n05622o76948q68877j088358j328152j550155j701440j748344
60971A4611633j694380j569511j408102j235888j068732r15153p78261o58077
60963E283529n54109m66205l93584l34140k85216k44786k11726j85158j63836
$$ plain form
61027 1576199 1622290 1671022 1722068 1774933 1830014 1888098 1948918 2011211 2074658 2141021 2212679
61016 2212679 2290709 2375271 2467333 2569041 2682711 2810652 2956060 3123208 3316793 3542286
61006 3542286 3807500 4123255 4502152 4956848 5498938 6138122 6882022 7737810 8714702
60997 8714702 9824200 11076743 12476114 14011885 15649846 17326229 18956340 20458652
60989 20458652 21777122 22882037 23752960 24369813 24727912 24858619 24823398 24677495 24436816
60980 24436816 24079529 23573907 22896959 22028082 20939724 19611572 18061417 16359977 14611633
60971 14611633 12917253 11347742 9939640 8703752 7635020 6719867 5941606 5283529
60963 5283529 4729420 4263215 3869631 3535491 3250275 3005489 2793763 2608605 2444769
60954B444769j46319j31537j18823j07446r6732q6820p8535p2037o6252o0389
60944A479879n5331n2439n1400n0403m8394m5886m3535m1124l8342l5487l2848
60933I84690l0259k7758k5889k4799k3809k2361k0704j9118j7256j5016j3256
60922G44465j2678j2526j1431r342p584o986o903o340n244m337m118m454m835
60909F47687m741l986k944k293k300k450k068j206p29j275k361k846k333j705
60895F14450j946k832l366l317l534m553n676n940n493n305n766o222o056n556
60881E48888n433n753n867n397m870n002n631n853n300m638m482m438l831k921
60867D79472k513k577k214j053L15J417K455L365L405K341J276J418K536L457
$$ plain form
60954 2444769 2298450 2166913 2048090 1940644 1843912 1757092 1678557 1606520 1540268 1479879
60944 1479879 1424548 1372109 1320709 1270306 1221912 1176026 1132491 1091367 1053025 1017538 984690
60933 984690 954431 926673 900784 875985 852176 829815 809111 789993 772737 757721 744465
60922 744465 731787 719261 707830 698488 690904 683918 677015 670675 665431 661094 656976 652522 647687
60909 647687 642946 638960 636016 633723 631423 628973 626905 625699 624970 623695 621334 618488 616155 614450
60895 614450 612504 609672 606306 602989 599455 594902 589226 583286 577793 572488 566722 560500 554444 548888
60881 548888 543455 537702 531835 526438 521568 516566 510935 505082 499782 495144 490662 486224 482393 479472
60867 479472 476959 474382 472168 471115 471430 472847 475302 478667 482072 484413 485689 487107 489643 493100
60853D93100L614L375L157L058L128L251K966K095J278J188J394R26k26j104j285
60838E19915j433k146l119l820m273m717n038m966m465l737l131l064l505l560
60824D68941k443r11p42k345l961l993l158l222m296m826m039k946k694l133l554
60809D22678l867m281m522m174l527l274l528l666l285k705k387k275k013j561
60795C77613j226j140j013n79n9Q6k06m67k78K91Q89J322J477J166L88l43l74
60778C77547L37J236J868K217K241J741R18N53J128K096K524K213J666J202P64
60763D00251N32R18J750K130J511M63r9m4R8L1r6k73p85j657k386k428j782r55
60745C97179m99o09j021j240j041p53r02j637k625l455l879l752l089k256j792
$$ plain form
60853 493100 496714 500089 503246 506304 509432 512683 515649 517744 519022 520210 521604 522530 522304 521200 519915
60838 519915 518482 516336 513217 509397 505124 500407 495369 490403 485938 482201 479070 476006 472501 468941
60824 468941 466498 465587 464845 462500 458539 454546 451388 448166 443870 439044 435005 432059 429365 426232 422678
60809 422678 418811 414530 410008 405834 402307 399033 395505 391839 388554 385849 383462 381187 379174 377613
60795 377613 376387 375247 374234 373655 373596 373682 373476 373009 372731 373022 373911 375233 376710 377876 378264 377921 377547
60778 377547 377884 379120 380988 383205 385446 387187 388105 388658 389786 391882 394406 396619 398285 399487 400251
60763 400251 400783 401701 403451 405581 407092 407555 407456 407412 407510 407541 407445 407172 406387 404730 402344 399916 398134 397179
60745 397179 396680 396071 395050 393810 392769 392016 391114 389477 386852 383397 379518 375766 372677 370421 368629
60730C68629j895k302k771l289l725l630k741j438l58K44M63L23j15l49K41J514
60714C48801K537K675K267J988J916J655J119O38M21L81N04Q92J376J575J500
60699C70245J651K194K523K053J124O01P54J091J164J023Q76Q18R42J191J080
60684C89330J87r85j329o44j9k48o17q0R70J213M12k35J28R92J532J685J592Q19
60666C94703r87l033l928l191j685n77l17o71j168j461j526j661k023k230j681
60651C68564l30J168K131K437K351K091J696J175N52r0o09q55q44p11n64n09q46
60634C76807j815l036l537k760j363n30n38n43R5Q53Q24J2p37q79o01j69M57J172
60616C63712J504J258R08Q98R23N06j31l29j0K78K56K27L56K93j75o44n36K64
$$ plain form
60730 368629 366734 364432 361661 358372 354647 351017 348276 346838 346480 346724 347187 347510 347395 347046 347287 348801
60714 348801 351338 354013 356280 358268 360184 361839 362958 363596 364017 364398 364902 365794 367170 368745 370245
60699 370245 371896 374090 376613 378666 379790 380391 381145 382236 383400 384423 385299 386117 387059 388250 389330
60684 389330 389517 388532 387203 386559 386540 386292 385675 385595 386565 387778 388190 387955 388083 389075 390607 392292 393884 394703
60666 394703 393716 390683 386755 383564 381879 381302 380985 380314 379146 377685 376159 374498 372475 370245 368564
60651 368564 368234 369402 371533 373970 376321 378412 380108 381283 381835 381745 381136 380281 379437 378726 378162 377653 376807
60634 376807 374992 371956 368419 365659 364296 363766 363228 362685 362780 363633 364457 364469 363732 362853 362252 362083 362540 363712
60616 363712 365216 366474 367382 368280 369203 369709 369578 369249 369239 369517 369773 370000 370356 370649 370474 369830 369294 369558
60598C69558J447K537K983K472J459R09J161J496J255R06J321K399L150L029K388
60583C98470J648P52k72r14p25J42J241K358L351L883L749L324L219L579M064
60568D27869M512N235O521Q151R530J0204J0075R261P965O533N418M831M396L387
60554E23888J539m96j749k026k052k387k613j943m43Q85J320J280J767L277N542
60539E25789Q011J0242J1902J2903J3618J4622J6026J7306J7917J7824J7276J6296
60527F99732J4675J2339R405N958K095j794n065p326q709r626j0302j0685j0621
60514F80076j0011q893p421n847m444l420k769k169j128O23K869N215P581J0276
60500F60538J3529J7032K0111K2404K4345K6850L0305L3895L6264L6899L6528
$$ plain form
60598 369558 371005 373542 376525 378997 380456 381365 382526 384022 385277 386183 387504 389903 393053 396082 398470
60583 398470 400118 400870 400598 399684 398959 399101 400342 402700 406051 409934 413683 417007 420226 423805 427869
60568 427869 432381 437616 444137 452288 461818 472022 482097 491358 499323 505856 511274 516105 520501 523888
60554 523888 525427 524931 523182 521156 519104 516717 514104 512161 511718 512603 513923 515203 516970 520247 525789
60539 525789 533800 544042 555944 568847 582465 597087 613113 630419 648336 666160 683436 699732
60527 699732 714407 726746 736151 742109 744204 742410 737345 730019 721310 711684 701382 690697 680076
60514 680076 670065 661172 653751 647904 643460 640040 637271 635102 633974 634597 637466 642681 650262 660538
60500 660538 674067 691099 711210 733614 757959 784809 815114 849009 885273 922172 958700
60489I58700L6001L5180L3361L0428K7019K3577J9852J5402J0184M504j216o546
60477A186446j1338j6001k1152k6811l2322l7062m0809m3353m4363m3918m2639
60466H26678m0927l8541l5355l1982k9107k6558k3724k0627j7945j6029j4465
60455E31418j2729j0748q785p149o095n608n267m621l758l215l254l556l682l508
60441D49443l135k662k219j982k033k233k365k267j868j230n41L4M67P35P13L14
60425D29171k59o65p25n09j90O7K13M25Q41J148P98o8m71K09J279J648J289J018
60407D35219J057Q42K79J42Q37J698K025K125K661L487L815L244K118J092P90
60392D61431J487K650L155K559J774J887K627K889K505K502L414M373M261L123
$$ plain form
60489 958700 994701 1029881 1063242 1093670 1120689 1144266 1164118 1179520 1189704 1194208 1192992 1186446
60477 1186446 1175108 1159107 1137955 1111144 1078822 1041760 1000951 957598 913235 869317 826678
60466 826678 785751 747210 711855 679873 650766 624208 600484 579857 561912 545883 531418
60455 531418 518689 507941 499156 492007 485912 480304 475037 470416 466658 463443 460189 456633 452951 449443
60441 449443 446308 443646 441427 439445 437412 435179 432814 430547 428679 427449 426908 426942 427409 428144 428857 429171
60425 429171 428912 428247 427522 427013 426823 426890 427103 427528 428369 429517 430315 430247 429776 429985 431264 432912 434201 435219
60407 435219 436276 437118 437397 437539 438376 440074 442099 444224 446885 450372 454187 457431 459549 460641 461431
60392 461431 462918 465568 468723 471282 473056 474943 477570 480459 482964 485466 488880 493253 497514 500637
60378E00637J865J146J070J513K135K363J944J418J463J965K184J830J309R28
60364E23770M64k32p30n40K19J007J536J930K320K671K908L052L260L813M815
60349E50263N728N624M275K739K305K981L563L185K120J028O4r29j931k866l876
60334E74273m969n710n640m863l942l416l617m567n674n906m754k922j566j102
60320E15625j156j433j949k417k154q59Q97K290L040L465L997M839N997P391Q954
60305E46527J0522J1749J2329J2438J2581J2833J2583J1381R529P364M503O63
60293F65002l188n656o824q225j0602j2881j3798j3507j2806j1731r911p758o165
60280E41950n265m434l445k808k922l585m400n047n139m458l504l174l685m263
$$ plain form
60378 500637 502502 503648 504718 506231 508366 510729 512673 514091 515554 517519 519703 521533 522842 523770
60364 523770 524234 524002 523272 522732 522951 523958 525494 527424 529744 532415 535323 538375 541635 545448 550263
60349 550263 555991 561615 565890 568629 570934 573915 577478 580663 582783 583811 583875 582946 581015 578149 574273
60334 574273 569304 563594 557954 553091 549149 545733 542116 537549 531875 525969 521215 518293 516727 515625
60320 515625 514469 513036 511087 508670 506516 505657 506554 508844 511884 515349 519346 524185 530182 537573 546527
60305 546527 557049 568798 581127 593565 606146 618979 631562 642943 652472 659836 664339 665002
60293 665002 661814 656158 649334 641109 630507 617626 603828 590321 577515 565784 555873 548115 541950
60280 541950 536685 532251 528806 525998 523076 519491 515091 510044 504905 500447 496943 493769 490084 485821
60266D85821m123l368k641k331k346k402k254j788j106m24J22M29K83l83j120
60251D62369j261o63J83Q61J358J653J526J081R00J264J734J927K143K615K659
60236D80349J564M1l88N11J322J096O94J297K474K896K478K543L849N478O078
60221E12282N482M652M475N042N810O183O009N688N656N843N851N657N689O155
60207E90474O781P256P526P521P081O398O017O118O194N804N192M803M562M034
60193F75761L079J932R01L00K84M95K42o19j434j807k294l444m701n049m409l624
60177F55613l257l229l438l837m001l456k505j964k112k525k934l383l613l219
60163F12140k449k042k095k005j635j560j949k176j902j622j689j729j398r08
$$ plain form
60266 485821 481698 478330 475689 473358 471012 468610 466356 464568 463462 463038 463160 463589 463872 463489 462369
60251 462369 461108 460445 460628 461489 462847 464500 466026 467107 468007 469271 471005 472932 475075 477690 480349
60236 480349 481913 481954 481566 482077 483399 484495 485189 486486 488960 491856 494334 496877 500726 506204 512282
60221 512282 517764 522416 526891 531933 537743 543926 549935 555623 561279 567122 572973 578630 584319 590474
60207 590474 597255 604511 612037 619558 626639 633037 639054 645172 651366 657170 662362 667165 671727 675761
60193 675761 678840 680772 681673 681973 682257 682752 682994 682375 680941 679134 676840 673396 668695 663646 659237 655613
60177 655613 652356 649127 645689 641852 637851 634395 631890 629926 627814 625289 622355 618972 615359 612140
60163 612140 609691 607649 605554 603549 601914 600354 598405 596229 594327 592705 591016 589287 587889 586981
60149E86981l43N74J544J657R11O98J761K825K387J093Q49K080L371L648L348
60134F13384L230L298L290L334L649M105M436M521M377M210M446N239O028O062
60120F73609N340M573M258M281M368M477M689N088N682O155N904M760L441K757
60106G39382K581K179J353O23L06J48j21m30o75r02j160j500k094k880l309k941
60090G30560k130j627j613j768j995k459k983l235l366l776m254m225l794l680
60076F89655m097m550m881n510o369o664o172n806o269o971p005o561o501o992
60062F05307p372p156o486n659m792m017l573l597m007m472m514l845k699j594
60048E41524p17J62J156K015K606L145L730M076L959L635L541L842M388M808M632
$$ plain form
60149 586981 586638 587212 588756 590413 591324 592022 593783 596608 598995 600088 600937 603017 606388 610036 613384
60134 613384 616614 619912 623202 626536 630185 634290 638726 643247 647624 651834 656280 661519 667547 673609
60120 673609 678949 683522 687780 692061 696429 700906 705595 710683 716365 722520 728424 733184 736625 739382
60106 739382 741963 744142 745495 746118 746424 746572 746451 746021 745346 744444 743284 741784 739690 736810 733501 730560
60090 730560 728430 726803 725190 723422 721427 718968 715985 712750 709384 705608 701354 697129 693335 689655
60076 689655 685558 681008 676127 670617 664248 657584 651412 645606 639337 632366 625361 618800 612299 605307
60062 605307 597935 590779 584293 578634 573842 569825 566252 562655 558648 554176 549662 545817 543118 541524
60048 541524 540807 540969 542125 544140 546746 549891 553621 557697 561656 565291 568832 572674 577062 581870 586502
60033E86502L706K576J988J903J565O33l56q98j214j703k318k850l403m079m683
60018E77369n066n403n808o165o598p457q473q636p478n882m974m730m359l537
60004D92803k569j682r42n43n28m79q4K74J65o7K39R59J435J508J598J836J950
59987D95873K012K480L401M151M147L419K477J956K183K681K344O80j371k494
59973E23939k575k494k639k589k191j911j975j980j655j250r48o08k66k02l32
59958E00324j78L29P35R13J281J916K206J870J490J551J650J272P74Q71J538K095
59942E20637K086J550O89k11p34o83l47n4K98R19J604J954J954J969K316L135
59926E37082M418N827O709O688O134N696N572N501N299N035M831M787M907M921
$$ plain form
60033 586502 590208 592784 594772 596675 598240 598873 598517 597619 596405 594702 592384 589534 586131 582052 577369
60018 577369 572303 566900 561092 554927 548329 540872 532399 523763 516285 510403 505429 500699 496340 492803
60004 492803 490234 488552 487610 487067 486539 486060 485976 486250 486415 486348 486587 487546 488981 490489 492087 493923 495873
59987 495873 497885 500365 503766 507917 512064 515483 517960 519916 522099 524780 527124 527804 526433 523939
59973 523939 521364 518870 516231 513642 511451 509540 507565 505585 503930 502680 501732 501124 500858 500656 500324
59958 500324 500146 500475 501210 502123 503404 505320 507526 509396 510886 512437 514087 515359 516133 517004 518542 520637
59942 520637 522723 524273 524962 524751 524017 523334 522987 522933 523231 524150 525754 527708 529662 531631 533947 537082
59926 537082 541500 547327 554036 560724 566858 572554 578126 583627 588926 593961 598792 603579 608486 613407
59912F13407M430L493K689K323J960J222N97P86J593K126K004J536Q60k63j614
59897F37149k286j736m98N81J355K185L097L742M001M140M290M214L756L221L119
59882F70330L641M557N525O270O505O041N109M395M305M375L680J921k39j984
59868G24431l038l518l572l473l664m303n048n579n957o127n528l928k252j722
59854F66722k200k251j017P33J809K081K315L011M032N142O276P275P811P680
59840G09419O967N908M694L438K240J245N68R2n31j412k126k241k137k777m473
59825G18874o373p435p548p326p199p176p173p065o515n335l997l369l722m407
59811F34234m577m023l173k531k289k333k485k685k943l138l007k422j562p05
$$ plain form
59912 613407 617837 621330 624019 626342 628302 629524 630121 630907 632500 634626 636630 638166 639026 638763 637149
59897 637149 634863 633127 632629 633210 634565 636750 639847 643589 647590 651730 656020 660234 663990 667211 670330
59882 670330 673971 678528 684053 690323 696828 702869 707978 712373 716678 721053 724733 726654 726415 724431
59868 724431 721393 717875 714303 710830 707166 702863 697815 692236 686279 680152 674624 670696 668444 666722
59854 666722 664522 662271 661254 661987 663796 665877 668192 671203 675235 680377 686653 693928 701739 709419
59840 709419 716386 722294 726988 730426 732666 733911 734479 734571 734040 732628 730502 728261 726124 723347 718874
59825 718874 712501 705066 697518 690192 682993 675817 668644 661579 655064 649729 645732 642363 638641 634234
59811 634234 629657 625634 622461 619930 617641 615308 612823 610138 607195 604057 601050 598628 597066 596361
59797E96361LM09K82l51r63j047p70p23j064j343j219q73o13m51k79j25PK29M80
59778E87950L79k91j164j642j533j109o87l74j93r9J33P95J901L064L823M080
59762E95033M220M743N683O488O677O524O855Q016R409J0194J0193R914R828R964
59748G03741J0085R968R530Q809P828O514M868L217K023J344Q30L64K78O57R14
59733G70970N15k27o77q41j182j697j968k027k347k834k761j966j353j667k451
59718G47487k803k600k307j997j334l57M73J002J570K355L095L569L957M536N320
59703G61966O165O996P783Q472R034R503R914J0299J0674J0940J0884J0447R918
59690H82995R604R381Q803P563N664L291Q37j059j960k227k706l752m878n565
$$ plain form
59797 596361 596364 596773 597055 596704 595741 594694 593924 593201 592137 590794 589575 588702 588089 587638 587359 587234 587241 587470 587950
59778 587950 588329 588038 586874 585232 583699 582590 581903 581529 581336 581237 581370 582165 584066 587130 590953 595033
59762 595033 599253 603996 609679 616167 622844 629368 636223 644239 653648 663842 674035 683949 693777 703741
59748 703741 713826 723794 733324 742133 749961 756475 761343 764560 766583 767927 768757 769121 769399 770056 770970
59733 770970 771485 771258 770581 769740 768558 766861 764893 762866 760519 757685 754924 752958 751605 749938 747487
59718 747487 744684 742084 739777 737780 736446 736089 736562 737564 739134 741489 744584 748153 752110 756646 761966
59703 761966 768131 775127 782910 791382 800416 809919 819833 830132 840806 851746 862630 873077 882995
59690 882995 892599 901980 910783 918346 924010 927301 928138 927079 925119 922892 920186 916434 911556 905991
59676I05991n926o357o924p476q093q854r301q683o913m935l811l655l675l174
59662H18214k183j078J33J753L766N636O934P853Q797R640R812R071P785O406
59648H92539N048L689K372R33j091l850o752r017j0573j1934j3252j4072j4101
59635H19939j3737j3552j3524j3190j2352j1314j0431r717q967q112p333o915
59623F90795o981p327p557p495p414p744q500r150r136q376p254o229n569n296
59609E86767n183m831m015k951k102j645j385j159j087j168r83j70Q53J145L99
59594E62485n56o50K23J189J418Q57L0n18m81J8M18O3j153k629l632l927l746
59577E49409l391l111l089l284l368l148k924l008l061k478j433r32j461k188
$$ plain form
59676 905991 900065 893708 886784 879308 871215 862361 853060 844377 837464 832529 828718 825063 821388 818214
59662 818214 816031 814953 815086 816839 820605 826241 833175 841028 849825 859465 869277 878348 886133 892539
59648 892539 897587 901276 903648 904581 903490 899640 892888 883871 873298 861364 848112 834040 819939
59635 819939 806202 792650 779126 765936 753584 742270 731839 722122 713155 705043 697710 690795
59623 690795 683814 676487 668930 661435 654021 646277 637777 628627 619491 611115 603861 597632 592063 586767
59609 586767 581584 576753 572738 569787 567685 566040 564655 563496 562409 561241 560258 560088 560941 562086 562485
59594 562485 561929 561279 561502 562691 564109 564966 564996 564478 563997 564015 564433 564496 563343 560714 557082 553155 549409
59577 549409 546018 542907 539818 536534 533166 530018 527094 524086 521025 518547 517114 516182 514721 512533
59563E12533k004j003k05p1m5L37O11J55p25j023l04Q36J612J989K469L220L808
59546E22190L947M074M830O106P115P520P939R026J0497J1611J2292J3022J3719
59533F33888J3561J2173J0303Q786P367N121J846j496l714m367l866k923k031
59520F74648j278o45l68p90j767k607k924l213m209n816p218p912q158q333q362
59505F11048p943p001n722m422l491l198l394l560l356k861k221j315m8J256K130
59490E65902K495K738L217L933M685N329N785N968N866N658N638N905O177O060
59476F35356N491M848M498M367M096L476K531J287k47j803k876l219l121k942
59462F51742k567j574J5J549K418K765L274M254N279N797N908O201O893P452P196
$$ plain form
59563 512533 510529 509526 509321 509250 509205 509542 510153 510308 509583 508560 508256 509092 510704 512693 515162 518382 522190
59546 522190 526137 530211 535041 541147 548262 555782 563721 572747 583244 594855 607147 620169 633888
59533 633888 647449 659622 669925 678711 686078 691199 693045 691549 687835 683468 679602 676679 674648
59520 674648 673370 672725 672357 671567 669800 667193 664269 661056 656847 651031 643813 635901 627743 619410 611048
59505 611048 603105 596104 590382 585960 582469 579271 575877 572317 568961 566100 563879 562564 562516 563772 565902
59490 565902 568397 571135 574352 578285 582970 588299 594084 600052 605918 611576 617214 623119 629296 635356
59476 635356 640847 645695 650193 654560 658656 662132 664663 665950 665703 663900 661024 657805 654684 651742
59462 651742 649175 647601 647616 649165 651583 654348 657622 661876 667155 672952 678860 685061 691954 699406 706602
59447G06602O109M853M068L779L394K210O1k420m339n441o259p257q092q042o965
59432F82261n504m425m024m071l994l269j970q73n26l32Q98L449O328Q559J0184
59417F82691J1667J2955J3738J4293J5332J7004J8531J8920J7744J5326J2336
59406H50537R240O015K513q62l238m220m322m041l073j083J132K139J510Q1j517
59391H50811l630o607r825j2277j3514j3500j2194r918p664o204n175l783k163
59378G44357j198j150j318j146q63q22r67j225j699k071j520J53J857K330J604
59363G36322Q18P90J424K290L179M022M751N414O124O926P915R278J0968J2532
59349H12753J3628J4514J5604J6780J7595J7989J8200J8086J7271J5914J4674
$$ plain form
59447 706602 712711 717564 721632 725411 728805 731015 731076 728656 724317 718876 712617 705360 697268 689226 682261
59432 682261 676757 672332 668308 664237 660243 656974 655004 654131 653605 653273 654171 657620 663948 672507 682691
59417 682691 694358 707313 721051 735344 750676 767680 786211 805131 822875 838201 850537
59406 850537 859777 865792 868305 867443 864205 859985 855663 851622 848549 847466 848598 850737 852247 852328 850811
59391 850811 847181 840574 830749 818472 804958 791458 779264 769346 761682 755478 750303 746520 744357
59378 744357 743159 742009 740691 739545 738682 737860 736893 735668 733969 731898 730378 730531 732388 734718 736322
59363 736322 737140 737930 739354 741644 744823 748845 753596 759010 765134 772060 779975 789253 800221 812753
59349 812753 826381 840895 856499 873279 890874 908863 927063 945149 962420 978334 993008
59338I93008J3759J2648J0902Q690O315L823J292j049l182n303p280q745r897
59325A014981j1429j3379j4837j5278j5358j5836j6426j6562j6552j6929j7225
59314H45170j6517j5005j3857j3513j3179j2241j1127j0371r647q324o509m967
59302G09913m223m002l536k225j15K231M356O186P574Q002P219N742M186K348
59288G43656k80l359n896p544q752r591r471q216o513m784k649pK217L320M091
59273F86222N882Q699J1217J2525J2940J3062J2839J1969J0589R158P849O483
59261H09434M928L347J931O55o07j803k744l479m348n499o537o978o802o303n585
59246G69610m617l583k647j532J11J910L049L334L367L553L622L381L147L089
$$ plain form
59338 993008 1006767 1019415 1030317 1039007 1045322 1049145 1050437 1049388 1046206 1040903 1033623 1024878 1014981
59325 1014981 1003552 990173 975336 960058 944700 928864 912438 895876 879324 862395 845170
59314 845170 828653 813648 799791 786278 773099 760858 749731 739360 729713 721389 714880 709913
59302 709913 705690 701688 698152 695927 695812 698043 702399 708585 716159 724161 731380 737122 741308 743656
59288 743656 743376 740017 734121 726577 717825 708234 698763 690547 684034 679250 676601 676594 678811 682131 686222
59273 686222 692104 700803 712020 724545 737485 750547 763386 775355 785944 795102 802951 809434
59261 809434 814362 817709 819640 820295 819688 817885 815141 811662 807314 801815 795278 788300 781498 775195 769610
59246 769610 764993 761410 758763 757231 757342 759252 762301 765635 769002 772555 776177 779558 782705 785794
59232G85794K810K050J192N48k87j751l478m757n564o462p701q989r920j0211
59218G33274r710q667p785p488p351o737n753m984m501l830k937k475k823l367
59204F54866l169k045o91J89O46J260K243L058L159K896L266M657O347P383P522
59189F91587P123O646O569P256Q453R258R052Q128P098O075M927L782K835J916
59175G80705Q67l6n92j231k343l426l631l008k465k600l193l801m149m088l749
59160G43260l770m617n762o199n773n333n549o234p003p808q592r016q839q225
59146F50540p459o720o197o052o193o354o477o592o487n909n007m157l429k708
59132E70799k069j517o26P90J957K010J475J774L228M668N287N700O651P745Q234
$$ plain form
59232 785794 788604 790654 791846 792394 792107 790356 786878 782121 776557 770095 762394 753405 743485 733274
59218 733274 723564 714897 707112 699624 692273 685536 679783 674799 670298 666468 663531 661056 658233 654866
59204 654866 651697 649652 648961 649150 649796 651056 653299 656357 659516 662412 665678 670335 676682 684065 691587
59189 691587 698710 705356 711925 719181 727634 736892 745944 754072 761170 767245 772172 775954 778789 780705
59175 780705 781572 781536 780944 779713 777370 773944 770313 767305 764840 762240 759047 755246 751097 747009 743260
59160 743260 739490 734873 729111 722912 717139 711806 706257 700023 693020 685212 676620 667604 658765 650540
59146 650540 643081 636361 630164 624112 617919 611565 605088 598496 592009 586100 581093 576936 573507 570799
59132 570799 568730 567213 566587 567377 569334 571344 572819 574593 577821 582489 587776 593476 600127 607872 616106
59117F16106Q262Q512R120R696J0035J0184J0166J0042R944R688Q817P359N972
59104G33903M961L794K131O21Km6l21r60j639k462l657m633m425l101j842j509
59088G20817j826k095j969j350k66P75Q53m38k446m111n005n449n893o412o779
59073F78406o768o365n745n122m659m495m642m816m598l952l405l471l974m237
59059F12157l868l133k588k514k735k865k692k387k273k415k563k549k484k470
59045E74621k337j880j153m31J5M1k44m55k67J82N34Q26J410K223K742K885L285
59028E81997M263N246N751O324P719R547J0691J0854J0760J0823J0552R460P859
59015F91846O364N154M090L068J978O02j013k354k893k639k030j362o15L09J254
$$ plain form
59117 616106 624368 632880 642000 651696 661731 671915 682081 692123 702067 711755 720572 727931 733903
59104 733903 738864 742658 744789 745410 745412 745366 745045 744085 742446 739984 736327 731694 727269 724168 722326 720817
59088 720817 718991 716896 714927 713577 713311 714086 714939 714501 712055 707944 702939 697490 691597 685185 678406
59073 678406 671638 665273 659528 654406 649747 645252 640610 635794 631196 627244 623839 620368 616394 612157
59059 612157 608289 605156 602568 600054 597319 594454 591762 589375 587102 584687 582124 579575 577091 574621
59045 574621 572284 570404 569251 568820 568835 568876 568632 568177 567910 568092 568626 569452 570862 573085 575827 578712 581997
59028 581997 586260 591506 597257 603581 611300 620847 631538 642392 653152 663975 674527 683987 691846
59015 691846 698210 703364 707454 710522 712500 713102 712089 709735 706842 704203 702173 700811 700196 700505 701759
59000G01759J882K011J894J989K419K836K919K715K353J685O59j99k73K62N80
58985G25491L51J73O89J701K541L012L502M300N243O094O927P958R083R948J0490
58970G97503J1221J2614J4305J5260J4877J3609J2314J1353J0561R771Q847P439
58958I39674N248K546mk138m213o608r207j1568j3330j4375j4833j4998j5048
58945H41146j4847j4238j3499j3060j2807j2058j0480q586p088o002m832l362
58933G20287j960j028n25j63J18J15k33o11o87n14l94l88k65L3K59K66K02J40
58915G14652o5l47k53M34J315K036K852M005M961N146N101N972P868R722J0943
58900G74342J2151J3904J5600J6367J6344J6340J6594J6695J6450J6183J6163
$$ plain form
59000 701759 703641 705652 707546 709535 711954 714790 717709 720424 722777 724462 725121 724922 724649 724911 725491
58985 725491 725842 726015 726704 728405 730946 733958 737460 741760 747003 753097 760024 767982 777065 787013 797503
58970 797503 808724 821338 835643 850903 865780 879389 891703 903056 913617 923388 932235 939674
58958 939674 944922 947468 947464 945326 941113 934505 925298 913730 900400 886025 871192 856194 841146
58945 841146 826299 812061 798562 785502 772695 760637 750157 741571 734483 728481 723649 720287
58933 720287 718327 717299 716774 716611 716729 716844 716611 716000 715313 714799 714405 714017 713752 713785 714044 714310 714512 714652
58915 714652 714587 714240 713987 714421 715736 717772 720624 724629 729590 734736 739837 745809 753677 763399 774342
58900 774342 786493 800397 815997 832364 848708 865048 881642 898337 914787 930970 947133
58889I47133J6292J6444J6696J7189J7929J8610J8546J7066J4305J1332R176P822
58877A128540O572N044L336J390j041l690n685o482o539o822p810r231j0547j1414
58863A075621j1804j1906j1975j2130j2268j2225j1995j1834j2104j2919j3927
58852I40534j4527j4443j3962j3504j3120j2570j1805j1082j0661j0581j0732
58841H03547j0932j0951j0718j0440j0296j0062r381q448p903p903p730o682n068
58828F87033l799l166k586j555l49M69Q88J380K195L116L893M577N266N767N802
58813G08931N466N167M996M479L196J519L24k7m6l07p82j255j979l280m735n462
58797G16205n337n181n549n964n782n214m843m536l612j986l34Q66J859K997M232
$$ plain form
58889 947133 963425 979869 996565 1013754 1031683 1050293 1068839 1085905 1100210 1111542 1120718 1128540
58877 1128540 1135112 1140156 1143492 1144882 1143841 1140151 1134466 1127984 1121445 1114623 1106813 1097582 1087035 1075621
58863 1075621 1063817 1051911 1039936 1027806 1015538 1003313 991318 979484 967380 954461 940534
58852 940534 926007 911564 897602 884098 870978 858408 846603 835521 824860 814279 803547
58841 803547 792615 781664 770946 760506 750210 740148 730767 722319 714416 706513 698783 692101 687033
58828 687033 683234 680068 677482 675927 675578 676047 676935 678315 680510 683626 687519 692096 697362 703129 708931
58813 708931 714397 719564 724560 729039 732235 733754 734078 734051 734005 733698 732916 731661 729682 726402 721667 716205
58797 716205 710868 705687 700138 694174 688392 683178 678335 673799 670187 668201 667867 668733 670592 673589 677821
58782F77821N370O360P112P531P910Q657R374Q924O937M645L422K953J780n77
58768G58219l092m906o470q488j0526j1508j1198j0439j0018r931r770r332q576
58755F43965p423n939m459l329k515j711p65J75R32J496J918K191K341K577L144
58740F32598M040M954N573N903O179O506O605O051M779L347K584K842L603L894
58726F99458L250K241J854K306K652J896L64n30NJ184J823J949K451L468M062
58711G28433L664K898K512K245J386j99k156m311o522q360r623j0755j2042j2876
58697F74294j2772j2614j3620j5251j5550j3795j1505j0261r787q869p326o051
58685E36893n665n880n946n255l794k353j862k227k387j765r60o09l76L43J382
$$ plain form
58782 677821 683191 689551 696663 704194 712104 720761 730135 739059 745996 750641 754063 757016 758796 758219
58768 758219 755127 750221 743751 735263 724737 713229 702031 691592 681574 671643 661873 652541 643965
58755 643965 636542 630603 626144 622815 620300 618589 617824 617999 618931 620427 622345 624536 626877 629454 632598
58740 632598 636638 641592 647165 653068 659247 665753 672358 678409 683188 686535 689119 691961 695564 699458
58726 699458 702708 704949 706803 709109 711761 713657 714021 713491 713496 714680 716503 718452 720903 724371 728433
58711 728433 732097 734995 737507 739752 741138 740939 738783 734472 727950 719590 709967 699212 687170 674294
58697 674294 661522 648908 635288 620037 604487 590692 579187 568926 559139 550270 542944 536893
58685 536893 531228 525348 519402 514147 510353 508000 506138 503911 501524 499759 498799 498190 497814 498157 499539
58670D99539K224K854L547M249M866N662O707P482P609P476P368O700M980K858
58656E74121J202k64k325m656o169o652o856p091o971o516o182n859m989l832
58642E06961l310l426l150k178j455j459j290j67J293K066K104J845J238K78k84
58627D99066K30J273J724J384R76R23R54Q71Q94J186J568J835J944J857J551J180
58611E19416J004J159J672K539L566M304M330L635K604J732J364J485J800K116
58597E52726K581L234L547K951J788J135J517K409L096L518M019M898O385Q446
58583F02250J0316J0878R965Q694Q125Q155Q202Q293Q740R256R303R039R115R618
58569G29949J0010J0154J0675J2055J3934J5624J6959J8287J9711K0735K0756
$$ plain form
58670 499539 501763 504617 508164 512413 517279 522941 529648 537130 544739 552215 559583 566283 571263 574121
58656 574121 575323 575059 572734 568078 561909 555257 548401 541310 534339 527823 521641 515782 510793 506961
58642 506961 503651 500225 497075 494897 493442 491983 490693 490526 491819 493885 495989 497834 499072 499350 499066
58627 499066 499296 500569 502293 503677 504653 505576 506530 507401 508295 509481 511049 512884 514828 516685 518236 519416
58611 519416 520420 521579 523251 525790 529356 533660 537990 541625 544229 545961 547325 548810 550610 552726
58597 552726 555307 558541 562088 565039 566827 567962 569479 571888 574984 578502 582521 587419 593804 602250
58583 602250 612566 623444 633409 642103 650228 658383 666585 674878 683618 692874 702177 711216 720331 729949
58569 729949 739959 750113 760788 772843 786777 802401 819360 837647 857358 878093 898849
58558H98849J9817J8563J7366J5789J3216R844O616M183K318M55j672l946o061
58545I95337p655q642r402j0332j1263j1877j2570j4182j6716j9128k0578k1158
58533H31834k1120k0269j8641j6956j5749j4637j3106j1436j0172r197q045o777
58521F65729n754m901l934l010k487k251j909j498j352j438j426j260j131j056
58507F32322r52r15r04n50J45L67m29j304p81J046K433K222J208Q41J361J945
58491F38055K139K405L289M667N902O588O921P445Q443R732J1000J2168J3235
58478G31989J3998J4239J4047J3702J3221J2269J0553Q079N109J961j072l772
58466H34323n930p304p764p492o802n780m338k599q70Q11K698M777O528P493P674
$$ plain form
58558 898849 918666 937229 954595 970384 983600 993444 1000060 1004243 1006561 1007016 1005344 1001398 995337
58545 995337 987682 979040 969638 959306 948043 936166 923596 909414 892698 873570 852992 831834
58533 831834 810714 790445 771804 754848 739099 724462 711356 699920 689748 680551 672506 665729
58521 665729 659975 655074 651140 648130 645643 643392 641483 639985 638633 637195 635769 634509 633378 632322
58507 632322 631370 630455 629551 629001 629146 629513 629084 627780 626999 628045 630478 632700 633908 634749 636110 638055
58491 638055 640194 642599 645888 650555 656457 663045 669966 677411 685854 695586 706586 718754 731989
58478 731989 745987 760226 774273 787975 801196 813465 824018 832097 837206 839167 838095 834323
58466 834323 828393 821089 813325 805833 799031 793251 788913 786314 785444 786255 788953 793730 800258 807751 815425
58451H15425P312O651O045N746N277L590K67l734o910q522q857q666q633r011
58437G95980r287q607o764m510k595j035M03J566K276K888L885N205O319O779
58423G92503O432N470M560M364M644M392L133J441j34j838l911n794o847p217
58409H01198p265o910o237o013o617p123o444m877l480k405j061M62J386J584
58395G46198J810K474L172L543L772M080M364M470M353L975L482L278L557M018
58381G96546M393M837N289N136M122L068K886L431M007M452M911N246N601O763
58367H60688Q870J0555J0629R899R911J0594J0803J0632J1174J2241J2310J0935
58355I89241R327Q182O755M649K870K261K220J862J389J491K274L422M746O025
$$ plain form
58451 815425 822737 829388 835433 841179 846456 850046 850313 846579 839669 831147 822290 813624 804991 795980
58437 795980 786693 778086 771322 766812 764217 763182 763585 765151 767427 770315 774200 779405 785724 792503
58423 792503 798935 804405 808965 813329 817973 822365 825498 826939 826805 824967 821056 815262 808415 801198
58409 801198 793933 787023 780786 774773 768156 761033 754589 749712 746232 743827 742766 743228 744614 746198
58395 746198 748008 750482 753654 757197 760969 765049 769413 773883 778236 782211 785693 788971 792528 796546
58381 796546 800939 805776 811065 816201 820323 823391 826277 829708 833715 838167 843078 848324 853925 860688
58367 860688 869558 880113 890742 900641 910552 921146 931949 942581 953755 965996 978306 989241
58355 989241 998568 1006750 1013505 1018154 1021024 1023285 1025505 1027367 1028756 1030247 1032521 1035943 1040689 1046714
58341A046714O919P478Q115Q938R702J0467J1518J2590J3099J3190J3559J4163
58329A176452J4157J3304J2355J1817J1325J0493R411Q174O772N556M905M437
58317A289158L628L026L640N174O357P061Q410J0539J2023J2152J2090J2947J4130
58304A400335J4646J4725J5135J5869J6567J7357J8371J9088J9051J8675J8684
58293A588503J9271K0229K1329K2249K2762K3289K4542K6420K8059K9075K9837
58282A855565L0471L0705L0811L1500L2623L3268L3341L3815L4997L5971L6176
58271B219243L6313L7152L8650M0670M3416M6604M9401N1680N4185N7125N9760
58260B734199O1760O3657O5611O7046O7867O8786P0068P1233P2220P3582P5393
$$ plain form
58341 1046714 1053633 1061111 1069226 1078164 1087866 1098333 1109851 1122441 1135540 1148730 1162289 1176452
58329 1176452 1190609 1203913 1216268 1228085 1239410 1249903 1259314 1267488 1274260 1279816 1284721 1289158
58317 1289158 1292786 1295812 1299452 1304626 1310983 1318044 1326454 1336993 1349016 1361168 1373258 1386205 1400335
58304 1400335 1414981 1429706 1444841 1460710 1477277 1494634 1513005 1532093 1551144 1569819 1588503
58293 1588503 1607774 1628003 1649332 1671581 1694343 1717632 1742174 1768594 1796653 1825728 1855565
58282 1855565 1886036 1916741 1947552 1979052 2011675 2044943 2078284 2112099 2147096 2183067 2219243
58271 2219243 2255556 2292708 2331358 2372028 2415444 2462048 2511449 2563129 2617314 2674439 2734199
58260 2734199 2795959 2859616 2925227 2992273 3060140 3128926 3198994 3270227 3342447 3416029 3491422
58249C491422P7310P9728Q3360Q7811R2224R7154J03770J11438J18395J24709
58239D467321J32079J40631J48762J56440J65622J76834J88361J99679K12635
58230E988364K28123K44649K61335K79480K99978L22090L46044L73736M05539
58221H749338M39598M75716N16707N64418O17656O75818P41299Q16641R02550
58212A4499741J000478J113977J246148J399261J578429J792172K048648K355957
58204B7034811K727477L182336L739980M420265N249910O260441P473367Q887549
58196F8976136J0478250J2202980J4014602J5884618J7815275J9810977K1820499
58189A81003337K3690470K5138814K5744703K5016832K2604610J8534730J3207299
$$ plain form
58249 3491422 3568732 3648460 3731820 3819631 3911855 4009009 4112779 4224217 4342612 4467321
58239 4467321 4599400 4740031 4888793 5045233 5210855 5387689 5576050 5775729 5988364
58230 5988364 6216487 6461136 6722471 7001951 7301929 7624019 7970063 8343799 8749338
58221 8749338 9188936 9664652 10181359 10745777 11363433 12039251 12780550 13597191 14499741
58212 14499741 15500219 16614196 17860344 19259605 20838034 22630206 24678854 27034811
58204 27034811 29762288 32944624 36684604 41104869 46354779 52615220 60088587 68976136
58196 68976136 79454386 91657366 105671968 121556586 139371861 159182838 181003337
58189 181003337 204693807 229832621 255577324 280594156 303198766 321733496 334940795
58182C34940795P091106M54298o514927j3341773j9174888k3190960k5094232
58175B55169419k5201053k4107339k2351772k0329910j8335640j6545243j4974207
58168A13324255j3524067j2100358j0684084r314711q043134o905621n916923
58161D6835357n071198m351653l742232l229517k798656k434944k128297j871452
58153B1207408j655686j472503j317099j186077j073954r75534q89249q14583
58145A1822723p48607o88296o33678n85198n40435m96786m55138m17532l83359
58136F873694l51036l21433k96223k74580k54662k36859k22546k10985k00205
58127D505165j89756j80054j70339j59794j49470j40649j32476j23518j14488
$$ plain form
58182 334940795 342031901 342486199 335971272 322629499 303454611 280263651 255169419
58175 255169419 229968366 205861027 183509255 163179345 144843705 128298462 113324255
58168 113324255 99800188 87699830 77015746 67701035 59657901 52752280 46835357
58161 46835357 41764159 37412506 33670274 30440757 27642101 25207157 23078860 21207408
58153 21207408 19551722 18079219 16762120 15576043 14502089 13526555 12637306 11822723
58145 11822723 11074116 10385820 9752142 9166944 8626509 8129723 7674585 7257053 6873694
58136 6873694 6522658 6201225 5905002 5630422 5375760 5138901 4916355 4705370 4505165
58127 4505165 4315409 4135355 3965016 3805222 3655752 3515103 3382627 3259109 3144621
58118C144621j07004j00799r4533q8382q3426p9272p4615o9560o5280o1940n8870
58107B260940n6150n4281n2792n1008m9418m8758m8424m7575m6876m7245m7661
58096A710752m6315m3365m0620l8785l7036l4989l3128l1347k8876k5859k3355
58085A327077k1741k0455j9325j8785j8762j8719j8793j9541k0529k0543j9353
58074A110531j8063j7524j7517j7646j7861j7873j7152j5831j4760j4329j4062
58063I27913j3517j2855j2241j1470j0471r565r020q802q880r251r660r777r662
58050G92742r599r541r228q744q413q185p714p048o642o666o785o693o464o326
58036F84694o418o743p046o888o255n826o243p224p936q134q350q981r691r823
$$ plain form
58118 3144621 3037617 2936818 2842285 2753903 2670477 2591205 2516590 2447030 2381750 2319810 2260940
58107 2260940 2204790 2150509 2097717 2046709 1997291 1948533 1900109 1852534 1805658 1758413 1710752
58096 1710752 1664437 1621072 1580452 1541667 1504631 1469642 1436514 1405167 1376291 1350432 1327077
58085 1327077 1305336 1284881 1265556 1246771 1228009 1209290 1190497 1170956 1150427 1129884 1110531
58074 1110531 1092468 1074944 1057427 1039781 1021920 1004047 986895 971064 956304 941975 927913
58063 927913 914396 901541 889300 877830 867359 857794 848774 839972 831092 821841 812181 802404 792742
58050 792742 783143 773602 764374 755630 747217 739032 731318 724270 717628 710962 704177 697484 691020 684694
58036 684694 678276 671533 664487 657599 651344 645518 639275 632051 624115 615981 607631 598650 588959 579136
58022E79136r085p733o377n627n624n904n869n327m472l546k741k269k191k280
58008E10091k251k039j701j257q36p22j015j366j299o96O2L97o0j052j791j785
57992D92680j414j377j635j672j579k051l128l898l810l425l338l239k709k169
57978D57236k210k497k259j488r00q45j000r94p51l02K16N19M94L90L37Rq56j844
57960D43255k282k019j488j150j273j892k639k970k866k933l474l935l662k733
57946D07939j646p05j07l2q8O45K351L862M115L691L976N277O616P144O782N794
57930D55614M618L851L494K498Q8k740m165l949l688m558o006o935p096o766o033
57915D18227n048m340m192m202l867l256k649k002j110o5Q69J476J582J145N96
$$ plain form
58022 579136 570051 562318 555941 550314 544690 538786 532917 527590 523118 519572 516831 514562 512371 510091
58008 510091 507840 505801 504100 502843 502007 501285 500270 498904 497605 496909 496971 497368 497308 496256 494465 492680
57992 492680 491266 489889 488254 486582 485003 482952 479824 475926 472116 468691 465353 462114 459405 457236
57978 457236 455026 452529 450270 448782 447882 447037 446037 445043 444292 443990 444206 444725 445219 445609 445946 445955 445099 443255
57960 443255 440973 438954 437466 436316 435043 433151 430512 427542 424676 421743 418269 414334 410672 407939
57946 407939 406293 405588 405481 405449 405361 406006 408357 412219 416334 420025 424001 429278 435894 443038 449820 455614
57930 455614 460232 464083 467577 470075 470163 467423 463258 459309 455621 451063 445057 438122 431026 424260 418227
57915 418227 413179 408839 404647 400445 396578 393322 390673 388671 387561 387496 388365 389841 391423 392568 393164
57900C93164N73J104J491J325J118J503K238K585K375K082K023K013J871J724
57886D17189J620J278N03l72q00o93n11o88j214j864k597l507m441m979m783l943
57870C90198k957k396k381k299j339L99J708J557L47o06n84J40J133K109K544
57855C87573K029J297J783L667N357N530M735M189L915L213K229J748J675J085
57841D30025k08j228j239o31j84j63m89j101j796k173k111j956k057k348k520
57826D09821k362j934j586j741k411l034l109k791k571k542k405k056j665j291
57812C78323r03o74q77j520k400l331m046m162l768l655m408n462n755n134m403
57797C27825m122m039l707l007j995q32R5M45L95L54M14N33R87K018L181L857
$$ plain form
57900 393164 393737 394841 396332 397657 398775 400278 402516 405101 407476 409558 411581 413594 415465 417189
57886 417189 418809 420087 420590 420218 419418 418725 418214 417526 416312 414448 411851 408344 403903 398924 394141 390198
57870 390198 387241 384845 382464 380165 378826 379225 380933 382490 382837 382231 381647 381787 382920 385029 387573
57855 387573 389602 390899 392682 396349 401706 407236 411971 416160 420075 423288 425517 427265 428940 430025
57841 430025 429817 428589 427350 426719 426535 426372 425883 424782 422986 420813 418702 416746 414689 412341 409821
57826 409821 407459 405525 403939 402198 399787 396753 393644 390853 388282 385740 383335 381279 379614 378323
57812 378323 377420 376746 375869 374349 371949 368618 364572 360410 356642 352987 348579 343117 337362 332228 327825
57797 327825 323703 319664 315957 312950 310955 310123 310218 310663 311058 311412 311826 312359 313346 315364 318545 322402
57781C22402M192M753N364N321M692M357M582M618M044L462L420L469K945J953
57767C79574R47l1j052j793j943j779j768j899j849j534j118p20m74n31p84q83
57751C62363p93r17j392j724j471r12o72r23j319j428r88m1R04J201Q25M44M84
57734C53641N61K36j76m5O55J396J880K280K750L094L010K474J897J872K532L175
57718C81232K912J813Q59O26N54j5p63r35n96n41j162k037k695l080l180k769
57702C70223j848r46o64j047j648k086k363k659k999l188l045k592j998j444j083
57687C40613j023j231j460j383q07K91J814L537N258P114R588J2989J7063K1268
57673D13631K5275K9023L2608L6317M0379M4237M6503M6129M3344L8785L2188
$$ plain form
57781 322402 326594 331347 336711 342032 346724 351081 355663 360281 364325 367787 371207 374676 377621 379574
57767 379574 380521 380490 379438 377645 375702 373923 372155 370256 368407 366873 365755 365035 364561 364030 363246 362363
57751 362363 361570 360653 359261 357537 356066 355154 354482 353559 352240 350812 349824 349783 350687 351888 352713 353157 353641
57734 353641 354202 354438 354262 354217 354872 356268 358148 360428 363178 366272 369282 371756 373653 375525 378057 381232
57718 381232 384144 385957 386816 387442 387996 387981 387218 386283 385687 385146 383984 381947 379252 376172 372992 370223
57702 370223 368375 367429 366765 365718 364070 361984 359621 356962 353963 350775 347730 345138 343140 341696 340613
57687 340613 339590 338359 336899 335516 334709 335000 336814 340351 345609 352723 362311 375300 392363 413631
57673 413631 438906 467929 500537 536854 577233 621470 667973 714102 757446 796231 828419
57662H28419K2751J0619k860j6337k9034l9998m7826n1525n1177m7544m1684l5061
57650D98743k9183k4644k0965j7651j4803j2504j0326p922n633m033l298l239
57638C44542l553l774l488k768k033j390p24l80r66k243l151l137k683k254j726
57623C10272j217j399k306k863k404j684j588j693j146k46J4n59j324j843k039
57608B87975j746j046o51j038j614j597j288j445j878j781j161p74q46j019j319
57593B68772k074k885k968k452k207k293j862p85o4k63o64m93J8L07K86n1r19
57576B49403k053k514j935j229j405k197k643k509k330k391k432k273k040j817
57562B19635j576j445j643k067k295k054j472q18k34K23L93P6o37j196r77R3J473
$$ plain form
57662 828419 851170 861789 858929 842592 813558 773560 725734 674209 623032 575488 533804 498743
57650 498743 469560 444916 423951 406300 391497 378993 368667 360745 355112 351079 347781 344542
57638 344542 340989 337215 333727 330959 328926 327536 326812 326432 325466 323223 320072 316935 314252 311998 310272
57623 310272 309055 307656 305350 302487 300083 298399 296811 295118 293972 293726 293740 293181 291857 290014 287975
57608 287975 286229 285183 284532 283494 281880 280283 278995 277550 275672 273891 272730 271956 271110 270091 268772
57593 268772 266698 263813 260845 258393 256186 253893 252031 251246 251182 250919 250255 249762 249780 250087 250373 250322 249403
57576 249403 247350 244836 242901 241672 240267 238070 235427 232918 230588 228197 225765 223492 221452 219635
57562 219635 218059 216614 214971 212904 210609 208555 207083 206265 206031 206254 206647 206723 206086 204890 203913 204006 205479
57545B05479K579L168L092K174P43k12LQ88J382J142O91M42L06K01K37K97Q6l82
57527B22316p64r04q51m94K07P45N84R0J17O24O96R5k55K87J056J140O36K25J58
57508B25708L30P63J305J372P38J07J84N41K61n74r50l90M65Q62P33L33k75j004
57490B30509j498j518j344j434j784j907j433n65J32L16J30j23m16r65j798k527
57474B13775k677k172j462j185j569k170k321j883j313r28n05J12N17L42m8j40
57458A96373k00p32j309r96J17Q79P62M71N10L58k47m13N31J658J642O94Q5J51
57440B00334J23j78L2R88J683J277K80k73j61K09O65J256J630J256K55n30m99
57423B08347P4N28O43P11R09R85O50O4l08k42L6K21K73K77K16om09q68j135r41
$$ plain form
57545 205479 208058 211226 214318 216492 217235 217023 217026 217914 219296 220438 221129 221571 221877 222078 222315 222612 222698 222316
57527 222316 221552 220648 219797 219303 219510 220255 220839 220929 221046 221670 222366 222461 222206 222493 223549 224689 225325 225550 225708
57508 225708 226038 226801 228106 229478 230216 230323 230507 231048 231309 230735 229785 229395 229860 230722 231455 231788 231513 230509
57490 230509 229011 227493 226149 224715 222931 221024 219591 219026 219158 219474 219604 219481 219065 218100 216302 213775
57474 213775 211098 208926 207464 206279 204710 202540 200219 198336 197023 196095 195590 195702 196219 196561 196513 196373
57458 196373 196173 195441 194132 193136 193253 194132 194894 195365 195875 196233 195986 195573 196104 197762 199404 200098 200183 200334
57440 200334 200457 200279 200311 201299 202982 204259 204539 204266 204105 204314 204979 206235 207865 209121 209376 208846 208347
57423 208347 208421 208949 209592 210303 211212 212197 212847 212911 212603 212361 212397 212618 212891 213168 213384 213378 212969 212101 210966 210025
57403B10025k68M62P16M11o4l70m67l00K90J092J411Q59j7k62M09J419K068K142
57385B19556J907J835K259L021L468L112K236J603J527J562J148L14m67r01j076
57370B41104j098q21j82L98L12m42j151j325j284j469j590j079j83K49ml00k70
57353B30865l27o81p56j00P57J084J026J206J634J758J326O11j16p24j029r42
57337B35592o77l31M08J674K799K934K040P75l82j243j546j236r26j193j550r85
57321B36153M73J655J850J545J381J263R54P08P58Q51P88Q31J078J002K34o18
57305B50906o63J13R61J449J767K083K197J967J579J258R95P03M61N17J033J806
57289B69132K300K154J708J665K132K379J831R43O66J260K092K499K412K105J754
$$ plain form
57403 210025 209757 210219 210935 211346 211282 210912 210445 210145 210435 211527 212938 213797 213780 213518 213927 215346 217414 219556
57385 219556 221463 223298 225557 228578 232046 235158 237394 238997 240524 242086 243234 243548 243081 242180 241104
57370 241104 240006 239185 239003 239401 239713 239271 238120 236795 235511 234042 232452 231373 231190 231439 231435 231135 230865
57353 230865 230538 229857 229101 229001 229758 230842 231868 233074 234708 236466 237792 238403 238287 237563 236534 235592
57337 235592 234915 234584 234992 236666 239465 242399 244439 245214 244832 243589 242043 240807 239881 238688 237138 236153
57321 236153 236626 238281 240131 241676 243057 244320 245274 245982 246740 247591 248379 249210 250288 251290 251524 250906
57305 250906 250243 250356 251317 252766 254533 256616 258813 260780 262359 263617 264612 265315 265776 266293 267326 269132
57289 269132 271432 273586 275294 276959 279091 281470 283301 284244 284910 286170 288262 290761 293173 295278 297032
57274B97032J401J087Q37O56N76O28O74M45j63q47j082o47N9L82J64m5K77Q99
57256C02333J188J100J262K008K834L143K995K780K528K134J888K155K621K539
57242C33508J806J151J111J371J391J182J094J243J548K106K999L891M281M133
57228C62815L859L685L490L325L598M432N131M776L315J765J234J884K900L425
57214D09634L412L563M337N271N527N106N022N985P364P941P416O548N907N329
57200D88362M720M584N254O232O850P234P905Q760R213R219R377R922J0355J0298
57186E98285J0128J0413J1177J2131J3236J4532J5779J6676J7360J8140J8894
57175G56751J9143J8789J8340J8310J8713J9318K0056K0928K1830K2677K3552
$$ plain form
57274 297032 298433 299520 300357 301013 301589 302217 302891 303336 303173 302326 301244 300597 300656 301038 301202 301157 301434 302333
57256 302333 303521 304621 305883 307891 310725 313868 316863 319643 322171 324305 326193 328348 330969 333508
57242 333508 335314 336465 337576 338947 340338 341520 342614 343857 345405 347511 350510 354401 358682 362815
57228 362815 366674 370359 373849 377174 380772 385204 390335 395111 398426 400191 401425 403309 406209 409634
57214 409634 413046 416609 420946 426217 431744 436850 441872 447857 455221 463162 470578 477126 483033 488362
57200 488362 493082 497666 502920 509152 516002 523236 531141 539901 549114 558333 567710 577632 587987 598285
57186 598285 608413 618826 630003 642134 655370 669902 685681 702357 719717 737857 756751
57175 756751 775894 794683 813023 831333 850046 869364 889420 910348 932178 954855 978407
57164I78407K4436K4922K4708K4305K4792K6649K9259L1883L4619L7879M1216
57153A303075M3613M5038M6766M9648N2714N4301N4149N3534N3504N3939N4442
57142A864723N5205N6434N7606N7995N7679N7501N8173N9880O2422O5180O7076
57131B519874O7319O6430O6063O7472P0448P3845P6731P8630P9175P8353P7292
57120C321632P8157Q2749R1218J02240J14320J26638J39013J51701J65434J81133
57110D554235J99185K19197K40907K65239K93986L28482L69060M16005M70572
57101G356868N34797O10741P00423Q06172R30188J073448J235323J414421J609688
57092A6272069J820845K048167K291910K551427K824184L104428L381183L637750
$$ plain form
57164 978407 1002843 1027765 1052473 1076778 1101570 1128219 1157478 1189361 1223980 1261859 1303075
57153 1303075 1346688 1391726 1438492 1488140 1540854 1595155 1649304 1702838 1756342 1810281 1864723
57142 1864723 1919928 1976362 2033968 2091963 2149642 2207143 2265316 2325196 2387618 2452798 2519874
57131 2519874 2587193 2653623 2719686 2787158 2857606 2931451 3008182 3086812 3165987 3244340 3321632
57120 3321632 3399789 3482538 3573756 3675996 3790316 3916954 4055967 4207668 4373102 4554235
57110 4554235 4753420 4972617 5213524 5478763 5772749 6101231 6470291 6886296 7356868
57101 7356868 7891665 8502406 9202829 10009001 10939189 12012637 13247960 14662381 16272069
57092 16272069 18092914 20141081 22432991 24984418 27808602 30913030 34294213 37931963
57084C7931963L858192M040881M205057M371542M521485M570381M394791L902929
57076G1797221L092615K048253Q86444k96926j440023k497282l422378m169152
57068F5998772m703929n015822n118452n043722m831716m522029m149814l745272
57060B8868016l333392k933138k557468k214492j908626j641340j411803j217380
57052A1650377j053878r16422q01005p05098o26427n61880n08258m63491m26181
57043E587737l94450l66286l40770l17903k97335k78200k59920k42216k24384
57034B866273k05647j86158j66670j47234j27419j07757q9603p3185n7147m0490
57024A664963k3928q935L218J0943J2552Q375J504n193j2391k3152l8709n6537
$$ plain form
57084 37931963 41790155 45831036 50036093 54407635 58929120 63499501 67894292 71797221
57076 71797221 74889836 76938089 77824533 77527607 76087584 73590302 70167924 65998772
57068 65998772 61294843 56279021 51160569 46116847 41285131 36763102 32613288 28868016
57060 28868016 25534624 22601486 20044018 17829526 15920900 14279560 12867757 11650377
57052 11650377 10596499 9680077 8879072 8173974 7547547 6985667 6477409 6013918 5587737
57043 5587737 5193287 4827001 4486231 4168328 3870993 3592793 3332873 3090657 2866273
57034 2866273 2660626 2474468 2307798 2160564 2033145 1925388 1835785 1762600 1705453 1664963
57024 1664963 1641035 1632100 1635318 1646261 1658813 1667188 1668692 1663499 1651108 1627956 1589247 1532710
57012A532710p2489q3647q9141q9566q6365q1068p4541o6986n8744n0654m3561
57001G35948l7773l3089k9104k5497k2295j9831j8282j7290j6270j4930j3255
56990D88332j1238q972o839n218m055l047k077j214n42l55j249l512o563r478
56976D23973j1960j4243j6187j7133j6739j5375j3536j1325q743o089l697j494
56964B87452Q98L734O847R803J2251J4183J5686J6457J5808J3454R944O031J827
56951D14375k872p697j1736j4451j6000j6543j5918j4210j2074j0044p915n200
56939B79715j914J454M570P480J0269J2903J5337J7504J9105J9648J8729J6164
56927D20964J1938O221n10p527j4115j9678k3671k5682k5763k4524k2722k0802
$$ plain form
57012 1532710 1460221 1376574 1287433 1197867 1111502 1030434 955893 888907 830163 779509 735948
57001 735948 698175 665086 635982 610485 588190 568359 550077 532787 516517 501587 488332
56990 488332 477094 468122 461283 456065 452010 448963 446886 445672 445130 444775 443526 440014 433451 423973
56976 423973 412013 397770 381583 364450 347711 332336 318800 307475 298732 292643 288946 287452
56964 287452 288350 292084 298931 308734 320985 335168 350854 367311 383119 396573 406517 412548 414375
56951 414375 411503 403806 392070 377619 361619 345076 329158 314948 302874 292830 284915 279715
56939 279715 277801 279255 283825 291305 301574 314477 329814 347318 366423 386071 404800 420964
56927 420964 432902 439123 438613 431086 416971 397293 373622 347940 322177 297653 274931 254129
56915B54129j8969j7400j6027j4298j1747q923p096o672o545n537l978k947k472
56902A31518j612k21P27Q97J379K976M802N628N842O827Q887J1009J2544J3877
56888B05080J5279J6228J6263J5647J4723J3242J0827P654M230Q61k314n017o916
56875C05787p850p756o619m585j940J231N078R533J4108J8290K2029K5642K9394
56862D02342L3243L6763L9227L9846L8100L3818K7196J8873R790N75q766j8041
56850F52966k5910l0398l0589k7342k2121j5667q077K95Q666J6437K3495L0038
56838E71793L6350M2711M9197N5347O0039O1733N9094N1777M0680K7277J2536
56827A068534l296j9893l6035m9695n8849o2377o0676n5410m8332m0154l0786
$$ plain form
56915 254129 235160 217760 201733 187435 175688 166765 159669 152997 146452 140915 136937 133990 131518
56902 131518 129906 129685 130412 131309 132688 135664 140466 146094 151936 158763 167650 178659 191203 205080
56888 205080 220359 236587 252850 268497 283220 296462 307289 314943 319173 320034 317720 312703 305787
56875 305787 297937 290181 283562 278977 277037 278268 283346 292879 306987 325277 347306 372948 402342
56862 402342 435585 472348 511575 551421 589521 623339 650535 669408 679198 679773 671007 652966
56850 652966 627056 596658 566069 538727 516606 500939 492862 493157 501823 518260 541755 571793
56838 571793 608143 650854 700051 755398 815437 877170 936264 988041 1028721 1055998 1068534
56827 1068534 1065238 1045345 1009310 959615 900766 838389 777713 722303 673971 633817 603031
56816F03031k0523j0433j416O555J3863K0489K6198L1135L5484L8638L9168L5855
56804H18044K8638J8529O807n746j8734l1365m1977m8829n1316n0144m6296m0486
56792E37125l3641k7045k1373j6113j0559m918K02M965J0033J5143J8933K0396
56780D93148J9779J7734J4223Q831J761o023j3507k0144k5692k9917l2558l3446
56768C94189l2596l0283k7044k3612k0740j8823j7541j5987j3540j0610q278p162
56756A67973o813o370n538m706m272m066l545k418j097l75o31j397j882j854j710
56741A21299j699j473o98K20M19l98j571k148j756q05l6R1k53m52r0O10J111J214
56723A13585J158J089R08P08Q89J517J968J689J039Q25J139J297R35N18N50Q82
$$ plain form
56816 603031 582508 572075 570659 577214 591077 611566 637764 668899 704383 743021 782189 818044
56804 818044 846682 865211 872018 866272 847538 816173 774196 725367 674051 623907 577611 537125
56792 537125 503484 476439 455066 438953 428394 423476 423678 428643 438676 453819 472752 493148
56780 493148 512927 530661 544884 553715 555476 549453 535946 515802 490110 460193 427635 394189
56768 394189 361593 331310 304266 280654 259914 241091 223550 207563 194023 183413 175135 167973
56756 167973 161160 154790 149252 144546 140274 136208 132663 130245 129148 128773 128142 126745 124863 123009 121299
56741 121299 119600 118127 117429 117649 118068 117670 116099 113951 112195 111390 111354 111445 111192 110740 110650 111260 112371 113585
56723 113585 114743 115832 116740 117448 118337 119854 121822 123511 124550 125375 126514 127811 128746 129264 129814 130696
56707A30696J120J246J378J372J135J016J316J632J311M58n2K92J029J346R60
56692A46255K30l30m01k1M46O54O11N79O24N35K08r0K4O78J603K238K065J130
56674A57038J67l6N02J026R19K71m26p96p34l82p3p2l16n58p26q28o63o5N72O39
56654A55459K29J36O56J086P99K49K48P04Q06K95j87j16K57L86J35k68o05p11
56636A59558m04K99R75J050L53o74j373j469j298j384j868k347k309j614n76L36
56620A47255Q02P89M08k40j022j561j372m60M31O17L83N46J156J282L93p13r19
56603A47775k52L46M21M24P53J079R77O11M51O35R83J370J692J668J085K76j19
56586A60175N3K52N6j86J04Q06J209J003O91Q41J389J903K203K362K426K445K667
$$ plain form
56707 130696 131816 133062 134440 135812 136947 137963 139279 140911 142222 142680 142628 142920 143949 145295 146255
56692 146255 146485 146155 145754 145733 146179 146833 147444 148023 148647 149182 149390 149300 149324 150002 151605 153843 155908 157038
56674 157038 157205 157169 157671 158697 159616 159887 159461 158665 157931 157549 157476 157404 157088 156530 155804 154976 154313 154248 154820 155459
56654 155459 155688 155824 156480 157566 158365 158614 158862 159566 160372 160667 160480 160364 160621 161007 161142 160874 160269 159558
56636 159558 159154 159453 160428 161478 161831 161157 159784 158315 157017 155633 153765 151418 149109 147495 146919 147255
56620 147255 148057 148846 149254 149014 147992 146431 145059 144599 145030 145647 146030 146576 147732 149014 149407 148694 147775
56603 147775 147523 147869 148290 148714 149467 150546 151523 152134 152585 153220 154203 155573 157265 158933 160018 160294 160175
56586 160175 160228 160480 160536 160350 160454 161260 162469 163472 164163 165004 166393 168296 170499 172861 175287 177732 180399
56569A80399L238L918M319M453M669N195N999O952P884Q558Q963R400J0002J0386
56555B74335J0167R513Q702P482N537L282J441L4j359k451k482j709j470k400
56541C08622l551l854l518l290l227l014k869l244m028m773n325n616n280m284
56527B52749l509l811m733n027m312l409l078l185l204k933k487k092j922j874
56513B07173j597j067q91j528k410k484j556n18j97n62j042j182q71l76j74m37
56497A90281p15m90O9L00m5o05r78j018o55O7P58R94Q82Q95J156J262Q77J10o45
56478A92500r62n83L12J183J723K046K033J095p29k114j887p31k74p42q40J9Q46
56461A92895P71L14K40L22N7k68j20L00M76M83O30P25M56J52L17P27P48L76J80
$$ plain form
56569 180399 183637 187555 191874 196327 200996 206191 212190 219142 227026 235584 244547 253947 263949 274335
56555 274335 284502 294015 302717 310199 315736 319018 320459 320493 319134 316683 314201 312492 311022 308622
56541 308622 305071 301217 297699 294409 291182 288168 285299 282055 278027 273254 267929 262313 257033 252749
56527 252749 249240 245429 240696 235669 231357 227948 224870 221685 218481 215548 213061 210969 209047 207173
56513 207173 205576 204509 203618 202090 199680 197196 195640 195122 194925 194363 193321 192139 191268 190892 190718 190281
56497 190281 189566 189076 189145 189445 189400 188795 187817 186799 186144 186211 186969 187963 188845 189740 190896 192158 193035 193145 192500
56478 192500 191538 190955 191267 192450 194173 196219 198252 199347 198618 196504 194617 193886 193612 192870 192030 192049 192895
56461 192895 193666 193980 194220 194542 194599 194331 194211 194511 194987 195470 196100 196825 197281 197433 197750 198477 199225 199601 199781
56442A99781L55N46O08P82J070J067N86m5m66o95q54q76o65l65k60n01r51j213
56424A97904r37j93N47R52J161J385J457J143P21P54J305J861J958J543O84m68
56408B11777j325j123N5J035Q68M8j81M77J106R94N29M25O89R17J048J305J599
56391B20243J605J295R25N84K71K13N70R35Q35N89R16J645J776J051M59P17J137
56374B35766P15l63j168j302r57j71R78J820J762J280J400K303L249L774L962
56359B53048L733K791J441N65N79J081J601J992K044J562R78J009J535J604Q53
56344B76416O0m3K99N58P64J129J460J532J550J773K049K110J969J734J447J377
56328B96184J910K888L552L561L466L797M240M182L571K780K000J368J182J495
$$ plain form
56442 199781 200136 200682 201290 202072 203142 204209 204795 204750 204284 203589 202735 201859 201194 200829 200569 200068 199117 197904
56424 197904 196967 196774 197321 198273 199434 200819 202276 203419 204140 204894 206199 208060 210018 211561 212245 211777
56408 211777 210452 209329 209384 210419 211287 211335 211154 211631 212737 213731 214260 214685 215374 216291 217339 218644 220243
56391 220243 221848 223143 224068 224652 224923 225136 225706 226641 227476 228065 228981 230626 232402 233453 233912 234629 235766
56374 235766 236481 236118 234950 233648 232691 232520 233498 235318 237080 238360 239760 242063 245312 249086 253048
56359 253048 256781 259572 261013 261578 262157 263238 264839 266831 268875 270437 271415 272424 273959 275563 276416
56344 276416 276476 276433 276732 277290 278054 279183 280643 282175 283725 285498 287547 289657 291626 293360 294807 296184
56328 296184 298094 300982 304534 308095 311561 315358 319598 323780 327351 330131 332131 333499 334681 336176
56314C36176J759J417O51R4O7N06J316K371L370M132M860N726O404O449N996N695
56298C86989O003O768P493P772P489O729N622M395L591L868N235O758P572P868
56284D74152Q373R084R409R388R774J0810J1885J2561J3045J3406J3383J3348
56272F08618J4375J6774J9449K1336K2617K3916K5297K6827K9175L2746L6942
56261H78072M1207M5992N1708N7615O3006O8848P6739Q6561R6589J05909J15360
56250A687606J25809J36736J47035J56306J64780J72469J78856J83063J84102
56241C136762J81255J74475J64302J51265J35365J16181R3443O7694M0357J2854
56231D273953j4307m1157o7113r0872j11529j28950j42852j52603j58434j61797
$$ plain form
56314 336176 337935 339352 340003 340097 340164 340670 341986 344357 347727 351859 356719 362445 368849 375298 381294 386989
56298 386989 392992 399760 407253 415025 422514 429243 434865 439260 442851 446719 451954 458712 466284 474152
56284 474152 482525 491609 501018 510406 520180 530990 542875 555436 568481 581887 595270 608618
56272 608618 622993 639767 659216 680552 703169 727085 752382 779209 808384 841130 878072
56261 878072 919279 965271 1016979 1074594 1137600 1206448 1283187 1369748 1466337 1572246 1687606
56250 1687606 1813415 1950151 2097186 2253492 2418272 2590741 2769597 2952660 3136762
56241 3136762 3318017 3492492 3656794 3808059 3943424 4059605 4153048 4220742 4261099 4273953
56231 4273953 4259646 4218489 4151376 4060504 3948975 3820025 3677173 3524570 3366136 3204339
56221C204339j63744j63805j61280j56693j50950j43980j35454j26266j17867
56212A884300j10496j03328r6082q9234q2805p6215o9409o3046n7455n2368m7736
56201A036126m3789m0316l6762l3180l0151k7731k5356k2848k0617j8774j6880
56190G19722j4785j2909j1510j0415r568r109q814q160p044n838m710l558k595
56177F10707k201k160j808r93k14K22M75O44P22J033J957L197M083M540M955N276
56161F30435N179N068N767P223Q591R695J1266J3489J5586J7206J9090K1779K4745
56148G95119K7523L0776L5357M1000M6688N1900N6923O2240O8023P3814P8421
56137A367784Q0689Q0591P9020P6267P1553O4468N6034M7763M0249L3409K7469
$$ plain form
56221 3204339 3040595 2876790 2715510 2558817 2407867 2263887 2128433 2002167 1884300
56212 1884300 1773804 1670476 1574394 1485160 1402355 1326140 1256731 1193685 1136230 1083862 1036126
56201 1036126 992337 952021 915259 882079 851928 824197 798841 775993 755376 736602 719722
56190 719722 704937 692028 680518 670103 660535 651426 642612 634452 627408 621570 616860 613302 610707
56177 610707 608506 606346 604538 603545 603331 603553 604028 604672 605394 606427 608384 611581 615664 620204 625159 630435
56161 630435 635614 640682 646449 653672 662263 671958 683224 696713 712299 729505 748595 770374 795119
56148 795119 822642 853418 888775 929775 976463 1028363 1085286 1147526 1215549 1289363 1367784
56137 1367784 1448473 1529064 1608084 1684351 1755904 1820372 1876406 1924169 1964418 1997827 2025296
56126B025296K2787J8938J4752R385K895m198j1457j8556k5231l1481l7703m4308
56114A921119n1043n7051o1877o6126p0443p3894p4425p1220o5756n9831n3625
56103A215828m6600l9364l3245k8447k4073j9788j6144j3252j0488p640n248l561
56091I67978k071l52J437K970M011M312M066M197N354O837P532P612Q065Q888
56077A030836R186R021R554J1163J2878J3942J4614J5116J5141J4831J4974J5812
56065A187068J6756J7571J8618J9651J9764J8957J8379J8571J8744J8316J7833
56054A390228J7776J7716J7352J7167J7462J7793J8043J8882K0553K2208K3120
56043A598300K3608K4270K5206K6390K7773K8777K8746K8167K8237K9018K9469
$$ plain form
56126 2025296 2048083 2067021 2081773 2091158 2094053 2089855 2078398 2059842 2034611 2003130 1965427 1921119
56114 1921119 1870076 1813025 1751148 1685022 1614579 1540685 1466260 1395040 1329284 1269453 1215828
56103 1215828 1169228 1129864 1096619 1068172 1044099 1024311 1008167 994915 984427 976787 971539 967978
56091 967978 965907 965555 966992 969962 973973 978285 982351 986548 991902 998739 1006271 1013883 1021948 1030836
56077 1030836 1040022 1049043 1058597 1069760 1082638 1096580 1111194 1126310 1141451 1156282 1171256 1187068
56065 1187068 1203824 1221395 1240013 1259664 1279428 1298385 1316764 1335335 1354079 1372395 1390228
56054 1390228 1408004 1425720 1443072 1460239 1477701 1495494 1513537 1532419 1552972 1575180 1598300
56043 1598300 1621908 1646178 1671384 1697774 1725547 1754324 1783070 1811237 1839474 1868492 1897961
56032A897961K9470L0259L2389L4852L6799L8577M0473M2028M3250M4999M7416
56021B318473M9574N1280N3615N6955O0106O2321O4490O7396P0377P2730P5003
56010C002320P7875Q1084Q4351Q8107R2584R7450J02748J08787J14888J20048
56000C970242J25060J31817J40148J47836J54384J62070J72280J83500J94259
55991E381596K05508K18648K33530K49775K67858K87618L08055L29763L55127
55982G837478L85013M17848M53040M92361N36843N85584O39056P00316P71432
55973A2818971Q52099R43326J049053J172636J315817J482947J682453J922653
55965B3239955K210766K558313K983261L505504M145465M928928N886241P040752
$$ plain form
56032 1897961 1927431 1957690 1990079 2024931 2061730 2100307 2140780 2182808 2226058 2271057 2318473
56021 2318473 2368047 2419327 2472942 2529897 2590003 2652324 2716814 2784210 2854587 2927317 3002320
56010 3002320 3080195 3161279 3245630 3333737 3426321 3523771 3626519 3735306 3850194 3970242
56000 3970242 4095302 4227119 4367267 4515103 4669487 4831557 5003837 5187337 5381596
55991 5381596 5587104 5805752 6039282 6289057 6556915 6844533 7152588 7482351 7837478
55982 7837478 8222491 8640339 9093379 9585740 10122583 10708167 11347223 12047539 12818971
55973 12818971 13671070 14614396 15663449 16836085 18151902 19634849 21317302 23239955
55965 23239955 25450721 28009034 30992295 34497799 38643264 43572192 49458433 56499185
55957E6499185Q397141R936965J1619364J3391816J5215460J7082502J8996356
55950A51138789K0926145K2767622K4300616K5131556K4712651K2559424J8571788
55943C10108591J3130788O806337j7430p143284j4196641k0405607k4881912k7141463
55935B36259379k7333644k6023026k3828922k1232182j8560019j6014055j3692679
55928H9574852j1630014r836996q311228p029944n958742n068278m334384l729390
55920C3675876l225599k804293k452983k157563j904685j687986j504699j348756
55912A6589312j212939j094464r92601r03561q22955p50599o87851o32587n81378
55903H910377n34376m93453m57436m23377l90877l61320l34280l08295k83894
$$ plain form
55957 56499185 64896326 74833291 86452655 99844471 115059931 132142433 151138789
55950 151138789 172064934 194832556 219133172 244264728 268977379 291536803 310108591
55943 310108591 323239379 330045716 330028286 322885002 308688361 288282754 263400842 236259379
55935 236259379 208925735 182902709 159073787 137841605 119281586 103267531 89574852
55928 89574852 77944838 68107842 59796614 52766670 46807928 41739650 37405266 33675876
55920 33675876 30450277 27645984 25193001 23035438 21130753 19442767 17938068 16589312
55912 16589312 15376373 14281909 13289308 12385747 11562792 10812193 10124342 9491755 8910377
55903 8910377 8376001 7882548 7425112 7001735 6610858 6249538 5915258 5606963 5323069
55894E323069k62580k43953k26538k10199j95321j81090j66992j54417j44361
55885C537618j35186j25106j15117j06941r9835r2104q4354p8409p4245p0612
55875B555709o7641o6313o6190o6081o6132o7042o7937o7323o5427o3580o1874
55864A830169n9337n5908n2384m8952m5443m2475m0736l9713l8508l7233l6254
55853A333226l4990l2946l1041l0225k9690k8095k5821k4277k3691k3266k2892
55842A026292k2939k2891k1928k0533j9836j9659j8852j7330j6149j5638j4967
55831H15570j3665j2278j1324j0656j0055r634r540r762j0154j0271r604q408
55819F90219p671p830q231q332q462q783q615p632o658o309n963n011l999l366
$$ plain form
55894 5323069 5060489 4816536 4589998 4379799 4184478 4003388 3836396 3681979 3537618
55885 3537618 3402432 3277326 3162209 3055268 2955433 2863329 2778975 2700566 2626321 2555709
55875 2555709 2488068 2421755 2355565 2289484 2223352 2156310 2088373 2021050 1955623 1892043 1830169
55864 1830169 1770832 1714924 1662540 1613588 1568145 1525670 1484934 1445221 1406713 1369480 1333226
55853 1333226 1298236 1265290 1234249 1204024 1174334 1146239 1120418 1096141 1072450 1049184 1026292
55842 1026292 1003353 980462 958534 938001 918165 898506 879654 862324 846175 830537 815570
55831 815570 801905 789627 778303 767647 757592 747958 738418 728656 718502 708231 698627 690219
55819 690219 682548 674718 666487 658155 649693 640910 632295 624663 618005 611696 605733 600722 596723 593357
55805E93357k371n61R08J010P75J709L271L753K970K072J327Mj873l496m780o183
55789E91892p309p424p036p184p418o418m550l699m373m957m266k973j909p85
55775E21591O42J721K184L010M981P427R228J0128J0292R398P091L644n01n270
55761E85566j0423j5010j8046j9375j9517j9025j8269j7426j6340j4834j3257
55750D04044j2238j1758j1131j0045q940q101p126n721m378l666l335k712j688
55737C13205q08m68n23o42p50j000j486k144k957m034n269o034n695m515l535
55722B73345l314l276k653j558o51j78J26N00J042J793K584L123L558M416N540
55707B84397N833M637K705J066l44k034l710m748n367o176o996p248p089o926
$$ plain form
55805 593357 590986 590425 591333 592343 593118 594827 598098 601851 604821 606893 608220 608224 606351 602855 598075 591892
55789 591892 584583 577159 570123 562939 555521 549103 544553 540854 536481 531524 527258 524285 522376 521591
55775 521591 522233 523954 526138 529148 534129 541556 550784 560912 571204 580602 587693 591337 590836 585566
55761 585566 575143 560133 542087 522712 503195 484170 465901 448475 432135 417301 404044
55750 404044 391806 380048 368917 358872 349932 341831 334705 328984 324606 320940 317605 314893 313205
55737 313205 312397 311929 311406 310764 310014 309014 307528 305384 302427 298393 293124 287090 281395 276880 273345
55722 273345 270031 266755 264102 262544 261893 261715 261841 262341 263383 265176 267760 270883 274441 278857 284397
55707 284397 290230 294867 297572 298638 298294 296260 292550 287802 282435 276259 269263 262015 254926 248000
55693B48000o307m628k666j800j958j813j042o94j093j098L0J499K367K792L151
55678B34740L173K731K442K632K622J825P19Mm24r11j190r55n99o56r34r50p07
55661B43562m01J31R77J659J738J514J469J428R02m9r32j504j815j749j170l78
55645B45382Pl87j497k936m087m445m185m086m653n567o248o487o222n266l734
55630A85589k358j786j847j899j708j510j480j519j522j457j287j038q14o57n44
55615A64163n99r82j559k021k365k773k963k378j219n02p38j201j035m68k61n13
55599A42586p59q52j014j220j217j067j032r98n44L53J136J266P66J33j08J18
55583A37547L33N1n08o28p1O09R56J215J717K274K625K954L454L799L709L574
$$ plain form
55693 248000 241693 237065 234399 232599 230641 228828 227786 227092 225999 224901 224931 226430 228797 231589 234740
55678 234740 237913 240644 243086 245718 248340 250165 250884 250888 250464 249553 248363 247408 246809 246153 245219 244269 243562
55661 243562 243161 243292 244269 245928 247666 249180 250649 252077 252979 252930 251998 250494 248679 246930 245760 245382
55645 245382 245389 245002 243505 240569 236482 232037 227852 223766 219113 213546 207298 200811 194589 189323 185589
55630 185589 183231 181445 179598 177699 175991 174481 173001 171482 169960 168503 167216 166178 165364 164707 164163
55615 164163 163564 162582 161023 159002 156637 153864 150901 148523 147304 146802 146064 144863 143828 143360 143099 142586
55599 142586 141827 140975 139961 138741 137524 136457 135425 134427 133883 134236 135372 136638 137404 137537 137429 137547
55583 137547 137880 137931 137423 136795 136724 137333 138289 139504 141221 143495 146120 149074 152528 156327 160036 163610
55567A63610L840M197M083L598L150K555J424J54m63o34j444l170m682m963m363
55552A66892l870l797l710l242k391j378n72l71p25j061r38n28j76J99Q14J422
55536A46568J495R63L61J82L82M97J14p67j637j788j056j79j03r60j986k539k677
55519A36870k680k480k040j837k286k899k764j901j382j784k316j978j043n85
55505A08895r12j309j207q45n94l94r0R1j97r47j730j898r88P24K099K083Q82
55488A03663l12p40o79n37j42O84J459J562J020L63q4l02k62J01O36R94Q81J83
55470A08488q62j616j556r88p75j173j482j089l43M5q1m55q77j043m52Q29J770
55453I8340J507N61O4R2l12j465k375k040p24M96R18O44J49k16m22o21p55m69
$$ plain form
55567 163610 167450 171647 175730 179328 182478 185033 186457 186611 186148 185514 184070 180900 176218 171255 166892
55552 166892 163022 159225 155515 152273 149882 148504 147932 147561 146836 145775 144837 144309 144133 144332 145146 146568
55536 146568 148063 149026 149387 149569 149951 150448 150562 149795 148158 146370 145314 145135 145032 144072 142086 139547 136870
55519 136870 134190 131710 129670 127833 125547 122648 119884 117983 116601 114817 112501 110523 109480 108895
55505 108895 107983 106674 105467 104622 104028 103634 103544 103635 103438 102491 100761 98863 97875 98599 100698 102781 103663
55488 103663 103351 102611 101932 101395 101253 101937 103396 104958 105978 106341 106257 105955 105693 105794 106430 107424 108305 108488
55470 108488 107626 106010 104454 103466 102691 101518 100036 98947 98604 98649 98568 98113 97236 96193 95741 96570 98340
55453 98340 99847 100408 100472 100564 100252 98787 96412 94372 93648 94144 95062 95706 95855 95639 95217 94596 93841 93372
55435I3372M08J474K107K081J524N96m16r75q31m97n50p18l64K80L34k19k85O83
55417I8004J696J494K23q65r81l95K57O08N81K98L1l6nn5j60k15k69l77m40m52
55397I8942p10j352j892j641o74J43K42K2K05P11P17j70j186j213j63Q56Q75J84
55379I3896j70K42Q38R87Q06P52Q58P66L35k00n71p01n76k86j32m08r64j294j163
55360I3015q53p20p52p94q78j052j104q11k97J44M72P67P67J70o57q87l21L40
55342H6549N48O31J005J275Q74J14j86Q4L30L33M29N96K92n31j083q07j16K84
55324I0621K42q8o01r11l23J162K343K117R17J10J65K98j45p41p29j20L37O1p14
55305I4001j219r96m08j07j24J31Q65J465J386R03N49K68k20o53n67j58r2m67
$$ plain form
55435 93372 93780 95254 97361 99442 100966 101562 101146 100171 99340 98843 98293 97575 97211 97491 97825 97606 97321 98004
55417 98004 99700 101194 101417 100552 99571 99176 99433 100041 100622 100920 100951 100915 100910 100855 100695 100480 100211 99834 99394 98942
55397 98942 98232 96880 94988 93347 92673 92816 93058 93080 93285 93996 94713 94543 93357 92144 91981 92837 93712 93896
55379 93896 93726 93968 94806 95793 96599 97351 98209 98975 99310 99110 98539 97838 97262 96976 96844 96436 95472 94178 93015
55360 93015 92162 91442 90690 89896 89018 87966 86862 86051 85754 85898 86370 87137 87904 88074 87417 86530 86209 86549
55342 86549 87097 87728 88733 90008 90882 90996 90810 90894 91224 91557 91986 92582 92874 92343 91260 90453 90337 90621
55324 90621 90863 90775 90174 89263 88940 90102 92445 94562 95479 95589 95754 96052 95907 95166 94437 94317 94654 94715 94001
55305 94001 92782 91786 91378 91271 91147 91278 92143 93608 94994 95897 96446 96714 96494 95841 95274 95116 95024 94557
55287I4557o63k47N33J179J375J008K69k62j66K08J99k24m95m24m21p19r94r76
55269I3737p85n18q1L14J31o23j085n40O34J467J579J408J369J264O55m23j302
55252I7201j330o66j13j50m13l87k15k84m23k08J64Q4l56m28l3J2o51j232r38
55233H9634j35L20K80J03j93p37j079n94M94J282J405J399J652J707R78k75j100
55216I5141q70J66J193J457P27n60j524j465m44P20J194Q44J85k56l77l70m30
55199I5331o57q84o30L53J385J312K7j019n05J035J927J486N34j04n54j120j511
55182I6406j369r12n74l97j99k9o4k42k76Q4Q11J495J575J031N93P88J081O65
55164A00467j35k57L68O75K47n3L50O98K41n00p17n92n82k97O95J597J281R4n27
$$ plain form
55287 94557 93894 93647 94180 95359 96734 97742 98011 97749 97583 97791 97990 97766 97271 96847 96426 95707 94713 93737
55269 93737 92952 92434 92353 92667 92798 92175 91090 90550 91184 92651 94230 95638 97007 98271 98926 98503 97201
55252 97201 95871 95205 95092 94942 94529 94142 93927 93643 93220 93012 93176 93260 92904 92476 92443 92455 91804 90572 89634
55233 89634 89499 89819 90099 90202 90009 89272 88193 87599 88093 89375 90780 92179 93831 95538 96516 96241 95141
55216 95141 94271 94437 95630 97087 97814 97254 95730 94265 93821 94541 95735 96579 96764 96508 96131 95761 95331
55199 95331 94674 93790 93160 93513 94898 96210 96237 95218 94713 95748 97675 99161 99695 99591 99037 97917 96406
55182 96406 95037 94125 93551 93154 92955 92926 92862 92620 92344 92428 93239 94734 96309 97340 97933 98721 99802 100467
55164 100467 100332 100075 100443 101118 101365 101312 101662 102360 102601 102101 101384 100792 100210 99913 100608 102205 103486 103580 103053
55145A03053j67J68k45q69q94l18L11N31J90l85m03N53J679J710N29p16j210j265
55127A02252j340j145k82Q80J571J432O39m05j159j134m31J85J37l43o61o36m90
55110I9070l29j6M68Q93R95P70M99M84P26R54J048J226J578J652R68k16j083j230
55092A08457r60o12j16O17J351J775J768J273K90p57j120m47Q03J826K149J699
55076A17996O59n04j175j107o65l30j76NK69M93N81M86R6n46j061r94l07N20R29
55057A15169P48K66j17k79l90n76p99j037j363j616j378n91O2m1n02l58N17J187
55039A08902R08L9o63j012j213j218p90l9O35J014J116R17L96j41j73N00J502
55022A10680K150J961J018n2n14k09L10L83m3m98o48o26o34m44L43J547K213J549
$$ plain form
55145 103053 102886 103054 102809 101940 101046 100728 101039 101570 101760 101375 100972 101525 103204 104914 105443 104727 103517 102252
55127 102252 100912 99767 99485 100365 101936 103368 104007 103602 102443 101309 100878 101063 101200 100857 100196 99560 99070
55110 99070 98741 98725 99193 100086 101081 101851 102350 102834 103560 104514 105562 106788 108366 110018 110986 110770 109687 108457
55092 108457 107497 106885 106769 107386 108737 110512 112280 113553 113843 113086 111966 111519 112322 114148 116297 117996
55076 117996 118655 118151 116976 115869 115204 114874 114698 114703 114972 115465 116046 116532 116628 116082 115021 114027 113720 114240 115169
55057 115169 115917 116183 116066 115787 115397 114821 114022 112985 111622 110006 108628 108037 108099 108058 107556 107198 107715 108902
55039 108902 109810 109849 109186 108174 106961 105743 104953 104914 105549 106563 107679 108596 108992 108851 108678 109178 110680
55022 110680 112830 114791 115809 115757 115243 115034 115344 115727 115684 115186 114538 113912 113278 112834 113177 114724 116937 118486
55004A18486k9j223j276o78k57j48m9k7l05n65l00K22J84m73q55m50R5N6k51n4
54984A12103O26J064R30O52O58P33L23o74j543j345k3J293J493Q89O97J249J533
54967A20658Q17k46o86n02j97K68J052J544J043M9k35L79Q55N57J7j26j4qqJ15
54947A25332M9m37r92j169j068r88q68n69l33m54o70m87M6M47O12R89J808K653
54929A23901L022K955K853K894K972L104L533M314N038N174M664M055L955M457
54915A76891N076N203M572L373J993O88n37j754k887l758m360m903n509n949n858
54900A62281n144m105l110k392k033k062k364k628k477j766p24K18P98J088J327
54885A36907J620J929K211K525K946L482M047M501M747M909N194N502N383M671
$$ plain form
55004 118486 118457 117234 115958 115280 115023 114875 114826 114799 114494 113929 113629 113851 114035 113562 112707 112257 112352 112408 112157 112103
54984 112103 112729 113793 114723 115375 116033 116766 117089 116415 114872 113527 113504 114797 116290 117179 117876 119125 120658
54967 120658 121475 121229 120543 120041 119844 120112 121164 122708 123751 123800 123565 123944 124799 125356 125373 125247 125233 125225 125217 125332
54947 125332 125381 124944 123952 122783 121715 120727 119859 119290 118957 118503 117833 117346 117392 117839 118451 119440 121248 123901
54929 123901 126923 129878 132731 135625 138597 141701 145234 149548 154586 159760 164424 168479 172434 176891
54915 176891 181967 187170 191742 195115 197108 197796 197259 195505 192618 188860 184500 179597 174088 168139 162281
54900 162281 157137 153032 149922 147530 145497 143435 141071 138443 135966 134200 133476 133694 134492 135580 136907
54885 136907 138527 140456 142667 145192 148138 151620 155667 160168 164915 169824 175018 180520 185903 190574
54871A90574L872L533L341K421N34j587l239m481n580o302o254n536m688m154
54857A62454m130m543m884m454l264k255k181k627k740k502k457k520j941n95
54843A21361O66J113Q83L52m63j496k232k252j850j601j599j485j028l32L73Q78
54827A11288J044R23P00M17j3l95k15O28J432J379N28k95n00k70p4j9J07L15K53
54808A17233l15r91j080m42K33L36J98N81J471K011J718J148J050J415J694J564
54792A27824J082M05j84k69J79N18J53o48j088q77l91J57J008K193L093L102K402
54775A38659J765J684K017K400K698L050L548M049M330M370M420M761N415O135
54761A89301O545O309N325L888K489J336J36j431l168m517n193n477n741o007
$$ plain form
54871 190574 194446 197979 201320 203741 204275 202688 199449 194968 189388 183086 176832 171296 166608 162454
54857 162454 158324 153781 148897 144443 141179 138924 136743 134116 131376 128874 126417 123897 121956 121361
54843 121361 122027 123140 124023 124375 123912 122416 120184 117932 116082 114481 112882 111397 110369 110037 110410 111288
54827 111288 112332 113255 113955 114372 114359 113964 113749 114377 115809 117188 117716 117421 116921 116651 116577 116558 116665 116980 117233
54808 117233 116918 115927 114847 114405 114638 114974 115172 115753 117224 119235 120953 122101 123151 124566 126260 127824
54792 127824 128906 129311 129127 128858 129037 129555 129708 129060 127972 127095 126704 126861 127869 130062 133155 136257 138659
54775 138659 140424 142108 144125 146525 149223 152273 155821 159870 164200 168570 172990 177751 183166 189301
54761 189301 195846 202155 207480 211368 213857 215193 215329 213898 210730 206213 201020 195543 189802 183795
54747A83795o008n649n196n001n024m768l820k438j348r17q47p57p30q73p81k6
54731A39612J002J414J098R59J653K688L242L339L639M322M916N093M997M735
54717A82709M134L214K343J638P25n41j621k094k498l586n000n555m907m064l896
54702A61001m025l736l283l327l510k731q63P75J003J22p58j044q88o14n02p93
54686A36827j342j513r90l79n07j254j743j554j089p04k27M37Q70O76M0n90r91
54669A25967j046n65K87P16R7j153j928j692q92k29Nj56n51p45l13M64N77m72
54651A18371j747j786m13R73J096K73j79L61J225J526J221R11Q96Q59M31k34o26
54634A23158m27K51J076J674J654Q08m71j225p37O06J595J431M35o01j378k017
$$ plain form
54747 183795 177787 172138 166942 161941 156917 152149 148329 145891 144543 143626 142779 142022 141292 140419 139638 139612
54731 139612 140614 142028 143126 144085 145738 148426 151668 155007 158646 162968 167884 172977 177974 182709
54717 182709 186843 190057 192400 194038 194763 194222 192601 190507 188009 184423 179423 173868 168961 164897 161001
54702 161001 156976 153240 149957 146630 143120 140389 139526 140301 141304 141426 140668 139624 138736 138122 137620 136827
54686 136827 135485 133972 132982 132603 132096 130842 129099 127545 126456 125752 125525 125962 126832 127508 127548 126958 125967
54669 125967 124921 124356 124643 125359 125456 124303 122375 120683 119791 119562 119567 119411 118860 118115 117802 118266 118843 118371
54651 118371 116624 114838 114425 115398 116494 116767 116588 116949 118174 119700 120921 121832 122728 123587 124018 123784 123158
54634 123158 122731 122982 124058 125732 127386 128194 127723 126498 125761 126367 127962 129393 129828 129227 127849 125832
54618A25832k269j512K59J960K439J748R41O67N48J04l54k37K74L84j18n71n06
54601A29589l92p94j360j302o52k22l61n29k78J59N32J069J722J696M69j126j764
54584A26456j270o20l60j01M41Q05O36L34M14P65J014J109J091P81J76k73l63
54567A31035o56j641k686k634j341P2N90L47J25L46P77R38N69p3m03j16M36P30
54549A26415P36P60P99N42P6m0M85J286J889K196K279K091J713J380J078M33n48
54532A43570j110o15M63J024O84L0m13q48j565k236k265j602p89l00k28m68q36
54515A32496r73n71Q9K33m60j314j432q35l11k15p9M34Q71P13K26P3L62P03R49
54496A30959J238J409J087M42J30K71K02l97p49J9J497K278J557q1j435j783j172
$$ plain form
54618 125832 123563 122051 122310 124270 126709 128457 129398 130065 130613 130717 130363 130126 130400 130784 130666 130095 129589
54601 129589 129197 128403 127043 125741 125089 124867 124506 123977 123699 123858 124390 125459 127181 128877 129346 128220 126456
54584 126456 125186 124566 124206 124105 124546 125351 125987 126321 126735 127500 128514 129623 130714 131495 131671 131398 131035
54567 131035 130379 128738 126052 123418 122077 122149 122739 123086 123211 123557 124334 125272 125841 125768 125365 125249 125685 126415
54549 126415 127151 127911 128710 129252 129328 129288 129773 131059 132948 135144 137423 139514 141227 142607 143685 144118 143570
54532 143570 142460 141845 142308 143332 144016 144046 143633 142785 141220 138984 136719 135117 134328 134028 133800 133332 132496
54515 132496 131523 130952 131041 131274 130814 129500 128068 127233 126922 126707 126628 127062 127933 128646 128872 128945 129307 130010 130959
54496 130959 132197 133606 134693 135135 135265 135536 135738 135341 134592 134611 136108 138386 139943 139862 138427 136644 135472
54479A35472q5R04J397J379J160J092J282J575J669J312N19l87r48q44q5R30J526
54462A47868J231K54o62r99q82n85K6J158K344K569J402l84j559j666j209p89
54446A48117m46J6L88J56p41j622j804j381j028j051j032m91L53P86M38k43m32
54429A39983K21J148J413P44j17l17N6K27l3r2N27J392J873K021K158K012J050
54412A54266m20j307j071l17J35K60M55P03O36K52k1Q9L88N66N43M09K27O0JJ06
54392A55960L10M95O12O63O67O43O32O46N91K82l53j097j505j273n43J86M93L63
54374A57772J30J89O63J340J857K024K015K171K631L159L372L147K774K567K431
54359A88242J918Q83q3k13M76J081Q04j86j098j464j476j528j791k230k788l388
$$ plain form
54479 135472 135387 136291 137688 139067 140227 141319 142601 144176 145845 147157 147676 147289 146341 145497 145412 146342 147868
54462 147868 149099 149353 148691 147692 146810 146225 146251 147409 149753 152322 153724 153340 151781 150115 148906 148117
54446 148117 147671 147687 148075 148231 147490 145868 144064 142683 141655 140604 139572 139081 139434 140220 140658 140415 139983
54429 139983 140204 141352 142765 143509 143392 143075 143131 143358 143325 143233 143760 145152 147025 149046 151204 153216 154266
54412 154266 153846 152539 151468 151151 151286 151546 152001 152704 153340 153592 153571 153660 154048 154614 155157 155566 155793 155853 155854 155960
54392 155960 156270 156765 157377 158040 158707 159350 159982 160628 161219 161501 161148 160051 158546 157273 156730 156916 157409 157772
54374 157772 157902 158091 158754 160094 161951 163975 165990 168161 170792 173951 177323 180470 183244 185811 188242
54359 188242 190160 191043 190960 190747 191223 192304 193108 192922 191824 190360 188884 187356 185565 183335 180547 177159
54343A77159l893m086l723k679j186K10J013J090N40m95j658k309k024j184o82
54328A56093r15j367j259l89P31J402J278O07J0j34m8j96o16q87p23k64K81Q12
54310A54416J099Q34J61k72j63p9o53j557j812j104j72K01J22K47P84J224J038
54293A54314L57j58j16J44P3k73k83K12M80j94j428k075j564l81P64J616K057
54276A53545J757O92l22l14O41J419J196L99M4M92J176J423J105N34P7kL78R48
54258A65188J221R83N70L47K00j86o43n93J20Q99J080O37J5m20n29k86R9J80l03
54239A68579j012j363j178p96o10p34j000j074o98l6L53K25N3L61Q45P79K04k
54221A62896N71J203J031J81n22o15k50K53N92L47o96k045k779k455j558q90p60
$$ plain form
54343 177159 173266 169180 165457 162778 161592 161802 162815 163905 164445 163950 162292 159983 157959 156775 156093
54328 156093 155178 153811 152552 152163 152894 154296 155574 156181 156191 156057 156009 155813 155197 154310 153587 153323 153604 154416
54310 154416 155515 156349 156510 156238 156075 155996 155343 153786 151974 150870 150698 150899 151021 151268 152052 153276 154314
54293 154314 154671 154513 154397 154541 154614 154341 154058 154270 154750 154556 153128 151053 149489 149108 149872 151488 153545
54276 153545 155302 155994 155672 155358 155999 157418 158614 159013 159057 159549 160725 162148 163253 163787 163864 163862 164240 165188
54258 165188 166409 167392 167962 168309 168509 168323 167680 167087 167207 168106 169186 169823 169838 169418 168889 168603 168702 168882 168579
54239 168579 167567 166204 165026 164230 163620 162886 161886 160812 160114 160078 160431 160656 160709 161070 161915 162694 162898 162896
54221 162896 163467 164670 165701 165882 165360 164745 164495 164748 165340 165687 164991 162946 160167 157712 156154 155264 154504
54204A54504q19n85L1O40Q05M92P3j39j27O4N21J202J722J729J409J256J367J275
54186A65420N84m16r67o34K15P30M80l0O5R17J765J888J347O13j07p60j046p69
54168A69295l72m79j015j314j103p52n47l73k26l22m99j84O84J301J025K43k27
54151A65135j34K51O98J025Q69J45o02q27p38q61j110r43k68M60R33J187J147
54134A66367O40j01n39n16l45k36j66k62n90o60P9J090J099r0j078p13L50P38
54116A65067L19N8L71O71N40L58N43Q60Q67O32O05R80J481J760J747J640J554
54099A80053J444J387J727K532L119K703J579R24J158J302N06n56p30k06j66q48
54083A95928j237q33n19j154k212k571j986j137n38j15M19J237K345L382L673
$$ plain form
54204 154504 153685 153100 153131 153771 154576 155068 155141 155002 154875 154939 155460 156662 158384 160113 161522 162778 164145 165420
54186 165420 166004 165588 164621 163987 164202 164932 165412 165382 165447 166364 168129 170017 171364 171977 171870 171110 170064 169295
54168 169295 168923 168444 167429 166115 165012 164260 163713 163340 163114 162792 162293 162109 162793 164094 165119 165362 165135
54151 165135 165001 165252 165950 166975 167844 167989 167387 166560 165822 164961 163851 162908 162640 163100 164033 165220 166367
54134 166367 167007 166906 166367 165851 165506 165270 165104 164842 164252 163592 163671 164761 165860 165770 164692 163979 164329 165067
54116 165067 165386 165444 165815 166486 167026 167384 167927 168787 169654 170286 170891 171871 173352 175112 176859 178499 180053
54099 180053 181497 182884 184611 187143 190262 192965 194544 195468 196626 197928 198434 197878 197148 196942 196776 195928
54083 195928 194691 193858 193339 192185 189973 187402 185416 184279 183741 183626 184045 185282 187627 191009 194682
54068A94682K877J523M96J11O6J65N96J399K120K207J616Q29L71L64N23N23L57
54051B10825K86M51P24J001J407K063K691K823K369J812J697K094K656L158L734
54036B39791M524N278N591N514N633O295P066P243O722O038N585N248M789M176
54022C19493L411K380J137Q0m20m21l20m87j022j743k299k536k701l123l733m249
54006C03447m688n235n590n119l890k886k796l166l256l108l173l327l133k781
53992B51299k864l291l316k776k398k635k914k528j682j103r21n96J38Q03P70
53977B25986Q0n72o55l84l72p20q16k01P34J241J219J179J382J590J636J686J818
53960B34831J886K000K511L304L723L551L520M322N536O187O005N487M952M199
$$ plain form
54068 194682 197559 199082 199578 199689 199755 199920 200516 201915 204035 206242 207858 208687 209058 209422 209945 210468 210825
54051 210825 211111 211562 212286 213287 214694 216757 219448 222271 224640 226452 228149 230243 232899 236057 239791
54036 239791 244315 249593 255184 260698 266331 272626 279692 286935 293657 299695 305280 310528 315317 319493
54022 319493 322904 325284 326421 326501 326081 325660 325340 324853 323831 322088 319789 317253 314552 311429 307696 303447
54006 303447 298759 293524 287934 282815 278925 276039 273243 270077 266821 263713 260540 257213 254080 251299
53992 251299 248435 245144 241828 239052 236654 234019 231105 228577 226895 225792 224871 224275 224413 225216 225986
53977 225986 226066 225494 224839 224455 224083 223363 222547 222346 223080 224321 225540 226719 228101 229691 231327 233013 234831
53960 234831 236717 238717 241228 244532 248255 251806 255326 259648 265184 271371 277376 282863 287815 292014
53946B92014L087J817N76n33j135p83K88J123J062M58P1J60M71Q13J176J444J464
53929C03573J321J255J304J364J594K337L547M650N203N367N502N585N473N407
53915C53482N791O402O541O117O046P075Q619R364Q837P752O761N633L914J861
53901D44195K06p09j099j260j364j616k195k995l737m329m862n325n623n864o226
53886C97197o571o630o623p163q325r288r249q323p146o005m867l931l496l366
53872C06214l032k516k402k950l671m002l894l564l157k896l087l629l986l935
53858B59493l866l967l731k791j776j534j916k126j981j914j881j358n14l19j110
53843B28709k003k127j675j212p08N3P79J069J073J029O60k67j177j236n34J08
$$ plain form
53946 292014 295101 296918 297494 296961 295826 295043 295331 296454 297516 297974 298045 298205 298676 299489 300665 302109 303573
53929 303573 304894 306149 307453 308817 310411 312748 316295 320945 326148 331515 337017 342602 348075 353482
53915 353482 359273 365675 372216 378333 384379 391454 400073 409437 418274 426026 432787 438420 442334 444195
53901 444195 444401 443692 442593 441333 439969 438353 436158 433163 429426 425097 420235 414910 409287 403423 397197
53886 397197 390626 383996 377373 370210 361885 352597 343348 335025 327879 321874 317007 313076 309580 306214
53872 306214 303182 300666 298264 295314 291643 287641 283747 280183 277026 274130 271043 267414 263428 259493
53858 259493 255627 251660 247929 245138 243362 241828 239912 237786 235805 233891 232010 230652 230138 229819 228709
53843 228709 226706 224579 222904 221692 220984 221037 221816 222885 223958 224987 225647 225380 224203 222967 222433 222541
53827B22541K88K92L01N5n66j240j522j150p1J314K144J877J050O90J053J539
53811B28595J722J830K134K586L115L729M172M171M013M228M627M523L982M015
53797B77442N072O226O368N589M780M433M432M534M486L967K983K037J501J180
53783C35030P99N38N75N79J30p28j775l075m552n611n766n320m824m298l636l316
53767B94750l786m454m290l350k741k951l271l059k686k792l277l594l539l261
53753B47699k836k274j788j644j842k106k156j903j496j205j109r69n97k62l62
53738B25150p90j022q32n06l10j64N1K59M01N68Q12J068J279J332R38L7p29n39
53720B27003M78J207R53L05L08J091J816J739R96M05O63J629K376K178J448J230
$$ plain form
53827 222541 222829 223121 223422 223477 222911 221671 220149 218999 218928 220242 222386 224263 225313 226003 227056 228595
53811 228595 230317 232147 234281 236867 239982 243711 247883 252054 256067 260295 264922 269445 273427 277442
53797 277442 282514 288740 295108 300697 305477 309910 314342 318876 323362 327329 330312 332349 333850 335030
53783 335030 335829 336367 336942 337521 337651 336923 335148 332073 327521 321910 316144 310824 306000 301702 298066 294750
53767 294750 290964 286510 282220 278870 276129 273178 269907 266848 264162 261370 258093 254499 250960 247699
53753 247699 244863 242589 240801 239157 237315 235209 233053 231150 229654 228449 227340 226371 225774 225512 225150
53738 225150 224360 223338 222506 222000 221690 221526 221577 221836 222237 222805 223617 224685 225964 227296 228234 228271 227542 227003
53720 227003 227481 228688 229641 229946 230254 231345 233161 234900 235896 236301 236964 238593 240969 243147 244595 245825
53704B45825J816K404K289J787J612J888K237K456K614K738K899L276L751L791
53690B81383L148K389K189K335K069J202K74l40p55j022r25n26l46o96j205j315
53674B87859r37l75Q4K75N9n00j002j010m82K20P39R67R17M41o64k190l277l027
53656B78097j517Q4O78L61O5L33R19J406J666J608J113M52K79Q05J403J418J061
53639B90231R98J296J392J056P94J072J683K086K130K034J968J961K099K439K787
53624C16026K875K782K812K938K769K274K088K721L715M075L459K504J971J975
53610C54984K194K429K704L023L298L360K967K082J239J224K083K890K839K278
53596C89594K090K343K270J544P58M34K39k94q63q09j75K71N5n38j065j476j869
$$ plain form
53704 245825 247641 250045 252334 254121 255733 257621 259858 262314 264928 267666 270565 273841 277592 281383
53690 281383 284531 286920 289109 291444 293513 294715 294989 294649 293894 292872 291947 291421 291075 290379 289174 287859
53674 287859 286922 286547 286631 286906 286965 286465 285463 284453 283971 284191 284930 285897 286814 287255 286591 284401 281124 278097
53656 278097 276580 276664 277342 277703 277768 278101 279020 280426 282092 283700 284813 285265 285544 286349 287752 289170 290231
53639 290231 291229 292525 293917 294973 295767 296839 298522 300608 302738 304772 306740 308701 310800 313239 316026
53624 316026 318901 321683 324495 327433 330202 332476 334564 337285 341000 345075 348534 351038 353009 354984
53610 354984 357178 359607 362311 365334 368632 371992 374959 377041 378280 379504 381587 384477 387316 389594
53596 389594 391684 394027 396297 397841 398599 399033 399272 398978 398115 397306 397131 397402 397457 396919 395854 394378 392509
53579C92509k083j901j498j306j437j514j194o70m64p56j177j316j214j125j004
53564C73850o00k7J82k00p21r05r07j078j189o56M88J546K097K390K608K459J896
53547C81233J568J916K318J930J050Q12J570K473K833L016L645M559N120N074
53533D19117M691M374M552N549P067Q165Q240P795P740Q272Q934R536J0211J0811
53519E25054J1006J1059J1714J3069J4299J4753J4776J5119J5971J7060J8210
53508F82090J9397K0507K1431K2225K2866K3149K3061K2951K2909K2385K0878
53497I23849J8840J7328J6853J7057J7416J7727J7844J7553J7016J6849J7335
53486A115667J7891J7699J6774J6008J6124J6945J7705J7760J6911J5341J3613
$$ plain form
53579 392509 390426 388525 387027 385721 384284 382770 381576 380906 380442 379686 378509 377193 375979 374854 373850
53564 373850 373250 373223 373405 373205 372484 371579 370672 369594 368405 367749 368237 369783 371880 374270 376878 379337 381233
53547 381233 382801 384717 387035 388965 390015 390827 392397 394870 397703 400719 404364 408923 414043 419117
53533 419117 423808 428182 432734 438283 445350 453515 461755 469550 477290 485562 494496 504032 514243 525054
53519 525054 536060 547119 558833 571902 586201 600954 615730 630849 646820 663880 682090
53508 682090 701487 721994 743425 765650 788516 811665 834726 857677 880586 902971 923849
53497 923849 942689 960017 976870 993927 1011343 1029070 1046914 1064467 1081483 1098332 1115667
53486 1115667 1133558 1151257 1168031 1184039 1200163 1217108 1234813 1252573 1269484 1284825 1298438
53475A298438J2436J2037J1769J0746Q886O905N195L247N47k468m875o366p335
53462A349162q083q651r266j0207j1128j1349j0996j1073j2102j3347j3921j3975
53450A215064j4189j4657j5050j5474j6288j7221j7444j6567j4976j3124j1116
53439A048958r161p804p380p472p230o127m348k600j526j278j504j740j646q89
53425I88253P34K918M909O328P582R142J0757J1896J2588J3272J4090J4939J6069
53412A113477J7810J9792K1192K1879K2674K4272K6479K8698L0587L2046L3077
53401A391983L3979L5234L6952L8714M0137M1176M1940M2644M3741M5448M7108
53390A839056M7728M7402M7333M8115M8817M8297M6654M4705M2763M0713L8797
$$ plain form
53475 1298438 1310874 1322911 1334680 1345426 1354312 1361217 1366412 1369659 1370206 1367738 1362863 1356497 1349162
53462 1349162 1341079 1332428 1323162 1312955 1301827 1290478 1279482 1268409 1256307 1242960 1229039 1215064
53450 1215064 1200875 1186218 1171168 1155694 1139406 1122185 1104741 1088174 1073198 1060074 1048958
53439 1048958 1039797 1031993 1024613 1017141 1009911 1003784 999436 996836 995310 994032 992528 990788 989142 988253
53425 988253 988987 991905 996814 1003142 1010724 1019866 1030623 1042519 1055107 1068379 1082469 1097408 1113477
53412 1113477 1131287 1151079 1172271 1194150 1216824 1241096 1267575 1296273 1326860 1358906 1391983
53401 1391983 1425962 1461196 1498148 1536862 1576999 1618175 1660115 1702759 1746500 1791948 1839056
53390 1839056 1886784 1934186 1981519 2029634 2078451 2126748 2173402 2218107 2260870 2301583 2340380
53379B340380L7330L5936L3954L1404K8767K5977K2439J8034J3336Q799M356j12
53367B600600m574r131j3913j8611k2733k6346k9892l3218l5563l6699l7340l8095
53355B294485l8747l8947l8923l9006l8955l8414l7535l6653l5723l4694l4067
53344A882821l4280l4829l4699l3681l2541l1841l1258l0288k8973k7647k6375
53333A536409k5031k3643k2284k0791j9014j7244j6157j6161j6892j7445j7174
53322A324573j6368j5940j6392j7201j7462j6930j6039j5033j3659j1916j0439
53311A157194r718r277q139n973l369j105M93J527K319L263M533N928P203Q480
53297A153359R956J1358J2227J2832J4078J6276J8528J9779K0009J9937J9878
$$ plain form
53379 2340380 2377710 2413646 2447600 2479004 2507771 2533748 2556187 2574221 2587557 2596356 2600712 2600600
53367 2600600 2596026 2586895 2572982 2554371 2531638 2505292 2475400 2442182 2406619 2369920 2332580 2294485
53355 2294485 2255738 2216791 2177868 2138862 2099907 2061493 2023958 1987305 1951582 1916888 1882821
53344 1882821 1848541 1813712 1779013 1745332 1712791 1680950 1649692 1619404 1590431 1562784 1536409
53333 1536409 1511378 1487735 1465451 1444660 1425646 1408402 1392245 1376084 1359192 1341747 1324573
53322 1324573 1308205 1292265 1275873 1258672 1241210 1224280 1208241 1193208 1179549 1167633 1157194
53311 1157194 1147476 1138199 1130060 1124087 1120718 1119613 1120106 1121633 1123952 1127215 1131748 1137676 1144879 1153359
53297 1153359 1163315 1174673 1186900 1199732 1213810 1230086 1248614 1268393 1288402 1308339 1328217
53286A328217J9628J9235J9107J9198J8773J7335J5365J3707J2500J1091Q935
53275A503091O160L275O07j802l990n953p717r352j0888j2365j3940j5787j7791
53262A413548j9460k0365k0630k0750k1017k1328k1628k2145k2967k3696k3799
53251A175763k3191k2256k1392k0761k0377k0176k0058k0032k0211k0542k0692
53240I46075k0450k0069j9876j9776j9409j8677j7708j6447j4777j2986j1615
53229G54285j0832j0379j0176j0455j1180j1843j2090j2087j2109j2158j2222
53218F28754j2464j2888j3244j3462j3821j4330j4525j4168j3698j3438j2926
53207D79790j1656j0122r232q952q368p158o155o208p157q248q957r046q347p037
$$ plain form
53286 1328217 1347845 1367080 1386187 1405385 1424158 1441493 1456858 1470565 1483065 1494156 1503091
53275 1503091 1509251 1512526 1513133 1511331 1507341 1501388 1493671 1484319 1473431 1461066 1447126 1431339 1413548
53262 1413548 1394088 1373723 1353093 1332343 1311326 1289998 1268370 1246225 1223258 1199562 1175763
53251 1175763 1152572 1130316 1108924 1088163 1067786 1047610 1027552 1007520 987309 966767 946075
53240 946075 925625 905556 885680 865904 846495 827818 810110 793663 778886 765900 754285
53229 754285 743453 733074 722898 712443 701263 689420 677330 665243 653134 640976 628754
53218 628754 616290 603402 590158 576696 562875 548545 534020 519852 506154 492716 479790
53207 479790 468134 458012 448780 439828 431460 424302 418147 411939 404782 396534 387577 378531 370184 363147
53193C63147n832n405n711o187o446o396n913m869l567k715k726l258l662l693
53179B96767l621l714l845l692l192k648k370k302k068j444o97m14q85j717k206
53164B61952k053j549j068o24j94j22p57j691j910r22N74J407J117K21m65n51
53148B53365k31m7l58r21j088n80J83O94J006J394J632J206K11n60n72j26K58
53131B55466O03J168J714J610P00l77q11m13L57Q91Q88N13K65N96J402K007J835
53114B68414J067L90J35J6k24l72k44k05p15j513j803j236k93L01J00j011k673
53097B60134l872l597j984l15M03M04L81M40K90m2l41o90j197j479j164o21m90
53080B46260o52m39J92N09J92k03j96j11m31r95j297j174q11l78o1j25n88r96
$$ plain form
53193 363147 357315 351910 346199 340012 333566 327170 321257 316388 312821 310106 307380 304122 300460 296767
53179 296767 293146 289432 285587 281895 278703 276055 273685 271383 269315 267871 267174 266760 265875 264158 261952
53164 261952 259899 258350 257282 256658 256464 256342 255585 253894 251984 251062 251636 253043 254160 254381 253916 253365
53148 253365 253134 253087 252729 251808 250720 250140 250323 251017 252023 253417 255049 256255 256466 255906 255334 255208 255466
53131 255466 256069 257237 258951 260561 261261 260884 260073 259660 260017 260908 261796 262309 262574 263170 264572 266579 268414
53114 268414 269481 269871 270006 270022 269798 269426 269182 268977 268262 266749 264946 263710 263417 263718 263818 262807 260134
53097 260134 256262 252665 250681 250366 250769 251173 251554 251994 252284 252242 251901 251211 250014 248535 247371 246750 246260
53080 246260 245608 245169 245361 245870 246062 245859 245663 245552 245121 244126 242829 241655 240844 240466 240405 240280 239692 238696
53062B38696q64j78P14J468J824J600R18K59n3k16n40r27j028p56l51jK59M04
53044B41228M51N77R06J167R55L25j65j50O4l8m16n44j51L59M52J40j41k17l06
53025B44496m68l92J3K56r9o48n89J71Q71J007R70J366K019K144J348J38o34o35
53007B51334k47K6J93O01J241J575J229N16k1k68l79k90J02M56L21j59m44m27
52989B55359m22l76J20R65J443J311J218J725K481K781K428J650Q02M60J151K559
52973B75655L498L241K273J364N89j32l62J02M56n8q26p08J36M82Nk47M27J352
52955B87247J517P74m36j755k828l194k760k003j381r47p01p99j123j180p15k2
52939B69694N57R64J123Q30K78P4L99O52K65n26j107j192p85N3R93J423J129O13
$$ plain form
53062 238696 237832 237654 238368 239836 241660 243260 244178 244437 244384 244168 243628 242701 241673 240917 240566 240565 240824 241228
53044 241228 241679 242256 243162 244329 245284 245609 245444 245294 245358 245320 244904 244360 244209 244568 245020 245160 245019 244802 244496
53025 244496 244028 243636 243649 243905 243806 243158 242569 242740 243611 244618 245588 246954 248973 251117 252465 252603 251969 251334
53007 251334 251087 251113 251306 251907 253148 254723 255952 256468 256447 256179 255800 255510 255612 256068 256389 256230 255786 255359
52989 255359 254937 254561 254681 255646 257089 258400 259618 261343 263824 266605 269033 270683 271485 271945 273096 275655
52973 275655 279153 282394 284667 286031 286620 286488 286126 286228 286684 286626 285800 285092 285228 285710 285715 285468 285895 287247
52955 287247 288764 289538 289102 287347 284519 281325 278565 276562 275181 274234 273533 272734 271611 270431 269716 269694
52939 269694 270251 271215 272338 273168 273446 273520 273919 274571 274836 274310 273203 272011 271226 271279 272272 273695 274824 275437
52921B75437L17K5o21j404j916k177k312k094j395p33n65m76J66J012J131M77
52905B64872o0p4j26o09j066j030p65n87j85P72J777J923R92l24j178j225p23
52888B62384k72k81m79j68Q13J759J970J578J133P45J93l92n21KQ74J640J892
52871B72870J321J23p16k24J351K631K589J519M38O6N03J396J944J330l69j972
52855B84800k360j685j032j109j754k546l191l389k933k158j791k164k853l264
52841B52571l189k649j725q16o29j383k295k346j406k21O33J181J563J691J553
52826B42533J386J283R60K62l93m72j20nm02p81n72OK07j96n03M8J233K026J788
52807B48288R57M11M20N69M88K35m6m16r27j439j857k308k792k918k310j220l40
$$ plain form
52921 275437 275754 275779 275158 273754 271838 269661 267349 265255 263860 263127 262562 262086 262252 263264 264395 264872
52905 264872 264812 264738 264612 264003 262937 261907 261142 260555 260370 261142 262919 264842 265834 265510 264332 263107 262384
52888 262384 262112 261831 261352 261184 261997 263756 265726 267304 268437 269182 269375 268983 268462 268464 269338 270978 272870
52871 272870 274191 274314 273598 273374 274725 277356 279945 281464 281902 281968 282471 283867 285811 287141 286772 284800
52855 284800 282440 280755 279723 278614 276860 274314 271123 267734 264801 262643 260852 258688 255835 252571
52841 252571 249382 246733 245008 244192 243563 242180 239885 237539 236133 235912 236545 237726 239289 240980 242533
52826 242533 243919 245202 246162 246424 246031 245559 245439 245434 245032 244251 243679 243685 243892 243696 243193 243241 244474 246500 248288
52807 248288 249245 249656 250076 250645 251133 251368 251322 250906 249979 248540 246683 244375 241583 238665 236355 235135 234795
52790B34795k5K3J88L99L13j30n98p37m62P1O18R37R08O30L06L0k37m81n26k34
52770B35788K67O64P54O13L90J04k98p32j004j041j005j034r72m88L98J110J036
52753B34550L32q2N04J723K470K131J173M38J98J75K55O99J535K264K427K243
52737B53035K317K790L152K933K269J578R94M36M1R0M89P27N75M87R17J488J327
52720B75645K77q11j177j149j582k609l439l384k608j700r76l92Q3M40P78J196
52704B58592J526J430Q29P1l82l27R3N33O25K36m10q79r03n78k37j33k67m07l08
52685B59104l0O4k03m51j91L67M05m30j393j524q08l0L39N27P47P50L57o1k3M08
52665B57924P69P85N71L22J88L14P82J453K054K386K392K143J880J863K050K052
$$ plain form
52790 234795 234770 234793 234981 235380 235693 235563 234965 234228 233766 233837 234455 235392 236300 236930 237236 237266 237029 236548 236022 235788
52770 235788 236055 236719 237473 238086 238476 238580 238282 237550 236546 235505 234500 233466 232494 232006 232404 233514 234550
52753 234550 234882 234800 235304 237027 239497 241628 242801 243239 243437 243612 243867 244566 246101 248365 250792 253035
52737 253035 255352 258142 261294 264227 266496 268074 269068 269504 269545 269635 270124 270851 271426 271913 272830 274318 275645
52720 275645 275922 275111 273934 272785 271203 268594 265155 261771 259163 257463 256487 256095 256178 256618 257396 258592
52704 258592 260118 261548 262377 262448 262066 261739 261832 262365 262990 263226 262816 261937 261034 260456 260219 260086 259819 259412 259104
52685 259104 259074 259138 258935 258484 258293 258660 259065 258635 257242 255718 254910 254880 255219 255746 256493 257243 257600 257539 257516 257924
52665 257924 258693 259478 260049 260371 260559 260873 261655 263108 265162 267548 269940 272083 273963 275826 277876 279928
52649B79928J652J105P27M32qm58o13m88l41k42j97n62j634k847l095k062p51
52632B70546k56n36p62m99q0J13J66L97Q19J028O79L4k20J59N77M46J03K61P83
52613B73758Q19K05k30LL98N58R68J955K667K123P23k94m94l60j57K60N75J26
52595B83603r75j776j739j224n91K53J179J579J265Q82R25R85N01l09p92p19l27
52578B82720J60N67O47L83J50K00K64lm67p63p94o36k59K69N60L38j52n17p86
52559B81881j168j488j339o93k0K43on90j191j479j351r93o08k79j82n02r41p95
52541B68499Q3Q09N59k18l38N31J479J576R08K61K01O72J127J008L43j74J18J070
52523B78514J926K165J832J215N97K48K46L52L77N69J196J922K091J668J322J500
$$ plain form
52649 279928 281580 282685 283412 283844 283836 283378 282765 282277 281936 281694 281497 280935 279301 276454 273359 271297 270546
52632 270546 270290 269754 268992 268493 268413 268526 268692 269089 269908 270936 271615 271649 271429 271588 272165 272611 272714 272975 273758
52613 273758 274577 274782 274552 274555 274953 275511 276479 278434 281101 283224 283947 283653 283159 282799 282642 282902 283477 283603
52595 283603 282628 280852 279113 277889 277298 277551 278730 280309 281574 282456 283381 284366 284867 284558 283766 283047 282720
52578 282720 282880 283447 284094 284477 284627 284827 285091 285088 284621 283858 283064 282428 282169 282438 282998 283336 283184 282667 281881
52559 281881 280713 279225 277886 277193 277173 277416 277410 276820 275629 274150 272799 271806 271198 270919 270737 270235 269294 268499
52541 268499 268582 269391 269950 269732 269394 269925 271404 272980 273888 274149 274350 275022 276149 277157 277500 277326 277444 278514
52523 278514 280440 282605 284437 285652 286249 286497 286743 287095 287472 288041 289237 291159 293250 294918 296240 297740
52507B97740J936K147J985J535R17K93j87n87j040j472j832k406l344m004l535
52492B88146k142r72n87l90N6J40p78k104k649k030q04M52J437J819J462Q71P58
52475B82685J143J377J058M44K6J06P65J766K581K853K763K645K386J723Q84L82
52459C05587L17L67L97M37K21n70j637k351k656k962l107k469j294p94j372j778
52443B86336r21L35K87j171k454k470j722j102o61p0M54M57L3k73k75l45p93j305
52425B74340j247m10O81J298J239R17P66Q37J035J343J634J603J270J227J885
52410B88418K739K960K606K570L264M064M268M021L911M127M420M547M319L508
52396C39742K133O43m99j327k136k899l261l057k510j974j685j705j874j841j344
$$ plain form
52507 297740 299676 301823 303808 305343 306260 306553 306366 305779 304739 303267 301435 299029 295685 291681 288146
52492 288146 286004 285032 284445 284055 284111 284251 283473 281369 278720 276690 275886 276338 277775 279594 281056 281927 282685
52475 282685 283828 285205 286263 286707 286733 286839 287604 289370 291951 294804 297567 300212 302598 304321 305205 305587
52459 305587 305904 306271 306668 307105 307326 306756 305119 302768 300112 297150 294043 291574 290280 289486 288114 286336
52443 286336 285415 285750 286037 284866 282412 279942 278220 277118 276457 276387 276841 277298 277331 277058 276783 276438 275645 274340
52425 274340 273093 272683 273364 274662 275901 276818 277584 278421 279456 280799 282433 284036 285306 286533 288418
52410 288418 291157 294117 296723 299293 302557 306621 310889 314910 318821 322948 327368 331915 336234 339742
52396 339742 341875 342518 342019 340692 338556 335657 332396 329339 326829 324855 323170 321465 319591 317750 316406
52381C16406m92L90J086J587J934K128K152K042K051K608L834N054N246M244L089
52366C53359K861L478M016L840K967J693M42j97lM18K32m92q66m08L73P93P99
52349C73305P54Q73J129J418J588J535J394J412J582J757K112L021M334N372N816
52334D07402O161O996Q220R333J0094J0560J0808J0977J1395J2293J3545J4907
52322E32691J6264J7438J8072J8080J7898J7951J8097J7991J7767J7881J8381
52311G28511J8798J8843J8815J9218K0093K0862K0839J9974J9027J8721J8852
52300I42553J8575J7627J6683J6215J5593J3856J1047Q139N880M192K661J156
52288A074177j78j230k167l420n158o766p280o565n584n084m669l669k368j510
$$ plain form
52381 316406 315914 316304 317390 318977 320911 323039 325191 327233 329284 331892 335726 340780 346026 350270 353359
52366 353359 356220 359698 363714 367554 370521 372214 372656 372459 372456 372874 373106 372614 371748 371340 371713 372506 373305
52349 373305 374059 374932 376061 377479 379067 380602 381996 383408 384990 386747 388859 391880 396214 401586 407402
52334 407402 413563 420559 428779 438112 448206 458766 469574 480551 491946 504239 517784 532691
52322 532691 548955 566393 584465 602545 620443 638394 656491 674482 692249 710130 728511
52311 728511 747309 766152 784967 804185 824278 845140 865979 885953 904980 923701 942553
52300 942553 961128 978755 995438 1011653 1027246 1041102 1052149 1060288 1066168 1070360 1073021 1074177
52288 1074177 1073999 1072769 1070602 1067182 1062024 1055258 1047978 1041413 1035829 1030745 1026076 1022407 1020039 1018529
52274A018529j038k39J035K293L401M742O321P658Q749J0086J1541J2187J1739
52261A097004J1291J1991J3603J5014J5521J5207J4582J4444J5434J6985J7341
52250A258417J5452J2451J0319R389Q269O154L990K885K421J306q21l123m840
52237A322269o072p148p944q194q173q545r497j0396j0496r774q875q368q266
52224A210521q215p872p071n918m785m101l959m026l871l304k415j386l25Q30
52210A154103K175L581M616M918M590M118L906M046M396M738M928N118N675O638
52196A217546P428P431O725N905N391N250N483N868N732M589L007K090J985J619
52182A286049J85j822l425m351m997n751o854q409j0023j0823j0381r273q297
$$ plain form
52274 1018529 1017491 1017252 1018287 1020580 1023981 1028723 1035044 1042702 1051451 1061537 1073078 1085265 1097004
52261 1097004 1108295 1120286 1133889 1148903 1164424 1179631 1194213 1208657 1224091 1241076 1258417
52250 1258417 1273869 1286320 1296639 1306028 1314297 1320451 1324441 1327326 1329747 1331053 1330232 1327109 1322269
52237 1322269 1316197 1309049 1301105 1292911 1284738 1276193 1266696 1256300 1245804 1236030 1227155 1218787 1210521
52224 1210521 1202306 1194434 1187363 1181445 1176660 1172559 1168600 1164574 1160703 1157399 1154984 1153598 1153273 1154103
52210 1154103 1156278 1159859 1164475 1169393 1173983 1178101 1182007 1186053 1190449 1195187 1200115 1205233 1210908 1217546
52196 1217546 1224974 1232405 1239130 1245035 1250426 1255676 1261159 1267027 1272759 1277348 1280355 1282445 1284430 1286049
52182 1286049 1286234 1284412 1280987 1276636 1271639 1265888 1259034 1250625 1240602 1229779 1219398 1210125 1201828
52169A201828p526o597n492m467l551k639j829j116j14J315K527K860K613K533
52155A180345K575K037Q65j64n86p37q43n33L57J148J092L33l79o35n63l64j11
52138A183837K5j99o43o72L08K108L730M372M442N241P486J0485J3039J4721J5865
52123A264145J6697J7240J7920J9461K1912K4333K5680K5672K4777K3741K3262
52112A504840K3551K4040K3818K2567K0755J8903J7132J5465J4065J2973J2043
52101A710152J1321J1024J0933J0353Q881O806M503J959p93l342n463p516r818
52088A749000j2043j3683j4778j5597j6056j6035j5906j6051j6088j5254j3427
52077A584082j1130q667o056l683k110j082L95K643M730N857O614Q171J0585J2656
$$ plain form
52169 1201828 1194302 1187705 1182213 1177746 1174195 1171556 1169727 1168611 1168497 1169812 1172339 1175199 1177812 1180345
52155 1180345 1182920 1184957 1185822 1185658 1185072 1184335 1183492 1182959 1183316 1184464 1185556 1185889 1185510 1184875 1184312 1183948 1183837
52138 1183837 1183862 1183663 1183020 1182348 1182656 1184764 1188494 1192866 1197308 1202549 1210035 1220520 1233559 1248280 1264145
52123 1264145 1280842 1298082 1316002 1335463 1357375 1381708 1407388 1433060 1457837 1481578 1504840
52112 1504840 1528391 1552431 1576249 1598816 1619571 1638474 1655606 1671071 1685136 1698109 1710152
52101 1710152 1721473 1732497 1743430 1753783 1762664 1769470 1773973 1775932 1775139 1771797 1766334 1758818 1749000
52088 1749000 1736957 1723274 1708496 1692899 1676843 1660808 1644902 1628851 1612763 1597509 1584082
52077 1584082 1572952 1564285 1558229 1554546 1552436 1551354 1551749 1554392 1559122 1564979 1571593 1579764 1590349 1603005
52063A603005J3434J3272J3234J3845J4683J4987J4525J3782J3281J2888J1996
$$ plain form
52063 1603005 1616439 1629711 1642945 1656790 1671473 1686460 1700985 1714767 1728048 1740936 1752932
$$ [...]
##END NTUPLES=NMR SPECTRUM
##END=
