##TITLE=AC1618_BRASL13349_8325911_0QAOxiUdGU
##JCAMPDX= 6.0         $$ Bruker NMR JCAMP-DX V2.0
##DATA TYPE= NMR SPECTRUM
##DATA CLASS= NTUPLES
##ORIGIN= BRUKER
##OWNER= Administrator
$$ 1.72 TOPSPIN		Version 2.1
$$ 2013-11-13 19:20:11.376 -0800  Administrator@X
$$ Compression mode = diff/dup
##.OBSERVE FREQUENCY= 400.02188249412
##.OBSERVE NUCLEUS= ^1H
##.ACQUISITION MODE= SIMULTANEOUS (DQD)
##.ACQUISITION SCHEME= undefined
##.AVERAGES= 8
##.DIGITISER RES= 22
##SPECTROMETER/DATA SYSTEM= spect
##.PULSE SEQUENCE= zg30
##.SOLVENT NAME= COFFEE_meoh
##.SHIFT REFERENCE= INTERNAL, COFFEE_meoh, 1, 14.98509
##AUDIT TRAIL= $$ (NUMBER, WHEN, WHO, WHERE, PROCESS, VERSION, WHAT)
$$ ##TITLE= Audit trail, TOPSPIN		Version 2.1
$$ ##JCAMPDX= 5.01
$$ ##ORIGIN= Bruker BioSpin GmbH
$$ ##OWNER= Administrator
$$ $$ E:\/data/COFFEE/nmr/AC1618_BRASL13349_8325911_0QAOxiUdGU/10/pdata/1/auditp.txt
$$ ##AUDIT TRAIL=  $$ (NUMBER, WHEN, WHO, WHERE, PROCESS, VERSION, WHAT)
(   1,<2013-11-13 19:20:04.110 -0800>,<Administrator>,<X>,<go>,<TOPSPIN 2.1>,
      <created by zg
	started at 2013-11-13 19:18:57.704 -0800,
	POWCHK enabled, PULCHK disabled,
       configuration hash MD5:
       C8 4E 4E 5D D3 5C D8 9E 9F 52 82 E0 59 8A DE 15
       data hash MD5: 64K
       43 83 24 D9 AD 4A 35 21 BB 53 7A DE E0 BA 81 7A>)
(   2,<2013-11-13 19:20:07.235 -0800>,<Administrator>,<X>,<proc1d>,<TOPSPIN 2.1>,
      <Start of raw data processing
       efp LB = 0 FT_mod = 6 PKNL = 1 PHC0 = 0 PHC1 = 0 SI = 32K 
       data hash MD5: 32K
       0B 62 F0 EF 72 7B 08 CD 85 C4 42 E3 B4 0F AF 01>)
(   3,<2013-11-13 19:20:07.641 -0800>,<Administrator>,<X>,<proc1d>,<TOPSPIN 2.1>,
      <pk PHC0 = 92.66968 PHC1 = 0 
       data hash MD5: 32K
       D2 5D F3 79 A0 EE 40 17 56 25 3D F6 E9 3E 2D 94>)
(   4,<2013-11-13 19:20:07.782 -0800>,<Administrator>,<X>,<proc1d>,<TOPSPIN 2.1>,
      <abs ABSG = 1 
       data hash MD5: 32K
       66 23 92 AC AC BC 1D C0 63 D1 52 98 76 AD D6 0A>)
(   5,<2013-11-13 19:20:07.845 -0800>,<Administrator>,<X>,<proc1d>,<TOPSPIN 2.1>,
      <abs ABSG = 2 
       data hash MD5: 32K
       2D 2F 66 09 9E 5D 95 39 02 52 64 03 4A B6 0E 7D>)
(   6,<2013-11-13 19:20:07.891 -0800>,<Administrator>,<X>,<proc1d>,<TOPSPIN 2.1>,
      <abs ABSG = 3 
       data hash MD5: 32K
       E3 72 3C 1E 2B 4B 41 EF 43 06 08 01 76 FA 41 30>)
(   7,<2013-11-13 19:20:07.954 -0800>,<Administrator>,<X>,<proc1d>,<TOPSPIN 2.1>,
      <abs ABSG = 4 
       data hash MD5: 32K
       20 3A B5 90 DC 4D 18 72 81 D1 BF 22 F9 F3 0F 73>)
(   8,<2013-11-13 19:20:08.001 -0800>,<Administrator>,<X>,<proc1d>,<TOPSPIN 2.1>,
      <abs ABSG = 5 
       data hash MD5: 32K
       7A D5 C5 1E B3 32 AA 6A DC 08 35 D7 C8 33 14 25>)
$$ ##END=
$$ 
$$ $$ hash MD5
$$ $$ A0 9F 25 C0 05 B8 9C 57 FF CF FA FF CA 00 D7 16
##$RELAX= 
##$RELAX= 
##$RELAX= 
##$RELAX= 
##$RELAX= 
##$RELAX= 
##$RELAX= 
$$ Bruker specific parameters
$$ --------------------------
##$DU= <E:\>
##$EXPNO= 10
##$NAME= <AC1618_BRASL13349_8325911_0QAOxiUdGU>
$$ [...]
150 150 150 150 150 150 150 150
##$TP07= 0
##$TPNAME0= <>
##$TPNAME1= <>
##$TPNAME2= <>
##$TPNAME3= <>
##$TPNAME4= <>
##$TPNAME5= <>
##$TPNAME6= <>
##$TPNAME7= <>
##$TPOAL= (0..7)
0.5 0.5 0.5 0.5 0.5 0.5 0.5 0.5
##$TPOFFS= (0..7)
0 0 0 0 0 0 0 0
##$TUNHIN= 0
##$TUNHOUT= 0
##$TUNXOUT= 0
##$USERA1= <user>
##$USERA2= <user>
##$USERA3= <user>
##$USERA4= <user>
##$USERA5= <user>
##$V9= 5
##$VALIST= <valist>
##$VCLIST= <CCCCCCCCCCCCCCC>
##$VD= 0
##$VDLIST= <DDDDDDDDDDDDDDD>
##$VPLIST= <PPPPPPPPPPPPPPP>
##$VTLIST= <TTTTTTTTTTTTTTT>
##$WBST= 1024
##$WBSW= 4
##$XGAIN= (0..3)
0 0 0 0
##$XL= 0
##$YL= 0
##$YMAX_a= 639508
##$YMIN_a= -544081
##$ZGOPTNS= <>
##$ZL1= 120
##$ZL2= 120
##$ZL3= 120
##$ZL4= 120
##$ABSF1= 14.98509
##$ABSF2= -5.573092
##$ABSG= 5
##$ABSL= 3
##$ALPHA= 0
##$AQORDER= 0
##$ASSFAC= 0
##$ASSFACI= 0
##$ASSFACX= 0
##$ASSWID= 0
##$AUNMP= <proc_prof1d_extract_pilot.lims>
##$AXLEFT= 0
##$AXNAME= <>
##$AXNUC= <1H>
##$AXRIGHT= 0
##$AXTYPE= 0
##$AXUNIT= <>
##$AZFE= 0.1
##$AZFW= 0.1
##$BCFW= 0
##$BC_mod= 0
##$BYTORDP= 0
##$COROFFS= 0
##$CY= 15
##$DATMOD= 1
##$DC= 0
##$DFILT= <>
##$DTYPP= 0
##$F1P= 0
##$F2P= 0
##$FCOR= 0.5
##$FTSIZE= 32768
##$FT_mod= 6
##$GAMMA= 0
##$GB= 0
##$INTBC= 1
##$INTSCL= 1
##$ISEN= 128
##$LB= 0
##$LEV0= 0
##$LPBIN= 0
##$MAXI= 10000
##$MC2= 0
##$MEAN= 0
##$ME_mod= 0
##$MI= 0
##$NCOEF= 0
##$NC_proc= -8
##$NLEV= 6
##$NOISF1= 0
##$NOISF2= 0
##$NSP= 0
##$NTH_PI= 0
##$NZP= 0
##$OFFSET= 14.98509
##$PC= 1
##$PHC0= 92.66968
##$PHC1= 0
##$PH_mod= 1
##$PKNL= yes
##$PPARMOD= 0
##$PPDIAG= 0
##$PPIPTYP= 0
##$PPMPNUM= 2147483647
##$PPRESOL= 1
##$PSCAL= 4
##$PSIGN= 0
##$PYNMP= <proc.py>
##$REVERSE= no
##$SF= 400.02
##$SI= 32768
##$SIGF1= 0
##$SIGF2= 0
##$SINO= 400
##$SIOLD= 32768
##$SPECTYP= <>
##$SREGLST= <1H.CDCl3>
##$SSB= 0
##$STSI= 32768
##$STSR= 0
##$SW_p= 8223.68421052631
##$SYMM= 0
##$S_DEV= 0
##$TDeff= 65536
##$TDoff= 0
##$TI= <>
##$TILT= no
##$TM1= 0
##$TM2= 0
##$TOPLEV= 0
##$USERP1= <user>
##$USERP2= <user>
##$USERP3= <user>
##$USERP4= <user>
##$USERP5= <user>
##$WDW= 1
##$XDIM= 32768
##$YMAX_p= 468224723
##$YMIN_p= -734201
##$CURPLOT= <Network HP LaserJet P1505>
##$CURPRIN= <$Network HP LaserJet P1505>
##$DFORMAT= <normdp>
##$LAYOUT= <+/1D_H.xwp>
##$LFORMAT= <normlp>
##$PFORMAT= <normpl>
##$SURQMSG= 1
$$ End of Bruker specific parameters
$$ ---------------------------------
##NTUPLES= NMR SPECTRUM
##VAR_NAME=  FREQUENCY,     SPECTRUM/REAL,   SPECTRUM/IMAG
##SYMBOL=    X,             R,               I
##VAR_TYPE=  INDEPENDENT,   DEPENDENT,       DEPENDENT
##VAR_FORM=  AFFN,          ASDF,            ASDF
##VAR_DIM=   32768,         32768,           32768
##UNITS=     HZ,            ARBITRARY UNITS, ARBITRARY UNITS
##FACTOR=    0.250966925370066, 1,           1
##FIRST=     8223.43324360094, 124213,       -202220
##LAST=      0,             -205428,         -66482
##MIN=       0,             -734201,         0
##MAX=       8223.43324360094, 468224723,    0
$$ Real data points
##PAGE= N=1
##DATA TABLE= (X++(R..R)), XYDATA
$$ [...]
$$ plain form
19565 -335103 -167430 -52761 -493502 -29264 -36526 -227503 159167 54674 -58989 80635 -61006
19553 -145915 -372126 -302668 -217387 45851 -182232 -145972 -194754 -261108 18989 -46537 7663
19541 -161848 -41290 235859 99684 -71227 20017 175361 -206218 -70655 103964 123801 11700
19529 -160695 -61943 258572 -83518 -180714 8380 -119801 172693 820 -88911 -433770 -81684
19517 25540 -121860 227699 -125259 -793 51420 -229379 76064 -254907 -485629 -82190 -417832
19506 -417832 -70754 -158629 -57498 -190619 -214418 -530226 147131 -89523 -106200 75652 192701
19495 192701 105592 357282 35188 -390700 101738 329850 93757 -150941 217132 -383341
19484 -261354 -72723 29605 -1886 87025 15326 21640 183382 -42599 44143 -17755 -464150
$$ packed form
19565c35103a67430e2761m40741b9264p262j90977A59167E4674e8989H0635f1006
19553a45915k26211O9458Q5281D5851a82232L6260m8782o6354A8989d6537G663
19541a61848d1290B35859I9684g1227B0017J55344b06218g0655A03964J9837A1700
19529a60695f1943B58572h3518r7196H380a19801A72693H20h8911l44859h1684
19517B5540a21860B27699a25259g93E1420b29379G6064b54907k30722h2190l35642
19506d17832g0754q7875e7498j33121k3799l15808A47131h9523j6677G5652J17049
19495A92701q7109K51690C5188c90700A01738K28112I3757a50941B17132c83341
19484b61354g2723B9605a886H7025A5326O314J61742d2599D4143a7755m46395
$$ plain form
19473 -464150 -283740 197395 14845 -191199 -106458 -17696 20126 -47375 -51199 -303613 -351881
19462 -351881 -109129 -167591 -75473 78422 161734 301870 -117458 -123230 -93276 -131897 -71596
19451 -71596 236395 15722 -139874 18973 65563 -116219 202534 -265024 -281188 -281704 37958
19439 33036 6030 -339620 -4435 -180163 -257984 -242166 -18367 -308736 -74016 -465856 -140311
19427 -40343 -278 -41262 -34148 -278317 -63806 33516 -30744 -127526 -114424 -51496 263157 -232328
19414 69993 -44017 -63614 -193444 87553 -136839 95663 -179945 324660 -306616 26905 -188831
19402 -51097 -125516 -225440 370609 -214542 232785 -283083 -333614 55388 -77523 -205030 10704
19390 -152179 -276535 -66900 -161640 111742 -273797 -700 -324548 12592 225657 -107001 -258753
$$ packed form
19473d64150J80410A97395A4845a91199Q4741a7696B0126d7375l824k52414m8268
19462c51881a09129n8462g5473G8422Q3312J40136a17458n772K9954l8621O0301
19451g1596B36395A5722a39874A8973M6590a16219B02534b65024j6164n16C7958
19439C3036F030c39620d435j75728p7821J5818a8367k90369g4016l91840a40311
19427d0343b78m0984P114k44169f3806C3516c0744r6782J3102e1496B63157b32328
19414F9993d4017j9597j29830H7553a36839I5663a79945C24660c06616B6905a88831
19402e1097p4419r9924C70609b14542B32785b83083n0531E5388g7523j27507A0704
19390a52179j24356f6900r4740A11742b73797g00l23848A2592K13065a07001j51752
$$ plain form
19379 -258753 -118415 -33814 -39197 99079 -161928 66465 -129347 -124994 -230133 -203404 -171832
19368 -171832 -299480 23010 -283329 -216728 128697 -235728 -19521 -247047 -66742 10767
19357 4284 -31967 -147459 -181944 -141430 -14462 250324 59912 -76705 178741 1957 -208215
19345 -57678 62401 -341584 -21554 15921 -19423 96965 -158526 -197167 -128255 -282181 193043
19333 -32380 48083 -27994 100071 -75115 82498 205812 -230584 -192602 26956 51018 152939
19322 152939 -417556 -332336 273623 -165607 -144486 -46379 190370 296072 -323987 -4072
19311 -50548 31488 -200972 94386 137597 -187268 76711 114750 -134732 -128562 66969 -269846
19299 85735 -68979 226526 -111653 631 -233192 -208887 -291961 88511 67724 -92152 -262081
$$ packed form
19379b58753a18415c3814n383I9079a61928F6465a29347M353j05139K6729L1572
19368a71832j27648B3010b83329O6601A28697b35728a9521k27526f6742A0767
19357D284c1967j15492l4485M0514a4462B50324E9912g6705A78741A957b08215
19345e7678F2401c41584b1554A5921a9423I6965a58526l8641O8912j53926A93043
19333c2380D8083b7994A00071g5115H2498J23314b30584L7982B6956K4062J01921
19322A52939d17556Q5220B73623a65607K1121d6379A90370J05702c23987d072
19311e0548C1488b00972I4386M3211a87268G6711L8039a34732O170F6969b69846
19299H5735f8979B26526a11653F31b33192K4305q3074H8511k0787i2152j69929
$$ plain form
19288 -262081 336364 11502 231944 -274257 -123103 100956 -94777 -267299 -161016 -23232
19277 194478 225477 177393 -57938 60068 -148206 -38152 -100185 -42169 -115761 261027 314834
19266 314834 -107142 -225359 -116967 -119352 -247659 -72595 -70606 -271671 114909 -322032
19255 -306454 59849 184305 -262381 21874 -50434 -34267 -38832 -5431 -116454 -266225 -55302
19243 -223645 82136 -169862 -380951 42209 289894 314800 -71427 91486 -95298 -418528 -216316
19232 -216316 75126 -59998 126960 -198864 -132138 -157396 -3591 80967 -358409 16603 -206944
19220 -74103 75746 106717 233263 -209875 2596 -159926 339613 114990 -262455 -258885 139082
19208 -82696 -209249 39420 -219411 93330 -63736 -30528 -95850 153916 166368 -244385 252556
$$ packed form
19288b62081C36364A1502K20442b74257a23103A00956i4777j72522J06283b3232
19277A94478L0999m8084e7938F0068a48206c8152o2033d2169p3592B61027N3807
19266C14834a07142j18217J08392k385j28307g2595J989k01065A14909c22032
19255c06454E9849J24456b62381B1874e0434J6167m565e431j11023j49771e5302
19243b23645H2136a69862k11089D2209K47685K4906g1427I1486i5298l23230K02212
19232b16316G5126e9998A26960a98864O6726k5258c591H0967c58409A6603b06944
19220g4103G5746L0971J26546b09875B596a59926C39613A14990b62455L570A39082
19208h2696j26553C9420b19411I3330f3736c0528o5322A53916J2452b44385B52556
$$ plain form
19196 -205900 -158489 -17402 -508189 207899 -318393 182817 -174848 -99755 -345731 105384
19185 -157343 -146666 -137373 111577 92419 7319 -31218 35758 54449 41140 -357410 135868
19173 -172047 157907 -99533 -417519 -153717 -94027 -243527 -145424 -239574 -293212 201548
19162 -175608 45367 41363 -35423 -53356 -23879 -190466 79073 -298287 -5350 -132182 236273
19150 -435677 156540 -171574 59185 -120416 -92461 4359 -161353 109603 218794 -3070 -194811
19139 -194811 -221640 -207865 113719 231006 -39549 -147184 -214255 -367814 -275712 -83688 -120421
19128 -120421 36948 64789 142682 147806 -72176 -89335 -272257 -363052 -84341 -145077 -60125
19116 67476 139707 -203859 154659 -238978 -154733 -50434 112863 229933 -78724 184809
$$ packed form
19196b05900M7411a7402m90787B07899c18393A82817a74848P5093k45976A05384
19185a57343J0677R293A11577j9158G319c1218C5758J8691j3309c57410A35868
19173a72047A57907i9533l17986a53717N9690j49500R8103r4150n3638B01548
19162a75608D5367m004c5423j7933b3879j66587G9073b98287e350j26832B36273
19150d35677A56540a71574E9185a20416K7955D359a61353A09603J09191c070j91741
19139a94811k6829J3775A13719J17287c9549j07635o7071j53559R2102h3688l6733
19128a20421C6948K7841P7893N124g2176j7159j82922r0795h4341o0736f0125
19116F7476P2231b03859A54659b38978Q4245e0434A12863J17070g8724A84809
$$ plain form
19105 -195892 -143213 -175242 -67547 429203 -143893 -174671 -62306 -84509 -111502 -97315 23445
19093 223446 171919 -123375 -134901 289781 -96510 52019 3766 420601 -49671 126235 309218
19082 309218 -237767 -125369 -61490 15262 352231 -97288 15937 56981 -79643 177888 -104063
19070 -338214 -132281 -22248 -310421 -58117 -47194 -41896 99050 -323803 201260 153285 -595674
19058 -139138 109103 -216586 -111049 83627 -20127 -45236 -25501 -102402 219753 -299151
19047 -25747 70665 -130358 39953 40334 117756 -291158 216098 -13325 108303 -154558 4630
19035 236979 -421606 -128046 19070 -172346 153111 -53600 20235 101357 -75631 -103147 -157486
19024 -157486 270023 39956 88808 -68160 -2236 -298099 114971 -69045 -122850 -42574 -290035
$$ packed form
19105a95892N2679l2029f7547D29203a43893l0778f2306k2203k6993J4187B3445
19093B23446n1527a23375j1526B89781i6510E2019C766M16835d9671A26235J82983
19082C09218b37767J12398f1490A5262L36969i7288A5937M1044g9643A77888a04063
19070c38214a32281b2248k88173e8117J0923N298I9050c23803B01260m7975e95674
19058a39138A09103b16586J05537H3627b0127k5109J9735p6901B19753b99151
19047b5747G0665a30358C9953L81P7422b91158B16098a3325A08303a54558D630
19035B36979d21606a28046A9070a72346A53111e3600B0235Q1122g5631k7516n4339
19024a57486B70023C9956M8852f8160b236k95863A14971f9045n3805d2574k47461
$$ plain form
19013 -290035 -132441 -71772 -129981 284838 152602 -256180 -345371 124499 233450 -64187
19002 170837 -113325 -176215 -99447 -17307 46173 -254647 -306304 -235985 -45474 121932 11417
18990 -170061 -240078 -134381 -231627 187544 17216 -234337 -100571 59878 -169821 -315237
18980 -315237 -199982 111031 -166349 -121380 249728 -27181 -182536 103122 -84088 -188883
18970 -188883 -108144 123801 -255868 -32992 -108454 139401 -310260 -160561 -23585 -102644
18960 -102644 -304394 -94307 81454 187257 -69679 -20537 -275824 -107870 64776 107148 179277
18949 179277 60879 -165087 -154725 -78905 -246533 161409 -51370 308462 162452 88539
18939 88539 75033 530151 173154 157827 258827 -272106 -51823 -163437 96028 24967 -160411
$$ packed form
19013b90035a32441O0669n8209B84838j32236b56180q9191A24499J08951f4187
19002A70837a13325o2890P6768a7307D6173b54647n1657P0319d5474A21932A1417
18990a70061p0017J05697r7246A87544A7216b34337a00571E9878a69821j45416
18980c15237J15255A11031a66349M4969B49728b7181j55355A03122h4088j04795
18970a88883Q0739A23801b55868c2992p5462A39401c10260J49699b3585p9059
18960a02644k01750i4307H1454J05803f9679b0537k55287a07870F4776M2372P2129
18949A79277F0879a65087J0362P5820j67628A61409e1370C08462j46010p3913
18939H8539j3506M55118A73154j5327J01000b72106e1823j11614I6028B4967a60411
$$ plain form
18927 -167968 -191122 106995 -223652 6500 -174537 42033 -39369 -95085 -277713 -208978 -150589
18916 -150589 -27511 -81997 3034 -177880 87011 -70285 28472 -120424 25509 -223105 -14242
18904 176230 -11728 251967 -26373 -146536 -23611 67723 -79273 214341 -27589 -282630 6436
18892 -88190 188063 -75390 -303589 152920 -283172 -234125 -130416 -196953 -37358 115255
18881 28922 -74749 -62850 -285719 -12379 189370 -131393 -319759 -128712 -71075 330100
18870 -72982 238975 -179342 32218 -98491 -146297 116265 -237300 27534 -136745 76898 81442
18859 81442 -87465 28571 -160880 109643 138299 -532243 98575 27749 -194968 56790 -32460
18847 -17374 515686 -48319 -176253 -177663 -166555 -95925 -206352 -122949 5216 -79087 -135219
$$ packed form
18927a67968k3154A06995b23652F500a74537D2033c9369n5716j82628O8735N8389
18916a50589b7511n4486C034a77880H7011g0285B8472a20424B5509b23105a4242
18904A76230a1728B51967b6373j20163b3611F7723g9273B14341b7589k55041F436
18892h8190A88063g5390k28199A52920b83172M9047J03709o6537c7358A15255
18881B8922g4749J1899k22869a2379A89370a31393j88366a28712N7637C30100
18870g2982B38975a79342C2218i8491m7806A16265b37300B7534a36745G6898M544
18859H1442h7465B8571a60880A09643K8656e32243I8575B7749a94968E6790c2460
18847a7374E15686d8319j27934j410J1108P0630j10427Q3403E216g9087n6132
$$ plain form
18836 -135219 46866 -171514 -104851 39585 1940 -229988 180532 28962 40114 -273702 -482425
18825 -482425 108640 -7363 103459 -267853 -222879 -72391 -169933 -40615 364700 -112595 54085
18813 -18139 60955 440107 134009 193692 77478 182501 -273307 46182 -75512 -141587 286285
18801 99309 221878 -399111 -274088 -26051 35715 -71775 237876 -33445 79394 158859 15049
18789 68953 -6637 -222843 -241846 -216220 -188828 -539201 88576 -227554 -234701 -44277 99640
18777 -252876 97602 -134811 -149727 -152470 -140721 -268558 80020 -117233 -68683 176076 -166299
18765 -230746 -117431 -113901 154190 -319239 -90965 -115038 132215 -93863 89774 -293061 -54766
18753 142144 83852 -548790 -152843 -140094 39939 -137138 -242585 93651 -44273 -88165 -266040
$$ packed form
18836a35219D6866a71514O6663C9585A940b29988A80532B8962J1152b73702k08723
18825d82425A08640g363A03459b67853M4974g2391r7542d0615C64700a12595E4085
18813a8139F0955L79152A34009N9683G7478J05023b73307D6182g5512o6075B86285
18801I9309J22569c99111J25023b6051C5715g1775B37876c3445G9394P9465A5049
18789F8953f637k16206j9003K5626K7392l50373H8576b27554p147d4277I9640
18777b52876I7602a34811j4916k743J1749j27837H0020a17233M8550A76076a66299
18765b30746J13315L530A54190c19239i0965k4073A32215i3863H9774b93061e4766
18753A42144n8292e48790a52843J2749C9939a37138j05447I3651d4273m3892j77875
$$ plain form
18742 -266040 -105102 138048 -326967 -192253 89168 82027 -285287 -105472 -26150 221748
18731 -172213 -47354 279253 2936 -17868 -15684 -17296 91926 38595 -336333 -174328 179204
18719 -126855 178730 236443 -413214 136298 -373546 -104548 -145386 -19427 -134766 -149207
18709 -149207 246351 180579 -40605 -96234 201950 98569 -325457 -124293 -243483 53384
18698 223099 167120 -122091 70897 256575 -173724 206468 -116934 -132154 -139733 52103 67377
18687 67377 295573 109961 -406629 -161760 25068 -70806 -141550 65440 32035 -149215 46301
18675 13779 163182 -104126 105679 83008 -6062 252228 -15036 -127931 -34127 -107312 -381120
18664 -381120 -151232 -165542 -345778 -406353 252330 49403 -17451 -87070 -313219 -35785 -111884
$$ packed form
18742b66040a05102A38048c26967J34714H9168p141b85287a05472b6150B21748
18731a72213d7354B79253B936a7868K184j612I1926C8595c36333J62005A79204
18719a26855A78730N7713d13214A36298c73546a04548m0838a9427j15339j4441
18709a49207B46351o5772d0605n5629B01950I8569c25457a24293j19190E3384
18698B23099n5979a22091G0897J85678a73724B06468a16934j5220p579E2103J5274
18687F7377K28196A09961d06629a61760B5068g0806p0744F5440C2035a49215D6301
18675A3779J49403a04126A05679k2671f062B52228a5036j12895c4127p3185k73808
18664c81120a51232j4310j80236o0575B52330D9403a7451o9619k26149c5785p6099
$$ plain form
18653 -111884 47176 -279527 -16568 -212215 120279 -47948 -101889 -493455 -37888 113234
18642 35798 416 -178272 -215187 14263 -80474 -47010 20033 145780 17530 120902 -303553
18630 99868 158095 132079 63169 205133 -135745 256500 -237493 -175701 -24686 -31310 25583
18618 -24299 163459 -78404 209427 -116235 -241916 -19349 -133215 -153711 89780 -191397
18607 -47307 -21287 85794 -127541 -77225 -305976 -141394 -199012 29706 -159665 -201278 -133415
18596 -133415 -216455 174235 -397046 42219 261 -96467 89930 -467772 -165678 -175110 -448760
18585 -448760 -222223 -7744 -394435 91550 159142 -148075 -46475 -30420 -315989 94817 -162449
18573 -35771 -75737 -102707 -341303 205159 -110341 -186538 6785 151369 -41318 111102 -142281
$$ packed form
18653a11884D7176b79527a6568j95647A20279d7948n3941l91566c7888A13234
18642C5798D16a78272l6915A4263h0474L3464B0033J25747A7530J03372c03553
18630I9868N8227k6016F3169J41964a35745B56500b37493O1792b4686o624B5583
18618b4299A63459g8404B09427a16235j25681a9349j13866k0496H9780a91397
18607d7307b1287H5794a27541N0316k28751a41394n7618B9706a59665m1613O7863
18596a33415q3040A74235c97046D2219B61i6467H9930d67772a65678r432k73650
18585d48760b22223g744l86691I1550O7592a48075d6475J6055k85569I4817a62449
18573c5771l9966k6970k38596B05159a10341p6197F785J44584d1318A11102a42281
$$ plain form
18561 -371994 -329640 76630 -258447 -98422 -154047 -70802 -386844 -60695 272114 -51857 -2905
18549 -150137 338731 74674 27259 -62117 846 76985 104886 -77495 -468368 -245947 -135105
18538 -135105 324947 -110016 49017 65670 257401 -71877 -65157 1975 -230592 14438 -244856
18526 -375247 244588 38801 64096 -329289 -97085 -29754 -1116 5152 -5937 -21591 -51343 -49117
18514 -49117 -254589 -218976 243562 -43400 -92506 28608 -16052 -320239 -112156 -16688 22806
18502 -61835 165188 228108 -220551 59651 -25041 216787 -160592 14751 174566 -47225 157993
18490 -8008 102335 129455 136364 26932 310151 50972 94402 257975 70812 -181582 -150065
18479 -150065 143022 -30527 267058 -166171 -272188 -142368 -32073 -152486 35645 -349824
$$ packed form
18561c71994M2354G6630b58447i8422n5625g0802l16042f0695B72114e1857b905
18549a50137C38731G4674B7259f2117H46P6139K7901g7495l90873K22421J10842
18538a35105C24947a10016D9017J6653J91731g1877O720A975b30592A4438b44856
18526c75247B44588C8801K5295c29289i7085b9754a116E152e937j5654k9752K226
18514d9117k05472L5613B43562d3400m9106B8608a6052l04187a12156a6688B2806
18502f1835A65188O2920b20551E9651b5041B16787a60592A4751J59815d7225A57993
18490h008A02335K7120O909B6932K83219E0972M3430J63573G0812a81582L1517
18479a50065A43022c0527B67058a66171j06017J29820c2073j20413C5645c49824
$$ plain form
18468 -156289 -159588 35909 -143558 -177076 -170099 242842 -119464 -50278 -242722 -206884 68466
18456 112223 -165050 -102360 -36708 -61082 -88668 352009 -78212 130675 -86472 103944 -117446
18444 -30533 130034 -68322 -49018 -190678 223899 -211066 -103130 -211479 -29170 -14692
18434 -14692 156560 -229888 230814 -39139 -89745 -100374 -23824 -24028 -125576 50739 77215
18423 77215 -204558 149406 -88578 -93868 -225638 24817 36904 -286159 -100069 144929 -189387
18411 84048 49049 31607 154765 -73683 29208 69016 -74502 227483 -112334 -94392 -41747
18399 -15644 30227 -145464 249049 -80435 -19995 105080 62023 -80366 -2901 177503 -245221
18387 -44996 262928 -192728 -231565 -361126 149607 176175 309600 42474 -267035 16855
$$ packed form
18468a56289l299C5909a43558l3518O977B42842a19464e0278j92444L5838F8466
18456A12223a65050O2690c6708k4374k7586C52009g8212A30675h6472A03944a17446
18444c0533A30034f8322J9304j41660B23899b11066a03130j08349b9170J4478
18434a4692A56560b29888B30814c9139n0606j0629b3824k04j01548E0739K6476
18423G7215b04558A49406h8578n290j31770B4817J2087b86159a00069A44929a89387
18411H4048l4999j7442J23158g3683B9208L9808g4502B27483a12334J7942d1747
18399a5644C0227a45464B49049h0435a9995A05080m3057h0366b901A77503b45221
18387d4996B62928a92728l8837j29561A49607K6568J33425D2474b67035A6855
$$ plain form
18376 -233672 -17728 -300967 -38919 64552 89368 -170124 -475749 -3719 -25076 143553 -219395
18364 18083 -194653 -70477 311926 -102074 -82191 -87824 59862 -42819 -298233 95519 -37492
18352 -27012 54104 50355 -173309 291343 188064 27464 -141057 -285576 354953 -382184
18341 -223882 314810 -79646 -68952 -145574 98357 -183825 36770 -112254 158839 -276209
18330 91657 36312 -20155 20619 131396 -28940 235860 -275570 -299416 -73634 -16122 -213550
18319 -213550 -274290 -3881 45920 -169405 86492 36705 -19414 83847 -115665 -189341 202929
18307 12910 -194668 -141863 95494 151384 11443 -263427 -8813 -61133 -191175 18376 -41287
18295 58353 -96951 -184498 -245750 -96528 193391 -14088 -435179 -104454 -205405 25026 52711
$$ packed form
18376b33672a7728k83239c8919F4552K4816a70124l05625c719k1357A43553b19395
18364A8083a94653g0477C11926a02074J9883n633E9862d2819k55414I5519c7492
18352b7012E4104l749a73309B91343j03279B7464a41057j44519C54953c82184
18341b23882C14810g9646J0694p6622I8357a83825C6770a12254A58839b76209
18330I1657C6312b0155B0619J10777b8940B35860b75570k3846g3634a6122j97428
18319b13550o0740c881D5920a69405H6492C6705a9414H3847a15665p3676B02929
18307A2910a94668N2805I5494N5890A1443b63427h813n2320j30042A8376d1287
18295E8353i6951q7547o1252i6528A93391a4088m21091a04454j00951B5026K7685
$$ plain form
18284 52711 -83663 -111127 -329226 -416719 -262399 -293491 26979 15743 -101072 -336670 -415142
18273 -415142 30466 98167 115123 -175848 -275546 -2004 -64388 668 -39733 80694 68399 -92561
18260 149230 -260350 110553 -201400 -133191 172597 -87727 43340 -53689 -158533 60709
18249 38663 -69302 -141696 -27226 -308346 40740 -244557 129115 -30216 -212366 277618 -112237
18237 98427 -54192 -321608 269302 28747 86662 -216641 -109998 117788 -242328 -150192
18227 -150192 -450402 -281985 -190016 -140689 373691 -76098 13170 61734 214577 -72376 -177509
18216 -177509 -122359 -88517 -155703 -86152 -163662 -218591 274728 -32472 117930 -128519 64766
18204 -253771 68902 -116426 10213 166760 -35757 -37313 141099 -265292 -533149 11809 -261878
$$ packed form
18284E2711h3663k7464k18099q7493J54320l1092B6979j1236a01072k35598p8472
18273d15142C0466O7701J6956a75848r9698b004o2384F68c9733H0694j2295i2561
18260A49230b60350A10553b01400O8209A72597h7727D3340e3689j04844F0709
18249C8663f9302p2394b7226k81120D0740b44557A29115c0216j82150B77618a12237
18237I8427e4192k67416B69302B8747N7915b16641J06643A17788b42328R2136
18227a50192l00210J68417R1969M9327C73691g6098A3170M8564J52843g2376j05133
18216a77509N5150L3842o7186O9551p7510n4929B74728c2472A17930a28519F4766
18204b53771F8902a16426A0213J56547c5757j556A41099b65292k67857A1809b61878
$$ plain form
18192 106879 -102164 231417 -193018 -45114 -206829 -114199 192171 -8651 -208715 253434
18181 -124115 -60199 -59616 -250424 -229672 105624 -408821 24548 67240 -35210 -5175 -333988
18170 -333988 -75077 298284 103973 -254886 -30195 -74323 -66782 -264489 74445 66943 -86107
18158 153340 -120603 -48027 48752 -178410 370723 -58399 -193262 -102089 -82620 181741
18147 -125279 -59217 323029 88878 100797 -67857 253789 44297 198309 -187829 20708 -26421
18135 -86617 -150117 -2922 -117913 199224 -12506 -217066 -135008 -6455 -191737 -4728 106551
18123 24180 31987 -79212 -12863 22525 264232 -139745 -76665 129755 30108 -165697 -66220
18111 -548649 -14090 21838 218155 -122827 158155 119528 -140762 -123968 -183879 42386 -223683
$$ packed form
18192A06879a02164B31417a93018d5114j61715R2630A92171h651k00064B53434
18181a24115f0199N83j90808K0752A05624d08821B4548M2692c5210e175l28813
18170c33988g5077B98284A03973b54886c0195m4128P541j97707G4445p502h6107
18158A53340a20603d8027D8752a78410C70723e8399j34863R1173J9469A81741
18147a25279e9217C23029H8878J1919f7857B53789D4297J54012a87829B0708b6421
18135h6617o3500b922j14991A99224a2506k04560Q2058f455j85282d728A06551
18123B4180P807g9212a2863B2525K41707a39745O3080A29755C0108a65697f6220
18111e48649a4090B1838J96317a22827A58155l8627a40762J6794n9911D2386b23683
$$ plain form
18099 110785 -15707 138643 -125105 101324 -78428 -268253 -66727 323489 -249531 86651
18088 -104888 164864 -299096 359469 -219215 -162567 197873 68375 -121012 -178339 -24626
18077 -176829 -209873 -34161 97631 -68625 -312989 -30780 11918 -324838 115656 97146 -180447
18065 -148838 95459 -412762 219886 85346 -68022 26141 62464 52366 -33785 -72336 69050
18053 155241 388689 151575 -112838 75601 104135 267118 190642 -93902 102877 -4348 99638
18041 131573 -52785 -130017 90611 -476014 299957 -268733 -100007 92353 -80003 49050 223038
18030 223038 -156940 -39223 -15418 -28529 58354 93685 29411 52633 118211 71020 -38380
18018 -34429 211893 -24504 178324 -180130 230301 -113821 -82539 46077 -79093 151252
$$ packed form
18099A10785a5707A38643a25105A01324g8428j89825f6727C23489b49531H6651
18088a04888A64864b99096C59469b19215N6648A97873F8375a21012n7327b4626
18077a76829l3044c4161I7631f8625k44364c0780A1918c24838A15656j8510a80447
18065a48838I5459d12762B19886H5346f8022B6141L6323j0098c3785l8551F9050
18053A55241K33448A51575a12838G5601K8534J62983p6476i3902A02877d348I9638
18041A31573e2785p7232I0611d76014B99957b68733a00007I2353h0003D9050J73988
18030B23038a56940c9223a5418j3111E8354L5331B9411K3222O5578m7191c8380
18018c4429B11893b4504A78324a80130B30301a13821L1282D6077g9093A51252
$$ plain form
18007 -262863 27735 218335 57791 -297520 -19622 -433194 69844 67488 -3970 -98236 26642
17995 -15285 -51160 -127477 311569 40451 105720 -89746 -97385 -219375 -72086 178945 371316
17984 371316 -144962 -211365 -48862 -194394 115859 -101575 -124348 -236846 183320 -2797
17973 14843 -27635 65059 39054 77841 124154 11182 181044 -227142 -8072 76569 130870
17962 130870 92985 -111318 -256415 124500 -201695 132003 -64305 -294498 -118677 -78859
17952 -78859 23287 222929 -314478 -44226 -166355 -36719 -73406 -421 139251 -220339 -402400
17941 -402400 27521 -4154 21266 86243 -68149 -24211 -75947 -370678 138367 53336 391046
17930 391046 -13023 -76682 -260705 -80642 59911 167658 -171468 17974 27762 230960 -47963
$$ packed form
18007b62863B7735J90600E7791b97520a9622m13572F9844k356c970r4266B6642
17995a5285l5875p6317C11569D0451O5269h9746p639j21990g2086A78945J92371
17984C71316a44962o6403d8862j45532A15859a01575k2773j12498A83320b797
17973A4843b7635F5059k6005L8787M6313A1182J69862b27142h072G6569N4301
17962A30870l7885a11318j45097A24500b01695A32003f4305k30193a18677L9818
17952g8859B3287J99642c14478d4226j22129c6719l6687d21A39251b20339j82061
17941d02400B7521d154B1266O4977f8149b4211n1736k94731A38367E3336L37710
17930C91046a3023o3659j84023h0642E9911J07747a71468A7974R788K03198d7963
$$ plain form
17918 87222 60233 76983 -411886 -86365 12178 9035 -17889 2008 13828 -72752 107686 134233
17906 134233 60916 922 -95155 100395 173016 61115 -77890 -221431 58296 160254 -142495
17894 150817 -228389 -219723 -292419 99516 -32713 -127871 -68696 75546 422514 -89707 178396
17882 151003 -430086 -162212 151800 -196038 283274 -25640 -197552 -137208 -48162 -124999
17872 -124999 -165682 -184943 -377165 -229552 -9163 3220 -107323 -95772 425659 237223 46524
17860 -10502 -177963 -49555 -108618 -208204 266460 -149060 73386 169692 92860 -161200 57957
17848 155505 230568 -38895 -337541 -131356 59797 -384573 -201012 1657 32018 -102059 302846
17836 342713 224734 -90499 -18656 -107674 -199913 -175888 89954 -46755 148256 183917 -61567
$$ packed form
17918H7222k6989J6750d11886h6365A2178l143a7889B008J1820g2752A07686K6547
17906A34233F0916I22i5155A00395P2621F1115g7890j43541E8296J01958a42495
17894A50817b28389Q666p2696I9516c2713r5158N9175G5546L46968h9707A78396
17882A51003d30086a62212A51800a96038B83274b5640j71912O0344d8162p6837
17872a24999m0683j9261j92222J47613i163C220a07323J1551D25659j88436D6524
17860a0502j67461d9555n9063r9586B66460a49060G3386R6306p6832a61200E7957
17848A55505P5063c8895k98646a31356E9797c84573J83561A657L0361a02059C02846
17836C42713j17979i0499a8656q9018r2239K4025H9954d6755A48256L5661f1567
$$ plain form
17824 -209414 49006 -51859 66003 22961 280385 -25366 101488 -53920 233149 -138072 -67225
17812 -294259 -454421 151715 128975 -108548 -58410 -17290 307504 -154814 25063 -33192
17801 -411816 -40995 48743 63444 44701 241393 -43567 -179416 409937 245101 22473 -54130
17789 -53781 99587 177347 153875 -119724 -63128 169329 -242162 57896 61482 278782 118138
17777 -63306 213028 -29981 105312 29576 43487 -3093 -34852 -293615 -81642 -155174 1049
17765 -278347 28264 24307 -418825 20065 -129600 -48691 -19562 -19169 38027 -276450 -13367
17753 6311 26580 -222734 43187 122195 67042 -57031 268801 -212250 136920 161828 -193424
17741 -131507 77607 -47745 27627 364060 61660 362202 94936 -73648 50736 -80647 -142120
$$ packed form
17824b09414D9006e1859F6003B2961K57424b5366A01488e3920B33149a38072f7225
17812b94259j60162A51715k2740a08548N0138a7290C07504a54814B5063c3192
17801d11816d0995D8743J4701j8743J96692d3567j35849D09937j64836B2473e4130
17789e3781I9587P7760k3472a19724N6596A69329b42162E7896L586K17300A18138
17777f3306B13028b9981A05312B9576J3911c093l1759k58763h1642p3532A049
17765b78347B8264l957d18825B0065a29600d8691a9562L93C8027b76450a3367
17753F311K0269b22734D3187P9008n5153e7031B68801b12250A36920K4908a93424
17741a31507G7607d7745B7627L36433F1660L00542I4936g3648E0736h0647o1473
$$ plain form
17730 -142120 256913 -69087 -196416 -168645 -111001 118242 60176 340844 -181684 51246
17719 71265 30434 -197381 225005 300721 95365 -309551 16853 165100 278260 -293790
17708 748 -103454 -118476 -44837 3164 84878 31994 -22481 -74673 -150068 167073 2403 -358769
17695 -171651 -120614 88453 -133732 -74566 -88894 105897 63405 3476 -231358 -30487 62991
17683 169108 26865 139133 27544 102456 -85344 138120 84581 -153576 -18349 37640 -371380
17671 75345 -108471 -28392 -29673 349072 284368 149690 66166 -259089 248650 -194385 86277
17659 85439 -64516 -69824 -206135 198894 -473265 193504 -270071 273394 161459 23896
17648 559 -164135 -22199 352677 406139 92791 -54275 -53670 -175295 340723 -64257 122202
$$ packed form
17730a42120B56913f9087j27329K7771N7644A18242n8066K80668a81684E1246
17719G1265C0434a97381B25005P5716I5365c09551A6853J48247J13160b93790
17708G48a03454j5022d4837C164Q1714C1994b2481n2192p5395A67073B403c58769
17695a71651N1037H8453a33732N9166j4328A05897m2492C476b31358c0487F2991
17683A69108B6865J12268B7544P4912h5344A38120n3539a53576a8349C7640c71380
17671G5345a08471b8392j281C49072o4704j34678F6166b59089B48650a94385H6277
17659H5439f4516n308j36311A98894d73265A93504b70071B73394j11935B3896
17648E59a64135b2199C52677N3462I2791e4275O05j21625C40723f4257A22202
$$ plain form
17636 -28392 -43624 -93278 136501 54170 -212579 82056 -155638 -93828 250043 208346 -14514
17624 -3140 151648 -105860 245010 26858 147171 -80394 102981 -138575 50100 -109105
17613 100650 134225 332287 85562 -11767 324626 -116344 13209 -244171 295680 110689
17602 -31204 -99968 -70243 60690 251072 -75513 -149137 -142699 -28938 -30275 336436 142497
17590 88275 -18701 84503 -84126 124310 192152 -308117 19578 -16756 -113182 215363 115160
17579 115160 -389531 151236 -130755 157433 -164250 -81947 -270362 -6147 -122324 159159
17568 -184742 -109466 108587 149481 102924 271180 -59738 122093 -155609 -59908 -18896 -7180
17556 -55101 -169793 114681 99817 167206 57973 -92739 50814 -74784 67952 127867 -29169
$$ packed form
17636b8392j5232m9654A36501E4170b12579H2056a55638O1810B50043m1697a4514
17624c140A51648a05860B45010B6858J20313h0394A02981a38575E0100a09105
17613A00650L3575J98062H5562a1767C24626a16344A3209b44171B95680A10689
17602c1204o8764K9725F0690J90382g5513p3624O438b8938j337C36436A42497
17590H8275a8701H4503h4126A24310O7842c08117A9578a6756r6426B15363j00203
17579A15160c89531A51236a30755A57433a64250h1947j88415f147j16177A59159
17568a84742P5276A08587M0894m6557J68256e9738A22093a55609e9908a8896g180
17556e5101j14692A14681j4864O7389E7973i2739E0814g4784F7952N9915b9169
$$ plain form
17544 -360171 111677 -36038 158940 -274344 44566 132550 301830 398743 362237 95379 -36228
17532 3526 -82719 372161 377680 120543 -51649 292169 199891 -8024 157110 138158 11188
17520 -86207 55701 51741 57908 226756 162219 123750 232199 -27347 269007 227605 233149 181923
17508 181923 147192 25052 116729 100216 -30103 312081 -294201 76767 88727 109943 290467
17497 290467 -157859 22892 53355 256265 10321 377822 22432 217272 193223 106881 332715
17486 332715 -77986 -271540 -80553 381893 321826 -45647 246872 107275 234741 85463
17475 51984 293955 -43995 253457 195486 225731 209943 269687 93047 102782 -41664 -302053
17464 -302053 -208537 247591 173706 135280 390027 112166 -178169 26819 395213 438978
$$ packed form
17544c60171A11677c6038A58940b74344D4566Q7984J69280R6913l6506I5379c6228
17532C526h2719C72161N519A20543e1649B92169r2278h024A57110j8952A1188
17520h6207E5701l960O167J68848o4537l8469J08449b7347B69007m1402N544n1226
17508A81923l4731B5052R1677j6513c0103C12081b94201G6767J1960K1216J80524
17497B90467a57859B2892L0463K02910A0321L67501B2432J94840k4049q6342K25834
17486C32715g7986j93554h0553C81893o0067d5647B46872A07275J27466H5463
17475E1984K41971d3995B53457n7971L0245j5788N9744I3047R735d1664k60389
17464c02053R3516B47591p3885l8426K54747A12166a78169B6819L68394M3765
$$ plain form
17454 438978 162977 198187 260438 226711 103387 591620 302566 348136 399230 223394
17444 223394 -53414 485439 95863 150499 33124 251653 159247 114141 168992 -49670 493348
17432 242468 266424 109447 148292 87762 -126400 81611 221966 224962 157472 233801 82508
17420 291254 364197 362594 -146791 74817 176006 116295 49480 45199 324384 89470 -123578
17408 135592 184560 290838 -98434 -48812 136529 -21517 326391 308730 168149 219205 122219
17397 122219 -121737 449277 21058 -15408 90784 114536 -45799 298625 375325 -26858 174675
17385 457715 116331 41133 -32883 218612 111896 -126694 32712 -111052 458643 -94160
17374 -42260 170600 -264781 258713 -1125 33548 252907 261611 180769 150931 199497 264451
$$ packed form
17454D38978A62977L5210O2251l3727A03387M88233k89054M5570N1094j75836
17444B23394e3414D85439I5863N4636C3124K18529r2406m5106N4851d9670D93348
17432B42468K3956A09447L8845o0530a26400H1611J40355K996o7490P6329H2508
17420B91254P2943j603a46791G4817J01189n9711D9480m281K79185H9470a23578
17408A35592M8968J06278i8434d8812A36529b1517C26391j7661j40581N1056r6986
17397A22219a21737D49277B1058a5408I0784K3752d5799B98625P6700b6858A74675
17385D57715A16331D1133c2883B18612j06716a26694C2712a11052D58643i4160
17374d2260A70600b64781B58713a125C3548K19359Q704q0842k9838M8566O4954
$$ plain form
17363 264451 -32377 167621 104592 167037 258433 -158174 414843 -27017 218197 -54343 139461
17351 183894 139007 -30579 186350 112833 159516 342627 258191 269431 265035 366049 254756
17340 254756 -10787 69889 39863 -104441 380637 251177 64176 193061 -84260 22894 277801
17329 277801 354623 462926 105795 213351 13318 55191 33647 -54247 -94990 -66063 173573
17317 202930 83606 -46116 375463 124389 140379 -99077 33769 23784 78339 226012 451581
17306 451581 286372 54449 143936 305117 299008 92926 168370 250549 323937 252196 169469
17295 169469 -152822 110872 99070 115302 473909 -28958 251282 144639 269999 128575
17284 242816 145016 177052 116847 -73783 32814 -2121 -53123 394205 -102869 242801 283750
$$ packed form
17363B64451c2377A67621o3029O2445R1396a58174D14843b7017B18197e4343A39461
17351A83894m4887c0579A86350p3517M6683J83111q4436J1240m396J01014j11293
17340B54756a0787F9889l0026a04441C80637j29460F4176J28885h4260B2894K54907
17329B77801P6822J08303A05795J07556A3318M1873k1544e4247m0743K8927A73573
17317B02930H3606d6116C75463A24389J5990i9077C3769r985N4555J47673K25569
17306D51581j65209E4449Q9487J61181o109I2926P5444Q2179P3388p1741q2727
17295A69469a52822A10872j1802J6232L58607b8958B51282j06643J25360A28575
17284B42816r7800L2036o0205g3783C2814b121n1002C94205a02869B42801M0949
$$ plain form
17273 283750 71847 340809 -99446 178755 229385 -70407 25651 361258 284483 163311 374351
17262 374351 416 9289 224243 130751 59692 -150686 -104383 -140487 -69807 326639 -102394
17250 100235 36148 454368 150008 19135 410147 -112677 96624 93803 370740 102605
17239 119280 32577 253675 93956 408599 389783 14689 2285 212708 38906 242605 -204549
17227 162970 269660 216237 465502 109554 -8137 165258 -27598 127233 247510 267003
17217 267003 372293 134121 299715 173069 142305 100793 211278 439834 193369 352154
17207 352154 267615 33658 619107 356511 -22239 390793 377554 308474 170710 249796 422354
17196 422354 166898 481394 474084 461584 718598 500776 296073 110114 192460 64448
$$ packed form
17273B83750G1847K68962i9446A78755N0630g0407B5651L35607p6775j21172K11040
17262C74351D16Q873K14954r3492E9692a50686M6303l6104f9807C26639a02394
17250A00235C6148M18220A50008A9135L91012a12677I6624k821K76937A02605
17239A19280C2577K21098I3956L14643j8816A4689B285K10423C8906K03699b04549
17227A62970J06690n3423K49265A09554h137A65258b7598A27233J20277J9493
17217B67003J05290A34121J65594j26646l0764m1512J10485K28556A93369J58785
17207C52154q4539C3658N85449k62596b2239C90793j3239o9080j37764P9086J72558
17196D22354A66898L14496p310j2500K57014k17822k04703A10114Q2346F4448
$$ plain form
17185 170587 47500 218840 163634 139733 44825 1865 471421 347842 338188 368534 305887
17174 305887 228985 274411 560356 432502 191013 85736 64755 44064 242407 142363
17164 142363 68854 119763 407190 310454 379072 160462 629844 370164 429267 340266 -21299
17152 43746 -53992 141060 264272 613396 174564 488894 164035 264333 459814 50441
17141 534673 350131 74245 238588 158177 283116 328421 261449 200907 421341 441214 362514
17130 362514 123204 343457 287935 220342 498373 76374 179777 -52118 115294 -22704
17119 107446 297754 248085 199806 433166 381527 -337076 298646 195603 622068 322013
17109 322013 500072 313575 208152 161425 235629 163244 288719 434948 350101 333541
$$ packed form
17185A70587D7500J71340n5206k3901D4825A865M69556j23579r654L0346o2647
17174C05887p6902M5426K85945j27854A91013H5736k0981k0691J98343j00044
17164A42363F8854N0909K87427r6736O8618A60462M69382k59680N9103q9001b1299
17152D3746e3992A41060J23212L49124A74564L14330A64035J00298J95481E0441
17141E34673j84542G4245J64343q0411J24939M5305o6972o0542K20434J9873p8700
17130C62514A23204K20253n5522o7593K78031G6374J03403e2118A15294b2704
17119A07446J90308m9669m8279K33360n1639c37076B98646j03043M26465l00055
17109C22013J78059j86497j05423m6727P4204p2385J25475J46229q4847j6560
$$ plain form
17099 333541 316123 85043 373849 601107 528654 574187 375243 603668 398393 289634
17089 289634 224555 443268 377089 141841 300343 208540 361655 659723 357796 49383
17078 560027 392865 160069 632611 778221 346887 384745 141310 577021 632597 663664
17068 663664 531745 231669 493964 357830 357174 637156 575926 405601 538695 286698
17058 286698 540698 374910 550758 510492 530017 354109 662389 757831 492612 510881
17048 510881 423668 243932 620543 617412 821228 672438 654211 486654 242343 860787
17038 860787 596419 416078 126976 272606 677550 738332 540916 574079 752259 621455
17028 621455 408240 820782 632380 674154 686029 268841 654672 404919 542522 246621
$$ packed form
17099C33541j7418H5043K88806K27258p2453M5533j98944K28425k05275j08759
17089B89634o5079K18713o6179A41841J58502r1803J53115K98068l01927D9383
17078E60027j67162A60069M72542J45610C46887L7858A41310M35711N5576L1067
17068F63664j31919B31669K62295j36134o56K79982o1230j70325J33094k51997
17058B86698K54000j65788J75848m0266J9525j75908L08280R5442k65219J8269
17048E10881q7213j79736L76611l131K03816j48790j8227j67557B42343O18444
17038H60787k64368j80341A26976J45630M04944O0782j97416L3163J78180j30804
17028F21455k13215M12542j88402M1774J1875B68841L85831k49753J37603B46621
$$ plain form
17017 680567 592307 499463 686018 417296 667873 474426 854270 640669 644750 685908
17007 685908 633990 927119 641929 623010 761106 610808 829845 871035 1033320 732840
16997 732840 662510 738507 481602 767019 578901 577038 456222 911594 659690 582394
16987 582394 1014466 784511 983204 786604 812435 670255 660127 726046 1296524 842154
16977 842154 804151 703059 960099 827595 895190 387390 994749 786779 954097 805454
16967 805454 985464 481319 1105025 881008 850699 1109887 929487 655625 958444 893013
16957 893013 810044 931330 1201364 666605 785325 836923 992634 1209939 983199 1174431
16947 1174431 842522 933775 1092475 1044030 1132351 1113982 1052044 1113823 1101516 1235418 775581
$$ packed form
17017F80567q8260r2844J86555k68722K50577j93447L79844k13601M081M1158
17007F85908n1918K93129k85190j8919J38096j50298K19037M1190J62285l00480
16997G32840p0330P5997k56905K85417j88118j863j20816M55372k51904p7296
16987E82394M32072k29955J98693j96600K5831j42180j0128O5919N70478m54370
16977H42154l8003j01092K57040j32504O7595C87390O07359k07970J67318j48643
16967H05454J80010D81319O23706k24017l0309K59188j80400k73862L02819o5431
16957H93013q2969J21286K70034n34759J18720N1598J55711K17305k26740J91232
16947A174431l31909R1253J58700m8445Q8321j8369o1938O1779j2307J33902m59837
$$ plain form
16936 775581 1186654 1058127 1234671 1154126 1238029 1281575 1153533 1154316 1220165 1280814 1354997
16925 1354997 1425062 1437474 978829 1520100 1513419 1121746 933762 1788068 1358625 1167660
16915 1167660 1232096 1527177 1497920 1318394 1478784 1289675 1355409 1586975 1407590 1596068
16905 1596068 1179883 1407010 1520632 1617750 1589599 1460058 1875008 1624960 1611141 1326553
16895 1326553 1368038 1781174 1971194 1723273 1673042 1933451 1867032 1834241 1991908 2241613
16885 2241613 1826292 2125878 1909592 1840866 2060209 2236317 2134047 2227159 2077434 1988752
16875 1988752 2354672 2104881 2186706 2074325 2331405 2282085 2548604 2253933 2625510 2595101
16865 2595101 2670935 2430184 2465540 2569650 2958412 3018619 2775575 2864366 2859782 2741776
$$ packed form
16936G75581M11073j28527J76544q0545Q3903M3546j28042P83O5849O0649P4183
16925A354997P0065J2412m58645N41271o681l91673j87984Q54306m29443j90965
16915A167660O4436K95081k9257j79526J60390j89109O5734K31566j79385J88478
16905A596068m16185K27127J13622R7118k8151j29541M14950k50048j3819k84588
16895A326553M1485M13136J90020k47921n0231K60409o6419l2791J57667K49705
16885B241613m15321K99586k16286o8726K19343J76108j02270R3112j49725q8682
16875A988752L65920k49791Q1825j12381K57080m9320K66519k94671L71577l0409
16865B595101P5834k40751L5356J04110L88762O0207k43044Q8791m584j18006
$$ plain form
16855 2741776 2783101 2808816 3036864 3394745 2896188 3067914 3259409 3109990 2874447 3350689
16845 3350689 3118351 3599111 3531405 3330516 3720633 3543964 3539741 3535282 3636963 3821920
16835 3821920 4172087 3587928 3991485 4353195 4214833 4235860 4350770 4531722 4511993 4545217
16825 4545217 4417220 4808113 4504960 5120249 4865510 5099359 4884569 5009649 5160170
16816 5160170 5397559 5537476 5333200 5527083 5667989 5736966 6177525 6292936 6399252 6453318
16806 6453318 6771090 6870440 6950501 6620034 7224132 7306372 7446251 7621847 7635617 8234039
16796 8234039 8129127 8519992 8516558 8890073 8900228 9049176 9460487 9447864 9847750 10336496
16786 10336496 10477877 10871547 11018754 11538095 11778858 11920959 12300587 12790322 13069131
$$ packed form
16855B741776M1325K5715K28048L57881m98557J71726J91495j49419k35543M76242
16845C350689k32338M80760o7706k00889L90117j76669m223m459J01681J84957
16835C821920L50167n84159M03557L61710j38362K1027J14910J80952j9729L3224
16825D545217j27997L90893l03153O15289k54739K33849k14790J25080J50521
16816E160170K37389J39917k04276J93883J40906O8977M40559J15411J06316N4066
16806F453318L17772R9350Q0061l30467O04098Q2240J39879J75596J3770N98422
16796H234039j04912L90865l434L73515J0155J48948M11311j2623L99886M88746
16786A0336496J41381L93670J47207N19341K40763J42101L79628M89735K78809
$$ plain form
16777 13069131 13599030 13852103 14469141 14739092 15216063 16064909 16036703 16890932 17078172
16768 17078172 17887918 18428100 19009856 20026605 20447057 21086946 22018846 22941392 23912723
16759 23912723 24607228 25741900 26902307 27715726 28857445 30172781 31390572 32507592
16751 32507592 34502559 35731138 37885324 39833260 41575372 43671167 45899991 48386726
16743 48386726 50950545 53579799 56553627 59543641 63096245 66512989 70713625 74717709
16735 74717709 78973679 83969599 88782105 94344038 100515708 106490704 112866418 119556449
16727 119556449 126444861 134123295 141614614 148923511 156266217 163968301 170610993 177011727
16719 177011727 182970837 187970042 191962400 194878736 195901899 195927386 194743632 192040342
$$ packed form
16777A3069131N29899K53073O17038K69951M76971Q48846k8206Q54229J87240
16768A7078172Q09746N40182N81756J016749M20452O39889R31900R22546R71331
16759B3912723O94505J134672J160407Q13419J141719J315336J217791J117020
16751C2507592J994967J228579K154186J947936J742112K095795K228824K486735
16743D8386726K563819K629254K973828K990014L552604L416744M200636M004084
16735G4717709M255970M995920M812506N561933O171670N974996O375714O690031
16727A19556449O888412P678434P491319P308897P342706P702084O642692O400734
16719A77011727N959110M999205L992358K916336J023163K5487j183754k703290
$$ plain form
16711 192040342 188325032 183556521 177641118 171291836 164235623 156932711 149278514 141659917
16703 141659917 133857094 126784913 119329266 112780512 105936446 99644369 93536269 88055750
16695 88055750 82967921 78664053 73569589 69075527 65515043 61944530 58524306 55086252
16687 55086252 52223526 49595062 47092966 44924570 42305235 40384584 38469143 36432227
16679 36432227 35263981 33073378 32116143 30360874 29302284 27730301 26801996 25589299
16671 25589299 24203044 23585686 22406640 21670730 20620059 20283570 19221613 18498666 17930279
16662 17930279 17187241 16617766 16133605 15638923 15029516 14786664 13809334 13591421 13119551
16653 13119551 12939303 12598652 12218797 11722665 11249048 11095754 11076065 10100296 10299967
$$ packed form
16711A92040342l715310m768511n915403o349282p056213p302912p654197p618597
16703A41659917p802823p072181p455647o548754o844066o292077o108100n480519
16695H8055750n087829m303868n094464m494062l560484l570513l420224l438054
16687E5086252k862726k628464k502096k168396k619335j920651j915441k036916
16679C6432227j168246k190603r57235j755269j058590j571983r28305j212697
16671B5589299j386255o17358j179046p35910j050671l36489j061957p22947n68387
16662A7930279p43038n69475m84161m94682o09407k42852r77330k17913m71870
16653A3119551j80248l40651l79855m96132m73617j53294j9689r75769J99671
$$ plain form
16644 10299967 9786661 9683333 9046768 8616079 8471595 8621043 8216417 7873488 7846064
16635 7846064 7648921 7557422 7297437 6990685 7301929 6730174 6576860 6162853 5958702 5918859
16625 5918859 6055024 5966626 5913638 5296162 5717260 5491245 5110441 5122637 5012812 4817064
16615 4817064 4772794 4670031 4749341 4418468 4608175 4187950 4457173 4129875 4306147 3837884
16605 3837884 3649671 4093655 3791076 3534461 3828287 3759921 3428414 3417595 3122803 3311728
16595 3311728 3418618 3127443 3508933 3279158 3127447 2581500 2981845 2634725 2978972
16586 2978972 2409954 2733349 2669034 2907511 2853639 2733280 2787751 2371148 2578288 2277583
16576 2277583 2327501 2274842 2114607 2671788 2359240 2086419 2374189 1705485 2241146 2069942
$$ packed form
16644A0299967n13306j03328o36565m30689j44484J49448m04626l42929k7424
16635G846064j97143r1499k59985l06752L11244n71755j53314m14007k04151l9843
16625E918859J36165q8398n2988o17476M21098k26015l80804J2196j09825j95748
16615D817064m4270j02763P9310l30873J89707m20225K69223l27298J76272m68263
16605C837884j88213M43984l02579k56615K93826o8366l31507j0819k94792J88925
16595C311728J06890k91175L81490k29775j51711n45947M00345l47120L44247
16586B978972n69018L23395o4315K38477n3872j20359N4471m16603K07140l00705
16576B277583M9918n2659j60235N57181l12548k72821K87770o68704N35661j71204
$$ plain form
16566 2069942 2435776 1859230 1933947 2037350 2116581 1537297 1928224 1766573 1701360 1693864
16556 1693864 1848821 1896886 1519515 1744588 1623748 1822492 1595319 1428443 1565632 1625690
16546 1625690 1708621 1451695 1695036 1569829 1738477 1138197 1732547 1550528 1515719 1595779
16536 1595779 1396088 1487418 1098155 1234673 1555567 1158899 1226236 1295707 1672280 1233588
16526 1233588 1139180 1205977 1145853 1186127 872109 1234429 1157037 1503178 1415023 1235713
16516 1235713 594553 1284998 944409 1244376 1075560 1217725 1092868 1495249 1079855
16507 1079855 849335 1016754 738103 1397796 662550 798239 1114410 945732 980984 922650
16497 922650 1068566 815653 1004191 755879 911405 899857 769947 618123 815093 695290
$$ packed form
16566B069942L65834n76546P4717J03403P9231n79284L90927j61651o5213p496
16556A693864J54957M8065l77371K25073j20840J98744k27173j66876J37189O0058
16546A625690Q2931k56926K43341j25207J68648o00280N94350j82019l4809Q0060
16536A595779j99691R1330l89263J36518L20894l96668O7337O9471L76573m38692
16526A233588r4408O6797o0124M0274l14018L62320p7392L46141q8155j79310
16516A235713E94553O90445l40589K99967j68816J42165j24857M02381m15394
16507A079855k30520J67419k78651O59693F62550J35689L16171j68678L5252n8334
16497I22650J45916k52913J88538k48312J55526j1548j29910j51824J96970j19803
$$ plain form
16487 695290 698185 967907 857343 1100086 856541 928461 787019 478453 650126 432655
16477 432655 713272 657908 1209408 569401 771658 662968 587296 639393 587257 1072481
16467 1072481 612468 596338 643959 693131 729365 852163 543600 712000 523196 701394
16457 701394 753871 624379 948267 1043623 373144 876812 472576 779149 510771 695011
16447 695011 248517 625110 315107 770148 476610 688452 422610 459014 313638 674190
16437 674190 522559 405899 481264 642944 817093 430944 756962 679324 304864 552932
16427 552932 585144 244051 466751 480969 331192 517304 567406 207067 223204 365599
16417 365599 15228 561158 178960 543770 407618 461044 653429 409698 476398 158246
$$ packed form
16487F95290K895K69722j10564K42743k43545P1920j41442l08566J71673k17471
16477D32655K80617n5364N51500E69401K02257j08690p5672N2097n2136M85224
16467A072481m60013j6130M7621M9172L6234J22798l08563J68400j88804J78198
16457G01394N2477j29492L23888R5356C73144N03668m04236L06573k68378J84240
16447F95011B48517L76593l10003M55041k93538K11842k65842L6404j45376L60552
16437F74190j51631j16660P5365J61680J74149l86149L26018p7638C04864K48068
16427E52932L2212B44051K22700J4218j49777J86112N0102B07067J6137J42395
16417C65599A5228N45930A78960L64810j36152N3426J92385k43731O6700A58246
$$ plain form
16406 269054 650235 406527 559728 453969 256041 249876 8891 466194 381256 73059 570491
16395 570491 270406 333653 418886 372443 231408 86359 223222 257122 473101 -38995 189876
16383 431970 474932 154668 310978 451899 317650 327022 61989 410820 268180 227273
16373 227273 59125 -145176 -148264 330517 583219 388283 140730 191741 187503 328637 163332
16361 225997 55547 557334 287645 119893 222212 170412 -11199 478677 196691 169984
16351 169984 319550 201554 375596 381971 226027 157543 355927 48863 249880 368955
16341 368955 199018 392927 470744 272376 278687 143114 22865 69899 314361 328051 -26770
16329 63629 -53744 351743 38368 -25420 189955 251805 194841 -40621 246985 -94783 214576
$$ packed form
16406B69054L81181k43708J53201j05759j97928o165H891M57303q4938G3059M97432
16395E70491B70406O3247Q5233m6443j41035H6359J36863L3900K15979c8995A89876
16383D31970M2962A54668J56310J40921j34249R372F1989L48831j42640m0907
16373B27273E9125a45176l088C30517K52702j94936A40730N1011m238J41134A63332
16361B25997E5547N01787k69689A19893J02319n1800a1199D78677A96691k6707
16351A69984J49566j17996J74042O375j55944o8484J98384D8863K01017J19075
16341C68955j69937J93909P7817j98368O311j35573B2865M7034K44462J3690b6770
16329F3629e3744C51743C8368b5420A89955O1850n6964d0621B46985i4783B14576
$$ plain form
16317 250836 133419 151360 265215 128134 116925 141668 89678 227783 429584 116213
16306 235443 335059 296151 16725 327453 -41531 -73376 219518 351590 17327 45893 400502
16295 400502 -258968 264515 -73940 331219 294030 197699 34673 180051 262972 87878 200057
16284 200057 243328 11768 16070 432860 -30848 11692 84347 229435 166828 155673 -193136
16272 -98598 -32130 106750 438185 181797 90480 -139676 409671 -53052 45032 -106470
16261 308396 -224425 262837 219286 27762 93813 507831 150766 196035 329643 315652
16251 315652 -43842 517717 37600 8534 180433 109717 84813 249650 371203 337877 -340425
16239 15509 227930 218661 94787 -257507 249866 -195302 33543 94486 442210 85026 -123393
$$ packed form
16317B50836j17417J7941J13855A28134j1209K4743n1990J38105K01801A16213
16306B35443R9616l8908A6725L10728d1531l1845B19518J32072A7327K8566L54609
16295D00502b58968B64515g3940C31219l7189r6331C4673J45378Q2921H7878J12179
16284B00057M3271A1768M302M16790c0848A1692P2655J45088o2607j1155a93136
16272i8598c2130A06750L31435A81797I0480a39676D09671e3052D5032a06470
16261C08396b24425B62837m3551B7762O6051M14018A50766M5269J33608j3991
16251C15652d3842E17717C7600H534J71899p0716k4904J64837J21553l3326c40425
16239A5509K12421r269I4787b57507B49866a95302C3543O0943L47724H5026a23393
$$ plain form
16227 191823 207374 214173 25800 -83540 -51890 261760 305857 -20974 55082 22007 176544
16216 176544 -83531 194601 -202037 225281 34788 150184 132334 -65301 181883 136825
16206 136825 -7714 315802 87210 204518 -8378 -352950 248724 -27367 -82859 78044 298541
16195 298541 -381565 168020 100499 291116 17227 -134551 -62021 13674 -36045 -70123 -125782
16184 -125782 64504 -19873 139602 174366 -65135 -203688 59644 -87406 -244378 293600 38052
16172 172962 225853 177775 -27991 334241 -44722 -192742 -41717 -297405 35525 161805 99630
16161 99630 -146205 -162910 261434 -130295 45253 283700 -206511 -18140 -147085 -235768
16151 -235768 -19260 -73968 -61872 91957 -87621 197959 194 16934 220019 230219 208335
$$ packed form
16227A91823J5551O799B5800h3540L1650B61760M4097b0974E5082B2007J54537
16216A76544h3531A94601b02037B25281C4788J15396j7850f5301A81883m5058
16206A36825g714C15802H7210J17308h378l44572B48724b7367n5492G8044K20497
16195B98541c81565A68020o7521J90617A7227a34551f2021A3674c6045l4078n5659
16184a25782F4504a9873A39602L4764f5135j38553E9644h7406j56972B93600C8052
16172A72962N2891m8078b7991C34241d4722j48020d1717k55688C5525J26280o2175
16161I9630a46205j6705B61434a30295D5253K38447b06511a8140j28945q8683
16151b35768a9260n4708J2096I1957h7621A97959A94J6740K03085J0200k1884
$$ plain form
16140 208335 401199 40747 238663 194154 -81563 197227 92763 85956 -200245 18745 236861
16129 236861 -195158 -104450 -167962 129113 -86966 175528 -8940 -27893 2628 175352 108969
16118 108969 -452525 -54188 143519 -2393 -77757 -20930 -23801 270174 37296 153061 198191
16107 198191 139787 -41360 250972 -28588 420697 86520 374116 112051 100855 259614
16097 259614 31545 -39083 -266959 238812 -38109 -92578 -43135 236935 -197980 11085 202610
16086 202610 56646 185806 -257322 268910 241901 -117633 308228 120679 -107338 -125788
16076 -125788 387092 -315967 -24827 -62151 -185927 -195466 -86143 -143506 66460 8226 -109375
16064 -45311 -85586 -73232 334637 -83963 -216920 -190295 -250969 -68426 -318050 164966 155881
$$ packed form
16140B08335J92864D0747J97916m4509h1563A97227I2763o807b00245A8745K18116
16129B36861a95158R0708o3512A29113h6966A75528h940j8953B628J72724o6383
16118A08969d52525e4188A43519b393p5364b0930k871B70174C7296J15765M5130
16107A98191n8404d1360B50972b8588D20697H6520K87596A12051j1196J58759
16097B59614C1545c9083k27876B38812c8109n4469d3135B36935a97980A1085J91525
16086B02610E6646J29160b57322B68910k7009a17633C08228A20679a07338j8450
16076a25788C87092c15967b4827l7324j23776r539h6143n7363F6460H226a09375
16064d5311m0275J2354C34637h3963j32957K6625o0674f8426k49624A64966r085
$$ plain form
16053 155881 -249731 104335 -311825 265643 3148 264873 -202911 -254344 75182 73191 -151756
16041 -26960 -168786 -226924 70337 -196382 3221 114214 -33080 163630 81175 19752 88152
16030 88152 182569 86195 123118 -61247 -24702 -66403 29263 113688 23309 172920 -184520
16018 -223416 256015 -107270 -175454 -29565 122077 71091 -135262 -9881 -186862 117343
16007 424831 -191992 -162078 -260491 -91951 73771 207204 -271520 93859 95428 -150129 132400
15995 17903 184717 -63579 -53543 -31526 -10341 90933 -231480 -71802 -160897 88100 307931
15984 307931 247410 467476 323554 414476 510764 17864 103532 410399 58856 135657 -20578
15972 -110980 82354 -270115 384148 -123862 -99081 -156377 -264282 -110758 -157964 -31486
$$ packed form
16053A55881b49731A04335c11825B65643C148K61725b02911n1433G5182j991a51756
16041b6960j41826n8138G0337a96382C221J10993c3080A63630H1175A9752O8400
16030H8152R4417H6195L6923f1247b4702m1701B9263Q4425B3309J49611a84520
16018b23416B56015a07270o8184b9565A22077n0986a35262i881j76981A17343
16007D24831a91992K9914r8413i1951G3771J33433b71520I3859J569a50129A32400
15995A7903J66814f3579J0036K2017a0341I0933b31480g1802q9095H8100K19831
15984C07931o0521K20066j43922R0922R6288A7864Q5668L06867E8856P6801b0578
15972a10980H2354b70115C84148a23862K4781n7296j07905a10758m7206c1486
$$ plain form
15961 34312 -41942 -104587 -219511 -238224 -139283 -19894 -30936 -9550 81451 -215240 -70568
15949 -61869 -140201 -102485 -399953 289972 -404068 -314322 270031 -215435 -83768 -315425
15939 -315425 -39236 -72518 144023 57176 44213 -7672 -131547 -87788 79262 65131 143639
15928 143639 20207 55211 15774 200983 -101312 -217255 77062 -5924 33044 -119458 -100344
15917 -100344 186247 -1789 -22609 -30057 -104302 187573 -37622 -19536 -234938 -115950 -298586
15906 -298586 -247619 -221711 41349 10936 33196 -338292 -234090 -166448 -9354 -205090 70960
15894 -88735 -240875 -185123 -208670 88173 -166068 -172915 131734 229051 -241164 -37819 26251
15882 -286444 104261 -47223 257642 -122824 -377640 -29115 60409 -16344 -104736 -413197
$$ packed form
15961C4312d1942o2645j14924j8713R8941a9894j1042i550H1451b15240g0568
15949f1869p8332L7716k97468B89972d04068Q9746B70031b15435h3768k31657
15939c15425c9236l3282A44023E7176j2963g672j23875M3759G9262j4131P8508
15928A43639B0207L5004A5774J85209a01312j15943G7062e924C3044a19458J9114
15917a00344A86247a789k0820p448p4245A87573c7622J8086k15402a15950j82636
15906b98586N0967K5908D1349A0936K2260c38292J04202O7642i354j95736G0960
15894h8735j52140N5752k3547H8173a66068o847A31734R7317b41164c7819B6251
15882b86444A04261d7223B57642a22824k54816b9115F0409a6344q8392l08461
$$ plain form
15872 -413197 -16423 -65720 45103 55338 -146142 -170157 -235616 -251735 -69159 48271 -348797
15860 -217746 91764 -207352 293391 -174798 253246 -176410 141963 276990 251356 348552
15850 348552 -100224 79289 -72913 2822 -94896 -27130 -166938 180409 -23346 -315968 125604
15838 210096 -228241 98843 -180422 7007 -250947 173212 -172243 49044 -226188 136323
15827 -121241 32090 -27055 -226595 -364522 71996 -179713 30361 -102397 69938 46307 -151195
15815 -95576 -3628 121422 -49848 256539 -111464 49186 -71381 69690 -201263 147018 36295
15803 -193307 -277283 -39649 -291197 37806 -195815 266750 -249613 -48134 -247690 240612
15792 77223 14529 77172 -137306 59202 56077 2207 -8454 52413 155702 -84761 -155860 240620
$$ packed form
15872d13197a6423m9297D5103J0235a46142k4015o5459j6119f9159D8271c48797
15860b17746I1764b07352B93391a74798B53246a76410A41963J35027k5634R7196
15850C48552a00224G9289g2913B822i4896b7130j39808A80409b3346k92622A25604
15838B10096b28241I8843a80422G007b50947A73212a72243D9044b26188A36323
15827a21241C2090b7055j99540j37927G1996a79713C0361a02397F9938k3631a51195
15815i5576c628A21422d9848B56539a11464D9186g1381F9690b01263A47018C6295
15803a93307q3976c9649k51548C7806a95815B66750b49613d8134j99556B40612
15792G7223A4529O2643a37306E9202l125B207h454E2413J03289h4761p1099B40620
$$ plain form
15779 -234821 200865 -57739 -55882 -120722 -124828 88083 -164228 52975 99837 1525 64378 -180763
15766 10418 133426 -104114 141246 76742 -137426 -218278 -45368 -5768 158036 105637 194865
15755 194865 248626 191002 -172821 59428 -323423 44994 148267 174562 172353 -74395 393252
15743 -46708 17174 -84007 -27119 276276 387250 -51027 135398 -99023 253253 -158356 -38807
15731 -63468 -44215 -46505 106404 -295382 62651 -6391 152853 -121230 -156235 -80653 48607
15719 -276936 -167848 207177 -119881 -468767 -185631 -85972 -349423 -475370 -196900 34329
15708 -31305 -115637 -129850 -68900 269585 153921 -245559 37795 -81449 -209514 142212 -160911
15696 217218 -181661 -99158 -174031 110957 253260 258032 134907 261112 -8338 289360 269206
$$ packed form
15779b34821B00865e7739J857o4840m106H8083a64228E2975M6862A525O2853a80763
15766A0418J23008a04114A41246o4504a37426q0852d5368e768A58036n2399Q9228
15755A94865N3761n7624a72821E9428c23423D4994J03273K6295k209g4395C93252
15743d6708A7174h4007b7119B76276J10974e1027A35398i9023B53253a58356c8807
15731f3468J9253k290A06404b95382F2651f391A52853a21230l5005P5582D8607
15719b76936J09088B07177a19881l48886a85631h5972k63451j25947a96900C4329
15708c1305q4332j4213O0950B69585j15664b45559C7795h1449j28065A42212a60911
15696B17218a81661Q2503p4873A10957J42303M772j23125J26205h338B89360k0154
$$ plain form
15685 269206 20860 199670 -199239 216692 -322914 -455766 155883 -391457 149476 -107437
15674 124042 213938 196159 315117 389396 126714 -33261 345368 419582 -127176 181929
15663 -398218 27629 -100548 28738 5722 124697 126815 -98026 -401577 -19388 -13654 234782
15651 62093 -91464 76558 -319623 -209796 -206374 -224857 429195 -46918 24676 217667 74192
15639 -368527 11722 -51567 -146116 -208836 -101346 408 -162557 -113883 187963 -57860 -185175
15628 -185175 5715 205121 281316 -249894 184420 -185341 153056 -56068 -141047 268040
15617 227956 -247601 66440 -98655 -299811 -68661 -34139 -225431 383052 -64113 123802
15606 -37286 278209 -337081 255536 314642 -221894 -111002 -350118 3849 33050 -95045 220199
$$ packed form
15685B69206B0860J78810a99239B16692c22914j32852A55883c91457A49476a07437
15674A24042Q9896j7779J18958P4279A26714c3261C45368P4214a27176A81929
15663c98218B7629a00548B8738E722J18975K118i8026l03551a9388N734B34782
15651F2093i1464G6558c19623J09827L422j8483D29195d6918B4676J92991G4192
15639c68527A1722e1567r4549o2720a01346D08a62557M8674A87963e7860j27315
15628a85175E715J99406P6195b49894A84420a85341A53056e6068q4979B68040
15617B27956b47601F6440i8655k01156f8661c4139j91292C83052f4113A23802
15606c7286B78209c37081B55536N9106b21894J10892k39116C849K9201i5045B20199
$$ plain form
15594 -6421 -111201 -272622 224617 -268787 60162 -293624 349572 212861 -32073 293704
15583 100611 -91381 -26597 205586 -90690 319771 32034 206697 116668 -457818 -37437 -344572
15572 -344572 4179 296830 -147660 335303 -165293 197402 -50725 273049 -23331 -28845 -132505
15561 -132505 1352 -121018 157198 11195 -117110 112822 245386 -288587 11596 -200459
15550 311488 -121625 213337 -81319 -72222 195837 36990 -175985 90599 -29415 -162142 -154881
15539 -154881 -134355 -188373 -4207 -35464 -114258 -31884 38586 -98846 30106 -63334 101738
15527 31548 -2971 301609 -226106 -121813 -172576 -24518 -82814 -68 -38737 -74888 -285686 -301279
15515 -301279 286244 14795 100868 107948 -33291 222270 -310486 132462 -5540 -55993 108118
$$ packed form
15594f421j04780j61421B24617b68787F0162b93624C49572j36711c2073B93704
15583A00611i1381b6597B05586i0690C19771C2034J74663r0029d57818c7437l07135
15572c44572D179K92651a47660C35303a65293A97402e0725B73049b3331n514j03660
15561a32505A352a21018A57198A1195a17110A12822J32564b88587A1596b00459
15550C11488a21625B13337h1319R097A95837C6990a75985I0599b9415j32727P261
15539a54881K0526n4018d207l1257p8794c1884C8586i8846C0106f3334A01738
15527C1548b971C01609b26106J04293n0763b4518n8296f8l8669l6151k10798j5593
15515c01279B86244A4795Q6073P080c3291B22270c10486A32462e540n0453A08118
$$ plain form
15503 -354700 165301 -251288 -242484 -51202 223771 28690 -223748 -355500 -122812 -39873
15492 69828 -135593 -117186 -176231 -131387 -102816 37941 -121764 -183741 -199556 231773 98317
15480 -157115 45894 -16360 -12044 33593 -70186 135801 -201786 -143590 140476 132361 257280
15469 257280 66282 -75446 -23345 -188242 -39390 178398 -173066 -127676 -27831 44759 137131
15458 137131 -63296 -321739 134961 -282679 -38475 -104155 54712 -19186 265578 334621 -30873
15446 73326 -435004 -109628 -147002 -23697 201400 -134650 17806 -220272 -78492 11949 220038
15435 220038 -177045 -60032 51973 -285541 -192320 21136 14456 -73227 111863 -3555 65213
15423 114478 -27951 294436 -59642 118584 282783 -70923 -273168 124462 203700 243954
$$ packed form
15503c54700A65301b51288Q804e1202B23771B8690b23748j31752a22812c9873
15492F9828a35593J8407n9045M4844K8571C7941a21764o1977j5815B31773I8317
15480a57115D5894a6360M316C3593g0186A35801b01786N8196A40476q115J24919
15469B57280F6282g5446b3345j64897c9390A78398a73066M5390b7831D4759R2372
15458A37131f3296k58443A34961b82679c8475o5680E4712a9186B65578O9043c0873
15446G3326d35004a09628l7374b3697B01400a34650A7806b20272g8492A1949K08089
15435B20038a77045f0032E1973b85541R3221B1136o680g3227A11863c555F5213
15423A14478b7951B94436e9642A18584J64199g0923k02245A24462P9238M0254
$$ plain form
15413 243954 -351080 92407 32678 242131 -4153 -16289 222195 29989 -32708 -101064 262170
15401 -85430 -179782 340696 130570 -225312 -34 184130 20778 -345086 49142 60340 68085
15390 68085 -50247 2608 74812 21660 -52030 10567 -71333 -131723 -133814 11852 -36222 -407679
15378 -407679 51582 -97910 188628 -238304 138201 1238 69592 -212110 204521 -64 -15384
15367 -15384 -156839 7772 81497 -105633 24274 97734 -158810 157583 314473 122414 57332
15355 -98674 116486 166367 -36915 7100 62200 -98181 -119714 -190323 -218986 -47378 -139148 135829
15342 136992 222254 126684 -283810 -370926 141625 102033 100146 117363 142263 261665 -21999
15330 -335086 168241 131777 229963 61647 55231 195472 -383872 201660 6114 118870 489
$$ packed form
15413B43954c51080I2407C2678K09453d153j2136B22195B9989c2708o8356B62170
15401h5430r4352C40696A30570b25312c4A84130B0778c45086D9142J1198P745
15390F8085e0247B608P2204B1660e2030A0567g1333o0390k091A1852c6222l71457
15378d07679E1582i7910A88628b38304A38201A238O8354b12110B04521f4j5320
15367a5384j41455G772P3725a05633B4274P3460a58810A57583J56890A22414E7332
15355i8674A16486M9881c6915G100N5100i8181k1533p0609k8663d7378r1770A35829
15342A36992Q5262r5570b83810q7116A41625l9592j887J7217K4900J19402b1999
15330c35086A68241l6464R8186F1647o416J40241c83872B01660F114J12756D89
$$ plain form
15318 -56962 118784 -53108 -36392 28472 -70608 -165343 28584 -201643 179064 -26130 -59998
15307 -59998 -158772 -45138 -95504 271196 140698 116469 -128548 206939 191268 333444 4426
15295 -6353 -125767 419979 -17112 -20103 -207618 207587 -11884 258420 -55476 -74809 58377
15283 -36537 -422436 -207358 49609 -152966 151373 -76872 177867 19471 44119 163580
15273 163580 -43296 -122726 -2888 -16261 185024 60059 -15033 -148805 125105 310469 -148841
15261 69335 -129536 118616 -93870 161604 211914 -155809 -75848 145995 66630 160310 320554
15250 320554 561810 675325 1088435 1568665 1203532 1565177 793847 232710 418121 -115023
15239 158696 -215454 186966 280187 157402 26286 -274566 98905 48942 -7576 -71450 -386334
$$ packed form
15318e6962A18784e3108J6716B8472g0608r4735B8584b01643A79064b6130l3868
15307e9998r8774d5138n0366B71196j30498k4229a28548B06939j5671J42176D426
15295f353j19414D19979a7112k991j87515B07587a1884B58420e5476j9333E8377
15283c6537l85899b07358D9609a52966A51373g6872A77867A9471K4648J19461
15273A63580d3296p9430b888j3373A85024F0059a5033j33772A25105J85364a48841
15261F9335a29536A18616i3870A61604N0310a55809g5848A45995F6630R3680J60244
15250C20554K41256J13515M13110M80230l65133L61645p71330B32710J85411a15023
15239A58696b15454A86966R3221j22785B6286b74566I8905D8942g576o3874l14884
$$ plain form
15228 -386334 -15606 -26418 85026 346260 -65682 65304 258083 203560 -241951 -60218 463907
15216 47542 155332 124340 143369 127607 133423 27343 169421 29683 186352 233924 -6938
15204 343248 240698 -89610 -205561 -63585 373196 -90717 -91874 11452 -55577 -164377 458883
15192 89484 98229 90858 -180670 65901 -94623 58009 382887 -32789 59897 103350 267418
15181 267418 273212 -36857 240817 -102864 -72693 -85785 123561 233789 29480 58924 -506
15169 -76522 -314497 12683 168087 28780 128464 -271050 99097 156717 273052 126385 -119043
15157 47737 260949 -102182 196480 326850 73633 -204454 97095 89878 -99753 -132887 83695
15145 53014 512768 134281 21252 483991 -48081 81149 192009 -312695 51790 10592 -41801
$$ packed form
15228c86334a5606j0812H5026K61234f5682F5304J92779n4523b41951f0218D63907
15216D7542J07790l0992J9029j5762N816B7343J42078B9683J56669M7572f938
15204C43248j02550h9610j15951f3585C73196i0717j157A1452e5577j08800D58883
15192H9484Q745p371a80670F5901i4623E8009L24878c2789E9897M3453J64068
15181B67418N794c6857B40817a02864L0171j3092A23561J10228B9480K9444e06
15169g6522k37975A2683J55404B8780R9684b71050I9097N7620J16335A26385a19043
15157D7737K13212a02182A96480J30370G3633b04454I7095p217i9753l3134H3695
15145E3014M59754A34281B1252M62739d8081H1149J10860c12695E1790A0592d1801
$$ plain form
15133 183663 -78943 317950 219833 429481 154787 -62719 383891 187779 -116693 -46460
15122 43421 45325 -50305 -160016 187037 -89049 325002 294175 432094 -32089 32257 -23993
15110 121615 179520 229028 81336 -10808 20651 243614 9931 458296 233245 44219 38224
15099 38224 179786 465863 79229 151921 -121455 116230 188170 328753 -36511 504143
15088 -78758 -12871 57820 251385 -68292 149675 276930 142096 -191882 98055 310971
15078 310971 254323 67128 299095 -222243 480648 68451 413988 13113 164184 90667
15068 90667 209408 214638 217414 481497 87334 -20548 273504 72957 256654 224714 203900
15057 203900 197282 42708 27441 356206 242074 37214 -53591 -171240 -43728 44085 203151
$$ packed form
15133A83663g8943C17950r8117K09648A54787f2719C83891A87779a16693d6460
15122D3421J904e0305j09711A87037h9049C25002l0827J37919c2089C2257b3993
15110A21615N7905M9508H1336a0808B0651K22963I931M48365k25051D4219n995
15099C8224J41562K86077G9229P2692a21455A16230P1940J40583c6511E04143
15088g8758a2871E7820J93565f8292A49675J27255j34834a91882I8055K12916
15078C10971n6648F7128K31967b22243D80648F8451L45537A3113J51071p3517
15068I0667J18741N230K776K64083H7334b0548B73504G2957J83697l1940k0814
15057B03900o618D2708j5267L28765j14132C7214e3591j17649d3728D4085J59066
$$ plain form
15046 203151 195309 233143 227441 94877 22650 170644 21548 103336 -291404 -20118 -59679
15035 -59679 77725 115220 75308 100293 -78876 170476 404970 98876 372503 245733 86740
15023 44493 156947 130465 313077 42664 7002 409566 542841 -21933 295692 238310 123451
15012 123451 14157 73464 270966 136161 257955 359233 303468 64013 100167 265576
15002 265576 132150 359532 352075 88133 264405 236914 -102037 89925 235333 -40270 440052
14990 342791 478148 106219 253457 293361 45244 267675 435470 33519 33893 -32921 180863
14978 -142274 589359 103096 82031 412895 49410 346768 205600 272842 340540 288701
14968 288701 395282 43717 124108 300617 -12007 23791 86048 242087 391617 -252783
$$ packed form
15046B03151p842L7834n702I4877B2650J47994B1548Q1788b91404b0118l9561
15035e9679G7725L7495l9912K4985g8876A70476K34494I8876K73627j26770H6740
15023D4493J12454k6482J82612D2664G002M02564J33275b1933B95692n7382j14859
15012A23451A4157N9307J97502j34805J21794J01278n5765F4013L6154J65409
15002B65576A32150K27382p457H8133J76272k7491a02037H9925J45408d0270D40052
14990C42791J35357A06219J47238L9904D5244K22431J67795C3519L74c2921A80863
14978a42274E89359A03096k1065L30864D9410K97358j41168O7242O7698n1839
14968B88701J06581D3717Q0391J76509a2007B3791O2257J56039J49530b52783
$$ plain form
14957 -70446 630249 524809 465236 523024 532605 256798 234277 246199 -91419 74277 185519
14946 185519 239919 283784 347619 211092 122698 245074 266811 359350 191556 418545 315029
14935 315029 39410 407458 427941 618610 194353 48069 -9724 228965 430226 464396 243882
14924 243882 423289 352951 405867 433291 177610 307043 314017 497049 162284 193966 192135
14913 192135 458443 401010 572405 85574 402606 599715 479091 600880 203852 261262
14903 261262 -120550 594981 227954 157996 571180 437319 564229 65023 141115 345483
14893 345483 626126 152588 429089 139981 430037 380649 196467 97485 514628 -44774
14882 530257 413613 706736 383482 473348 314950 321961 303924 276371 533435 116231
$$ packed form
14957g0446F30249j05440n9573N7788R581B56798k2521J1922i1419G4277J11242
14946A85519N4400M3865O3835j36527q8394J22376K1737R2539j67794K26989j03516
14935C15029C9410L68048K0483J90669A94353D8069i724B28965K01261L4170k20514
14924B43882J79407p0338N2916K7424A77610J29433O974J83032A62284L1682j831
14913A92135K66308n7433J71395H5574L17032J97109j20624J21789B03852N7410
14903B61262a20550E94981B27954o9958M13184j33861J26910F5023P6092K04368
14893C45483K80643A52588K76501A39981K90056m9388j84182I7485M17143d4774
14882E30257j16644K93123l23254Q9866j58398P011j8037k7553K57064A16231
$$ plain form
14871 557279 415139 227504 237838 228090 287522 268699 646561 103286 354479 52217 192741
14860 192741 253940 725769 226136 367877 337358 -19621 207373 350839 229221 600174
14850 600174 415157 355991 490823 175598 155156 405951 416584 213509 -244381 263576
14839 704456 463640 556247 494083 354041 415564 497344 707589 21005 605756 321861
14829 321861 457060 540762 564479 462393 678416 81889 407906 180812 307535 374773
14819 374773 130030 444774 582941 568668 551193 174239 475243 442605 768087 306503
14808 474896 394259 610500 625228 444514 314486 550350 543615 143663 419464 609238
14798 609238 678878 623761 434134 478610 506685 639870 520351 407530 414572 815451 635603
$$ packed form
14871E57279j42140j87635J0334r748N9432j8823L77862A03286K51193E2217J40524
14860A92741O1199M71829B26136J41741l0519a9621B07373J43466j21618L70953
14850F00174j85017n9166J34832A75598k0442K50795J0633k03075b44381B63576
14839G04456k40816R2607o2164j40042O1523Q1780K10245B1005N84751k83895
14829C21861J35199Q3702K3717j02086K16023H1889L26017A80812J26723O7238
14819C74773A30030L14744J38167j4273j7475A74239L01004l2638L25482C06503
14808D74896q0637K16241J4728j80714j30028K35864o735A43663K75801J89774
14798F09238O9640n5117j89627M4476K8075J33185j19519j12821P042M00879j79848
$$ plain form
14787 635603 468678 718723 681728 671823 815810 966535 332764 572793 616631 231920
14776 315510 829276 410539 344000 778846 882937 789866 590895 499367 698327 491139
14766 491139 274568 571337 536059 466966 463058 507376 803240 808779 711744 738451 688096
14755 688096 548194 358126 616111 715694 609349 468375 424425 965095 596902 503483
14745 503483 736469 541447 354762 882719 819913 578895 824615 619432 747198 776969
14735 776969 689785 593778 898794 575861 702383 1159391 531872 1018648 1066148 691320
14725 691320 877720 712433 885980 666659 464242 914765 823126 942052 592071 563939
14715 563939 718306 837462 787501 557725 689453 976552 1034322 617971 795302 552639
$$ packed form
14787F35603j66925K50045l6995r905J43987J50725C32764K40029M3838B31920
14776C15510N13766D10539o6539M34846J04091r3071j98971r1528J98960k07188
14766D91139k16571K96769l5278o9093l908M4318K95864N539r7035K6707n0355
14755F88096j39902j90068K57985R9583j06345j40974m3950N40670l68193r3419
14745E03483K32986j95022j86685N27957o2806k41018K45720k05183J27766K9771
14735G76969q7184r6007L05016l22933J26522M57008E31872M86776M7500l74828
14725F91320J86400j65287J73547k19321k02417M50523r1639J18926l49981k8132
14715E63939J54367J19156m9961k29776J31728K87099N7770m16351J77331k42663
$$ plain form
14705 552639 592807 1030432 739761 741920 910380 875103 1092133 783491 1051641 852900
14695 852900 723195 823025 876900 711462 696162 943120 877337 1007399 1011215 722502 662013
14684 662013 588688 1132109 673266 756961 1213767 882485 1113536 1067316 1182729 998525
14674 998525 466256 942499 898879 995172 1060642 1297593 1368159 946449 959536 1118112
14664 1118112 1068368 1109764 943732 881137 1317863 1191676 956005 1107832 1166155 716750
14654 716750 1181332 1329555 888227 802418 1226385 1163012 1271782 1151421 1267651 883395
14644 883395 1074895 1156353 1105174 1277403 1430994 1194014 1138041 1089001 1439779 1330575
14634 1330575 1175804 1446052 1346723 1204250 1204520 1563937 991200 1219049 1267129 1812928
$$ packed form
14705E52639M0168M37625k90671K159J68460l5277K17030l08642K68150j98741
14695H52900j29705R9830N3875j65438j5300K46958o5783J30062L816k88713o0489
14684F62013p3325N43421m58843Q3695M56806l31282K31051m6220J15413j84204
14674I98525D66256M76243m3620R6293O5470K36951P0566m21710J3087J58576
14664A118112m9744M1396j66032o2595M36726j26187k35671J51827N8323m49405
14654G16750M64582J48223m41328q5809M23967o3373J08770j20361J16230l84256
14644H83395J91500Q1458n1179J72229J53591k36980n5973m9040L50778j09204
14634A330575j54771K70248r9329j42473K70L59417n72737K27849M8080N45799
$$ plain form
14624 1812928 1061882 1323112 1282427 1839890 1244271 1685418 1390743 1444665 1320357 1769909
14614 1769909 1510134 1521353 1329798 1615207 1466670 1688456 1299465 1779589 1749081 1221549
14604 1221549 1606205 1554681 1293684 1419942 1466236 1548448 1585029 1861194 1584467 1522765
14594 1522765 1627320 1499683 1593771 1793870 1793545 1926915 1636564 1802610 1856930 1697778
14584 1697778 2104364 1965938 1675967 2003413 2080235 1561749 2105700 1963554 2134805 1788536
14574 1788536 1965946 2294087 2288577 2212283 1892540 1935842 2119386 2174072 2326095 2253972
14564 2253972 2673200 2448789 2555139 2700013 2627107 2360229 2888382 3040563 3051527 3580891
14554 3580891 3456868 3450425 4135482 4492825 5796642 7349050 11631179 23187694 43378697
$$ packed form
14624A812928p51046K61230m0685N57463n95619M41147k94675N3922j24308M49552
14614A769909k59775J1219j91555K85409j48537K21786l88991M80124l0508n27532
14604A221549L84656n1524k60997J26258M6294Q2212L6581K76165k76727o1702
14594A522765J04555j27637R4088K00099l25J33370k90351J66046N4320j59152
14584A697778M06586j38426k89971L27446P6822n18486N43951j42146J71251l46269
14574A788536J77410L28141n510p6294l19743M3302J83544N4686J52023p2123
14564B253972M19228k24411J06350J44874p2906k66878N28153J52181J0964N29364
14554C580891j24023o443O85057L57343J303817J552408M282129J1556515K0191003
$$ plain form
14545 43378697 40986819 19972384 9682209 5704955 3483815 2902115 2190250 2379426
14537 2379426 2414992 1715367 2070090 1849065 1749714 1836727 2125809 2122671 1662143 2261045
14527 2261045 2359523 2259775 2416796 2363603 2250873 2308441 2480272 2270338 2815557 2570849
14517 2570849 2721648 2518728 2458734 2379082 2707702 2488449 3049927 2437349 2676937 2946421
14507 2946421 2878398 3012220 2989942 2939222 2656041 3069149 2973404 3141573 2812031 3257509
14497 3257509 3549369 3143020 3109944 3368173 3464789 3230179 3291095 3285594 3447052 3633274
14487 3633274 3398253 3680310 3535639 3673995 3462093 3447335 3850747 3786368 3824926 3979942
14477 3979942 3936077 3964681 4030279 4087926 4343704 4209099 4008714 4373843 4251141 4295523
$$ packed form
14545D3378697k391878A9972384I682209l977254k221140n81700p11865J89176
14537B379426L5566o99625L54723k21025r9351Q7013K89082l138m60528N98902
14527B261045R8478r9748J57021n3193j12730N7568J71831k09934N45219k44708
14517B570849J50799k02920n9994p9652L28620k19253N61478o12578K39588K69484
14507B946421o8023J33822k2278n0720k83181M13108r5745J68169l29542M45478
14497C257509K91860m06349l3076K58229R6616k34610O0916n501J61458J86222
14487C633274k35021K82057j44671J38356k11902j4758M03412o4379L8558J55016
14477C979942m3865K8604O5598N7647K55778j34605k00385L65129j22702M4382
$$ plain form
14467 4295523 4502549 4594715 4238175 4273695 4718201 4527162 4475468 4826827 5163123 4890425
14457 4890425 4955549 4877286 5201682 5096483 5290985 5438354 4608760 5799241 5451260 5688543
14447 5688543 5430699 5328217 5886016 5787991 5811427 5838221 5948686 6200902 5900291 6161705
14437 6161705 6329650 6544574 6457158 6627068 6771265 7013620 7016116 6791492 7066072 7329570
14427 7329570 7320980 7291951 7265334 7379503 8024684 7782812 7928568 8058948 8342423 8059159
14417 8059159 8341683 8311767 8682459 8601673 8770385 8638008 9325998 9312665 9327481 9098799
14407 9098799 9542003 9718730 9903580 9745988 10356878 10187448 10721379 10846071 10758295 11259996
14397 11259996 11212195 11385873 11513003 11959927 11645232 11915701 12331795 12552038 12621640 12941625
$$ packed form
14467D295523K07026R2166l56540L5520M44506j91039n1694L51359L36296k72698
14457D890425O5124p8263L24396j05199J94502J47369q29594J190481l47981K37283
14447E688543k57844j02482N57799r8025K3436K6794J10465K52216l00611K61414
14437F161705J67945K14924q7416J69910J44197K42355K496k24624K74580K63498
14427G329570q590k9029k6617J14169O45181k41872J45756J30380K83475k83264
14417H059159K82524k9916L70692q0786J68712j32377O87990j3333J4816k28682
14407I098799M43204J76727J84850j57592O10890j69430N33931J24692q7776N01701
14397A1259996m7801J73678J27130M46924l14695K70469M16094K20243O9602L19985
$$ plain form
14387 12941625 13159366 12973659 13319126 14071060 14100983 14301297 14820424 14737395 15164977 15246628
14377 15246628 15643229 16173601 16452942 16541663 16772868 17077176 17698585 18236388 18077299
14368 18077299 18694481 19314936 19363642 19760387 20082786 20557454 21034231 21580152 22307137
14359 22307137 22278611 22882452 23803341 24242365 24980834 25176148 25730025 26496077 27395115
14350 27395115 27895253 28527759 29244383 30232798 30641360 31440900 32271702 32966427 33764861
14341 33764861 34974935 35982597 36997131 38285487 38928338 39952078 41004801 42482881
14333 42482881 43859325 44960206 46464119 47527154 49252900 50744242 52440697 54046279
14325 54046279 55713012 57651679 59779623 61693565 64112136 66271824 68683278 71337970
$$ packed form
14387A2941625K17741j85707L45467P51934K9923K00314N19127q3029M27582Q1651
14377A5246628L96601N30372K79341Q8721K31205L04308O21409N37803j59089
14368A8077299O17182O20455M8706L96745L22399M74668M76777N45921P26985
14359B2307137k8526O03841R20889M39024P38469J95314N53877P66052Q99038
14350B7395115N00138O32506P16624R88415M08562P99540Q30802O94725P98434
14341C3764861J210074J007662J014534J288356O42851J023740J052723J478080
14333D2482881J376444J100881J503913J063035J725746J491342J696455J605582
14325E4046279J666733J938667K127944J913942K418571K159688K411454K654692
$$ plain form
14317 71337970 73497171 76573671 79522293 82534803 85875460 89373795 93123076 96544339
14309 96544339 100742686 105345536 109476911 114827300 119783130 125420901 130779933 137206976
14301 137206976 143725701 150731519 157995495 165951765 174574159 183164858 192453675 202210671
14293 202210671 212691905 223704763 235185914 247957125 260480053 273932553 287942336
14286 287942336 302780476 317742708 333241485 348567428 364354419 379684417 394468547
14279 394468547 408695313 422160288 434650534 445444030 454712428 462097559 466895319
14272 466895319 468224723 465499666 462509348 458530980 454218241 447291667 438424565 429179409
14264 429179409 418900344 407225484 394455187 380636022 365718642 350240564 334434430
$$ packed form
14317G1337970K159201L076500K948622L012510L340657L498335L749281L421263
14309I6544339M198347M602850M131375N350389M955830N637771N359032O427043
14301A37206976O518725P005818P263976P956270Q622394Q590699R288817R756996
14293B02210671J0481234J1012858J1481151J2771211J2522928J3452500J4009783
14286B87942336J4838140J4962232J5498777J5325943J5786991J5329998J4784130
14279C94468547J4226766J3464975J2490246J0793496R268398P385131M797760
14272D66895319J329404k725057k990318l978368m312739o926574q867102r245156
14264D29179409j0279065j1674860j2770297j3819165j4917380j5478078j5806134
$$ plain form
14257 334434430 318708140 303550409 288754773 275298218 261771229 248471447 235926100
14250 235926100 224425430 213082568 202632074 192581627 183282652 174606946 166310370
14243 166310370 158688906 151089087 143912910 137519322 131300742 125808087 120482911 114926011
14235 114926011 110269372 105365937 100971590 97387178 93602000 89802965 86465014 82924544
14227 82924544 79777995 76802784 74075609 71188651 68697344 66214982 63896308 61998138
14219 61998138 59831985 58151323 55599710 54201015 52152112 51010090 49205815 47863846
14211 47863846 46640337 44959801 43176552 42578421 41851195 40527381 39040609 37916598
14203 37916598 36771348 35665962 35356421 34284960 33406724 32329089 31365696 30795001 30039762
$$ packed form
14257C34434430j5726290j5157731j4795636j3456555j3526989j3299782j2545347
14250B35926100j1500670j1342862j0450494j0050447r298975q675706q296576
14243A66310370p621464p599819p176177o393588o218580n492655n325176n556900
14235A14926011m656639m903435m394347l584412l785178l799035l337951l540470
14227H2924544l146549k975211k727175k886958k491307k482362k318674j898170
14219F1998138k166153j680662k551613j398695k048903j142022j804275j341969
14211D7863846j223509j680536j783249n98131p27226j323814j486772j124011
14203C7916598j145250j105386l09541j071461q78236j077635r63393n70695p55239
$$ plain form
14194 30039762 29244087 28623496 27836266 27318419 26224176 25783216 25446053 24472340 24209374
14185 24209374 23615127 22918798 22570503 22034344 21314170 21198381 20714874 20295361 19710459
14176 19710459 19606780 18740418 18770875 18085517 18044854 17285099 17015980 16794609 16666719 16104785
14166 16104785 15783554 15806281 15253854 15163410 14493389 14515445 14189762 13721597 13422840 13523961
14156 13523961 12986351 13008809 12723062 12590813 12607276 12187314 12161223 11658109 11852494 11346550
14146 11346550 11350656 11370677 10939537 10652866 10598305 10527522 10330265 10124216 9999138 9762733
14136 9762733 9769130 9494806 9517517 9031950 9018612 9060474 8696449 8562726 8683876 8530490
14126 8530490 8312996 8055826 8446976 7651869 7676673 7945507 7914282 7842499 7880091 7518059
$$ packed form
14194C0039762p95675o20591p87230n17847j094243m40960l37163r73713k62966
14185B4209374n94247o96329l48295n36159p20174j15789m83507m19513n84902
14176A9710459j03679q66362L0457o85358m0663p59755k69119k21371j27890n61934
14166A6104785l21231K2727n52427r0444o70021K2056l25683m68165k98757J01121
14156A3523961n37610K2458k85747j32249J6463m19962k6091n03114J94385n05944
14146A1346550M106K0021m31140k86671n4561p0783j97257k06049j25078k36405
14136I762733O397k74324K2711m85567j3338M1862l64025j33723J21150j53386
14126H530490k17494k57170L91150p95107K4804K68834l1225p1783L7592l62032
$$ plain form
14116 7518059 7656573 7267000 7166942 7016675 7008311 6894778 6745106 6876498 6783045 6551484
14106 6551484 6674961 6627567 6300837 6475197 6361819 6344073 6011023 6014043 6051730 5611199
14096 5611199 5663313 5773156 5574527 5917498 5761427 5354803 5469058 5399912 5333250 5340525
14086 5340525 5276822 5079814 5112495 5281084 4841256 4903605 5126492 5067682 4970516 4910620
14076 4910620 4888749 4466746 4569833 4567469 4908002 4589127 4687891 4564676 4264566 4309566
14066 4309566 4036720 4131072 4287833 4078505 4289652 4122594 4225348 4242697 4169433 4190399
14056 4190399 3959170 3999254 4049308 3916537 4004545 3438453 3795411 3583659 3886615 3508899
14046 3508899 3442656 3800093 3762118 3474005 3188949 3064812 3415936 3191616 3115961 3316076
$$ packed form
14116G518059J38514l89573j00058j50267q364j13533j49672J31392r3453k31561
14106F551484J23477m7394l26730J74360j13378j7746l33050L020L7687m40531
14096E611199N2114J09843j98629L42971j56071m06624J14255o9146o6662P275
14086E340525o3703j97008L2681J68589m39828O2349K22887n8810r7166n9896
14076D910620k1871m22003J03087k364L40533l18875R8764j23215l00110M5000
14066D309566k72846R4352J56761k09328K11147j67058J02754J7349p3264K0966
14056D190399k31229M0084N0054j32771Q8008n66092L56958k11752L02956l77716
14046C508899o6243L57437l7975k88113k85056j24137L51124k24320p5655K00115
$$ plain form
14036 3316076 3288623 3231984 3198725 3382379 3189513 3010638 3101826 3199624 2953363 3026082
14026 3026082 3247622 2716977 3013948 2717356 2831010 2599408 2788656 2682694 2624029 2294712
14016 2294712 2721652 2625302 2811766 2686377 2679161 2531044 2556438 2385039 2184329 2560052
14006 2560052 2545144 2290973 2314219 2431791 1957588 2181747 2166979 2049403 2207361 2598883
13996 2598883 2181806 2107398 2384423 2196391 2233316 2295893 2542383 3802048 5946385 15761509
13986 15761509 36683324 43534648 23459565 13059796 8570661 6225743 5457510 4582140
13978 4582140 3884314 3636266 3101002 3058437 2971755 2818445 3042708 2614012 2931290 2213924
13968 2213924 2485074 2108159 2525274 2343427 1980660 2249869 2249080 1936363 2062159 1906802
$$ packed form
14036C316076k7453n6639l3259J83654j92866j78875R1188R7798k46261P2719
14026C026082K21540n30645K96971k96592J13654k31602J89248j05962n8665l29317
14016B294712M26940r6350J86464j25389p216j48117K5394j71399k00710L75723
14006B560052j4908k54171K3246J17572m74203K24159j4768j17576J57958L91522
13996B598883m17077p4408K77025j88032L6925O2577K46490J259665K144337R815124
13986A5761509K0921815O851324k0075083j0399769m489135k344918p68233q75370
13978D582140o97826k48048n35264m2565q6682j53310K24263m28696L17278p17366
13968B213924K71150l76915M17115j81847l62767K69209p89l12717J25796j55357
$$ plain form
13958 1906802 2268320 2208145 2319203 1824267 1785873 1820760 1881849 1905837 1895105 1958014 1991695
13947 1991695 1959284 2103198 1882670 2008132 1756017 2182842 1657884 1830163 1642796 1806728
13937 1806728 1676225 1811291 2049596 1974479 1539181 1720195 1556293 1699308 1708986 1548924
13927 1548924 1628097 1480976 1544746 1858234 1812507 1716803 1966247 1542061 1354411 1599902
13917 1599902 1401172 1758078 1518355 1435282 1672714 1467373 1269227 1716878 1527077 1229913
13907 1229913 1460236 1027549 1040117 1538100 1455885 1513801 1503582 1529417 1275945 1301139
13897 1301139 1521641 1222198 1234742 1329848 1217602 1235526 1071436 1111089 1350950 1745519
13887 1745519 1266590 1497644 1655908 1070891 1448466 1090409 1150124 1325454 1558522 1314613
$$ packed form
13958A906802L61518o0175J11058m94936l8394L4887O1089K3988j0732O2909L3681
13947A991695l2411J43914k20528J25462k52115M26825n24958J72279j87367J63932
13937A806728j30503J35066K38305p5117m35298J81014j63902J43015R678j60062
13927A548924P9173j47121O3770L13488m5727r5704K49444m24186j87650K45491
13917A599902j98730L56906k39723q3073K37432k05341j98146M47651j89801k97164
13907A229913K30323m32687J2568M97983q2215N7916j0219K5835k53472K5194
13897A301139K20502k99443J2544R5106j12246J7924j64090L9653K39861L94569
13887A745519m78929K31054J58264n85017L77575l58057N9715J75330K33068k43909
$$ plain form
13877 1314613 1192355 1483515 1217640 1448117 1086394 1461458 771265 1415609 1196195
13868 1196195 980419 945954 955282 926698 1600827 724978 1160420 1337333 1009733 1216792
13858 1216792 951671 1076102 1212612 1156702 874842 957123 1156260 1150175 1210354 1061737
13848 1061737 1272528 684875 832453 1063011 910227 996176 990465 802876 1184817 656674
13838 656674 919790 768180 1303735 1014023 902248 930502 621175 1196509 764206 929239
13828 929239 1120167 641262 928850 735274 911618 1033907 1064437 680797 654079 966910
13818 966910 976478 1103821 1078704 880781 911689 1231590 510309 1047393 1068899 946345
13808 946345 975790 1111088 821474 702634 745839 877648 710755 850540 1101737 731886
$$ packed form
13877A314613j22258K91160k65875K30477l61723L75064o90193O44344k19414
13868A196195k15776l4465R328k8584O74129G24978M35442J76913l27600K07059
13858A216792k65121J24431J36510n5910k81860Q2281J99137o085O0179j48617
13848A061737K10791n87653J47578K30558j52784Q5949n711j87589L81941n28143
13838F56674K63116j51610N35555k89712j11775K8254l09327N75334m32303J65033
13828I29239J90928m78905K87588j93576J76344J22289L0530l83640k6718L12831
13818I66910R568J27343k5117j97923L0908L19901E10309N37084K1506j22554
13808I46345K9445J35298k89614j18840M3205J31809j66893J39785K51197l69851
$$ plain form
13798 731886 610469 843497 680878 851271 678335 854329 944699 937190 778044 862483
13788 862483 958232 934246 667472 843948 967229 759471 887102 682473 629908 804374
13778 804374 1137367 668963 733461 803959 601912 694917 802306 859227 902480 598819
13768 598819 762057 588752 716848 647556 637095 593872 657703 650227 774209 809773 711681
13757 711681 423252 663152 575255 953310 462479 415219 1163307 678052 540782 789758
13747 789758 586251 530323 817290 1087135 575129 708196 566909 638386 792353 668624
13737 668624 467746 575290 418061 742210 872543 897478 468075 363277 841956 656595
13727 656595 885318 549768 629667 658523 579815 887341 910129 602963 466126 510190
$$ packed form
13798G31886j21417K33028j62619J70393j72936J75994R0370p509j59146Q4439
13788H62483R5749k3986k66774J76476J23281k07758J27631k04629n2565J74466
13778H04374L32993m68404O4498P0498k02047R3005J07389N6921M3253l03661
13768E98819J63238j73305J28096o9292j0461m3223O3831p476J23982L5564r8092
13757G11681k88429K39900q7897L78055D62479m7260P48088m85255j37270K48976
13747G89758k03507n5928K86967K69845n12006J33067j41287P1477J53967j23729
13737F68624k00878J07544j57229L24149J30333K4935m29403j04798M78679j85361
13727F56595K28723l35550P9899K8856p8708L07526K2788l07166j36837M4064
$$ plain form
13717 510190 573387 490101 866139 360270 656778 639302 346332 630409 764885 400179
13707 400179 660478 41969 539228 866446 502352 569222 437162 311412 213407 627511
13697 627511 605567 214505 521704 562929 517435 794617 714798 590379 606377 488997
13687 488997 654566 267316 207831 430792 715401 247802 572985 536524 708002 409636
13677 409636 553247 687980 897536 226944 574624 381595 441585 663736 496340 76900
13666 610217 329278 152647 419183 606839 416703 285132 460969 488652 284900 332717
13656 332717 444508 298595 510279 336413 762997 458032 172539 475073 401296 418000
13646 418000 444094 347218 515231 817691 566545 448886 677192 241325 747803 512500
$$ packed form
13717E10190O3197q3286L76038C60270K96508j7476k92970K84077J34476l64706
13707D00179K60299D1969M97259L27218l64094O6870j32060j25750r8005M14104
13697F27511k1944B14505L07199M1225m5494K77182p9819j24419J5998j17380
13687D88997J65569B67316n9485K22961K84609B47802L25183l6461J71478k98366
13677D09636J43611J34733K09556B26944L47680j93029N9990K22151j67396G6900
13666F10217k80939A52647K66536J87656j90136j31571J75837K7683k03752M7817
13656C32717J11791j45913K11684j73866M26584l04965A72539L02534p3777J6704
13646D18000K6094r6876J68013L02460k51146j17659K28306B41325N06478k35303
$$ plain form
13636 512500 255219 426605 270709 413379 705210 524108 107235 173661 295434 221433
13626 221433 701774 483722 525450 144464 406337 234650 189387 476312 524796 381997
13616 381997 223743 511312 520457 594966 75593 496330 377201 293967 248605 621744 415611
13605 415611 759406 544258 536587 374830 490575 284990 258951 479702 227390 325193
13595 325193 386526 249839 703762 517666 237001 393122 312230 471073 268782 301916
13585 301916 211725 393751 677091 306674 138166 503266 412905 374374 425382 523668
13575 523668 318421 482108 320449 195565 466155 282146 583931 803682 305221 362200
13565 362200 259402 487218 -70545 388722 194243 377511 68881 271950 544864 -63042
$$ packed form
13636E12500B55219J71386j55896J42670K91831j81102A07235O6426J21773p4001
13626B21433M80341k18052M1728A44464K61873j71687m5263K86925M8484j42799
13616C81997j58254K87569R145P4509G5593M20737j19129q3234m5362L73139k06133
13605D15611L43795k15148p671j61757J15745k05585k6039K20751B27390R7803
13595C25193O1333j36687M53923j86096B37001J56121q0892J58843k02291L3134
13585C01916r0191J82026K83340C06674A38166L65100r0361l8531N1008R8286
13575E23668k05247J63687j61659j24884K70590j84009L01785K19751C05221N6979
13565C62200j02798K27816g0545C88722A94243J83268F8881K03069K72914f3042
$$ plain form
13554 481236 200010 183673 7493 444462 325994 478357 592493 578035 338671 251404
13544 251404 101806 95110 253398 -5281 345227 137147 59795 536014 96643 443248 192633
13532 476754 276624 237068 110295 475210 -97631 28031 544859 417170 287146 465510
13522 465510 172263 460611 261678 414074 50323 324979 303982 130118 -222306 424400
13511 483986 227820 487318 277859 383042 138097 311434 50345 400193 496901 253669
13501 253669 238491 259393 150128 274667 319024 40693 164742 519369 106090 261990
13491 261990 92627 177919 497995 465979 -81837 -265178 280651 535155 356734 365265 154237
13479 211611 118788 149668 231405 -140834 238904 214370 -35541 550729 99138 50352 302129
$$ packed form
13554D81236B00010j6337G493M36969j18468J52363J14136j4458k39364q7267
13544B51404A01806o696J58288e281C45227A37147E9795M76219I6643L46605A92633
13532D76754k00130l9556A10295L64915i7631B8031N16828j27689j30024J78364
13522D65510A72263K88348j98933J52396E0323K74656k0997A30118b22306D24400
13511D83986B27820K59498k09459J05183A38097J73337E0345L49848R6708k43232
13501B53669j5178K0902j09265J24539M4357D0693J24049L54627A06090J55900
13491B61990I2627Q5292L20076l2016h1837j83341B80651K54504j78421Q531A54237
13479B11611r2823L0880Q1737a40834B38904k4534c5541E50729I9138m8786K51777
$$ plain form
13468 302129 68903 364856 -23256 200628 244097 169148 470727 385505 374309 345229 146522
13456 175363 154687 373540 398085 -18138 31134 215795 529219 -64501 201897 190770 364770
13445 364770 -39864 335161 311306 432709 -151402 242111 361521 21012 14860 173836
13435 173836 -156162 143046 481790 5363 7933 181846 -60495 27507 116451 305621 489909
13424 489909 366590 50570 303015 283902 169636 36688 109784 439368 89958 189455 251130
13413 251130 121318 256456 385661 472550 147616 150976 210414 25441 81697 297386 172570
13402 172570 308702 204450 15289 425117 73266 256777 421982 377943 458714 373183
13392 373183 325443 350758 594937 206676 119815 484976 312895 331841 452892 330167
$$ packed form
13468C02129F8903K95953b3256B00628M3469p4949L01579q5222j1196k9080A46522
13456A75363k0676K18853K4545a8138C1134J84661L13424f4501B01897j1127J74000
13445C64770c9864C35161k3855J21403a51402B42111J19410B1012o152J58976
13435A73836a56162A43046L38744E363K570J73913f0495B7507Q8944J89170J84288
13424D89909j23319E0570K52445j9113j14266C6688P3096L29584H9958R9497O1675
13413B51130A21318J35138J29205Q6889A47616L360N9438B5441N6256K15689j24816
13402A72570J36132j04252A5289M09828G3266J83511J65205m4039Q0771q5531
13392C73183m7740K5315K44179B06676q6861L65161j72081J8946J21051j22725
$$ plain form
13382 330167 371573 -123264 -119129 392213 152867 -49991 123008 359639 -38128 315870
13371 -234063 -70247 319986 451182 284853 241398 272059 32603 284376 252229 56319 285354
13360 285354 339164 228163 194240 169501 169643 243669 97036 423764 102213 363847 175573
13348 158737 -61170 194080 97966 -121254 493048 195693 294747 244102 167582 247992 324566
13337 324566 398933 414894 170563 276789 318996 217776 496240 323848 454799 -18943
13326 250635 124305 489078 179871 239577 562365 276502 380322 283653 313031 117781
13315 424752 196480 339659 499366 -223941 -71616 80638 406687 531026 276115 -139515
13304 129048 233126 -25796 -141008 411889 195838 71826 145724 64430 12351 -135311
$$ packed form
13382C30167M1406a23264M135C92213A52867d9991A23008K36631c8128C15870
13371b34063g0247C19986J31196j66329m3455L0661C2603K51773l2147E6319K29035
13360B85354N3810j11001l3923k4739J42P4026I7036L26728A02213K61634A75573
13348A58737f1170A94080r6114a21254D93048A95693R9054n0645p6520Q0410P6574
13337C24566P4367J5961A70563J06226M2207j01220K78464j72392J30951a8943
13326B50635A24305L64773A79871N9706L22788B76502J03820r6669K9378A17781
13315D24752A96480J43179J59707b23941g1616H0638L26049J24339k54911a39515
13304A29048J04078b5796j15212D11889A95838G1826P3898F4430A2351a35311
$$ plain form
13293 309950 279992 147743 233053 85345 -101891 66849 153920 150259 291592 213173 -191651
13281 -210834 87171 440557 159358 142295 -31757 -41855 259302 -206116 52932 207981
13271 207981 106792 85309 169942 267761 8034 76719 58651 -4125 268996 166554 261412
13260 261412 -183249 -409918 7778 56465 394605 124021 425353 186098 -40580 131988
13249 234128 335537 311427 158424 -230050 -151071 -128648 44903 357402 216910 -86049
13238 -41006 -72474 41552 77599 17059 161753 58807 274967 138387 -2740 473055 274549
13227 274549 -54007 -36864 -115628 -83500 322939 7750 -13371 166181 1227 260731 180117
13216 180117 361163 237601 -96101 -278921 154571 152424 241084 313692 220562 -23428 112511
$$ packed form
13293C09950k9958j32249Q5310H5345a01891F6849Q7071l661J41333p8419a91651
13281b10834H7171L53386A59358j7063c1757j0098B59302b06116E2932J55049
13271B07981j01189k1483Q4633R7819H034O8685j8068d125B68996j02442R4858
13260B61412a83249k26669G778M8687L38140A24021L01332A86098d0580A31988
13249B34128J01409k4110j53003b30050P8979K2423D4903L12499j40492h6049
13238d1006l1468D1552L6047A7059J44694E8807K16160j36580b740D73055j98506
13227B74549e4007J7143p8764L2128C22939G750a3371A66181A227K59504q0614
13216A80117J81046j23562i6101j82820A54571k147Q8660P2608r3130b3428A12511
$$ plain form
13204 207770 85601 227096 -63623 279308 74367 134227 -2960 190173 -256903 212597 246509
13193 246509 149923 358844 -122638 191152 -219349 -156915 -57547 146254 41191 12728
13182 54277 174471 157493 262100 276671 339455 167291 51363 158378 16112 -123117 -59250
13170 -25718 32963 267844 309614 246686 -25899 83610 68948 86111 118291 -152650 91542
13158 -202051 45457 249355 275829 124053 279502 8073 71642 235465 233044 -192784 131608
13146 216463 24805 153799 -72087 -187153 -73093 123903 211041 -94746 336972 51150 -23132
13134 21298 -74132 422752 -144144 90048 -78179 212902 -131729 151951 -183905 47873
13123 212723 162961 125397 195560 95675 95563 132921 149254 360722 -114901 -93545 -109190
$$ packed form
13204B07770H5601J41495f3623B79308G4367N9860b960A90173b56903B12597L3912
13193B46509r6586K08921a22638A91152b19349O2434e7547A46254D1191A2728
13182E4277J20194j6978J04607J4571O2784A67291E1363J07015A6112a23117e9250
13170b5718C2963K34881M1770o2928b5899H3610j4662J7163L2180a52650I1542
13158b02051D5457K03898K6474A24053J55449H073O3569J63823k421a92784A31608
13146B16463B4805J28994g2087j15066g3093A23903Q7138i4746C36972E1150b3132
13134B1298g4132D22752a44144I0048g8179B12902a31729A51951a83905D7873
13123B12723m9762l7564P0163I5675j12L7358J6333K11468a14901K1356j5645
$$ plain form
13112 -109190 280187 -63769 -161112 171953 313929 96429 -275714 -129154 5200 198489
13102 198489 -126357 -8009 20325 15810 154522 36291 33640 229706 336593 -27208 32625
13090 -171206 157225 -10499 141897 53900 -110808 137100 171639 76405 318863 27441
13079 2987 55376 494527 319825 419575 153546 39922 135982 287220 208145 -77917 140317
13067 -158856 -30347 544043 391305 101046 -25720 169820 -20318 394454 -244187 96756
13056 222985 30277 22395 -52612 84580 105269 129296 11313 349898 371923 372057 68760 -1394
13043 213197 342363 13521 56378 328637 96691 307951 74176 -176301 -57938 98132 45266
13031 -38580 38161 -168007 452119 104291 252177 42571 213789 97752 133019 127798 209325
$$ packed form
13112a09190B80187f3769r7343A71953J41976I6429b75714a29154E200J93289
13102A98489a26357h009B0325m515J38712C6291k651J96066J06887b7208C2625
13090a71206A57225a0499A41897E3900a10808A37100L4539G6405K42458B7441
13079B987N2389M39151j74702R9750A53546C9922R6060J51238p9075g7917A40317
13067a58856c0347E44043j52738A01046b5720A69820b0318C94454b44187I6756
13056B22985C0277p882e2612H4580K0689K4027A1313L38585K2025J34F8760a394
13043B13197J29166A3521M2857K72259I6691K11260G4176a76301e7938I8132D5266
13031c8580C8161a68007D52119A04291J47886D2571J71218I7752L5267n221Q1527
$$ plain form
13020 209325 178716 8119 217295 35712 257002 70127 159174 136259 456436 33440 165456
13009 165456 541238 -114730 -26840 104501 -276790 297702 -352237 51799 -71744 -112328
12999 -112328 251272 332820 -127594 233666 171811 50214 322751 1277 -146044 -229139 -32919
12987 237214 77808 -99171 76284 76909 34773 248462 -101867 30175 -152220 86148 -39507
12975 18469 96627 -155363 109810 385868 -129616 481568 296082 212796 -41982 116553
12964 -124721 -103403 92448 121484 392670 111744 263581 121541 128108 -170586 104718
12953 -112359 -63091 223582 117665 -17432 -5124 -95050 111597 271378 -68564 372634 248686
12942 248686 -276893 -294719 -68792 -222992 260893 71054 37782 277394 -38756 -102694 -37482
$$ packed form
13020B09325l0609H119K09176C5712K21290G0127Q9047k2915L20177C3440J32016
13009A65456L75782a14730b6840A04501b76790B97702c52237E1799g1744m0584
12999a12328B51272Q1548a27594B33666o1855E0214K72537A277a46044q3095c2919
12987B37214G7808i9171G6284O25C4773K13689a01867C0175a52220H6148c9507
12975A8469P8158a55363A09810K76058a29616D81568j85486q3286d1982A16553
12964a24721K1318I2448K9036K71186A11744J51837A21541O567a70586A04718
12953a12359M9268B23582j05917a7432e124q9926A11597J59781f8564C72634j23948
12942B48686b76893j7826f8792j54200B60893G1054l3272K39612c8756o3938c7482
$$ plain form
12930 -135099 54181 123873 -175495 -178043 136594 93525 100390 14075 -160470 53784 21209
12918 20320 29472 151757 103692 -69859 161891 59068 -316890 218933 -285593 198784 -130604
12906 343104 15307 226331 -14863 285827 -111214 -287592 36153 289332 99241 55861
12896 55861 -56693 228990 182322 199930 68335 -39027 -236914 -1395 247133 53357 84234
12885 84234 117864 320927 -4102 25521 125489 178138 -131286 125374 33615 -25263 -268183
12874 -268183 270637 210495 265709 -354879 -181968 -93559 44672 -14930 180640 91640 193866
12863 193866 150057 -85353 -55399 72600 62025 79320 177589 -8597 -67123 193955 131333
12852 131333 158942 68496 -22226 178735 -210497 128455 338042 185687 270319 130054
$$ packed form
12930a35099E4181O9692a75495k548A36594m3069O865A4075a60470E3784B1209
12918B0320R152J22285m8065f9859A61891E9068c16890B18933b85593A98784a30604
12906C43104A5307K11024a4863B85827a11214j76378C6153K53179I9241m3380
12896E5861e6693B28990m6668J7608F8335c9027j97887a395B47133E3357L0877
12885H4234L3630K03063d102B5521R9968N2649a31286A25374C3615b5263k42920
12874b68183B70637o0142N5214c54879J72911Q8409D4672a4930A80640q9000J02226
12863A93866m3809h5353K9954G2600j0575J7295R8269h597n8526A93955o2622
12852A31333K7609F8496b2226A78735b10497A28455K09587j52355Q4632A30054
$$ plain form
12841 99035 349331 -120388 365488 345457 40653 -620 -214337 10535 -40341 34131 -541 77325
12828 -68448 296352 79439 -181452 -195132 697 -262569 83827 251196 55279 82770 252864
12817 252864 39129 -105987 -33702 -274884 121024 97113 53792 -88287 -227949 181777
12806 104976 218652 83134 72561 230240 -77186 35290 -224589 422227 2397 7881 -183651
12794 267033 61087 163974 47995 25719 -48819 66405 -17478 -205996 -223985 95661 -48943
12782 17987 -238077 -191390 -69326 -171960 -117814 -190444 -331295 97840 250043 157840 31239
12770 -9086 206972 -72685 61469 81194 73606 229022 -118490 94651 14126 90062 -85880
12758 39462 27809 203862 92111 41239 -6090 -8288 296835 256468 -69211 -161221 235387
$$ packed form
12841I9035K50296a20388C65488k0031D0653f20k13717A0535d0341C4131e41G7325
12828f8448B96352G9439a81452j3680F97b62569H3827J67369E5279K7491J70094
12817B52864C9129a05987c3702k41182A21024k3911m3321h8287j39662A81777
12806A04976J13676H3134j0573J57679g7186C5290b24589D22227B397N484a83651
12794B67033F1087J02887D7995k2276d8819F6405a7478j88518j7989I5661d8943
12782A7987b38077M6687f9326j02634N4146p2630j40851I7840J52203r2203C1239
12770i086B06972g2685F1469J9725p588J55416a18490I4651A4126P5936h5880
12758C9462j1653J76053I2111D1239f090k198B96835m0367f9211r2010B35387
$$ plain form
12746 7801 97613 69459 161627 3152 -53407 74470 2502 -58544 -127399 70276 355275 188771
12734 188771 290642 10117 78258 301083 151118 -121017 365263 49066 151470 -306165
12723 17098 80527 -60607 88570 131561 66260 444653 -245710 290632 183387 -12143 -41552
12712 -41552 8346 222295 501327 -39770 148197 589674 598003 319981 159486 95953 259705
12701 259705 -33148 182764 -23027 -179363 -47578 42935 -175983 -128862 139059 15559 -47399
12689 -134333 94997 51428 -83517 82040 530211 101181 -245732 92618 76709 366915 212908
12678 212908 186629 -102878 283563 416715 221136 429781 86443 -25027 -29615 -59456 96070
12666 359108 102121 18036 11561 205029 125859 194024 165553 34012 -24663 -354609 102811
$$ packed form
12746G801Q9812k8154R2168C152e3407G4470B502e8544o8855G0276K84999j66504
12734A88771J01871A0117O8141K22825j49965a21017C65263D9066J02404c06165
12723A7098O3429f0607H8570M2991o5301L78393b45710B90632j07245a2143k9409
12712d1552H346K13949K79032c9770A48197M41477Q329k78022A59486o3533J63752
12701B59705c3148A82764b3027j56336d7578D2935a75983M7121A39059A5559d7399
12689a34333I4997m3569h3517H2040M48171A01181b45732I2618j5909K90206j54007
12678B12908k6279a02878B83563J33152j95579K08645H6443b5027m588k9841I6070
12666C59108A02121A8036o475J93468p9170O8165k8471C4012b4663l29946A02811
$$ plain form
12654 58423 -157710 23782 325175 342842 -109697 -285463 -22265 88936 71406 -103511 -134847
12643 -134847 39922 -233102 -9670 93203 172435 64079 -306526 17448 223319 17573 -43981
12631 194041 113708 163954 -184256 20903 -168178 302581 278225 -135478 190711 18599
12620 421688 379316 -46722 71883 -293237 -257024 -203082 -46847 -128449 2053 68259 97998
12609 97998 171964 -174460 -57392 -19388 -275 63282 -328180 6534 241625 239574 -49364 -360195
12597 -360195 -361 118280 120113 45081 256425 -162866 278254 -20072 135146 121750 -109146
12585 66087 -96199 -81151 -3928 83853 -1067 93899 -184864 -211134 122086 -11985 64322 23288
12572 -251378 269457 -42910 36776 126737 -76541 120124 -91221 -136461 28924 63713 -103154
$$ packed form
12654E8423a57710B3782L01393J7667a09697j75766b2265H8936j7530a03511l1336
12643a34847C9922b33102i670I3203P9232F4079c06526A7448K05871A7573d3981
12631A94041q0333N0246a84256B0903a68178C02581k4356a35478A90711A8599
12620D21688m2372d6722G1883b93237L6213N3942d6847q1602B053O6206K9739
12609I7998P3966a74460e7392a9388b75F3282c28180F534K35091k051d9364l10831
12597c60195c61A18280J833D5081K11344a62866B78254b0072A35146j3396a09146
12585F6087i6199J5048c928H3853a067I3899a84864k6270A22086a1985F4322B3288
12572b51378B69457d2910C6776Q9961g6541A20124i1221m5240B8924L4789a03154
$$ plain form
12560 -45794 -45640 71628 125482 13475 45532 -78894 290537 210593 -57763 -66262 128870 59301
12547 15461 43231 94077 -22450 -97676 335425 -238206 77304 143492 91095 -28143 36144
12535 162430 -19579 41152 251421 -346436 107563 398653 -192055 41755 -183827 -81274
12524 -24114 -2970 -182860 30179 -44124 -253135 -195393 283811 -108877 190572 243370 351121
12513 351121 401622 -208468 -78747 133407 258759 -327222 -18638 260679 164377 230384
12503 230384 -267791 -108080 151935 115018 158311 265812 -80805 162934 236985 365535
12493 365535 119187 -56492 -2864 98822 -1329 91016 -70031 -120667 -279607 24361 -104458
12481 34980 -324310 -41422 -335516 -113405 49023 469161 -110845 96451 -197665 -176527
$$ packed form
12560d5794J54G1628N3854A3475L2057g8894B90537p9944e7763q499A28870E9301
12547A5461K7770N0846b2450p5226C35425b38206G7304O6188n2397b8143C6144
12535A62430a9579D1152K10269c46436A07563K91090a92055D1755a83827h1274
12524b4114b970j79890C0179d4124k09011N7742B83811a08877A90572N2798J07751
12513C51121N0501b08468g8747A33407J25352c27222a8638B60679r6302O6007
12503B30384b67791a08080A51935l6917M3293J07501h0805A62934P4051J28550
12493C65535A19187e6492b864I8822a329I1016g0031n0636j58940B4361a04458
12481C4980c24310d1422k94094a13405D9023M20138a10845I6451a97665K1138
$$ plain form
12471 -176527 213273 209882 130201 -224720 16425 -297665 41503 11110 323297 -13982 68741
12459 318151 -80760 -71819 -39578 -141794 284445 48214 63583 87426 -108381 -213107 -123267
12448 -123267 -145186 -22376 164822 66113 -395349 40049 -221244 96089 246354 -112854
12437 -196863 83971 173348 345544 126889 -80713 65264 120303 -154858 -131268 -394239 -35723
12425 -161529 125917 62185 64204 -451570 37950 85096 -282378 -119299 77007 488277 264126
12414 264126 172850 252799 -79899 12314 -9592 -103368 29819 -3766 41164 282995 207846 -65170
12401 -2512 -62032 -216160 -28169 48655 -29423 -195077 34883 -126265 -61404 -25605 -128454
12390 -128454 -334862 -267318 118620 -146794 -294436 -18308 241069 128749 -42938 -191006
$$ packed form
12471a76527B13273l391p9681b24720A6425b97665D1503A1110L12187a3982F8741
12459C18151h0760Q941L2241j02216B84445D8214J5369K3843a08381j04726Q9840
12448a23267k1919b2376A64822F6113c95349D0049b21244I6089J50265a12854
12437a96863H3971Q9377J72196A26889h0713F5264N5039a54858K3590k62971c5723
12425a61529A25917F2185K019d51570C7950M7146b82378a19299G7007M11270k24151
12414B64126r1276P9949g9899A2314i592r3776B9819c766D1164K41831p5149f5170
12401b512n9520j54128b8169D8655b9423j65654C4883a26265f1404b5605j02849
12390a28454k06408O7544A18620a46794j47642a8308B41069j12320d2938j48068
$$ plain form
12380 -191006 397406 179444 156659 -1928 -124057 238201 82308 51032 119373 -32696 172132
12368 -151319 -86347 103272 -208822 161254 45268 40478 -225577 -2468 -173273 -158359 64714
12356 -573417 -51823 -247933 204040 83037 -166085 -54762 -237559 92349 42010 65652 13554
12344 95790 -167912 138293 239179 -83516 -49576 18224 -58773 -197168 -171361 -88756 210721
12332 131320 -2463 51512 -148065 -165751 -39398 -294116 73624 30298 405184 -178866 -13030
12320 -41937 -384045 -158705 -15532 -58951 -31940 83086 -194556 125866 -37452 178543 -190655
12308 50970 146148 -70377 191340 117034 -125109 -279545 220012 -88497 -118619 -304645 -232129
12297 -232129 -202653 71118 -135038 -251982 104045 -326390 -25043 228869 -124146 399295
$$ packed form
12380a91006C97406A79444k2785a928j22129B38201H2308l1276O8341c2696A72132
12368a51319O4972A03272b08822A61254D5268m790b25577b468j70805J4914F4714
12356e73417e1823j96110B04040H3037a66085e4762j82797I2349D2010K3642A3554
12344I5790a67912A38293J00886h3516L3940A8224e8773j38395K5807Q2605B10721
12332A31320b463E1512a48065j7686c9398k54718G3624C0298L74886a78866a3030
12320d1937l42108a58705a5532m3419K7011H3086a94556A25866c7452A78543a90655
12308E0970R5178g0377A91340p4306a25109j54436B20012h8497l0122j86026P2516
12297b32129K9476G1118a35038j16944A04045c26390b5043B28869a24146C99295
$$ plain form
12286 143172 41959 125144 -25876 -20854 56115 144784 324080 118830 186126 214712 209289
12275 209289 356112 36206 103614 99622 -131063 321261 -136805 135136 359215 -164492
12264 63992 -42632 66390 142610 126637 -49227 63002 -196420 10322 198744 9594 -44590
12252 64381 472685 174329 -106905 102398 33169 324349 -44033 70452 -120452 -21287
12241 -80151 280780 45824 -35133 -139782 336311 -50652 37827 -281885 564250 279980
12230 131305 265658 430225 175544 348002 334145 245149 -232651 169832 258443 287754
12220 287754 326367 226428 306158 482754 268777 203357 11699 63622 52102 140666 -192209
12208 49501 -124602 156198 335281 262477 285831 278451 236422 314108 261930 -63148 278318
$$ packed form
12286A43172D1959Q3185b5876N022E6115Q8669J79296A18830O7296K8586n423
12275B09289J46823C6206O7408l992a31063C21261a36805A35136K24079a64492
12264F3992d2632F6390P6220j5973d9227F3002a96420A0322J88422I594d4590
12252F4381M08304A74329a06905A02398C3169K91180d4033G0452a20452b1287
12241h0151B80780D5824c5133j04649C36311e0652C7827b81885E64250B79980
12230A31305J34353J64567A75544J72458j3857q8996b32651A69832Q8611K9311
12220B87754L8613r9939P9730J76596k13977o5420A1699N1923j1520Q8564a92209
12208D9501a24602A56198J79083p2804K3354p380m2029P7686n2178f3148B78318
$$ plain form
12196 254349 225088 72081 116448 409894 81865 198129 -68466 -166339 37908 158733 82888
12185 82888 114293 175125 -43109 55649 250128 92999 -28795 30140 -4322 70152 322450
12174 322450 274538 204053 319887 333050 146572 132096 -123314 122945 -293327 163235
12163 -30420 -77193 188453 231304 252624 185451 -195325 242511 479362 5772 91118 471602
12152 471602 14188 112636 -197291 -1687 348150 -54519 -186803 139493 -52447 -119474 231349
12140 127189 -86570 -66642 153487 -237845 -174677 -367026 -44666 -47757 283047 114585 297116
12129 297116 -390266 171779 38926 -239741 -159340 125367 -45474 112689 347244 63323
12118 194929 417802 300334 -114008 273272 -91018 172806 154968 39513 -93609 -3565 145474
$$ packed form
12196B54349k9261G2081M4367K93446H1865J16264f8466r7873C7908J20825p5845
12185H2888L1405O0832d3109E5649J94479I2999b8795C0140d322G0152K52298
12174C22450m7912p0485J15834J3163A46572j4476a23314A22945b93327A63235
12163c0420m6773A88453M2851K1320o7173a95325B42511K36851E772Q5346L80484
12152D71602A4188R8448a97291a687C48150e4519j32284A39493e2447o7027B31349
12140A27189h6570J9928A53487b37845O3168j92349d4666l091B83047A14585J82531
12129B97116c90266A71779C8926b39741Q0401A25367d5474A12689K34555F3323
12118A94929K22873j17468a14008B73272i1018A72806j7838C9513i3609c565A45474
$$ plain form
12106 372527 253884 -85331 -90304 158531 9451 -261044 133304 9899 85389 477758 153982
12094 -81334 -34494 135054 -4463 -127225 107933 -74 14447 -119587 -190001 213916 276275
12083 276275 -54834 31573 -95609 -113579 81294 -55595 115106 317686 863299 1965859
12073 1965859 1264778 539695 111301 119235 197339 -68606 -415010 -42942 -144582 -145617 230957
12061 447128 -244834 162758 -291186 -47391 158017 -67383 -81909 -62396 28500 151258
12051 151258 54854 91359 8893 -180923 -140733 -31574 -194213 -5196 -156328 48281 68158
12040 68158 60223 15789 -181527 -12272 -137398 187813 -233867 221790 57938 -313136 -101143
12028 -33476 106050 -1624 -187202 -44961 163549 -283082 295342 -2641 144390 -62338 -239342
$$ packed form
12106C72527j18643h5331m973A58531I451b61044A33304I899P5490L92369A53982
12094h1334c4494A35054d463j22762A07933g4A4447a19587p0414B13916O2359
12083B76275e4834C1573i5609j7970H1294e5595A15106K02580N45613J102560
12073A965859p01081E39695A11301P934P8104f8606l46404d2942j01640j035B30957
12061D47128b44834A62758b91186d7391A58017f7383j4526J9513B8500J22758
12051A51258E4854L6505H893a80923M0190c1574j62639e196j51132D8281J9877
12040F8158p935A5789a81527a2272j25126A87813b33867B21790E7938c13136a01143
12028c3476A06050a624j85578d4961A63549b83082B95342b641A44390f2338j77004
$$ plain form
12017 -239342 64226 154821 320050 -212006 115961 -194704 -210280 167018 -142778 87901
12006 38930 -159807 139880 -313054 -59999 -7026 34237 52511 -369398 10934 136685 -8564
11994 -173962 -62596 80292 -34526 -46326 190981 -3636 -183025 6620 51620 117778 -339390
11982 257253 -275155 -63081 275113 46302 334956 -235825 19836 -116466 -24876 10889
11971 -26009 232726 336299 126716 -147297 -221622 -74107 -162492 -288629 -229003 51283 227619
11960 227619 3379 -209902 -162431 10511 -144586 -60421 148212 -329676 157459 211175 97476
11948 24956 66938 13235 -166308 201087 109203 146402 95534 263962 121799 -170213 -12143
11936 -83363 -223588 219885 -896 -28921 -59672 -388171 -349686 86810 -38906 120137 -52282
$$ packed form
12017b39342F4226R0595J65229b12006A15961a94704j5576A67018a42778H7901
12006C8930a59807A39880c13054e9999g026C4237J8274c69398A0934J25751h564
11994a73962f2596H0292c4526j1800A90981c636j79389F620M5000O6158c39390
11982B57253b75155f3081B75113D6302K88654b35825A9836a16466b4876A0889
11971b6009B32726J03573A26716a47297p4325g4107q8385j26137N9626E1283J76336
11960B27619C379b09902M7471A0511a44586f0421A48212c29676A57459N3716I7476
11948B4956M1982A3235a66308B01087r1884L7199n0868J68428A21799a70213a2143
11936h3363j40225B19885h96k8025l0751l28499L8485H6810c8906A20137e2282
$$ plain form
11924 342503 -770 23378 267175 -80299 61432 57886 -188902 -85023 195065 236215 -22038
11912 157855 -17888 -107430 191994 -130886 240311 -236573 -182714 228296 19771 151207
11902 151207 255501 -96649 -312430 49007 -55830 200634 -258688 -337535 55459 341768
11892 341768 116008 -243141 -67001 -25849 26310 -75354 -75952 -80867 -176800 -184868 85066 -292964
11879 82516 -125388 -103092 -203335 -127458 31957 78899 -96256 -443483 12517 72454 -90445
11867 -21183 18817 30501 -6409 34706 74180 -55443 -173083 -89597 230699 -60128 122500
11855 211751 -113033 -21678 28405 -1002 14152 -167809 105154 -150888 92396 -47082 -96007
11844 -96007 264668 55227 65 -24004 16811 -230661 8726 236714 -233737 53446 46412 3262
$$ packed form
11924C42503g70B3378K43797h0299F1432l546a88902h5023A95065M1150b2038
11912A57855a7888q9542A91994a30886B40311b36573N3859B28296A9771J31436
11902A51207J04294i6649k15781D9007e5830B00634b58688p8847E5459K86309
11892C41768A16008b43141f7001b5849B6310g5354n98m915r5933q068H5066b92964
11879H2516a25388K2296j00243P5877C1957M6942i6256l47227A2517N9937i0445
11867b1183A8817J1684f409C4706L9474e5443j17640Q3486B30699f0128A22500
11855B11751a13033b1678B8405a002A4152a67809A05154a50888I2396d7082m8925
11844i6007B64668E5227F5b4004A6811b30661H726K27988b33737E3446p034C262
$$ plain form
11831 166591 -221844 -145789 -201545 56931 231347 -356415 -215278 -31024 224676 66979
11820 75604 -24118 50756 -7072 11049 47121 -135267 151804 -135633 13489 -35481 1399
11808 -165073 -39368 -43644 -124390 193576 -340591 -144614 5903 137388 214670 215962 103979
11796 -232081 97140 147361 -67774 -315542 204486 -235779 -31421 61603 -91758 -82279 241496
11784 -502555 131480 -145801 -121490 106066 71072 -183132 144644 -103202 42400 -66519
11773 147996 -7333 131161 206270 -97134 -28144 165453 281862 169726 -127448 -94301 126167
11761 -50185 -186419 257596 -6128 -73387 -148194 117582 170721 -257848 -19934 -106521 168079
11749 134219 -106468 445208 227853 43362 62248 126541 -168253 -234285 64522 176495
$$ packed form
11831A66591b21844P6055n5756E6931J74416c56415J41137c1024B24676F6979
11820G5604b4118E0756g072A1049L6072a35267A51804a35633A3489c5481A399
11808a65073c9368m276q0746A93576c40591a44614E903J31485P7282J292A03979
11796b32081I7140N0221f7774k47768B04486b35779c1421F1603i1758R479B41496
11784e02555A31480a45801K4311A06066l4994a83132A44644a03202D2400f6519
11773A47996g333A31161P5109i7134b8144A65453J16409j12136a27448L3147A26167
11761e0185j36234B57596f128o7259p4807A17582N3139b57848a9934q6587A68079
11749A34219a06468D45208k17355D3362J8886O4293a68253o6032F4522J11973
$$ plain form
11739 176495 77380 -254023 80030 48754 -38003 -131853 -135947 100841 38823 -97051 10951
11727 -33663 -165992 134824 -131935 96906 -211368 -202991 -118656 111288 -300920 44481 152272
11716 152272 139722 -183651 -309918 243147 290597 266067 13549 199463 -183936 128046
11705 -210855 117854 -185853 124076 -93842 -126801 -82520 -54196 122504 -6636 183898 115093
11694 115093 218441 132695 100157 219306 155930 36489 229192 75397 27685 106341 390964
11683 390964 -176456 266696 -75175 50978 100894 -142011 -253745 218178 -142260 92472
11672 163811 243130 109360 -276861 -19202 40556 81898 87021 78831 106351 259734 263436
11661 263436 288660 -6793 80817 303990 250387 82498 -13241 71022 -46499 113981 122660
$$ packed form
11739A76495G7380b54023H0030l1276c8003r3850m094A00841C8823i7051A0951
11727c3663j32329A34824a31935I6906b11368Q377Q4335A11288c00920D4481J07791
11716A52272j2550a83651j26267B43147M7450k4530A3549J85914a83936A28046
11705b10855A17854a85853A24076i3842l2959M4281K8324A22504f636A83898o8805
11694A15093J03348q5746l2538J19149o3376C6489J92703G5397B7685P8656K84623
11683C90964a76456B66696g5175E0978M9916a42011j11734B18178a42260I2472
11672A63811P9319A09360b76861a9202D0556M1342N123q190K7520J53383L702
11661B63436K5224f793H0817K23173n3603H2498a3241G1022d6499A13981Q679
$$ plain form
11650 122660 37292 -163865 -123694 -198799 -91949 28166 204119 -174431 311234 87839 172701
11639 172701 138159 -211902 1891 -156880 89356 96475 139774 310900 126410 130649 426483
11628 426483 41203 106650 -111305 360770 27200 56469 120427 268538 321844 -46455 175254
11616 -148587 -29322 143299 -377579 -3203 -164322 -240062 340230 -112899 181039 -24320
11605 8244 338910 83871 169869 92122 24819 155186 339325 -60605 -125070 202684 -14079
11593 56524 -172457 -22242 134354 165040 79920 -83853 131582 97693 106985 418858 78617
11581 161409 -197194 -17074 66602 140824 -164778 166943 20681 362602 268181 -200731
11570 225888 434782 361917 72614 -291656 37144 133556 280673 85626 85020 218904 68969
$$ packed form
11650A22660C7292a63865M0171p5105i1949B8166J75953a74431C11234H7839Q4862
11639A72701l4542b11902A891a56880H9356P119M3299J71126A26410M239K95834
11628D26483D1203O5447a11305C60770B7200K9269O3958J48111N3306d6455A75254
11616a48587b9322A43299c77579c203j61119p5740C40230a12899A81039b4320
11605H244L30666H3871Q5998p7747B4819J30367J84139f0605o4465B02684a4079
11593E6524a72457b2242A34354L0686G9920h3853A31582l3889R292L11873G8617
11581A61409a97194a7074F6602P4222a64778A66943B0681L41921r4421b00731
11570B25888K08894p2865G2614b91656C7144R6412J47117H5626o06J33884F8969
$$ plain form
11558 -266062 218155 127078 78466 249202 103217 -353876 -197675 279742 -49303 -220708
11548 -220708 324575 360708 310825 53192 241692 250434 -172434 222777 120010 -165731
11537 127222 -87908 -24372 417230 -206962 110917 31284 283342 113972 445591 121090
11526 139473 120537 55407 291755 179053 195014 -83984 -156348 80652 169910 522907 292991
11515 292991 124568 69146 33938 327769 280810 279746 27692 531767 471359 298438 79485
11503 140460 -47040 -219875 -30554 132236 355060 -45549 21488 270874 -94957 -34604 167067
11491 151031 -213206 -103696 -45720 348282 -30121 274180 197642 79284 -59677 294109
11480 294924 79656 23882 552897 -213152 112204 -91655 -123259 88722 -101311 46454 220553
$$ packed form
11558b66062B18155r1077m8612J70736A03217c53876J56201B79742d9303j71405
11548b20708C24575L6133m9883E3192J88500Q742a72434B22777j02767a65731
11537A27222h7908b4372D17230b06962A10917C1284K52058A13972L31619A21090
11526A39473j8936E5407K36348j12702J5961h3984p2364H0652Q9258L52997k29916
11515B92991A24568n5422C3938K93831m6959j064B7692N04075o0408j72921G9485
11503A40460d7040j72835c0554A32236K22824d5549B1488K49386i4957c4604A67067
11491A51031b13206a03696d5720C48282c0121B74180p6538G9284e9677B94109
11480B94924G9656B3882N29015b13152A12204i1655l1604H8722a01311D6454J74099
$$ plain form
11469 220553 85429 115534 142410 120526 164339 202379 68195 116686 -68635 30057 -62270
11457 43663 224510 368097 174254 198691 178409 279398 199326 103929 125778 -15919 67843
11445 179104 10626 -27274 22507 -192160 105069 363949 -24784 -16649 151226 -144430 -47191
11433 -100907 -77518 89407 189398 160501 517590 -115966 -25803 -5207 142227 60736 -109729
11421 30859 83216 -103561 -219973 368861 -228575 -86708 -176781 83234 102327 43337 199719
11410 199719 -131089 -105999 141714 -68642 -175655 -117219 300699 103740 193487 122432
11400 122432 106152 57961 -8921 127542 161572 -9174 244126 -185369 -96792 -316010 -41820
11388 190352 312544 49894 108696 368596 105683 161821 -32551 151425 -128765 -125521 -204368
$$ packed form
11469B20553H5429L0105K6876k1884M3813L8040F8195M8491f8635C0057f2270
11457D3663J80847J43587A74254K4437k0282J00989q0072r5397K1849a5919F7843
11445A79104A0626b7274B2507a92160A05069K58880b4784Q135A51226a44430d7191
11433a00907K3389H9407R9991k8897L57089a15966b5803e207A42227F0736a09729
11421C0859N2357a03561j16412C68861b28575h6708r0073H3234J9093D3337J56382
11410A99719a31089K5090A41714f8642j07013N8436C00699A03740Q9747p1055
11400A22432j6280m8191h921A27542L4030i174B44126a85369Q8577k19218d1820
11388A90352J22192D9894N8802K59900A05683N6138c2551A51425a28765L244p8847
$$ plain form
11377 -204368 30356 -185511 -208688 -219472 205498 383811 119724 -133016 -17698 505866
11366 -99804 -92022 -56676 43889 53480 -101139 -294188 34349 -81891 -23807 -116646 -18159 -50197
11354 -50197 121451 101561 -260025 -160670 -96923 250773 -86547 -231730 -70971 -142501 -22230
11342 73689 130253 594346 121263 61770 -100541 375362 234235 173797 235660 -242345
11331 125641 235497 -226417 47558 -15674 -26606 -160177 174127 132765 -204937 -201311 233937
11319 74892 89490 -168669 -107736 269939 159603 -49825 -87357 -381586 -7645 -188057 72083
11307 -90065 -148448 50023 56657 -39997 103615 -123688 70370 -50376 -265695 373718 248176
11296 248176 -44563 2279 40245 -44481 -297137 -105449 -214678 -258146 -70241 129326 -31173
$$ packed form
11377b04368C0356a85511k3177j0784B05498J78313A19724a33016a7698E05866
11366i9804P782L5346D3889R591a01139j93049C4349h1891b3807r2839a8159l2038
11354e0197A21451j9890b60025R9355O3747B50773h6547j45183g0971p1530b2230
11342G3689N6564M64093A21263n9493a00541C75362j41127o0438O1863b42345
11331A25641J09856b26417D7558a5674j0932j33571A74127m1362b04937L626B33937
11319G4892J4598a68669O0933B69939j10336d9825l7532k94229g645j80412G2083
11307i0065n8383E0023O634c9997A03615a23688G0370e0376k15319C73718j25542
11296B48176d4563B279L7966d4481k52656a05449j09229m3468g0241A29326c1173
$$ plain form
11284 -71366 -173079 18627 203707 -363542 -54388 106341 -16160 204091 -34062 -282739
11274 -282739 81478 11713 367972 168424 -470990 -264518 -216722 36774 -72054 -47638 52519
11262 -17732 56031 -277537 -99404 176743 -206962 45137 14909 -21911 -91285 39460 -9884
11250 83893 151292 -35037 -133972 -91964 22293 -59663 -197716 50265 -2846 -114227 -296711
11239 -296711 -90932 -119074 -251035 -183667 -167634 104414 -132124 -42053 110054 368553
11229 368553 125333 207343 129439 19061 54919 216829 -157290 63438 74980 -25249 -123083
11218 -123083 -162596 -310942 144870 51869 -40478 -127364 -69784 81672 -91155 34003 444464
11207 444464 -113797 90873 15049 156702 -136985 -99949 71307 -17689 14699 -4187 177673
$$ packed form
11284g1366j01713A8627J85080c63542e4388A06341a6160B04091c4062k48677
11274b82739H1478A1713L56259A68424d70990K06472M7796C6774g2054K4416E2519
11262a7732E6031b77537i9404A76743b06962D5137A4909b1911o9374C9460i884
11250H3893O7399c5037r8935M2008B2293e9663j38053E0265b846j11381j82484
11239b96711i0932k8142j31961O7368J6033A04414a32124d2053A10054K58499
11229C68553A25333Q2010p7904A9061L5858J61910a57290F3438J1542b5249r7834
11218a23083l9513j48346A44870E1869d0478q6886N7580H1672i1155C4003M10461
11207D44464a13797I0873A5049J41653a36985L7036G1307a7689A4699d187A77673
$$ plain form
11195 71839 2859 157134 -142750 54200 -56388 -126790 57926 -119558 -125435 175655 -14583
11183 13960 194338 160668 -66703 18416 -137879 -177766 -47999 -37445 139486 13423 92791
11172 92791 -10000 -185706 146120 -273682 -9459 150083 -247161 -375629 -322947 8202 -389181
11160 -105417 41410 76984 96320 -13592 -154255 -81771 115522 -207773 67362 -151313 -28883
11148 -53704 379305 -23318 -24523 -128175 133723 294164 -44120 228705 181227 -124829 283487
11136 -9993 -28675 235884 -125720 -177615 140198 75207 -197966 192149 -162230 -219122 72826
11124 137222 187658 26108 -97840 123481 13606 108643 104569 274273 -11585 440835 121112
11112 -122957 18074 -48520 258390 97237 302853 373169 236503 34081 -51758 163848 389521
$$ packed form
11195G1839B859J54275a42750E4200e6388p0402E7926a19558n877A75655a4583
11183A3960J80378l3670f6703A8416a37879l9887d7999J0554A39486A3423P9368
11172I2791a0000j75706A46120b73682i459A50083b47161j28468N2682H202c89181
11160a05417D1410L5574J9336a3592j40663P2484A15522b07773F7362a51313b8883
11148e3704C79305b3318j205j03652A33723J60441d4120B28705m7478a24829B83487
11136i993j8682B35884a25720n1895A40198o4991a97966A92149a62230n6892G2826
11124A37222N0436B6108i7840A23481A3606R5037m074J69704a1585D40835A21112
11112a22957A8074d8520B58390I7237K05616P0316j36666C4081e1758A63848K25673
$$ plain form
11101 389521 125887 202184 42975 48097 -116751 57706 148107 -38174 124713 -169366 392162
11089 466580 243111 385308 249438 131032 492572 113065 422599 154010 135166 179506
11079 179506 314252 306619 -97212 200615 313170 207207 282582 389699 51892 514903
11069 514903 119116 146961 165374 464965 332966 318058 -4500 504426 579042 372359 487438
11058 487438 667172 823956 736581 777157 349307 807474 489539 534342 670166 797692
11048 797692 423017 656726 860777 822913 772924 749286 574446 500010 747937 999501
11038 999501 625596 490928 536757 591795 245119 676433 671501 682194 897531 449914
11028 449914 778472 903860 578239 758415 877724 954225 755574 767634 611983 607394
$$ packed form
11101C89521A25887P6297D2975N122a16751E7706R0401c8174A24713a69366C92162
11089D66580k23469J42197j35870j18406L61540A13065L09534A54010j8844M4340
11079A79506J34746p633i7212B00615J12555j05963P5375J07117E1892M63011
11069E14903A19116K7845J8413K99591j31999j4908d500E04426P4616k06683J15079
11058D87438J79734J56784q7375M0576C49307M58167l17935M4803J35824J27526
11048G97692l74675K33709K04051l7864m9989k3638j74840p4436K47927K51564
11038I99501l73905j34668M5829N5038B45119M31314m932J0693K15337m47617
11028D49914L28558J25388l25621J80176J19309P6501j98651J2060j55651m589
$$ plain form
11018 607394 606502 440821 369448 799945 657053 438123 660953 812940 282299 761989
11008 761989 461877 496036 815435 441690 365919 627545 730094 641320 950695 402528
10997 813981 723786 616128 467087 691986 495250 487569 594051 781587 746570 965877
10987 965877 851193 926383 938856 902378 1112994 1040518 1165762 1392638 1071902 1584511
10977 1584511 1524579 1720249 2082227 1991042 2335468 2495678 2799410 3072032 2924484 2744985
10967 2744985 2329411 2589664 2123951 1912668 2190371 1728325 2072773 2126597 2056606 2316267
10957 2316267 2226082 2222278 2196611 2083705 1785977 1334129 1108190 1046846 1116036 578518
10947 578518 435047 495140 587208 166991 690580 163394 179912 507685 65908 6349 261655
$$ packed form
11018F07394q92j65681p1373M30497j42892k18930K22830J51987B82299M79690
11008G61989l00112L4159L19399l73745p5771K61626J02549q8774L09375D02528
10997H13981r0195j07658j49041K24899j96736p681J06482J87536l5017K19307
10987I65877j14684P5190J2473l6478K10616p2476J25244K26876l20736N12609
10977A584511n9932J95670L61978r1185L44426J60210L03732K72622j47548j79499
10967B744985m15574K60253m65713k11283K77703m62046L44448N3824o9991K59661
10957B316267r0185l804k5667j12906k97728m51848k25939o1344O9190n37518
10947E78518j43471O0093R2068A66991N23589A63394J6518L27773F5908F349K55306
$$ plain form
10936 261655 432700 -49558 98285 -60427 34758 76744 -83221 -139266 328317 275538 -279527
10924 185229 9925 -213325 357142 -212562 367990 177277 -153731 133504 46140 259475
10914 259475 -107480 -66786 -193861 169214 -45367 51369 375162 -111819 50357 71636
10904 71636 40448 10476 30187 285017 -198946 172215 87251 160223 115410 -169783 44068
10892 181138 253824 27711 -17638 -12769 -11866 199504 -61007 -36109 -170804 -2476 62573 139513
10880 139513 -326582 135362 87207 -169010 -171568 80683 -19522 30130 109728 -81579 -75491
10869 -75491 306890 52161 27962 -91012 3135 115678 -44223 22731 26997 145444 326608
10858 326608 -22211 -187802 -149199 -247053 143135 -56517 -273066 86645 114574 144485 -188678
$$ packed form
10936B61655J71045d9558I8285f0427C4758M1986h3221n6045C28317n2779b79527
10924A85229I925b13325C57142b12562C67990A77277a53731A33504D6140K13335
10914B59475a07480M0694j27075A69214d5367E1369L23793a11819E0357K1279
10904G1636l1188A0476J9711K54830a98946A72215q4964P2972m4813a69783D4068
10892A81138P2686B7711a7638M869R03A99504f1007K4898j34695b476F2573P6940
10880A39513c26582A35362m8155a69010k558H0683a9522C0130P9598h1579O088
10869g5491C06890E2161k4199i1012C135J12543d4223B2731M266J18447J81164
10858C26608b2211j65591L8603r7854A43135e6517k16549H6645K7929K9911a88678
$$ plain form
10846 160435 99051 192680 -354561 -55167 105761 89250 -76469 84760 134832 -15464 405372
10834 -42850 -34525 -296742 109700 -224516 164524 -195527 30320 15581 -81545 256206 -36328
10822 83237 -285017 66356 -62198 181165 -237107 -134692 43055 -135239 -23595 159648
10811 -180432 121740 -271441 199612 85974 -108963 -2108 237367 -20255 -403214 -144355
10800 53557 -394474 27038 100330 25568 -17325 157144 -244747 -125817 360629 -179121
10789 179823 -48429 -250747 -188710 -187703 -126852 -174026 -205853 98965 56534 -141719 43490
10777 304518 46805 -162800 -15747 100941 -136145 -323627 -285127 452322 -88730 29598
10766 42443 81168 285751 450311 -129506 -18867 166287 -161890 113709 -298337 -137981
$$ packed form
10846A60435o1384R3629c54561e5167A05761j6511g6469H4760N0072a5464D05372
10834d2850Q325k62217A09700b24516A64524a95527C0320j4739h1545B56206c6328
10822H3237b85017F6356f2198A81165b37107J02415D3055a35239b3595A59648
10811a80432A21740b71441A99612H5974a08963b108B37367b0255l82959a44355
10800E3557c94474B7038P3292B5568a7325A57144b44747J18930C60629a79121
10789A79823d8429k02318O2037J007O0851m7174l1827I8965m2431a41719D3490
10777C04518D6805a62800a5747A00941a36145j87482L8500D52322h8730B9598
10766D2443L8725K04583J64560a29506a8867A66287a61890A13709b98337a37981
$$ plain form
10755 -67110 183036 -27091 -325983 70616 -97926 -96598 -92842 -164063 -154770 -98626 4017 -29159
10742 125217 -61934 153212 -16514 -89428 -26569 -166849 -139537 -86968 75447 9160 162389
10731 162389 -85611 -205401 -113226 -252432 -218887 -75321 -76678 -130037 -432578 66622 -275511
10719 -99063 -192764 -65546 -175684 259269 119130 -60544 -167219 -167511 -187994 -45329 -23726
10708 -23726 109981 -281415 -104449 -57205 196099 -202050 120881 -306170 -1728 -248725
10698 -248725 -115460 -209628 -279684 -102839 -89086 -79153 169941 226697 -206322 -67904 213845
10686 -184020 219463 -199685 118164 40663 94606 -73449 215276 132193 -354979 -219271
10676 -219271 80564 209282 -138592 -18700 -141369 78732 -341956 106238 -310943 80917
$$ packed form
10755f7110A83036b7091k98892G0616i7926J328L756p1221R293N6144D017b9159
10742A25217f1934A53212a6514p2914b6569j40280K7312N2569G5447I160J53229
10731A62389h5611j19790R2175j39206L3545g5321j357n3359l02541F6622b75511
10719i9063r3701f5546j10138B59269A19130f0544j06675k92k0483d5329K1603
10708b3726A09981b81415a04449M7244A96099b02050A20881c06170a728k46997
10698b48725a15460r4168p0056a02839J3753R933A69941N6756b06322f7904B13845
10686a84020B19463a99685A18164D0663N3943g3449B15276q3083c54979J35708
10676b19271H0564J28718a38592a8700j22669G8732c41956A06238c10943H0917
$$ plain form
10665 -175966 -159827 -24426 -121348 -161862 311820 -83562 86448 180570 -4326 117793 -3819
10653 17303 -316625 20775 154174 -238598 -144965 104501 -15105 148965 50305 144765 -104701
10641 -225630 -32224 -518582 52249 -64219 -478142 -450884 -34525 -180043 -93501 -144886 -60797
10629 -231871 44524 -42943 -213777 63899 89025 164916 -128070 48508 -280865 255807 324964
10618 324964 11144 -69500 114496 136031 -11245 -77291 337318 310961 -89046 -105163 19877
10606 -443447 -312086 -126015 188369 120626 225637 -82884 261064 -176026 332853 140221
10595 20482 112291 -12942 -76084 -328182 103601 -422265 -190463 -157084 -97174 -1722 -73104
10584 -73104 80985 -262380 161132 -18319 -45910 -247051 185522 -269902 -154274 -134587
$$ packed form
10665a75966J6139b4426r6922m0514C11820h3562H6448R4122d326A17793c819
10653A7303c16625B0775J33399b38598R3633A04501a5105A48965E0305R4460a04701
10641b25630c2224m86358E2249f4219m13923K7258c4525j45518Q6542n1385f0797
10629b31871D4524d2943j70834F3899K5126P5891a28070D8508b80865B55807O9157
10618C24964A1144f9500A14496K1535a1245o6046C37318k6357h9046j6117A9877
10606d43447J31361a26015A88369o7743J05011h2884B61064a76026C32853A40221
10595B0482R1809a2942o3142k52098A03601d22265a90463L3379N9910a722p1382
10584g3104H0985b62380A61132a8319k7591k01141A85522b69902J15628J9687
$$ plain form
10574 -134587 -71546 -337035 17699 -61750 -104359 53 -96586 -58136 47480 -363144 18590 -57539
10561 -94043 -74219 78376 -55207 101264 54528 -121470 -35375 -150008 -321223 -70357 230430
10549 50040 277347 237970 -86851 -83464 -364862 -16283 -523587 -307102 -235945 -153914 -10160
10537 -377288 -101542 94484 97798 80729 16578 -146587 -237311 181345 65827 -33661 -322951
10526 -322951 32176 -63849 76950 -152093 141136 -160661 128437 27793 -45276 323986
10515 155987 206641 -111150 -335115 350098 -194016 -219599 -143990 -158764 182226 -279622
10504 104680 133565 12000 111433 -336000 -125177 -4194 -125937 190256 -179111 -124304 68897
10492 -124411 109156 -89797 -113670 197559 -159358 59701 -39602 24203 -1365 292215 290694
$$ packed form
10574a34587O3041k65489A7699f1750m2609E3i6586L8450D7480c63144A8590e7539
10561i4043J9824G8376e5207A01264m6736a21470c5375j14633j71215g0357B30430
10549E0040K27307l9377h6851L387k81398a6283n07304K16485P1157Q2031a0160
10537c77288a01542I4484L314j7069A6578a46587r0724A81345F5827c3661k89290
10526c22951C2176f3849G6950a52093A41136a60661A28437B7793d5276C23986
10515A55987N0654a11150k23965C50098a94016k5583P5609j4774A82226b79622
10504A04680K8885A2000R9433c36000a25177d194j21743A90256a79111N4807F8897
10492a24411A09156h9797k3873A97559a59358E9701c9602B4203a365B92215j521
$$ plain form
10481 290694 542953 361698 488988 343398 160507 -11799 143023 4413 88629 -46715
10470 -85717 -2140 26532 -72736 -56844 -29564 363326 278852 112682 158501 -317966 122654
10458 -221128 265775 -114566 -34155 -180888 -115734 65689 48656 -265496 -28044 -41255 3105
10446 -9596 16437 142197 -92329 -45279 9315 -230275 191277 -345069 9247 -146885 -121164
10435 -121164 680 54376 47296 182945 -9110 -270467 84484 6095 -104624 191111 4628 169808
10423 169808 -290307 173005 -299064 -210827 181153 251320 -100926 -37913 78755 112815
10413 112815 142360 185811 98134 128954 -31132 -322699 130558 -94303 -392068 -36156 93399
10401 -73120 -16799 -392958 -288727 70766 329035 104333 -30772 220418 48700 -259176
$$ packed form
10481B90694K52259j81255J27290j45590A60507a1799A43023D413Q4216d6715
10470h5717b140B6532g2736J5892K7280C63326q4474A12682M5819c17966A22654
10458b21128B65775a14566c4155j46733O5154F5689j7033b65496b8044j3211C105
10446i596A6437J25760i2329d5279I315b30275A91277c45069I247a46885K5721
10435a21164F80N3696p080J35649i110k61357H4484F095a04624A91111D628J65180
10423A69808b90307A73005b99064Q8237A81153P0167a00926c7913G8755L4060
10413A12815K9545M3451q7677L0820c1132k91567A30558i4303k97765c6156I3399
10401g3120a6799l76159J04231G0766K58269A04333c0772B20418D8700b59176
$$ plain form
10390 72712 228402 -54527 76318 112517 146802 57603 196153 194419 -15178 -208969 125914
10378 264258 247995 96207 -44683 407243 -153312 144639 142894 645114 157804 543387
10368 543387 323287 234603 453269 328045 167847 596429 177480 438764 127333 512125
10358 512125 309620 415884 208672 -104428 -148117 414230 163050 556379 486592 222526
10347 466877 394403 472095 330752 412657 536825 7045 284357 126966 322999 138112
10336 298593 -28732 502966 -111030 18667 -47978 3073 123715 -4343 58735 49468 247421
10325 247421 -132117 266379 -204937 330202 131609 308558 32331 151408 253200 409457
10315 409457 -2572 -42553 61182 20215 82963 174458 -113541 -157535 240813 -11860 -47011
$$ packed form
10390G2712J55690e4527G6318L6199L4285E7603J38550j734a5178j93791A25914
10378B64258j6263I6207d4683D07243a53312A44639j745N02220A57804L85583
10368E43387k20100q8684K18666j25224j60198M28582A77480K61284A27333L84792
10358E12125k02505J06264k07212a04428m3689D14230A63050L93329o9787B22526
10347D66877p2474P7692j41343Q1905J24168G045K77312A26966J96033A38112
10336B98593b8732E02966a11030A8667d7978C073J20642d343E8735r267J97953
10325B47421a32117B66379b04937C30202A31609J76949C2331J19077J01792J56257
10315D09457b572l9981F1182B0215O2748R1495a13541m3994B40813a1860l5151
$$ plain form
10304 -47011 92399 297282 -8812 -140102 -175461 521097 426298 -147382 -133574 350494 175645
10293 175645 392057 -275187 251638 -31642 180611 -331779 146 -166891 -182066 -40006 -17447
10281 45229 -35892 56195 -99260 -94805 95056 -158586 -46584 -346057 120623 -95041 4800
10269 29978 -929 -178159 -34002 -104019 63537 5773 226514 219883 602796 376286 323957 435065
10257 435065 418401 662675 222689 209543 194577 -167298 36707 -130771 177293 -93068
10246 105350 39095 -115702 22960 81039 -65567 -92900 -430029 -208549 -17976 -288996 -302246
10235 -302246 228247 163123 -190387 429674 -69368 39085 -84056 -112659 56390 -176371 -73479
10223 -301911 53782 -39248 -240651 -42884 -281622 84181 -30302 -39767 -168023 -201625 -92636
$$ packed form
10304d7011I2399K04883h812j31290l5359E21097r4799a47382J3808C50494j74849
10293A75645K16412b75187B51638c1642A80611c31779A46a66891j5175d0006a7447
10281D5229c5892E6195i9260M455I5056a58586d6584k99473A20623i5041D800
10269B9978i29j77230c4002p0017F3537E773K20741o631L82913k26510n2329J11108
10257D35065j6664K44274B22689j3146j4966a67298C6707a30771A77293i3068
10246A05350C9095a15702B2960N8079f5567k7333l37129b08549a7976k71020j3250
10235c02246B28247o5124a90387D29674f9368C9085h4056k8603E6390a76371g3479
10223c01911E3782c9248k01403d2884k38738H4181c0302r465j28256l3602i2636
$$ plain form
10211 169913 -53178 130578 121539 143683 -153390 289589 -300054 8236 -260650 -481543 -193837
10199 140538 -89331 -52270 14634 139729 -265983 -18787 17250 -117269 -191735 -236627 -100142
10187 -164086 -84770 403489 42976 -309368 -15431 280070 -32028 55828 -115745 126218
10176 -247010 -117519 -279058 4647 -242276 -151684 -103566 26157 -284524 -208787 81780 210626
10165 210626 -246967 -60251 -17945 -7182 157566 -299401 -252800 -162860 -162617 -29272 -218922
10154 -218922 -30317 -53624 84924 110729 10155 -112293 10860 -211406 361658 -17175 44592
10142 -16418 -40025 -39292 -253784 -67146 21295 -207227 247473 -184065 -26068 -119180 325 -114396
10129 -201571 -199337 -282104 64317 81829 -221349 153799 -137089 -113086 -66344 -200924 -97336
$$ packed form
10211A69913e3178A30578r039K2144a53390B89589c00054H236b60650k20893a93837
10199A40538h9331L7061A4634J25095b65983a8787A7250a17269p4466m4892a00142
10187a64086P9316D03489D2976c09368a5431B80070c2028E5828a15745A26218
10176b47010a17519j61539D647b42276R0592M8118B6157b84524P5737H1780J28846
10165B10626b46967f0251a7945g182A57566b99401M6601Q9940K43b9272j89650
10154b18922c0317k3307H4924K5805A0155a12293A0860b11406C61658a7175D4592
10142a6418k3607P33k14492f7146B1295b07227B47473a84065b6068r3112C25a14396
10129b01571K234q2767F4317J7512b21349A53799a37089K4003M6742j34580i7336
$$ plain form
10117 104765 -129866 -428036 -352973 -40288 -46275 96339 -113493 -128191 57819 -206455 -210006
10106 -210006 118993 12028 -2278 -239950 -465578 124422 63427 -74837 -135534 -216904 -141709
10095 -141709 106542 -330099 70207 120813 191164 -601027 -333667 59985 -36835 -6456 119995
10083 27075 20085 -89073 -69249 6106 -117271 479337 29663 -19873 63925 124462 -93440 -89487
10071 -89487 -184432 -3044 -233042 38702 133869 -72860 127653 201847 -211383 65528 50240
10060 50240 73165 260017 25749 187347 -85451 -175856 -42559 -33883 -78787 -62253 -406130
10049 -406130 -63365 -39460 -173838 -78097 -309553 39391 138643 -108006 12382 -42371 -591625
10038 -591625 -169330 31002 -155386 106648 178842 173822 -88943 -239432 -39928 -321522 -99361
$$ packed form
10117A04765a29866k98170P5063d0288n987I6339a13493j4698E7819b06455l551
10106b10006A18993A2028b278k37672k25628A24422o0995g4837o0697q1370P5195
10095a41709A06542c30099G0207N0606P0351f01027K67360E9985c6835f456A19995
10083B7075o990h9073J9824F106a17271D79337B9663a9873F3925O0537i3440L953
10071h9487r4945c044k29998C8702R5167g2860A27653P4194b11383F5528j5288
10060E0240K2925J86852B5749J61598h5451r0405d2559Q676m4904J6534l43877
10049d06130f3365K3905j34378g8097k31456C9391R9252a08006A2382d2371n49254
10038e91625a69330C1002a55386A06648P2194n020h8943j50489c9928k81594i9361
$$ plain form
10026 318581 -79364 129189 -311828 -12531 90038 331010 -151584 54809 69766 -236441
10015 -37257 113373 -264469 110266 -56181 -164038 -171556 -87512 -115213 -72070 72467 -233360
10003 79525 -294795 -186327 -63100 -154453 -138115 201939 224746 -98504 139833 -427163 -214220
9992 -214220 -294387 -18356 24788 -79287 261931 120715 -237809 42602 -211342 -389885 10409
9980 -161402 14277 15752 212636 -67888 -196914 147686 -138946 149936 -425842 -147934
9969 -5763 -177757 170380 -392597 -78095 290816 45134 -15079 44027 99937 -173010 -209463
9958 -209463 -121272 -66430 -137366 -400943 140317 -55887 -117121 -389720 -292 -151817 100053
9946 -118326 -297213 -225995 -254618 -32014 -256630 226948 -133161 183747 -16323 -102235 -72704
$$ packed form
10026C18581g9364A29189c11828a2531I0038K40972a51584E4809J4957b36441
10015c7257A13373b64469A10266e6181j07857p518Q4044k7701M3143G2467b33360
10003G9525b94795J08468f3100r1353J6338B01939K2807i8504A39833d27163K12943
9992b14220q0167a8356B4788g9287B61931A20715b37809D2602b11342j78543A0409
9980a61402A4277J475J96884f7888j29026A47686a38946A49936d25842a47934
9969e763j71994A70380c92597g8095B90816D5134a5079D4027N5910a73010l6453
9958b09463Q8191N4842p0936k63577A40317e5887o1234k72599b92j51525A00053
9946a18326j78887P1218k8623c2014k24616B26948a33161A83747a6323q5912K9531
$$ plain form
9935 -72704 127096 108682 -82958 -175463 -7826 267238 -22595 63545 -7642 37108 -166418 2105
9922 -142911 21613 -200843 -325687 160889 173996 -133821 61253 339936 100185 49831
9911 -271885 -102549 -339221 -30540 -44833 -252136 -101382 -232537 261405 -59116 -202897
9901 -202897 224656 -128425 61636 -142927 -230354 103033 142931 8672 59906 -59874 200198
9889 -19376 -215435 35416 -51100 207542 -86725 -322636 -141777 -154984 -231577 -298806 3169
9877 -223728 21202 -82776 -198085 -120137 116851 -281356 -24591 -338100 -260334 -83392 -277391
9866 -277391 -310832 -17237 -182998 45758 -157626 136112 -10024 526352 -95935 113032 199561
9855 199561 -39373 -130953 -223970 140919 -178916 -48158 129533 90340 -14437 -115673 -182572
$$ packed form
9935g2704A27096j8414h2958r2505g826B67238b2595F3545g642C7108a66418B105
9922a42911B1613b00843j24844A60889J3107a33821F1253K78683A00185D9831
9911b71885a02549k36672c0540j4293k07303a01382j31155B61405e9116j43781
9901b02897B24656a28425F1636a42927q7427A03033L9898H672N1234e9874B00198
9889a9376j96059C5416e1100B07542h6725k35911a41777j3207p6593o7229C169
9877b23728B1202h2776j15309P7948A16851b81356b4591l13509P7766h3392j93999
9866b77391l3441a7237j65761D5758a57626A36112a0024E26352i5935A13032Q6529
9855A99561c9373r1580r3017A40919a78916d8158A29533l9193a4437j01236o6899
$$ plain form
9844 -182572 -29538 -79450 -132422 -127991 -105267 166790 -175606 311227 -255860 -34317 10340
9832 -63034 -30296 -72716 -9002 -389064 -225180 -281920 -173313 -281137 -125148 -30972 -68755
9821 -68755 -227884 -116915 -121723 -274298 -225604 -83822 197899 142026 -126258 -47853 -248499
9810 -248499 -70546 -88894 232975 115149 106886 -72631 -116634 53373 -286974 -29334 -203424
9799 -203424 86117 -300651 44091 181134 -87640 240071 -32146 -7036 42929 -236972 -18757
9787 48920 -2848 217050 -117098 174044 -332088 -330447 160765 -66621 92435 -118995 142895
9775 5997 100467 1236 -104486 -146760 -292175 -93480 -5935 -1464 106893 -215108 -9152 42539
9762 -408132 -134963 -99965 20036 60484 -320721 31773 -79207 -187971 -78252 -183554 -234548
$$ packed form
9844a82572b9538m9912n2972M431K2724A66790a75606C11227b55860c4317A0340
9832f3034c0296m2420i002l80062J63884n6740J08607j07824a25148c0972l7783
9821f8755j59129J10969m808j52575M8694h3822A97899n5873a26258d7853k00646
9810b48499g0546j8348B32975A15149q263g2631m4003E3373b86974b9334j74090
9799b03424H6117c00651D4091J37043h7640B40071c2146g036D2929b36972a8757
9787D8920b848B17050a17098A74044c32088J641A60765f6621I2435a18995A42895
9775E997R4470A236a04486m2274j45415i3480e935a464A06893b15108i152D2539
9762d08132a34963L4998B0036M0448c20721C1773g9207j08764g8252j05302n0994
$$ plain form
9751 -234548 -42729 -171412 -104994 -27135 -432511 -197644 -175233 -136385 -498525 116341 -43570
9739 205967 -58289 -159708 54760 106947 -119034 25063 -88534 -285518 30118 3106 -91754
9727 14548 -41118 6370 -92717 -236272 -139484 -67897 189962 -89006 39886 -42194 -37546 -162221
9715 -162221 264052 -301928 -263518 -33330 -15079 60894 -131825 -405690 -80437 -71397 92420
9703 284194 -114747 -141613 -173987 -64208 -256478 -164393 120376 -28556 30036 -285845 43121
9691 240848 72952 -116382 -30351 -115191 427398 -23884 2310 -47544 108122 23227 -67197
9679 -31552 -8406 132862 -73745 -8161 -85210 61043 -75199 -280710 -31617 144875 -6016 42584
9666 -61092 -62127 -313259 -127196 -7198 -131655 -46773 -247891 -230848 -306696 -206698 -370865
$$ packed form
9751b34548d2729j28683O6418b7135m05376a97644K2411L8848l62140A16341d3570
9739B05967e8289j01419E4760N2187a19034B5063h8534j96984C0118C106i1754
9727A4548d1118F370i2717j43555R6788f7897A89962h9006C9886d2194M648j24675
9715a62221B64052c01928L8410c3330a5079F0894a31825k73865h0437R040I2420
9703B84194a14747k6866l2374f4208j92270R2085A20376b8556C0036b85845D3121
9691B40848G2952a16382c0351q4840D27398b3884B310d7544A08122B3227f7197
9679c1552h406A32862g3745h161p7049F1043g5199k05511c1617A44875f016D2584
9666f1092j035k51132a27196g198j24457d6773k01118J7043p5848R9998j64167
$$ plain form
9655 -370865 2269 -120935 -87020 76431 90795 81517 357020 152248 -320030 -28180 -186125
9644 -186125 -338114 28895 -313904 20111 418074 -307337 186765 -322761 -173342 -366993
9634 -366993 -492239 -38587 -8829 -301340 -20939 -76464 3058 -12396 126882 241582 373052
9623 373052 186923 -42842 -197372 -7835 -341523 48443 -338996 -21528 23781 145918 504413
9612 504413 175858 204197 -238845 -197351 -56382 17797 -436389 -57642 -25122 -84844 279824
9600 70794 -73495 -61097 125022 -356072 24475 -101443 -235196 181444 -234047 203157
9589 -278651 149164 57096 -191420 155323 -253100 35188 21843 -225045 57746 26122 149657
9578 149657 -260392 59604 130131 -246122 13933 -270494 121893 10776 -317996 -11647 -130673
$$ packed form
9655c70865B269a20935L3915G6431J4364r278K75503A52248c20030b8180j57945
9644a86125j51989B8895c13904B0111L97963c07337A86765c22761J49419j93651
9634c66993j25246c8587h829k92511b0939n5525C058a2396A26882J14700J31470
9623C73052j86129d2842j54530g835l33688D8443c38996b1528B3781J22137L58495
9612E04413A75858K8339b38845M1494e6382A7797d36389e7642b5122n9722B79824
9600G0794g3495J2398A25022c56072B4475a01443j33753A81444b34047B03157
9589b78651A49164E7096a91420A55323b53100C5188j3345b25045E7746B6122J23535
9578A49657b60392E9604P0527b46122A3933b70494A21893A0776c17996a1647j19026
$$ plain form
9567 -130673 -215693 -389505 238162 223835 95874 132749 -247805 -168718 -127325 -241652 -182856
9556 -182856 -135882 79792 -226203 -167382 29893 -32824 98422 184334 166267 -88390 -183721
9545 -183721 -162148 17058 -61106 230340 -219950 -122827 -120139 186849 -190282 180247 -62446
9533 83406 -129199 30670 -64502 -457048 -230545 -91526 103843 -7290 160302 -36952 -107149
9522 -107149 94113 -80059 52561 -207280 94924 -234485 103650 -168139 -118949 201072 -186700
9510 -449760 222148 -86213 -7540 -28749 -255257 -60875 -92162 41370 170 -13418 -11505 62614
9497 -116319 -84925 167877 199767 -216695 166313 -293669 -225593 -14677 -68411 222076 -3036
9485 -119283 -167632 -273219 16852 -110279 -182573 -103977 42853 -141302 -119302 13690 -29533
$$ packed form
9567a30673q5020j73812B38162j4327I5874L6875b47805P9087M1393j14327N8796
9556a82856M6974G9792b26203N8821B9893c2824I8422Q5912j8067h8390r5331
9545a83721K1573A7058f1106B30340b19950R7123K688A86849a90282A80247f2446
9533H3406a29199C0670f4502l92546K26503i1526A03843g290A60302c6952p0197
9522a07149I4113h0059E2561b07280I4924b34485A03650a68139M9190B01072a86700
9510d49760B22148h6213g540k1209k26508f0875l1287D1370A70a3418J913F2614
9497a16319L1394A67877L1890b16695A66313b93669O8076a4677n3734B22076c036
9485a19283m8349j05587A6852a10279p2294P8596D2853a41302K2000A3690b9533
$$ plain form
9473 -157365 23152 -231744 228626 171352 -62382 -169268 189352 -132235 -77436 201598
9462 154668 -19745 -268986 -112845 10636 36746 -423537 -294439 -208353 110710 156186 -21218
9450 -124490 -12464 96148 53231 -55256 -198850 68515 87125 247506 -64121 -223989 147425
9438 -57833 38356 -86690 23496 -112195 -155977 -425375 -179507 79594 -285641 -397628 -31563
9426 -268931 96072 -161735 49775 -281124 -5223 157918 -199614 36045 -76341 -310293 147639
9414 26748 123759 144080 -72827 148508 -74645 9890 -110855 24602 -53492 30732 308424
9403 308424 -30582 -214735 -216973 -503254 -526963 223494 94848 -177729 -41755 -100050 -734201
9392 -734201 252739 -40666 -173066 105081 -70286 -144967 -21163 301244 -243775 225376
$$ packed form
9473a57365B3152b31744B28626n7274f2382j06886A89352a32235N4799B01598
9462A54668a9745k49241a12845A0636K6110d23537J29098Q6086A10710M5476b1218
9450a24490a2464I6148m2917e5256j43594F8515J8610J60381f4121j59868A47425
9438e7833C8356h6690B3496a12195m3782k69398a79507G9594b85641j11987c1563
9426b68931I6072a61735D9775b81124e223A57918a99614C6045g6341k33952A47639
9414B6748R7011K0321g2827A48508g4645I890a10855B4602e3492C0732K77692
9403C08424c0582j84153k238k86281k3709B23494I4848a77729d1755n8295o34151
9392g34201B52739d0666j32400A05081g0286p4681b1163C01244b43775B25376
$$ plain form
9381 -227431 -279961 209876 -57913 -121318 -93780 -106042 -343601 -55402 -157428 -213696 -94167
9369 299106 -243463 -29404 -123134 3789 -91750 61423 327675 88534 -10524 -184892 -172743
9358 -172743 -76647 -139278 -164172 -313463 91570 -215948 -250422 123133 -138784 34858 -115956
9346 233374 -266850 -529518 49564 -100378 -47173 294208 141636 -25518 -113221 -101975 67021
9334 296193 -91937 -76682 -50151 -200209 -171795 33419 -71227 -513329 247189 -42318 214356
9322 -416031 -10928 91471 -164603 76056 73923 -269661 -12480 -372327 -339262 -7810 148420
9310 -178199 -120710 219599 -146779 -218842 -80910 45031 -377646 148532 -6153 -58518 -175108
9299 -175108 -78845 150419 -128698 -184580 -125259 -211437 154197 202144 162872 -122876 -95739
$$ packed form
9381b27431n2530B09876e7913o3405K7538j2262k37559e5402j02026n6268i4167
9369B99106b43463b9404r3730C789i1750F1423K66252H8534a0524j74368J2149
9358a72743g6647o2631k4894j49291I1570b15948l4474A23133a38784C4858a15956
9346B33374b66850k62668D9564a00378d7173B94208A41636b5518q7703J1246F7021
9334B96193i1937J5255K6531j50058K8414C3419g1227m42102B47189d2318B14356
9322d16031a0928I1471a64603G6056k133b69661a2480l59847L3065g810A48420
9310a78199N7489B19599a46779p2063h0910D5031c77646A48532f153n2365j16590
9299a75108g8845A50419a28698n5882N9321q6178A54197M7947l9272a22876K7137
$$ plain form
9288 -95739 -93908 -109303 290900 47161 -29418 -119786 -124796 -256226 30606 -130951 -190599 -34925
9275 -321699 -172440 -55364 65194 -40604 22697 209380 -81582 11186 98826 -280595 -193070
9264 -193070 -144376 89959 -76195 -47402 -18914 -213752 -44470 114800 88962 -231406 100078
9252 -117779 -21079 -30746 -64008 263741 392792 99599 -106769 143753 51444 -3530 -18643
9241 -18643 -36526 -264990 -173336 130080 99594 -75367 -212746 -89474 71579 -7484 -104892
9230 -104892 95024 -45770 87091 186293 97003 -211599 -408707 -91661 38088 181530 52516
9218 -72221 -32666 -158731 -26376 13516 -603219 28157 108421 -92640 -123674 -143139 -263327
9207 -263327 43034 -318207 160315 -102025 -214853 -363840 102848 104388 -60883 95681 119711
$$ packed form
9288i5739J831j5395B90900D7161b9418r0368n010j31430C0606a30951n9648c4925
9275c21699J49259e5364F5194d0604B2697J86683h1582A1186Q7640b80595Q7525
9264a93070M8694H9959g6195K8793a8914j94838d4470A14800k5838b31406A00078
9252a17779b1079r667l3262B63741J29051I9599a06769A43753E1444c530j5113
9241a8643j7883k28464R1654A30080l0486g5367j37379h9474G1579g484r7408
9230a04892I5024d5770H7091R9202q9290b11599j97108i1661C8088J43442E2516
9218g2221c2666j26065b6376A3516f03219B8157Q0264i2640l1034j9465j20188
9207b63327D3034c18207A60315a02025j12828j48987A02848J540f0883I5681K4030
$$ plain form
9196 119711 271650 -128776 -41893 75621 -366003 -70085 105933 -49781 -132588 -216968 -29841
9184 -9992 -176369 242665 -235849 70247 -52587 -20650 -2834 80810 78026 -77344 212244 -165718
9171 -114364 162838 53766 -230849 -220294 251190 -150722 -74523 -153806 -134872 -323305 -182788
9160 -182788 68331 -44805 322867 65773 -237160 -83674 -230031 -321926 -69482 26384 -98336
9148 -27420 28218 -160704 -306258 -119822 -238743 -79872 -74090 132931 -372899 -163042 -95734
9137 -95734 75825 67713 -257186 -189159 -319808 -261285 -200473 -64653 -160426 168601 -334741
9125 74107 -194666 48313 -231317 -328271 -327405 214808 -120018 -34713 18988 -92076 -188379
9114 -188379 -229270 -399932 82276 -96184 -19151 139917 -252784 -248203 -14210 180795 17277
$$ packed form
9196A19711J51939a28776d1893G5621c66003g0085A05933d9781q2807q4380b9841
9184i992j66377B42665b35849G0247e2587b0650b834H0810k784g7344B12244a65718
9171a14364A62838E3766b30849J0555B51190a50722g4523p9283J8934j88433J40517
9160a82788F8331d4805C22867F5773b37160h3674j46357r1895f9482B6384i8336
9148b7420B8218a60704j45554a19822j18921g9872N782A32931c72899a63042O7308
9137i5734G5825q112b57186O8027j30649N8523O0812f4653r5773A68601c34741
9125G4107a94666D8313b31317r6954Q66B14808a20018c4713A8988i2076r6303
9114a88379m0891j70662H2276i6184a9151A39917b52784M581a4210A80795A7277
$$ plain form
9102 47499 205576 -194892 142825 -146360 -262104 23593 20294 -96535 -80344 47593 -77885
9090 62287 -316640 39856 -287397 316632 131279 28014 344524 104539 -85279 12953 -344608
9078 -227815 -72840 -6150 87214 243840 -230773 -122054 537 -233587 99552 -165835 277386
9066 -176701 -245644 -247582 -200269 70664 100605 206303 86868 251357 -291300 178210 -322942
9054 -311398 -200987 -245567 138456 -16327 -245443 30686 -149420 129710 -94634 30600 -34183
9042 125927 36990 378653 15793 123430 -222724 -149186 77988 33130 -1862 234776 8661
9030 -78844 86158 -3856 -186982 -223746 83065 107758 -117031 -110251 -291120 131683 -172277
9018 216452 -86272 -148996 301278 244867 -61141 142537 64902 -154838 -230240 -51380 -87631
$$ packed form
9102D7499J58077a94892A42825a46360j15744B3593l299i6535J6191D7593g7885
9090F2287c16640C9856b87397C16632A31279B8014L16510A04539h5279A2953c44608
9078b27815g2840f150H7214J56626b30773J08719E37b33587I9552a65835B77386
9066a76701o8943j938M7313G0664K9941J05698H6868J64489b91300A78210c22942
9054c11398J10411m4580A38456a6327k29116C0686a49420A29710i4634C0600c4183
9042A25927C6990L41663A5793J07637b22724P3538G7988C3130a862B34776H661
9030g8844H6158c856j83126l6764H3065K4693a17031O780j80869A31683a72277
9018B16452h6272o2724C01278n6411f1141A42537F4902a54838p5402e1380l6251
$$ plain form
9007 -87631 -100353 -58550 -106937 166244 -448137 -110892 58364 -258618 -71370 -184130 59566
8995 -87165 -28923 -126611 -419704 -18657 -259345 -64139 311106 -89540 -32442 -35601 -207810
8984 -207810 -185752 15567 -888 43167 -222956 167567 -194743 -145113 -329312 -312507 -284143
8973 -284143 279768 -294715 253253 359427 -157999 -389609 -72799 41955 -91919 262623
8962 -83138 -304785 -217465 -185036 27548 -291932 173721 -305430 228627 -176541 29251 -322512
8950 -121050 -337775 -72423 -111660 185405 -54600 -309869 -73345 -137287 -187317 -188848 -111149
8939 -111149 -53791 -92950 -123970 58575 143802 -6758 -148012 20092 142812 -159365 32444
8927 354264 -1058 306181 124496 967556 3987091 12925260 8891185 1797358 897906
$$ packed form
9007h7631j2722M1803m8387A66244d48137a10892E8364b58618g1370j12760E9566
8995h7165b8923r7688k93093a8657k40688f4139C11106h9540c2442l159j72209
8984b07810K2058A5567h88D3167b22956A67567a94743M9630j84199J6805K8364
8973b84143B79768b94715B53253J06174a57999k31610g2799D1955i1919B62623
8962h3138k21647Q7320L2429B7548b91932A73721c05430B28627a76541B9251c22512
8950a21050k16725g2423l9237A85405e4600k55269g3345o3942n0030j531P7699
8939a11149e3791l9159l1020E8575Q5227f758j41254B0092J22720a59365C2444
8927C54264a058C06181A24496Q43060L019535Q938169m034075A797358H97906
$$ plain form
8917 373013 654918 96502 23490 73975 -37700 205981 78241 474989 102532 296907 94660
8905 -29641 -22353 97427 290104 -121357 -213788 -11820 -153135 -281688 -433365 62219 -163227
8893 -499794 -155978 327965 -169310 180912 -23566 42827 183745 -319191 128320 -68684
8882 -35477 44605 140419 -112146 -85101 191644 -312496 272071 125515 -119097 -260006
8872 -260006 -96510 -99261 -48651 201895 -171747 145321 55028 -132900 -179808 -269040 143890
$$ packed form
8917C73013K81905I6502B3490N0485c7700B05981G8241L96748A02532J94375I4660
8905b9641P288I7427J92677a21357r2431a1820j41315j28553j51677F2219a63227
8893d99794a55978C27965a69310A80912b3566D2827J40918c19191A28320f8684
8882c5477D4605R5814a12146K7045A91644c12496B72071A25515a19097j40909
8872b60006i6510k751d8651B01895a71747A45321E5028a32900m6908q9232A43890
$$ [...]
##END NTUPLES=NMR SPECTRUM
##END=
