##TITLE=AC1618_BRASL13349_8325911_0QAOxiUdGU
##JCAMPDX= 6.0         $$ Bruker NMR JCAMP-DX V2.0
##DATA TYPE= NMR SPECTRUM
##DATA CLASS= NTUPLES
##ORIGIN= BRUKER
##OWNER= Administrator
$$ 1.72 TOPSPIN		Version 2.1
$$ 2013-11-13 19:33:13.018 -0800  Administrator@X
$$ Compression mode = diff/dup
##.OBSERVE FREQUENCY= 400.02188249412
##.OBSERVE NUCLEUS= ^1H
##.ACQUISITION MODE= SIMULTANEOUS (DQD)
##.ACQUISITION SCHEME= undefined
##.AVERAGES= 64
##.DIGITISER RES= 22
##SPECTROMETER/DATA SYSTEM= spect
##.PULSE SEQUENCE= noesygpps1d.comp
##.SOLVENT NAME= COFFEE_meoh
##.SHIFT REFERENCE= INTERNAL, COFFEE_meoh, 1, 14.96079
##AUDIT TRAIL= $$ (NUMBER, WHEN, WHO, WHERE, PROCESS, VERSION, WHAT)
$$ ##TITLE= Audit trail, TOPSPIN		Version 2.1
$$ ##JCAMPDX= 5.01
$$ ##ORIGIN= Bruker BioSpin GmbH
$$ ##OWNER= Administrator
$$ $$ E:\/data/COFFEE/nmr/AC1618_BRASL13349_8325911_0QAOxiUdGU/12/pdata/1/auditp.txt
$$ ##AUDIT TRAIL=  $$ (NUMBER, WHEN, WHO, WHERE, PROCESS, VERSION, WHAT)
(   1,<2013-11-13 19:33:06.831 -0800>,<Administrator>,<X>,<go>,<TOPSPIN 2.1>,
      <created by zg
	started at 2013-11-13 19:21:35.735 -0800,
	POWCHK enabled, PULCHK disabled,
       configuration hash MD5:
       C8 4E 4E 5D D3 5C D8 9E 9F 52 82 E0 59 8A DE 15
       data hash MD5: 64K
       5E C3 4E 1C 6A DE B7 97 8B 35 E0 C7 2C F0 34 01>)
(   2,<2013-11-13 19:33:10.487 -0800>,<Administrator>,<X>,<proc1d>,<TOPSPIN 2.1>,
      <Start of raw data processing
       efp LB = 0.3 FT_mod = 6 PKNL = 1 PHC0 = 0 PHC1 = 0 SI = 128K 
       data hash MD5: 128K
       71 27 3F 5D 71 27 A3 64 50 C8 B6 E8 FE E7 70 14>)
(   3,<2013-11-13 19:33:11.753 -0800>,<Administrator>,<X>,<proc1d>,<TOPSPIN 2.1>,
      <pk PHC0 = -84.35303 PHC1 = 0 
       data hash MD5: 128K
       C4 02 54 A7 BB D9 AD 57 0F 0D D5 A0 86 23 5C 0C>)
(   4,<2013-11-13 19:33:12.221 -0800>,<Administrator>,<X>,<proc1d>,<TOPSPIN 2.1>,
      <abs ABSG = 1 
       data hash MD5: 128K
       EF 2B 8E D2 6E 33 7B 43 C2 99 5D F0 CA 58 EF 21>)
(   5,<2013-11-13 19:33:12.331 -0800>,<Administrator>,<X>,<proc1d>,<TOPSPIN 2.1>,
      <abs ABSG = 2 
       data hash MD5: 128K
       0D 81 96 67 2F 3E C8 BE 8A 59 8B C4 A0 3A A5 6F>)
(   6,<2013-11-13 19:33:12.409 -0800>,<Administrator>,<X>,<proc1d>,<TOPSPIN 2.1>,
      <abs ABSG = 3 
       data hash MD5: 128K
       A1 51 3F ED 94 19 06 15 BB DA FC 06 0E DB BF 8C>)
(   7,<2013-11-13 19:33:12.534 -0800>,<Administrator>,<X>,<proc1d>,<TOPSPIN 2.1>,
      <abs ABSG = 4 
       data hash MD5: 128K
       73 72 49 3C FC DA 0A A2 FE 9A 64 6D 62 4B 27 D9>)
(   8,<2013-11-13 19:33:12.674 -0800>,<Administrator>,<X>,<proc1d>,<TOPSPIN 2.1>,
      <abs ABSG = 5 
       data hash MD5: 128K
       20 F7 78 8B 36 5D D9 11 0A E0 74 87 25 9C 21 B0>)
$$ ##END=
$$ 
$$ $$ hash MD5
$$ $$ 5A 26 F4 2B 53 9E 3A 64 D2 3C D7 18 9A 3E FD 79
##$RELAX= 
##$RELAX= 
##$RELAX= 
##$RELAX= 
##$RELAX= 
##$RELAX= 
##$RELAX= 
##$RELAX= 
$$ Bruker specific parameters
$$ --------------------------
##$DU= <E:\>
##$EXPNO= 12
$$ [...]
##$TP07= 0
##$TPNAME0= <>
##$TPNAME1= <>
##$TPNAME2= <>
##$TPNAME3= <>
##$TPNAME4= <>
##$TPNAME5= <>
##$TPNAME6= <>
##$TPNAME7= <>
##$TPOAL= (0..7)
0.5 0.5 0.5 0.5 0.5 0.5 0.5 0.5
##$TPOFFS= (0..7)
0 0 0 0 0 0 0 0
##$TUNHIN= 0
##$TUNHOUT= 0
##$TUNXOUT= 0
##$USERA1= <user>
##$USERA2= <user>
##$USERA3= <user>
##$USERA4= <user>
##$USERA5= <user>
##$V9= 5
##$VALIST= <valist>
##$VCLIST= <CCCCCCCCCCCCCCC>
##$VD= 0
##$VDLIST= <DDDDDDDDDDDDDDD>
##$VPLIST= <PPPPPPPPPPPPPPP>
##$VTLIST= <TTTTTTTTTTTTTTT>
##$WBST= 1024
##$WBSW= 4
##$XGAIN= (0..3)
0 0 0 0
##$XL= 0
##$YL= 0
##$YMAX_a= 6127544
##$YMIN_a= -12972088
##$ZGOPTNS= <>
##$ZL1= 120
##$ZL2= 120
##$ZL3= 120
##$ZL4= 120
##$ABSF1= 14.96079
##$ABSF2= -5.597392
##$ABSG= 5
##$ABSL= 3
##$ALPHA= 0
##$AQORDER= 0
##$ASSFAC= 0
##$ASSFACI= 0
##$ASSFACX= 0
##$ASSWID= 0
##$AUNMP= <proc_prof1d_extract.lims>
##$AXLEFT= 0
##$AXNAME= <>
##$AXNUC= <1H>
##$AXRIGHT= 0
##$AXTYPE= 0
##$AXUNIT= <>
##$AZFE= 0.1
##$AZFW= 0.1
##$BCFW= 0
##$BC_mod= 0
##$BYTORDP= 0
##$COROFFS= 0
##$CY= 15
##$DATMOD= 1
##$DC= 0
##$DFILT= <>
##$DTYPP= 0
##$F1P= 0
##$F2P= 0
##$FCOR= 0.5
##$FTSIZE= 131072
##$FT_mod= 6
##$GAMMA= 0
##$GB= 0
##$INTBC= 1
##$INTSCL= 1
##$ISEN= 128
##$LB= 0.3
##$LEV0= 0
##$LPBIN= 0
##$MAXI= 10000
##$MC2= 0
##$MEAN= 0
##$ME_mod= 0
##$MI= 0
##$NCOEF= 0
##$NC_proc= -2
##$NLEV= 6
##$NOISF1= 0
##$NOISF2= 0
##$NSP= 0
##$NTH_PI= 0
##$NZP= 0
##$OFFSET= 14.96079
##$PC= 1
##$PHC0= -84.35303
##$PHC1= 0
##$PH_mod= 1
##$PKNL= yes
##$PPARMOD= 0
##$PPDIAG= 0
##$PPIPTYP= 0
##$PPMPNUM= 2147483647
##$PPRESOL= 1
##$PSCAL= 4
##$PSIGN= 0
##$PYNMP= <proc.py>
##$REVERSE= no
##$SF= 400.020009720553
##$SI= 131072
##$SIGF1= 0
##$SIGF2= 0
##$SINO= 400
##$SIOLD= 131072
##$SPECTYP= <>
##$SREGLST= <1H.CDCl3>
##$SSB= 0
##$STSI= 131072
##$STSR= 0
##$SW_p= 8223.68421052631
##$SYMM= 0
##$S_DEV= 0
##$TDeff= 65536
##$TDoff= 0
##$TI= <>
##$TILT= no
##$TM1= 0
##$TM2= 0
##$TOPLEV= 0
##$USERP1= <user>
##$USERP2= <user>
##$USERP3= <user>
##$USERP4= <user>
##$USERP5= <user>
##$WDW= 1
##$XDIM= 131072
##$YMAX_p= 404717991
##$YMIN_p= -10889
##$CURPLOT= <Network HP LaserJet P1505>
##$CURPRIN= <$Network HP LaserJet P1505>
##$DFORMAT= <normdp>
##$LAYOUT= <+/1D_H.xwp>
##$LFORMAT= <normlp>
##$PFORMAT= <normpl>
##$SURQMSG= 1
$$ End of Bruker specific parameters
$$ ---------------------------------
##NTUPLES= NMR SPECTRUM
##VAR_NAME=  FREQUENCY,     SPECTRUM/REAL,   SPECTRUM/IMAG
##SYMBOL=    X,             R,               I
##VAR_TYPE=  INDEPENDENT,   DEPENDENT,       DEPENDENT
##VAR_FORM=  AFFN,          ASDF,            ASDF
##VAR_DIM=   131072,        131072,          131072
##UNITS=     HZ,            ARBITRARY UNITS, ARBITRARY UNITS
##FACTOR=    0.0627417313425164, 1,          1
##FIRST=     8223.62146879497, 2678,         -65175
##LAST=      0,             4660,            -64445
##MIN=       0,             -10889,          0
##MAX=       8223.62146879497, 404717991,    0
$$ Real data points
##PAGE= N=1
##DATA TABLE= (X++(R..R)), XYDATA
$$ [...]
63910C100625k52205k31645k10566j89809j69695j50798j33839j18801j04954
63901A538313r1903q0037o9766o0925n3184m6503m0931l6416l3036l0970k9951
63890I64691k9173k8086k6880k5898k5018k4046k3157k2391k1108j8644j5363
63879G04927j2278r712p059l928p85J808M020O362Q874J1154J2970J4410J5610
63866G46373J6685J7799J8930J9587J9188J7819J6195J4747J3148J1057Q884P253
63854I27665N912L914R88j933l949n393p249r777j2355j4526j6485j8471k0334
63841H28007k1881k3152k4183k4919k5591k6621k7892k8524k7850k6246k4629
63830E46519k3389k2285k1096j9799j8270j6365j4394j2977j2288j1781j0921
$$ y = [3100625, 2848420, 2616775, 2406209, 2216400, 2046705, 1895907, 1762068, 1643267, 1538313, 1446410, 1366373, 1296607, 1235682, 1182498, 1135995, 1095064, 1058648, 1025612, 994642, 964691, 935518, 907432, 880552, 854654, 829636, 805590, 782433, 760042, 738934, 720290, 704927, 692649, 682937, 675878, 671950, 671165, 672973, 676993, 683355, 692229, 703383, 716353, 730763, 746373, 763058, 780857, 799787, 819374, 838562, 856381, 872576, 887323, 900471, 911528, 920412, 927665, 933577, 937491, 938479, 936546, 932597, 927204, 919955, 910178, 897823, 883297, 866812, 848341, 828007, 806126, 782974, 758791, 733872, 708281, 681660, 653768, 625244, 597394, 571148, 546519, 523130, 500845, 479749, 459950, 441680, 425315, 410921, 397944, 385656, 373875, 362954]
63819C62954r832r068q852q829q506p748o835o093n583n108m453l527k382j198
63805B74940k98K2k37q10j427j991k454k809l152l513l614l146k350j933k182
63790B45046k631k780k701k604k260j451n92l13n97r17j069j237j350j147q77
63775B22520j104j671j677q23l2j61p39p35j12K33j12n75n73k77q2O0M01Q20R34
63756B16295O13K6o75j359j638j052K64J365J320K66o58n18M77J392J701J723
63740B19542J914K159K054J634J432J830K600L313L790L996L711K781J629J091
63726B53476J526K420L086L469L924M447M632M371M062L956L713K955J899J086
63712B99022O17J26n46j094j283j396j855k563k947k648j925j294r43p02m21j25
$$ y = [362954, 353122, 344054, 335202, 326373, 317867, 310119, 303284, 297191, 291608, 286500, 282047, 278520, 276138, 274940, 274642, 274664, 274427, 273617, 272190, 270199, 267745, 264936, 261784, 258271, 254657, 251511, 249161, 247228, 245046, 242415, 239635, 236934, 234330, 232070, 230619, 230027, 229714, 229117, 228200, 227131, 225894, 224544, 223397, 222520, 221416, 219745, 218068, 217245, 217213, 217052, 216313, 215578, 215466, 215699, 215587, 215012, 214439, 214162, 214080, 214140, 214541, 215361, 216295, 216908, 216934, 216259, 214900, 213262, 212210, 212474, 213839, 215159, 215425, 214767, 214249, 214726, 216118, 217819, 219542, 221456, 223615, 225669, 227303, 228735, 230565, 233165, 236478, 240268, 244264, 247975, 250756, 252385, 253476, 255002, 257422, 260508, 263977, 267901, 272348, 276980, 281351, 285413, 289369, 293082, 296037, 297936, 299022, 299639, 299765, 299219, 298125, 296842, 295446, 293591, 291028, 288081, 285433, 283508, 282214, 281271, 280569, 280148, 280023]
63696B80023K33Q91J955L156M061M458M389L956L346K888K727K492J690M07o87
63681C15985j173j321j524j669j365o16P6K07k33p44p07K5R26J372J423J693K386
63664C14741K896K589J558L29q20j829k558k997l534m453n335n476m812l977l469
63649B82853l287l278l365l310k792j862r10j29O25J345J742J739J637J593J349
63634B73950Q15M96R30J933K832L304L598M015M479M771M933N296O131P344Q508
63619C33335R280R665R917J0232J0759J1718J3235J5045J6608J7658J8487J9672
63607D95611K1621K4268K6923K8528K8388K6730K4237K1145J7181J2370P308K552
63595G36862j678m968o632o690o335o779p943q966r685j0822j2770j5068j7156
$$ y = [280023, 280256, 281147, 283102, 286258, 290319, 294777, 299166, 303122, 306468, 309356, 312083, 314575, 316265, 316672, 315985, 314812, 313491, 311967, 310298, 308933, 308317, 308393, 308600, 308367, 307623, 306916, 306941, 307867, 309239, 310662, 312355, 314741, 317637, 320226, 321784, 322113, 321293, 319464, 316906, 313909, 310375, 305922, 300587, 295111, 290299, 286322, 282853, 279566, 276288, 272923, 269613, 266821, 264959, 264049, 263920, 264545, 265890, 267632, 269371, 271008, 272601, 273950, 274765, 275261, 276191, 278124, 280956, 284260, 287858, 291873, 296352, 301123, 306056, 311352, 317483, 324827, 333335, 342615, 352280, 362197, 372429, 383188, 394906, 408141, 423186, 439794, 457452, 475939, 495611, 517232, 541500, 568423, 596951, 625339, 652069, 676306, 697451, 714632, 727002, 734310, 736862, 735184, 730216, 723584, 716894, 710559, 703780, 695837, 686871, 677186, 666364, 653594, 638526, 621370]
63582F21370j8931k0294k0763k0025j8471j6795j5327j3974j2532j0799q698o527
63570D38234m793l497j940K91K498L543L254K619K653L534M794N825O089N444
63556D68548M503M346N487P471R595J1690J3935J6341J8833K1523K4506K7630
63544F34408L0779L4020L6924L7973L5452K9082K0366J1321L296l019p221r299
63532H54082r763r280q255o954n836n610o916r894j3885j7747k0828k3475k6263
63519F89376k8862l0266l0100k8975k7492k5602k3174k0552j8145j6065j4423
63508D25720j3344j2379j0698q361o594o158o194n543m462l978m075l790k867
63495C37277k057j721j294l79N75R99Q66M01j68m34o3N51O51L13M58J415K373
$$ y = [621370, 602439, 582145, 561382, 541357, 522886, 506091, 490764, 476790, 464258, 453459, 444761, 438234, 433441, 429944, 428004, 428295, 430793, 434336, 437590, 440209, 442862, 446396, 451190, 457015, 463104, 468548, 473051, 477397, 482884, 490355, 499950, 511640, 525575, 541916, 560749, 582272, 606778, 634408, 665187, 699207, 736131, 774104, 809556, 838638, 859004, 870325, 873621, 870602, 863381, 854082, 844319, 835039, 826784, 819830, 813994, 808384, 801468, 791574, 777689, 759942, 739114, 715639, 689376, 660514, 630248, 600148, 571173, 543681, 518079, 494905, 474353, 456208, 440143, 425720, 412376, 399997, 389299, 380938, 374344, 368186, 361992, 356449, 351987, 348009, 343934, 340144, 337277, 335220, 333499, 332205, 331826, 332401, 333400, 334266, 334667, 334499, 334065, 334002, 334553, 335204, 335517, 335975, 337390, 339763]
63478C39763K657K711L179L713L483K408J192L84k7l31q49j821l112m217m791
63463C44342m880m477l397j940j087j375k027j817o66L85O00L34L56R03J647K218
63447C29119K596L072L871M794N343N341N201N414O005O719P534Q711J0495J2988
63433D17203J6158J9690K2937K5198K5960K4933K2128J8095J3790J0047P308N867
63421F29314N923P253R378J2235J6110K0728K4979K8074L0293L2034L2659L1083
63409H80063K7108K1489J4993Q162J741l481p206r449j0096r386q523q868j0526
63396H86021j2616j4812j7669k1313k4843k7349k8730k9152k8618k7470k6445
63385F27004k5681k4409k2198j9838j8183j6776j4515j1372q438o395m703k536
$$ y = [339763, 342420, 345131, 348310, 352023, 355506, 357914, 359106, 359490, 359463, 359132, 358283, 356462, 353350, 349133, 344342, 339462, 334985, 331588, 329648, 328561, 327186, 325159, 323342, 322676, 323061, 323661, 323995, 324351, 325254, 326901, 329119, 331715, 334787, 338658, 343452, 348795, 354136, 359337, 364751, 370756, 377475, 385009, 393720, 404215, 417203, 433361, 453051, 475988, 501186, 527146, 552079, 574207, 592302, 606092, 616139, 623447, 629314, 635237, 642490, 651868, 664103, 680213, 700941, 725920, 753994, 784287, 816321, 848980, 880063, 907171, 928660, 943653, 951815, 953556, 950075, 942869, 933420, 923324, 913938, 905415, 896547, 886021, 873405, 858593, 840924, 819611, 794768, 767419, 738689, 709537, 680919, 653449, 627004, 601323, 576914, 554716, 534878, 516695, 499919, 485404, 474032, 465594, 459199, 454496, 451960]
63373D51960J42K642M312N066N357N823O813Q189R613J0876J1912J2780J3795
63360E49280J5387J7548J9730K1596K3558K6114K8916L1069L2170L2436L1816
63349H29620K9688K5634K0010J3539O858P23l922o633q014r077j0203j1099j1582
63336H65542j1995j2815j4306j6578j9638k3111k6159k7918k8071k6924k5058
63325F32969k2923k0653j8176j5519j2906j0432p788m713j803m35j539m561q013
63312E03508j0906j3258j5254j6459j6158j4296j1699r443q067p360o710n681
63300C68217m318k984j954j215o86m00l79m93n95p53j114j611k009k303k805l678
63284C40920m511m666m041l191k612k111j226j08M58M0q11j179q09j48M41J046
$$ y = [451960, 452102, 454744, 459056, 464122, 469479, 475302, 482115, 490304, 499917, 510793, 522705, 535485, 549280, 564667, 582215, 601945, 623541, 647099, 673213, 702129, 733198, 765368, 797804, 829620, 859308, 884942, 904952, 918491, 925349, 926072, 922150, 915517, 907503, 898426, 888223, 877124, 865542, 853547, 840732, 826426, 809848, 790210, 767099, 740940, 713022, 684951, 658027, 632969, 610046, 589393, 571217, 555698, 542792, 532360, 524572, 519859, 518056, 517621, 516082, 511521, 503508, 492602, 479344, 464090, 447631, 431473, 417177, 405478, 396035, 387968, 380608, 373898, 368217, 363899, 360915, 358961, 357746, 357060, 356660, 356281, 355788, 355193, 354440, 353326, 351715, 349706, 347403, 344598, 340920, 336409, 331743, 327702, 324511, 321899, 319788, 318562, 318454, 318912, 318952, 318141, 316962, 316153, 316005, 316446, 317492]
63268C17492J778K423K682K504K016J342P15N37R98J760K280K452K714L410M321
63253C49424M959N171N236N456N880O467P167P792Q102Q299R056J0628J2187J2730
63239D58554J2591J3306J5737J8992K1622K3236K4423K5633K6805K7799K8370
63228F97068K8050K6761K5389K4991K5529K6086K6193K6182K6290K6412K6752
63217I85703K7748K9041K9479K8443K6347K3457J9251J3563P392J731l737r772
63205A178646j6046k1402k5405k8600l1275l2829l2553l0510k7550k4644k2157
63194H85675j9532j5956j1520p264l802n08L366P422J0807J3658J6846K0510K3866
63181I23568K6453K8622L0615L2037L2526L2302L1797L1280L0938L0846L0669
$$ y = [317492, 319270, 321693, 324375, 326879, 328895, 330237, 330952, 331489, 332487, 334247, 336527, 338979, 341693, 345103, 349424, 354383, 359554, 364790, 370246, 376126, 382593, 389760, 397552, 405654, 413953, 423009, 433637, 445824, 458554, 471145, 484451, 500188, 519180, 540802, 564038, 588461, 614094, 640899, 668698, 697068, 725118, 751879, 777268, 802259, 827788, 853874, 880067, 906249, 932539, 958951, 985703, 1013451, 1042492, 1071971, 1100414, 1126761, 1150218, 1169469, 1183032, 1190424, 1192155, 1188418, 1178646, 1162600, 1141198, 1115793, 1087193, 1055918, 1023089, 990536, 960026, 932476, 907832, 885675, 866143, 850187, 838667, 831403, 827601, 827093, 830459, 837881, 848688, 862346, 879192, 899702, 923568, 950021, 978643, 1009258, 1041295, 1073821, 1106123, 1137920, 1169200, 1200138, 1230984, 1261653]
63170A261653K9953K8708K7107K4680K0551J4720Q316K146m227j1532j9513k7250
63158A355312l4251m0521m5760m9336n1099n1581n1229m9849m7138m3473l9712
63147H51363l6317l3029k9549k6185k3447k1252j9048j6618j4247j2000r594p228
63135F02849n824n790o126n605m377l543l290k613r34R66K105K585L174M102M906
63120E82585N255N390N642N903N690M716L277J956J077O12N65R54J413J329P34
63105F27098M19P65J022M42n56j065j129j414j852j762j205r77j178j004k00M13
63089F17817L11J44O33J452J864J760J449J052P56J043K015K960L277L442M377
63074F44352O154P929Q990R419R753J0404J1301J1979J2199J2523J3788J5940
$$ y = [1261653, 1291606, 1320314, 1347421, 1372101, 1392652, 1407372, 1415688, 1417834, 1413607, 1402075, 1382562, 1355312, 1321061, 1280540, 1234780, 1185444, 1134345, 1082764, 1031535, 981686, 934548, 891075, 851363, 815046, 782017, 752468, 726283, 702836, 681584, 662536, 645918, 631671, 619671, 610077, 602849, 597025, 591235, 585109, 579504, 575127, 571584, 568294, 565681, 564747, 565713, 567818, 570403, 573577, 577679, 582585, 587840, 593230, 598872, 604775, 610465, 615181, 618458, 620414, 621491, 622103, 622668, 623622, 625035, 626364, 627098, 627517, 628282, 629304, 629746, 629190, 628125, 626996, 625582, 623730, 621968, 620763, 619786, 618608, 617604, 617404, 617817, 618128, 618272, 618905, 620357, 622221, 623981, 625430, 626482, 627238, 628281, 630296, 633256, 636533, 639975, 644352, 650506, 658435, 667425, 676844, 686597, 697001, 708302, 720281, 732480, 745003, 758791, 774731]
63062G74731J8015J9578K1348K4051K7289L0267L3036L6224L9949M3834M7823
63051A116145N2079N6143N9029O0385O0980O1763O2893O3858O4299O4408O4518
63040A786500O4617O4450O4169O4445O5584O6780O6896O5891O4600O2931N9163
63029B496026N1732M1058K8941J6486L390j0903k6058m0844n3847o4119p1509
63018B370353p6484p9490q0477p9130p5357o9568o2538n4967m6905l7861k7801
63007A679775j7762q742k70Q856J8474K6912L3302L8677M4100M8975N2210N4080
62995A978587N5660N7131N7899N7949N7860N7714N7155N6262N5292N3675N0309
62984B595493M4822L7579K8566J7385M352r432k3286l7296n1258o4225p5446q4882
$$ y = [774731, 792746, 812324, 833672, 857723, 885012, 915279, 948315, 984539, 1024488, 1068322, 1116145, 1168224, 1224367, 1283396, 1343781, 1404761, 1466524, 1529417, 1593275, 1657574, 1721982, 1786500, 1851117, 1915567, 1979736, 2044181, 2109765, 2176545, 2243441, 2309332, 2373932, 2436863, 2496026, 2547758, 2588816, 2617757, 2634243, 2637633, 2626730, 2600672, 2559828, 2505981, 2441862, 2370353, 2293869, 2214379, 2133902, 2054772, 1979415, 1909847, 1847309, 1792342, 1745437, 1707576, 1679775, 1662013, 1653271, 1653001, 1661857, 1680331, 1707243, 1740545, 1779222, 1823322, 1872297, 1924507, 1978587, 2034247, 2091378, 2149277, 2207226, 2265086, 2322800, 2379955, 2436217, 2491509, 2545184, 2595493, 2640315, 2677894, 2706460, 2723845, 2728197, 2718765, 2695479, 2658183, 2606925, 2542700, 2467254, 2382372]
62972B382372r2459r7532r9577r8947r6581r3270q9301q4418p8194p0913o3944
62961A417236n8547n4464n0449m6129m2376l9706l7477l5071l2876l1376l0065
62950I58700k8190k5963k4271k3386k2740k1859k0839j9902j8960j7860j6697
62939G18033j5681j4785j3693j2167j0436q975p897o746n195l598k537j990j424
62926F12909o29P8M07L77J1p00j432j635j174n86n91j526l230n082o256o341n755
62909E78845n255n136n283n702o399o926o736n963n196m588l796k785j907j236
62895E11937o35m05r45j711j588n34K61K31K51R94J679J451R33J231K044K110
62879E17304J198L48K42M19L39J58J29qn79j375j942k172k281k323k069j367m68
$$ y = [2382372, 2289913, 2192381, 2092804, 1993857, 1897276, 1804006, 1714705, 1630287, 1552093, 1481180, 1417236, 1358689, 1304225, 1253776, 1207647, 1165271, 1125565, 1088088, 1053017, 1020141, 988765, 958700, 930510, 904547, 880276, 856890, 834150, 812291, 791452, 771550, 752590, 734730, 718033, 702352, 687567, 673874, 661707, 651271, 642296, 634399, 627653, 622458, 618860, 616323, 614333, 612909, 612280, 612358, 612765, 613142, 613153, 612453, 611021, 609386, 608212, 607626, 607035, 605509, 602279, 597197, 590941, 584600, 578845, 573590, 568454, 563171, 557469, 551070, 544144, 537408, 531445, 526249, 521661, 517865, 515080, 513173, 511937, 511302, 510897, 509952, 508241, 506653, 506119, 506380, 506611, 506862, 507856, 509535, 510986, 511919, 513150, 515194, 517304, 518502, 518850, 519092, 519511, 519850, 520008, 520137, 520129, 519550, 518175, 516233, 514061, 511780, 509457, 507388, 506021, 505553]
62862E05553J77M48O26Q25O56j00p51l98O53J078M07k58R9R03J005M66K25L96
62844E12010J74o74j357j343j145j369j799j962k013k393k922k868j965q81m54
62829D89039o62o02M23J941K748K331J482J295J902K626L050L335L590L594L295
62814E19387L015K947K923K929L368M399N384N563N070M793N233N988O453O597
62800E84049O764P116P581Q242R353J0896J2480J3747J4758J5876J7454J9740
62788G28056K2810K6454L0302L4307L8907M4564N1159N8092O4828P1206P7408
62777A248093Q3836R0773R7808J03756J07510J08846J07994J04729R8482Q9203
62767B241030P7424O3409M7029K8726R821q553k6208m3156n8638p1545q1447q8611
$$ y = [505553, 505730, 506178, 506804, 507629, 508285, 508185, 507434, 507036, 507689, 508767, 509174, 508916, 509015, 509918, 510923, 511389, 511614, 512010, 512184, 511510, 510153, 508810, 507665, 506296, 504497, 502535, 500522, 498129, 495207, 492339, 490374, 489493, 489039, 488377, 487775, 488198, 490139, 492887, 495218, 496700, 497995, 499897, 502523, 505573, 508908, 512498, 516092, 519387, 522402, 525349, 528272, 531201, 534569, 538968, 544352, 549915, 554985, 559778, 565011, 570999, 577452, 584049, 590813, 597929, 605510, 613752, 623105, 634001, 646481, 660228, 674986, 690862, 708316, 728056, 750866, 777320, 807622, 841929, 880836, 925400, 976559, 1034651, 1099479, 1170685, 1248093, 1331929, 1422702, 1520510, 1624266, 1731776, 1840622, 1948616, 2053345, 2151827, 2241030, 2318454, 2381863, 2428892, 2457618, 2467439, 2458886, 2432678, 2389522, 2330884, 2259339, 2177892, 2089281]
62755B089281r3296r5632r6080r5407r4069r1922q8602q3991p8427p2607o7175
62744A132073o2177n7070n1488m5799m0663l6322l2589k9309k6440k3825k1243
62733G05148j8645j6086j3570j1200r266p893o725n303l622k041p81J97R97J783
62719F12993K794M074N317O370P651R698J2414J5169J7598J9891K2441K5608K9675
62706G91693L4596L9798M4702M9481N4873O1265O8429P6087Q4126R2184R9600
62695A496834J06072J11877J17106J21088J22855J21914J18120J11060J00000
62686B526926Q4579O5386M3821K1420q44k2685m3879o3632q0742r4449j04821
62675B331080j12216j16690j18177j17042j14070j09936j04876r8874r1974q4433
$$ y = [2089281, 1995985, 1900353, 1804273, 1708866, 1614797, 1522875, 1434273, 1350282, 1271855, 1199248, 1132073, 1069896, 1012826, 961338, 915539, 874876, 838554, 805965, 776656, 750216, 726391, 705148, 686503, 670417, 656847, 645647, 636381, 628488, 621763, 616460, 612838, 610797, 610016, 610213, 611210, 612993, 615787, 619861, 625178, 631548, 639199, 648897, 661311, 676480, 694078, 713969, 736410, 762018, 791693, 826289, 866087, 910789, 960270, 1015143, 1076408, 1144837, 1220924, 1305050, 1397234, 1496834, 1602906, 1714783, 1831889, 1952977, 2075832, 2197746, 2315866, 2426926, 2526926, 2611505, 2676891, 2720712, 2742132, 2741288, 2718603, 2674724, 2611092, 2530350, 2435901, 2331080, 2218864, 2102174, 1983997, 1866955, 1752885, 1642949, 1538073, 1439199, 1347225, 1262792]
62665A262792p6666o9205o2553n6966n2261m7890m3435l9034l5213l2168k9407
62654G17994k6309k2917j9889j7732j6363j5410j4585j3667j2504j1296j0571
62643E36751j0555j0685j0068q442o383m591l259k177j272o95n66p69j081j341
62629D74867j544j780k115k436k474k138j734j617j697j548j048n03N3J098K815
62614D58199M439N074M878M758M998N039M791N214P035R562J1417J2175J2613
62601E50192J3574J5229J7403K0086K3376K7256L1531L5905M0103M4015M7580
62590H66250N0455N2052N2103N0898M8738M5369M0339L3690K5943J7508Q485j037
62578A290793j0748k0076k8166l4168l7952m0422m2613m4576m5554m5129m3686
$$ y = [1262792, 1186126, 1116921, 1054368, 997402, 945141, 897251, 853816, 814782, 779569, 747401, 717994, 691685, 668768, 648879, 631147, 614784, 599374, 584789, 571122, 558618, 547322, 536751, 526196, 515511, 505443, 497001, 490618, 486027, 482768, 480591, 479319, 478624, 478058, 477289, 476208, 474867, 473323, 471543, 469428, 466992, 464518, 462380, 460646, 459029, 457332, 455784, 454736, 454233, 454286, 455384, 458199, 462638, 467712, 472590, 477348, 482346, 487385, 492176, 497390, 504425, 513987, 525404, 537579, 550192, 563766, 578995, 596398, 616484, 639860, 667116, 698647, 734552, 774655, 818670, 866250, 916705, 968757, 1020860, 1071758, 1120496, 1165865, 1206204, 1239894, 1265837, 1283345, 1291830, 1290793, 1280045, 1259969, 1231803, 1197635, 1159683, 1119261, 1076648, 1032072, 986518, 941389, 897703]
62567H97703m1788l9605l7130l4459l1694k8831k5957k3259k0728j8147j5439
62556E80666j2842j0620q852p563o821o597o679o782o548n563l711j533P9O21
62542D97255K81l95q14m74O47J769J945J169M86P45J719K645L197L582M089N002
62526E22848O666R093J1670J3700J5275J7138J9749K2861K6126K9694L3949L8840
62514G67609M3870M8644N3250N7930O2574O6578O9197O9850O8240O4382N8629
62503A430753N1486M3149L3412K2248J0343j284j2138k2287l1462l8615m2800
62492A442805m4189m3784m2189l9214l4641k8902k2676j6141r136j893M941J1037
62480A176018J6747K2445K7868L2399L5630L7255L6660L3279K7452K0304J2693
$$ y = [897703, 855915, 816310, 779180, 744721, 713027, 684196, 658239, 634980, 614252, 596105, 580666, 567824, 557204, 548352, 540789, 533968, 527371, 520692, 513910, 507362, 501799, 498088, 496555, 496634, 497255, 497536, 497141, 496327, 495853, 496500, 498269, 500214, 501383, 501869, 502614, 504333, 506978, 510175, 513757, 517846, 522848, 529514, 538607, 550277, 563977, 579252, 596390, 616139, 639000, 665126, 694820, 728769, 767609, 811479, 860123, 913373, 971303, 1033877, 1100455, 1169652, 1239502, 1307742, 1372124, 1430753, 1482239, 1525388, 1558800, 1581048, 1591391, 1590107, 1577969, 1555682, 1524220, 1485605, 1442805, 1398616, 1354832, 1312643, 1273429, 1238788, 1209886, 1187210, 1171069, 1161933, 1160040, 1164981, 1176018, 1192765, 1215210, 1243078, 1275477, 1311107, 1348362, 1385022, 1418301, 1445753, 1466057, 1478750]
62469A478750M727l595j1943k0170k8619l7304m5162n0886n4235n6016n6870n6722
62457A061955n5331n2737m9080m4566l9726l5220l1183k7179k2958j8813j5071
62446F70091j1701q694o313m522k628l9K798M828N692O110O847P749Q069P376
62432F85663N753L307N6l615o886r212j0813j2118j3026j3256j3175j3578j4459
62419E84641j4852j4100j2705j1441j0288q906p614p055p126p044o382n356m175
62406D67597k919k066k225l167l745l179j859o61lJ83J03J37P48J907K910L097
62390D56858K519J661Q78L66K91O34J186J926L089M543N569N693N397N568O411
62375E02589P343P743P488O900O506O776P681Q614R024R116R616J0976J3081J5633
$$ y = [1478750, 1483477, 1479882, 1467939, 1447769, 1419150, 1381846, 1336684, 1285798, 1231563, 1175547, 1118677, 1061955, 1006624, 953887, 904807, 860241, 820515, 785295, 754112, 726933, 703975, 685162, 670091, 658390, 649696, 643383, 638861, 636233, 636194, 638992, 643820, 649512, 655622, 662469, 670218, 678287, 685663, 691416, 694723, 694779, 691164, 684278, 675066, 664253, 652135, 639109, 625853, 612678, 599100, 584641, 569789, 555689, 542984, 531543, 521255, 512349, 504735, 497680, 490554, 483510, 477128, 471772, 467597, 464678, 462612, 460387, 457220, 453475, 450296, 448437, 447776, 447773, 447956, 448059, 448196, 448944, 450851, 453761, 456858, 459377, 461038, 461916, 462282, 462573, 463207, 464393, 466319, 469408, 473951, 479520, 485213, 490610, 496178, 502589, 509932, 517675, 525163, 532063, 538569, 545345, 553026, 561640, 570664, 579780, 589396, 600372, 613453, 629086]
62361F29086J8497K1596K4807K8059L1468L5298L9734M4572M9038N2129N3225
62350A027509N2271M9357M4489L7918L0339K2525J4898P698J237m341r315j4023
62338A260562j8365k2042k5052k7551k9310k9839k9105k7621k5749k3312k0221
62327I82395j7067j4702j3356j2581j2109j2360j3850j6271j8609k0216k1422
62316H09852k2784k4105k4641k4215k3492k3017k2516k1415j9630j7408j4823
62305E71806j1975r479q094p762p525o574n029l558k592k104j887j691j224k99
62291E02013R20J988K546K623K597K912L691M589N021M690L874L192L066L490
62277E47212M186M835N129M868M240L890M424N761P192Q142Q744R576J1055J3173
$$ y = [629086, 647583, 669179, 693986, 722045, 753513, 788811, 828545, 873117, 922155, 974284, 1027509, 1079780, 1129137, 1173626, 1211544, 1241883, 1264408, 1279306, 1287004, 1288241, 1283900, 1274585, 1260562, 1242197, 1220155, 1195103, 1167552, 1138242, 1108403, 1079298, 1051677, 1025928, 1002616, 982395, 965328, 950626, 937270, 924689, 912580, 900220, 886370, 870099, 851490, 831274, 809852, 787068, 762963, 738322, 714107, 690615, 667598, 645082, 623667, 604037, 586629, 571806, 559831, 550352, 542258, 534496, 526971, 520397, 515368, 511810, 509218, 507114, 505227, 503536, 502312, 502013, 502933, 504921, 507467, 510090, 512687, 515599, 519290, 523879, 528900, 533590, 537464, 540656, 543722, 547212, 551398, 556233, 561362, 566230, 570470, 574360, 578784, 584545, 591737, 599879, 608623, 618199, 629254, 642427]
62263F42427J5667J8248K0813K3591K6996L1187L5863M0613M5300M9989N4605
62252A005299N8788O1964O3414O2497N8988N3171M5562L6774K7598J8717J0101
62241A502873J123q398j7757k6286l4201m1890m8810n3846n6522n7209n6390n4521
62229A048166n2262m9934m6824m2095l6361l1365k7910k5110k2047j9052j6847
62218F78359j5297j3755j2050j0487r242q287p511o635n465m441m220m464l882
62205E72623j959J76J214J238J126J246J620K622M381N992O415N902N542N654
62191F13792N702N597N915O788P638Q167Q662R162R230Q814Q516Q580Q397P412
62177G22372N948M688L806L124K705K825L590M908O741R138J2129J5717J9821
$$ y = [642427, 658094, 676342, 697155, 720746, 747742, 778929, 814792, 855405, 900705, 950694, 1005299, 1064087, 1126051, 1189465, 1251962, 1310950, 1364121, 1409683, 1446457, 1474055, 1492772, 1502873, 1503996, 1495598, 1477841, 1451555, 1417354, 1375464, 1326654, 1272808, 1216286, 1159077, 1102687, 1048166, 995904, 945970, 899146, 857051, 820690, 789325, 761415, 736305, 714258, 695206, 678359, 663062, 649307, 637257, 626770, 617528, 609241, 601730, 595095, 589630, 585189, 580969, 576505, 572623, 570664, 570840, 572054, 573292, 574418, 575664, 577284, 579906, 584287, 590279, 596694, 602596, 608138, 613792, 619494, 625091, 631006, 637794, 645432, 653599, 662261, 671423, 680653, 689467, 697983, 706563, 714960, 722372, 728320, 733008, 736814, 739938, 742643, 745468, 749058, 753966, 760707, 769845, 781974, 797691, 817512]
62164H17512K4182K8468L2481L5992L8435L9077L7651L4528L0207K4891J8654
62153A162078J1846N147p74n674r842j3737j7509k1004k4159k6905k8695k8746
62141A002026k7161k5204k3867k2636k0298j6617j2467q662n516l282k103j517
62129H32696r25n80j189k541l531l713l794m137l887k224K79K403L787M863N730
62114H23237N881M938K974K61k781n434p043p575p513p232o832o455o408o906
62100G73112p934r315j0642j1295j0788r221p165n142l327j714l68N47R78J128
62086F98854J422K175L326M579N791P059Q428R781J1042J2333J3817J5442J6949
62073H10998J8026J8461J8259J7614J6711J5703J4966J5073J6215J7854J9369
$$ y = [817512, 841694, 870162, 902643, 938635, 977070, 1016147, 1053798, 1088326, 1118533, 1143424, 1162078, 1173924, 1179071, 1178297, 1172623, 1162781, 1149044, 1131535, 1110531, 1086372, 1059467, 1030772, 1002026, 974865, 949661, 925794, 903158, 882860, 866243, 853776, 845114, 839598, 836316, 834213, 832696, 831771, 831191, 830002, 827461, 823930, 820217, 816423, 812286, 808399, 806175, 806454, 808857, 812644, 817507, 823237, 829118, 834056, 837030, 837291, 834510, 829076, 822033, 814458, 806945, 799713, 792881, 786426, 780018, 773112, 765178, 755863, 745221, 733926, 723138, 713917, 706752, 701610, 698283, 696569, 696201, 696748, 697726, 698854, 700276, 702451, 705777, 710356, 716147, 723206, 731634, 741415, 752457, 764790, 778607, 794049, 810998, 829024, 847485, 865744, 883358, 900069, 915772, 930738, 945811, 962026, 979880, 999249]
62062I99249K0844K2675K4526K5374K4692K2919K0493J7146J2670P820L725O10
62050A202743k314n769r698j3722j7749k1904k6058k9680l2240l3626l4193l4425
62038I41365l4617l4786l4669l3765l1684k8724k5865k3882k2594k1310j9794
62027F29675j8317j6934j5391j3739j2407j1490j0587r611r130r434r818r335
62015D83482p967o530n590n035m627m429m533m651m258l136j716o81j70N20K044
62000D32723M025N364N606N435N654O209O491O177N305L954K364J040K55m70j871
61985D88261m017o181p586p987p636p050o687o601o385n708m737l806k944k138
61971D08798j815k477l842m825m642l529k267j301n56Q9N02M87J07k90m15k84
$$ y = [999249, 1020093, 1042768, 1067294, 1092668, 1117360, 1140279, 1160772, 1177918, 1190588, 1198408, 1202133, 1202743, 1200429, 1194660, 1184962, 1171240, 1153491, 1131587, 1105529, 1075849, 1043609, 1009983, 975790, 941365, 906748, 871962, 837293, 803528, 771844, 743120, 717255, 693373, 670779, 649469, 629675, 611358, 594424, 579033, 565294, 552887, 541397, 530810, 521199, 512069, 502635, 492817, 483482, 475515, 468985, 463395, 458360, 453733, 449304, 444771, 440120, 435862, 432726, 431010, 430329, 430159, 430679, 432723, 436748, 442112, 447718, 453153, 458807, 465016, 471507, 477684, 482989, 486943, 489307, 490347, 490602, 490132, 488261, 484244, 478063, 470477, 462490, 454854, 447804, 441117, 434516, 428131, 422423, 417686, 413880, 410936, 408798, 406983, 404506, 400664, 395839, 391197, 387668, 385401, 384100, 383544, 383633, 384135, 384622, 384729, 384439, 384024, 383740]
61955C83740q1K09P42J369J614J292R02J054J751K597L520M755O162P177P661
61940D24464Q242R487J1037J2026J2070J1475J0601R571Q610Q134Q278Q629Q631
61927E51255Q068P004N558L974K561J265m06k586m500n267n102m978n176m954
61913E46716l778j989P0K625N572P856Q705Q933R969J1890J3341J3298J1927R793
61899F44928P217M632K619J211k22j981l536m262m246m060m106m344m339l644
61885F25867k496j981k857m439n426n735o470q062r614j0381j0665j0727j0022
61872E36992q371o824o352o401n808m519l360k599j871j108n15K00J538L230M494
61857D98726N220O107P579R347J1036J2583J3982J5277J6708J8266J9250J9048
$$ y = [383740, 383659, 383868, 384610, 385979, 387593, 388885, 389787, 390841, 392592, 395189, 398709, 403464, 409626, 416803, 424464, 432706, 442193, 453230, 465256, 477326, 488801, 499402, 508973, 517583, 525717, 533995, 542624, 551255, 559323, 566327, 571885, 575859, 578420, 579685, 579279, 576693, 572193, 566926, 561824, 556846, 551670, 546716, 542938, 540949, 541019, 543644, 549216, 557072, 565777, 574710, 584679, 596569, 609910, 623208, 635135, 644928, 652145, 656777, 659396, 660607, 660385, 658404, 654868, 650606, 646360, 642300, 638194, 633850, 629511, 625867, 623371, 621390, 618533, 614094, 608668, 602933, 596463, 588401, 578787, 568406, 557741, 547014, 536992, 528621, 521797, 515445, 509044, 503236, 498717, 495357, 492758, 490887, 489779, 489264, 489464, 491002, 494232, 498726, 503946, 510053, 517632, 526979, 538015, 550598, 564580, 579857, 596565, 614831, 634081, 653129]
61845F53129J8182J7721J7727J7152J5357J2733R694O094K029j626m173n912p447
61832G50660q631q805p762n908l646j127J458L784N697P348Q895J0103J0353R160
61818G71579O772M007J405j242m287p453j0088j2017j3611j5050j5997j6066j5213
61805F72739j3657j1781j0133r107q580q232q131q544r177r253q506p559p072
61792E53007o940o629n992n393n240n577o019o039n403m393l421k666k196k281
61778D84818l000l777l799k959j873r81k23M52Q29Q91R36J065J144J336K075L173
61762D80107L735L378K968L551M975O200O667O730O818O755O048M511K466L96
61748E45305j427k976m169m738m667m505m832n550o112o277o115n456m214l170
$$ y = [653129, 671311, 689032, 706759, 723911, 739268, 752001, 761695, 767789, 769818, 768192, 764019, 758107, 750660, 742029, 733224, 725462, 719554, 715908, 714781, 716239, 720023, 725720, 733068, 741963, 752066, 762419, 771579, 778351, 782358, 783763, 782521, 778234, 770781, 760693, 748676, 735065, 720015, 704018, 687952, 672739, 659082, 647301, 637168, 628061, 619481, 611249, 603118, 594574, 585397, 576144, 567638, 560079, 553007, 546067, 539438, 533446, 528053, 522813, 517236, 511217, 505178, 499775, 495382, 491961, 489295, 487099, 484818, 481818, 478041, 474242, 471283, 469410, 468429, 468206, 468658, 469487, 470378, 471314, 472379, 473523, 474859, 476934, 480107, 483842, 487220, 490188, 493739, 498714, 504914, 511581, 518311, 525129, 531884, 537932, 542443, 544909, 545305, 543878, 540902, 536733, 531995, 527328, 522823, 517991, 512441, 506329, 500052, 493937, 488481, 484267, 481097]
61734D81097l381m479m664k998p64L14L10N50J408J955J634J062J022J565K345
61719D76976L077L332K586R39o47j187o38K07N35J57m78q32r41j375k366l263
61703D76082l318k755k440k697l111l481m093m841m962m123l136k950l460l905
61689D26810l980l894l678l267l081l704m821n325m654l392k243j189n9O74M79
61674C84676k72o99o40p15j217j671j644j309r34m76pO5k92l93K40J063J334J325
61656C78434J898K994L611L256K582K321K394K387K274K125J708R12J87M8M07
61641D07538P84R12P91N07L07N02R29R28K83k59o1L18j15j207j823j578j399k086
61623D05271l119l469k939k118j410p72k60k10p73j616k255k548k727l006l275
$$ y = [481097, 477716, 473237, 468573, 465575, 464811, 465125, 465435, 465985, 467393, 469348, 470982, 472044, 473066, 474631, 476976, 480053, 483385, 485971, 486910, 486263, 485076, 484438, 484645, 485180, 485337, 484859, 484027, 483086, 481711, 479345, 476082, 472764, 470009, 467569, 464872, 461761, 458280, 454187, 449346, 444384, 440261, 437125, 434175, 430715, 426810, 422830, 418936, 415258, 411991, 408910, 405206, 400385, 395060, 390406, 387014, 384771, 383582, 383523, 384197, 384676, 384404, 383705, 383065, 382350, 381133, 379462, 377818, 376509, 375575, 375099, 375092, 375157, 374865, 374472, 374712, 375775, 377109, 378434, 380332, 383326, 386937, 390193, 392775, 395096, 397490, 399877, 402151, 404276, 405984, 406896, 407083, 407131, 407538, 408322, 409234, 410025, 410532, 410839, 411341, 412270, 413198, 413481, 413222, 413161, 413479, 413364, 412157, 410334, 408756, 407357, 405271, 402152, 398683, 395744, 393626, 392216, 391444, 391184, 390974, 390201, 388585, 386330, 383782, 381055, 378049, 374774]
61608C74774l264k974k819l137l774m300m507m427m068l468k983k976l259l239
61594C25579k727k144j818j653j643k077k868l208k567j528j015r89p20j13J27
61579C00636k48n72l22N0j71r05j472j447q93l7Q09J232J090P39N53M42K32K07
61561B99923P61J632K140K165K218K484K482J937J372J379J739J797J428J132
61547C24589J236J532J648J515J296J140J016P60L30M8K97R48J363J225R94J161
61531C41098J372Q63l84j542k001j949j767j482j088q90j090j362j253q52o30
61516C27043p54r23q50n81l00r5qj04l16l08K98J510K730L077K129M10r46j205
61498C30807n90J51N71P69R55J182J467J865K189J965J002j52o45l14J76K22O
$$ y = [374774, 371510, 368536, 365717, 362580, 358806, 354506, 349999, 345572, 341504, 338036, 335053, 332077, 328818, 325579, 322852, 320708, 318890, 317237, 315594, 313517, 310649, 307441, 304874, 303346, 302331, 301342, 300622, 300509, 300636, 300388, 299816, 299494, 299544, 299373, 298468, 296996, 295549, 294656, 294619, 295428, 296660, 297750, 298489, 299042, 299484, 299716, 299923, 300684, 302316, 304456, 306621, 308839, 311323, 313805, 315742, 317114, 318493, 320232, 322029, 323457, 324589, 325825, 327357, 329005, 330520, 331816, 332956, 333972, 334732, 335062, 335110, 335407, 336355, 337718, 338943, 339937, 341098, 342470, 343333, 342949, 341407, 339406, 337457, 335690, 334208, 333120, 332230, 331140, 329778, 328525, 327673, 327043, 326289, 325366, 324516, 323935, 323635, 323540, 323532, 323428, 323112, 322804, 323102, 324612, 327342, 330419, 332548, 332958, 332012, 330807, 330217, 330368, 330939, 331708, 332663, 333845, 335312, 337177, 339366, 341331, 342333, 342181, 341536, 341222, 341398, 341620, 341626]
61481C41626P3N82J358K390L627M389L779J942L08J17J048J785J591Q24O4n61
61465C64942j172j667j765j307n03N1j80r97j457r47QL97O6k36%N35J055J653
61447C58476K278K426J792Q46K89L10P49J558K578L201K923K087J475J207O88
61432C82883k60q60l61Q79J702J407L51o19r75p58k76K19O38R29R65O09k6m52
61414C85995k34M24P32J73q63j600j809j876k022k040j874j793j755j247j90N76
61398C70597L87j82j27M39N72J24j8N94J238J235R14Q83J047J004Q03P32P98R51
61380C81991J400K111K508K284K129K877M250N148N032M289L387K441J587J016
61366D22450N84l8p20r65p27m62l36lO28J125J385J970L182M396M985N355O272
$$ y = [341626, 341699, 342281, 343639, 346029, 349656, 354045, 357824, 359766, 360074, 360191, 361239, 363024, 364615, 365439, 365503, 364942, 363770, 362103, 360338, 359031, 358528, 358579, 358399, 357402, 355945, 354998, 355006, 355403, 355469, 355233, 355233, 355768, 356823, 358476, 360754, 363180, 364972, 365818, 366107, 366417, 367166, 368724, 371302, 374503, 377426, 379513, 380988, 382195, 382883, 382623, 381763, 381402, 382281, 383983, 385390, 385741, 385122, 384147, 383389, 383113, 383332, 383970, 384899, 385864, 386473, 386447, 385995, 385761, 386185, 386917, 387090, 386227, 384627, 382818, 380942, 378920, 376880, 375006, 373213, 371458, 370211, 370021, 370597, 370984, 370802, 370675, 371114, 371686, 371810, 371792, 372386, 373624, 374859, 375773, 376656, 377703, 378707, 379510, 380242, 381040, 381991, 383391, 385502, 388010, 390294, 392423, 395300, 399550, 404698, 409730, 414019, 417406, 419847, 421434, 422450, 423034, 422996, 422276, 421311, 420584, 420122, 419786, 419783, 420411, 421536, 422921, 424891, 428073, 432469, 437454, 442809, 449081]
61349D49081P438P677O549N032M258M246M177L577K691J973J670J814K232K566
61335E04981K540K266K038J812J241K74n94r47r62j100j479j891k175k211j746
61320E02047o95M46J096J461K345L926N339N857N925O547Q028R915J1881J4009
61306E78127J6234J8114J9293J9713J9247J7578J4675J1104P546M220R87k082
61294G24756m615o354p461q308r073r728j0303j0935j1532j1685j1127j0166r338
61281F04131q660p666o230m864l979l241k122p59K57P89J272J876K193J933J564
61266E76494J780K567L232L310L116L288M020M950N635N874N569M651L282J917
61252F29685Q98J58m93r17q59n12l77n56o01j52N94J214J445J145K80q12j545
$$ y = [449081, 456519, 464196, 470745, 475777, 480035, 484281, 488458, 492035, 494726, 496699, 498369, 500183, 502415, 504981, 507521, 509787, 511825, 513637, 514878, 515152, 514558, 513611, 512649, 511549, 510070, 508179, 506004, 503793, 502047, 501352, 501798, 502894, 504355, 506700, 510626, 515965, 521822, 527747, 534294, 542322, 552237, 564118, 578127, 594361, 612475, 631768, 651481, 670728, 688306, 702981, 714085, 721631, 725851, 726838, 724756, 720141, 713787, 706326, 698018, 688945, 679217, 668914, 657979, 646447, 634762, 623635, 613469, 604131, 595471, 587805, 581575, 576711, 572732, 569491, 567369, 566610, 566867, 567656, 568928, 570804, 572997, 574930, 576494, 578274, 580841, 584073, 587383, 590499, 593787, 597807, 602757, 608392, 614266, 619835, 624486, 627768, 629685, 630583, 630741, 630248, 629331, 628472, 627960, 627583, 627027, 626426, 626274, 626868, 628082, 629527, 630672, 630952, 630140, 628595]
61235F28595j741j816j947j568j52J844L366M035M417N132O151P016P378P261
61221F67971P069P353Q292R432J0148J0265R982R409Q562P673O976O221N000L584
61207G77937K838L094L590L381K540J983K393L569M879O021P266R061J1411J3696
61193H53659J5127J5317J4412J2740J0587Q147N498K608m14l139n162o548p660
61180I15172q552q945q843q755r104r729j0248j0627j1115j1723j2136j2048j1439
61167G81908j0549r736r349r470r850j0229j0658j1295j1941j2082j1507j0575
61155F54667r668q591o889m615k412p44M85J377J575P55p07k134l467n136p022
61140F07474q274q378p857p422o959n880m200k613j615j014l55O30K060L896N823
$$ y = [628595, 626854, 625038, 623091, 621523, 621371, 623215, 626581, 630616, 635033, 640165, 646316, 653332, 660710, 667971, 675040, 682393, 690685, 700117, 710265, 720530, 730512, 739921, 748483, 756156, 763132, 769353, 774353, 777937, 780775, 783869, 787459, 790840, 793380, 795363, 797756, 801325, 806204, 812225, 819491, 828552, 839963, 853659, 868786, 884103, 898515, 911255, 921842, 929989, 935487, 938095, 937681, 934542, 929380, 922832, 915172, 906620, 897675, 888832, 880077, 870973, 861244, 850996, 840369, 829254, 817531, 805395, 793347, 781908, 771359, 761623, 752274, 742804, 732954, 722725, 712067, 700772, 688831, 676749, 665242, 654667, 644999, 636408, 629519, 624904, 622492, 621748, 622233, 623610, 625185, 625940, 625233, 623099, 619632, 614496, 607474, 599200, 590822, 582965, 575543, 568584, 562704, 558504, 555891, 554276, 553262, 552907, 553537, 555597, 559493, 565316]
61125E65316P406Q596R809J1369J3061J4512J5769J7229J9009K0707K1976K3146
61113G47905K4874K7086K8650K8491K6836K4956K3691K2649K1015J8654J6171
61102A010978J4040J2031R391N581R68l300o412q898j2010j5998j9614k1650k2372
61089I42735k2892k3584k3808k3067k1794k0838k0549k0413j9463j7243j4462
61078G14622j2437j1624j1070r746p957o826o692o704n966m407k484o62O19J052
61064F29718Q59P97J446K658L828M550M919N310O039P141Q390R535J0505J1401
61050G07096J2399J3589J4860J6017J7184J8861K1240K3605K4976K5300K5420
61039I20547K5880K6472K7097K8116K9505L0519L0794L1082L2221L3991L5680
$$ y = [565316, 572722, 581318, 591127, 602496, 615557, 630069, 645838, 663067, 682076, 702783, 724759, 747905, 772779, 799865, 828515, 857006, 883842, 908798, 932489, 955138, 976153, 994807, 1010978, 1025018, 1037049, 1046440, 1052021, 1052989, 1049689, 1043277, 1034379, 1022369, 1006371, 986757, 965107, 942735, 919843, 896259, 872451, 849384, 827590, 806752, 786203, 765790, 746327, 729084, 714622, 702185, 690561, 679491, 669745, 661788, 654962, 648270, 641566, 635600, 631193, 628709, 628047, 628666, 629718, 630577, 631374, 632820, 635478, 639306, 643856, 648775, 654085, 660124, 667265, 675655, 685190, 695695, 707096, 719495, 733084, 747944, 763961, 781145, 800006, 821246, 844851, 869827, 895127, 920547, 946427, 972899, 999996, 1028112, 1057617, 1088136, 1118930, 1150012, 1182233, 1216224, 1251904]
61028A251904L7230L9093M1353M3630M5522M6669M6909M6918M8077N1201N6032
61017A754538O2429P0904Q1238R1706J00961J09763J19730J31558J45923J65107
61007B833857J91883K27715K73931L33921M12270N12996O40847Q02263J000864
60998G230547J232969J491266J767620K036996K231337K245287J996884J501420
60990B1734326Q85256L19198o8586k29016j74465M0549L12831M93035M38841R6405
60980B3848374m61615j079747j605800j950492k094125k064298j913027j698117
60972A0981153j466356j244960j045850q74167p31022o12908n14425m32385l65547
60963C693533l11763k68071k32830k05314j83658j65408j49567j36064j23752
$$ y = [1251904, 1289134, 1328227, 1369580, 1413210, 1458732, 1505401, 1552310, 1599228, 1647305, 1698506, 1754538, 1816967, 1887871, 1969109, 2060815, 2161776, 2271539, 2391269, 2522827, 2668750, 2833857, 3025740, 3253455, 3527386, 3861307, 4273577, 4786573, 5427420, 6229683, 7230547, 8463516, 9954782, 11722402, 13759398, 15990735, 18236022, 20232906, 21734326, 22619582, 22938780, 22870194, 22641178, 22466713, 22507262, 22820093, 23313128, 23751969, 23848374, 23386759, 22307012, 20701212, 18750720, 16656595, 14592297, 12679270, 10981153, 9514797, 8269837, 7223987, 6349820, 5618798, 5005890, 4491465, 4059080, 3693533, 3381770, 3113699, 2880869, 2675555, 2491897, 2326489, 2176922, 2040858, 1917106]
60954A917106j11124r8574q7758p8755p0112o1640n5027n1305m9515m8323m7224
60943A157749m5824m3527m0586l8037l6103l3856l0906k8127k6243k4845k3365
60932G86330k1885k0548j9128j7606j6307j5210j3977j2786j2096j1525j0126
60921F15136q015o412n809n412m776m514m806m651l482k295k125k474k296j652
60907E56417j246j048n51J10L82K63J82J91M3j41m6K15K45nl47q44j648k524l098
60888E46550l315l332l141k830k881l811n509p300q530q991r008r240r943j0366
60874D58353r475p423n614m900m528l451j970j150j202j383j200p96k36O11J506
60859D17142J931J938K163K813L295L136K696K605K909L222L428L744M196M437
$$ y = [1917106, 1805982, 1707408, 1619650, 1540895, 1470783, 1409143, 1354116, 1302811, 1253296, 1204973, 1157749, 1111925, 1068398, 1027812, 989775, 953672, 919816, 888910, 860783, 834540, 809695, 786330, 764445, 743897, 724769, 707163, 690856, 675646, 661669, 648883, 636787, 625262, 615136, 607121, 600709, 594900, 589488, 584712, 580198, 575392, 570741, 567259, 564964, 562839, 560365, 558069, 556417, 555171, 554123, 553572, 553682, 554064, 554327, 554509, 554700, 554743, 554602, 554556, 554771, 555016, 555011, 554664, 553820, 552172, 549648, 546550, 543235, 539903, 536762, 533932, 531051, 527240, 521731, 514431, 505901, 496910, 487902, 478662, 468719, 458353, 448878, 441455, 435841, 430941, 426413, 422962, 420992, 419842, 418640, 417257, 416057, 415261, 415025, 415636, 417142, 419073, 421011, 423174, 425987, 429282, 432418, 435114, 437719, 440628, 443850, 447278, 451022, 455218, 459655]
60845D59655M196L635L120K778K461J968J173pj412k448k533j887j486j889k535
60830D64789k633k285k121k159j867j283j135j683k270k237j683j020n31o06j648
60815D39628l295m430m490m208m468n054n153m619m007l687l645l876m344m651
60801C79701m443l957l677l582l274k708k244k039j974j991k080j950j367p19
60787C43696o65j146j328o77M38J348J879K251K450K154J244K64J03J075K386
60772C55472K943K732K850L930N123N260M464L818L714L497K737J848J229N77
60758D00194m58j545k108k108j980k081k474l000l236k702j450j98M00M27L76
60743C78057M16L47L0n40j450k695l839m266l909l449l542m102m444m080l197
$$ y = [459655, 463851, 467486, 470606, 473384, 475845, 477813, 478986, 478979, 477567, 475119, 472586, 470699, 469213, 467324, 464789, 462156, 459871, 457750, 455591, 453724, 452441, 451306, 449623, 447353, 445116, 443433, 442413, 441882, 441276, 439628, 436333, 431903, 427413, 423205, 418737, 413683, 408530, 403911, 399904, 396217, 392572, 388696, 384352, 379701, 375258, 371301, 367624, 364042, 360768, 358060, 355816, 353777, 351803, 349812, 347732, 345782, 344415, 343696, 343031, 341885, 340557, 339880, 340318, 341666, 343545, 345796, 348246, 350400, 351644, 351908, 352011, 353086, 355472, 358415, 361147, 363997, 367927, 373050, 378310, 382774, 386592, 390306, 393803, 396540, 398388, 399617, 400194, 399736, 398191, 396083, 393975, 391995, 389914, 387440, 384440, 381204, 378502, 377052, 376854, 377254, 377681, 378057, 378473, 378820, 378850, 378310, 376860, 374165, 370326, 366060, 362151, 358702, 355160, 351058, 346614, 342534, 339337]
60728C39337k401k136k366k703k692j991n61J093K042J661L35q26j098p61m30
60713C26503j71L51J087J511J319Q08L84R9j26q4N26J653K858L693L962L694L119
60696C51186K626K547K887L359L695L822L807L717L560L214K562J721J035P17
60682C90455O39O15O65P62O53K79J25N65J061P58j69n84p6L27l27j516k131k176
60664C89925k586l603m412m420m023l731l350k465j280m59l56p22r91o30N47K107
60648C59551L226L423L021K656K480K096J212M9r30j537j931k336k824l314l582
60633C61260l285k209o49O50J199J218J178J071O20Ok23k7j3m78r15q26m34j99
60615C57944j94l40p34j151q40M61J740J781P06l10o06m69k24J25L62J14l80l14
$$ y = [339337, 336936, 334800, 332434, 329731, 327039, 325048, 324487, 325580, 327622, 329283, 329618, 328792, 327694, 326933, 326503, 326332, 326683, 327770, 329281, 330600, 331408, 331792, 331891, 331765, 331681, 332207, 333860, 336718, 340411, 344373, 348067, 351186, 353812, 356359, 359246, 362605, 366300, 370122, 373929, 377646, 381206, 384420, 386982, 388703, 389738, 390455, 391094, 391709, 392374, 393136, 393789, 394068, 394193, 394758, 395819, 396577, 396408, 395824, 395748, 396075, 395748, 394232, 392101, 389925, 387339, 383736, 379324, 374904, 370881, 367150, 363800, 361335, 360055, 359596, 359240, 358518, 357527, 356897, 357444, 359551, 362777, 366200, 369221, 371877, 374357, 376453, 377665, 377714, 376784, 375247, 373316, 370980, 368156, 364842, 361260, 357975, 355766, 355117, 355767, 356966, 358184, 359362, 360433, 361053, 361059, 360836, 360809, 360796, 360318, 359403, 358577, 358143, 357944, 357750, 357410, 356676, 355525, 354685, 355146, 356886, 358667, 359373, 359063, 358457, 357988, 357764, 357889, 358251, 358365, 357985, 357671]
60597C57671O21J884K890L583M050M213M066L683K956J792O34J79N09J085J507
60582C91323J668J298K06j003j357p50O3P46J666K831L697M287N347O984Q341
60567D25347R132J0281J2306J4218J4923J4607J3836J2260R421O010L055M71k337
60554E43530n014o662p297p592p450o218m168k474j555o73P10K206L432M609N998
60539E11382P516R303J1812J4986J8049K0474K2549K4602K6202K6481K4910K1533
60527G39799J6796J1358N766K25m985r148j1652j2839j3604j4165j3987j3008
60515F80556j2014j1456j0666q876o468m551l619l152k340q21J194L238N151P417
60501F33593J0690J4864J9095K2971K7149L2290L7768M2141M4744M6081M6583
$$ y = [357671, 358292, 360176, 363066, 366649, 370699, 374912, 378978, 382661, 385617, 387409, 388043, 388222, 388731, 389816, 391323, 392991, 394289, 394495, 393492, 392135, 391385, 391448, 392194, 393860, 396691, 400388, 404675, 410022, 417006, 425347, 434479, 444760, 457066, 471284, 486207, 500814, 514650, 526910, 536331, 542341, 545396, 545867, 543530, 538516, 531854, 524557, 516965, 509515, 503297, 499129, 496655, 495100, 494427, 495137, 497343, 500775, 505384, 511382, 518898, 528201, 540013, 554999, 573048, 593522, 616071, 640673, 666875, 693356, 718266, 739799, 756595, 767953, 773719, 773944, 768959, 759811, 748159, 735320, 721716, 707551, 693564, 680556, 668542, 657086, 646420, 637544, 631076, 626525, 622906, 619754, 617414, 616593, 617787, 621025, 626176, 633593, 644283, 659147, 678242, 701213, 728362, 760652, 798420, 840561, 885305, 931386, 977969]
60490I77969M5717M2775L8104L2965K8285K4150K0455J7468J5294J3217J0110
60479A266509N433o24p891j6554k6512l6776m5816n2391n6031n7036n6142n3927
60467H62242n0413m5517l9807l4391k9926k6267k3178k0757j8846j6780j4282
60456E42078j2126j1237j1485j1907j1749j0758q907o536m538l636l567l502l074
60443D39056k474j786r77l40k96p62j250j515j573j442j326j735k683l132k204
60428D15561o72j62r76j806j686j049o17l58l5J68R0k7n8j61j74L99J389J864
60410D11690J480J031J167J410J229J169J893K839K958K358K077K409K606K252
60396D38568J875J974K254K280K206K397K754K887K795K919L496M055L825K594
$$ y = [977969, 1023686, 1066461, 1104565, 1137530, 1165815, 1189965, 1210420, 1227888, 1243182, 1256399, 1266509, 1271942, 1271318, 1263427, 1246873, 1220361, 1183585, 1137769, 1085378, 1029347, 972311, 916169, 862242, 811829, 766312, 726505, 692114, 662188, 635921, 612743, 591986, 573140, 556360, 542078, 529952, 518715, 507230, 495323, 483574, 472816, 463909, 457373, 452835, 449199, 445632, 442130, 439056, 436582, 434796, 433819, 433479, 433183, 432421, 431171, 429656, 428083, 426641, 425315, 423580, 420897, 417765, 415561, 414889, 414727, 413751, 411945, 410259, 409210, 408593, 408235, 408200, 408368, 408458, 408431, 408373, 408212, 408038, 408437, 409826, 411690, 413170, 414201, 415368, 416778, 418007, 419176, 421069, 423908, 426866, 429224, 431301, 433710, 436316, 438568, 440443, 442417, 444671, 446951, 449157, 451554, 454308, 457195, 459990, 462909, 466405, 470460, 474285, 476879]
60382D76879J096L31O27J505K423L209L762L813L255K402J680J273J137J083P02
60367E05177k75j363j578p01L03M84P3j97k92n89p49Q1J908L651M489M730N120
60350E20272N909O869P641P713O659M796L180K450K034R44r03k663l661l965m000
60335E53275m060m223m344m108l445k863k932l492l761l348k697k399k572l118
60321E05913l958m668m474l223j884j405j336m70J333K922L534L817M794O594
60307E07489Q717J0883J3067J5142J7032J8882K0558K1288K0309J7634J3729Q837
60295F93567L091k992q760j3881j7998k0332k0323j8535j6186j3859j1386q863
60283E43543o895n656m540l095j775j342j956l099m134m762n132n571o032n933
$$ y = [476879, 477975, 478306, 478933, 480438, 482861, 486070, 489832, 493645, 496900, 499302, 500982, 502255, 503392, 504475, 505177, 504902, 503539, 501961, 501260, 501563, 502047, 502120, 501923, 501631, 501042, 500293, 500374, 502282, 505933, 510422, 515152, 520272, 526181, 533050, 540691, 548404, 555063, 559859, 563039, 565489, 567523, 568467, 567564, 564901, 561240, 557275, 553275, 549215, 544992, 540648, 536540, 533095, 530232, 527300, 523808, 520047, 516699, 514002, 511603, 509031, 505913, 501955, 497287, 492813, 489590, 487706, 486301, 484965, 484495, 485828, 488750, 492284, 496101, 500895, 507489, 516206, 527089, 540156, 555298, 572330, 591212, 611770, 633058, 653367, 671001, 684730, 693567, 696658, 693666, 684906, 671025, 653027, 632695, 612372, 593837, 577651, 563792, 552406, 543543, 536648, 530992, 526452, 523357, 521582, 520240, 518284, 515185, 511051, 506289, 501157, 495586, 489554, 483621]
60269D83621m910l510k627k412k327k184k300k653k739k505k551l020l110k272
60255D44501j144o45o29k39P37J591J689J153N05J12O2K96P40J318J851K001J634
60238D55533J135J057J318J280P40L50P72J812K817L469L784L660L047K416K405
60223D85595K979L385L049K284J952K595L976N265N747N411N001N353O640Q195
60209E47427R100R058Q601Q387Q379Q069P508P442Q125Q610P890O317N077M523
60195F54513L994L117K335J996J884J859K021J940P28j586l640m334m117m056
60181F56654m362m618m792n089n274n055m765m813m751l861k517j927k459l179
60167E99192l269l083l324l849l904l211k301j793j749j753j464r01k71L13Q51
$$ y = [483621, 478711, 475201, 472574, 470162, 467835, 465651, 463351, 460698, 457959, 455454, 452903, 449883, 446773, 444501, 443357, 442712, 442083, 441844, 442581, 444172, 445861, 447014, 447519, 447631, 447693, 447989, 448729, 450047, 451898, 453899, 455533, 456668, 457725, 459043, 460323, 461063, 461413, 462185, 463997, 466814, 470283, 474067, 477727, 480774, 483190, 485595, 488574, 491959, 495008, 497292, 499244, 501839, 505815, 511080, 516827, 522238, 527239, 532592, 539232, 547427, 556527, 565585, 574186, 582573, 590952, 599021, 606529, 613971, 622096, 630706, 638596, 644913, 649990, 654513, 658507, 661624, 663959, 665955, 667839, 669698, 671719, 673659, 674387, 672801, 669161, 664827, 660710, 656654, 652292, 647674, 642882, 637793, 632519, 627464, 622699, 617886, 613135, 609274, 606757, 604830, 602371, 599192, 595923, 592840, 589516, 585667, 581763, 578552, 576251, 574458, 572709, 570956, 569492, 568591, 568320, 568633, 569484]
60152E69484J261J447J515J695J965K051J845J555J389J360J516J977K563K858
60138E94481K814K955L717M869N876O434O536O307O127O437P119P382O628N137
60124F72819L601K312J195L05j00J19Q33J673K126K017J914K513L505L715K705
60109G01252J410P41L37n91j801k399k271k166k570l232l729l845l520k979k775
60094F71862l083l199k318o87O35J009O58J14j95JN90R90P77K72PK6J54N15J070
60075F69198J047j83k078l664n015o883r031j0214r966r241q979r060r076r124
60061E77731r317r236q585p700o966o205n097l796k680j904j491j440j457r74
60047E10883J92J586K690L438L943M239M459M878N487N952O131O170N878M715
$$ y = [569484, 570745, 572192, 573707, 575402, 577367, 579418, 581263, 582818, 584207, 585567, 587083, 589060, 591623, 594481, 597295, 600250, 603967, 608836, 614712, 621146, 627682, 633989, 640116, 646553, 653672, 661054, 667682, 672819, 676420, 678732, 679927, 680232, 680132, 680251, 681084, 682757, 684883, 686900, 688814, 691327, 694832, 698547, 701252, 702662, 703403, 703740, 703149, 701348, 698949, 696678, 694512, 691942, 688710, 684981, 681136, 677616, 674637, 671862, 668779, 665580, 663262, 662575, 663210, 664219, 664877, 664991, 664796, 664797, 665387, 666377, 667154, 667426, 667433, 667459, 667613, 668128, 669198, 670245, 670062, 667984, 664320, 659305, 652422, 643391, 633177, 623211, 613970, 604991, 595931, 586855, 577731, 568414, 559178, 550593, 542893, 535927, 529722, 524625, 520829, 518149, 516245, 514754, 513314, 511857, 510883, 511075, 512661, 515351, 518789, 522732, 526971, 531430, 536308, 541795, 547747, 553878, 560048, 565926, 570641]
60033E70641K739J003M61Q38J055M46q47k362l676m466m681m649m684m787m863
60018E42168n127n884p015p955q218p870p438p353p443p048n851m419l577l305
60004D53665k792j630m55r8m70o53QJ180J880J516O17L85J397K910L754L705L477
59987D68396L567L775L874M009M207M105L535K872K447J963R51n24j948k928l412
59972D94889l503l376l195l024k865k763k601j887j91K096M022N140N865O571
59958D95178O985O761O116N403M498L113J413j65j402k257k571k314j896j803
59944E17059j984k042j859j659j584j630j863k362k822k738k018j163o61m21K
59929D92255P72J582K127K600L452M736O004P018Q129R571J0658J0386Q730O769
$$ y = [570641, 573380, 574383, 574844, 575682, 576737, 577183, 576336, 573974, 570298, 565832, 561151, 556502, 551818, 547031, 542168, 537041, 531157, 524142, 516187, 507969, 500099, 492661, 485308, 477865, 470817, 464966, 460547, 456970, 453665, 450873, 449243, 448788, 448690, 448220, 447567, 447575, 448755, 450635, 452151, 452768, 453153, 454550, 457460, 461214, 464919, 468396, 471963, 475738, 479612, 483621, 487828, 491933, 495468, 498340, 500787, 502750, 503701, 503177, 501229, 498301, 494889, 491386, 488010, 484815, 481791, 478926, 476163, 473562, 471675, 471484, 473580, 477602, 482742, 488607, 495178, 502163, 508924, 515040, 520443, 524941, 528054, 529467, 529302, 527900, 525643, 523072, 520758, 518862, 517059, 515075, 513033, 511174, 509515, 507931, 506301, 504438, 502076, 499254, 496516, 494498, 493335, 492674, 492253, 492255, 493027, 494609, 496736, 499336, 502788, 507524, 513528, 520546, 528675, 538246, 548904, 559290, 568020, 574789]
59915E74789N418M587L796K991K476K445K969L994N121N747N761N667N700N304
59901F36765L949K108Q46O28R83J169P32l18j497k088j790j060m21K47J306K547
59885F44106L346L548L564L631L591L491L769M538N263N453N277N045M535L365
59871G02522J893J002R35Q44j75k002l695m521m422l802l192l074l509l938l814
59856F71052l324l075l038k578j553n81J48J383L464N382O174O480P357Q024O585
59841G01900K961n82k346l035l804m090k815p52N4j047k762l963n003o527q142
59826F60047q920q643p839o881n623l920k149j021r19j532k262k833l316l578
59812F00611l271k517k081k416k943k756j790p14M8N18N84qr27j287p11J29L58
$$ y = [574789, 580207, 584794, 588590, 591581, 594057, 596502, 599471, 603465, 608586, 614333, 620094, 625761, 631461, 636765, 640714, 642822, 643668, 644296, 645279, 646448, 647180, 646862, 645365, 643277, 641487, 640427, 640006, 640253, 641559, 644106, 647452, 651000, 654564, 658195, 661786, 665277, 669046, 673584, 678847, 684300, 689577, 694622, 699157, 702522, 704415, 705417, 706352, 707196, 707021, 705019, 701324, 696803, 692381, 688579, 685387, 682313, 678804, 674866, 671052, 667728, 664653, 661615, 659037, 657484, 656903, 657051, 658434, 661898, 667280, 673454, 679934, 687291, 695315, 701900, 704861, 704279, 701933, 698898, 695094, 691004, 688189, 687437, 687491, 686444, 683682, 679719, 674716, 668189, 660047, 651127, 642484, 634645, 627764, 622141, 618221, 616072, 615051, 614132, 612600, 610338, 607505, 604189, 600611, 597340, 594823, 592742, 590326, 587383, 584627, 582837, 582123, 582171, 582689, 583273, 583265, 582338, 581051, 580340, 580469, 580827]
59795E80827j10p25j028q86l96J7l07j542k909l434l097k731k807k938k752k592
59779E52590k866l216k977k223j649j446j001O1J189J680J614J641K109K887L787
59764E52180M627N078M985M799N248O532Q084R204R656R724R955J0732J1932J3094
59750F65830J4027J4953J5802J5867J4727J3032J1730J0778R443P654O102M986
59738H04931L622J617m42j840k617l226l859m546n322n954n970n369m820m766
59724G61439m799m396l811l695m148m685m963n106n331n584n540m837l467j975
59710F99102j100j068j502j885j856j136K61J755K711L318M271N511O058N457
59696G19897M546M330M746N219N735O484O850N737L002j07k092k495k085k021
$$ y = [580827, 580717, 579992, 578964, 578078, 577682, 577699, 577392, 575850, 572941, 569507, 566410, 563679, 560872, 557934, 555182, 552590, 549724, 546508, 543531, 541308, 539659, 538213, 537212, 537273, 538462, 540142, 541756, 543397, 545506, 548393, 552180, 556807, 561885, 566870, 571669, 576917, 583449, 591533, 600737, 610393, 620117, 630072, 640804, 652736, 665830, 679857, 694810, 710612, 726479, 741206, 754238, 765968, 776746, 786189, 793843, 799945, 804931, 808553, 810170, 809728, 807888, 805271, 802045, 798186, 793640, 788318, 782364, 776394, 771025, 766205, 761439, 756640, 752244, 748433, 744738, 740590, 735905, 730942, 725836, 720505, 714921, 709381, 704544, 701077, 699102, 698002, 696934, 695432, 693547, 691691, 690555, 690816, 692571, 695282, 698600, 702871, 708382, 714440, 719897, 724443, 728773, 733519, 738738, 744473, 750957, 757807, 763544, 766546, 766439, 764347, 761852, 759767, 757746]
59682G57746k794l851m296l926l406l446m215n470o784p523p241o316n633n519
59668F87326n524n401n416n447m714k946j035J36P60J382J931K263K928M380N870
59653F76493O273N709N390N925O658O647N537L457P89j900m186o123p914r478
59639F93277j0617j1360j1656j1177r879q454p575p040o223n025l837k900k377
59626E95157k607l556m438m627m590n103n925o200n879n731n998o121n763n176
59612E23443m498l552k489j798j476r78j19O40R97J227J614J998K093J779J065
59597E19946J89k68N4O94R16P27P41J151J518J583J503J274O99q2o87j180j940
59580E26838k785l087k837k787l296l797l707l143k477j841j370j310j532j467
$$ y = [757746, 754952, 751101, 746805, 742879, 739473, 736027, 731812, 726342, 719558, 712035, 704794, 698478, 692845, 687326, 681802, 676401, 670985, 665538, 660824, 657878, 656843, 656979, 657739, 659121, 661052, 663315, 666243, 670623, 676493, 682766, 688475, 693865, 699790, 706448, 713095, 718632, 722089, 722878, 720978, 716792, 710669, 702755, 693277, 682660, 671300, 659644, 648467, 638588, 630134, 622559, 615519, 609296, 604271, 600434, 597534, 595157, 592550, 588994, 584556, 579929, 575339, 570236, 564311, 558111, 552232, 546501, 540503, 534382, 528619, 523443, 518945, 515393, 512904, 511106, 509630, 508652, 508533, 509173, 510170, 511397, 513011, 515009, 517102, 518881, 519946, 520135, 519867, 519921, 520615, 521531, 522258, 522999, 524150, 525668, 527251, 528754, 530028, 530727, 530645, 529958, 528778, 526838, 524053, 520966, 518129, 515342, 512046, 508249, 504542, 501399, 498922, 497081, 495711, 494401, 492869, 491402]
59566D91402r35n37q62j690k302k313j894j423j123q74m25J20K87k6j62M33J286
59549D78962J560J376J585K411L216L647M090M871N883P203R193J1774J4346J6682
59535E66799J8977K0650K0015J5877R047J769l981p395q650q343p012m965k628
59522F10160p78L6J86M48R15R88L29r06k617m730o623p580p846q247q746q439
59506E56550p176n979n474n085m292l610l533l555l030k289k018k168k227k009
59492E04105j594q80J26J061J729K410L239L841L978L998M155M214M094M189M596
59477E43261M753M446M352M889N360N005M126L341K464J116j77o29n13p56j448
59462E79590j762j276m13M23J368K621M046N284N963N981N889O537P969R066Q864
$$ y = [491402, 490467, 489930, 489068, 487378, 485076, 482763, 480869, 479446, 478323, 477449, 477024, 477144, 477431, 477405, 477243, 477676, 478962, 480522, 481898, 483483, 485894, 489110, 492757, 496847, 501718, 507601, 514804, 523997, 535771, 550117, 566799, 585776, 606426, 626441, 642318, 651365, 653134, 649153, 641758, 633108, 624765, 617753, 612788, 610160, 609382, 609418, 609604, 610052, 610967, 611955, 612284, 611378, 608761, 604031, 597408, 589828, 581982, 573735, 564989, 556550, 549374, 543395, 537921, 532836, 528544, 524934, 521401, 517846, 514816, 512527, 510509, 508341, 506114, 504105, 502511, 501631, 501757, 502818, 504547, 506957, 510196, 514037, 518015, 522013, 526168, 530382, 534476, 538665, 543261, 548014, 552460, 556812, 561701, 567061, 572066, 576192, 579533, 581997, 583113, 582936, 582307, 581794, 581038, 579590, 577828, 576552, 576139, 576562, 577930, 580551, 584597, 589881, 595844, 601825, 607714, 614251, 622220, 631286, 640150]
59447F40150P729O654N894M965L532J528j162m266o768p772p580p074o445n371
59433F24014m112l427l433l520l326k938k215q36R38K400L464M784O672Q624J0096
59418F37185J1109J1972J3017J4694J7240K0156K2677K4718K6461K6878K3785
59407H49892J6096N471m771j1934j4920j3916r993m680R00O486J1773J5282J4898
59394H60584R807J572p000j3785j8089k0034j9858j7977j5176j2281r650p264
59382G30849n176l509k172j030l16l51p69p37j63k7j011k400k905k216j083k17
59366G06767K21K75L2k12k08q4NL76J479L120M651N794O768P662Q401R285J0882
59349G65214J3154J5287J6603J7182J7399J7344J7024J6670J6434J6019J4948
$$ y = [640150, 647879, 654533, 660427, 665392, 668924, 670452, 669290, 665024, 658256, 650484, 642904, 635830, 629385, 624014, 619902, 616475, 613042, 609522, 606196, 603258, 601043, 600207, 601145, 603545, 607009, 611793, 618465, 627089, 637185, 648294, 660266, 673283, 687977, 705217, 725373, 748050, 772768, 799229, 826107, 849892, 865988, 871459, 866688, 854754, 839834, 825918, 815925, 811245, 812145, 818631, 830404, 845686, 860584, 870391, 871963, 864963, 851178, 833089, 813055, 793197, 775220, 760044, 747763, 738113, 730849, 725673, 722164, 719992, 718962, 718646, 718295, 717526, 716789, 716626, 716599, 715588, 713188, 710283, 708067, 706984, 706767, 706988, 707263, 707295, 707083, 706875, 706791, 706796, 707172, 708651, 711771, 716422, 722216, 728984, 736646, 745047, 754332, 765214, 778368, 793655, 810258, 827440, 844839, 862183, 879207, 895877, 912311, 928330, 943278]
59338I43278J3084J0661P926N005K050p06l139n327p411r335j0870j1995j3084
59325I20137j4424j5629j6009j5598j5275j5539j5666j4709j2909j1412j0706
59314G62261j0140r114q026p592p750p766p272o619o173n630m378k310L3K178
59300F81702M233O519Q937J0964J2056J1703R363M888r38o795j1759j5483j7569
59287F97821j7534j5583j2780j0051p493m974k764j167J3J201K616M446O940R872
59273F50563J2367J3829J4671J5601J6544J6853J6304J5279J4133J2872J1364
59262H10380R426O900L948J155j030k756m387n959p215p921p857o890n375m061
59248G78358l291k744k183j810j594r50L09J413J772J923K585L417L637L374L322
$$ y = [943278, 956362, 967023, 974949, 979954, 982004, 981298, 978159, 972832, 965421, 956086, 945216, 933221, 920137, 905713, 890084, 874075, 858477, 843202, 827663, 811997, 797288, 784379, 772967, 762261, 752121, 743007, 734981, 727389, 719639, 711873, 704601, 697982, 691809, 686179, 681801, 679491, 679524, 681702, 685935, 692454, 701391, 712355, 724411, 736114, 745477, 750365, 749427, 742632, 730873, 715390, 697821, 680287, 664704, 651924, 641873, 634380, 629406, 626642, 625475, 625488, 626689, 629305, 633751, 640691, 650563, 662930, 676759, 691430, 707031, 723575, 740428, 756732, 772011, 786144, 799016, 810380, 819806, 826706, 830654, 831809, 830779, 828023, 823636, 817677, 810462, 802541, 794684, 787794, 782419, 778358, 775067, 772323, 770140, 768330, 766736, 765786, 766095, 767508, 769280, 771203, 773788, 777205, 780842, 784216, 787538]
59233G87538L485L266K548J621L57j506l471m782n731p276r328j0583j0353r526
59219G36259r292r791j0432j0799j0764j0246r319q237p113n971n027m484m042
59206F30742l152j863p77j69K89P80R93P13K78J67N39J319K356L364M077M543
59190F44199N034N605O096O491O969P638Q383Q873Q598P296N612M722M919N168
59176G35603M616L729L190K511R48q59j611j338j206j478j256l66O0o73j798k385
59160G37687k561k882l510m532o122p832q665q434q211q837r763j0020r543q856
59146F37919q107p184o340n981o063o185o011n429m613m092m249m601m176k766
59132E62122j140P0R63J645J858J681J805K680M032N544P176Q565R059Q850R080
$$ y = [787538, 791023, 794289, 796837, 798458, 798815, 797309, 793838, 789056, 783325, 776049, 766721, 756138, 745785, 736259, 726967, 717176, 706744, 695945, 685181, 674935, 665616, 657379, 650266, 644295, 639268, 634784, 630742, 627590, 625727, 624950, 624781, 625070, 625850, 626843, 627556, 627834, 628001, 628540, 629859, 632215, 635579, 639656, 644199, 649233, 654838, 660934, 667425, 674394, 682032, 690415, 699288, 707886, 715182, 720794, 725516, 730435, 735603, 740219, 743948, 747138, 749649, 750597, 749738, 748127, 746789, 745583, 744105, 742849, 742483, 742543, 741870, 740072, 737687, 735126, 732244, 728734, 724202, 718080, 710248, 701583, 693149, 684938, 676101, 666338, 656318, 646775, 637919, 629812, 622628, 616288, 610307, 604244, 598059, 592048, 586619, 582006, 577914, 573665, 569064, 564888, 562122, 560982, 561052, 562015, 563660, 565518, 567199, 569004, 571684, 575716, 581260, 588436, 597001, 606060, 614910, 623990]
59117F23990J0253J1450J1787J1718J2032J2422J2007J0623Q704O480M178K490
59105G38134J818J512P37k97r29j379k373l722m407m075l424l091l027l076l252
59090G09149l213k389r23J56R1p77j657k287k853l441m063m920o125p235p600
59075F61913p183o650o458o271n572m634m261m625m982m707m102l783l809l911
59061E90965m139m559m704m113l224k863k970k779k216k082k622k903k143q32
59047E48816K4J64N8Q5J98J42k85r19j134m99N22J093J231J693K605L149K966
59030E59909K867L666N118O605Q074R733J1509J3362J5468J7477J8387J7774J6486
59017G06435J5353J3941J1385P835M119N31l008n939p374p370o987o974p095o809
$$ y = [623990, 634243, 645693, 657480, 669198, 681230, 693652, 705659, 716282, 724986, 731466, 735644, 738134, 739952, 741464, 742201, 741904, 740975, 739596, 737223, 733501, 729094, 725019, 721595, 718504, 715477, 712401, 709149, 705936, 703547, 702624, 702780, 702871, 702094, 700437, 698150, 695297, 691856, 687793, 682873, 676748, 669513, 661913, 654730, 648080, 641622, 635351, 629779, 625145, 620884, 616259, 611277, 606570, 602468, 598685, 594876, 590965, 586826, 582267, 577563, 573450, 570226, 567363, 564393, 561614, 559398, 557316, 554694, 551791, 549648, 548816, 548840, 549004, 549062, 549147, 549345, 549487, 549202, 548283, 547149, 546650, 547172, 548265, 549496, 551189, 553794, 556943, 559909, 562776, 566442, 571560, 578165, 586239, 595972, 607481, 620843, 636311, 653788, 672175, 689949, 706435, 721788, 735729, 747114, 754949, 759068, 759599, 756591, 750652, 743278, 735908, 728921, 721947, 714852, 708043]
59003G08043n961m718l286j809k42J528L245M222M089L317K588J867O89q87k128
58988G10557k486k160j748j637j692j458o60M39J353J974K594L430M607O416Q991
58973G28520J1643J3379J4205J5158J6784J8403J9262J9461J9256J8351J6624
58962I11046J4751J3327J1909R788P067M287J440j778n161q219j0947j3610j6021
58949I17879j7686j8505j8788j8832j8779j8616j7915j6127j3513j1190r805q778
58937G29345p370n758m407l167j800p77n63o16J2J358K632L278L272K762K038
58922G20239J467Q98l10k090l274l089k328k137k420k477k429k768l055k356o28
58907F93243J409L383N221O535P235Q241J0302J2604J3833J4152J4679J5421J5421
$$ y = [708043, 702082, 697364, 694078, 692269, 692027, 693555, 696800, 701022, 705111, 708428, 711016, 712883, 713572, 712685, 710557, 708071, 705911, 704163, 702526, 700834, 699376, 698716, 699155, 700508, 702482, 705076, 708506, 713113, 719529, 728520, 740163, 753542, 767747, 782905, 799689, 818092, 837354, 856815, 876071, 894422, 911046, 925797, 939124, 951033, 960821, 967888, 972175, 973615, 971837, 966676, 958457, 947510, 933900, 917879, 900193, 881688, 862900, 844068, 825289, 806673, 788758, 772631, 759118, 747928, 738123, 729345, 721975, 716217, 711810, 708643, 706843, 706066, 705503, 704887, 704899, 706257, 708889, 712167, 715439, 718201, 720239, 721706, 722604, 722294, 720204, 716930, 713841, 711513, 709376, 706956, 704479, 702050, 699282, 696227, 693871, 693243, 694652, 698035, 703256, 709791, 717026, 725267, 735569, 748173, 762006, 776158, 790837, 806258, 821679]
58894H21679J4704J4323J4464J4304J3863J4322J6045J7915J9074J9801K0101
58883A000595J9017J6240J3087J0838R104O749L654N78k046m325o351q122r760
58870A049258j1298j2512j3191j3262j2592j1230r829r099q812q141p155o926
58858I25211p908r187r801r855r751r227p962o439n402m946m760m852n367o076
58844H23678o694p434q671j0203j1436j2128j2550j2942j3079j2537j1264r883
58832F94857r189r212q974p634n577l845k713j626l92N53J195K293M126N806O448
58817F66116O486O955P857Q026O737M747L461L337L487K908J676N54k86j415k926
58802G17720l968m060m040m864o097o654o562o783p495p875p643p564q060q379
$$ y = [821679, 836383, 850706, 865170, 879474, 893337, 907659, 923704, 941619, 960693, 980494, 1000595, 1019612, 1035852, 1048939, 1059777, 1068881, 1075630, 1079284, 1079862, 1077816, 1073491, 1067140, 1059018, 1049258, 1037960, 1025448, 1012257, 998995, 986403, 975173, 965344, 956245, 947433, 939292, 932137, 925211, 917303, 908116, 898315, 888460, 878709, 869482, 861520, 855081, 849679, 844733, 839973, 835121, 829754, 823678, 816984, 809550, 800879, 790676, 779240, 767112, 754562, 741620, 728541, 716004, 704740, 694857, 685668, 676456, 667482, 659848, 654271, 650426, 647713, 646087, 645695, 646248, 647443, 649736, 653862, 659668, 666116, 672602, 679557, 687414, 695440, 702177, 706924, 710385, 713722, 717209, 720117, 721793, 722347, 722061, 720646, 717720, 713752, 709692, 705652, 700788, 694691, 688037, 681475, 674692, 667197, 659322, 651679, 644115, 636055, 627676]
58788F27676p663o018m084k252p38L10J111K182L567M740N431N998O640O925O403
58773F50228N214L665J820k85k383m263n943p375q331q660q353p393o019m919
58759E97003m485m031k566l54J241J570J402J537J683J259N16J72M42R44J324
58744E97657J601K030K799L691M187M255M691O031P439P594O535N565N318N086
58730F64479M301L473L129K822J934O79l79j189j974k601k695k118r75M89J821
58715F71196K603K980L499M286M872M813M019K453K20k043l651m818o428q723
58701F75278j0979j2536j3361j3575j3272j2880j2824j2757j2056j1024j0476
58690E39538j0179r057p143n823n666n520m485l335l114l470l529l351l450l637
$$ y = [627676, 620013, 613995, 609911, 607659, 606921, 607231, 608342, 610524, 614091, 618831, 624262, 630260, 636900, 643825, 650228, 655442, 659107, 660927, 660642, 658259, 653996, 648053, 640678, 632347, 623687, 615334, 607941, 601922, 597003, 592518, 588487, 585921, 585567, 586808, 588378, 589780, 591317, 593000, 594259, 594775, 594947, 595389, 596333, 597657, 599258, 601288, 604087, 607778, 611965, 616220, 620911, 626942, 634381, 641975, 648510, 654075, 659393, 664479, 668780, 672253, 675382, 678204, 680138, 680817, 680438, 679249, 677275, 674674, 671979, 669861, 668886, 669375, 671196, 673799, 676779, 680278, 684564, 689436, 694249, 698268, 700721, 700941, 698898, 695247, 690429, 684001, 675278, 664299, 651763, 638402, 624827, 611555, 598675, 585851, 573094, 561038, 550014, 539538, 529359, 520302, 513159, 507336, 501670, 496150, 491665, 488330, 485216, 481746, 478217, 474866, 471416, 467779]
58676D67779l345k516j396o7J089J339P28N02J619L569N422P161Q999J0296J0280
58661E11459R246P977O427M126J411p79k191l358m620n811o746p340p375o825
58647D95601o171n851n637n057m117l152k295j573j152r88o22K05J102J583J732
58632D63608J897K202K619L074L186K488J199J02n38j219k044k332j763r22j82
58617D71375Q67K212K886K504K265L224M548M805M207M116M788N110M507L754
58603E21168L703M160M283L514J991M34m15n39n65q23r34n73O3Q46K077L770N358
58586E47518O537P666Q842R555R760J0247J1176J1388J0142Q464P661P432O732
58573F63120N600M848M587M498N010O745R208J1381J3367J6109J9710K3182K5764
$$ y = [467779, 464434, 461918, 460522, 460455, 461544, 462883, 463611, 464113, 465732, 469301, 474723, 481884, 490883, 501179, 511459, 520705, 528682, 535109, 539235, 540646, 539867, 537676, 534318, 529698, 523887, 517141, 509801, 502426, 495601, 489430, 483579, 477942, 472885, 468768, 465616, 463321, 461748, 460596, 459608, 458986, 459191, 460293, 461876, 463608, 465505, 467707, 470326, 473400, 476586, 479074, 480273, 480375, 479837, 478618, 476574, 474242, 472479, 471557, 471375, 472242, 474454, 477340, 479844, 482109, 485333, 489881, 494686, 498893, 503009, 507797, 512907, 517414, 521168, 524871, 529031, 533314, 536828, 538819, 539253, 538838, 538299, 537734, 536911, 535977, 535404, 535467, 536313, 538390, 542160, 547518, 554055, 561721, 570563, 580118, 589878, 600125, 611301, 622689, 632831, 641295, 648956, 656388, 663120, 668720, 673568, 678155, 682653, 687663, 694408, 703616, 714997, 728364, 744473, 764183, 787365, 813129]
58560H13129K7348K7785K6801K4584K1540J7664J2935Q083L966N84k405m605n380
58547I72029n084m697m458l995l584m112n908q571j1827j5498j8831k0970k2101
58534H42393k3053k3796k3392k1495j8899j6440j4234j2172j0391q991p850o878
58522F54802o046n241m472m022l929l799l460l351l668l770l152k402k271k422
58508F02797k081j436j213j325j080n51n29j216j907j996j485o29J87M18nk75
58492E87674L28J395K072K398L117M433N923P369Q907J0496J1988J3433J4773
58479F74306J5672J6248J7266J8859J9765J8744J6056J2595Q413L263k093o477
58467H12617r658j1965j3125j2724j1328r801p981n280k052Q98L723O993J0235
$$ y = [813129, 840477, 868262, 895063, 919647, 941187, 958851, 971786, 979869, 983835, 984419, 982014, 977409, 972029, 966945, 962248, 957790, 953795, 950211, 946099, 940191, 931620, 919793, 904295, 885464, 864494, 842393, 819340, 795544, 772152, 750657, 731758, 715318, 701084, 688912, 678521, 669530, 661680, 654802, 648756, 643515, 639043, 635021, 631092, 627293, 623833, 620482, 616814, 613044, 609892, 607490, 605219, 602797, 600716, 599280, 598067, 596742, 595662, 595111, 594582, 593366, 591459, 589463, 587978, 587349, 587536, 587954, 587949, 587674, 588002, 589397, 591469, 593867, 596984, 601417, 607340, 614709, 623616, 634112, 646100, 659533, 674306, 689978, 706226, 723492, 742351, 762116, 780860, 796916, 809511, 817924, 821187, 819094, 812617, 802959, 790994, 777869, 765145, 753817, 744016, 736035, 730755, 728703, 729601, 733324, 740317, 750552]
58454G50552J2435J3592J4437J4904J4274J2457R727N747L35n199r089j1284j3017
58441H09871j4537j4882j3785j2073j0210p974n612l831k521r43Q15J903K326
58428G28547L078M613O394Q026R596J0842J1145J0408Q895O473L075m38l030m817
58414H02807o465p850q573r188j0289j1030j0273q734q125q443q053o284m072
58401F95428k190o05M33N54N17J485L051L698L242K994L478L804L410K752K124
58386G24175J410J070J705K743L105L064L747M979N499N171N087N554N847N909
58372G79065O376P028P051O746P096P894Q228Q504R780J1462J2006J1694J2170
58359H95100J3399J3649J2499J1230J0187Q405O053M493L662K133N1p55j5N09
$$ y = [750552, 762987, 776579, 791016, 805920, 820194, 832651, 842378, 848125, 848460, 843261, 834172, 822888, 809871, 795334, 780452, 766667, 754594, 744384, 736410, 730798, 726967, 724446, 723503, 724318, 726221, 728547, 731625, 736238, 742632, 750658, 760254, 771096, 782241, 792649, 801544, 808017, 811092, 810654, 807624, 802807, 796342, 788492, 779919, 770731, 760442, 749412, 739139, 730405, 722280, 713837, 705784, 699500, 695428, 693238, 692633, 693066, 693620, 694137, 695622, 698673, 702371, 705613, 708607, 712085, 715889, 719299, 722051, 724175, 725585, 726655, 728360, 731103, 734208, 737272, 741019, 745998, 751497, 756668, 761755, 767309, 773156, 779065, 785441, 792469, 799520, 806266, 813362, 821256, 829484, 837988, 847768, 859230, 871236, 882930, 895100, 908499, 922148, 934647, 945877, 956064, 964469, 970522, 975015, 978677, 980810, 980861, 980106, 980091, 980600]
58345I80600K84Q42K637L995M113M440O011P844R034J0087J1342J2198J2623J3320
58331A079370J4006J3799J3402J4296J5583J4731J1678Q998P572N641K809J306
58319A203191K011K756K083J440K089K999L391M334O203P505P738Q587J0756J2487
58305A277570J2702J2704J3439J4032J4322J5599J7439J7280J4872J3578J5316
58294A438853J7649J7959J7254J7482J8275J8768J9748K1714K3417K4276K5640
58283A661035K7924K9460K9758L0673L2698L3566L2352L1378L2090L2756L2317
58272B006007L2708L5044L7299L8179L9557M2670M5674M7438M9857N3930N7438
58261B485801N9014O0500O2831O3843O2648O1711O2064O1224N8551N7539N9779
$$ y = [980600, 980884, 981726, 984363, 988358, 992471, 996911, 1002922, 1010766, 1019800, 1029887, 1041229, 1053427, 1066050, 1079370, 1093376, 1107175, 1120577, 1134873, 1150456, 1165187, 1176865, 1185863, 1193435, 1199076, 1201885, 1203191, 1205202, 1207958, 1210041, 1211481, 1213570, 1216569, 1219960, 1224294, 1230497, 1238002, 1245740, 1254327, 1265083, 1277570, 1290272, 1302976, 1316415, 1330447, 1344769, 1360368, 1377807, 1395087, 1409959, 1423537, 1438853, 1456502, 1474461, 1491715, 1509197, 1527472, 1546240, 1565988, 1587702, 1611119, 1635395, 1661035, 1688959, 1718419, 1748177, 1778850, 1811548, 1845114, 1877466, 1908844, 1940934, 1973690, 2006007, 2038715, 2073759, 2111058, 2149237, 2188794, 2231464, 2277138, 2324576, 2374433, 2428363, 2485801, 2544815, 2605315, 2668146, 2731989, 2794637, 2856348, 2918412, 2979636, 3038187, 3095726, 3155505]
58250C155505O2022O2497O4557P0290P6236P9668Q3522R0604R8409J04372J10687
58239D058369J19231J27277J33247J40869J52440J63984J72446J81559J94734
58230E444156K08616K19889K32049K48797K67187K84158L03300L27977L54555
58221G890684L79865M08416M44473M84378N24821N70882O27311O90148P56074
58212A2777052Q31199R20930J020966J129189J255885J410319J588681J788797
58204B2723018K024705K311981K652558L052169L540120M154552M926217N901650
58196E1286970P167227Q825742J0968077J3692738J7113726K1281999K6088849
58189A56425328L1246793L6254854M0219911M1738939L9269286L2000861K0577015
$$ y = [3155505, 3217527, 3280024, 3344581, 3414871, 3491107, 3570775, 3654297, 3744901, 3843310, 3947682, 4058369, 4177600, 4304877, 4438124, 4578993, 4731433, 4895417, 5067863, 5249422, 5444156, 5652772, 5872661, 6104710, 6353507, 6620694, 6904852, 7208152, 7536129, 7890684, 8270549, 8678965, 9123438, 9607816, 10132637, 10703519, 11330830, 12020978, 12777052, 13608251, 14529181, 15550147, 16679336, 17935221, 19345540, 20934221, 22723018, 24747723, 27059704, 29712262, 32764431, 36304551, 40459103, 45385320, 51286970, 58454197, 67279939, 78248016, 91940754, 109054480, 130336479, 156425328, 187672121, 223926975, 264146886, 305885825, 345155111, 377155972, 397732987]
58182C97732987O985004o326459j7410809k5296302k9930708l1855608l1827017
58175B62071088l0518850k8405706k5810294k2984670k0132299j7400836j4894163
58168A01924270j2683042j0791550r194093p847830o721583n788067n009826m351432
58160C9536847l794342l326408k928193k582265k284889k035372j822815j634907
58152A9127656j470741j332992j215112j107435j009022r22689q44521p68618
58144A0456526o96698o33205n75836n19892m67416m23197l86012l51972l22395
58135F079903l00287k82765k64763k46924k32537k20015k05556j90294j77930
58126C958832j67834j56973j46067j37634j30490j22085j13846j08366j03932
$$ y = [397732987, 404717991, 398391532, 380980723, 355684421, 325753713, 293898105, 262071088, 231552238, 203146532, 177336238, 154351568, 134219269, 116818433, 101924270, 89241228, 78449678, 69255585, 61407755, 54686172, 48898105, 43888279, 39536847, 35742505, 32416097, 29487904, 26905639, 24620750, 22585378, 20762563, 19127656, 17656915, 16323923, 15108811, 14001376, 12992354, 12069665, 11225144, 10456526, 9759828, 9126623, 8550787, 8030895, 7563479, 7140282, 6754270, 6402298, 6079903, 5779616, 5496851, 5232088, 4985164, 4752627, 4532612, 4327056, 4136762, 3958832, 3790998, 3634025, 3487958, 3350324, 3219834, 3097749, 2983903, 2875537, 2771605]
58117B771605r7481r0482q6137q3159p8143p1955o7927o5553o1707n6658n3369
58106A959034n1967n0159m8072m7728m8483m7699m5267m3328m2228m0630l8704
58095A454769l7403l5735l2380k8849k7345k6793k4648k1270j8774j6847j3772
58084A170953j0472r572j1120j2853j4007j5463j6918j7327j7391j8501j9929
58073A007400k0107j9644k0049k0556j9398j7106j5501j4427j2662j0861j0446
58062H26643j0609r649q196p930q301p797p273q495j0497j0994j0444j0950j2017
58049G03491j1304q989p574p576p224o220o073o740o531n545n658o928p383o679
58035F03067o608p553p743o699o229p226q348q680q999r612r528q562p922p937
$$ y = [2771605, 2674124, 2583642, 2497505, 2414346, 2336203, 2264248, 2196321, 2130768, 2069061, 2012403, 1959034, 1907067, 1856908, 1808836, 1761108, 1712625, 1664926, 1619659, 1576331, 1534103, 1493473, 1454769, 1417366, 1381631, 1349251, 1320402, 1293057, 1266264, 1241616, 1220346, 1201572, 1184725, 1170953, 1160481, 1150909, 1139789, 1126936, 1112929, 1097466, 1080548, 1063221, 1045830, 1027329, 1007400, 987293, 967649, 947600, 927044, 907646, 890540, 875039, 860612, 847950, 837089, 826643, 816034, 806385, 798189, 790259, 781958, 774161, 766888, 758393, 747896, 736902, 726458, 715508, 703491, 692187, 683198, 675624, 668048, 660824, 654604, 648531, 641791, 635260, 629715, 624057, 617129, 609746, 603067, 596459, 588906, 581163, 574464, 568235, 561009, 552661, 543981, 534982, 525370, 515842, 507280, 499358, 491421]
58021D91421p485o287n581n819n858n104m405m270m102l707l704m018l785l060
58007D24236k820l068k779j909j457j374n13J070J882J455J065J481J926J715
57993D20910J230P48k1q57j109j037j579k602l054k888l111l837m151l952m077
57978C90613m467m142l206k863l192k843j342J79Q90J176J337J109P59Q41P87
57963C75636m50k178k473j087K02M13L00J70q57k705l819l676l677m485m654l158
57947C43502j375r76j444j132L54K161L591M462M867N359O573Q121Q887Q706Q587
57932D00243Q907Q743P465N663L891J890m45k572m365o264q034q715q368q259
57918C89780q787q764p562o312o058o134n389l826k080l98R95J574J425J458K068
$$ y = [491421, 483936, 477649, 472068, 466249, 460391, 455287, 450882, 446612, 442510, 438803, 435099, 431081, 427296, 424236, 421416, 418348, 415569, 413660, 412203, 410829, 410316, 411386, 413268, 414723, 415788, 417269, 419195, 420910, 422140, 422888, 422867, 422010, 420901, 419864, 418285, 415683, 412629, 409741, 406630, 402793, 398642, 394690, 390613, 386146, 382004, 378798, 375935, 372743, 369900, 368558, 368737, 369627, 370803, 372140, 373249, 374008, 374849, 375636, 375186, 373008, 370535, 369448, 369650, 370063, 370363, 370533, 369676, 366971, 363152, 359476, 355799, 351314, 346660, 343502, 342127, 341151, 339707, 338575, 338929, 341090, 344681, 349143, 354010, 359369, 365942, 374063, 382950, 391656, 400243, 409150, 417893, 425358, 431021, 434912, 436802, 436357, 433785, 429420, 423156, 415122, 406407, 398039, 389780, 380993, 372229, 364667, 358355, 352297, 346163, 340774, 336948, 334868, 334470, 335465, 337039, 338464, 339922, 341990]
57903C41990K505K150J316L72p21j542j235OQ52Q46J055K099L051L099K745K457
57887C61045J691L39l47L67J209O56r29k192k806l262l569l497l448l848m249
57872C37160m100l770l877m119l838l114k444j841j063k33M82J288K297L231M040
57857C20099N049O054O282N748N587O352P075O828O111N767N529M687L387K142
57843C96697Q60o57j938k496k700l090l505l677l981m681n146m735l828l177k802
57828C51144k395k094k066j905j285o37l95l10j71m18j250j962k037k079k687
57813C29453l284l128k753l185m376n513o368p179p602o996n574m298l748l793
57799B61656m058m037l227j780o75n41q02n97J6M87P63J149J670K257L003L727
$$ y = [341990, 344495, 346645, 347961, 348333, 347612, 346070, 344835, 344841, 345693, 346539, 347594, 349693, 352744, 355843, 358588, 361045, 362736, 363075, 362728, 363095, 364304, 364960, 364031, 361839, 359033, 355771, 352202, 348705, 345257, 341409, 337160, 333060, 329290, 325413, 321294, 317456, 314342, 311898, 310057, 308994, 308761, 309243, 310531, 312828, 316059, 320099, 325148, 331202, 337484, 343232, 348819, 355171, 362246, 369074, 375185, 380952, 386481, 391168, 394555, 396697, 397557, 396900, 394962, 392466, 389766, 386676, 383171, 379494, 375513, 370832, 365686, 360951, 357123, 353946, 351144, 348749, 346655, 344589, 342684, 341399, 340762, 340367, 340057, 339886, 339468, 338218, 336256, 334219, 332140, 329453, 326169, 323041, 320288, 317103, 312727, 307214, 300846, 293667, 286065, 279069, 273495, 269197, 265449, 261656, 257598, 253561, 250334, 248554, 247879, 247338, 246536, 245939, 245955, 246442, 247205, 248354, 250024, 252281, 255284, 259011]
57783B59011L936L829M359N771P032P488P908Q882R396Q372O636N799N894N632
57769C49945M454K891J286l85j764k478l026m100n320n811n615n332m813l615
57755C16317k324k032k570k727k136j576j441j215o48j38J79O79J289J358P12
57740C03727K0r9L39R66J289Q23k56q40n0J541K735L284L700L949L583K927K823
57723C30461L277L567L534L608L624K975J886J234J006L09r86j933k088k087k383
57708C46004k720l179m339n954o785o315n442m833l941k376j032o97o43K45J586
57693B99579K000J060l05j242j880k748l950n024n318m515k977j470l71O31J995
57678B75465L791N897Q433J1805J6492K2839L0803L9921M9826O0700P2650Q4363
$$ y = [259011, 262947, 266776, 271135, 276906, 283938, 291426, 299334, 308216, 317612, 325984, 332620, 338419, 344313, 349945, 354399, 357290, 358576, 358191, 356427, 353949, 350923, 346823, 341503, 335692, 330077, 324745, 319932, 316317, 313993, 311961, 309391, 306664, 304528, 302952, 301511, 300296, 299648, 299510, 299689, 300368, 301657, 303015, 303727, 303747, 303648, 303987, 304953, 306242, 307065, 306809, 305969, 305919, 307460, 310195, 313479, 317179, 321128, 324711, 327638, 330461, 333738, 337305, 340839, 344447, 348071, 351046, 352932, 354166, 355172, 355481, 354495, 352562, 350474, 348387, 346004, 343284, 340105, 335766, 329812, 323027, 316712, 311270, 306437, 302496, 300120, 299088, 298391, 297748, 297993, 299579, 301579, 302639, 302334, 301092, 299212, 296464, 292514, 287490, 282172, 277657, 274680, 273210, 272839, 273470, 275465, 279256, 285153, 293586, 305391, 321883, 344722, 375525, 415446, 465272, 525972, 598622, 682985]
57666F82985R2571R3109Q2723O0766L0082l645l4288n7694p2303p8283p6942p0630
57654F48451o2044n3071m4582l7104l1050k6311k2365j8940j6084j3596j1037
57643C12267q396o128m461l228k352j899j618j083l45J72L37L42J05n70j306j440
57627B80397j109j220k161l260l772l679l321k870k469k295k255k112j978k144
57613B45752k406k261j795j589j640j231r6J098J719J873J765J204J44r06j510
57598B40121j862k305k830l314l809m270m444m297m130m057l839l385k937k599
57584A92043k138j447p28j87N8k35j126k054k316j984j757j937k286k693l124
57569A68089l080k179j224j473k700l246k373j190q43j032j049j010j156j013
$$ y = [682985, 775556, 868665, 951388, 1012154, 1042236, 1038591, 1004303, 946609, 874306, 796023, 719081, 648451, 586407, 533336, 488754, 451650, 420600, 394289, 371924, 352984, 336900, 323304, 312267, 303871, 297743, 293282, 290054, 287702, 285803, 284185, 283102, 282757, 282929, 283266, 283608, 283713, 283143, 281837, 280397, 279288, 278068, 275907, 272647, 268875, 265196, 261875, 259005, 256536, 254241, 251986, 249874, 247896, 245752, 243346, 241085, 239290, 237701, 236061, 234830, 234734, 235832, 237551, 239424, 241189, 242393, 242537, 241631, 240121, 238259, 235954, 233124, 229810, 226001, 221731, 217287, 212990, 208860, 204803, 200964, 197579, 194642, 192043, 189905, 188458, 187730, 187543, 187601, 187366, 186240, 184186, 181870, 179886, 178129, 176192, 173906, 171213, 168089, 165009, 162830, 161606, 160133, 157433, 154187, 151814, 150624, 149781, 148749, 147700, 146690, 145534, 144521]
57555A44521k45N11O38O27J200K037K350K096J716J168K21p28j099j078j214j360
57539A51361q98J86J254J878K056J766J038L61L00O93P99K58n50j070j119q40
57523A57473m55m7M92J133J448J119P15J162K267K626J503J5k77O97J747K049
57507A73667J707J105N61L93N91N81r0j099j856k355k842l090k707k006j691j844
57491A59025j933j776j712j840j745j178m88j85l90p75q74m64R9J41n47j365j674
57474A42319j576j612j906k104j950j548j095o71k89L3J18l32j275j972j643n35
57458A23962L24N14M95L86m47k009l019k488j178m64m64l61J8J05k13m93n75o06
57440A13487l18O67J881K291J622O10m5k31mN55J025R22L61j18l41n28n89k05
$$ y = [144521, 144276, 144787, 145425, 146052, 147252, 149289, 151639, 153735, 155451, 156619, 156840, 156112, 155013, 153935, 152721, 151361, 150463, 150649, 151903, 153781, 155837, 157603, 158641, 159002, 159302, 159995, 160794, 161052, 160502, 159432, 158313, 157473, 157018, 156971, 157463, 158596, 160044, 161163, 161878, 163040, 165307, 167933, 169436, 169451, 169174, 169871, 171618, 173667, 175374, 176479, 177040, 177433, 178024, 178605, 178515, 177416, 175560, 173205, 170363, 167273, 164566, 162560, 160869, 159025, 157092, 155316, 153604, 151764, 150019, 148841, 148353, 148168, 147778, 147003, 146129, 145665, 145764, 145905, 145358, 143993, 142319, 140743, 139131, 137225, 135121, 133171, 131623, 130528, 129857, 129568, 129601, 129719, 129387, 128112, 126140, 124497, 123962, 124286, 124800, 125295, 125681, 125234, 123225, 120206, 117718, 116540, 116076, 115612, 115251, 115269, 115374, 115161, 114668, 114093, 113487, 113169, 113836, 115717, 118008, 119630, 120240, 120195, 119964, 119960, 120515, 121540, 122462, 122823, 122705, 122364, 121836, 121247, 121042]
57422A21042M74R08J001J104J175P45k10j010j168r67q95j002r84n58L14J292
57406A21261J744J325L75n66j362k025k208j572m33N00Q99Q46M29q7j15N53J198
57389A20762J157R35J421K315K535K027J874K488K960K556J769J287R18J73o93
57374A44484r93n30K15O33L96l75j180j597j712j801j825j588j216q50j86R81
57358A32856J960J841R11M03P91J329J383J178R96O16j1m17l96l34m64n14m62
57341A41666p56j384j603j045l40j09j13M4J35j19l96l85m51j004j730k016j775
57324A28619j275o75k83o48j711k384j713j72R21R89N64L26M04N33M75K29R6L00
57306A24595N01J78m10l65L99P57K5q08m23Q59J561J143N11M77P60P47M29K20
$$ y = [121042, 121516, 122424, 123425, 124529, 125704, 126449, 126239, 125229, 124061, 123094, 122199, 121197, 120213, 119655, 119969, 121261, 123005, 124330, 124705, 124139, 122777, 120752, 118544, 116972, 116539, 117039, 117938, 118784, 119213, 119126, 119011, 119564, 120762, 121919, 122854, 124275, 126590, 129125, 131152, 133026, 135514, 138474, 141030, 142799, 144086, 145004, 145177, 144484, 143491, 142961, 143176, 143809, 144205, 143830, 142650, 141053, 139341, 137540, 135715, 134127, 132911, 132061, 131875, 132856, 134816, 136657, 137568, 137971, 138762, 140091, 141474, 142652, 143648, 144264, 144253, 143836, 143440, 143106, 142642, 142128, 141666, 140910, 139526, 137923, 136878, 136538, 136429, 136316, 136360, 136495, 136376, 135980, 135595, 135144, 134140, 132410, 130394, 128619, 127344, 126669, 126386, 125738, 124027, 121643, 119930, 119758, 120679, 121668, 122232, 122558, 122962, 123495, 123970, 124199, 124295, 124595, 125096, 125274, 124864, 124499, 124898, 125655, 125680, 124872, 124449, 125308, 126869, 128012, 128523, 129000, 129760, 130507, 130936, 131156]
57288A31156L45O63Q74P61M52L72P41J279J647J946K365K651K424J855J503J545
57272A52579J678J712J755J788J592J199J037J449K243K883K951K401J555P80
57258A77602J83l69q49r61n64M0M83Q01J233J713J856J393M65m28o97j53O92J069
57240A83509Q86Q29J365K019K046J451Q83P35Q73J039J189J334J446J560J767
57225B02931K160K802L610M213M191L585K907K514K297K120K141K423K672K698
57211B43264K800L286L902M109L782L243K807K627K791L240L690L858L670L210
57197B90279K722K654L354M530N446N736N613N238M493L543K882K585K172J585
57183C42832J447J957K362K124J755J828K005J918K145L293M711N311N251N592
$$ y = [131156, 131501, 132164, 133038, 133799, 134251, 134623, 135364, 136643, 138290, 140236, 142601, 145252, 147676, 149531, 151034, 152579, 154257, 155969, 157724, 159512, 161104, 162303, 163340, 164789, 167032, 169915, 172866, 175267, 176822, 177602, 177785, 177416, 176567, 175606, 175042, 175082, 175565, 176366, 177599, 179312, 181168, 182561, 183026, 182598, 181901, 181748, 182440, 183509, 184395, 185224, 186589, 188608, 190654, 192105, 192988, 193723, 194596, 195635, 196824, 198158, 199604, 201164, 202931, 205091, 207893, 211503, 215716, 219907, 223492, 226399, 228913, 231210, 233330, 235471, 237894, 240566, 243264, 246064, 249350, 253252, 257361, 261143, 264386, 267193, 269820, 272611, 275851, 279541, 283399, 287069, 290279, 293001, 295655, 299009, 303539, 308985, 314721, 320334, 325572, 330065, 333608, 336490, 339075, 341247, 342832, 344279, 346236, 348598, 350722, 352477, 354305, 356310, 358228, 360373, 363666, 368377, 373688, 378939, 384531]
57169C84531O677P953R215J0781J2512J3737J4282J4562J4703J4482J4193J4620
57157E32248J5842J6871J6680J5138J2943J1180J0710J1303J1654J0891R808R762
57145F85030J0806J1941J2766J3641J4493J4976J5771J8207K2384K6990L1321
57134H78326L6190M2563N0583O0178P1298Q3066R4035J03790J13138J22313J30353
57123A785833J36673J41844J46202J49242J51175J53614J57750J63183J69423
57114C154939J77159J86971J98226K10472K24651K41730K61445K83688L09887
57105E249168L41683L79704M25158M81291N51717O38947P46566Q81610J052735
57096A0748579J267270J531910J854306K240522K690916L199450L754119M334431
$$ y = [384531, 391208, 399161, 408376, 419157, 431669, 445406, 459688, 474250, 488953, 503435, 517628, 532248, 548090, 564961, 581641, 596779, 609722, 620902, 631612, 642915, 654569, 665460, 675268, 685030, 695836, 707777, 720543, 734184, 748677, 763653, 779424, 797631, 820015, 847005, 878326, 914516, 957079, 1007662, 1067840, 1139138, 1222204, 1316239, 1420029, 1533167, 1655480, 1785833, 1922506, 2064350, 2210552, 2359794, 2510969, 2664583, 2822333, 2985516, 3154939, 3332098, 3519069, 3717295, 3927767, 4152418, 4394148, 4655593, 4939281, 5249168, 5590851, 5970555, 6395713, 6877004, 7428721, 8067668, 8814234, 9695844, 10748579, 12015849, 13547759, 15402065, 17642587, 20333503, 23532953, 27287072, 31621503]
57088C1621503M910535N449537N922897O306255O576874O716666O710279O524678
57080H0739224O089811N320927M182662K735833J116840n26959k081098l462941
57072I4114299m607727n471541o041488o333218o379171o221689n910647n497249
57064D7651569n025892m531859m043383l581272l156849k773797k432854k133645
57056A9972018j873618j648476j454147j286945j142594j017268r09368q18292
57048I821310p41671o75615o17416n66175n20897m80011m42956m10275l81503
57039D984791l54450l27188k99650k72753k47059k22756j99891j77985j56066
57030B726993j33447j10087q6049o1121l4889p217K0196M1596M7870L2330l089
$$ y = [31621503, 36532038, 41981575, 47904472, 54210727, 60787601, 67504267, 74214546, 80739224, 86829035, 92149962, 96332624, 99068457, 100185297, 99658338, 97577240, 94114299, 89506572, 84035031, 77993543, 71660325, 65281154, 59059465, 53148818, 47651569, 42625677, 38093818, 34050435, 30469163, 27312314, 24538517, 22105663, 19972018, 18098400, 16449924, 14995777, 13708832, 12566238, 11548970, 10639602, 9821310, 9079639, 8404024, 7786608, 7220433, 6699536, 6219525, 5776569, 5366294, 4984791, 4630341, 4303153, 4003503, 3730750, 3483691, 3260935, 3061044, 2883059, 2726993, 2593546, 2483459, 2397410, 2336289, 2301400, 2294183, 2314379, 2355975, 2403845, 2436175, 2433086]
57019B433086m8044r0322j21640j38683j41928j34926j22804j09523r6567q4384
57009A344265p3708o4900n7366n0624m5067m0873l7206l3374k9819k7090k4780
56998H59458k2416k0514j9664j9258j8207j6370j4362j2413j0270p817m972j474
56986F91721K522O125Q628J0100J0406Q504L768k703r110j4673j9358k2629k3855
56973F49446k3575k2961k2181k0502j7901j5297j3142j0900q134n081j875J882
56961D89779O413J1260J5721J9280K1434K1609J9381J4569P356j367r993j7091
56949E98351k2100k4900k5359k3823k1459j9170j6662j3365r744o621l777m30
56937D10941L316O766J0214J4772K0583K6373L0745L2766L1262K5123J4845K721
$$ y = [2433086, 2385042, 2294720, 2173080, 2034397, 1892469, 1757543, 1634739, 1525216, 1428649, 1344265, 1270557, 1205657, 1148291, 1097667, 1052600, 1011727, 974521, 941147, 911328, 884238, 859458, 837042, 816528, 796864, 777606, 759399, 743029, 728667, 716254, 705984, 698167, 693195, 691721, 694243, 700368, 708996, 719096, 729502, 738006, 741774, 739071, 729961, 715288, 695930, 673301, 649446, 625871, 602910, 580729, 560227, 542326, 527029, 513887, 502987, 494853, 489772, 487897, 489779, 496192, 507452, 523173, 542453, 563887, 585496, 604877, 619446, 626802, 625435, 615442, 598351, 576251, 551351, 525992, 502169, 480710, 461540, 444878, 431513, 421769, 415148, 411371, 410941, 414257, 421023, 431237, 446009, 466592, 492965, 523710, 556476, 587738, 612861, 627706, 630427]
56925F30427q977j9039k6586l0678l1302k9783k7500k4910k2097j9401j7007j4788
56913C58359j2932j1942j1624j0985r564q069p191o620n751m580l362k117j017
56900B62605n24o23n80M6Q72J643K902N083P622R704J1355J3224J5657J8475K1043
56885C68504K2164K0576J6227J0440M447j602p585j2328j4623j4694j3744j2388
56873C65394j0381p604m303n91L527P589J0994J3976J7679K3060L0007L7572M4711
56860E31630N0624N4378N4354M8582L6349J9588J966j3630k6199l5362m0218m0234
56848F41828l6427l0722k4395j7828j1288n078R75P485J4982K3732L3890M5388
56836F42542N7852P0713Q2842R1670R3298Q4488O4795L6917N474k4391m8342o4124
$$ y = [630427, 621450, 602411, 575825, 545147, 513845, 484062, 456562, 431652, 409555, 390154, 373147, 358359, 345427, 333485, 321861, 310876, 301312, 293243, 286052, 279432, 273681, 269101, 265739, 263622, 262605, 262081, 261458, 260878, 260924, 261796, 263439, 266341, 271424, 279046, 288750, 300105, 313329, 328986, 347461, 368504, 390668, 411244, 427471, 437911, 442358, 440756, 433171, 420843, 406220, 391526, 377782, 365394, 355013, 347409, 343106, 342515, 346042, 353631, 364625, 378601, 396280, 419340, 449347, 486919, 531630, 582254, 636632, 690986, 739568, 775917, 795505, 797471, 783841, 757642, 722280, 682062, 641828, 605401, 574679, 550284, 532456, 521168, 516090, 517065, 524550, 539532, 563264, 597154, 642542, 700394, 771107, 853949, 945619, 1038917, 1123405, 1188200, 1225117, 1230591, 1206200, 1157858, 1093734]
56824A093734p1886p3162o9734o3439n6004m8282m0127l1469k2981j5069p010
56813E94571K109J2112K2301L2674M3496N3808O1278O3457N8599M5900K6212K679
56801A019196k0382l9589n3317o1010o2794n9871n4245m7566m0615l3829k7679
56790E18299k2333j7472j2618p416j665M553J0854J7011K3139K8811L2327L1553
56778F05043K5602J5284K309j1200k2781l0516l4279l5549l5653l4679l2252k8709
56766C82620k5030k2006j9772j8017j6387j4729j3039j1224r190p256o078n856
56754B14036n945n652n092m764m640m264l570k930k475j946j263p48p16j119j579
56739A67333j615j055m16m73j172j465o93M50Q93O36M26N21N91N71O89Q54Q43
$$ y = [1093734, 1021848, 948686, 878952, 815513, 759509, 711227, 671100, 639631, 616650, 601581, 594571, 596680, 608792, 631093, 663767, 707263, 761071, 822349, 885806, 944405, 990305, 1016517, 1019196, 998814, 959225, 905908, 844898, 782104, 722233, 667988, 620422, 579807, 545978, 518299, 495966, 478494, 465876, 458460, 456795, 461348, 472202, 489213, 512352, 541163, 573490, 605043, 630645, 645929, 648238, 637038, 614257, 583741, 549462, 513913, 478260, 443581, 411329, 382620, 357590, 335584, 315812, 297795, 281408, 266679, 253640, 242416, 233226, 225970, 219892, 214036, 208091, 202439, 197347, 192583, 187943, 183679, 180109, 177179, 174704, 172758, 171495, 170747, 170031, 168912, 167333, 165718, 164663, 164247, 163774, 162602, 161137, 160444, 160894, 161787, 162423, 162849, 163370, 163961, 164532, 165221, 166075, 166918]
56722A66918R03J356J811J661J138R99J295J472J518J933K535K426J423M30R7
56707A87915M6j52j52M89J448K025J937J370O38Q6j43l07p19j137j056n66l54
56690A91368p56j418j926k097j638l13J388K453K466J933J390R10N86O81J069
56675A96096J176P96L31R8M0K01O70R24J66j413k537k382j375j73J154K399K716
56658A98887J715L80M8Q52J810K121J794J266R40R05Q49M51r3l05k61m90r87j088
56640B08794n47M5K57L60M99K63l81o47j51K93r4q17r79p41r15j560j998j882
56622A99799j385o59O8J55p60j952k302j688r26o07o88j054j568j775j326o47
56606A82685l42j68N61J603J940J327O54N12M27n6m97l81p8k29o42n96M0O90R53
$$ y = [166918, 167821, 169177, 170988, 172649, 173787, 174786, 176081, 177553, 179071, 181004, 183539, 185965, 187388, 187818, 187915, 187961, 187809, 187657, 188146, 189594, 191619, 193556, 194926, 195564, 195650, 195507, 195200, 194481, 193344, 192288, 191722, 191368, 190612, 189194, 187268, 185171, 183533, 183220, 184608, 187061, 189527, 191460, 192850, 193760, 194346, 195027, 196096, 197272, 198068, 198399, 198497, 198537, 198738, 199408, 200332, 200498, 199085, 196548, 194166, 192791, 192618, 193772, 196171, 198887, 200602, 200982, 201030, 201882, 203692, 205813, 207607, 208873, 209813, 210718, 211567, 212018, 211925, 211620, 211359, 210869, 209882, 208794, 208247, 208292, 208549, 208909, 209408, 209671, 209290, 208643, 208492, 208785, 208691, 207874, 206895, 206154, 205239, 203679, 201681, 199799, 198414, 197755, 197823, 197978, 197218, 195266, 192964, 191276, 190350, 189743, 189055, 188001, 186433, 184658, 183332, 182685, 182343, 182175, 182736, 184339, 186279, 187606, 188260, 188772, 189199, 189143, 188646, 188265, 188187, 187958, 187316, 186720, 186760, 187450, 188403]
56587A88403J032J258J593J700J252K45q15j134l91P75J381J187Q72J068J658
56572B00084K178K556L026L498L521K921K117J724K101L317N210P395R520J1565
56558B60733J3520J4645J3709J0401O048K398L5j486k423k680k535k571k744k383
56544C04667j373n40n42j068j543k011k772l599l943l666l158k844k895l263l694
56529B67756l868l729l518l319k883k061j149n21j85J7J2l84j056j620j893k048
56513B39551k332k694k826k445j585n95R3J69m44j369j826j323l93j58q99j661
56497B19263j615j181j252j772j960j533r33n17l21m57r23j147n06P30J698K044
56481B09618K015J706J054M63M97J005J440J831K469K888K373J386J074J382J124
$$ y = [188403, 189435, 190693, 192286, 193986, 195238, 195483, 194668, 193534, 193143, 193918, 195299, 196486, 197358, 198426, 200084, 202262, 204818, 207844, 211342, 214863, 217784, 219901, 221625, 223726, 227043, 232253, 239648, 249168, 260733, 274253, 288898, 302607, 313008, 319056, 321454, 321489, 320003, 317580, 314900, 312365, 309794, 307050, 304667, 303294, 302754, 302212, 301144, 299601, 297590, 294818, 291219, 287276, 283610, 280452, 277608, 274713, 271450, 267756, 263888, 260159, 256641, 253322, 250439, 248378, 247229, 246708, 246523, 246540, 246552, 246168, 245112, 243492, 241599, 239551, 237219, 234525, 231699, 229254, 227669, 227074, 227167, 227336, 226892, 225523, 223697, 222374, 221981, 221823, 220924, 219263, 217648, 216467, 215215, 213443, 211483, 209950, 209017, 208500, 208179, 207722, 206799, 205652, 205146, 205876, 207574, 209618, 211633, 213339, 214393, 214856, 215353, 216358, 217798, 219629, 222098, 224986, 227359, 228745, 229819, 231201, 232325]
56466B32325J34l32K40O71Q6o62n13J26K64j42n64q45q52j72Q86J014k95j509
56448B29860r13J074K560K626J912J271R66Q86O70j17j218j600q58j8p5n21l89
56431B36116L2k11r38j092m14L93R72J446J467M76r99j603r31O9O28R98J461J538
56413B39408P75l76j042q74k23L40M43J31k58n40q29j062p89J14R52J002N00K09
56395B37881L07M40O05J116J778J901J339P76Q12J270J564J419J000O14M22L72
56379B53616L85N52R01J044N61k48n05Q0Q71J302J576K005K365K375K115J591
56363B70586O10m57o38K54J120J144R81J517K346K517K055J684J574J503J665
56348B88461K205K492J961J180J012J188Q71K22P0M58P32R29J657K749L257K876
$$ y = [232325, 232459, 232127, 232367, 233038, 233124, 232462, 231949, 232075, 232339, 232197, 231633, 230788, 229936, 229764, 230650, 231664, 231369, 229860, 228947, 230021, 232581, 235207, 237119, 238390, 239356, 240242, 240912, 240795, 239577, 237977, 237119, 237101, 237026, 236505, 236116, 236148, 235937, 234999, 233907, 233493, 233886, 234858, 236304, 237771, 238247, 237248, 235645, 234714, 234783, 235411, 236409, 237870, 239408, 240183, 239807, 238765, 237891, 237668, 238008, 238451, 238582, 238324, 237784, 236955, 235893, 235104, 235218, 236170, 237172, 237672, 237881, 238188, 238628, 239233, 240349, 242127, 244028, 245367, 246143, 246955, 248225, 249789, 251208, 252208, 252822, 253244, 253616, 254001, 254553, 255454, 256498, 257059, 256811, 256306, 256386, 257257, 258559, 260135, 262140, 264505, 266880, 268995, 270586, 271196, 270739, 270101, 270355, 271475, 272619, 273600, 275117, 277463, 279980, 282035, 283719, 285293, 286796, 288461, 290666, 293158, 295119, 296299, 297311, 298499, 299370, 299592, 299662, 300120, 300852, 301781, 303438, 306187, 309444, 312320]
56332C12320K302K120K256K551K982L353L477L595L857L763K936K002J730J793
56318C51037J464J036J261J709J252Ro52j25P75J324J714K141K312K215K427L218
56302C73117M290N440O666P529P432O653O134O071N740M843M064L985M376M811
56288D51151N228N610N847O140O895Q107R381J0496J1404J1864J1794J1728J2208
56275E67853J3024J3772J4752J6299J7758J8275J8260J8913K0533K2485K4606
56264G66530K7324L0480L3434L6220L9536M3641M8525N4877O3409P3312Q2951
56253A300239R2224J02759J15564J29888J44689J59800J75155J90072K03818K15973
56243B830181K25848K32382K34733K32246K23996K09353J88795J63135J32337
$$ y = [312320, 314622, 316742, 318998, 321549, 324531, 327884, 331361, 334956, 338813, 342576, 345512, 347514, 349244, 351037, 352501, 353537, 354798, 356507, 357759, 357768, 357116, 356991, 357766, 359090, 360804, 362945, 365257, 367472, 369899, 373117, 377407, 382847, 389513, 397042, 404474, 411127, 417261, 423332, 429072, 433915, 437979, 441964, 446340, 451151, 456379, 461989, 467836, 473976, 480871, 488978, 498359, 508855, 520259, 532123, 543917, 555645, 567853, 580877, 594649, 609401, 625700, 643458, 661733, 679993, 698906, 719439, 741924, 766530, 793854, 824334, 857768, 893988, 933524, 977165, 1025690, 1080567, 1143976, 1217288, 1300239, 1392463, 1495222, 1610786, 1740674, 1885363, 2045163, 2220318, 2410390, 2614208, 2830181, 3056029, 3288411, 3523144, 3755390, 3979386, 4188739, 4377534, 4540669, 4673006]
56234D673006R6337N6796J6561k2383n9094r2256j20431j43638j62892j78196
56224D063810j88680j94691j97711j98028j94617j87699j79376j70985j61795
56215B390228j51145j40034j29632j19843j10370j01690r4041q6695p9238p2384
56205A305156o6691o1591n6491n1720m7634m3841l9982l6322l3015k9731k6433
56194H11705k3552k1089j8628j6401j5089j4357j3058j1127r759r372q956p866
56182F42451o711n875m768l215k120k026k272k183j889j506p94k3J75R0O58J748
56166F11740K303K308K866M076M832N033N907P641Q817Q915R272J0724J2320J3298
56152G10052J4349J6051J7896J9836K2929K7612L3125L9394M7581N7983O9386
$$ y = [4673006, 4769343, 4826139, 4842700, 4820317, 4761223, 4668967, 4548536, 4404898, 4242006, 4063810, 3875130, 3680439, 3482728, 3284700, 3090083, 2902384, 2723008, 2552023, 2390228, 2239083, 2099049, 1969417, 1849574, 1739204, 1637514, 1543473, 1456778, 1377540, 1305156, 1238465, 1176874, 1120383, 1068663, 1021029, 977188, 937206, 900884, 867869, 838138, 811705, 788153, 767064, 748436, 732035, 716946, 702589, 689531, 678404, 668645, 659273, 650317, 642451, 635740, 629865, 625097, 621882, 619762, 617736, 615464, 613281, 611392, 609886, 609092, 609069, 609244, 609334, 609992, 611740, 614043, 616351, 619217, 623293, 628125, 633158, 639065, 646706, 655523, 664438, 673710, 684434, 696754, 710052, 724401, 740452, 758348, 778184, 801113, 828725, 861850, 901244, 948825, 1006808, 1076194]
56141A076194Q1111R3450J05242J13440J16249J14485J08928R8986Q5355P1427
56131B064867O0235N2019M6119M2748M1091L8030L1185K1646J1992L218m812j1756
56119B396582j7553k3433l0734m0006n2026o7540q4695r8963j07201j09963j08782
56108A655686j03721r5045q4674p4036o2753n1155m1562l5130k9946k4282j9326
56097A034056j6471j4499j1836r277p966o883m879l076k658k365o87J405K378
56084I57242K832L891M852M869M972O074O997O811O891Q363R793R804R625J0581
56070A053597J1588J1692J2361J4546J6304J6243J6384J8428K0249J9627J8428
56059A229447J9220K0585J9912J8210J7793J7653J5685J3281J3131J4339J4264
$$ y = [1076194, 1157305, 1250755, 1355997, 1469437, 1585686, 1700171, 1809099, 1908085, 1993440, 2064867, 2125102, 2177121, 2223240, 2265988, 2307079, 2345109, 2376294, 2397940, 2409932, 2413150, 2408338, 2396582, 2379029, 2355596, 2324862, 2284856, 2232830, 2165290, 2080595, 1981632, 1874431, 1764468, 1655686, 1551965, 1456920, 1372246, 1298210, 1235457, 1184302, 1142740, 1107610, 1077664, 1053382, 1034056, 1017585, 1003086, 991250, 981973, 974007, 967124, 962245, 959169, 956511, 954146, 953459, 954864, 957242, 960074, 963965, 968817, 973686, 978658, 984732, 991729, 998540, 1005431, 1013794, 1023587, 1033391, 1043016, 1053597, 1065185, 1076877, 1089238, 1103784, 1120088, 1136331, 1152715, 1171143, 1191392, 1211019, 1229447, 1248667, 1269252, 1289164, 1307374, 1325167, 1342820, 1358505, 1371786, 1384917, 1399256, 1413520]
56048A413520J3441J4228J6213J7409J8388K0806K3460K4241K4442K6626K9732
56037A642506L0801L0075K9941L0296K9587K9002L0927L4404L6549L7289L8484
56026A999861L9882M0240M0767M3065M5484M5914M6086M8533N1648N2767N3536
56015B507783N6815O0744O1788O1469O3911O8712P2405P5100P9403Q4547Q7854
56004C280531R0329R4752J00128J04184J08926J17221J26587J33215J39285J48944
55994D444102J60178J68620J76292J87906K01593K12507K22713K37783K56266
55985F267960K72777K88976L10805L37293L63115L89943M23706M63046N02576
55976I620197N45056N97562O58276P20756P88591Q71157R67622J071195J186607
$$ y = [1413520, 1426961, 1441189, 1457402, 1474811, 1493199, 1514005, 1537465, 1561706, 1586148, 1612774, 1642506, 1673307, 1703382, 1733323, 1763619, 1793206, 1822208, 1853135, 1887539, 1924088, 1961377, 1999861, 2039743, 2079983, 2120750, 2163815, 2209299, 2255213, 2301299, 2349832, 2401480, 2454247, 2507783, 2564598, 2625342, 2687130, 2748599, 2812510, 2881222, 2953627, 3028727, 3108130, 3192677, 3280531, 3370860, 3465612, 3565740, 3669924, 3778850, 3896071, 4022658, 4155873, 4295158, 4444102, 4604280, 4772900, 4949192, 5137098, 5338691, 5551198, 5773911, 6011694, 6267960, 6540737, 6829713, 7140518, 7477811, 7840926, 8230869, 8654575, 9117621, 9620197, 10165253, 10762815, 11421091, 12141847, 12930438, 13801595, 14769217, 15840412, 17027019]
55967A7027019J326307J491997J678805J895635K161543K484797K868301L334493
55959C4268897L922211M663829N595439O789251Q346517J0362118J2928848J6158889
55951A03035999K0129391K4773723K9834946L4851162L9018396M1029736L9308832
55944C31982185L2800966K1789148P988250o183384j8534164k7645385l2986328
55937C09211288l4815348l3945249l1382494k7993548k4375067k0898608j7772643
55930A18028331j5069616j2772626j0841612r238552p912771o804548n871600
55923D9517006n091525m439263l883833l406627l002063k659055k359463k094842
55915B2580335j867519j674076j503033j349244j215928j101575r98284r03838
$$ y = [17027019, 18353326, 19845323, 21524128, 23419763, 25581306, 28066103, 30934404, 34268897, 38191108, 42854937, 48450376, 55239627, 63586144, 73948262, 86877110, 103035999, 123165390, 147939113, 177774059, 212625221, 251643617, 292673353, 331982185, 364783151, 386572299, 394560549, 388377165, 369843001, 342197616, 309211288, 274395940, 240450691, 209068197, 181074649, 156699582, 135800974, 118028331, 102958715, 90186089, 79344477, 70105925, 62193154, 55388606, 49517006, 44425481, 39986218, 36102385, 32695758, 29693695, 27034640, 24675177, 22580335, 20712816, 19038740, 17535707, 16186463, 14970535, 13868960, 12870676, 11966838]
55907A1966838q22699p54056o90719o30562n77791n32208m88057m44367m05988
55898F620391l73495l42002l10846k84800k64500k44883k24346k06758j93084
55889D175677j79402j64553j51859j41935j31357j19685j10424j03911r6534q8227
55879B887790q3587q3975q5294q5109q5455q6989q6739q3542p9982p7232p3357
55868A976529o8103o3996o1371n7545n2103m7932m5850m3402m0076l8482l9019
55857A418650l8555l5828l3258l2051l0303k7469k5847k5996k5291k2760k0904
55846A100388k0947k0640j8683j7209j7769j8671j8256j7500j7446j7263j6455
55835H99549j6027j6101j5326j3800j3467j4535j4707j3002j1174j0294r210p555
$$ y = [11966838, 11144139, 10390083, 9699364, 9068802, 8491011, 7958803, 7470746, 7026379, 6620391, 6246896, 5904894, 5594048, 5309248, 5044748, 4799865, 4575519, 4368761, 4175677, 3996275, 3831722, 3679863, 3537928, 3406571, 3286886, 3176462, 3072551, 2976017, 2887790, 2804203, 2720228, 2634934, 2549825, 2464370, 2377381, 2290642, 2207100, 2127118, 2049886, 1976529, 1908426, 1844430, 1783059, 1725514, 1673411, 1625479, 1579629, 1536227, 1496151, 1457669, 1418650, 1380095, 1344267, 1311009, 1278958, 1248655, 1221186, 1195339, 1169343, 1144052, 1121292, 1100388, 1079441, 1058801, 1040118, 1022909, 1005140, 986469, 968213, 950713, 933267, 916004, 899549, 883522, 867421, 852095, 838295, 824828, 810293, 795586, 782584, 771410, 761116, 751906, 744351]
55823G44351p011q239r542r863j0260j1290j1792j1327j1011j1014j0037q116
55811F24849o933o576n161k559j178j890k407j125N90J354J985L179L741K880
55797F10749J741J182L54j211k512l282m849p474r301r210q374p780o597m318
55783E49118k226j478j833l217o135r609j1234j0377q826p335m327P77N901R481
55769D98680J2418J5150J5549J1921N754n40o458j1997j5695j6378j5330j4555
55757D78519j4249j3667j2893j2090j0475p826n657n286n951o320o451o929p363
55744C63362p229o914o628n591l540j745j252j415j307j296j965k790l100l153
55730C15437l277l140k784l076m136m795m462m109m509n022m981m714m309l106
$$ y = [744351, 737340, 729101, 719559, 709696, 699436, 688146, 676354, 665027, 654016, 643002, 632965, 624849, 617916, 611340, 606179, 603620, 602442, 600552, 598145, 597020, 597610, 598964, 600949, 604128, 607869, 610749, 612490, 613672, 614026, 612815, 610303, 607021, 602172, 594698, 585397, 576187, 567813, 560033, 553436, 549118, 546892, 545414, 543581, 540364, 534229, 524620, 513386, 503009, 494183, 486848, 482521, 483298, 489199, 498680, 511098, 526248, 541797, 553718, 559472, 558932, 552474, 540477, 524782, 508404, 493074, 478519, 464270, 450603, 437710, 425620, 415145, 407319, 401662, 396376, 390425, 384105, 377654, 370725, 363362, 356133, 349219, 342591, 337000, 333460, 331715, 330463, 329048, 327741, 326445, 324480, 321690, 318590, 315437, 312160, 309020, 306236, 303160, 299024, 294229, 289767, 285658, 281149, 276127, 271146, 266432, 262123, 259017]
55716B59017j235Q7O97J910L934N054M632M533N956P136O185M136K895J961l18
55701C06580l461n432n693n539n860o397o768o743n909m366l114k718k384j414
55687B40782n51o42j048o69L65J322K282L623M955N703N947N692M385K150L90
55672B74686PJ06m24j223j497j489j692j731j282r50j046p63J85N79k45q55J15
55655B62481J575J642N21k32l11o07j308j831k144k514k639k386k650l944n090
55640B40563m916m325m869o067o147m845l557l032k771k462k420k580k493k158
55626A87921j819j270m17O0k71o48l44j2m61j062r17o38j328k493k873k573k561
55609A68294k643j960r66q52j385j311p29r06j818j997j031k81o76j476j744j572
$$ y = [259017, 257782, 257869, 258566, 260476, 264410, 269464, 274096, 278629, 284585, 291721, 297906, 302042, 304937, 306898, 306580, 303119, 297687, 291994, 286455, 280595, 274198, 267430, 260687, 254778, 250412, 247298, 244580, 242196, 240782, 240231, 239589, 238541, 237872, 238237, 239559, 241841, 245464, 250419, 256122, 262069, 267761, 272146, 274296, 274686, 274693, 274799, 274375, 273152, 271655, 270166, 268474, 266743, 265461, 264511, 263465, 262702, 262887, 263466, 263221, 262366, 262481, 264056, 265698, 266219, 265987, 265676, 265069, 263761, 261930, 259786, 257272, 254633, 252247, 249597, 245653, 240563, 235647, 231322, 226453, 220386, 214239, 209394, 205837, 202805, 200034, 197572, 195152, 192572, 190079, 187921, 186102, 184832, 184415, 184475, 184204, 183556, 183212, 183200, 182739, 181677, 180760, 180122, 178794, 176301, 173428, 170855, 168294, 165651, 163691, 162725, 161873, 160488, 159177, 158448, 157542, 155724, 153727, 152696, 152415, 151739, 150263, 148519, 146947]
55593A46947j363j171j097j264j234n17L46M23K0L18J419K147J879J285J011R29
55577A50078Q99J152J695K353L389N070O716P403P444P862Q533Q250O680M762
55563B22286L024J005j317l091l979m732n808o611o662o414o274n822m614l063
55549A67928j922j451j471j699j811j630j351j123n83N25J617J978J945K306K840
55534A66098K635J738J112R30L00j017k012j983j558j552j908k247k643l155l435
55519A51303l325l258l556l926l968l682l215k607k018j670j413r06k87o2l04
55504A17106n76o89q30q97m54M53J133J068L99m79j175j253n74K15K36m56r42
55487A12285o18J63O81N24k18r37q57N6P99O44K46O55J617J899J077o3p52q23
$$ y = [146947, 145584, 144413, 143316, 142052, 140818, 140301, 140647, 141070, 141090, 141408, 142827, 144974, 146853, 148138, 149149, 150078, 150977, 152129, 153824, 156177, 159566, 164636, 171352, 178755, 186199, 194061, 202594, 210844, 217524, 222286, 225310, 226315, 224998, 221907, 217928, 213196, 207388, 200777, 194115, 187701, 181427, 175605, 170991, 167928, 166006, 164555, 163084, 161385, 159574, 157944, 156593, 155470, 154887, 155412, 157029, 159007, 160952, 163258, 166098, 168733, 170471, 171583, 172513, 172813, 171796, 169784, 167801, 166243, 164691, 162783, 160536, 157893, 154738, 151303, 147978, 144720, 141164, 137238, 133270, 129588, 126373, 123766, 121748, 120078, 118665, 117759, 117472, 117410, 117106, 116530, 115841, 115011, 114114, 113660, 114113, 115246, 116314, 116713, 116234, 115059, 113806, 113232, 113447, 113683, 113227, 112285, 111667, 111830, 112511, 113035, 112817, 111880, 111023, 111079, 111878, 112522, 112768, 113423, 115040, 116939, 118016, 117953, 117201, 116378]
55469A16378l02N54Q44j10j560k039j319n47m58o43o16m58k31J48K68l77j258
55452A08274j187o8R42J091P24J79o62j411j173m6O60K89k56r9L38L53K00M18
55434A08566P36O01J04l32o41r13j006q23n33k13J68K79l02j160j260l96N19R63
55416A04357J512K580L432L240K230J173M17J4L0P9o32k161l295k941j471j36
55400A08428L00j11r24j468j190l47J12k07o35n69l39m33o35n24k32KL78J030
55382A02636J542J513J155P82L08k63n35m69o66j281j409m19P64P82k11p75j35
55365A03319J056J853J963J557Q25Jo73j193j672j952j645o59M96J036O08l11
55349A04609q12n48j15j54m03j75M52P28M58K26L30L64Q1j69j83l11p48j152j289
$$ y = [116378, 116076, 116630, 117474, 117364, 115804, 113765, 112446, 111899, 111441, 110798, 110182, 109724, 109493, 109641, 109909, 109532, 108274, 107087, 107019, 107961, 109052, 109776, 109955, 109293, 107882, 106709, 106663, 107323, 107612, 107356, 107257, 107595, 107948, 108148, 108566, 109302, 109903, 110007, 109675, 109034, 108121, 107115, 106292, 105759, 105546, 105714, 105993, 105691, 104531, 103271, 102875, 103394, 104357, 105869, 108449, 111881, 115121, 117351, 118524, 118941, 118955, 118985, 119064, 118432, 116271, 112976, 110035, 108564, 108428, 108728, 108617, 107693, 106225, 105035, 104688, 104800, 104593, 103958, 103389, 103050, 102617, 101982, 101458, 101226, 101228, 101606, 102636, 104178, 105691, 106846, 107628, 107936, 107673, 107138, 106669, 106003, 104722, 103313, 102894, 103658, 104440, 104229, 103454, 103319, 104375, 106228, 108191, 109748, 110573, 110574, 109901, 108708, 107036, 105084, 103439, 102780, 103276, 104312, 104920, 104609, 103797, 103249, 103134, 102980, 102577, 102402, 102854, 103582, 104040, 104266, 104596, 104960, 105041, 104872, 104689, 104378, 103630, 102478, 101189]
55330A01189j324j177l70J002K015K065J625J328J095O87L65L69L56n7o46j013
55314A07509j133j081q08n27o38r22o61R5L31l06q02m00J17j97p62m10O46J079
55296A01130L90n91r45n51K30R19J103Q95R43J536K066J916J356R35N95J34l8
55279A12023M30R13N71l35q75q81r34j158j075o22l06l03k42J6J71R8Nj03m91
55260A06902j156j659j617r42K10J387J931J655J159R59P35J2p86q31k59k3m82
55243A07195r48p60q9N43Q51P45K11n09r62r13m96qK91K82R7m1k11p21j367j413
55223A01777o25K43N56O84J180J673J480Q25M25K81j38p39r16o60n35o05m05k3
55205A04478p9n25n35J54P34O06K62L99Q53J046Q94O63L37k93j039j372j097o45
$$ y = [101189, 99865, 98688, 98318, 99320, 101335, 103400, 105025, 106353, 107448, 108135, 108500, 108869, 109225, 109168, 108522, 107509, 106376, 105295, 104487, 103960, 103322, 102400, 101739, 101834, 102165, 101859, 101057, 100657, 100774, 100577, 99815, 99405, 100051, 101130, 101520, 100929, 99984, 99433, 99663, 100582, 101685, 102580, 103523, 105059, 107125, 109041, 110397, 111332, 111927, 112061, 112023, 112453, 113366, 113937, 113602, 112727, 111846, 110912, 109754, 108679, 108057, 107751, 107448, 107206, 107222, 107393, 107491, 107496, 107393, 106902, 105746, 104087, 102470, 101528, 101738, 103125, 105056, 106711, 107870, 108829, 109564, 109576, 108790, 107959, 107700, 107677, 107195, 106247, 105487, 105398, 105941, 106792, 107537, 107748, 107239, 106277, 105364, 104868, 104860, 105151, 105433, 105530, 105489, 105278, 104557, 103190, 101777, 101152, 101395, 101951, 102635, 103815, 105488, 106968, 107793, 108218, 108499, 108361, 107622, 106706, 106046, 105511, 104906, 104501, 104478, 104399, 103874, 103339, 103493, 104227, 104833, 105095, 105494, 106347, 107393, 108287, 108950, 109287, 108994, 107955, 106583, 105486, 104841]
55187A04841n52p77o98M9R55J185P35M41P28J062R78Q86J131J033j07j536j786
55170A08568o76M68O21P3m71p86q33n09l6K5m59r89j181j162j032o06Q4O07P88
55151A02494R64J328J555J371R89O86M11J46J40M29N22P2m94m70J47O56N42Km98
55132A10992q25j116j300j078n07j68m51r35j033r94j433j953j365L79J708J574
55116A01495R75J257J923J574L89o8P08J477J230L80l21p87j015p20j41j51r01
55099A07304j286m76P82J242Q89P37J242J722J375L20m54p5J234K259K127J369
55083A20311J099J385J280M67j73pL21k4o95p46r4M24K56k83n90m58j30j9l05
55064A22019o65n80l5L75K29j98m01l60l71m62l77j15j02o76j525j838j112J39
$$ y = [104841, 104289, 103512, 102814, 102863, 103818, 105003, 105738, 106179, 106907, 107969, 108947, 109833, 110964, 111997, 111890, 110354, 108568, 107892, 108360, 108981, 109054, 108583, 107797, 106964, 106455, 106419, 106444, 105985, 104996, 103815, 102653, 101621, 101015, 101099, 101706, 102494, 103458, 104786, 106341, 107712, 108701, 109387, 109798, 109944, 110084, 110513, 111035, 111107, 110613, 110143, 110290, 110946, 111488, 111490, 110992, 110167, 109051, 107751, 106673, 106166, 105998, 105547, 104612, 103579, 102585, 101152, 99199, 97834, 98213, 99921, 101495, 102470, 103727, 105650, 107224, 107613, 107545, 108253, 109730, 110960, 111340, 111019, 110232, 109217, 108497, 108356, 108205, 107304, 106018, 105542, 106324, 107566, 108455, 109192, 110434, 112156, 113531, 113851, 113397, 113322, 114556, 116815, 118942, 120311, 121410, 122795, 124075, 124542, 124369, 124362, 124683, 124659, 123964, 123218, 123124, 123548, 123804, 123521, 122931, 122473, 122343, 122324, 122019, 121354, 120774, 120739, 121114, 121343, 121145, 120744, 120384, 120013, 119551, 119174, 119059, 118957, 118281, 116756, 114918, 113806, 113945]
55046A13945Q01L72m68p84m29J89Q98J655J999J415K07p55j105j080p48l3N53
55029A16632K64o23r72m55n1m54j029r70m43O0O38J323J430M91o36o95K45R82
55011A15737Q84N61Q04J580K118J639R0j599k199j517n90k96k93P8N98O78N53
54994A18826Q40J223P67l85q92j05R19R25J63j80K36N95K71k84l03J78L91j40
54976A23045r98j381r23J11J235K011K120J545P25K37J97K21N6j00PK79M54M74
54958A29315M12K59k7l63n55m24P4O97J005Q11M77L85L02l04j321j960j736j003
54940A26044l17J47L81K90Pl0L71Q39J012J054J325J822K236K313K040J730J965
54923A43229L023M463N750P108Q939J0534J0568R116P903P887P804N993K634q30
$$ y = [113945, 114746, 115118, 114650, 113866, 113437, 113626, 114524, 116179, 118178, 119593, 119800, 119045, 117940, 116860, 116112, 116079, 116632, 116896, 116273, 115301, 114846, 114795, 114341, 113312, 112342, 111899, 111959, 112597, 113920, 115350, 115841, 115205, 114510, 114755, 115737, 116621, 117182, 117986, 119566, 121684, 123323, 123413, 121814, 119615, 118098, 117508, 117212, 116919, 116997, 117595, 118273, 118826, 119666, 120889, 121656, 121271, 120379, 120274, 121193, 122118, 122281, 122101, 122337, 122932, 123203, 122919, 122616, 122794, 123185, 123045, 122047, 120666, 119743, 119854, 121089, 123100, 125220, 126765, 127490, 127727, 127924, 128145, 128201, 128101, 128108, 128387, 128841, 129315, 129727, 129986, 129959, 129596, 129041, 128617, 128691, 129388, 130393, 131204, 131681, 132066, 132368, 132064, 130743, 128783, 127047, 126044, 125727, 125874, 126255, 126545, 126552, 126522, 126893, 127732, 128744, 129798, 131123, 132945, 135181, 137494, 139534, 141264, 143229, 146252, 150715, 156465, 163573, 172512, 183046, 193614, 202730, 210633, 218520, 226324, 232317, 234951, 234121]
54909B34121l629n796p146p508p568q121q748q385p060n770m840l713k434j902
54895A51501k288k512j795o89J8M31R09J112N83l31q59p41j96O57J794K964L941
54878A54499M867N921O898P537Q047Q771R439R212P561M815J843o44k459l836
54864B22471n058o190p123p784q072p730o628n168m063l557l270k895k670k860
54850A49403l168l105k748k623k857k912k321j348o66n21n24k30K56M87K86j05
54834A27304m44p31q64m81N17J469J498N26n85j003p08k20R2J85J24o1l67p88
54816A25463j244j417r74L5J091J705J826J656J305Q28M49L72M69L51j98r61j477
54799A29279j344m88O71J371J154M43J90P60J390J073j93j301j268k32Q69J347
$$ y = [234121, 230492, 224696, 217550, 210042, 202474, 194353, 185605, 177220, 170160, 164390, 159550, 155837, 153403, 151501, 149213, 146701, 144906, 144217, 144235, 144666, 145575, 146687, 147270, 146939, 146080, 145339, 145143, 145800, 147594, 150558, 154499, 159366, 165287, 172185, 179722, 187769, 196540, 205979, 215191, 222752, 227567, 229410, 228766, 226307, 222471, 217413, 211223, 204100, 196316, 188244, 180514, 173886, 168718, 164655, 161098, 157828, 154933, 152263, 149403, 146235, 143130, 140382, 137759, 134902, 131990, 129669, 128321, 127655, 127134, 126610, 126380, 126636, 127123, 127409, 127304, 126860, 126129, 125265, 124784, 125301, 126770, 128268, 128794, 128209, 127206, 126498, 126278, 126370, 126555, 126679, 126618, 126251, 125463, 124219, 122802, 121828, 121863, 122954, 124659, 126485, 128141, 129446, 130274, 130723, 131095, 131564, 131915, 131717, 130756, 129279, 127935, 127447, 128118, 129489, 130643, 131086, 131276, 132036, 133426, 134499, 134306, 133005, 131737, 131505, 132374, 133721]
54783A33721J235R23O39L70R1p2K1L40O86R59J313J872K449K824L294M446O231
54766A61342P733Q215Q092Q338R172R800R427P969N875L608J418p52l164n757
54752B31316p849q790q821q769q882q572p397n701m089k788j862j438j453j518
54738A53387j408j320j379j259o29L30J133J425J110L98k2O07K241L980N138N930
54722A69662O797P668Q266Q634Q758Q218O745M796K925R76j458m096o192p521
54708B14178q447r126r272q725p700o465n227m224l499k718j715r85j070j574
54694A43431j515o55K48N22L29N1l55j086j892k201j689o24L16N36J1p22j158
54677A33547j258j208j039p40m26j25L42Q27O89l58j507j677q50N1M78O95R76
$$ y = [133721, 134956, 135879, 136518, 136888, 136979, 136907, 136928, 137268, 137954, 138913, 140226, 142098, 144547, 147371, 150665, 155111, 161342, 169075, 177290, 185382, 193720, 202892, 212692, 222119, 230088, 235963, 239571, 240989, 240237, 237073, 231316, 223467, 214677, 205856, 197087, 188205, 179633, 172236, 166535, 162446, 159658, 157796, 156358, 154905, 153387, 151979, 150659, 149280, 148021, 147392, 147722, 148855, 150280, 151390, 151788, 151766, 152373, 154614, 158594, 163732, 169662, 176459, 184127, 192393, 201027, 209785, 218003, 224748, 229544, 232469, 233445, 231987, 227891, 221699, 214178, 205731, 196605, 187333, 178608, 170908, 164443, 159216, 154992, 151493, 148775, 147060, 146075, 145005, 143431, 141916, 141261, 141509, 142031, 142360, 142411, 142056, 140970, 139078, 136877, 135188, 134564, 134880, 135416, 135427, 134705, 133547, 132289, 131081, 130042, 129302, 128876, 128751, 129093, 129920, 130609, 130251, 128744, 127067, 126217, 126268, 126746, 127441, 128417]
54660A28417J085P64J35n17r73j015o34k69l36o01n01OM79Q11J256J621J313L08
54642A31349n95p84m57l7L90P46P27L13m9j08j82m68n64j08N17O96M73L90O08
54623A32857O47K7j047j745j399l04M27J02o80q34k84O3k55o39m34J77P05J098
54605A28482J482J701J573J228Q32L90O6K13P21Q62K68m66o05k65o7k07m38n63
54587A35207m42J47J032J421P54m44j222j370j335j230p69n7L24J99K0J08K28
54570A32571J43rr2k70n70o04j12N88R74R68Q36O25J03o92j241j080l45M30R57
54551A33180J360J664J517P72K6Q3Q51J363J026M18M41J107J575J258M10l12n07
54534A46232k01K70N06L05k11p63j141j249j083q71r49j357j655j375n87K67R06
$$ y = [128417, 129502, 130266, 130401, 129884, 128911, 127896, 127262, 126993, 126657, 126056, 125555, 125561, 126040, 126851, 128107, 129728, 131041, 131349, 130754, 129970, 129513, 129476, 129866, 130612, 131339, 131652, 131603, 131495, 131313, 130845, 130281, 130173, 130690, 131386, 131859, 132249, 132857, 133504, 133531, 132484, 130739, 129340, 129036, 129463, 129565, 128885, 128051, 127767, 127830, 127575, 126936, 126502, 126679, 127384, 128482, 129964, 131665, 133238, 134466, 135298, 135688, 135754, 135967, 136688, 137550, 137818, 137352, 136747, 136482, 136415, 136208, 135770, 135207, 134765, 134912, 135944, 137365, 138119, 137675, 136453, 135083, 133748, 132518, 131749, 131692, 132016, 132215, 132235, 132343, 132571, 132714, 132705, 132613, 132343, 131773, 131169, 131057, 131645, 132619, 133587, 134423, 135048, 135151, 134459, 133218, 132138, 131793, 132223, 133180, 134540, 136204, 137721, 138493, 138519, 138602, 139453, 140816, 141842, 142260, 142701, 143808, 145383, 146641, 147051, 146739, 146232, 146031, 146301, 146807, 147112, 146901, 146138, 144997, 143748, 142665, 141794, 140845, 139488, 137833, 136458, 135871, 136138, 137044]
54517A37044J320J439J128N33J11J10K19l5o93j318j574j530j374j017l30M01
54501A34434O45L52J02K42L88J53l7M36J227J317N18j73J0N92P02K25l67q30j116
54482A38820r85l21L73M95J90J14M10N53K53j04o5L06O79R38J165J358J416J353
54464A46948J319J430J589J582J344J089J043J077Q46L00k20n02p40j124j500
54449A54481j671j748j795j453m16Q10J260O90j20l38o7l3n77j256j484j169o12
54432A44502M6Q97J740J923J118jl84J16O34M82p0l70k07K79R62J576J628R45
54414A55816M8m23l94j37K00M49J87o32j238q74N7M71J12j65L06J161J706J805
54396A58455J699J453R91M07k9j13J87O48Q42N15n0l38k53j39j17Q4N48Q72P39
$$ y = [137044, 138364, 139803, 140931, 141464, 141575, 141685, 141904, 141869, 141176, 139858, 138284, 136754, 135380, 134363, 134033, 134434, 135079, 135431, 135533, 135775, 136163, 136316, 136279, 136715, 137942, 139259, 139777, 139604, 139614, 140206, 140908, 141133, 140766, 139936, 138820, 137835, 137514, 137887, 138382, 138572, 138686, 139096, 139649, 139902, 139798, 139733, 140039, 140718, 141656, 142821, 144179, 145595, 146948, 148267, 149697, 151286, 152868, 154212, 155301, 156344, 157421, 158267, 158567, 158347, 157845, 157105, 155981, 154481, 152810, 151062, 149267, 147814, 147398, 148208, 149468, 150158, 150038, 149700, 149633, 149600, 149023, 147767, 146283, 145114, 144502, 144548, 145445, 147185, 149108, 150226, 150225, 149841, 149957, 150591, 151073, 151003, 150633, 150426, 150705, 151667, 153243, 154871, 155816, 155864, 155441, 155047, 154910, 155110, 155559, 155746, 155114, 153876, 153002, 153059, 153530, 153642, 153477, 153783, 154944, 156650, 158455, 160154, 161607, 162598, 163005, 162976, 162863, 163050, 163698, 164540, 165055, 165005, 164667, 164414, 164275, 164158, 164242, 164790, 165662, 166401]
54377A66401L61Q7j14l73m36Q2J027J741J827J582J497J646J722J635J701K175
54361A82561K765K973K767K730L252L914L880K803J113n03j668k370k752k906
54347A98559k824k500k116j970k145k443k718l127l687l921l283j948p10j18N
54332A65054Q2J85J40j4L7M42Q28O35j77q67o96J32O60M15j9M5L80K55m79j272
54312A65766j674j663j283o07m3r4o73j158j198r91o92k09K68J99m22p81l17L91
54294A54819M08k14o16l92M4L36O24R35Q60L27N8O49J469J291Pj074r48k11j11
54275A58261p70j181p72q0K46M09Q94J555J843J708J607J729J706J220N07Q5J44
54258A69111L20R1n13p37J61J880L183L164K113Q98m5p27j095j102j095j472k046
$$ y = [166401, 166762, 166849, 166735, 166362, 165926, 166008, 167035, 168776, 170603, 172185, 173682, 175328, 177050, 178685, 180386, 182561, 185326, 188299, 191066, 193796, 197048, 200962, 204842, 207645, 208758, 208255, 206587, 204217, 201465, 198559, 195735, 193235, 191119, 189149, 187004, 184561, 181843, 178716, 175029, 171108, 167825, 165877, 165167, 165049, 165054, 165136, 165321, 165461, 165447, 165484, 165926, 166754, 167389, 167212, 166345, 165649, 165781, 166441, 166856, 166837, 166882, 167262, 167517, 167038, 165766, 164092, 162429, 161146, 160539, 160496, 160402, 159729, 158571, 157373, 156382, 155690, 155481, 155749, 155948, 155526, 154745, 154428, 154819, 155227, 155013, 154397, 154005, 154049, 154385, 155009, 155944, 156804, 157131, 157189, 157838, 159307, 160598, 160605, 159531, 158583, 158372, 158261, 157491, 156310, 155538, 155458, 155704, 156113, 157007, 158562, 160405, 162113, 163720, 165449, 167155, 168375, 168882, 168967, 169111, 169431, 169522, 169009, 168272, 168433, 170313, 173496, 176660, 178773, 179671, 179626, 178899, 177804, 176702, 175607, 174135, 172089]
54241A72089k223j816j172n56N4N38O07L58L51Q95J588J782J276L69m60q55p55
54224A72070m75m53q22j290j477j242p84n06o44r22q00k10K27M5m60q26j157j645
54206A58629j802j032J96P22L13M3P49J910K450K063J289O75L42J11j89m90n24
54189A65455k59j12l84p27o39k49M4M29J252J958J570L48k49M07J223J097M47
54172A71611K81O65R69R22N98q4j018j613j587j503j844k111j670q92n40n37l35
54155A61312m9j11j72M40J402J700J207P55O15J75o54r53k36O91Q92N34L22M11
54137A68281N09M99L66Pm21l82K52P29L51m72p19j41M61L93p7j96K56P42P09K81
54117A71428O2L24P35J015J362J905K186J798J226J258J709J645Q95L37L99L32
$$ y = [172089, 169866, 168050, 166878, 166322, 166376, 166914, 167521, 167879, 168230, 169125, 170713, 172495, 173771, 174140, 173680, 172825, 172070, 171595, 171142, 170320, 169030, 167553, 166311, 165527, 165021, 164377, 163455, 162655, 162445, 162672, 162717, 162257, 161431, 160274, 158629, 156827, 155795, 155991, 156713, 157026, 157069, 157818, 159728, 162178, 164241, 165530, 166205, 166547, 166658, 166469, 165979, 165455, 165196, 165084, 164700, 163973, 163334, 163085, 163129, 163558, 164810, 166768, 168338, 168686, 168437, 168844, 170067, 171164, 171611, 171892, 172557, 173526, 174448, 175046, 174962, 173944, 172331, 170744, 169241, 167397, 165286, 163616, 162724, 162184, 161647, 161312, 161263, 161152, 160980, 161420, 162822, 164522, 165729, 166484, 167099, 167274, 166620, 165667, 165431, 166122, 167014, 167548, 167870, 168281, 168790, 169289, 169655, 169662, 169241, 168859, 169111, 169840, 170191, 169719, 169000, 168859, 169320, 169713, 169636, 169440, 169696, 170438, 171147, 171428, 171490, 171814, 172549, 173564, 174926, 176831, 179017, 180815, 182041, 183299, 185008, 186653, 187548, 187885, 188284, 188616]
54101A88616m10j045o27M38J020R35R14J204J359J407K084L536M739M742L820
54086B12732K822J929O94r21k293k878k798k518k295k067j748j429j182q16nJ204
54070A98431K157K224J525Q13N91O89Q02R52J168J116M92l72p66m20K24N79M44
54053B10649N4r0N10J923L562M678N149N386N552N358M824M556M854N057M422
54038B66444L379L172M239N671O474O754P257Q136Q743Q514P666O833O295N695
54024C55272M565L054J970J941K635L014K403J112n4o99j109j832l131m765o174
54009C58202o895o892o547o316o477p011p562p588o856n792n086m892m702m036
53995B71550l042k245k042k527l488m379m560l861k780j916j342p76j18M41P01
$$ y = [188616, 188206, 187161, 186534, 186972, 187992, 188927, 189841, 191045, 192404, 193811, 195895, 199431, 204170, 208912, 212732, 215554, 217483, 218177, 217256, 214963, 212085, 209287, 206769, 204474, 202407, 200659, 199230, 198048, 197232, 197227, 198431, 200588, 202812, 204337, 205150, 205741, 206430, 207232, 208184, 209352, 210468, 210960, 210588, 209822, 209402, 209626, 210205, 210649, 210703, 210613, 211123, 213046, 216608, 221286, 226435, 231821, 237373, 242731, 247555, 252111, 256965, 262022, 266444, 269823, 272995, 277234, 282905, 289379, 296133, 303390, 311526, 320269, 328783, 336449, 343282, 349577, 355272, 359837, 362891, 364861, 366802, 369437, 372451, 374854, 375966, 375912, 375213, 374104, 372272, 369141, 364376, 358202, 351307, 344415, 337868, 331552, 325075, 318064, 310502, 302914, 296058, 290266, 285180, 280288, 275586, 271550, 268508, 266263, 264221, 261694, 258206, 253827, 249267, 245406, 242626, 240710, 239368, 238592, 238474, 238915, 239616]
53980B39616O31K39m44j255j954k345k403k277k159j967j290K8J313J593Q17J1
53964B28154n9K40K95L89J229K668L796M166M185M242M289M520N581P700J0100
53949B81495J1861J2975J3966J4658J3999J1256O992K672m71k105k572k309j544
53936C60873m24P60J550J572Q32j83p86n65L42J531K693L657M200M191L978M216
53920C88437N128O221O927P258P591Q110Q727R318R706R692R428R430R725R422
53906E05120P682M980K619J098k21j733k799k805k275k316l292m615n629o174
53892D89640o440o751p422q520r688j0495j0914j1200j1364j1091j0210q982p831
53879C68732o979o391n968n670n494n443n507n679n942o184o154n679m945m451
$$ y = [239616, 240247, 240486, 240042, 238787, 236833, 234488, 232085, 229808, 227649, 225682, 224392, 224420, 225733, 227326, 228143, 228154, 228095, 228335, 228630, 229019, 230248, 232916, 236712, 240878, 245063, 249305, 253594, 258114, 263695, 271395, 281495, 293356, 306331, 320297, 334955, 348954, 360210, 367202, 369874, 369403, 367298, 364726, 362417, 360873, 360449, 361209, 362759, 364331, 365163, 364980, 364194, 363629, 363971, 365502, 368195, 371852, 376052, 380243, 384221, 388437, 393565, 399786, 406713, 413971, 421562, 429672, 438399, 447717, 457423, 467115, 476543, 485973, 495698, 505120, 512802, 517782, 520401, 521499, 521278, 519545, 516746, 513941, 511666, 509350, 506058, 501443, 495814, 489640, 483200, 476449, 469027, 460507, 450819, 440324, 429410, 418210, 406846, 395755, 385545, 376563, 368732, 361753, 355362, 349394, 343724, 338230, 332787, 327280, 321601, 315659, 309475, 303321, 297642, 292697, 288246]
53865B88246m487m758m700m187l655l457l330k826k138k041k842l731l637k504
53851B39953j300p96q66j021j072r97o62m7N00O50M85J78l61j122j654j538j014
53834B29316o21m15j19K15L17L73Q47J601J922J566J086R29Q55N68K90L75P81
53817B39886J300J836K212K115J615J314J581K052K328K698L655M924N643N440
53803B78599M843M645N185O172O981P143O797O533O653O784O416N533M483L533
53789C60300K865K735L190L733L618K501N94j553l244l892l552k995k985l593
53775C57722m487n498o498p085o983o559o410o556o549o254n873n344m387l159
53761B76080k215j727j393j216j680k818l805l900l393l086l239l462l408l066
$$ y = [288246, 283759, 279001, 274301, 270114, 266459, 263002, 259672, 256846, 254708, 252667, 249825, 246094, 242457, 239953, 238653, 237857, 236991, 235970, 234898, 233901, 233239, 233192, 233692, 234342, 234827, 235005, 234644, 233522, 231868, 230330, 229316, 228695, 228280, 228161, 228376, 228693, 229066, 229913, 231514, 233436, 235002, 236088, 237017, 237872, 238440, 238730, 239105, 239886, 241186, 243022, 245234, 247349, 248964, 250278, 251859, 253911, 256239, 258937, 262592, 267516, 273159, 278599, 283442, 288087, 293272, 299444, 306425, 313568, 320365, 326898, 333551, 340335, 346751, 352284, 356767, 360300, 363165, 365900, 369090, 372823, 376441, 378942, 379536, 377983, 374739, 370847, 367295, 364300, 361315, 357722, 353235, 347737, 341239, 334154, 327171, 320612, 314202, 307646, 301097, 294843, 288970, 283626, 279239, 276080, 273865, 272138, 270745, 269529, 267849, 265031, 261226, 257326, 253933, 250847, 247608, 244146, 240738, 237672]
53747B37672k480j624o42P2J74k93q58r58m80Q9J79j62l47o4L11K64j97o00n25
53728B29531J15J062J822J977J565J039P58P20Q42J103J293J007K39l57k14L61
53712B42863N68K07q2L44J413K558L356L759L829L499K697J733J362K118L551
53697B73775M489M283L453K867K682K521K343K435K658K486J816J199R57P02J3
53682C08679q26j212j036o99n45o70j043j474j553j067l93j27l42n35l43O8L33
53665B97215L22J43l5m3J54L68L94L13L41L84J31l69o33m52k60m38n93o7J050
53646B97925J894J828J050J59m47n70p0R63K063K684K627K098J448J021R84J191
53630C16848J277J085R35J287K217L374M364M933M895M221L320K929L430M379
$$ y = [237672, 235192, 233568, 232926, 232998, 233172, 232879, 232021, 231063, 230583, 230672, 230851, 230689, 230342, 230278, 230589, 230853, 230656, 230056, 229531, 229646, 230708, 232530, 234507, 236072, 237111, 237869, 238589, 239431, 240534, 241827, 242834, 243073, 242716, 242502, 242863, 243431, 243638, 243556, 243900, 245313, 247871, 251227, 254986, 258815, 262314, 265011, 266744, 268106, 270224, 273775, 278264, 282547, 286000, 288867, 291549, 294070, 296413, 298848, 301506, 303992, 305808, 307007, 307964, 308666, 308679, 307853, 306641, 305605, 304906, 304361, 303691, 302648, 301174, 299621, 298554, 298161, 298034, 297692, 297157, 296814, 296882, 297215, 297537, 297680, 297645, 297602, 297756, 298124, 298518, 298831, 299172, 299556, 299687, 299318, 298685, 298233, 297973, 297535, 296942, 296875, 297925, 299819, 301647, 302697, 302856, 302409, 301839, 301769, 302732, 304795, 307479, 310106, 312204, 313652, 314673, 315657, 316848, 318125, 319210, 320145, 321432, 323649, 327023, 331387, 336320, 341215, 345436, 348756, 351685, 355115, 359494]
53616C59494M922M667L973L371K984K660K480K735L409L992M066L857L887M245
53602D10742M489M225L478K415J215L20L50J342K358K320J185j29q60j035j003
53587D31412q45n26j98m3nJ6m4k63m54l77j17l6l42r08j389j392p05L27Q02O9
53567D24982j414k433k303j452o60j47K36L78j1p47j144p15L09J233J462Q39k66
53550D18147j161j324q17j09M87R92J399J502J253R93J074J401J648J806K212
53535D29503K983L729M041M090M499N527O631P071O858O778P408Q499R461J0127
53521E17205J0640J0966J1109J1575J2883J4614J5712J5923J6143J7029J8029
53510F71828J8431J8623J9455K0830K1866K2256K2555K3153K3766K4027K3782
$$ y = [359494, 364416, 369083, 373056, 376427, 379411, 382071, 384551, 387286, 390695, 394687, 398753, 402610, 406497, 410742, 415231, 419456, 422934, 425349, 426564, 426884, 427234, 428576, 430934, 433254, 434439, 434310, 433450, 432415, 431412, 430567, 430041, 429843, 429800, 429795, 429811, 429767, 429504, 429050, 428673, 428556, 428520, 428178, 427270, 425881, 424489, 423784, 424111, 424913, 424982, 423568, 421135, 418832, 417380, 416720, 416573, 416809, 417187, 417176, 416429, 415285, 414570, 414879, 416112, 417574, 418413, 418147, 416986, 415662, 414845, 414736, 415223, 416215, 417614, 419116, 420369, 421362, 422436, 423837, 425485, 427291, 429503, 432486, 436215, 440256, 444346, 448845, 454372, 461003, 468074, 474932, 481710, 489118, 497617, 507078, 517205, 527845, 538811, 549920, 561495, 574378, 588992, 604704, 620627, 636770, 653799, 671828, 690259, 708882, 728337, 749167, 771033, 793289, 815844, 838997, 862763, 886790, 910572]
53499I10572K2806K0989J9028J7989J7971J7903J7095J6167J5971J6342J6615
53488A109448J6775J7221J7806J7993J7798J7762J8021J8114J7873J7798J8306
53477A304915J9007J9048J7907J5733J3088J0498Q121N768L293Q18j556l979o454
53464A406207q364q974q450p965q508r848j0860j0780j0028r893j1280j3737j5804
53451A271716j6563j6559j6886j7631j7928j7439j6967j7219j7611j6983j5080
53440A084850j2740j0794r377q312p513o863o129n275m543l991l298k286j338
53427A002391q66n62L00J863L531M905O277P822Q950R117Q961R780J1892J4285
53413A088646J6045J7369J8843K0446K1887K3325K5051K6728K7833K8657L0165
$$ y = [910572, 933378, 954367, 973395, 991384, 1009355, 1027258, 1044353, 1060520, 1076491, 1092833, 1109448, 1126223, 1143444, 1161250, 1179243, 1197041, 1214803, 1232824, 1250938, 1268811, 1286609, 1304915, 1323922, 1342970, 1360877, 1376610, 1389698, 1400196, 1408317, 1414085, 1417378, 1418196, 1416640, 1412661, 1406207, 1397843, 1388869, 1380419, 1372454, 1363946, 1354098, 1343238, 1332458, 1322430, 1312537, 1301257, 1287520, 1271716, 1255153, 1238594, 1221708, 1204077, 1186149, 1168710, 1151743, 1134524, 1116913, 1099930, 1084850, 1072110, 1061316, 1051939, 1043627, 1036114, 1029251, 1023122, 1017847, 1013304, 1009313, 1006015, 1003729, 1002391, 1001525, 1000963, 1001263, 1003126, 1006657, 1011562, 1017839, 1025661, 1034611, 1043728, 1052689, 1062469, 1074361, 1088646, 1104691, 1122060, 1140903, 1161349, 1183236, 1206561, 1231612, 1258340, 1286173, 1314830, 1344995]
53402A344995L2705L5554L7893L9674M1239M2638M3693M4429M5095M5903M6907
53391A800725M7981M8792M9078M9066M9337N0042N0505M9901M8120M5823M3736
53380B333106M2144M0864L9473L7573L5024L1950K8448K4430J9830J4854R858
53369B657554N046L25m625j0104j6049k1896k6999l1197l4723l7524l9185l9675
53357B400948l9768m0201m0740m0503l9118l7059l4938l2996l1402l0503l0490
53346B003230l1129l2141l3603l5563l7416l8130l7238l5350l3488l2063l0716
53335A626393k8985k6826k4448k1988j9563j7422j5816j4804j4429j4919j6373
53324A410820j8289j9769k0303k0116j9692j9241j8735j8072j7082j5649j4015
$$ y = [1344995, 1377700, 1413254, 1451147, 1490821, 1532060, 1574698, 1618391, 1662820, 1707915, 1753818, 1800725, 1848706, 1897498, 1946576, 1995642, 2044979, 2095021, 2145526, 2195427, 2243547, 2289370, 2333106, 2375250, 2416114, 2455587, 2493160, 2528184, 2560134, 2588582, 2613012, 2632842, 2647696, 2657554, 2662600, 2662925, 2658300, 2648196, 2632147, 2610251, 2583252, 2552055, 2517332, 2479808, 2440623, 2400948, 2361180, 2320979, 2280239, 2239736, 2200618, 2163559, 2128621, 2095625, 2064223, 2033720, 2003230, 1972101, 1939960, 1906357, 1870794, 1833378, 1795248, 1758010, 1722660, 1689172, 1657109, 1626393, 1597408, 1570582, 1546134, 1524146, 1504583, 1487161, 1471345, 1456541, 1442112, 1427193, 1410820, 1392531, 1372762, 1352459, 1332343, 1312651, 1293410, 1274675, 1256603, 1239521, 1223872, 1209857]
53313A209857j2625j1458r947p828n686m193l190k095r45k79k7P09K474M803O970
53298A166540Q894J0764J2310J3144J3624J4699J6771J9177K0973K1890K2262
53287A341048K2372K2183K1647K0945K0311J9705J8821J7287J4949J2004R014
53276A540286O604M966L589J683j005l956o475q384r962j1516j3295j5554j8205
53263A468776k0445k1378k1217k1186k1970k2776k2565k1642k1231k1687k2090
53252A230589k1697k0909k0387k0043j9533j9163j9519k0429k1167k1524k1956
53241A004262k2536k2593k1736k0580j9971j9873j9580j8742j7596j6332j4835
53230G89888j3124j1572j0453r633q902q385q371q943r942j1190j2499j3667j4628
$$ y = [1209857, 1197232, 1185774, 1175827, 1167999, 1162313, 1158120, 1154930, 1152835, 1151890, 1151611, 1151584, 1152293, 1154767, 1159570, 1166540, 1175434, 1186198, 1198508, 1211652, 1225276, 1239975, 1256746, 1275923, 1296896, 1318786, 1341048, 1363420, 1385603, 1407250, 1428195, 1448506, 1468211, 1487032, 1504319, 1519268, 1531272, 1540286, 1546890, 1551856, 1555445, 1557128, 1556123, 1552167, 1545692, 1537308, 1527346, 1515830, 1502535, 1486981, 1468776, 1448331, 1426953, 1405736, 1384550, 1362580, 1339804, 1317239, 1295597, 1274366, 1252679, 1230589, 1208892, 1187983, 1167596, 1147553, 1128020, 1108857, 1089338, 1068909, 1047742, 1026218, 1004262, 981726, 959133, 937397, 916817, 896846, 876973, 857393, 838651, 821055, 804723, 789888, 776764, 765192, 754739, 745106, 736204, 727819, 719448, 710505, 700563, 689373, 676874, 663207, 648579]
53217F48579j5531j6483j7292j7680j7622j7197j6196j4326j1916r934q978q526
53205D76898p682o526o149p200q894r819r463q528p931p923q207q459q471q043
53191C63603p064n733m527l865l800l997m056l879l748l919m264m438m346m207
53177C01760m118l809k956j669n39k16r33k208l069k860j903j161j150j433j369
53162B72367r65o91p39q69q83q47q25p02l46K11P41Q56K63q07j605j587j009n22
53144B62041l83m07n42q54j110r10l61m7r1J08R23J734J618N12p27j239q40Q6
53126B59511R60J360J239R08O99P01Q12Q46O51L48M67J343K381K510J576O45M83
53109B77440M24n55k141l069k860k263j935j681j183o75m59l91k58k03l70n91
$$ y = [648579, 633048, 616565, 599273, 581593, 563971, 546774, 530578, 516252, 504336, 494402, 485424, 476898, 469216, 462690, 456541, 449341, 440447, 430628, 421165, 412637, 404706, 396783, 388576, 380117, 371646, 363603, 356539, 350806, 346279, 342414, 338614, 334617, 330561, 326682, 322934, 319015, 314751, 310313, 305967, 301760, 297642, 293833, 290877, 289208, 288669, 288453, 287520, 285312, 282243, 279383, 277480, 276319, 275169, 273736, 272367, 271402, 270711, 269972, 269103, 268220, 267373, 266548, 265846, 265500, 265711, 266452, 267308, 267571, 266764, 265159, 263572, 262563, 262041, 261658, 261251, 260709, 259855, 258745, 257835, 257474, 257427, 257336, 257444, 258367, 260101, 261719, 262231, 261504, 260265, 259425, 259511, 260471, 261831, 263070, 263978, 264677, 265378, 266190, 267036, 267687, 268035, 268502, 269845, 272226, 274736, 276312, 276957, 277440, 277864, 277309, 275168, 272099, 269239, 266976, 265041, 263360, 262177, 261502, 261043, 260652, 260394, 260191, 259821, 259230]
53093B59230o87p22o86m32j39l58j099j532j059k43K8j59n6M12N52Q1n13q21r84
53074B50813j053o88O7N25L24R1N28J257J266K63j026j782j760j168n02l57r13
53057B45885j496j215q7R54J270J158J157J246J156R03O39K55l21p40n79K8N51
53040B50764P43P48O73M78K59J94J62j01m45l82J68O41N89K59J44K81L93M46O37
53021B56651R69J169J053O44J5p15j237j227p05m5M19O46P42P86Q77J110J442
53004B62594J636J520J148P17L69J14j59n85j096j360j058l24L82Q04J104J417
52988B67223J542J251P93P03J156J763K032J855J488J232J206J360J590J841K071
52973B89106K113J755J052M29K54L68K96j13n18n46j50N76J544K418K604J808
$$ y = [259230, 258543, 257821, 257135, 256703, 256564, 256206, 255107, 253575, 252516, 252273, 252301, 252142, 252086, 252498, 253050, 253131, 252618, 251797, 250813, 249760, 249072, 249139, 249664, 249988, 250079, 250607, 251864, 253130, 253393, 252367, 250585, 248825, 247657, 247155, 246798, 245885, 244389, 243174, 243087, 244041, 245311, 246469, 247626, 248872, 250028, 250931, 251570, 251825, 251504, 250764, 250185, 250213, 250764, 251507, 252255, 252928, 253406, 253665, 253859, 254021, 253920, 253475, 253093, 253261, 253902, 254491, 254750, 254894, 255175, 255568, 256014, 256651, 257620, 258789, 259842, 260486, 260501, 259786, 258549, 257322, 256617, 256572, 256991, 257637, 258379, 259165, 260042, 261152, 262594, 264230, 265750, 266898, 267615, 267984, 268098, 267939, 267354, 266258, 264898, 263840, 263516, 263898, 264702, 265806, 267223, 268765, 270016, 270809, 271512, 272668, 274431, 276463, 278318, 279806, 281038, 282244, 283604, 285194, 287035, 289106, 291219, 292974, 294026, 294455, 294709, 295077, 295373, 295260, 294742, 294196, 294046, 294622, 296166, 298584, 301188, 302996]
52957C02996M74o73j322j565j423q58k64k93j057j862j999j521r77o73n10l61
52941B88112k78l14l77l56k16k3Q9j0l14o49q80j035j162j191j026o87k84N6J70
52922B79625o8n79j057j260j195r64o30l05j18M9N21J263J603R21n20j777k177
52905B73332j788j062m12j13j93l32j46L30O73O32L69J27j6l4J30L78M61L02J48
52886B72786K43N42Q17Q55M77l50j304j741j187K33J838K788K578J447L41J31
52870B80494P72J468J682J613J586J444Q52m0o75o95j91N58J281J676J456N73
52854B93854o88j924k881l508l800l695l198k641k532k937l225k730j643r16j179
52839B56357k092k838k940k497j873j354r76o26k98k12m11m63N8Q89J355J319
$$ y = [302996, 303470, 302797, 301475, 299910, 298487, 297629, 297365, 297072, 296015, 294153, 292154, 290633, 289656, 288983, 288473, 288112, 287834, 287520, 287143, 286787, 286571, 286548, 286637, 286627, 286313, 285664, 284784, 283749, 282587, 281396, 280370, 279683, 279399, 279455, 279625, 279557, 278978, 277921, 276661, 275466, 274502, 273872, 273567, 273449, 273498, 274019, 275282, 276885, 277806, 277286, 275509, 273332, 271544, 270482, 270070, 269957, 269764, 269432, 269286, 269616, 270289, 270921, 271290, 271417, 271401, 271367, 271497, 271875, 272336, 272638, 272786, 273029, 273571, 274388, 275243, 275720, 275370, 274066, 272325, 271138, 271371, 273209, 275997, 278575, 280022, 280363, 280494, 281266, 282734, 284416, 286029, 287615, 289059, 289911, 289871, 289196, 288501, 288310, 288868, 290149, 291825, 293281, 293854, 293166, 291242, 288361, 284853, 281053, 277358, 274160, 271519, 268987, 266050, 262825, 260095, 258452, 257536, 256357, 254265, 251427, 248487, 245990, 244117, 242763, 241787, 241161, 240863, 240651, 240240, 239777, 239835, 240724, 242079, 243398]
52823B43398J220J121N11o15j240n36Q56J526R97N8m42m18j35L27Q79J142P78
52806B49427l8o96p39l18l8l13q87j119p67k58j27m18p26o86k44L02M77N4n88
52787B42298p81l12M09R66J317J470J291Q56N49M95L66L1j35N2J30k94q64j040
52769B46804q88o75k77L23M40m15j466j507o49j06l25m55O7O20M70j29n22n48
52751B40762l26K54J206K100K633L104L739L947K968J181K0M45J888K966K982
52736B69869K385J846J352N31l81n55K01R69R77P21J129J974K131J215J2p70j198
52719B82408j403j194p20o23r80r98k76L38r7j227j894j580o82K06O83N49Q1k2
52701B72569N08J077J177J196J581J771R88k54o35N2N89J24p72j187j115j047
$$ y = [243398, 244618, 245739, 246250, 245635, 244395, 243859, 244715, 246241, 247238, 247296, 246854, 246436, 246301, 246628, 247507, 248649, 249427, 249389, 248693, 247954, 247636, 247598, 247285, 246398, 245279, 244512, 244254, 244127, 243709, 242983, 242297, 242053, 242355, 242832, 242886, 242298, 241517, 241205, 241614, 242580, 243897, 245367, 246658, 247514, 248063, 248558, 248924, 248955, 248820, 248872, 249002, 248708, 247844, 246804, 245916, 245241, 244964, 245287, 245727, 245312, 243846, 242339, 241690, 241584, 241259, 240804, 240871, 241491, 241961, 241832, 241310, 240762, 240436, 240690, 241896, 243996, 246629, 249733, 253472, 257419, 260387, 261568, 261588, 262033, 263921, 266887, 269869, 272254, 274100, 275452, 275983, 275602, 275047, 275248, 276217, 277194, 277915, 279044, 281018, 283149, 284364, 284376, 283606, 282408, 281005, 279811, 279091, 278468, 277488, 276490, 276214, 276552, 276455, 275228, 273334, 271754, 271072, 271278, 271961, 272510, 272591, 272569, 273077, 274154, 275331, 276527, 278108, 279879, 280867, 280613, 279978, 280030, 280619, 280743, 279971, 278784, 277669, 276622]
52685B76622j081j055j016r59n31L48R55N09o77j484j366q25m18l1N51R03M33
52668B70878n97j170q07k10l25j092j555j078k2Q99J507K136K976L773M162M096
52652B83571L811L507L127K527J734R27J88o11j530k363k802k697k083j136k69
52637B85901J7l33p55p66n70n68n30L2Q64J139P56N52R74J329Q60j32q55j197
52619B86718j564j968j978j433n92K85R83J112M87l45n09J48R47J330J418J583
52603B86622J839J924J637R64J33m10l53M1R8m67j162j274o85N3L45J57k3K60
52585B89699R94J808K367K493K081J171J77l58l35k03l04m46k89J36N11O15L83
52568C00500j02n00m70k47n45j501k229j940j012l78j99n3Mn05j370j654j025
$$ y = [276622, 275541, 274486, 273470, 272511, 271980, 272328, 273283, 273792, 273115, 271631, 270265, 269440, 269022, 268991, 269542, 270445, 270878, 270281, 269111, 268304, 268094, 267769, 266677, 265122, 264044, 264022, 264921, 266428, 268564, 271540, 275313, 279475, 283571, 287382, 290889, 294016, 296543, 298277, 299204, 299392, 298781, 297251, 294888, 292086, 289389, 287306, 286170, 285901, 285918, 285585, 284830, 284064, 283494, 282926, 282396, 282428, 283292, 284431, 285187, 285739, 286713, 288042, 288902, 288770, 287915, 286718, 285154, 283186, 281208, 279775, 279183, 279468, 280451, 281563, 282050, 281705, 281196, 281344, 282291, 283621, 285039, 286622, 288461, 290385, 292022, 292986, 293119, 292709, 292356, 292397, 292495, 292028, 290866, 289592, 288907, 288960, 289305, 289462, 289439, 289699, 290693, 292501, 294868, 297361, 299442, 300613, 300790, 300432, 300097, 299894, 299590, 299144, 298855, 298991, 299502, 300117, 300500, 300398, 299898, 299428, 299181, 298636, 297135, 294906, 292966, 291954, 291576, 291377, 291324, 291328, 290823, 289453, 287799, 286774]
52551B86774k70j14l01k64r1j26j66K47R53J260Q39R3m37n59k92K71Q70J158J156
52532B91001J364K047K645K307J112J96L73J026R04j96j206j298q31n20l57M1
52516B98608N49P35P22J093J949K657K721K404K348K890L796M367L874K253L90
52501C31356p23j185k033l806n699o509n943m699l475k428j493p67l69j69J7P7
52485B92152l71j323k136k127j392n94m6N15J169J504J324J093J194J295R82O22
52469B93861Q73J664K332K626K811K956K846K603K606K723K336J360N03K66K50
52454C22616k15j203k267l028l408l523l530l406k924k099j437j362j553j427
52440B91234j091j076j257r12J9O46L89l06p65q51n56K78J279J459N31l36J01
$$ y = [286774, 286504, 286390, 286089, 285825, 285734, 285608, 285442, 285689, 286642, 287902, 288741, 288834, 288397, 287838, 287546, 287817, 288687, 289845, 291001, 292365, 294412, 297057, 299364, 300476, 300672, 301045, 302071, 302975, 302779, 301573, 300275, 299444, 298924, 298567, 298608, 299157, 299892, 300614, 301707, 303656, 306313, 309034, 311438, 313786, 316676, 320472, 324839, 328713, 330966, 331356, 330633, 329448, 327415, 323609, 317910, 311401, 305458, 300759, 297284, 294856, 293363, 292596, 292227, 292058, 292075, 292152, 291781, 290458, 288322, 286195, 284803, 284209, 284163, 284678, 285847, 287351, 288675, 289768, 290962, 292257, 293239, 293861, 294734, 296398, 298730, 301356, 304167, 307123, 309969, 312572, 315178, 317901, 320237, 321597, 322100, 322366, 322616, 322401, 321198, 318931, 315903, 312495, 308972, 305442, 302036, 299112, 297013, 295576, 294214, 292661, 291234, 290143, 289067, 287810, 286898, 286917, 287563, 287952, 287646, 286881, 286030, 285474, 285752, 287031, 288490, 289021, 288685, 288786]
52423B88786J502K482K369J604P52K7k84J25J003J635J737J737K001K311K364
52408C10151K390K980M323N954P228P983Q584R268R562Q631O124K532j283m585
52394C79842o894q047q279p879o844n195l546k671k469k032r90K2M62O90J105
52379C27275J364J155J083J834K946L416L268L493M443N277N237M672M431M670
52365C74564M745M002K447P15m65q86q99q60p68n40l13k16o9L59R89J611K159
52348C86575K583K696K464K175K091K201K502L091L743L969L894M370N707O958
52334D35019P233P122P827R421J0990J2245J3742J5572J7017J7778J8536J9924
52322E92426K1683K3127K3858K3815K3156K2315K1710K1342K1117K1370K2328
$$ y = [288786, 290288, 292770, 295139, 296743, 297495, 297522, 297238, 297363, 298366, 300001, 301738, 303475, 305476, 307787, 310151, 312541, 315521, 319844, 325798, 333026, 341009, 349593, 358861, 368423, 377054, 383178, 385710, 384427, 379842, 372948, 364901, 356622, 348743, 341899, 336704, 333158, 330487, 328018, 325986, 324996, 325018, 325480, 326170, 327275, 328639, 329794, 330877, 332711, 335657, 339073, 342341, 345834, 350277, 355554, 360791, 365463, 369894, 374564, 379309, 383311, 385758, 386473, 386008, 385122, 384223, 383363, 382595, 382055, 381742, 381526, 381457, 381816, 382805, 384416, 386575, 389158, 391854, 394318, 396493, 398584, 400785, 403287, 406378, 410121, 414090, 417984, 422354, 428061, 435019, 442252, 449374, 457201, 466622, 477612, 489857, 503599, 519171, 536188, 553966, 572502, 592426, 614109, 637236, 661094, 684909, 708065, 730380, 752090, 773432, 794549, 815919, 838247]
52311H38247K3246K3087K2077K1558K2053K2605K2337K1610K1057K0509J9634
52300A078020J8773J8226J7371J5405J2569R780P334M814J986r06l700o414q845
52287A164413j0583j1480j1698j1398j0748j0068r536q816p430n421l258j199
52275A062778Q82L050N149P096R002J0900J2530J3614J4181J4604J5242J6061
52263A185089J6661J6840J6964J7454J8077J8178J7666J7187J7166J7225J6842
52252A375349J6053J5092J3841J2120J0068P819N104J781j549m055n619o829q147
52239A431028r556j0780j1530j1655j1464j1573j2078j2247j1540j0476r761r077
52227A299291p655n818m752m735m717l963l039k683k627k158j164J23J757L693
$$ y = [838247, 861493, 884580, 906657, 928215, 950268, 972873, 995210, 1016820, 1037877, 1058386, 1078020, 1096793, 1115019, 1132390, 1147795, 1160364, 1170144, 1177478, 1182292, 1184278, 1183372, 1179672, 1173258, 1164413, 1153830, 1142350, 1130652, 1119254, 1108506, 1098438, 1088902, 1080086, 1072656, 1067235, 1063977, 1062778, 1063660, 1066710, 1071859, 1078955, 1087957, 1098857, 1111387, 1125001, 1139182, 1153786, 1169028, 1185089, 1201750, 1218590, 1235554, 1253008, 1271085, 1289263, 1306929, 1324116, 1341282, 1358507, 1375349, 1391402, 1406494, 1420335, 1432455, 1442523, 1450342, 1455446, 1457227, 1455678, 1451623, 1446004, 1439175, 1431028, 1421472, 1410692, 1399162, 1387507, 1376043, 1364470, 1352392, 1340145, 1328605, 1318129, 1308368, 1299291, 1291636, 1285818, 1281066, 1276331, 1271614, 1267651, 1264612, 1261929, 1259302, 1257144, 1255980, 1256103, 1257860, 1261553]
52213A261553N229N718N569N732O368O824O901P233Q117Q792Q379P043N691M830
52199A353979M321M161M784O359Q193R288R343Q890Q497Q212P851P397O825N836
52185A453936M252K511J202O9j937n277q943j1439j2392j2613j2730j2515j1696
52172A372428j0744j0250r947r029p322n523m227l267k231j084L1J192K384L149
52158A315560L085K519K041J549M33j202k322k306j734j454j375r20j89J61j3
52143A313833j93j20j32m21o86p53r67j512j861j384k10J012K037L320N394Q311
52127A325668J1744J5261J8450K1037K3047K4788K6569K8459L0296L1827L2814
52116A589960L3091L2640L1585L0154K8551K6871K5034K2908K0499J8002J5677
$$ y = [1261553, 1266782, 1272500, 1278069, 1283801, 1290169, 1296993, 1303894, 1311127, 1319244, 1328036, 1336415, 1343458, 1349149, 1353979, 1358300, 1362461, 1367245, 1373604, 1381797, 1391085, 1400428, 1409318, 1417815, 1426027, 1433878, 1441275, 1448100, 1453936, 1458188, 1460699, 1461901, 1461970, 1460033, 1454756, 1445813, 1434374, 1421982, 1409369, 1396639, 1384124, 1372428, 1361684, 1351434, 1341487, 1332458, 1325136, 1319613, 1315386, 1312119, 1309888, 1308804, 1308835, 1310027, 1312411, 1315560, 1318645, 1321164, 1323205, 1324754, 1325187, 1323985, 1321663, 1319357, 1317623, 1316169, 1314794, 1313874, 1313685, 1313846, 1313833, 1313640, 1313520, 1313388, 1312967, 1312281, 1311528, 1310561, 1309049, 1307188, 1305804, 1305594, 1306606, 1308643, 1311963, 1317357, 1325668, 1337412, 1352673, 1371123, 1392160, 1415207, 1439995, 1466564, 1495023, 1525319, 1557146, 1589960, 1623051, 1655691, 1687276, 1717430, 1745981, 1772852, 1797886, 1820794, 1841293, 1859295, 1874972]
52105A874972J3697J2178J1177J0613J0167R400P985N870L292O51j729l788n725
52092A948760p789j0115j2712j5475j8201k0578k2200k2659k1778j9880j7679
$$ y = [1874972, 1888669, 1900847, 1912024, 1922637, 1932804, 1942204, 1950189, 1956059, 1959351, 1960002, 1958273, 1954485, 1948760, 1940971, 1930856, 1918144, 1902669, 1884468, 1863890, 1841690, 1819031, 1797253, 1777373, 1759694]
$$ [...]
##END NTUPLES=NMR SPECTRUM
##END=
