##TITLE=AC1619_BRASL13350_8325958_LeAUvf3HCF
##JCAMPDX= 6.0         $$ Bruker NMR JCAMP-DX V2.0
##DATA TYPE= NMR SPECTRUM
##DATA CLASS= NTUPLES
##ORIGIN= BRUKER
##OWNER= Administrator
$$ 1.72 TOPSPIN		Version 2.1
$$ 2013-11-13 21:23:42.700 -0800  Administrator@X
$$ Compression mode = diff/dup
##.OBSERVE FREQUENCY= 400.02188249412
##.OBSERVE NUCLEUS= ^1H
##.ACQUISITION MODE= SIMULTANEOUS (DQD)
##.ACQUISITION SCHEME= undefined
##.AVERAGES= 64
##.DIGITISER RES= 22
##SPECTROMETER/DATA SYSTEM= spect
##.PULSE SEQUENCE= noesygpps1d.comp
##.SOLVENT NAME= COFFEE_meoh
##.SHIFT REFERENCE= INTERNAL, COFFEE_meoh, 1, 14.96095
##AUDIT TRAIL= $$ (NUMBER, WHEN, WHO, WHERE, PROCESS, VERSION, WHAT)
$$ ##TITLE= Audit trail, TOPSPIN		Version 2.1
$$ ##JCAMPDX= 5.01
$$ ##ORIGIN= Bruker BioSpin GmbH
$$ ##OWNER= Administrator
$$ $$ E:\/data/COFFEE/nmr/AC1619_BRASL13350_8325958_LeAUvf3HCF/12/pdata/1/auditp.txt
$$ ##AUDIT TRAIL=  $$ (NUMBER, WHEN, WHO, WHERE, PROCESS, VERSION, WHAT)
(   1,<2013-11-13 21:23:37.232 -0800>,<Administrator>,<X>,<go>,<TOPSPIN 2.1>,
      <created by zg
	started at 2013-11-13 21:12:07.513 -0800,
	POWCHK enabled, PULCHK disabled,
       configuration hash MD5:
       C8 4E 4E 5D D3 5C D8 9E 9F 52 82 E0 59 8A DE 15
       data hash MD5: 64K
       03 45 91 CD 24 80 8A 07 98 8A 7C 67 BC 69 AF A4>)
(   2,<2013-11-13 21:23:40.357 -0800>,<Administrator>,<X>,<proc1d>,<TOPSPIN 2.1>,
      <Start of raw data processing
       efp LB = 0.3 FT_mod = 6 PKNL = 1 PHC0 = 0 PHC1 = 0 SI = 128K 
       data hash MD5: 128K
       6F C3 BA F6 7B CE 26 3B 63 DE C4 98 EE F6 3D B0>)
(   3,<2013-11-13 21:23:41.450 -0800>,<Administrator>,<X>,<proc1d>,<TOPSPIN 2.1>,
      <pk PHC0 = -84.56726 PHC1 = 0 
       data hash MD5: 128K
       C2 AB 91 E1 1F EE D5 E8 A1 29 93 01 99 0F C0 3D>)
(   4,<2013-11-13 21:23:42.122 -0800>,<Administrator>,<X>,<proc1d>,<TOPSPIN 2.1>,
      <abs ABSG = 1 
       data hash MD5: 128K
       01 61 29 7A A2 38 E2 84 33 35 34 29 1D 5B 42 0C>)
(   5,<2013-11-13 21:23:42.216 -0800>,<Administrator>,<X>,<proc1d>,<TOPSPIN 2.1>,
      <abs ABSG = 2 
       data hash MD5: 128K
       37 0A 52 1E 75 49 70 02 0A 56 CC 5F BA 82 83 A8>)
(   6,<2013-11-13 21:23:42.310 -0800>,<Administrator>,<X>,<proc1d>,<TOPSPIN 2.1>,
      <abs ABSG = 3 
       data hash MD5: 128K
       9B D6 C4 D9 70 44 0E E2 3B 65 E3 9D 8E 50 E3 92>)
(   7,<2013-11-13 21:23:42.403 -0800>,<Administrator>,<X>,<proc1d>,<TOPSPIN 2.1>,
      <abs ABSG = 4 
       data hash MD5: 128K
       76 06 72 37 89 CD 74 C5 9C 61 CA 6D 43 78 95 5E>)
(   8,<2013-11-13 21:23:42.482 -0800>,<Administrator>,<X>,<proc1d>,<TOPSPIN 2.1>,
      <abs ABSG = 5 
       data hash MD5: 128K
       6D 33 9D 7D A1 BD A0 B4 25 84 F1 6D C5 86 D7 5B>)
$$ ##END=
$$ 
$$ $$ hash MD5
$$ $$ CE 13 45 AB 95 D4 01 0A EF 2B E0 48 46 CB 4C 98
##$RELAX= 
##$RELAX= 
##$RELAX= 
##$RELAX= 
##$RELAX= 
##$RELAX= 
##$RELAX= 
##$RELAX= 
$$ Bruker specific parameters
$$ --------------------------
##$DU= <E:\>
##$EXPNO= 12
$$ [...]
150 150 150 150 150 150 150 150
##$TP07= 0
##$TPNAME0= <>
##$TPNAME1= <>
##$TPNAME2= <>
##$TPNAME3= <>
##$TPNAME4= <>
##$TPNAME5= <>
##$TPNAME6= <>
##$TPNAME7= <>
##$TPOAL= (0..7)
0.5 0.5 0.5 0.5 0.5 0.5 0.5 0.5
##$TPOFFS= (0..7)
0 0 0 0 0 0 0 0
##$TUNHIN= 0
##$TUNHOUT= 0
##$TUNXOUT= 0
##$USERA1= <user>
##$USERA2= <user>
##$USERA3= <user>
##$USERA4= <user>
##$USERA5= <user>
##$V9= 5
##$VALIST= <valist>
##$VCLIST= <CCCCCCCCCCCCCCC>
##$VD= 0
##$VDLIST= <DDDDDDDDDDDDDDD>
##$VPLIST= <PPPPPPPPPPPPPPP>
##$VTLIST= <TTTTTTTTTTTTTTT>
##$WBST= 1024
##$WBSW= 4
##$XGAIN= (0..3)
0 0 0 0
##$XL= 0
##$YL= 0
##$YMAX_a= 5976561
##$YMIN_a= -12684580
##$ZGOPTNS= <>
##$ZL1= 120
##$ZL2= 120
##$ZL3= 120
##$ZL4= 120
##$ABSF1= 14.96095
##$ABSF2= -5.597232
##$ABSG= 5
##$ABSL= 3
##$ALPHA= 0
##$AQORDER= 0
##$ASSFAC= 0
##$ASSFACI= 0
##$ASSFACX= 0
##$ASSWID= 0
##$AUNMP= <proc_prof1d_extract.lims>
##$AXLEFT= 0
##$AXNAME= <>
##$AXNUC= <1H>
##$AXRIGHT= 0
##$AXTYPE= 0
##$AXUNIT= <>
##$AZFE= 0.1
##$AZFW= 0.1
##$BCFW= 0
##$BC_mod= 0
##$BYTORDP= 0
##$COROFFS= 0
##$CY= 15
##$DATMOD= 1
##$DC= 0
##$DFILT= <>
##$DTYPP= 0
##$F1P= 0
##$F2P= 0
##$FCOR= 0.5
##$FTSIZE= 131072
##$FT_mod= 6
##$GAMMA= 0
##$GB= 0
##$INTBC= 1
##$INTSCL= 1
##$ISEN= 128
##$LB= 0.3
##$LEV0= 0
##$LPBIN= 0
##$MAXI= 10000
##$MC2= 0
##$MEAN= 0
##$ME_mod= 0
##$MI= 0
##$NCOEF= 0
##$NC_proc= -2
##$NLEV= 6
##$NOISF1= 0
##$NOISF2= 0
##$NSP= 0
##$NTH_PI= 0
##$NZP= 0
##$OFFSET= 14.96095
##$PC= 1
##$PHC0= -84.56726
##$PHC1= 0
##$PH_mod= 1
##$PKNL= yes
##$PPARMOD= 0
##$PPDIAG= 0
##$PPIPTYP= 0
##$PPMPNUM= 2147483647
##$PPRESOL= 1
##$PSCAL= 4
##$PSIGN= 0
##$PYNMP= <proc.py>
##$REVERSE= no
##$SF= 400.02000965487
##$SI= 131072
##$SIGF1= 0
##$SIGF2= 0
##$SINO= 400
##$SIOLD= 131072
##$SPECTYP= <>
##$SREGLST= <1H.CDCl3>
##$SSB= 0
##$STSI= 131072
##$STSR= 0
##$SW_p= 8223.68421052631
##$SYMM= 0
##$S_DEV= 0
##$TDeff= 65536
##$TDoff= 0
##$TI= <>
##$TILT= no
##$TM1= 0
##$TM2= 0
##$TOPLEV= 0
##$USERP1= <user>
##$USERP2= <user>
##$USERP3= <user>
##$USERP4= <user>
##$USERP5= <user>
##$WDW= 1
##$XDIM= 131072
##$YMAX_p= 399258188
##$YMIN_p= -11558
##$CURPLOT= <Network HP LaserJet P1505>
##$CURPRIN= <$Network HP LaserJet P1505>
##$DFORMAT= <normdp>
##$LAYOUT= <+/1D_H.xwp>
##$LFORMAT= <normlp>
##$PFORMAT= <normpl>
##$SURQMSG= 1
$$ End of Bruker specific parameters
$$ ---------------------------------
##NTUPLES= NMR SPECTRUM
##VAR_NAME=  FREQUENCY,     SPECTRUM/REAL,   SPECTRUM/IMAG
##SYMBOL=    X,             R,               I
##VAR_TYPE=  INDEPENDENT,   DEPENDENT,       DEPENDENT
##VAR_FORM=  AFFN,          ASDF,            ASDF
##VAR_DIM=   131072,        131072,          131072
##UNITS=     HZ,            ARBITRARY UNITS, ARBITRARY UNITS
##FACTOR=    0.0627417313425164, 1,          1
##FIRST=     8223.62146879497, -1748,        -63344
##LAST=      0,             194,             -63836
##MIN=       0,             -11558,          0
##MAX=       8223.62146879497, 399258188,    0
$$ Real data points
##PAGE= N=1
##DATA TABLE= (X++(R..R)), XYDATA
$$ [...]
63913C898537k78601k70197k58116k43085k26750k10217j92998j74431j55511
63904A888631j38099j22719j08368r4434q1568p0472o0959n2677m5794m0375l5823
63893A037343l1612k8041k5579k3941k2545k1474k1245k1696k1985k1624k0810
63882G76791j9642j7797j5281j2781j0772q777o105k940q0K289M815P915J1118
63869G08753J3658J5311J6338J7024J7652J8576J9844K0922K1217K0779K0063
63858I10137J9046J7224J4550J1778R434P006L696k88l857o330q013r539j1202
63845I53642j3104j5366j7853k0117k1918k3457k4888k5939k6387k6525k6755
63834G11333k7020k7099k7105k7177k6902k5727k3822k1931k0427j9066j7693
$$ plain form
63913 3898537 3619936 3349739 3091623 2848538 2621788 2411571 2218573 2044142 1888631
63904 1888631 1750532 1627813 1519445 1425011 1343443 1272971 1212012 1159335 1113541 1073166 1037343
63893 1037343 1005731 977690 952111 928170 905625 884151 862906 841210 819225 797601 776791
63882 776791 757149 739352 724071 711290 700518 691741 685636 682696 682616 684905 689720 697635 708753
63869 708753 722411 737722 754060 771084 788736 807312 827156 848078 869295 890074 910137
63858 910137 929183 946407 960957 972735 982169 989175 992871 992583 988726 982396 974383 964844 953642
63845 953642 940538 925172 907319 887202 865284 841827 816939 791000 764613 738088 711333
63834 711333 684313 657214 630109 602932 576030 550303 526481 504550 484123 465057 447364
63823D47364j6453j5250j3738j2070j0930j0442r777q424p123o819p166p010o077
63810C16085n249n095n078m467l395k542k201k110j944j648j383j390j793k385
63796B75405k726k605k288k177k342k565k729k945l269l473l235k561j928j830
63782B38732k163k201j354J08J263J428P56l1l38j23J69R9l20o84p72q32j133
63765B32604j394j113l49K18K12P4L57Q79R48L04n55j027j016q23o78n51k79K30
63747B28041Q53J209R19P3o29m47O02J666J925J443J028J323K216L038L204K631
63731B49095J782J397J916L001L739L505K559J724J624K299L390M458N180N468
63717B91137N437N173M632L811K847J868Q76p5q08j356k077l069l750l477k453
$$ plain form
63823 447364 430911 415661 401923 389853 378923 368481 358704 350280 343157 336338 329172 322162 316085
63810 316085 310836 305741 300663 296196 292801 290259 288058 285948 284004 282356 280973 279583 277790 275405
63796 275405 272679 270074 267786 265609 263267 260702 257973 255028 251759 248286 245051 242490 240562 238732
63782 238732 236569 234368 233014 233122 234385 235813 236569 236538 236200 236077 236246 236345 236025 235341 234569 233737 232604
63765 232604 231210 230097 229748 229966 230178 230252 230609 231488 232436 232740 232185 231158 230142 229319 228641 228090 227811 228041
63747 228041 228894 230103 231022 231095 230466 230019 230621 232287 234212 235655 236683 238006 240222 243260 246464 249095
63731 249095 250877 252274 254190 257191 260930 264435 266994 268718 270342 272641 276031 280489 285669 291137
63717 291137 296574 301747 306379 310190 313037 314905 315781 315706 314898 313542 311465 308396 304646 301169 298716
63702B98716j524j124r63p15m20oQ00J771K060J389Q66J764L758N199N152M339
63686C21062L807L477K603J159q9p21j157j797k294k101j409r83j146j386j103
63671C17922l83K18M68O53J094J722K247K507K510K221J546N04o32j497j936k151
63655C27013k512l225m145m906n171m782l802k463j102q3K72j85j256k380l011
63640B88262l062k852k524j734j10K075L965M857M784M318L974L876L897L959
63626C13685M118M400M738N096N524N984O267O327O593P546Q977J0082J0466J0690
63612D10493J1586J3347J5548J7811K0016K2063K3815K5241K6344K6958K6899
63601F40121K6128K4536K1689J7239J1547N622M40l433n769o703o834o843o978
$$ plain form
63702 298716 297192 296068 295105 294390 293970 293964 294764 296535 298595 299984 300850 302614 306372 311571 316723 321062
63686 321062 324869 328346 330949 332108 332019 331298 330141 328344 326050 323949 322540 321557 320411 319025 317922
63671 317922 317539 317757 318225 318878 319972 321694 323941 326448 328958 331179 332725 333229 332597 331100 329164 327013
63655 327013 324501 321276 317131 312225 307054 302272 298470 296007 294905 294822 295094 294909 293653 291273 288262
63640 288262 285200 282348 279824 278090 277980 280055 284020 288877 293661 297979 301953 305829 309726 313685
63626 313685 317803 322203 326941 332037 337561 343545 349812 356139 362732 370278 379255 389337 399803 410493
63612 410493 422079 435426 450974 468785 488801 510864 534679 559920 586264 613222 640121
63601 640121 666249 690785 712474 729713 741260 746882 747322 743889 738120 731417 724583 717740 710762
63588G10762p201p754r051j1003j3060j5040j7299j9777k1443k1329j9786j8078
63576E29941j6907j5817j4067j1571q827o300m171k471j200k95L89J036J842K930
63562D54512M200N235N553N127M513M379M831N461N985O618P764R525J1677J3870
63548E49250J5824J7534J9479K2332K6218L0451L4145L6682L7334L4969K8836
63537H53054J9661R536O89n513q786r786r593q879p638o083n315o396r003j1880
63523G94068j4564j7675k1481k5121k7616k8792k8856k7912k6358k5009k4128
63512E26556k2932k0695j7841j5379j3694j2506j1598j0897j0097q880p383n964
63500C68690m720l630k870k543k360k082j941k081k032j384o49o13j076j077l66
$$ plain form
63588 710762 703561 695807 686756 675753 662693 647653 630354 610577 589134 567805 548019 529941
63576 529941 513034 497217 483150 471579 462752 456452 452281 449810 448610 448315 448704 449740 451582 454512
63562 454512 458712 463947 469500 474627 479140 483519 488350 493811 499796 506414 514178 523703 535380 549250
63548 549250 565074 582608 602087 624419 650637 681088 715233 751915 789249 824218 853054
63537 853054 872715 882251 882940 877427 868641 858855 849262 840383 832745 826662 821347 814951 805948 794068
63523 794068 779504 761829 740348 715227 687611 658819 629963 602051 575693 550684 526556
63512 526556 503624 482929 465088 449709 436015 423509 411911 401014 390917 382037 374654 368690
63500 368690 363970 360340 357470 354927 352567 350485 348544 346463 344431 343047 342398 341785 340709 339632 339266
63485C39266K09K4m02j40R76K322L233L528L377K986K401J728J365J655K167J868
63469C66563M76q90j122p60j267k846m120m056l217k652k502k344k172k263k413
63454C34415k101j238k21O87J543K322K762K770K658K948L943N490P051Q042Q250
63439C79321P966P707P925Q861J0567J2923J5808J9174K2787K5919K7549K6917
63427E73424K3891J8989J3352Q492N477M219L934M304N759Q510J1970J5447J8892
63414G16660K2544K6182K9207L1138L1576K9972K6077K0492J4237P866J522m217
63402I53256q308j0299j0822j0685j0062r076q729j0333j3970j8243k1789k4509
63390G96431k6946k8988k9898k9443k8248k6855k5063k2569j9784j7471j5821
$$ plain form
63485 339266 339475 339499 339097 338957 339933 342255 345488 349016 352393 355379 357780 359508 360873 362528 364695 366563
63469 366563 367039 366149 365027 364267 363000 360154 356034 351978 348761 346109 343607 341263 339091 336828 334415
63454 334415 332314 331076 330855 331542 333085 335407 338169 340939 343597 346545 350488 355978 363029 371071 379321
63439 379321 387287 394994 402919 411780 422347 435270 451078 470252 493039 518958 546507 573424
63427 573424 597315 616304 629656 638148 643625 647844 651778 656082 661841 670351 682321 697768 716660
63414 716660 739204 765386 794593 825731 857307 887279 913356 933848 948085 955951 957473 953256
63402 953256 944948 934649 923827 913142 903080 894004 885275 874942 860972 842729 820940 796431
63390 796431 769485 740497 710599 681156 652908 626053 600990 578421 558637 541166 525345
63379E25345j4387j2807j1080r172o854m184j707Q6J320K460L690M817N723O643
63365D89893P874R384J0787J1767J2488J3515J5290J7678K0130K2242K4079K6070
63353F81197K8597L1536L4017L4786L3080K9181K3982J8154J1988N859L40m260
63341I28457p971j0627j1679j0943r282q149q477j0254j2983j6206j9531k2513
63329G79842k4750k6064k6476k6130k5253k4030k2370j9919j6513j2564q761n377
63317E41635k245L87J354m58m690r582j3518j6017j7164j6913j5521j3927j2824
63304D20517j1716r740p251n539m962m442l203j960j687k044j937j218p94j189
63290C62835j909k367k622k943l209l208l133l316l651l672l137k261j386p23
$$ plain form
63379 525345 510958 498151 487071 477899 471045 466861 465154 465240 466560 469020 472710 477527 483250 489893
63365 489893 497767 507151 517938 529705 542193 555708 570998 588676 608806 631048 655127 681197
63353 681197 709794 741330 775347 810133 843213 872394 896376 914530 926518 932377 932717 928457
63341 928457 920486 909859 898180 887237 877955 869806 861329 851075 838092 821886 802355 779842
63329 779842 755092 729028 702552 676422 651169 627139 604769 584850 568337 555773 547012 541635
63317 541635 539390 539777 541131 540673 535983 526401 512883 496866 479702 462789 447268 433341 420517
63304 420517 408801 399061 391810 386271 381309 376867 373664 371704 370017 367973 366036 364818 364024 362835
63290 362835 360926 358559 355937 352994 349785 346577 343444 340128 336477 332805 329668 327407 326021 325298
63276C25298m08m93o97m63M13J395J745J434J080J009R17O81Q58J783K640K356
63260C39548J284J000K268M009M835M764M747N081N251N166N491O515P481P553
63246D04993P056P113Q284J0005J1384J2158J2629J3110J3777J4953J6968J9578
63234E52008K1954K3582K4844K6336K7868K8727K8797K8785K9123K9313K8649
63223H49986K7196K5619K4478K4007K4281K5182K6313K7219K7647K7440K6473
63212A135841K4882K2909K0324J6429J1009M818j450q097j5584k3087k8925l2436
63200A126633l4503l6064l6902l6346l4399l1619k8369k4761k1053j7506j4023
63189H11088j0320o437k765M17L213N980R028J2324J5424J7834J9521K0866K2074
$$ plain form
63276 325298 324890 324397 323700 323237 323650 325045 326790 328224 329304 330313 331230 331911 332769 334552 337192 339548
63260 339548 340832 341832 344100 348109 352944 357708 362455 367536 372787 377953 383444 389959 397440 404993
63246 404993 412049 419162 427446 437451 448835 460993 473622 486732 500509 515462 532430 552008
63234 552008 573962 597544 622388 648724 676592 705319 734116 762901 792024 821337 849986
63223 849986 877182 902801 927279 951286 975567 1000749 1027062 1054281 1081928 1109368 1135841
63212 1135841 1160723 1183632 1203956 1220385 1231394 1236212 1234762 1226665 1211081 1187994 1159069 1126633
63200 1126633 1092130 1056066 1019164 982818 948419 916800 888431 863670 842617 825111 811088
63189 811088 800768 794331 791566 791983 795196 801176 810204 822528 837952 855786 875307 896173 918247
63176I18247K3024K3703K4326K4719K4159K2341K0100J8552J7729J6738J5069
63165A148707J3004J0647P448L015k246p718j3322j9146k4765k9528l3305l6368
63153A016423l8613l9551l9101l7836l6206l4070l1267k8191k5379k2863k0423
63142F62923j8228j6574j5111j3025j0242p777o496n999n277m137l251k914k559
63129E51333j704p05j41R3N75J545K765L996N072N720N769N597N755O141O041
63114E97852N138L967L189K884K786K726K489J727N27l10j92L36K22o73j447j409
63098F19812q11k53K2J8k58o12o44j77N11J110J565J806J647J193R66J277J788
63081F28960K107K426L231M559N925O763O753O032N359N700P183Q858R871J0451
$$ plain form
63176 918247 941271 964974 989300 1014019 1038178 1060519 1080619 1099171 1116900 1133638 1148707
63165 1148707 1161711 1172358 1179806 1182821 1180575 1172857 1159535 1140389 1115624 1086096 1052791 1016423
63153 1016423 977810 938259 899158 861322 825116 791046 759779 731588 706209 683346 662923
63142 662923 644695 628121 613010 599985 589743 581966 575470 569471 564194 560057 556806 553892 551333
63129 551333 549629 548924 548783 548876 549451 550996 553761 557757 562829 568549 574318 579915 585670 591811 597852
63114 597852 602990 606957 610146 613030 615816 618542 621031 622758 623285 622975 622783 623119 623341 622668 621221 619812
63098 619812 619001 618748 618770 618788 618530 617918 617274 617097 617608 618718 620283 622089 623736 624929 625895 627172 628960
63081 628960 631067 633493 636724 641283 647208 653971 660724 666756 672115 677815 684998 693856 703727 714178
63067G14178J1201J1987J2385J2857J4354J6801J9070K0740K2797K6090K9938
63056I12398L3094L5533L8384M2313M6686N0461N3365N6037N9213O2902O6347
63045A456733O8761P0051P0605P0508O9454O7549O5687O4746O4662O4693O4367
63034B197816O3814O3284O2661O1443N8957N4737M8801M1474L2710K1867Q414
63023B715978p200k3569l9146n2830o4106p3015p9993q5294q8502q8871q6193
63012B027259q1122p4581o7132n9008n0486m1933l3526k5176j6840q784j316N621
63000A572976J2363J8931K4806K9478L2952L5489L7065L7533L7204L6759L6593
62989A912149L6587L6524L6266L5515L3916L1505K8519K4696J9306J2089L537
$$ plain form
63067 714178 725379 737366 749751 762608 776962 793763 812833 833573 856370 882460 912398
63056 912398 945492 981025 1019409 1061722 1108408 1158869 1212234 1268271 1327484 1390386 1456733
63045 1456733 1525494 1595545 1666150 1736658 1806112 1873661 1939348 2004094 2068756 2133449 2197816
63034 2197816 2261630 2324914 2387575 2449018 2507975 2562712 2611513 2652987 2685697 2707564 2715978
63023 2715978 2708778 2685209 2646063 2593233 2529127 2456112 2376119 2290825 2202323 2113452 2027259
63012 2027259 1946137 1871556 1804424 1745416 1694930 1652997 1619471 1594295 1577455 1568671 1567355 1572976
63000 1572976 1585339 1604270 1629076 1658554 1691506 1726995 1764060 1801593 1838797 1875556 1912149
62989 1912149 1948736 1985260 2021526 2057041 2090957 2122462 2150981 2175677 2194983 2207072 2210609
62978B210609n915j6276k7186l7540m6476n4188o1020o6440o9740p1266p1947
62967A682615p1803o9980o6220o1355n6282n1359m7002m3815m1760l9888l7456
62956A095695l4781l2567l0904k9333k7506k5386k3159k1341k0574k0859k1212
62945H08073k0633j9122j7471j6209j5247j4337j3403j2375j1129r755q591p826
62933F41975p239o447n380m357l704l345k899k193j459q99l28M23R87Q02no71
62917F05261q70j185k187l546m465m679m537m296l923l507l410l826m488m920
62903E55422m911m621m355m213l979l386k507j661r96m02M9J2n68j138j179r05
62887E20662q80j160j296j066p33n32m34l98m37l59R4P04Q69M74J59M42R21Q12
$$ plain form
62978 2210609 2204694 2188418 2161232 2123692 2077216 2023028 1962008 1895568 1825828 1754562 1682615
62967 1682615 1610812 1540832 1474612 1413257 1356975 1305616 1258614 1214799 1173039 1133151 1095695
62956 1095695 1060914 1028347 997443 968110 940604 915218 892059 870718 850144 829285 808073
62945 808073 787440 768318 750847 734638 719391 705054 691651 679276 668147 658392 649801 641975
62933 641975 634736 628289 622909 618552 614848 611503 608604 606411 604952 604053 603725 604148 605135 605937 605932 605261
62917 605261 604391 603206 601019 597473 593008 588329 583792 579496 575573 572066 568656 564830 560342 555422
62903 555422 550511 545890 541535 537322 533343 529957 527450 525789 524793 524391 524440 524452 523884 522746 521567 520662
62887 520662 519782 518622 517326 516260 515527 514995 514561 514163 513726 513367 513461 514165 515034 515508 515667 516109 517030 517842
62869E17842k4r97j575j722j624j365r95o12k97m3K08N02P62P49L61nL18J373
62851E12856K254K041Q61l62j004j175j179j222j597k455l261l057j641k2O49
62836E01686K07p09j477j745j345m89K39N23P00J009J003L20l54OJ260K259K534
62819E05627K816L607M257M000L195K787L048L549L981M313M417M228M227N041
62805E59093O575P945Q452Q188P722P598Q118R207J0335J0978J1311J2101J3740
62792F81363J5696J7165J8046J9094K1208K4688K9050L3354L6960M0226M4358
62781I81208N0318N7851O5782P3261Q0414Q7683R4899J01353J06602J10656J13325
62770A923352J13771J11102J05141R6328Q5061P1452N5561L7516J7593l367k3721
$$ plain form
62869 517842 517818 516821 515246 513524 511900 510535 509540 508928 508631 508588 508796 509298 510060 510809 511170 511165 511483 512856
62851 512856 515110 517151 518012 517650 516646 515471 514292 513070 511473 509018 505757 502700 501059 501037 501686
62836 501686 501893 501184 499707 497962 496617 496128 496367 496890 497590 498599 499602 499922 499568 499574 500834 503093 505627
62819 505627 508443 512050 516307 520307 523502 526289 529337 532886 536867 541180 545597 549825 554052 559093
62805 559093 565668 573613 582065 590253 597975 605573 613691 622898 633233 644211 655522 667623 681363
62792 681363 697059 714224 732270 751364 772572 797260 826310 859664 896624 936850 981208
62781 981208 1031526 1089377 1155159 1228420 1308834 1396517 1491416 1592769 1699371 1810027 1923352
62770 1923352 2037123 2148225 2253366 2349694 2434755 2506207 2561768 2599284 2616877 2613510 2589789
62759B589789m1833n7286p0732q2496r1896r8305j02250j04759j05910j04763
62749A729559j00821r5069q9293q4475q0067p4854o8419o1652n5713n0860m6517
62738I21819m2281l8201l4186k9922k5609k2026j9520j7510j5429j3527j2159
62727F51449j0939r304p478o018m833l537k391j901j641n74J318K892L586M329
62713F14958O200Q995J1747J3996J5934J7750J9590K1870K4967K8643L2269L5610
62701H52529L9111M3375M8578N4355O0140O5631P0937P6151Q0812Q4181Q6082
62690A561882Q7055Q7387Q6319Q2601P5646O5833N3784L9761K3909O823j0341
62679B160659k6459m1031n4120o5714p5446q2976q8309r1384r1734q9125q4426
$$ plain form
62759 2589789 2547956 2490670 2419938 2337442 2245546 2147241 2044991 1940232 1834322 1729559
62749 1729559 1628738 1533669 1444376 1359901 1279834 1204980 1136561 1074909 1019196 968336 921819
62738 921819 879538 841337 807151 777229 751620 729594 710074 692564 677135 663608 651449
62727 651449 640510 631206 623728 617710 612877 609340 606949 605048 603407 602833 604151 607043 610629 614958
62713 614958 621158 630153 641900 655896 671830 689580 709170 731040 756007 784650 816919 852529
62701 852529 891640 935015 983593 1037948 1098088 1163719 1234656 1310807 1391619 1475800 1561882
62690 1561882 1648937 1736324 1822643 1905244 1980890 2046723 2100507 2140268 2164177 2171000 2160659
62679 2160659 2134200 2093169 2039049 1973335 1897889 1814913 1726604 1635220 1543486 1454361 1369935
62668A369935p9246p4602p0330o5792o0721n5322n0063m5495m1822l8584l5185
62657G52773l1699k8592k5696k2347j8707j5984j4789j4212j3214j2171j2001
62646E43361j2400j2109j0797r444q753q231p211n878m717l615k183n92N65J094
62632D59090J299J283P27m50j615k079j963k014k432k437j305N16J840K169K085
62617D54714K223K506K695L045L849M755N188N238N540O317P147P715Q234Q992
62603E28158J0004J1289J3021J5143J7210J9015K1044K3911K7605L1685L5967
62592G54052M0433M4635M7837M9977N1766N3482N4226N2918M9590M4974L9132
62581A283022L1423K1889J1704J935p391j6504k4967l2164l8202m3399m7340m9308
$$ plain form
62668 1369935 1290689 1216087 1145757 1079965 1019244 963922 913859 868364 826542 787958 752773
62657 752773 721074 692482 666786 644439 625732 609748 594959 580747 567533 555362 543361
62646 543361 530961 518852 508055 498611 489858 481627 474416 468538 463821 460206 458023 457431 457996 459090
62632 459090 460389 461672 462399 461949 460334 458255 456292 454278 451846 449409 448104 448620 450460 452629 454714
62617 454714 456937 459443 462138 465183 469032 473787 478975 484213 489753 496070 503217 510932 519166 528158
62603 528158 538162 549451 562472 577615 594825 613840 634884 658795 686400 718085 754052
62592 754052 794485 839120 886957 936934 988700 1042182 1096408 1149326 1198916 1243890 1283022
62581 1283022 1314445 1336334 1348038 1349973 1342582 1326078 1301111 1268947 1230745 1187346 1140006 1090698
62569A090698m9499m8914m8024m6414m3819m0709l7628l4653l1818k9342k7122
62558F52756k4512k1125j7400j4141j1756j0225r304q556p628o728o396o537o298
62545E02150n161l620k355j350l24N03P22M35N8k33l84j66M73J072J290J458K005
62528D96573K682L040L307M028N190O493Q138J0473J3030J4992J6597J9005K2573
62515F26121K6307K9410L2374L5970L9940M3421M6170M8570N0737N2258N2646
62504A083924N1542M8628M3824L7584L0574K3082J5046O634j578r067j5656k1210
62492A293327k5237k7102k6644k4402k1080j6943j1910o210n34M655R665J5057
62480A162642K0824K6468L1730L6662M0874M3156M2296L8034L1163K2933J4522
$$ plain form
62569 1090698 1041199 992285 944261 897847 854028 813319 775691 741038 709220 679878 652756
62558 652756 628244 607119 589719 575578 563822 553597 544293 535737 528109 521381 514985 508448 502150
62545 502150 496989 493369 491014 489664 489340 489843 490565 491000 491058 490825 490441 490275 490748 491820 493110 494568 496573
62528 496573 499255 502295 505602 509630 514820 521313 529451 539924 552954 567946 584543 603548 626121
62515 626121 652428 681838 714212 750182 790122 833543 879713 928283 979020 1031278 1083924
62504 1083924 1135466 1184094 1227918 1265502 1296076 1319158 1334204 1340838 1339260 1330193 1314537 1293327
62492 1293327 1268090 1240988 1214344 1189942 1168862 1151919 1140009 1133799 1133265 1137920 1147585 1162642
62480 1162642 1183466 1209934 1241664 1278326 1319200 1362356 1404652 1442686 1473849 1496782 1511304
62469A511304O673o46q195j6745k6264l5861m4474n1441n6464n9379o0274n9655
62457A098579n8256n6418n3859n0139m5249l9658l3937k8598k4045k0283j6704
62446F71433j2711q706n861m593l789k051O11K967M252M927N754O769P441P394
62432F73837O600N093K844n8l317o503r239j1369j2994j4247j5103j5414j5124
62419E85006j4369j3341j2231j1222j0471j0040r813r437q539p146n830n070m623
62406D62874l915l028k633k844k811j946q41m15n86n45o7L24L27L04O57J366K214
62389D48435K997L439L359K975K664K486K334K370K838L530M079M619N512O525
62375D98162P039P131P543Q397Q831Q340P673P827Q784R846J0742J1651J2568
$$ plain form
62469 1511304 1517977 1517331 1509136 1492391 1466127 1430266 1385792 1334351 1277887 1218508 1158234 1098579
62457 1098579 1040323 983905 930046 879907 834658 795000 761063 732465 708420 688137 671433
62446 671433 658722 650016 644155 639562 635773 633722 634333 637300 641552 646479 652233 659002 666443 673837
62432 673837 680437 685530 688374 688316 684999 678496 669257 657888 644894 630647 615544 600130 585006
62419 585006 570637 557296 545065 533843 523372 513332 503519 494082 485543 478397 472567 467497 462874
62406 462874 458959 455931 453298 450454 447643 445697 444856 444441 443855 443310 443243 443567 443894 444198 444855 446221 448435
62389 448435 451432 454871 458230 461205 463869 466355 468689 471059 473897 477427 481506 486125 491637 498162
62375 498162 505201 512332 519875 528272 537103 545443 553116 560943 569727 579573 590315 601966 614534
62362F14534J3375J4401J6252J9082K2524K6337L0598L5190L9572M3223M6021
62351I21109M8015M9002M8573M6481M2768L7508L0680K2518J3934O255K62m364
62339A262741q512j2717j6882k0633k3610k5594k6700k7356k7724k7318k5593
62328A020102k2820j9900j7370j5181j3357j2251j1975j2242j3011j4722j7500
62317H49773k0525k2687k3642k3942k4301k4905k5265k4535k2313j9245j6551
62306F01862j4817j3521j1940j0085q449p216o129m994l933l145k651k254j720
62293E11008j004k55N08J459K485K948K462J743J887K822L264K507J423J236J998
62278E36491K869L390L772M252M854N570O273O541O127N528N637O790Q534J0280
$$ plain form
62362 614534 627909 642310 658562 677644 700168 726505 757103 792293 831865 875088 921109
62351 921109 969124 1018126 1066699 1113180 1155948 1193456 1224136 1246654 1260588 1266843 1267105 1262741
62339 1262741 1254229 1241512 1224630 1203997 1180387 1154793 1128093 1100737 1073013 1045695 1020102
62328 1020102 997282 977382 960012 944831 931474 919223 907248 895006 881995 867273 849773
62317 849773 829248 806561 782919 758977 734676 709771 684506 659971 637658 618413 601862
62306 601862 587045 573524 561584 551499 543050 535834 529705 524711 520778 517633 514982 512728 511008
62293 511008 510004 509749 510257 511716 514201 517149 519611 521354 523241 526063 529327 531834 533257 534493 536491
62278 536491 539360 542750 546522 550774 555628 561198 567471 574012 580139 585667 591304 598094 606628 616908
62264F16908J1914J3666J5675J7772J9690K1554K4040K7805L2726L8038M3185
62253H82973M8142N2814N6707N9400O0794O0657N8400N3757M7220L9499L0986
62242A451349K2126J3658N890j826j0220j9060k7559l5435m2814m9321n4081n6590
62230A196117n7060n5920n3565n0468m6990m3076l8650l4188l0406k7387k4611
62219G33796k1783j9087j6665j4389j2230j0399q980p865p029o519o175n760n315
62206E91600m892m149k775j252m58m62m17K21J123J974L096M642N858N903N066
62191F05078M462M607N007N182N460O397P764Q619Q397P651P420Q042Q833Q950
62177G01869Q208O918N355L699K346J739K042L205N228Q063J1292J4424J7425
$$ plain form
62264 616908 628822 642488 658163 675935 695625 717179 741219 769024 801750 839788 882973
62253 882973 931115 983929 1040636 1100036 1160830 1221487 1279887 1333644 1380864 1420363 1451349
62242 1451349 1473475 1487133 1493023 1491197 1480977 1461917 1434358 1398923 1356109 1306788 1252707 1196117
62230 1196117 1139057 1083137 1029572 979104 932114 889038 850388 816200 785794 758407 733796
62219 733796 712013 692926 676261 661872 649642 639243 630263 622398 615369 608850 602675 596915 591600
62206 591600 586708 582559 579784 578532 578074 577612 577195 577416 578539 580513 583609 588251 594109 600012 605078
62191 605078 609540 614147 619154 624336 629796 636193 643957 652576 660973 668624 676044 684086 692919 701869
62177 701869 710077 716995 722350 726049 728395 730134 732176 735381 740609 748672 759964 774388 791813
62164G91813K0608K4038K7434L0631L3647L6147L7287L6361L3331K8647K2797
62153A122741J6257R629L576j426n345q663j2071j5834j9540k2685k5240k7314
62141A014085k8516k8222k6425k3753k0707j7394j4076j1246q966o734m334k310
62129H21402j177o90l49k53q74k164l396l763k925j087J092K864L981M860O007
62114H23528P384Q517Q932Q186N880K156j896m925o442o967p067o758o000n347
62100H19181n673p279r462j0954j0846r205o935m986l695k825k069j283l33R02
62086G44538K225L092L086K406J709J598K323L829N776P631R063J0331J1942J3839
62072H23388J5270J5697J5446J5143J4857J4351J3955J4364J5475J6259J6229
$$ plain form
62164 791813 812421 836459 863893 894524 928171 964318 1001605 1037966 1071297 1099944 1122741
62153 1122741 1138998 1148627 1152203 1150777 1145432 1136769 1124698 1108864 1089324 1066639 1041399 1014085
62141 1014085 985569 957347 930922 907169 886462 869068 854992 843746 834780 828046 823712 821402
62129 821402 820225 819535 819186 818933 818059 815895 812499 808736 805811 804724 805816 808680 812661 817521 823528
62114 823528 830912 839429 848361 856547 862427 864583 862687 857762 851320 844353 837286 830528 824528 819181
62100 819181 813508 806229 796767 785813 774967 765762 758827 753841 750146 747321 745252 743969 743636 744538
62086 744538 746763 749855 752941 755347 757056 758654 760977 764806 770582 778213 787276 797607 809549 823388
62072 823388 838658 854355 869801 884944 899801 914152 928107 942471 957946 974205 990434
62061I90434J6430J8173K1146K3452K3493K1247J7723J3811R878O034K404q35
62049A163390l611o194r210j3132j7762k2399k6412k9477l1393l2175l2300l2418
62037I06907l2641l2470l1517k9957k8134k6101k3858k1683j9873j8316j6711
62026F25646j5072j3666j2515j1311r942q747q108p953p941p957q125q360q312
62013D97637p912p634p775p817p002n463m079l187k204q74Ok68r57o28J103L331
61997D46277N103O065O032M950L383K197J545R18K27m5J0m58j627k486k437k432
61981D67222l524n080n660n161m779n014n047m247l164k586k505k499k394k113
61967D13449j427m22K97K22m97j473k517l355l431k580j538j130j236j119n97
$$ plain form
62061 990434 1006864 1025037 1046183 1069635 1093128 1114375 1132098 1145909 1155787 1161821 1164225 1163390
62049 1163390 1159779 1153585 1144375 1131243 1113481 1091082 1064670 1035193 1003800 971625 939325 906907
62037 906907 874266 841796 810279 780322 752188 726087 702229 680546 660673 642357 625646
62026 625646 610574 596908 584393 573082 563140 554393 546285 538332 530391 522434 514309 505949 497637
62013 497637 489725 482091 474316 466499 459497 454034 449955 446768 444564 443690 443696 443428 442471 441843 442946 446277
61997 446277 451380 457445 463477 468427 471810 474007 475552 476470 476697 476652 476662 476204 474577 472091 469654 467222
61981 467222 463698 458618 452958 447797 443018 438004 432957 428710 425546 422960 420455 417956 415562 413449
61967 413449 412022 411600 411897 412119 411622 410149 407632 404277 400846 398266 396728 395598 394362 393243 392646
61952C92646j69p1R4O24J309J974K867M162N452O178O364O529P046P821Q563R079
61936D60468R428R859J0548J1252J1474J1079J0513J0160R799Q972P703O406N217
61923E82878L823K007k9j861l141l747l899m097m599n027m768l687k088j47K092
61908E53710M245N783O815P983R440J0503J0642J0222R794R195P884N804L450
61895F55470J300l82j430j930k244k628k935l015l025l073k940k522k190k240
61881F26216k403k417k689l787n529p223q585r793j0809j1294j1081j0206q614
61868E31786o434m365l125k607k174j601j004j21J443L233M201M149M028M651
61854E32060N888P419R318J1469J3204J4198J5058J6384J7740J8245J7810J7086
$$ plain form
61952 392646 392477 392406 392500 393124 394433 396407 399274 403436 408888 415066 421430 427959 435005 442826 451389 460468
61936 460468 469896 479755 490303 501555 513029 524108 534621 544781 554580 563552 571255 577661 582878
61923 582878 586701 588708 588679 586818 583677 579930 576031 571934 567335 562308 557540 553853 551765 551618 553710
61908 553710 557955 563738 570553 578536 587976 598479 609121 619343 629137 638332 646216 652020 655470
61895 655470 656770 656388 654958 653028 650784 648156 645221 642206 639181 636108 633168 630646 628456 626216
61881 626216 623813 621396 618707 614920 609391 602168 593583 583790 572981 561687 550606 540400 531786
61868 531786 525352 520987 517862 515255 513081 511480 510476 510355 511798 515031 519232 523381 527409 532060
61854 532060 537948 545367 554685 566154 579358 593556 608614 624998 642738 660983 678793 695879
61842F95879J6447J5538J3881J1348Q157M665J283j588l663m894n669o661q038
61829G36685q850p838m936j486J269L299N194P034Q436R258R641R471Q245N586
61815G81008J707k526o049q356r920j1563j3381j4662j4884j4285j3329j2193
61803F61567j1009j0128r771r796j0004j0224j0017q908p247o166o246o806o894
61790E48351o422n783n017m069l322l113l041k559j940j856k252k448k275k248
61776E02006k549k639k124j392j046j120j182r64o46n31o18n30L4Q24J342J620
61760D90485K290L654N084N786N741N476N239M964M723M624M361L484K017L90
61746E48318j177k726m131n084n568n849o019n887n342m487l493k618k210k325
$$ plain form
61842 695879 712326 727864 741745 753093 761250 765915 767198 765610 761947 757053 751384 744723 736685
61829 736685 727835 719997 715061 713575 714844 718143 723337 730371 738807 748065 757706 767177 775422 781008
61815 781008 782715 780189 774140 765784 755864 744301 730920 716258 701374 687089 673760 661567
61803 661567 650558 640430 630659 620863 610859 600635 590618 581710 574463 568297 562051 555245 548351
61790 548351 541929 536146 531129 527060 523738 520625 517584 515025 513085 511229 508977 506529 504254 502006
61776 502006 499457 496818 494694 493302 492256 491136 489954 488990 488344 487813 487195 486665 486699 487523 488865 490485
61760 490485 492775 496429 501513 507299 513040 518516 523755 528719 533442 538066 542427 545911 547928 548318
61746 548318 547141 544415 540284 535200 529632 523783 517764 511877 506535 502048 498555 495937 493727 491402
61732D91402k496k269j757j295q01j08L77Q5o69q18O7J213J643J250N64ol28l11
61714D85743O0N78R56J036P87K84k96p52j080j413j820k246k679l121l480l676
61698D68881l786l925m022l956l785l670l671l774l954m011l618k841k337k620
61684D18911l426m117m447m451l947k853j734j252j189p99j54k22j377k664k972
61669C83307k297j430q82o49o14o59n76k32K64P17J059J228J191J118J291J600
61653C84436J577J114Q11J203J955K238J793J226J200J699K112J974J429J049
61639D05816J201J703K071K036J650J013J63p82j516j747j431q49m35m55p18q46
61623D06874q57j208k123l186l834l923l483k418r68n8m70j784k869l257l311
$$ plain form
61732 491402 488906 486637 484880 483585 482784 482676 483053 483138 482469 481651 481718 482931 484574 485824 486388 486382 486054 485743
61714 485743 485803 486381 487337 488373 489160 489444 489148 488396 487316 485903 484083 481837 479158 476037 472557 468881
61698 468881 465095 461170 457148 453192 449407 445737 442066 438292 434338 430327 426709 423868 421531 418911
61684 418911 415485 411368 406921 402470 398523 395670 393936 392684 391495 390696 390542 390320 388943 386279 383307
61669 383307 381010 379580 378698 378049 377435 376776 376200 375968 376232 376949 378008 379236 380427 381545 382836 384436
61653 384436 386013 387127 387938 389141 391096 393334 395127 396353 397553 399252 401364 403338 404767 405816
61639 405816 407017 408720 410791 412827 414477 415490 415653 414871 413355 411608 410177 409328 408893 408438 407720 406874
61623 406874 406017 404809 402686 399500 395666 391743 388260 385842 384874 384816 384346 382562 379693 376436 373125
61608C73125l249k931k747l529n141o039n069l029j718j759k204k115j683j562
61594C30350j781j782j340r31j112j786k269k057j263l78J55Q5n13j097j064n41
61578C12676l57q57j334j118p02r76j750j993j336m06L07R28J486J669J497J406
61562C09140J413J096O28Q05J722K317J881J105J002J493J843J827J725J602J387
61547C30986J301J520J722J531J080O47J55m44p35m36P3M64J144K403L321K686
61531C47418P82p40q85l35k54q63j500j537r27k33j79q76j534j385p27n17j006
61514C34702j466j349r61p65o55l01K20N91P65R57J194J209P47o3o73n71J08O42
61496C34331O29N51J050J918K323J951J315R16O93M13O3k58m42j73P41J745J815
$$ plain form
61608 373125 369876 366945 364198 360669 355528 349489 344420 341391 339673 337914 335710 333595 331912 330350
61594 330350 328569 326787 325447 324516 323404 321618 319349 317292 316029 315651 315806 315891 315378 314281 313217 312676
61578 312676 312319 311462 310128 309010 308308 307332 305582 303589 302253 301847 302154 303082 304568 306237 307734 309140
61562 309140 310553 311649 312277 313082 314804 317121 319002 320107 321109 322602 324445 326272 327997 329599 330986
61547 330986 332287 333807 335529 337060 338140 338787 338942 338498 337763 337327 337400 337864 339008 341411 344732 347418
61531 347418 348200 347460 346575 346240 345986 345123 343623 342086 341159 340926 340747 339871 338337 336952 336225 335708 334702
61514 334702 333236 331887 330926 330161 329506 329205 329425 330016 330781 331738 332932 334141 334888 334825 334152 333581 333689 334331
61496 334331 334960 335511 336561 338479 340802 342753 344068 344984 345677 346090 346153 345895 345453 345280 346021 347766 349581
61479C49581Q08j19J61J362K300K468K379K419K110Q86q44j909j681p70k65m65
61463C58421p72p11n28n65n60j36L59K64k28j61P95J752J800J124N18L26L89O15
61445C62702R26J007P48O49J154J764J618Q67O37J486K681L229K998K413J707
61430C86586R76M67K38p7n98o92J94J459J906J307N87M43N53M34L48P95J592K037
61412C98555J681O34o09j377j205n12m37j538k924l300k593j836j589j360p08
61397C80882n3K3l53o65p72q83j033r85n55K26J166J913K118J839J543J572J796
61380C87779K003K318K867L326L248K745K451K793L557M174M162L450K499K005
61366D29377K158K310J735N76l46o38o30n85k57M85J148J269J133J366K025K727
$$ plain form
61479 349581 350389 350270 350431 351793 354093 356561 358940 361359 363469 364355 363511 361602 359921 359151 358886 358421
61463 358421 357649 356938 356410 355845 355285 355149 355508 355772 355544 355383 356178 357930 359730 360854 361372 361698 362087 362702
61445 362702 363628 364635 365383 366032 367186 368950 370568 371435 372072 373558 376239 379468 382466 384879 386586
61430 386586 387562 388029 388267 388190 387592 386900 387094 388553 390459 391766 392353 392796 393349 393783 394131 394926 396518 398555
61412 398555 400236 400870 400261 398884 397679 397167 396730 395192 392268 388968 386375 384539 382950 381590 380882
61397 380882 380829 380852 380499 379834 379062 378179 377146 376161 375606 375832 376998 378911 381029 382868 384411 385983 387779
61380 387779 389782 392100 394967 398293 401541 404286 406737 409530 413087 417261 421423 424873 427372 429377
61366 429377 431535 433845 435580 436156 435810 435172 434542 433957 433700 434185 435333 436602 437735 439101 441126 443853
61350D43853L447M448N469N716N018M285M361M882M821L868K671J960J987K767
61336D99553M056N094N035L950K876K599K816K753K111J072j13j146j694j806
61322E27156k012k476k503j405L74J724K245K549L248M323N538O789P935Q769
61308E62254R415J0310J1711J3511J5572J7738J9461J9879J8561J5820J2261Q369
61296G34862M649J619o22k486m353o149p622q781r818j0835j1726j2263j2266
61283F54209j1844j1340j0888j0233r274q419p887p047n225l018j779j721j492
61270E64042j3K093L459L649L282K904K551K188K048K415L328M473N351N710N744
61255F13224N648N148L975K639K027K151K106J415O60M99O79N14k24j244k098
$$ plain form
61350 443853 447300 451748 457217 462933 467951 472236 476597 481479 486300 490168 492839 494799 496786 499553
61336 499553 503609 508703 513738 517688 520564 523163 525979 528732 530843 531915 531802 530656 528962 527156
61322 527156 525144 522668 520165 518760 519134 520858 523103 525652 528900 533223 538761 545550 553485 562254
61308 562254 571669 581979 593690 607201 622773 640511 659972 679851 698412 714232 726493 734862
61296 734862 739511 741130 740508 738022 733669 727520 719898 711117 701299 690464 678738 666475 654209
61283 654209 642365 631025 620137 609904 600630 592211 584324 577277 572052 569034 567255 565534 564042
61270 564042 564029 566122 569581 573230 576512 579416 581967 584155 586203 588618 591946 596419 601770 607480 613224
61255 613224 618872 624020 627995 630634 632661 634812 636918 638333 638993 639492 640171 640685 640461 639217 637119
61240F37119k347j831r77l34K47J211K049J616Oj058l92J154K202K814L881N363
61224F50723O428O911P384Q051Q545Q813R208R777J0189J0312J0244R928R348
61211G65861Q804Q421P706O275M691L786L508L219K855K858L228L589M042N064
61197H33907O590Q046R268J0606J2138J3460J4230J4168J2767R890O550M102K632
61184I58354J081j035k979m094m745n584o720p959r218j0307j0892j0992j1016
61171H73894j1115j1029j0683j0398j0336j0295j0280j0648j1467j2227j2442
61160G52974j2152j1672j1285j1217j1390j1124r707p440n531m691m305l334j631
61147F47495q3L60m64j894l176m217n429o780p504p079n990m987m060k935j921
$$ plain form
61240 637119 634772 632941 631964 631630 631877 633088 635137 636753 636759 635701 635309 636463 638665 641479 645360 650723
61224 650723 657151 664062 671446 679497 688042 696855 706063 715840 726029 736341 746585 756513 765861
61211 765861 774665 783086 790792 797067 801758 805544 809052 812271 815126 817984 821212 824801 828843 833907
61197 833907 840497 848543 857811 868417 880555 894015 908245 922413 935180 945070 951620 955722 958354
61184 958354 959435 958400 955421 951327 946582 940998 934278 926319 917101 906794 895902 884910 873894
61171 873894 862779 851750 841067 830669 820333 810038 799758 789110 777643 765416 752974
61160 752974 740822 729150 717865 706648 695258 684134 674427 666987 661456 656765 652460 649126 647495
61147 647495 647412 647772 647308 645414 642238 638021 632592 625812 618308 611229 605239 600252 596192 593257 591336
61132E91336j425r27M05K260L469L760M150N532P811J0518J3273J5466J6555J6956
61118F89139J7754J9272K0854K2126K3482K5025K6133K6478K6485K6407K5909
61107I49064K4976K4145K3343K1648J8820J5997J4063J2315R632O060K246j826
61095A120483o388j0822j4199j6587j8760k0871k2334k2986k3436k4194k5068
61084I14838k5429k4707k2750k0187j8150j7247j6875j6002j4378j2536j0939
61073G15638r587q391p344o373n370m361l435k504j385l2J376K582L409L973M596
61058F82792N351N899O065O328P219Q547R755J0835J2203J3862J5505J7137J8734
61045H20232J9618J9416J9419K1459K5226K8259K9073K8771K9022K9936L0841
$$ plain form
61132 591336 589911 588984 589389 591649 595118 598878 603028 608560 616371 626889 640162 655628 672183 689139
61118 689139 706893 726165 747019 769145 792627 817652 843785 870263 896748 923155 949064
61107 949064 974040 998185 1021528 1043176 1061996 1077993 1092056 1104371 1114003 1120063 1122309 1120483
61095 1120483 1114095 1103273 1089074 1072487 1053727 1032856 1010522 987536 964100 939906 914838
61084 914838 889409 864702 841952 821765 803615 786368 769493 753491 739113 726577 715638
61073 715638 706051 697660 690316 683943 678573 674212 670777 668273 666888 666856 668232 670814 674223 678196 682792
61058 682792 688143 694042 700107 706435 713654 722201 731956 742791 754994 768856 784361 801498 820232
61045 820232 839850 859266 878685 900144 925370 953629 982702 1011473 1040495 1070431 1101272
61034A101272L1744L2862L3764L4191L4885L6512L8474L9822M0728M2064M4140
61023A510458M6575M8894N0540N1132N1404N3051N6985O2656O9643P8561Q9495
61012B169394J00915J11509J21932J33680J47673J65384J89859K23770K67748
61003C631864L22504L91207M77648N83656P10915Q63679J046844J263589J517492
60994A0809398J807789K104160K319700K328350K041634J488526Q20056K27158
60986B3946771j55461k84459j84763P3007L67924N36568M34660K3358n97780j247828
60976B2911997j763820k065247k154444k080996j907351j688255j461225j246369
60968H544290j052920q85182p43661o25165n25590m42563l74697l19916k75896
$$ plain form
61034 1101272 1133016 1165878 1199642 1233833 1268718 1305230 1343704 1383526 1424254 1466318 1510458
61023 1510458 1557033 1605927 1656467 1707599 1759003 1812054 1869039 1931695 2001338 2079899 2169394
61012 2169394 2270309 2381818 2503750 2637430 2785103 2950487 3140346 3364116 3631864
61003 3631864 3954368 4345575 4823223 5406879 6117794 6981473 8028317 9291906 10809398
60994 10809398 12617187 14721347 17041047 19369397 21411031 22899557 23719613 23946771
60986 23946771 23791310 23506851 23322088 23395095 23763019 24299587 24734247 24757605 24159825 22911997
60976 22911997 21148177 19082930 16928486 14847490 12940139 11251884 9790659 8544290
60968 8544290 7491370 6606188 5862527 5237362 4711772 4269209 3894512 3574596 3298700
60959C298700k40938k13116j89741j68972j51000j36353j23947j11992r9969q8513
60949A774159p8052o8760o1282n6262n3420n1899n1050n0252m8663m6123m3667
60938A164729m2150m0905l8747l5732l2921l0802k9077k7610k6514k5438k3788
60927H11045k1625j9485j7431j5164j2928j1430j0774j0293r550q802q301p738
60915F57524o733n460m454l964l596k726j309j61q9p98j235j017p88r43r64m86
60899F22801j57o46j521j994k163k513k804k554k255k805l900m251l511k821l138
60884E85768m108n045o036p328q365q359p498o814o937p511p900q021q174q339
60870D85333p984o758n150m096l887l802l015j534k1J013J468J456J310J565K459
$$ plain form
60959 3298700 3057762 2844646 2654905 2485933 2334933 2198580 2074633 1962641 1862672 1774159
60949 1774159 1696107 1627347 1566065 1509803 1456383 1404484 1353434 1303182 1254519 1208396 1164729
60938 1164729 1122579 1081674 1042927 1007195 974274 943472 914395 886785 860271 834833 811045
60927 811045 789420 769935 752504 737340 724412 712982 702208 691915 682365 673563 665262 657524
60915 657524 650791 645331 640877 636913 633317 630591 629282 629121 629032 628234 626999 625982 625194 624251 623287 622801
60899 622801 622644 621998 620477 618483 616320 613807 611003 608449 606194 603389 599489 595238 591727 588906 585768
60884 585768 581660 576615 570579 563251 554886 546527 539029 532215 525278 517767 509867 501846 493672 485333
60870 485333 477349 470591 465441 461345 457458 453656 450641 449107 449086 450099 451567 453023 454333 455898 458357
60855D58357L434L655K981K088J546J300J110J124J688K761L758M036L475K622
60841D93935K100J910J488N05p12j730k615l608m485m663l930k633j312m49m16
60826D73385j188k070k233j602r20q28j199j509j499j310j199j362j828k390k733
60811D49515k759k720k919l348l776m057m237m290l978l242k610k836l960n060
60797C99723n238m617l972l624l317k973k857k873k471j559p83n37l68J66O66
60782C65366N68J06j44j92k99j04R30K365L092K843K483K623K849K650K341K507
60766C89984L172L992M768N242M884L535J984J276J558K034K001J414N05o04j774
60751D23971k752l403l799l972l773l096k046q36K23O45K6j302k345k485k276
$$ plain form
60855 458357 461791 465446 468427 470515 472061 473361 474471 475595 477283 480044 483802 487838 491313 493935
60841 493935 496035 497945 499433 499938 499226 497496 494881 491273 486788 482125 478195 475562 474250 473801 473385
60826 473385 472197 470127 467894 466292 465372 464544 463345 461836 460337 459027 457828 456466 454638 452248 449515
60811 449515 446756 444036 441117 437769 433993 429936 425699 421409 417431 414189 411579 408743 404783 399723
60797 399723 394485 389868 385896 382272 378955 375982 373125 370252 367781 366222 365439 364902 364534 364700 365366
60782 365366 365934 366040 365896 365704 365405 365301 366231 368596 371688 374531 377014 379637 382486 385136 387477 389984
60766 389984 393156 397148 401916 407158 412042 415577 417561 418837 420395 422429 424430 425844 426349 425745 423971
60751 423971 421219 417816 414017 410045 406272 403176 401130 400294 400517 401162 401188 399886 397541 395056 392780
60736C92780k728l985n188n628n434m992m381l682l291l394l518l113k293j491
60722C39662p45N9N59L11k99l90J41M56O7n09o44l74L7N72J082J107O61N41J228
60703C43522K037K025J366J013J362K027K745L671M740N394N170M166K900J994
60689C84132J931K685L637M150M127L713K835J525M33L43J126J832J767J111M28
60674D15775J17L42R64J506J573J349J156P30m75k232l590m120m464n225o022
60659C97384o077n235l997k885k209k085k153j573J13K196L373L141K293J937
60645C84223K346K899K892K235J292L05q35k124l111l336l017k861l139l328k864
60630C71577j910j103p65o15j61P68J789K226J779R76O28Q13P80P1p33p99k06
$$ plain form
60736 392780 390052 386067 380879 375251 369817 364825 360444 356762 353471 350077 346559 343446 341153 339662
60722 339662 338917 338976 339535 339846 339547 339157 339298 339754 339821 339312 338668 338294 338331 338903 339985 341092 341753 342294 343522
60703 343522 345559 347584 348950 349963 351325 353352 356097 359768 364508 369902 375072 379238 382138 384132
60689 384132 386063 388748 392385 396535 400662 404375 407210 408735 409168 409511 410637 412469 414236 415347 415775
60674 415775 415892 416234 417198 418704 420277 421626 422782 423512 423037 420805 417215 413095 408631 403406 397384
60659 397384 391307 386072 382075 379190 376981 374896 372743 371170 371283 373479 376852 379993 382286 384223
60645 384223 386569 389468 392360 394595 395887 396192 395357 393233 390122 386786 383769 380908 377769 374441 371577
60630 371577 369667 368564 367799 367184 367023 367791 369580 371806 373585 374561 375189 376002 376782 376853 376120 375321 375115
60613C75115K87L95O01J202J718J544Q06J64n0j02l31o40o63k37L99Q79J101J317
60595C83505J765K328K654K699K911L678M653M935M027K395R51J40k06l33k39
60580D15863J4P9l07q47q94j73Q66J570J838K178L037M209N168N849O767Q302
60564D53519J0141J1674J2631J3048J2775J1606R753P705N624L271O54j862m122
60551E46417o254p932q243o821m618k928k001j208j52J093K613M628O780Q266
60537E29640Q941R601J0935J2720J4492J6450J9063K1976K3865K3516K0885J7024
60525G29108J3074R318N201K85m868r012j1343j2112j2107j1909j1645j1093r837
60512F63060p667n122l249k525k273j566m50K95M54Q20K200M551P442J0831J4893
$$ plain form
60613 375115 375402 375797 376398 377600 379318 380862 381668 381832 381782 381680 381349 380709 380046 379809 380208 381087 382188 383505
60595 383505 385270 387598 390252 392951 395862 399540 404193 409128 413155 415550 416501 416641 416435 416102 415863
60580 415863 415877 415956 415649 414802 413908 413735 414601 416171 418009 420187 423224 427433 432601 438450 445217 453519
60564 453519 463660 475334 487965 501013 513788 525394 535147 542852 548476 551747 552401 550539 546417
60551 546417 540163 532231 523988 517167 512549 509621 507620 506412 506260 507353 509966 514594 521374 529640
60537 529640 538581 548182 559117 571837 586329 602779 621842 643818 667683 691199 712084 729108
60525 729108 742182 751500 756701 756986 752118 743106 731763 719651 707544 695635 683990 672897 663060
60512 663060 655393 650271 647022 644497 642224 640658 640208 640503 640957 641777 643977 648528 655970 666801 681694
60497F81694J9366K3676K7667L1627L5537L8767M0761M1607M1501M0048L6618
60486A058869L1378K5473K0112J5794J2494J0124Q490O949M538N50n057j1833
60474A177881j9308k7173l4960m1725m6405m8582m8721m7497m5189m1956l8268
60463G38097l4616l1011k7299k3773k0918j8613j6309j3992j2304j1506j0996
60452E16760j0145r019p936o898n893n189m844m413l616k835k476k297j922j590
60438D47687j644j742j269m28n5m64j201j838k309k431j916j028n91r80j595j598
60422D26598q42J32O65M39l35r81q41Q8J205J937K198K207K152K063J814J342
60406D39841R22J026J576J741R44j69m10M10J382J829J966K088J975J516J247
$$ plain form
60497 681694 701060 724736 752403 784030 819567 858334 899095 940702 982203 1022251 1058869
60486 1058869 1090247 1115720 1135832 1151626 1164120 1174244 1182734 1189683 1194221 1194771 1189714 1177881
60474 1177881 1158573 1131400 1096440 1054715 1008310 959728 911007 863510 818321 776365 738097
60463 738097 703481 672470 645171 621398 600480 581867 565558 551566 539262 527756 516760
60452 516760 506615 497596 489660 482762 476869 471680 466836 462423 458807 455972 453496 451199 449277 447687
60438 447687 446043 444301 443032 442604 442549 442085 440884 439046 436737 434306 432390 431362 430771 429791 428196 426598
60422 426598 425756 425888 426553 426992 426657 425676 424835 424923 426128 428065 430263 432470 434622 436685 438499 439841
60406 439841 440763 441789 443365 445106 446050 445881 445471 445881 447263 449092 451058 453146 455121 456637 457884
60391D57884J675K474K925K888K855L157L559L608L168K541K203K384K834L050
60377D97205K710J850P44j36k63M47J270J323O72L39R84J994K208J280K3n01O8
60360E12217J241K260K749K883L020L325L755M173M315M001L656M204N932P713
60346E65444Q144P262O350N998N346L546J090r47k326l582m992o339p396p972
60332E69626p655o227m350l187l134l426l172k389j778j800k331l004l503l575
60318E20095l096k274j570j183p78R8J437K861M150N349O456P510Q954J1315J4302
60303E73626J6853J8451J9718K1252K2453K2254K0346J6925J1763M742l031r924
60291G35428j5486k0197k3563k4077k1588j8199j5822j4038j1460q233n815m836
$$ plain form
60391 457884 459559 462033 464958 467846 470701 473858 477417 481025 484193 486734 488937 491321 494155 497205
60377 497205 499915 501765 502509 502373 502110 502557 503827 505150 505822 506161 507145 509139 511347 512627 512650 512149 512217
60360 512217 513458 515718 518467 521350 524370 527695 531450 535623 539938 543939 547595 551799 557731 565444
60346 565444 573588 580850 587200 593198 598544 602090 603180 602233 599907 596325 591333 584994 577598 569626
60332 569626 561971 555744 551394 548207 545073 541647 538475 536086 534308 532508 530177 527173 523670 520095
60318 520095 516999 514725 513155 511972 511194 511292 512729 515590 519740 525089 531545 539055 548009 559324 573626
60303 573626 590479 608930 628648 649900 672353 694607 714953 731878 743641 748383 745352 735428
60291 735428 719942 699745 676182 652105 630517 612318 596496 582458 570998 562765 556950 552114
60279E52114m595m501m679n079n135m626m092l945l896l619l360l431l545l231
60265D94380k663k482k833l095k763k201k151k700l190l110k582j829p61N07J254
60250D63781R74K23K8N05R04R01R71J351J530J146N86K51q1o11q77l83N77J310
60232D73086J589J592J407J193J456K476L679M287M358M557N019N140M538L688
60218E18065L364L852M786N485N445M733L992L875M516N579O604P240P446P587
60204E92569Q038Q482Q136O937N928N956O467O276N208M147L696L548L183K470
60190F71041J453J49j231k274k757k785k542k257k342l072m138m930n326n715
60176F33274o178o213n535m689m419m678m673l876k644j720j354j210j034j034
$$ plain form
60279 552114 547519 543018 538339 533260 528125 523499 519407 515462 511566 507947 504587 501156 497611 494380
60265 494380 491717 489235 486402 483307 480544 478343 476192 473492 470302 467192 464610 462781 462020 462527 463781
60250 463781 464755 464978 465006 465511 466415 467316 468287 469638 471168 472314 472900 473151 473070 472459 471582 471199 471776 473086
60232 473086 474675 476267 477674 478867 480323 482799 486478 490765 495123 499680 504699 509839 514377 518065
60218 518065 521429 525281 530067 535552 540997 545730 549722 553597 558113 563692 570296 577536 584982 592569
60204 592569 600607 609089 617225 624162 630090 636046 642513 648789 653997 658144 661840 665388 668571 671041
60190 671041 672494 672643 671412 669138 666381 663596 661054 658797 656455 653383 649245 644315 638989 633274
60176 633274 627096 620883 615348 610659 606240 601562 596889 593013 590369 588649 587295 586085 585051 584017
60162E84017j388j749j670j306j128j043m76N81J315J159M84j00l67j06J008K566
60146E81797L264K501J437J470K251K403J756J394J664J667J054Q96K073L909
60132F09536N172N643N859N924N452M440L411K792K610K683K754K568K164J924
60118F62932K144K669L138L361L253K833K488K862M007M961M692L320J892J001
60104G05553K18r95k305k851k370j567j314j732k202k100j365m20L08O89R39J354
60088F89840J962K444K524K319K105J797J104J32n81q69j251k190l411m332m844
60073F86749n273n894o842q168r528j0189r859r233r109r243q795p667o628o168
60059E74153o003n800n641n532n181m486l780l291k836k221j554r49l10M05J160
$$ plain form
60162 584017 582629 580880 579210 577904 576776 575733 575257 575838 577153 578312 578796 578696 578329 578223 579231 581797
60146 581797 585061 587562 588999 590469 592720 595123 596879 598273 599937 601604 602658 603554 605627 609536
60132 609536 614708 620351 626210 632134 637586 642026 645437 648229 650839 653522 656276 658844 661008 662932
60118 662932 665076 667745 670883 674244 677497 680330 682818 685680 689687 694648 699340 702660 704552 705553
60104 705553 705771 704776 702471 699620 697250 695683 694369 692637 690435 688335 686970 686550 686858 687547 688486 689840
60088 689840 691802 694246 696770 699089 701194 702991 704095 704227 703646 702777 701526 699336 695925 691593 686749
60073 686749 681476 675582 668740 660572 651044 640855 630996 621763 612654 603411 594616 586949 580321 574153
60059 574153 568150 562350 556709 551177 545996 541510 537730 534439 531603 529382 527828 526879 526569 526974 528134
60044E28134K107L367M494M784M347M178M800N472N262M324L506L046K460J555
60030E81836Q11N68L75m67j947l236l629l358l249l675m224m504m827n653o717
60015E38104p320p295p021o644o055n564n746o332o226n017l699l231l188k579
60001D62187j410m47J90J051K034K127Q78o66j084k16R05J465J648K020K648L154
59985D76484L351L475L759M104M277M155L587K282K30j877l150l445l428l589
59971D90215l669l240k502k036j992j953j537q97m91n10o40m01L17J135J705K105
59955D75609K561K913K742J961R68J32m55o93m08K29N90K95k51l43J65P43Q72
59938D87630N61J89n5l63r53j580j640r44q0K98L96J009K415M022N164N786O170
$$ plain form
60044 528134 530241 533608 538102 542886 547233 551411 556211 561683 566945 571269 574775 577821 580281 581836
60030 581836 582647 583215 583590 583123 581176 577940 574311 570953 567704 564029 559805 555301 550474 544821 538104
60015 538104 530784 523489 516468 509824 503769 498205 492459 486127 479901 474884 471185 467954 464766 462187
60001 462187 460777 460330 460520 461571 463605 465732 466610 465944 464860 464644 465549 467014 468662 470682 473330 476484
59985 476484 479835 483310 487069 491173 495450 499605 503192 505474 505704 503827 500677 497232 493804 490215
59971 490215 486546 483306 480804 478768 476776 474823 473286 472389 471898 471388 470748 470347 470664 471799 473504 475609
59955 475609 478170 481083 483825 485786 486754 486886 486431 485738 485330 485559 486149 486444 486193 485850 486015 486758 487630
59938 487630 488191 488380 488325 487962 487009 485429 483789 482845 482765 483063 483459 484468 486883 490905 496069 501855 508025
59921E08025O504O914P518Q164Q448Q165P528O747N779M571L247J967R71P87J742
59906E87077L140L624K747J537J045J065Q83N62N30M89j51r76r31l0M61p5o20
59889F00377J1J534K799L384L673L757L315K566K418L262M333M726M588M673N081
59874F50497N149M557L802L335K788J636J41r68j610k464l855n113n342m478l247
59859F44828k352k044k256k735k985k491j210K64J191J376J330J726K785M257
59845F41684N820P312Q553R176Q808P306M791J654j318l169l406k375q59M80J134
59830F85591O59j012l321n516p209q265q483p832o796n920n221m505m006m007
59816F14157m065l451k333j743k124k735k746k210j651j287j086j072j195j247
$$ plain form
59921 508025 514529 521443 528961 537125 545573 553738 561266 568013 573792 578363 581610 583577 584548 585335 587077
59906 587077 590217 593841 596588 598125 599170 600235 601118 601680 602210 602699 602548 601572 600641 600611 601072 600997 600377
59889 600377 600388 601922 604721 608105 611778 615535 618850 621416 623834 627096 631429 636155 640743 645416 650497
59874 650497 655646 660203 664005 667340 670128 671764 671905 670937 669327 666863 663008 657895 652553 648075 644828
59859 644828 642476 640432 638176 635441 632456 629965 628755 629019 630210 631586 632916 634642 637427 641684
59845 641684 647504 654816 663369 672545 681353 688659 693450 695104 693786 690617 687211 684836 683977 684457 685591
59830 685591 686250 685238 681917 676401 669192 660927 652444 644612 637816 631896 626675 622170 618164 614157
59816 614157 610092 606641 604308 602565 600441 597706 594960 592750 591099 589812 588726 587654 586459 585212
59802E85212j195j230j301j114p50p13j163j644j855k096k603l022k977k648k445
59787E58456k463k603k757k659k123j634k045l260m026l521k435j901k039k206
59773E22784k050j526n03R01K081K796L643M866N484M636L240L014M171N369N772
59758E64678N886O242O632O889P327P937Q163P899P856Q471R206R366Q918Q047
59744F73517O679N012L823L589L622K876J320q8o06m18j43j47m18q05j211j595
59728F95007j869j904j694j428j314j378j591j965k325k217j468o56n69j218j878
59713F71533k038j864j640j356r20l87K47J087K009K657K969L335L974M529M520
59698F88655M058L803M276N288O109O227N971O093O629O593N181K885Q94l20j042
$$ plain form
59802 585212 584017 582787 581486 580372 579622 578909 577746 576102 574247 572151 569548 566526 563549 560901 558456
59787 558456 555993 553390 550633 547974 545851 544217 542172 538912 534886 531365 528930 527029 524990 522784
59773 522784 520734 519208 518705 519606 521687 524483 528126 532992 538476 543112 546352 549366 553537 558906 564678
59758 564678 570564 576806 583438 590327 597654 605591 613754 621653 629509 637980 647186 656552 665470 673517
59744 673517 680196 685208 689031 692620 696242 699118 700438 700350 699744 699326 699183 699036 698618 697813 696602 695007
59728 695007 693138 691234 689540 688112 686798 685420 683829 681864 679539 677322 675854 675198 674629 673411 671533
59713 671533 669495 667631 665991 664635 663715 663328 663575 664662 666671 669328 672297 675632 679606 684135 688655
59698 688655 692713 696516 700792 706080 712189 718416 724387 730480 737109 743702 748883 751768 752662 752342 751300
59683G51300j316r31l87p57k215l635m079l894l824l921m079m804o441q107q470
59668F94440p419o075n273m907m719m689m439l193q68J459K737L103L385L838
59654F67380M097M093M294M932N566N689N308M703L882K616Q82j063k970m759
59640G04650o430p973r326j0205j0143r076p762p195p386p291o156m538l514l218
59626F04437k847k048j591k329l925n089m999m159l723m137m681m422l438k845
59612E54204l455m720n256m379k746j468q85n01O3M94L73k1M5O90J116O89j26
59595E34117m05l4L32M22O14J028J202R78Q84J145J033m7j454k085j869j652j849
59578E32360k136k289k527k895l123l130l094k961k557k223k548l317l516k639
$$ plain form
59683 751300 749984 749053 748666 747909 745694 742059 737980 734086 730262 726341 722262 717458 711017 702910 694440
59668 694440 687021 680946 675673 670766 666047 661358 656919 653726 652858 654317 657054 660157 663542 667380
59654 667380 671477 675570 679864 684796 690362 696051 701359 706062 709944 712560 713442 712379 709409 704650
59640 704650 698220 690247 680921 670716 660573 651497 643735 636540 629154 621863 615707 611169 607655 604437
59626 604437 601590 599542 597951 595622 591697 586608 581609 577450 573727 569590 564909 560487 557049 554204
59612 554204 550749 546029 540773 536394 533648 532180 531295 530794 530857 531351 531724 531703 531748 532438 533554 534243 534117
59595 534117 533712 533678 534010 534432 535046 536074 537276 538254 539138 540283 541316 541269 539815 537730 535861 534209 532360
59578 532360 530224 527935 525408 522513 519390 516260 513166 510205 507648 505425 502877 499560 496044 493405
59564D93405j363n35j70J25L14J45k13k57J88Q46J317J360J019P49J123K101K906
59547E03060K944K574K582L094L539L618L846M927O921R197J1208J3184J5907
59534E86601J9486K2339K1833J6558Q004l45n730p825p962p261n903l853j557
59521F34385L06J375J653J280N11k59r23j906l638n757p341p934p902p694p292
59506E88864o676o211o193o316o079n408m600l871l318k984k666j948q06J54M34
59491E32376K29l0k49k63M67K003L286L298K582K549L474M276M306M194M571N112
59475E72181N297N320N504N571N101M314L694L187K307R73k85q67o73j55J06N2
59459F11627K97J362K863L941M506N356O892Q416R036Q754Q209P790P529P417
$$ plain form
59564 493405 492042 491507 491337 491462 491776 491921 491708 491451 491639 492485 493802 495162 496181 496930 498053 500154 503060
59547 503060 506004 508578 511160 514254 517793 521411 525257 530184 537105 546302 557510 570694 586601
59534 586601 606087 628426 650259 666817 674821 674476 668746 660921 652959 645698 639795 635942 634385
59521 634385 634691 636066 637719 638999 639510 639251 638328 636422 632784 627027 619686 611752 603850 596156 588864
59506 588864 582188 575977 569784 563468 557389 551981 547381 543510 540192 537208 534542 532594 531788 531942 532376
59491 532376 532605 532575 532326 532063 532530 534533 537819 541117 543699 546248 549722 553998 558304 562498 567069 572181
59475 572181 577478 582798 588302 593873 598974 603288 606982 610169 612476 613449 613164 612297 611624 611469 611575 611627
59459 611627 611924 613286 616149 620090 624596 629952 636844 645260 654296 663050 671259 679049 686578 693995
59445F93995P332O845N607L784J694q00l957p299r629j0207r557q784q234p310
59431F53480n612l844l126l588m222m109l207j771K39K671M830O305P702R739
59417F55487J2054J3829J5159J6782J8625J9990K1129K3188K6006K7109K3774
59406H73132J5572M486o594j4926j8544j7170j2476o722j028M676J0235J4188
59394H44829J4316R305K45r565j6740j9973k0074j8362j5707j2885j0636r010
59382G35743p473n946m970m583l995k808j666j148r08m82j27j69k90k11l30q91
59366F99746j217p04O5J59k71l04M25J597K979M406N367N550N483N888O733P736
59350G43638R229J1522J3860J5246J5945J6907J7956J7983J6977J6277J6507J6628
$$ plain form
59445 693995 701327 708172 713779 717563 719257 718457 714500 707201 697572 687365 677808 669024 660790 653480
59431 653480 647868 644024 640898 637310 633088 628979 625772 624001 624240 626911 631741 638046 645748 655487
59417 655487 667541 681370 696529 713311 731936 751926 773055 796243 822249 849358 873132
59406 873132 888704 893190 886596 871670 853126 835956 823480 816758 815730 820406 830641 844829
59394 844829 859145 868450 868695 859130 842390 822417 802343 783981 768274 755389 744753 735743
59382 735743 728270 722324 717354 712771 708776 705968 704302 703154 702246 701764 701637 701468 701178 700967 700637 699746
59366 699746 698529 697825 697890 698049 697778 697474 697899 699496 702475 706881 712248 717798 723281 729169 735902 743638
59350 743638 752867 764389 778249 793495 809440 826347 844303 862286 879263 895540 912047 928675
59338I28675J5607J3763J1677Q873M687k36m323o749q012r062j0433j2109j3767
59325I18591j5096j6045j6664j6772j6176j5252j4744j4745j4476j3430j2165
59314G53026j1451j1176j0715j0003r455r028q199o962o052n881n818m981l348
59301F49957j589k1J746M121O986R931J2617J4635J5233J3550R216K781m294j0154
59287G24715j3519j4446j3974j2932j1423r459p506n843l977j369J554L896N509
59274F41226O967Q491R910J1516J3851J6393J7637J7007J5708J4933J4152J2121
59262G99912Q926N916L862K236L21j774l517m782n948p302q492q762p812o336
59248G66448n285m686l745k179p19n5L7J98O62J384K375L425M062M191M222M209
$$ plain form
59338 928675 944282 958045 969722 978595 983282 983046 978723 971974 963962 954900 944467 932358 918591
59325 918591 903495 887450 870786 854014 837838 822586 807842 793097 778621 765191 753026
59314 753026 741575 730399 719684 709681 700226 691198 682999 676037 669985 664104 658286 653305 649957
59301 649957 648368 648347 650093 654214 661200 671131 683748 698383 713616 727166 736382 739163 734869 724715
59287 724715 711196 696750 682776 669844 658421 648962 641456 635613 631636 630267 631821 635717 641226
59274 641226 648193 656684 666594 678110 691961 708354 725991 742998 758706 773639 787791 799912
59262 799912 808838 814754 818616 820852 821173 819399 815882 811100 805152 797850 789358 780596 772784 766448
59248 766448 761163 756477 752732 750553 749834 749779 749816 750014 750676 752060 754435 757860 761922 766113 770335 774544
59232G74544L603K348J362J197J007k06j966l024l224l621m954o975r099j0845
59218G40147j1744j1679j1262j1152j1133j0543r369q136o961n589m235l426l076
59205F31842k558j713j030p87p60p43o42j07J123K500L094K781K404K631L355
59190F41390M190M899N296N377N504N908O165N877N529N840O467O446N694M946
59176G19528M256K901R68l45m53k78p37j421j448p81K5P24J260J357R34M18Q8
59159G26996m67j682l209m329m837n119n644o652p997r082r385r269r607j0409
59145F39308j0543r299p491o312n764n083m225l924m338m597l955k743j870j727
59131E67437j881j707j027j87L74N44N70Q34J697L312N417P384Q724R457R815
$$ plain form
59232 774544 778147 780495 781857 783054 784061 783855 781889 778865 775641 772020 767066 760091 750992 740147
59218 740147 728403 716724 705462 694310 683177 672634 663265 655129 648168 642579 638344 634918 631842
59205 631842 629284 627571 626541 625754 624994 624251 623609 623502 624625 627125 630219 633000 635404 638035 641390
59190 641390 645580 650479 655775 661152 666656 672564 678729 684606 690135 695975 702442 708888 714582 719528
59176 719528 723784 726685 727653 727308 726855 726577 725840 724419 722971 722190 722215 722939 724199 725556 726490 726908 726996
59159 726996 726529 724847 721638 717309 712472 707353 701709 695057 687060 677978 668593 659324 649717 639308
59145 639308 628765 619466 611975 605663 599899 594816 590591 586667 582329 577732 573777 571034 569164 567437
59131 567437 565556 563849 562822 562635 563009 563553 564123 564957 566654 569966 575383 582767 591491 600948 610763
59116F10763R888R857J0279J1495J2908J3487J2953J1913J0817R483P802O163
59104G37808M840L530J892K07r78j570j978k558l286l855m021l885l779l782l532
59089G15053k790j895j303r15l95K0k96j412k672l571m238m938n648o212o496
59074F72292o379n957n704n931o160n673m573l682l418l414l290l085k847k534
59060F09645k430k954l901m502m423m053l725l356k978k886k980k705j887j030
59046E65835n70m46n43q69j097p51o3J17m39r23o70m9K76K75L58P56J424K181
59028E64802K763L215M156O035Q158R384R702J0149J1111J1929J2315J2737J2990
59015F79446J1844Q945N727L496J802j80j868k308k096k646l915m355l129j150
$$ plain form
59116 610763 620651 630508 640787 652282 665190 678677 691630 703543 714360 723843 731645 737808
59104 737808 742648 746178 748070 748277 747299 745729 743751 741193 737907 734052 730031 726146 722367 718585 715053
59089 715053 712263 710368 709065 708150 707755 707775 707479 706067 703395 699824 695586 690648 685000 678788 672292
59074 672292 665913 659956 654252 648321 642161 636488 631915 628233 624815 621401 618111 615026 612179 609645
59060 609645 607215 604261 600360 595858 591435 587382 583657 580301 577323 574437 571457 568752 566865 565835
59046 565835 565265 564819 564276 563407 562310 561559 561496 561613 561174 560251 559581 559532 559808 560083 560441 561197 562621 564802
59028 564802 567565 570780 574936 580971 589129 598513 608215 618364 629475 641404 653719 666456 679446
59015 679446 691290 700235 705962 709458 711260 711080 709212 706904 704808 702162 698247 693892 690763 689613
59001F89613K80R02J370K310L728N023N538N318N043N121N157M634L562K181O28
58986G40408p05j156o97k23l54n49k3J043J954K667L705N287P230R365J1478J3132
58970G92562J4156J4943J5827J6599J7061J7481J7941J7868J6867J5414J4034
58959I70753J2428J0147P424M576J236k833o743r467j1343j3499j6091j8193j9281
58946I09114j9671j9606j8918j7754j6650j5812j4894j3602j1917r865p587n564
58934G37274m170l216k382j771j509j237p27m24n92m85N87J863J980J001K94M42
58918G26928N28k89j601k492k510j682l04R47J489J537J824K528L240L945N130
58903G39218O762Q149R146J0579J2942J5409J6761J6836J6396J5949J5348J4449
$$ plain form
59001 689613 689893 690795 692165 694475 698203 703226 708764 714082 719125 724246 729403 734037 737599 739780 740408
58986 740408 739703 738547 737850 737627 737273 736724 736701 737744 739698 742365 746070 751357 758587 767952 779430 792562
58970 792562 806718 821661 837488 854087 871148 888629 906570 924438 941305 956719 970753
58959 970753 983181 993328 1000752 1005328 1006564 1003731 996988 987521 976178 962679 946588 928395 909114
58946 909114 889443 869837 850919 833165 816515 800703 785809 772207 760290 750425 742838 737274
58934 737274 733104 729888 727506 725735 724226 722989 722262 721838 721246 720761 721348 723211 725191 726192 726486 726928
58918 726928 727456 727167 725566 723074 720564 718882 718578 719525 721014 722551 724375 726903 730143 734088 739218
58903 739218 745980 754129 763275 773854 786796 802205 818966 835802 852198 868147 883495 897944
58891H97944J3677J3727J4873J6717J8677K0519K2219K3398K3397K2016J9676
58880A106840J6693J3001Q906N373K880O37k339n819q857j1190j3189j4757j5334
58867A082845j4870j3910j2794j1625j0781j0586j0541r872q801q352q883r767
58855I52063j0562j1436j2249j2292j1419j0527j0425j0850j1046j0719j0038
58844H30500r270q804r063r931j0692j0783j0396j0065j0020j0135j0159r828
58832G11354q994p844o739n808m870l783k560j260K3J189K274L423M464M946M926
58817F90741N204O250P400P765P437P000O397N295M172L771L657K606N12j349
58803G56858k230k859m001n205n697n607n597n860o226o726p409p895p803p327
$$ plain form
58891 897944 911621 925348 940221 956938 975615 996134 1018353 1041751 1065148 1087164 1106840
58880 1106840 1123533 1136534 1145440 1150813 1153693 1154330 1151991 1146172 1137315 1126125 1112936 1098179 1082845
58867 1082845 1067975 1054065 1041271 1029646 1018865 1008279 997738 987866 979065 970713 961830 952063
58855 952063 941501 930065 917816 905524 894105 883578 873153 862303 851257 840538 830500
58844 830500 821230 812426 803363 793432 782740 771957 761561 751496 741476 731341 721182 711354
58832 711354 702360 694516 687777 681969 677099 673316 670756 669496 669519 670708 672982 676405 680869 685815 690741
58817 690741 695945 702195 709595 717360 724797 731797 738194 743489 747661 751432 755089 757695 758207 756858
58803 756858 754628 751769 747768 742563 736866 731259 725662 719802 713576 706850 699441 691546 683743 676416
58789F76416o972o769o213m952l243j754r42n87L5J392L166M608N309N397N168
58774F70059M802M328L573K261L96j625l495n215o687p563p827p944q003p422
58760F29638o114n122n194n455m615k931j639r30M5J342J980J612J047P83M65
58745F04912J15N62K017L482M262N007O428P950Q551Q213P632P025O206N428N313
58730F83103N859O247N674M160K495J548J503J709J419O41L2M3N41J226K012K975
58714G21187M232N863P534Q422P912O308M363K354J50k094l982n555p265r249
58700G40180j1253j3130j4867j6232j6995j7331j7370j6610j4572j1814r541q288
58688E72177p733p509p370o781n429m020l595m124m613m548m162l549k593j713
$$ plain form
58789 676416 669444 662675 656462 651510 648267 646513 645571 644984 645019 646411 649577 654185 659494 664891 670059
58774 670059 674861 679189 682762 685023 685419 683794 680299 675084 668397 660834 653007 645063 637060 629638
58760 629638 623524 618402 613208 607753 603138 600207 598568 597638 597683 599025 601005 602617 603664 604447 604912
58745 604912 605027 605589 607606 611088 615350 620357 626785 634735 643286 651499 659131 666156 672362 677790 683103
58730 683103 688962 695209 700883 705043 707538 709086 710589 712298 713717 714358 714390 714433 714974 716200 718212 721187
58714 721187 725419 731282 738816 747238 755150 761458 765821 768175 768325 766231 762249 756694 749429 740180
58700 740180 728927 715797 700930 684698 667703 650372 633002 616392 601820 590006 580465 572177
58688 572177 564444 556935 549565 542784 537355 533335 529740 525616 521003 516455 512293 508744 506151 504438
58674E04438j420j193o2J684K641K391K099K750M060N479P023Q597R606R849R770
58659E67712R345P719M514O43k654m859n974o228o224o509o700n951m485l557
58645E36792l707m152m263m297m312l678k303j086m75K46J517K531K612K418K816
58630E20659L484L574L004K182J182M8p15q20q26j303j891j901j264k77J114L032
58614E29282N010O267O453N835N034M648M707M478L365J963J356J523J458Q80
58600E82259N77Q74J044O52K01k0m74j148j063K17J699K387K622L261M435N895
58584F03418P668R608J1075J1732J1930J1803J0901R258P866P384P241O670N817
58571G22371N237N124N597O909Q825J0585J1977J3614J5807J8116K0295K2577
$$ plain form
58674 504438 503018 501825 501763 503447 506088 508479 510578 513328 517388 522867 529890 538487 548093 557942 567712
58659 567712 577057 584776 589290 589933 587279 582420 576446 570218 563994 557485 550785 544834 540349 536792
58645 536792 533085 528933 524670 520373 516061 512383 510080 508994 508519 508765 510282 512813 515425 517843 520659
58630 520659 524143 527717 530721 532903 534085 534133 533418 532598 531772 530469 528578 526677 525413 525136 526250 529282
58614 529282 534292 540559 547012 552847 557881 562529 567236 571714 575079 577042 578398 579921 581379 582259
58600 582259 582836 583710 584754 585406 585607 585587 585113 583965 582902 583119 584818 587205 589827 593088 597523 603418
58584 603418 611086 620694 631769 643501 655431 667234 678135 687393 695259 702643 709884 716554 722371
58571 722371 727608 732732 738329 745238 754063 764648 776625 790239 806046 824162 844457 867034
58559H67034K4701K5759K5400K3996K1397J7026J1522O654L023n11m387p168p731
58546A006715o988o284n643m820m646n960q340j1016j3917j6825j8798j9520j9979
58533H63979k0743k0897j9749j8108j6710j4902j2162r494p862o677n265m385
58521G07025m683n021m099k545j747j720j808k270l410m192l573k311j748j692
58507F66206j245p75j194k082k276j718j061k20J059J904J340qp80q28q46q14
58491F56662l34K04L13N63J642L075M268N752P918R619R817R598J0698J2930J4891
58476G47616J6296J7626J8322J7378J5093J2357Q898M161q31m471o783q752j0140
58463H26770j0001q720p464o112l729o71J838L746N891Q123R519J0112J0593J0836
$$ plain form
58559 867034 891735 917494 942894 966890 988287 1005313 1016835 1023489 1026512 1026001 1021614 1014446 1006715
58546 1006715 999727 993443 987800 982980 978334 972374 964034 953018 939101 922276 903478 883958 863979
58533 863979 843236 822339 802590 784482 767772 752870 740708 731214 723352 716675 711410 707025
58521 707025 702342 697321 693222 690677 688930 687210 685402 683132 679722 675530 671957 669646 667898 666206
58507 666206 664961 664186 662992 660910 658634 656916 655855 655635 656694 658598 659938 659930 659150 658322 657476 656662
58491 656662 656328 656532 656845 657408 659050 662125 666393 672145 680063 689682 699499 709097 719795 732725 747616
58476 747616 763912 781538 799860 817238 832331 844688 853586 857747 856916 852445 845662 836910 826770
58463 826770 816769 808049 800585 794473 790744 790073 791911 795657 801548 809671 819190 829302 839895 850731
58449H50731J0305R258P867N090L91m410p132q246r609j1159j1314r958q390o848
58435H06576m641k392j476j426m16J710L348L936M487N398O047O508P446Q402
58421H43507Q328P654P545P346N244J377k160m380o109p655q235p967q047q626
58407H27822q599p711o904o510n999n456n336n012l562j749j078j184m12J408
58393G69718K999M028N064N623M788L420L200L779L437K207J665K040K292K633
58379H16893M009N520N452M591N266P279Q190P499P103P556P458O874P656R802
58365I11148J0960J0393J0053J0989J1939J2269J3079J4478J4840J3679J2382
58354A046209J1386R550O929N083M115K560O78M92J933K515J637J657L667N756
$$ plain form
58449 850731 861036 870294 878161 883251 883642 879232 872100 863854 854245 843086 831772 821814 813424 806576
58435 806576 801935 799543 798067 796641 796225 797935 801283 805219 809706 815104 821151 827659 835105 843507
58421 843507 851835 859489 867034 874380 879624 881001 878841 874461 868352 860697 852462 844495 836448 827822
58407 827822 819223 811512 804608 798098 792099 786643 781307 776295 772733 770984 769906 768722 768310 769718
58393 769718 772717 776745 781809 787432 792220 795640 798840 802619 806056 808263 809928 811968 814260 816893
58379 816893 820902 826422 831874 836465 841731 849010 857200 864699 871802 879358 886816 893690 901346 911148
58365 911148 922108 932501 942554 953543 965482 977751 990830 1005308 1020148 1033827 1046209
58354 1046209 1057595 1067145 1074074 1079157 1083272 1085832 1086510 1087002 1088935 1091450 1093087 1094744 1098411 1104167
58340A104167O605P425R029J0338J0981J2227J4080J4714J3948J4068J5993J7743
58328A251318J7928J7588J7436J6390J4047J1560R198O102L167K686M350N196
58316A376966M365M149N521O555O409O864Q649J0112J0710J1955J3840J4418J3903
58303A494416J4824J7064J7506J5806J5541J7937J9633J8677J7707J8820K0155
58292A688086K0174K0600K2479K3795K3562K3929K5828K6992K6590K7129K9421
58281A958585L0642K9847L0295L3517L6260L6353L6427L8649M0813M1018M1286
58270B353692M3215M4903M5357M6992N0628N3196N3461N4710N8628O2203O3827
58259B930812O6391P0918P3475P2290P1464P3572P5130P3823P3396P6638Q0308
$$ plain form
58340 1104167 1110772 1118197 1127226 1137564 1148545 1160772 1174852 1189566 1203514 1217582 1233575 1251318
58328 1251318 1269246 1286834 1304270 1320660 1334707 1346267 1355465 1361567 1364734 1367420 1371770 1376966
58316 1376966 1381331 1385480 1391001 1397556 1403965 1410829 1419478 1429590 1440300 1452255 1466095 1480513 1494416
58303 1494416 1509240 1526304 1543810 1559616 1575157 1593094 1612727 1631404 1649111 1667931 1688086
58292 1688086 1708260 1728860 1751339 1775134 1798696 1822625 1848453 1875445 1902035 1929164 1958585
58281 1958585 1989227 2019074 2049369 2082886 2119146 2155499 2191926 2230575 2271388 2312406 2353692
58270 2353692 2396907 2441810 2487167 2534159 2584787 2637983 2691444 2746154 2804782 2866985 2930812
58259 2930812 2997203 3068121 3141596 3213886 3285350 3358922 3434052 3507875 3581271 3657909 3738217
58248C738217Q2000Q5223R2361R9470J03576J08195J16053J23468J27859J33515
58238D809937J43632J54036J61250J69322J81771J94462K03745K13921K29183
58229F461259K45797K59955K75557K96441L18966L40111L64332L94448M24989
58220I381855M53018M85709N28220N74615O20374O72532P36986Q07793Q80749
58211A5141851R64967J068526J185747J312194J458556J635451J839654K071281
58203B6678227K348711K689883L097019L579152M171042M910852N823737O952200
58195F0250823Q375471J0168485J2368882J5013495J8166597K1869003K6094234
58188A72306990L0750659L5523912L9459404M0746643L7348271K8328034J4794275
$$ plain form
58248 3738217 3820217 3905440 3997801 4097271 4200847 4309042 4425095 4548563 4676422 4809937
58238 4809937 4953569 5107605 5268855 5438177 5619948 5814410 6018155 6232076 6461259
58229 6461259 6707056 6967011 7242568 7539009 7857975 8198086 8562418 8956866 9381855
58220 9381855 9834873 10320582 10848802 11423417 12043791 12716323 13453309 14261102 15141851
58211 15141851 16106818 17175344 18361091 19673285 21131841 22767292 24606946 26678227
58203 26678227 29026938 31716821 34813840 38392992 42564034 47474886 53298623 60250823
58195 60250823 68626294 78794779 91163661 106177156 124343753 146212756 172306990
58188 172306990 203057649 238581561 278040965 318787608 356135879 384463913 399258188
58181C99258188m41278j4211651k4292920k9945703l1743230l1012777k9143697
58174B38466932k7036478k4971610k2883517k0694256j8429717j6170003j4005165
58167I4276186j2023464j0280615q775915p480973o379036n458092m688376m035473
58159C5154242l483762l025659k640654k305810k016009j774521j572904j397288
58151A6937635j245307j120120j015377r21094q37234p67463p06230o45180n86132
58142I093498n35311m90644m46320m04129l68977l38506l07905k80110k60933
58133E660663k48485k36853k25804k17802k10001j98204j84773j74199j64867
58124C799675j53142j41314j33448j27414j19001j10020j04452j00347r3440q5330
$$ plain form
58181 399258188 398816910 384605259 360312339 330366636 298623406 267610629 238466932
58174 238466932 211430454 186458844 163575327 142881071 124451354 108281351 94276186
58167 94276186 82252722 71972107 63196192 55715219 49336183 43878091 39189715 35154242
58159 35154242 31670480 28644821 26004167 23698357 21682348 19907827 18334923 16937635
58151 16937635 15692328 14572208 13556831 12635737 11798503 11031040 10324810 9679630 9093498
58142 9093498 8558187 8067543 7621223 7217094 6848117 6509611 6201706 5921596 5660663
58133 5660663 5412178 5175325 4949521 4731719 4521718 4323514 4138741 3964542 3799675
58124 3799675 3646533 3505219 3371771 3244357 3125356 3015336 2910884 2810537 2717097 2631767
58114B631767q0407p7693p3284o7972o5161o3809o0484n6086n3906n3253n1308
58103A928404m8952m8632m8869m6821m3933m3180m3239m1197l8533l8326l9014
58092A447708l6961l3082l0946l0256k8131k4992k3407k2777k0789j8536j8662
58081A159169k0048j9710j8384j8860k0372k0093j8722j9067k0392j9677j7438
58070I46406j6802j7755j7517j5916j5220j5290j3930j1519j0431j0389r156p272
58058G85209p311q871r131q047q262r971j0547r424q819r370r261q050p377p542
58044F63226p056n838n356n539n037m437n643q113r227q416p464o935n806m569
58030E73790n058p014q235q261q656r682r997r598r770j0089q871o572n386n461
$$ plain form
58114 2631767 2551360 2473667 2400383 2332411 2267250 2203441 2142957 2086871 2032965 1979712 1928404
58103 1928404 1879452 1830820 1781951 1735130 1691197 1648017 1604778 1563581 1525048 1486722 1447708
58092 1447708 1410747 1377665 1346719 1316463 1288332 1263340 1239933 1217156 1196367 1177831 1159169
58081 1159169 1139121 1119411 1101027 1082167 1061795 1041702 1022980 1003913 983521 963844 946406
58070 946406 929604 911849 894332 878416 863196 847906 833976 822457 812026 801637 792481 785209
58058 785209 777898 769027 759896 751849 743587 733616 723069 713645 704826 695456 686195 678145 670768 663226
58044 663226 656170 650332 644976 639437 634400 629963 624320 616207 606980 598564 591100 584165 578359 573790
58030 573790 568732 561718 553483 545222 536566 526884 516887 507289 497519 487430 478559 471987 466601 461140
58016D61140m911l617l463m618n092m357m006m357l805k169j330j801j769m27
58002D15418O91N80K33L57K33l52m59M3J11l89m52m3p4j60J011K808K972J151
57984D23679n10r13j330k607l683l819l860m263m128l115k307k336k410j958j433
57969C85007j078n40n1k77p89n55J01m4p67o76K18N22mk48j53p97j966k229j704
57950C73970k106l602m293l385k306j929j279J52J217J269J317K110L102L997
57936C68234N316O758P197O877P393Q782Q962O910M154K196O86q67j866k175k881
57921D25676m427n911p001q445r861r424o912m719m432m636l672k326j991k014
57907C49905r67Q56K188K857L422L674L000J686N44k0R8R27J808J644M72l33o0
$$ plain form
58016 461140 456229 452612 449149 444531 439439 435082 431076 426719 422914 420745 419415 417614 415845 415418
58002 415418 416109 416689 416922 417279 417512 417160 416701 416744 416855 416466 416014 415971 415897 415737 416748 419556 422528 423679
57984 423679 423169 422256 420926 418319 414636 410817 406957 402694 398566 395451 393144 390808 388398 386440 385007
57969 385007 383929 383389 383338 383061 382272 381717 381818 381774 381007 380331 380549 381071 381067 380819 380666 379869 377903 375674 373970
57950 373970 371864 368262 363969 360584 358278 356349 355070 355222 356439 357708 359025 361135 364237 368234
57936 368234 373550 380308 387505 394382 401775 410557 419519 426429 430583 432779 433465 432598 430732 428557 425676
57921 425676 421249 415338 408337 399892 390031 380607 373695 368976 364544 359908 356236 353910 351919 349905
57907 349905 348938 349794 351982 354839 358261 361935 364935 366621 367165 367145 367243 368170 369978 371622 372094 371761 371701
57890C71701M16K94RKk72j177k061k495k998l739l893l211k803l354l963l804
57874C38652l575m063m500l786k310j228o92k0Q71J308R24J59j51N67J985K948
57858C27089K922L012M459O454P074O177N524N882O054N296M572M561M307K989
57844C96372J322J43r28k298l311l476l498m059m758n097n312n436m844l591k780
57829C48449k799k588j575p96j108j764j836j670j819j850j364r29r84j016p74
57814C25577q97j474j385k10P12K16j160k572m231o125p104o610n840n772n591
57799B77534m518l512l462l282j839k82k56j006n36J184K481K840L302M247M832
57784B77727M590M040L695L782M630O145P243P061O291O149O540O513N947N425
$$ plain form
57890 371701 372117 372411 372420 372422 372150 370973 368912 366417 363419 359680 355787 352576 349773 346419 342456 338652
57874 338652 335077 331014 326514 322728 320418 319190 318498 318478 319349 320657 321581 321740 321589 322156 324141 327089
57858 327089 330011 333023 337482 343936 351010 357187 362711 368593 374647 379943 384515 389076 393383 396372
57844 396372 397694 397837 396909 394611 391300 387824 384326 380267 375509 370412 365100 359664 354820 351229 348449
57829 348449 345650 343062 341487 340691 339583 337819 335983 334313 332494 330644 329280 328351 327367 326351 325577
57814 325577 324680 323206 321821 321611 322323 322539 321379 318807 314576 308451 301347 294737 288897 283125 277534
57799 277534 273016 269504 266042 262760 260921 260639 260383 259377 258841 260025 262506 265346 268648 272895 277727
57784 277727 282317 286357 290052 293834 298464 304609 311852 318913 325204 331353 337893 344406 350353 355778
57770C55778M859L648J833J4j598l004l825l968m212n074n818n717n419n720n894
57755C15883m824l081k168k203k017j236n58j68N74J781K730K965K643J960J183
57740C13464R23J381J745J329P42Q59J261J047N80Q80J838K467K612K822K925
57725C36875K328J509J628K659L390L265K810K280J349J71n84r15j469k264k651
57710C50381k617k874l627m316m612m646m305l547l179m035n361n477m106k644
57696B95035j997j615j019p50j187j645j454j013j018j333j343r25n07m12m65
57681B78352j51R23K603M409O316Q848J2141J5596J9016K3303K9276L6543M4493
57668D81668N3568O4312P5490Q4126Q6714P9648O0082K8904p308l9438o1608p3200
$$ plain form
57770 355778 360637 364285 366118 366132 364534 361530 357705 353737 349525 344451 338633 332916 327497 321777 315883
57755 315883 311059 307978 305810 303607 301590 300354 299796 299628 300202 301983 304713 307678 310321 312281 313464
57740 313464 314387 315768 317513 318842 319584 320443 321704 322751 323331 324211 326049 328516 331128 333950 336875
57725 336875 339203 340712 342340 344999 348389 351654 354464 356744 358093 358264 357680 356765 355296 353032 350381
57710 350381 347764 344890 341263 336947 332335 327689 323384 319837 316658 312623 307262 301785 297679 295035
57696 295035 293038 291423 290404 289654 288467 286822 285368 284355 283337 282004 280661 279736 279229 278817 278352
57681 278352 278201 279124 281727 286136 292452 301300 313441 329037 348053 371356 400632 437175 481668
57668 481668 535236 599548 675038 759164 845878 925526 985608 1014512 1007204 967766 906158 832958
57656H32958p6214p2893o5810n7655m9723m1859l4302k8196k3825k0024j5992
57645C46465j2362r766p777o029n100n262n465m578k884j457p65o22q68j289j409
57630B80832j042n93l69j03L80O23J61q06j788k606l211l440l300l066k825k331
57614B56516j566r34o86o29n88o38p09n54k57k07m17m06J0L67K27l03q66j185
57596B47175j079o60n23j180k283l014l171l254l499l578l307k871k320j546q00
57581B14090n23o07o47p61j355k086k111j448j056j343j673j645j769k489l437
57566A91140m176m731m968m308k724j164m26k18P2L94M45M19O80J116J392J512
57550A74455J694J932K129K326K500K431J974J238L13p88j779k084j416l0J536
$$ plain form
57656 832958 756744 683851 618041 560386 510663 468804 434502 406306 382481 362457 346465
57645 346465 334103 324337 316560 310531 305431 300169 294704 290126 287242 285785 285020 284398 283530 282241 280832
57630 280832 279790 279197 278828 278725 279105 279728 279889 279083 277295 274689 271478 268038 264738 261672 258847 256516
57614 256516 254950 254016 253330 252701 252113 251475 250766 250212 249955 249748 249331 248925 248935 249302 249529 249226 248360 247175
57596 247175 246096 245436 244913 243733 241450 238436 235265 232011 228512 224934 221627 218756 216436 214890 214090
57581 214090 213567 212960 212313 211552 210197 208111 206000 204552 203496 202153 200480 198835 197066 194577 191140
57566 191140 186964 182233 177265 172957 170233 169069 168643 168425 168497 168891 169336 169755 170435 171551 172943 174455
57550 174455 176149 178081 180210 182536 185036 187467 189441 190679 190992 190204 188425 186341 184925 184895 186431
57535A86431K709K959K257J329R63J056R47M87J12j28o30j367j738j458q43j11
57519A92975P59J383J131J26o60o35j07N31J259J895J970J539J320J635J905J501
57503B08527N18n67j343j424p11J28J55o84j590k154k687l244l345k885k351j892
57487A84451j183m39m32j152j558j153o65o90p43k92K63M06L01J57l01j031j284
57470A74655q15n62j266k266k552k232k011j870j327m85J04L15M45N76O23O42
57454A61974O13K76l71q80j027j124j278j061l95Q2L0J0M52Q77Q43Q49J363J739
57436A62972J115j32q08m38M50J267J781J891J665J408J229R09M81L88O37N69
57420A75384J0k34L12Q42M88l10o21m64l44r1P07J562J615R91N07L45P1k33j01
$$ plain form
57535 186431 189140 192099 194356 195685 196648 197704 198651 199138 199250 199122 198492 197125 195387 193929 193086 192975
57519 192975 193734 195117 196248 196374 195714 195079 194972 195503 196762 198657 200627 202166 203486 205121 207026 208527
57503 208527 209045 208478 207135 205711 205000 205128 205283 204599 203009 200855 198168 194924 191579 188694 186343 184451
57487 184451 183268 182829 182397 181245 179687 178534 177869 177179 176436 176144 176407 176813 177114 177271 176970 175939 174655
57470 174655 173840 173278 172012 169746 167194 164962 162951 161081 159754 159269 159373 159688 160133 160709 161332 161974
57454 161974 162587 162863 162492 161612 160585 159461 158183 157122 156727 156809 156839 156849 157301 158178 159021 159870 161233 162972
57436 162972 164087 163955 163147 162709 163159 164426 166207 168098 169763 171171 172400 173309 173790 174178 174815 175384
57420 175384 175394 175160 175472 176314 176802 176492 175871 175407 175063 174972 175679 177241 178856 179847 180354 180699 180770 180537 180436
57401A80436K09j43j214k033j869j006j18M22N61M69N14Q50J182J289J514K155
57385A83218K736K625K101J976K316K320J500K79o26q22l06N91J264J328R97O86
57369B02183L93j07p13j052r61n77j61l7l64p72o78k38j99n73l12J108K629L022
57351B02591K521K105J921J535J182J462K075K065J192J50m98o74l44L45O82J70
57335B18480n57n67j36k72r35j021k81J46n00j411j413n46K11K39k05n24m33j79
57317B10096j90m18l25K42O05K16l48j12Q52J558J573J390J356J090L00m86m60
57300B16939N28J773K381K074J451J247J370J172O56N45Q89O83l72q63M47K578
57284B33498L629L349L008L145L188L058L387L986L705K284R46O98J205J835K554
$$ plain form
57401 180436 180645 180502 179288 177255 175386 174380 174262 174684 175245 175714 176228 177078 178260 179549 181063 183218
57385 183218 185954 188579 190680 192656 194972 197292 198792 199071 198445 197623 197317 197908 199172 200500 201497 202183
57369 202183 202576 202469 201756 200704 199743 199166 199005 198968 198604 197832 197154 196916 196717 196144 195832 196940 199569 202591
57351 202591 205112 207217 209138 210673 211855 213317 215392 217457 218649 218799 218301 217627 217283 217628 218310 218480
57335 218480 217923 217356 217220 216948 216013 214992 214711 214857 214357 212946 211533 210987 211198 211437 211232 210708 210275 210096
57317 210096 209906 209488 209163 209405 210010 210226 209878 209766 210618 212176 213749 215139 216495 217585 217885 217399 216939
57300 216939 217467 219240 221621 223695 225146 226393 227763 228935 229591 230136 231025 231708 231336 230473 230920 233498
57284 233498 237127 240476 243484 246629 249817 252875 256262 260248 263953 266237 267183 267881 269086 270921 273475
57269B73475L265L404K896K594L098L807L837L151K312J627J122Q14O39N26P07
57254C07274J439K307K488J950J640K119K873L282L520L909M128L758L145L064
57240C46896L654M282M344L917L638M023M897N575N728N772O138O567O650O590
57226D18671O765O874O487O089O562P716Q477Q554Q743R452J0117J0450J1111
57213E26068J2530J4027J4842J5249J5972J7075J8048J8565J8679J8601J8607
57202G08263J8812J8861J8262J7200J6449J6480J7245J8786K1151K3658K5229
57191I20396K5746K6121K6673K6542K5246K3787K3338K3624K3426K2145K0148
57180A187192J8136J6848J6924J8250J9796K0594K0691K0705K0926K1338K2049
$$ plain form
57269 273475 276740 280144 283040 285634 288732 292539 296376 299527 301839 303466 304588 305402 306041 306567 307274
57254 307274 308713 311020 313508 315458 317098 319217 322090 325372 328892 332801 336929 340687 343832 346896
57240 346896 350550 354832 359176 363093 366731 370754 375651 381226 386954 392726 398864 405431 412081 418671
57226 418671 425436 432310 438797 444886 451448 459164 467641 476195 484938 494390 504507 514957 526068
57213 526068 538598 552625 567467 582716 598688 615763 633811 652376 671055 689656 708263
57202 708263 727075 745936 764198 781398 797847 814327 831572 850358 871509 895167 920396
57191 920396 946142 972263 998936 1025478 1050724 1074511 1097849 1121473 1144899 1167044 1187192
57180 1187192 1205328 1222176 1239100 1257350 1277146 1297740 1318431 1339136 1360062 1381400 1403449
57169A403449K3031K3831K4190K4631K5839K7610K9018K9553K9656L0067L0971
57158A701846L1855L2158L2048L2458L4043L6294L8087L9055L9864M1122M2651
57147B101481M4029M5316M6979M9520N3176N7577O1770O5076O7817P0527P2823
57136B736091P4093P5160P7919Q2885Q8268R2027R3839R4585R4993R5598R7027
57125C702485R9383J01855J03771J05521J07835J10675J13596J16703J20646J25883
57115D808353J32505J40419J49363J59105J69914J82318J96306K11546K28711
57106F378540K49737K76397L09542L50321M01200M65064N44174O41000P59596
57097A0375571R05363J083841J300180J558808J862268K209905K597252L015532
$$ plain form
57169 1403449 1426480 1450311 1474501 1499132 1524971 1552581 1581599 1611152 1640808 1670875 1701846
57158 1701846 1733701 1765859 1797907 1830365 1864408 1900702 1938789 1977844 2017708 2058830 2101481
57147 2101481 2145510 2190826 2237805 2287325 2340501 2398078 2459848 2524924 2592741 2663268 2736091
57136 2736091 2810184 2885344 2963263 3046148 3134416 3226443 3320282 3414867 3509860 3605458 3702485
57125 3702485 3801868 3903723 4007494 4113015 4220850 4331525 4445121 4561824 4682470 4808353
57115 4808353 4940858 5081277 5230640 5389745 5559659 5741977 5938283 6149829 6378540
57106 6378540 6628277 6904674 7214216 7564537 7965737 8430801 8974975 9615975 10375571
57097 10375571 11280934 12364775 13664955 15223763 17086031 19295936 21893188 24908720
57089B4908720L450963L885135M296529M661677M955902N154801N234059N163844
57081F1711630M903167M408277L659114K684883J563865L95261p33798j763886
57073G6828513k660389l404632l987894m408549m670480m782398m757978m616057
57065D3540136m380180m077073l733835l374803l019567k682465k372505k093579
57057A7806129j845669j626847j434526j265612j116763r85369q70036p69853
57049G891454o83317o08273n42724m85467m35895l93247l56159l23086k93080
57040C770206k65821k40880k17530j95512j75374j57542j41436j26059j11161
57031B138891r7186q4263p1787n8952m5320l0853j5494J305K0270M0322N6435
$$ plain form
57089 24908720 28359683 32244818 36541347 41203024 46158926 51313727 56547786 61711630
57081 61711630 66614797 71023074 74682188 77367071 78930936 79326197 78592399 76828513
57073 76828513 74168124 70763492 66775598 62367049 57696569 52914171 48156193 43540136
57065 43540136 39159956 35082883 31349048 27974245 24954678 22272213 19899708 17806129
57057 17806129 15960460 14333613 12899087 11633475 10516712 9531343 8661307 7891454
57049 7891454 7208137 6599864 6057140 5571673 5135778 4742531 4386372 4063286 3770206
57040 3770206 3504385 3263505 3045975 2850463 2675089 2517547 2376111 2250052 2138891
57031 2138891 2041705 1957442 1885655 1826703 1781383 1750530 1735036 1736341 1756611 1796933 1853368
57020A853368O0755M7576J7888k0946n9498r0312j09581j17327j16398j10292
57010A355233j01249r0415p9099o8787n9983n2195m5098l9026l4169l0166k6698
56999G28348k3771k1329j9235j7679j6945j6615j5785j4229j2556j1042r052o081
56987E44029k665K68K526M646O961R051R888Q369M030k388r167j4703j8395k0549
56973E21901k1562k1374j9646j6488j2878j0006q154o506m273j625Q63L194N901
56960D09347R254J3096J7142K0834K3016K2417J8597J2081L760n293j3612j9756
56948E10883k3211k4436k4027k2290j9603j6606j3721j0888p988n137k370O36
56936C41242M221Q322J2589J6914K1519K6406L0675L2531L0208K3056J1829j685
$$ plain form
57020 1853368 1914123 1961699 1979587 1958641 1899143 1808831 1699250 1581923 1465525 1355233
57010 1355233 1253984 1163569 1084470 1015683 955700 903505 858407 819381 785212 755046 728348
56999 728348 704577 683248 664013 646334 629389 612774 596989 582760 570204 559162 550110 544029
56987 544029 541364 541632 544158 548804 555765 564816 574704 583073 587103 584715 575548 560845 542450 521901
56973 521901 500339 478965 459319 442831 429953 419947 411793 405287 401014 399389 400252 403446 409347
56960 409347 418601 431697 448839 469673 492689 515106 533703 545784 549544 544251 530639 510883
56948 510883 487672 463236 439209 416919 397316 380710 366989 356101 348113 342976 340606 341242
56936 341242 345463 353785 366374 383288 404807 431213 461888 494419 524627 547683 559512 557827
56924E57827j5046k5641l1797l3781l3214l1351k8382k4407k0230j6662j3822
56913B83494j1574j0053r201q400p269o292o033o139n785m739l406k185j349j060
56899B00009r53k35J239K576L149L623M925O900Q941J1236J4227J7382J9815K1688
56885C14522K3651K5031K3998J9660J2854M889l255j0355j4948j6582j6235j4943
56873C48287j2704r208m986j201J517L742O702J1045J6134K0959K5776L2067M0384
56860D78514M8984N5359N8172N6672M9211L4432J4036p191k4605l6249m2333m3670
56848F41332m1202l6064k9378k2105j5024q372j649N619J3183K0790K9114L9084
56836E95328N0570O2712P4981Q6511R4445R4389Q3000N9794K7298r053m1813o4841
$$ plain form
56924 557827 542781 517140 485343 451562 418348 386997 358615 334208 313978 297316 283494
56913 283494 271920 261867 252666 244266 236997 230705 224672 218533 212748 208009 204603 202418 201069 200009
56899 200009 199056 198821 200060 202636 205785 209408 214333 221233 230174 241410 255637 273019 292834 314522
56885 314522 338173 363204 387202 406862 419716 424605 421350 410995 396047 379465 363230 348287
56873 348287 335583 326375 321389 320188 321705 325447 332149 343194 359328 380287 406063 438130 478514
56860 478514 527498 582857 641029 697701 746912 781344 795380 788189 763584 727335 685002 641332
56848 641332 600130 564066 534688 512583 497559 489187 487538 493157 506340 527130 556244 595328
56836 595328 645898 708610 783591 870102 964547 1058936 1141936 1201730 1229028 1219975 1178162 1113321
56824A113321p6778q0490p9100p3844o5558n5922m6304l6710k6868j7286q464
56813E45997l6Q579J7510K6898L7124M8020N8326O5988O8208O1671M4593J9259
56801A002137q617l3597n2781o4868o9288o7158o1417n4619m7481m0123l3237
56790D68951k7084k0782j3810p145j749L020Q399J4571K1050K7630L3557L6588
56778E43196L4258K5934J2959k372j7289k9056l6440m0195m1370l9992l6220l1596
56766C41817k7752k4696k1622j8658j6436j4581j2240r699q075p586p396o988
56754A66088o521n994n228m560m506m767m520l541k256r55J11K25j020k623k964
56739A16969j787l79J95J21N8K59O65J127J312R88M49J88J84O6j44o2L17N14K26
$$ plain form
56824 1113321 1036543 956053 876953 803109 737551 681629 635325 598615 571747 554461 545997
56813 545997 545961 554540 572050 598948 636072 684092 742418 808406 876614 938285 982878 1002137
56801 1002137 993520 959923 907142 842274 772986 705828 644411 589792 542311 502188 468951
56790 468951 441867 421085 407275 400130 398381 401401 409800 424371 445421 473051 506608 543196
56778 543196 577454 603388 616347 613975 596686 567630 531190 490995 449625 409633 373413 341817
56766 341817 314065 289369 267747 249089 232653 218072 205832 196133 188058 180472 173076 166088
56754 166088 159567 153573 148345 143785 139279 134512 129992 126451 124195 123240 123351 123576 122556 119933 116969
56739 116969 115182 114803 114998 115119 115177 115436 116101 117228 118540 119528 119977 120165 120349 120415 120271 120209 120526 121040 121266
56720A21266l46p34n06M81J711K243J758J014Q68J212J440J422J416J442J406
56705A36093J512J837J911J393P86P05Q36M11n00j086r80n74k49kK07L76O09Q77
56687A44162Q31L63L8L79J061J432J441J352R90J11p48p60m8L98J9p54j234j130
56669A47903n06L03P93P52N50O05P75P55O42O35N30J37j40J89R01J361J375J189
56651A58749R64P72Q02R96Q84L23m1L42J053J321J092P58M10ok37k04l83r51j223
56632A65421p20j37k47n70l02Q8m48j644k167j597q05l84o4K15o3r75j767j825
56614A52009j305o60k36l14q91j359j134n02k06l65m53k06J91O12R39Q13J52m80
56596A46605p01r49j464j345J59J984K383J394O86J124J926K259K236K085J694
$$ plain form
56720 121266 120920 120186 119680 120161 121872 124115 125873 126887 127755 128967 130407 131829 133245 134687 136093
56705 136093 137605 139442 141353 142746 143532 144237 145073 145484 144984 143898 142918 142344 142095 142093 142300 142676 143285 144162
56687 144162 144993 145356 145394 145773 146834 148266 149707 151059 152049 152160 151412 150652 150604 151002 151021 150267 149033 147903
56669 147903 147397 147700 148493 149245 149795 150400 151175 151930 152572 153207 153737 153874 153734 153923 154824 156185 157560 158749
56651 158749 159713 160485 161287 162283 163167 163490 163449 163791 164844 166165 167257 168015 168425 168419 168182 167978 167595 166644 165421
56632 165421 164701 164564 164317 163747 163445 163533 163085 161441 159274 157677 156872 156488 156424 156639 156576 155601 153834 152009
56614 152009 150704 150044 149808 149494 148603 147244 146110 145608 145402 145037 144584 144378 144569 145181 146120 146933 147085 146605
56596 146605 145904 144955 143491 142146 142305 144289 146672 148066 148752 149876 151802 154061 156297 158382 160076
56581A60076J267J311J676J690J320J213J445J394R95R60J475J820J608J449K037
56566A81736L393N195P115Q647R455R994J1031J2675J4570J6688J8772J9389J7056
56553C35716J2357P654M528K795J976K091K727K824K018J037L48m28j456k273
56539C71914k819l645m746n397n587o185p317p940p632p364p791q128p639o965
56525B82759o970p299p114o443n775n126m329l627l229k873k473k495l122l716
56511B18168l702l335k991k522j858j498j743k110k080j840j734j614j226p24
56497A89191l68k41m94j195j834j749j132p08m06M32J478J476L17n48l25K1k82
56480A83633l77N61J637J650J063J055J508J420P79N37J015J611J914K055K069
$$ plain form
56581 160076 161343 162654 164330 166020 167340 168553 169998 171392 172387 173347 174822 176642 178250 179699 181736
56566 181736 185129 190324 197439 206086 215541 225535 236566 249241 263811 280499 299271 318660 335716
56553 335716 348073 355727 360255 363050 365026 367117 369844 372668 374686 375723 376071 375643 374187 371914
56539 371914 369095 365450 360704 355307 349720 343535 336218 328278 320646 313282 305491 297363 289724 282759
56525 282759 275789 268490 261376 254933 249158 244032 239703 236076 232847 229974 227501 225006 221884 218168
56511 218168 214466 211131 208140 205618 203760 202262 200519 198409 196329 194489 192755 191141 189915 189191
56497 189191 188823 188582 188088 186893 185059 183310 182178 181470 181064 181496 182974 184450 184767 184219 183894 183915 183633
56480 183633 183256 183817 185454 187104 188167 189222 190730 192150 192929 193466 194481 196092 198006 200061 202130
56465B02130J793J303P75J19o34r68n41J36L02p2m41m68j37M81J053J066N19J20
56447B06536L76R61J387J650J827J720J419J480J995K145J367K37m14o00p52q34
56431B20500o79n84q47j152j102r06r47j108j093r86r52q53o35o12r25j212j155
56414B04752p80j6J304K627K856J817P04M78P26O37K44o1l38o59o42j48K07ok96
56395B13406r5L85Q03J333J986K016R71m00r50m03P94K131L000K797J736Q56O48
56378B31014N27Q9j30K59P52R65J266J652J292J50l11P78K064J866O43Q9O08J254
56360B44827J553J847K152K061J642J414J557J909K366K686K441J773J428J495
56346B71151J027k90j269r89j83J74M90J394K162J886J301J808L317M596N137
$$ plain form
56465 202130 203923 205226 206001 206120 205486 204518 203977 204113 204415 204343 203902 203434 203297 203778 204831 205897 206416 206536
56447 206536 206912 207873 209260 210910 212737 214457 215876 217356 219351 221496 222863 223100 222686 222086 221334 220500
56431 220500 219821 219237 218390 217238 216136 215230 214283 213175 212082 211096 210144 209291 208656 208044 207119 205907 204752
56414 204752 203972 203956 205260 207887 210743 212560 213264 213742 214468 215105 215349 215288 214950 214291 213649 213501 213708 213702 213406
56395 213406 213311 213696 214499 215832 217818 219834 220805 220405 219455 219052 219846 221977 224977 227774 229510 230366 231014
56378 231014 231541 231630 231500 231759 232511 233476 234742 236394 237686 237836 237525 238303 240367 242233 242876 242965 243573 244827
56360 244827 246380 248227 250379 252440 254082 255496 257053 258962 261328 264014 266455 268228 269656 271151
56346 271151 272178 271888 270619 269630 269447 269621 270111 271505 273667 275553 276854 278662 281979 286575 291712
56331B91712N174M628L500K744L174L997L953L383L535M310M406L405K161J230
56317C41312M40q6J15Q19J217R92M11k85o83L2J983L780M079L395L233L940M795
56300C69489N573O632P757Q347Q386Q083P084N314L932M002M844N110M913N299
56286D54765O199O654O623O920P652Q322R112J0482J1879J2440J2601J3408J4664
56273E81721J5439J5952J7113J8704J9814K0777K2647K5061K6688K7663K9536
56262H21115L2795L6417L9905M3889M8599N3685N9670O7639P7268Q7100R6993
56251A465075J08377J21807J36093J50269J64571J79030J92763K05123K16008
56242B939116K24630K29541K30158K26747K18743K04715J84233J58158J26955
$$ plain form
56331 291712 296886 301514 305014 307758 310932 314929 318882 322265 325800 330110 334516 337921 340082 341312
56317 341312 341752 341666 341781 342600 343817 344809 345220 344935 344252 344284 346267 350047 354126 357521 360754 364694 369489
56300 369489 375062 381694 389451 397798 406184 414267 421351 426665 430597 434599 439443 444553 449466 454765
56286 454765 460964 467618 474241 481161 488813 497135 506247 516729 528608 541048 553649 567057 581721
56273 581721 597160 613112 630225 648929 668743 689520 712167 737228 763916 791579 821115
56262 821115 853910 890327 930232 974121 1022720 1076405 1136075 1203714 1280982 1368082 1465075
56251 1465075 1573452 1695259 1831352 1981621 2146192 2325222 2517985 2723108 2939116
56242 2939116 3163746 3393287 3623445 3850192 4068935 4273650 4457883 4616041 4742996
56233D742996R0634N0652R995k9174o6303j00540j30066j54000j73207j88386
56223D052601j98823k03931k04593k02176j97380j90651j82621j73527j63233
56214B335666j52179j41267j30731j20249j10197j01362r3391q5111p6537o9049
56204A255593o3265n8301n3350m8512m3832l9084l4751l1741k9818k7743k5069
56193H00127k2398j9933j7366j5187j4220j3855j2602j0521r101q648p912o528
56181F41856n608n472n019l948l422l785l728k531j206n69n6P44J197J160J548
56166F11161K549K984K361J835K310L174L781M565N854P124Q147R412J0843J1650
56152F87750J1970J3014J5129J7383J9513K2359K5992K9392L2688L7678M5339
$$ plain form
56233 4742996 4833630 4884282 4894277 4865103 4798800 4698260 4568194 4414194 4240987 4052601
56223 4052601 3853778 3649847 3445254 3243078 3045698 2855047 2672426 2498899 2335666
56214 2335666 2183487 2042220 1911489 1791240 1681043 1579681 1486290 1401179 1324642 1255593
56204 1255593 1192328 1134027 1080677 1032165 988333 949249 914498 882757 852939 825196 800127
56193 800127 777729 757796 740430 725243 711023 697168 684566 674045 664944 656296 648384 641856
56181 641856 636248 630776 625757 621809 618387 614602 610874 608343 607137 606568 606512 607256 608453 609613 611161
56166 611161 613710 616694 619055 620890 623200 626374 630155 634720 640574 647698 655845 665257 676100 687750
56152 687750 699720 712734 727863 745246 764759 787118 813110 842502 875190 912868 958207
56141I58207N4643O4403P4336Q3670R0736R4692R5810R3535Q6590P5691O4006
56130A836319N4037M6033M0027L6777L5550L3381K8095K0322J1587K440o466j3542
56118B124560j8043k1253k5091l0939m0010n2642o6493p7660q4368q7662q8249
56107A532150q5313p8969p1096o2759n3455m3682l5502k9511k4087j8582j4393
56096A014801j1853r151n667l203k530j793M5J392J278J362K788M122M338M874
56082A000803O661Q080P982P862Q988J0130J0280J0723J2215J3042J2216J1700
56070A120682J3028J4519J4379J3887J4845J6459J7293J7926J9183K0125K0059
56059A302385K0187K1157K1468K0349J9508J9986K0130J8774J7372J6983J6313
$$ plain form
56141 958207 1012850 1077253 1151589 1235259 1325995 1420687 1516497 1610032 1696622 1772313 1836319
56130 1836319 1890356 1936389 1976416 2013193 2048743 2082124 2110219 2130541 2142128 2144568 2138102 2124560
56118 2124560 2106517 2085264 2060173 2029234 1989224 1936582 1870089 1792429 1708061 1620399 1532150
56107 1532150 1446837 1367868 1296772 1234013 1180558 1136876 1101374 1071863 1047776 1029194 1014801
56096 1014801 1002948 993797 988130 984927 982397 980604 980649 982041 983319 984681 987469 991591 995929 1000803
56082 1000803 1007464 1015544 1023526 1031388 1040376 1050506 1060786 1071509 1083724 1096766 1108982 1120682
56070 1120682 1133710 1148229 1162608 1176495 1191340 1207799 1225092 1243018 1262201 1282326 1302385
56059 1302385 1322572 1343729 1365197 1385546 1405054 1425040 1445170 1463944 1481316 1498299 1514612
56048A514612J4957J5092J7627K0025K0451K0586K1910K2990K3067K4369K7930
56037A743616L1027L1888L2829L5535L7451L6497L5230L6449L8650L9705M1004
56026B139881M3817M5714M4855M4045M6150M9302N0900N2392N5669N8867O0295
56015B691887O2379O7021P1285P2575P3760P8179Q3856Q7835R1651R7285J02299
56004C580012J04608J07397J13636J20487J24894J29616J37752J46576J53187
55995D718165J60698J72133J83980J92846K02576K17258K33387K46861K61278
55986F589182K80964L02370L21417L42363L69877L99555M26496M56015M94823
55977I983062N39176N83332O31981O91849P59091Q28362R06108J000834J109061
$$ plain form
56048 1514612 1529569 1544661 1562288 1582313 1602764 1623350 1645260 1668250 1691317 1715686 1743616
56037 1743616 1774643 1806531 1839360 1874895 1912346 1948843 1984073 2020522 2059172 2098877 2139881
56026 2139881 2183698 2229412 2274267 2318312 2364462 2413764 2464664 2517056 2572725 2631592 2691887
56015 2691887 2754266 2821287 2892572 2965147 3038907 3117086 3200942 3288777 3380428 3477713 3580012
56004 3580012 3684620 3792017 3905653 4026140 4151034 4280650 4418402 4564978 4718165
55995 4718165 4878863 5050996 5234976 5427822 5630398 5847656 6081043 6327904 6589182
55986 6589182 6870146 7172516 7493933 7836296 8206173 8605728 9032224 9488239 9983062
55977 9983062 10522238 11105570 11737551 12429400 13188491 14016853 14922961 15923795 17032856
55968A7032856J226001J360703J524541J715160J929931K184472K498810K878026
55960C2350500L328986L883277M580525N446348O516120P862067R561785J1658135
55952H5187743J4186306J7210731K0783002K4889526K9465248L4291866L8590555
55945B64604977M0663821L8320453L0193014J6947769J232859j3642319k5186080
55938C53134494l2375351l5438765l5303391l3094893k9795519k6092553k2410576
55931A38623446j9009632j6029730j3499340j1379055r620347q177828o992621
55924E3914893o002984n170278m473819l887798l384003k949746k582355k270472
55916B3193438j997819j759626j558386j387957j237093j104048r92816q99040
$$ plain form
55968 17032856 18258857 19619560 21144101 22859261 24789192 26973664 29472474 32350500
55960 32350500 35679486 39562763 44143288 49589636 56105756 63967823 73529608 85187743
55952 85187743 99374049 116584780 137367782 162257308 191722556 226014422 264604977
55945 264604977 305268798 343589251 373782265 390730034 391962893 378320574 353134494
55938 353134494 320759143 285320378 250016987 216922094 187126575 161034022 138623446
55931 138623446 119613814 103584084 90084744 78705689 69085342 60907514 53914893
55924 53914893 47911909 42741631 38267812 34380014 30996011 28046265 25463910 23193438
55916 23193438 21195619 19435993 17877607 16489650 15252557 14148509 13155693 12256653
55908A2256653q13336p34878o68532o12169n59244n10476m70791m37665m04170
55899G045392l70853l43438l21158k98206k74532k54854k38773k21878k04933
55890D516767j92319j82790j71119j57631j47102j39303j29528j17596j07817
55881C171562j00451r1585q1303p4186p1598p0674p0762p3782p8181p9566p7605
55870B301869p6008p5536p3265o8919o5614o3909o0929n5959n1500m8296m4498
55859A617436m0180l7729l7283l6443l4756l4033l4153l2993l0685k9555k9779
55848A239847k9297k7982k7650k8052k7052k4788k3542k3510k2709k1069k0490
55837I63706k0902k0186j8146j6785j6510j5787j4469j3957j4069j3263j1762
$$ plain form
55908 12256653 11443317 10708439 10039907 9427738 8868494 8358018 7887227 7449562 7045392
55899 7045392 6674539 6331101 6009943 5711737 5437205 5182351 4943578 4721700 4516767
55890 4516767 4324448 4141658 3970539 3812908 3665806 3526503 3396975 3279379 3171562
55881 3171562 3071111 2979526 2898223 2824037 2752439 2681765 2611003 2537221 2459040 2379474 2301869
55870 2301869 2225861 2150325 2077060 2008141 1942527 1878618 1817689 1761730 1710230 1661934 1617436
55859 1617436 1577256 1539527 1502244 1465801 1431045 1397012 1362859 1329866 1299181 1269626 1239847
55848 1239847 1210550 1182568 1154918 1126866 1099814 1075026 1051484 1027974 1005265 984196 963706
55837 963706 942804 922618 904472 887687 871177 855390 840921 826964 812895 799632 787870
55826G87870j1055j0674r104p354p844j0056j1173j0752j0815j1609j1368j0218
55814F65848j0162j1016j0419q186o656o366n339l233k124k429j945P4J546J405
55800F00998J371K667M077M464M361M028K614J78k009l807o250q866r774q925
55786E85127q334q522p736n446l573l395m078n102p231j0028j1188r669p014m555
55772D89256j666K234O433J0570J5092J8962J9281J4526O313k790j1147j7265
55760E49799j9674j8851j7194j6101j4921j3336j2406j2338j1610r492p402o589
55748C89885o454o183o139o543o566n842n165m836m010k546j652j797j785r20
55734C29447l18j041k478l548m043m058l526l085l765n192n701m872m188m528
$$ plain form
55826 787870 776815 766141 757037 749683 741839 731783 720610 709858 699043 687434 676066 665848
55814 665848 655686 644670 634251 626065 619409 613043 607704 604471 602347 599918 597973 598047 599593 600998
55800 600998 602369 605036 609113 613577 617938 621966 624580 624758 622749 618942 612692 603826 594052 585127
55786 585127 576793 568271 560535 555089 551516 548121 544043 538941 531710 521682 510494 500825 493811 489256
55772 489256 487590 489824 496257 506827 521919 540881 560162 574688 581001 578211 567064 549799
55760 549799 530125 511274 494080 477979 463058 449722 437316 424978 413368 403876 396474 389885
55748 389885 383431 377248 371109 364566 358000 352158 346993 342157 338147 335601 333949 332152 330367 329447
55734 329447 329129 328088 325610 322062 318019 313961 310435 307350 303585 298393 292692 287820 283632 279104
55720B79104m898m429l766l471k843j361J99J127J817K645L336M082N619P410
55706B84571P510N192K109p0j591l254m851o054p327q792r499q838p434n901m037
55691B31734k089j192j623k068j584q56n73j56Q28J572J602J994L649N565O265
55676B43068N782M969L843K036R4j055j387j499j598j589j593j643j438r89q18
55661B46183j040j002l41M14P09O88P34J038J800K925L460K544R11J18K27j95
55645B59173j647l047l759m425n192n120m060l347l657m014l812m079n516o989
55631B00509p169o241m907l213j494q63j479j790q22K45R5o44q07o77r89j214
55615A68540o74j89q51k008k218j507j104j450j965k288k442k198j468q44q35
$$ plain form
55720 279104 274206 269777 266011 262540 259697 258336 258535 259662 261479 264124 267460 271542 277161 284571
55706 284571 292081 297273 299382 299312 297721 294467 289616 283562 276235 267443 257944 249106 241672 235771 231734
55691 231734 229645 228453 226830 224762 223178 222322 221749 221593 222421 223993 225595 227589 231238 236803 243068
55676 243068 248850 253819 257662 259698 259792 258737 257350 255851 254253 252664 251071 249428 247990 247001 246183
55661 246183 245143 244141 243800 244214 244923 245611 246345 247383 249183 252108 255568 258112 259023 259141 259368 259173
55645 259173 257526 254479 250720 246295 241103 235983 231923 228576 224919 220905 217093 213014 207498 200509
55631 200509 193340 187099 182192 178979 177485 176622 175143 173353 172531 172776 172871 172227 171420 170743 169754 168540
55615 168540 167866 167677 166826 164818 162600 161093 159989 158539 156574 154286 151844 149646 148178 147334 146499
55600A46499j119j337j763k370k220r35K87K77m09o27m78o91j073j059r95j492
55584A30495k067j847j047m70j08N84J502K169K607K868K458J379Q91J946L609
55569A44969M403M440M731N121M656L454K517J901P89p69j769j972k255l084l910
55554A63222m252m270m040l261j923n45L83O91L93k48o76o39m20j59M71J361J657
55537A47745J075O02R19J172N01k16K48J123N80j383k790k470j317o41p37j442
55521A42969k659l847m015k933j564r34j107j573j990k347k753l219l403k740
55507A07885j217K57P21J79o73j275j365p75K37R16Q23L23j96r08j763j933r55
55490A00281L02O98L09r1l09n22m34J85P20N73K32L94O12J50m31nJ168J689J058
$$ plain form
55600 146499 145380 144043 142280 139910 137690 136755 137042 137319 136910 136283 135805 135114 134041 132982 131987 130495
55584 130495 128428 126581 125534 125064 124956 125540 127042 129211 131818 134686 137144 138523 139414 141360 144969
55569 144969 149372 153812 158543 163664 168320 171774 174291 176192 176981 176212 174443 172471 170216 167132 163222
55554 163222 158970 154700 150660 147399 145476 144931 145314 146005 146398 146150 145474 144835 144415 144256 144727 146088 147745
55537 147745 148820 149422 150341 151513 152014 151798 152046 153169 153749 152366 149576 147106 145789 145148 144411 142969
55521 142969 140310 136463 132448 129515 127951 127017 125910 124337 122347 120000 117247 114028 110625 107885
55507 107885 106668 106925 107646 107825 107152 105877 104512 103737 103974 104890 105713 106036 105840 104932 103169 101236 100281
55490 100281 100583 101281 101590 101499 101190 100668 100234 100419 101139 101712 101944 102338 102950 103100 102669 102664 103832 105521 106579
55471A06579O1p71j580k139j817q09k25o07j309j499r95j34M06j07j474k183j089
55454I0308Q41J674J083M20M39N14K41K44R18J650J765J302N14m52j118q84K4
55437I9483O59O43M71M06N1p31j359j365r01k26N63J113R88L36k90q00j445j875
55419I5721j402k74M18K95J87P38J569K115K383K383J719K49j431k535k731k086
55403I7318j003l07o11j490j889j480q56m03J15P55J062Q23M30K76L69O14Q14
55386I4537M84n05j309j035j79K7m19l07P31J543J320P13N23N02K37J02M33O43
55368I8041Q1q17j144p89m05m35p65j012p90lQ24R67M21p4q0R7K25N38J004J005
55348I6889K34o99j124j121j012o90k5N82O80M45L99O88J034J108P06j70j059
$$ plain form
55471 106579 106640 105869 104289 102150 100333 99524 99299 98692 97383 95884 94889 94755 95161 95054 93580 91397 90308
55454 90308 91149 92823 93906 94326 94765 95279 95520 95764 96682 98332 100097 101399 101913 101461 100343 99459 99483
55437 99483 100142 100785 101256 101662 101713 100982 99623 98258 97357 97131 97694 98807 99795 100131 99841 99041 97596 95721
55419 95721 94319 94045 94463 94758 94945 95683 97252 99367 101750 104133 105852 106101 104670 102135 99404 97318
55403 97318 96315 96008 95397 93907 92018 90538 89682 89279 89394 90149 91211 92034 92464 92740 93109 93723 94537
55386 94537 95021 94516 93207 92172 91993 92020 91601 91294 92025 93568 94888 95601 96124 96626 96863 96965 97398 98041
55368 98041 98122 97305 96161 95372 94967 94532 93767 92755 91965 91962 92786 93753 94174 94100 94020 94117 94342 94880 95884 96889
55348 96889 97123 96424 95300 94179 93167 92477 92452 93034 93714 94159 94558 95246 96280 97388 98094 97924 96865
55331I6865j313q12j66M0j55l30j85L08R50J339J217P77L08k81j125j856j985
55314I3596j683j420j078k93M75L29n62j013n12J80M18N46R18J141R01O15O16
55297I3174N07k0m28j04O94J275J400J220Q33L63J02J11P4j81m64p01j046j363
55279I5446j214o09j16j8o5k05p00j244r56K81J373J384O58M8j52q0J78L96K00
55260I4605k60l73j0K71L03N79J051Q92m0o39k39K87L7m09j15N42O21K80L95R79
55240I8757J208P59Q1l93m78o7M72K38r80k008j766q98p39j232j154j56P85R62
55222I3391O89L67q2o08q06n37q2M22R70J166O37o2P9R73J381O34m75r55q59p21
55202I5522n47j37J98M0k99q8O96J261J046L29l61r00j315j344q15k17j96m95
$$ plain form
55331 96865 95552 94740 94574 94614 94459 94129 93944 94252 95202 96541 97758 98535 98843 98562 97437 95581 93596
55314 93596 91913 90493 89415 89122 89597 89926 89364 88351 87839 88019 88437 88983 89901 91042 91943 92558 93174
55297 93174 93681 93661 93233 93129 93823 95098 96498 97718 98551 98914 99016 99127 99201 99020 98556 97855 96809 95446
55279 95446 94232 93623 93507 93489 93424 93219 92519 91275 90319 90600 91973 93357 94015 94063 93911 93831 94009 94405 94605
55260 94605 94345 93972 93962 94233 94536 95115 96166 97058 97018 96379 96140 96427 96464 96055 95940 96482 97103 97383 97778 98757
55240 98757 99965 100724 100805 100412 99934 99867 100339 100577 99597 97589 95823 94925 94186 92954 91800 91644 92429 93391
55222 93391 94080 94447 94365 93757 92951 92414 92332 92754 93724 94890 95527 95465 95544 96517 97898 98532 98057 97102 96243 95522
55202 95522 94975 94838 95036 95076 94777 94689 95385 96646 97692 98021 97660 96760 95445 94101 93286 93069 92873 92378
55184I2378j61R57J741J365N04K33L72Q0m64l19M49P31K65R0O92J081N13j93K5
55165A00339P82R25K76m37p64q57r15j014j128r29m9J047J306O54L28J013J695
55148A02272J278L00j41j06k52l64L5L57k13j031q60l1K7p87j082l50L03J65k7
55129I9493K76L32m20j093o86K54M39k52p47m11K94P42R28J183J484J435P78j97
55111A03832q41p45n4P97J469J786J711J451J230R50L87j09J57J044J387N42o50
55094A14344j068p48k85L63J365J978J394K56rP04J125O23o1k81l36n18m84r6
55076A18266J62O7J15N69R09P20L99L89M18L2o18j089j305j458j580j573j385
55059A13038r84m30p6k75q39j200j121p68k23M81Q96N66j40l91j94l38r81j266
$$ plain form
55184 92378 92217 93174 94915 96280 96784 97017 97389 97469 97005 96686 97135 97866 98131 98221 98913 99994 100507 100314 100339
55165 100339 101121 102046 102322 101885 101121 100264 99349 98335 97207 96278 96229 97276 98582 99236 99564 100577 102272
55148 102272 103550 103850 103709 103603 103351 102987 103022 103379 103166 102135 101275 101244 101271 100484 99402 99052 99355 99520 99493
55129 99493 99769 100101 99681 98588 97902 98156 98595 98343 97596 97185 97479 98221 99149 100332 101816 103251 104029 103832
55111 103832 102991 102246 102192 102989 104458 106244 107955 109406 110636 111586 111973 111864 112021 113065 114452 114994 114344
55094 114344 113276 112528 112243 112606 113971 115949 117343 117599 117590 118294 119419 120042 119981 119700 119364 118846 118362 118266
55076 118266 118428 118495 118610 119179 120088 120808 121207 121596 122014 122046 121428 120339 119034 117576 115996 114423 113038
55059 113038 112054 111624 111548 111273 110434 109234 108113 107345 107122 107603 108499 109065 108925 108534 108340 108002 107021 105755
55041A05755o87J04L42J83J06J15O8J78N83R81J150J290J371Q12n89j975k330
55024A07457j646o33K08P31Q09N37L65M59L23l92j062p87L36J278J348P63J11
55007A10205k33j62J92N10O07P14J139J732J935J402M17l03j63P58J637J664Q94
54990A22945J23j09pL0m1r4j38j75j08k9k73q60j333j337j006n47N4O60Q24M22
54970A19001K3J54N73O94L63j58o30q29m54L93R99Q30K96J29L26L18L0k4L07M85
54950A22826J36l99n93m26k39k12k88l82m49m48m22m98o19m56J71R27J292J240
54932A21161J247J495J508R31L47P26K055L245L519L303L366L782M285N062O413
54917A62445P872Q563Q253P436O417N067L452J872K92j639l791n508o433o746
$$ plain form
55041 105755 105068 105172 105514 105697 105803 105918 105986 106164 106747 107728 108878 110168 111539 112351 111762 109787 107457
55024 107457 105811 105178 105386 106117 106926 107463 107828 108287 108610 108218 107156 106369 106705 107983 109331 110094 110205
55007 110205 109972 109810 110002 110512 111119 111833 112972 114704 116639 118041 118458 118155 117992 118750 120387 122051 122945
54990 122945 123068 122959 122952 122982 122941 122847 122709 122534 122426 122397 122124 121264 119931 118594 117588 117041 117095 117755 118579 119001
54970 119001 119024 119178 119751 120445 120808 120650 120020 119191 118737 119130 120129 120959 121255 121384 121710 122028 122058 122034 122341 122826
54950 122826 122962 122563 121970 121544 121305 121093 120805 120423 119974 119526 119104 118606 117987 117531 117702 118629 119921 121161
54932 121161 122408 123903 125411 126342 126689 127415 129470 132715 136234 139537 142903 146685 150970 156032 162445
54917 162445 170317 178880 187133 194569 200986 206053 209505 211377 211669 210030 206239 200731 194298 187552
54903A87552o556n810m922m625m932n014m406l606l100k592j673o21RP9k27o67
54887A38889p76r6J080J803J749J690K289L144L612L845M312M908N347N859O794
54872A84449P883Q572Q633P854N725K211j616m564o528p991q840q606p565o540
54858A73077n845n246m720m375l874k922k119k309l153l457k903k373k468k705
54844A24608k494j924j244l95M89Q91O26J86j2j56m87p76p09k94L12R41J201P15
54826A21478k14q14r10j058j427j387p08k53p53j564j583q20j76O2M49J180J647
54809A13149J451J085J212J722J948J534P53J34jK98P10R06P52L08k29n62l88
54792A24782K98R84J036L83l28l87K00P69P48K43k02k90j49R6O47J615K572K836
$$ plain form
54903 187552 180996 175186 170264 165639 160707 155693 151287 147681 144581 141989 140316 139695 139704 139783 139556 138889
54887 138889 138113 138017 139097 140900 142649 144339 146628 149772 153384 157229 161541 166449 171796 177655 184449
54872 184449 192332 200904 209537 217391 223116 225327 223711 219147 212619 204628 195788 187182 179617 173077
54858 173077 167232 161986 157266 152891 149017 146095 143976 141667 138514 135057 132154 129781 127313 124608
54844 124608 122114 120190 118946 118551 119040 119931 120557 120743 120731 120575 120088 119312 118603 118309 118621 119562 120763 121478
54826 121478 121264 120450 119540 118482 117055 115668 114960 114707 113954 112390 110807 109987 109811 109873 110322 111502 113149
54809 113149 114600 115685 116897 118619 120567 122101 122854 122988 122987 123285 123995 124901 125653 125961 125732 125170 124782
54792 124782 125080 126064 127100 127483 127155 126768 126968 127737 128485 128728 128526 128236 128087 128183 128830 130445 133017 135853
54774A35853K300J592J318J476J783K190K760L328L757M399N751P592Q985R312
54760A92396Q900Q318P464N855L509R89j376l678n763p019p157o759o624o895
54746A82160p144p038o443n215l444j828j155j369j616j303o57k02j36m07q96
54731A43307j301j212n55L05J084J835K600L204L634M257N318O540P477Q003Q147
54716A92643P767O674M931K773M61j701l453m846o052o844o718n869n314n632
54702A68820o054n530m210l169k860k682k064j246q25j029j650k238k263j459
54688A31541k45N02K98m87j104j214j056r97j087j090q93p27p96r58j012j110
54672A19565j420j502p14O70J529J297N85O2m31j057j169k80Q39J061M79P3J06
$$ plain form
54774 135853 138153 139745 141063 142539 144322 146512 149272 152600 156357 160756 166507 174099 183084 192396
54760 192396 201296 209614 217078 222933 226442 227431 226055 222377 216614 209595 202438 195679 189055 182160
54746 182160 175016 167978 161535 156320 152876 151048 149893 148524 146908 145605 144948 144746 144610 144203 143307
54731 143307 142006 140794 140239 140544 141628 143463 146063 149267 152901 157158 162476 169016 176493 184496 192643
54716 192643 200410 207084 212015 214788 215249 213548 210095 205249 199197 192353 185635 179766 174452 168820
54702 168820 162766 157236 153026 149857 146997 144315 142251 141005 140180 139151 137501 135263 133000 131541
54688 131541 131296 131798 132096 131609 130505 129291 128235 127238 126151 125061 124168 123441 122645 121687 120675 119565
54672 119565 118145 116643 115929 116599 118128 119425 120010 120072 119641 118584 117415 117135 117974 119035 119514 119587 119693
54655A19693J7k84j87M35R07Q42O58P02P24N36M47O85R71R71O95K48k90n98l56
54636A26816J74L77K17K01L60J09o71j269j190p79m15QM42L64l33r39j014j025
54618A21433j272j077M1J228J388Q56P14R25M90o57j267n89N63J039P81M93N12
54601A25601O22O10M84L05R3j30l20l97k65j2j1m80j029r51m1J123J744J456M65
54582A28867o63j350j437j248j091q00j32O12Q22L96j37l76m30m48k57K46P40
54565A23314Q33O12N02P06R46P67M9p25q50j56O71Q12L04r1M0L10K79J29L18Q67
54545A29637J367J509J309J000Q92J121J399J239O46K35L35M41j5o87p63j87K62
54528A39740R2l62o46p28o83m30j58l14q08q06Q6R78P65l32j142j205j099j113
$$ plain form
54655 119693 119710 119426 119239 119674 120581 121423 122081 122783 123507 124043 124490 125175 126146 127117 127812 128060 127770 127172 126816
54636 126816 126990 127367 127584 127785 128145 128254 127583 126314 125124 124345 123930 123938 124380 124744 124411 123472 122458 121433
54618 121433 120161 119084 119125 120353 121741 122597 123311 124236 124726 124069 122802 122213 122776 123815 124596 125089 125601
54601 125601 126223 126833 127317 127622 127715 127585 127265 126868 126603 126591 126580 126100 125071 124120 124079 125202 126946 128402 128867
54582 128867 128204 126854 125417 124169 123078 122278 122146 122758 123580 123976 123839 123463 123033 122585 122328 122574 123314
54565 123314 124147 124759 125261 125967 126913 127680 127729 127004 126154 125998 126669 127481 127785 127694 127734 128044 128323 128452 128770 129637
54545 129637 131004 132513 133822 134822 135714 136835 138234 139473 140119 140354 140689 141130 141115 140428 139665 139478 139740
54528 139740 139832 139470 138824 138096 137413 136983 136825 136511 135703 134897 134983 135961 136726 136394 135252 134047 132948 131835
54510A31835p07L17J108Q69L5m32m31n26p05l33N94J103O05j86k11M82R18O16
54492A34951Q5o4N1L4j28k12l35p65j220r66J76J438K016J955J743J407P49J41
54474A41056K61R41J180N85L6L51J003R02P2l83J47J055J426J031J97o89j282
54457A47889j265o43J82Q33J261J548J602J255M45p19j901k523k163j094j35K03
54441A44775J28J0k41q70j622j860j392p25m14l92k23K13N65N18K40J38L67P62
54423A39977J139J456J648J594J329J078R42Q20O86O85P54M86k83j015j013k77
54407A50006N68J075J311J403J218N90l53j185j364o29N86J348J212Q18J039J724
54391A59367J935J335O36M56M38o3r30j405j019j6R77J422J180N80Q3k24n87j013
$$ plain form
54510 131835 131128 131445 132553 133422 133457 133025 132594 132068 131363 131030 131624 132727 133332 133146 132935 133417 134335 134951
54492 134951 135036 134972 135023 135057 134929 134717 134382 133617 132397 131431 131607 133045 135061 137016 138759 140166 140915 141056
54474 141056 141317 142258 143438 144023 144059 144410 145413 146315 146387 146004 146151 147206 148632 149663 149860 149171 147889
54457 147889 146624 145981 146163 146996 148257 149805 151407 152662 153107 152388 150487 147964 145801 144707 144572 144775
54441 144775 144903 144913 144672 143802 142180 140320 138928 138203 137789 137397 137174 137387 137952 138470 138710 138848 139215 139977
54423 139977 141116 142572 144220 145814 147143 148221 149163 149983 150669 151354 152108 152594 152311 151296 150283 150006
54407 150006 150574 151649 152960 154363 155581 156171 155818 154633 153269 152640 153226 154574 155786 156604 157643 159367
54391 159367 161302 162637 163273 163729 164167 164104 163174 161769 160750 160734 161711 163133 164313 164893 164976 164752 164165 163152
54373A63152j058m17N69J222J173O00L3P1R47K167K866K750K480K836L812M758
54357A87961N193N152M844M353L602K493J049m87j840k945l808m220l973l461
54343A93913l455m066m399l686k355j511j612k197k643k690k314j631r71o08m55
54328A59320l12l32p30j220j241q30o44r29j022k47J081J994J978J367P29K98
54312A59260K2r3P8N98J225J447Q33m57j631j921j340o27m13o47r05r81r03n57
54294A52988K19J101J314N76l08l01N60J193Q57R2j25K70L69l99j381j484o42
54277A54899L6k25p24k27J160J950J284R4l50k06n23j336j567p39L45R14J172
54260A55957J472J453P57q8k67K52R07J483K097K417J799K83j125j470q27p0J15
$$ plain form
54373 163152 162094 161677 162246 163468 164641 165241 165274 165345 166292 168459 171325 174075 176555 179391 183203 187961
54357 187961 193154 198306 203150 207503 211105 213598 214647 214160 212320 209375 205567 201347 197374 193913
54343 193913 190458 186392 181993 178307 175952 174441 172829 170632 167989 165299 162985 161354 160383 159775 159320
54328 159320 159008 158676 157946 156726 155485 154655 154011 153082 152060 151813 152894 154888 156866 158233 158962 159260
54312 159260 159282 159189 159267 159865 161090 162537 163370 162913 161282 159361 158021 157394 156981 156334 155429 154448 153545 152988
54294 152988 153207 154308 155622 156198 155890 155589 156149 157342 158199 158291 158166 158436 158805 158406 157025 155541 154899
54277 154899 154935 154710 153986 153759 154919 156869 158153 158247 157897 157691 157168 155832 154265 153526 153871 154785 155957
54260 155957 157429 158882 159639 159551 159284 159536 160443 161926 164023 166440 168239 168522 167397 165927 165100 165030 165145
54243A65145j82m01k39K6M6k4K38P46Q39J98o95j225j337j218q03o8N53O75N87
54224A62861Q25J271J350R84O94P20O87L01j35k47j90m10j048j765k072j733r64
54207A61129l31k31m90o57n93n08m57k04K70M64n9r67j375p96K73Q70N76q9l58
54188A56467j03J61Q9n4J02M55O60P42J025J486J617J110L90J75N97J028Q47K59
54170A67053M7N57J198J174M56k71n38n36o25q51j093j338j598j776j787j576
54154A58496r60J64J378J936J609R42M71J59j44j65L37R20Q78R8q21j204q21M3
54136A63316O94N67j11m59p2M37L53j44m21l91l96m47k97m2O7K57R55J963K579
54117A68408K503K002J267L31l73j93P62J478J167J18p79q83j15J100K032K145
$$ plain form
54243 165145 164963 164562 164323 164349 164395 164371 164609 165355 166194 166392 165697 164472 163135 161917 161114 161046 161599 162274 162861
54224 162861 163686 164957 166307 167291 167985 168705 169392 169693 169558 169311 169121 168711 167663 165898 163826 162093 161129
54207 161129 160798 160567 160077 159420 158827 158319 157862 157658 157928 158392 158333 157366 155991 155195 155468 156338 156914 156825 156467
54188 156467 156364 156525 156614 156560 156662 157117 157777 158519 159544 161030 162647 163757 164147 164322 164919 165947 166794 167053
54170 167053 167100 167657 168855 170029 170485 170214 169676 169140 168515 167664 166571 165233 163635 161859 160072 158496
54154 158496 157536 157700 159078 161014 162623 163565 164036 164195 164051 163886 164223 165143 166021 166119 165298 164094 163273 163316
54136 163316 164010 164577 164466 164007 163935 164372 164725 164581 164160 163769 163373 162926 162629 162587 162654 162911 163866 165829 168408
54117 168408 170911 172913 174180 174511 174138 173945 174707 176185 177352 177470 176691 175808 175693 176793 178825 180970
54101A80970J625J030N48j4n07m74N8M06K17L0N77J877L348M399M765M584M407
54084B07846M762N492N857N396M279K728O22j954m231n277m807l304j634o90r68
54069B14117k097l045l083k356j398m86K61N33J29n61q22l82L83R96J340J552
54053B05081J648J454R21L62K15N75J180J950L106M535N452N268M531M399N320
54038B45997O699P788Q205P828O920O379O916P880P788O278M653M033L995L591
54024C34950K819K202J614O36l89o30l0O13P65O19L66k05j202k270l023l449l771
54007C29615m195m896n883o757o889o046m712l676l396l716m107m152l919l799
53993B63472l955m055l672k808j868j259j123j335j581j602j466j486j757j952
$$ plain form
54101 180970 182595 183625 184173 184159 183652 183178 183236 183642 183859 183889 184466 186343 189691 194090 198855 203439 207846
54084 207846 212608 218100 223957 229353 233632 236360 236982 235028 230797 225520 220713 217409 215775 215085 214117
54069 214117 212020 208975 205892 203536 202138 201652 201913 202446 202575 202014 201192 200810 201193 202189 203529 205081
54053 205081 206729 208183 209104 209466 209681 210256 211436 213386 216492 221027 226479 231747 236278 240677 245997
54038 245997 252696 260484 268689 276517 283437 289816 296732 304612 312400 318678 323331 327364 331359 334950
54024 334950 337769 339971 341585 342221 341832 341202 341172 341785 342550 343169 343535 343330 342128 339858 336835 333386 329615
54007 329615 325420 320524 314641 307884 300995 294949 290237 286561 283165 279449 275342 271190 267271 263472
53993 263472 259517 255462 251790 248982 247114 245855 244732 243397 241816 240214 238748 237262 235505 233553
53979B33553j697r93j46N23Q11O79L44O7j84n79q94n89L16R60O51j56m49N3P43
53960B33013J053J049J047J166J378J724K303L179M324N589O801P987R332J0845
53946B90790J2344J3922J6080J8981K1726K2741K0856J5956Q931J398m834q730
53934D30161j0521j0978j0420q848o833n440n096n075m462l150j622j41J307K558
53920C61440L332L770M438N548O553O820O538O560P311Q214Q415P813P059O657
53906D50468O463O069N308M266L115K032J123K70q02k111l267l810l658l254l323
53891D58889m353o126p805q764r211r686j0174j0198r718r281r169q966q237p153
53877C40048o204n626n355n172m785m127l627l662l769l178k213k217l645n143
$$ plain form
53979 233553 231856 230863 230717 231240 232051 232730 233074 233141 232957 232378 231484 230895 231211 232171 232822 232666 232217 232270 233013
53960 233013 234066 235115 236162 237328 238706 240430 242733 245912 250236 255825 262626 270613 279945 290790
53946 290790 303134 317056 333136 352117 373843 396584 417440 433396 442327 443725 438891 430161
53934 430161 419640 408662 398242 389394 382561 377121 372025 366950 362488 359338 357716 357575 358882 361440
53920 361440 364772 368542 372980 378528 385081 391901 398439 404999 412310 420524 428939 436752 443811 450468
53906 450468 456931 463000 468308 472574 475689 477721 478844 479114 478312 476201 472934 469124 465466 462212 458889
53891 458889 454536 448410 440605 431841 422630 412944 402770 392572 382854 373573 364404 355438 347201 340048
53877 340048 333844 328218 322863 317691 312906 308779 305152 301490 297721 294543 292330 290113 286468 281325
53863B81325n244m213l376l229l219k937k548k224j988k029k403k589k064j186
53849B42076p98j053j354j377j357j370j139o87m79o99r41p70j12Q41J651J634
53833B34066N16r24j528j127n68m31m42k86j28q5J19O14J099J320J341J158O95
53816B35409L48P63J802K403J935R57L25K29N65J438K677L580L851M193N185O194
53800B71854O312N815N664N937N906N489N378N637N412M409L532L458L542K971
53786C41316K185K177K797K803J562j98j489k140k564l067l777m741n723o205
53772C22936o007n663n761o132o140n583m870m313l793l198k780k829l247l636
53758B58984l633l093k264j762k072k896l370l011k167j355o40%K11l78j502k414
$$ plain form
53863 281325 276081 271868 268492 265263 262044 259107 256559 254335 252347 250318 247915 245326 243262 242076
53849 242076 241278 240225 238871 237494 236137 234767 233628 232941 232462 231763 230822 230052 229940 230781 232432 234066
53833 234066 234582 233658 232130 231003 230435 230004 229562 229276 229148 229063 229182 229796 230895 232215 233556 234714 235409
53816 235409 235757 236520 238322 240725 242660 243617 243942 244171 244736 246174 248851 252431 256282 260475 265660 271854
53800 271854 278166 283981 289645 295582 301488 306977 312355 317992 323404 327813 331345 334803 338345 341316
53786 341316 343501 345678 348475 351278 352840 352642 351153 349013 346449 343382 339605 334864 329141 322936
53772 322936 316929 311266 305505 299373 293233 287650 282780 278467 274674 271476 268696 265867 262620 258984
53758 258984 255351 252258 249994 248232 246160 243264 239894 236883 234716 233361 232721 232721 232932 232554 231052 228638
53742B28638k571j964r60j42j9n09q55m13O19J494J698J149M1j080j446q43o7
53725B22770km25m01L21J060J363J551J935K181J898J293Q72P88Q61R83J201J553
53708B39802J955K192K029J515J097J204J740K299K710K991K986K614K400L017
53694B70551M224M857M262L081K333K128J780Q51l33j075r82l07K71K45k74q93
53678B90719j458j954k049j395l84L5m99j332j686j480j071o91m56m54m79j20
53662B75246O23J215J274R88O02J08k99p5Q19J462J024q2p79p30m92l88k3R14
53644B81407J922K138J327K18k05L23J129J458J387J579K248K860K924K495J731
53629C04941N98n79q89J93J982L238L478L142K789K689K967L593M210M484M507
$$ plain form
53742 228638 226067 224103 223143 223001 222982 222473 221618 221205 221824 223318 225016 226165 226206 225126 223680 222837 222770
53725 222770 222768 222343 221942 222263 223323 224686 226237 228172 230353 232251 233544 234416 235204 236065 237048 238249 239802
53708 239802 241757 243949 245978 247493 248590 249794 251534 253833 256543 259534 262520 265134 267534 270551
53694 270551 274775 279632 283894 286975 289308 291436 293216 294067 293734 292659 291677 291370 291641 291886 291612 290719
53678 290719 289261 287307 285258 283863 283479 283514 283015 281683 279997 278517 277446 276755 276299 275845 275366 275246
53662 275246 275869 277084 278358 279346 279948 280056 279757 279682 280501 281963 282987 282905 282126 281396 280904 280516 280493 281407
53644 281407 283329 285467 286794 287012 286807 287130 288259 289717 291104 292683 294931 297791 300715 303210 304941
53629 304941 305539 304960 304071 304264 306246 309484 312962 316104 318893 321582 324549 328142 332352 336836 341343
53614C41343M528M482M178L794L623L434K742J672J032J323K136K711K802K764
53600C82564L002L471L672L136J978Q57K66P0o5j11J19L93K71k05m90k73J95N69
53582C99419P87Q34N29k32j177j907k254k323k219j892j235k98O00J036Q63L65
53566C90896m5k40l71m91m33n2N36J037J226J136R83R50J033J137J240J413J692
53549D01647K039K352K413J941R66N7j45L36Q71J054J165J646K501L316L700L553
53533D29412L208L326M342N891P116P557P464P251P103P220P801Q643R283R703
53519E25320J0310J1022J1193J0826J1015J2524J4638J6200J7168J8256J9556
53508F78028K0567K1284K2124K2931K3071K2629K2500K3039K3490K3087K1994
$$ plain form
53614 341343 345871 350353 354531 358325 361948 365382 368124 369796 370828 372151 374287 376998 379800 382564
53600 382564 385566 389037 392709 395845 397823 398680 398946 399016 398951 398840 398959 399352 399623 399418 398928 398655 398850 399419
53582 399419 400206 401040 401569 401337 400160 398253 395999 393676 391457 389565 388330 388032 388632 389668 390531 390896
53566 390896 390851 390611 390240 389749 389316 389264 389800 390837 392063 393199 394182 395132 396165 397302 398542 399955 401647
53549 401647 403686 406038 408451 410392 411358 411415 411270 411606 412477 413531 414696 416342 418843 422159 425859 429412
53533 429412 432620 435946 440288 446179 453295 460852 468316 475567 482670 489890 497691 506334 515617 525320
53519 525320 535630 546652 557845 568671 579686 592210 606848 623048 640216 658472 678028
53508 678028 698595 719879 742003 764934 788005 810634 833134 856173 879663 902750 924744
53497I24744K0833J9933J9411J9393J9641J9410J8184J6458J5377J5624J6794
53486A125802J7766J7694J6750J5983J6227J7221J7952J7787J7042J6437J6299
53475A312960J6294J5721J4141J1829R514P519N442K937M08j527k962m507o343
53462A381426q056r301r993j0014r388q769r039j0224j1489j2317j3097j4299
53450A255440j5723j6870j7558j7814j7658j7291j7082j7052j6684j5620j4157
53439A071931j2733j1243r339p132n184l843k998k469k266k354k323j606r2J584
53425A009933K670L091L456M166N035N927P240R198J1160J2329J2997J4202J6234
53412A117638J8204J9317J9809K0447K1639K3369K5439K7419K8822K9601L0247
$$ plain form
53497 924744 945577 965510 984921 1004314 1023955 1043365 1061549 1078007 1093384 1109008 1125802
53486 1125802 1143568 1161262 1178012 1193995 1210222 1227443 1245395 1263182 1280224 1296661 1312960
53475 1312960 1329254 1344975 1359116 1370945 1380459 1387978 1393420 1396357 1396765 1395238 1392276 1387769 1381426
53462 1381426 1373370 1364069 1354076 1344062 1334674 1325905 1316866 1306642 1295153 1282836 1269739 1255440
53450 1255440 1239717 1222847 1205289 1187475 1169817 1152526 1135444 1118392 1101708 1086088 1071931
53439 1071931 1059198 1047955 1038616 1031484 1026300 1022457 1019459 1016990 1014724 1012370 1010047 1008441 1008349 1009933
53425 1009933 1012603 1015694 1019150 1023316 1028351 1034278 1041518 1050716 1061876 1074205 1087202 1101404 1117638
53412 1117638 1135842 1155159 1174968 1195415 1217054 1240423 1265862 1293281 1322103 1351704 1381951
53401A381951L1207L2547L4275L6540L9218M1719M3486M4513M5240M6113M7310
53390A824119M8625M9600N0011N0084M9940M9168M7551M5892M5199M5119M4159
53379B349467M1686L8705L6290L4209L1608K8267K4525K0622J6766J3202R604
53368B644951M979j082p607j3439j8703k4189k9668l3889l6251l7581l9057m0957
53356B367507m2700m3610m3457m2515m1269l9937l8350l6404l4398l2746l1621
53345A940500l1151l1606l3000l4658l5647l5544l4582l3145l1374k9150k6393
53334A584250k3513k1440k0633k0160j8487j5482j2777j1770j2160j3003j4227
53323A400598j6094j7955j8825j8776j8568j8178j6936j4986j3435j2817j2511
$$ plain form
53401 1381951 1413158 1445705 1479980 1516520 1555738 1597457 1640943 1685456 1730696 1776809 1824119
53390 1824119 1872744 1922344 1972355 2022439 2072379 2121547 2169098 2214990 2260189 2305308 2349467
53379 2349467 2391153 2429858 2466148 2500357 2531965 2560232 2584757 2605379 2622145 2635347 2644951
53368 2644951 2649930 2648848 2641241 2627802 2609099 2584910 2555242 2521353 2485102 2447521 2408464 2367507
53356 2367507 2324807 2281197 2237740 2195225 2153956 2114019 2075669 2039265 2004867 1972121 1940500
53345 1940500 1909349 1877743 1844743 1810085 1774438 1738894 1704312 1671167 1639793 1610643 1584250
53334 1584250 1560737 1539297 1518664 1498504 1480017 1464535 1451758 1439988 1427828 1414825 1400598
53323 1400598 1384504 1366549 1347724 1328948 1310380 1292202 1275266 1260280 1246845 1234028 1221517
53312A221517j1882j0999r948q457o583m914l694k511j207k61K13J051K962N464
53298A170751P577R093J0517J2126J3760J5364J7064J8824K0387K1557K2239K2356
53286A361615K2049K1710K1558K1297K0445J8901J6984J5098J3471J1927R893
53275A554948O965L627Q84j039l068n866q720j0560j1630j3195j5724j8318k0074
53262A458230k1210k2406k3706k4571k4689k4264k3730k3468k3609k3801k3389
53251A199387k2199k0908k0319k0347k0207j9573j9080j9479k0632k1634k1797
53240I73212k1191k0370j9782j9501j9273j8734j7724j6411j5085j3805j2395
53229G78941j0819r378q437q033p863p709p747q421r867j1574j2791j3380j3990
$$ plain form
53312 1221517 1209635 1198636 1188688 1180231 1173648 1168734 1165040 1162529 1161322 1161061 1161274 1162325 1165287 1170751
53298 1170751 1178328 1187421 1197938 1210064 1223824 1239188 1256252 1275076 1295463 1317020 1339259 1361615
53286 1361615 1383664 1405374 1426932 1448229 1468674 1487575 1504559 1519657 1533128 1545055 1554948
53275 1554948 1561913 1565540 1566424 1565385 1562317 1556451 1547731 1537171 1525541 1512346 1496622 1478304 1458230
53262 1458230 1437020 1414614 1390908 1366337 1341648 1317384 1293654 1270186 1246577 1222776 1199387
53251 1199387 1177188 1156280 1135961 1115614 1095407 1075834 1056754 1037275 1016643 995009 973212
53240 973212 952021 931651 911869 892368 873095 854361 836637 820226 805141 791336 778941
53229 778941 768122 758744 750307 742274 734411 726702 718955 710534 700667 689093 676302 662922 648932
53216F48932j5219j6689j7399j6878j5625j4427j3635j3227j3055j2728j1719
53205D88331j0003q339p468p238o965o462o202o538p280q106q834r212q904q016
53191C78764p236p094p297p130o367n428m774m445m194l796l160k431k030k368
53177C11014l289m023l879k952j910j162o39l05m23j069j754j960j792j684j665
53162B82508j480j290j602k435l114l128k667k082j396n73J67O47Q73O82j61j157
53146B63792j219k01M58l83j764j849n95K77j05o67l65J83j12r99j360q91k21
53129B53979K46O77J070J096P76N86P38R13Q73Q48J002J023O03M5m0M64J044J176
53111B67119Q56L75p7m28n41l43n2p0n23j207j909k520k736k054m75J107J668
$$ plain form
53216 648932 633713 617024 599625 582747 567122 552695 539060 525833 512778 500050 488331
53205 488331 478328 469989 462521 455283 448318 441856 435654 429116 421836 413730 404896 395684 386780 378764
53191 378764 371528 364434 357137 350007 343640 338212 333438 328993 324799 321003 317843 315412 313382 311014
53177 311014 307725 303702 299823 296871 294961 293799 293160 292855 292432 291363 289609 287649 285857 284173 282508
53162 282508 281028 279738 278136 275701 272587 269459 266792 264710 263314 262741 262908 263555 264428 265110 264949 263792
53146 263792 262573 262372 262830 262447 260683 258834 258239 258516 258411 257744 257379 257562 257450 256451 255091 254200 253979
53129 253979 254225 254902 255972 257068 257844 258430 259168 260081 260954 261802 262804 263827 264430 264475 264435 264899 265943 267119
53111 267119 267975 268350 268273 267845 267304 266961 266909 266839 266316 265109 263200 260680 257944 255890 255415 256522 258190
53094B58190J078N9p44j174j216q08j63J97k4o39j330j892k007j281J02J209J265
53077B50822N97J96M46P24L09o52j322j134l91J57J65n4j25j52m40q93j098j003
53059B46152j034j450j944k079j788j204l49P00J505J602J056M64L54P37J179
53044B43901J211P21O4k71j10L49Q53J251J301Q05L3l52j29P6m04j316j773j420
53026B44790p90n08n81n90l08J13L96M65M86P09J134J474J453J163R54J080J479
53009B52919J873J925J501Q45M12L43K58k40r78j380j125m49J83M57L54J16K1
52992B57035Pk63p84q69J14J723K744K490J501P58O84J020J293J179P61O22J321
52975B71336K509L062K383J119K40j59n29p87m77J95M13Ok06L45J150J495J442
$$ plain form
53094 258190 259268 259327 258583 257409 256193 255385 255222 255419 255395 254756 253426 251534 249527 248246 248348 249557 250822
53077 250822 251419 251615 252061 252785 253094 252442 251120 249986 249595 249752 249917 249863 249738 249586 249146 248253 247155 246152
53059 246152 245118 243668 241724 239645 237857 236653 236304 237004 238509 240111 241167 241631 241985 242722 243901
53044 243901 245112 245833 245897 245626 245516 245865 246718 247969 249270 250075 250108 249756 249627 249703 249299 247983 246210 244790
53026 244790 244000 243492 242911 242321 242013 242126 242522 242987 243473 244182 245316 246790 248243 249406 250360 251440 252919
53009 252919 254792 256717 258218 259063 259475 259818 260076 259836 258858 257478 256353 255904 256087 256544 256898 257014 257035
52992 257035 257042 256779 255995 255126 255240 256963 259707 262197 263698 264456 265140 266160 267453 268632 269393 270015 271336
52975 271336 273845 276907 279290 280409 280649 280490 279961 279174 278697 278892 279305 279311 279105 279450 280600 282095 283537
52958B83537J386J240P96M23M95M86m39j969k794k390j636j369j218n52K24K09
52942B76429o09j380j641j680j694j400o88n7nm06p47p23m06m4O9k44p69j006
52924B62999o68p0J93j01n47n49O9Q12J026N60q3m41o55j160j916k291j767n48
52906B54863N60Q35K13o45r38n34p4j76o28o79k7Q56J304J125O53M01O66J251
52888B59026J628J510J135Q45O24L02o7m47j031j747j871q61O65J547J534J324
52872B64116J257J000O44R07J860K459J961R86N36O89R52J233J655J989J995J877
52856B86116J745J150q6j194j478j487k163l287l849l673l539l737l770l486l328
52841B53934l275k683j543q10j021j476j378r44p75q56q24o26l33K52J137J823
$$ plain form
52958 283537 284923 286163 286959 287382 287877 288363 287924 285955 283161 280771 279135 277766 276548 275996 276220 276429
52942 276429 275820 274440 272799 271119 269425 268025 267337 267280 267275 266869 266122 265399 264993 264949 265018 264774 264005 262999
52924 262999 262331 262261 262454 262353 261806 261257 261326 262138 263164 263724 263641 263200 262545 261385 259469 257178 255411 254863
52906 254863 255423 256258 256471 255826 254888 254354 254280 254104 253476 252797 252770 253626 254930 256055 256708 257109 257775 259026
52888 259026 260654 262164 263299 264144 264768 265070 265003 264556 263525 261778 259907 259046 259711 261258 262792 264116
52872 264116 265373 266373 267017 267924 269784 272243 274204 275190 275726 276415 277367 278600 280255 282244 284239 286116
52856 286116 287861 289011 288925 287731 286253 284766 282603 279316 275467 271794 268255 264518 260748 257262 253934
52841 253934 250659 247976 246433 245623 244602 243126 241748 240804 240029 239173 238349 237723 237390 237642 238779 240602
52825B40602J947J822J760J373K46j126j868j889j794j767j365m71L43N64L22
52810B38699J0j73j27K98J050J730J952J698J242Q27N29L02L9l33q16j391j980
52793B43556k314k094j454r97j067j239q63j3O52P74O18M79L38J79J72K99K83
52776B37309J27K93R63J546J326L86n66j082j212j025m46L29P73N94Q5l43o44
52759B38413r61j134p83P9Q40Q63K43k80j74K69L85Q9n9K58O18N87N18J067K104
52740B42942K820K925L002L430L665L122K205J759J791J552Q24K94M96R83J022
52725B72832O17L47M47M90J9q72j681j994j744j092k70M13O02J94m22p16p26j064
52707B65380j999k815k620j494l54K74O92J188J430J010K02l16k19K67P39R38
$$ plain form
52825 240602 242549 244371 246131 247504 247750 246624 244756 242867 241073 239306 237941 237470 237813 238377 238699
52810 238699 238709 238536 238409 238707 239757 241487 243439 245137 246379 247206 247735 248037 248076 247743 246927 245536 243556
52793 243556 241242 239148 237694 236697 235630 234391 233528 233515 234167 234941 235559 236038 236376 236555 236727 237026 237309
52776 237309 237436 237729 238692 240238 241564 241950 241384 240302 239090 238065 237619 237948 238721 239315 239400 239057 238413
52759 238413 237452 236318 235535 235614 236454 237317 237560 237280 237106 237375 237760 237849 237790 238048 238666 239253 239771 240838 242942
52740 242942 245762 248687 251689 255119 258784 261906 264111 265870 267661 269213 270037 270331 270827 271810 272832
52725 272832 273449 273796 274243 274733 274752 273880 272199 270205 268461 267369 267099 267512 268114 268308 267886 267170 266444 265380
52707 265380 263381 260566 257946 256452 256098 256372 257064 258252 259682 260692 260894 260578 260359 260626 261365 262303
52691B62303Q71P97R56J194J100N97R7n9M7K95O81Q77K15j294k381j798j1J149
52673B65636N85r73k071k092j394m68M33J061J141P02K10P9K19J88j29k55K98
52656B63170J317K128K454K635K949L215L220L108K963K489J484K87p15j619k516
52641B86569k939k431j463r69j103j201r57q03r68r85m37L81R66J259J511J856
52625B78286K362L097L787L771K644P74j092k478l289l578l475l157k618j691
52611B73343m53O19J129J193J167J186J182J137J076R30N58o4p37j091p97K6P86
52594B81190J088J250J716K112J559M2j270j382n46K68M73L5q13j498j247M1J363
52577B84381J646R42J72j23r0OR1M0k24l90n8N50P00J0j112j977k236k000j584
$$ plain form
52691 262303 263174 263971 264927 266121 267221 267818 267915 267856 267903 268198 268879 269756 269971 268677 266296 264498 264487 265636
52673 265636 266221 265248 263177 261085 259691 259223 259656 260717 261858 262560 262770 262849 263068 263256 263127 262872 263170
52656 263170 264487 266615 269069 271704 274653 277868 281088 284196 287159 289648 291132 291419 290704 289085 286569
52641 286569 283630 281199 279736 278767 277664 276463 275506 274703 273735 272750 272313 272694 273660 274919 276430 278286
52625 278286 280648 283745 287532 291303 293947 294721 293629 291151 287862 284284 280809 277652 275034 273343
52611 273343 272890 273509 274638 275831 276998 278184 279366 280503 281579 282509 283067 283003 282266 281175 280378 280404 281190
52594 281190 282278 283528 285244 287356 288915 288957 287687 286305 285759 286027 286500 286535 285722 284224 282977 283018 284381
52577 284381 286027 286969 287141 287018 286928 286934 287025 287065 286841 286451 286393 286943 287643 287653 286541 284564 282328 280328 278744
52558B78744j207p58MQ78J134L98p23j320j265j057q69m73k3ll95o12n16o98j387
52539B69852j833j300j13Q38J212J268J116O94K89M37J122J608J329O30L37P47
52523B78233J311J326P71K38J06J15l8qP58K032K805K479J537Q18O46J027K035
52506B96191L416M191L532J914O06J9p22k301m107m991m647l667k697k038j846
52491B82853k079k287j991j294p57n96m66j00K48K06j56m64m42o4N47J136J457
52474B75751J508J451J227N75l15o41Q8J248J786J557J381J797K432K790K961
52459B95596L173L125K345R68l01r79j189j334j668k202k790l235l429l408l191
52444B81481k724k024j274o33j16K01R2m81j101j220p34m7M01N36O30R60J425
$$ plain form
52558 278744 277537 276779 276783 277661 278795 279193 278470 277150 275885 274828 273959 273486 273463 273460 273065 272453 271937 271239 269852
52539 269852 268019 266719 266606 267444 268656 269924 271040 271734 272023 272460 273582 275190 276519 277149 277486 278233
52523 278233 279544 280870 281641 281879 281985 282100 282062 282054 282812 284844 287649 290128 291665 292483 293129 294156 296191
52506 296191 299607 303798 307330 309244 309850 309869 309147 306846 302739 297748 293101 289434 286737 284699 282853
52491 282853 280774 278487 276496 275202 274445 273849 273383 273283 273531 273737 273581 273117 272675 272611 273158 274294 275751
52474 275751 277259 278710 279937 280512 280197 279556 279644 280892 282678 284235 285616 287413 289845 292635 295596
52459 295596 298769 301894 304239 305207 304906 303927 302738 301404 299736 297534 294744 291509 288080 284672 281481
52444 281481 278757 276733 275459 274826 274710 274911 275003 274522 273421 272201 271467 271420 271821 272357 272987 273947 275372
52427B75372J514Q28k84r62p72j23M20P85J127J314J252J287J726K092J643N53
52411B87772j16K66J211K001K640L584M936O336P447Q256Q926R492R570Q420N630
52396C66371J851j622m057n720o935p369o674n379m423l991l364j995k42J024
52382C17475J259O03l03p45l91N57J622K455K935L075L009K975L131L483M105
52367C45245N086O072O160M764K455M56o44j180j459j227l58N76R04P34P62J336
52351C69682K110K519K306J620Q67M81N77R28J354J988K917L775M127M120M311
52336D03682M848N321N544N963O974Q254R232R922J0792J1924J2859J3364J3921
52323E22600J5164J7099J9089K0499K1151K1179K0766K0139J9673J9782K0490
$$ plain form
52427 275372 276886 277714 277430 276468 275696 275573 275993 276778 277905 279219 280471 281758 283484 285576 287219 287772
52411 287772 287656 287922 289133 291134 293774 297358 302294 308630 316077 324333 333259 342751 352321 360741 366371
52396 366371 368222 366600 362543 356823 349888 342519 335845 330466 326043 322052 318688 316693 316451 317475
52382 317475 318734 319337 319034 318289 317898 318455 320077 322532 325467 328542 331551 334526 337657 341140 345245
52367 345245 350331 356403 362563 367327 369782 370238 369594 368414 366955 365728 365370 365946 366850 367584 368346 369682
52351 369682 371792 374311 376617 378237 379104 379585 380162 381090 382444 384432 387349 391124 395251 399371 403682
52336 403682 408530 413851 419395 425358 432332 440586 449818 459740 470532 482456 495315 508679 522600
52323 522600 537764 554863 573952 594451 615602 636781 657547 677686 697359 717141 737631
52312G37631K1276K1548K1355K1316K1828K2563K2987K3078K3158K3159K2562
52301I82461K1137J9368J7967J7186J6730J6116J4972J3168J0815Q110N184K161
52289A145375p18l276n572p644r133r626r331q963q801q393p416o304n592n078
52275A049528m106k413k61J985L998N458O362P171Q222R259J0069J1130J2864
52262A119266J4586J5208J4957J5276J6738J8141J8245J7444J6923J6844J6448
52251A300076J5556J4834J4544J3912J2096R136N729K509j96k329m140o037q064
52238A367626r768j0807j1487j2402j3626j4563j4620j3885j3037j2674j2827
52227A227930j3098j3166j2983j2518j1597j0193q784q013p936p807o795m859
$$ plain form
52312 737631 758907 780455 801810 823126 844954 867517 890504 913582 936740 959899 982461
52301 982461 1003598 1022966 1040933 1058119 1074849 1090965 1105937 1119105 1129920 1138030 1143214 1145375
52289 1145375 1144657 1141381 1135809 1128165 1119032 1109406 1100075 1091112 1082311 1073918 1066502 1060198 1054606 1049528
52275 1049528 1045422 1043009 1042748 1044733 1048731 1054189 1060551 1067722 1075944 1085203 1095272 1106402 1119266
52262 1119266 1133852 1149060 1164017 1179293 1196031 1214172 1232417 1249861 1266784 1283628 1300076
52251 1300076 1315632 1330466 1345010 1358922 1371018 1380154 1385883 1388392 1388196 1385867 1381727 1375690 1367626
52238 1367626 1357858 1347051 1335564 1323162 1309536 1294973 1280353 1266468 1253431 1240757 1227930
52227 1227930 1214832 1201666 1188683 1176165 1164568 1154375 1145591 1137578 1129642 1121835 1115040 1110181
52215A110181k771j384q94p83l34P66K262L673M760N581O210O599O701O585O272
52200A153424N693M912M247L958L915L836L799M231N296O493P082O810O083N479
52186A225258N188M886M082K534M19j849l934n701p184q526r807j0815j1077j0411
52172A173063r326q566q243p849p128o428n907m991l118p02J231K193K530K747
52158A119506L084L646M289M421L533K012Q57M45K25k29m89k3R61J817K217K195
52142A148467J905J708K063K829L033J947J24j128j124k81O46J362K198L841O655
52127A174245J0061J2970J5099J7393K0595K4009K6371K7559K8495K9675L0725
52116A417197L1348L1729L1829L1195K9765K8117K6666K5222K3508K1559J9439
$$ plain form
52215 1110181 1107410 1106026 1105132 1104349 1104015 1104781 1107043 1110716 1115476 1121057 1127267 1133866 1140567 1147152 1153424
52200 1153424 1159117 1164029 1168276 1172234 1176149 1179985 1183784 1188015 1193311 1199804 1206886 1213696 1219779 1225258
52186 1225258 1230446 1235332 1239414 1241948 1242367 1240518 1236584 1230883 1223699 1215173 1205366 1194551 1183474 1173063
52172 1173063 1163737 1155171 1146928 1139079 1131951 1125523 1119616 1114625 1111507 1110805 1112036 1114229 1116759 1119506
52158 1119506 1122590 1126236 1130525 1134946 1138479 1140491 1141348 1141793 1142018 1141789 1141300 1141277 1142238 1144055 1146272 1148467
52142 1148467 1150372 1152080 1154143 1156972 1160005 1161952 1162076 1160948 1159824 1159543 1160189 1161551 1163749 1167590 1174245
52127 1174245 1184306 1197276 1212375 1229768 1250363 1274372 1300743 1328302 1356797 1386472 1417197
52116 1417197 1448545 1480274 1512103 1543298 1573063 1601180 1627846 1653068 1676576 1698135 1717574
52105A717574J7168J5107J3774J3080J2369J1342J0304R287P819N774L687J791
52093A839076m83l485o622r283j1850j4975j8431k1354k3259k4103k3735k2120
$$ plain form
52105 1717574 1734742 1749849 1763623 1776703 1789072 1800414 1810718 1820005 1827824 1833598 1837285 1839076
52093 1839076 1838593 1835108 1828486 1819203 1807353 1792378 1773947 1752593 1729334 1705231 1681496 1659376
$$ [...]
##END NTUPLES=NMR SPECTRUM
##END=
