##TITLE=AC1620_CTIAH13351_8326046_aCbfBM7ZLF
##JCAMPDX= 6.0         $$ Bruker NMR JCAMP-DX V2.0
##DATA TYPE= NMR SPECTRUM
##DATA CLASS= NTUPLES
##ORIGIN= BRUKER
##OWNER= Administrator
$$ 1.72 TOPSPIN		Version 2.1
$$ 2013-11-13 20:33:30.525 -0800  Administrator@X
$$ Compression mode = diff/dup
##.OBSERVE FREQUENCY= 400.02188249412
##.OBSERVE NUCLEUS= ^1H
##.ACQUISITION MODE= SIMULTANEOUS (DQD)
##.ACQUISITION SCHEME= undefined
##.AVERAGES= 8
##.DIGITISER RES= 22
##SPECTROMETER/DATA SYSTEM= spect
##.PULSE SEQUENCE= zg30
##.SOLVENT NAME= COFFEE_meoh
##.SHIFT REFERENCE= INTERNAL, COFFEE_meoh, 1, 14.98509
##AUDIT TRAIL= $$ (NUMBER, WHEN, WHO, WHERE, PROCESS, VERSION, WHAT)
$$ ##TITLE= Audit trail, TOPSPIN		Version 2.1
$$ ##JCAMPDX= 5.01
$$ ##ORIGIN= Bruker BioSpin GmbH
$$ ##OWNER= Administrator
$$ $$ E:\/data/COFFEE/nmr/AC1620_CTIAH13351_8326046_aCbfBM7ZLF/10/pdata/1/auditp.txt
$$ ##AUDIT TRAIL=  $$ (NUMBER, WHEN, WHO, WHERE, PROCESS, VERSION, WHAT)
(   1,<2013-11-13 20:33:23.478 -0800>,<Administrator>,<X>,<go>,<TOPSPIN 2.1>,
      <created by zg
	started at 2013-11-13 20:32:16.400 -0800,
	POWCHK enabled, PULCHK disabled,
       configuration hash MD5:
       C8 4E 4E 5D D3 5C D8 9E 9F 52 82 E0 59 8A DE 15
       data hash MD5: 64K
       14 70 D4 98 ED 2B 4A A8 A3 24 89 9D 8B 7C 4F 61>)
(   2,<2013-11-13 20:33:26.400 -0800>,<Administrator>,<X>,<proc1d>,<TOPSPIN 2.1>,
      <Start of raw data processing
       efp LB = 0 FT_mod = 6 PKNL = 1 PHC0 = 0 PHC1 = 0 SI = 32K 
       data hash MD5: 32K
       0E 4D 0B F4 BB E1 70 B5 C4 A2 CC E4 BC A5 29 18>)
(   3,<2013-11-13 20:33:26.697 -0800>,<Administrator>,<X>,<proc1d>,<TOPSPIN 2.1>,
      <pk PHC0 = 90.99426 PHC1 = 0 
       data hash MD5: 32K
       5C 29 E1 23 4B F3 03 82 25 9F FD ED 65 89 16 D0>)
(   4,<2013-11-13 20:33:26.916 -0800>,<Administrator>,<X>,<proc1d>,<TOPSPIN 2.1>,
      <abs ABSG = 1 
       data hash MD5: 32K
       33 AC DC F4 A1 62 85 03 0E A6 D6 BA 12 4C B1 35>)
(   5,<2013-11-13 20:33:27.103 -0800>,<Administrator>,<X>,<proc1d>,<TOPSPIN 2.1>,
      <abs ABSG = 2 
       data hash MD5: 32K
       34 D7 D0 E1 DB 1E C0 91 B1 82 1C 33 66 CB C6 88>)
(   6,<2013-11-13 20:33:27.291 -0800>,<Administrator>,<X>,<proc1d>,<TOPSPIN 2.1>,
      <abs ABSG = 3 
       data hash MD5: 32K
       9A 5D B7 92 27 D0 BC 32 19 4C CB 9C 00 E5 67 31>)
(   7,<2013-11-13 20:33:27.384 -0800>,<Administrator>,<X>,<proc1d>,<TOPSPIN 2.1>,
      <abs ABSG = 4 
       data hash MD5: 32K
       47 F5 97 AC C9 E8 54 05 B5 DD EA 8B B5 35 50 65>)
(   8,<2013-11-13 20:33:27.447 -0800>,<Administrator>,<X>,<proc1d>,<TOPSPIN 2.1>,
      <abs ABSG = 5 
       data hash MD5: 32K
       48 EE 2B B6 F1 E1 4E 94 D7 76 36 27 5C 17 A4 34>)
$$ ##END=
$$ 
$$ $$ hash MD5
$$ $$ 4D CC 11 6D 91 5E AF EE 47 C3 41 F6 43 BD 44 A2
##$RELAX= 
##$RELAX= 
##$RELAX= 
##$RELAX= 
##$RELAX= 
##$RELAX= 
##$RELAX= 
$$ Bruker specific parameters
$$ --------------------------
##$DU= <E:\>
##$EXPNO= 10
##$NAME= <AC1620_CTIAH13351_8326046_aCbfBM7ZLF>
$$ [...]
150 150 150 150 150 150 150 150
##$TP07= 0
##$TPNAME0= <>
##$TPNAME1= <>
##$TPNAME2= <>
##$TPNAME3= <>
##$TPNAME4= <>
##$TPNAME5= <>
##$TPNAME6= <>
##$TPNAME7= <>
##$TPOAL= (0..7)
0.5 0.5 0.5 0.5 0.5 0.5 0.5 0.5
##$TPOFFS= (0..7)
0 0 0 0 0 0 0 0
##$TUNHIN= 0
##$TUNHOUT= 0
##$TUNXOUT= 0
##$USERA1= <user>
##$USERA2= <user>
##$USERA3= <user>
##$USERA4= <user>
##$USERA5= <user>
##$V9= 5
##$VALIST= <valist>
##$VCLIST= <CCCCCCCCCCCCCCC>
##$VD= 0
##$VDLIST= <DDDDDDDDDDDDDDD>
##$VPLIST= <PPPPPPPPPPPPPPP>
##$VTLIST= <TTTTTTTTTTTTTTT>
##$WBST= 1024
##$WBSW= 4
##$XGAIN= (0..3)
0 0 0 0
##$XL= 0
##$YL= 0
##$YMAX_a= 630979
##$YMIN_a= -543209
##$ZGOPTNS= <>
##$ZL1= 120
##$ZL2= 120
##$ZL3= 120
##$ZL4= 120
##$ABSF1= 14.98509
##$ABSF2= -5.573092
##$ABSG= 5
##$ABSL= 3
##$ALPHA= 0
##$AQORDER= 0
##$ASSFAC= 0
##$ASSFACI= 0
##$ASSFACX= 0
##$ASSWID= 0
##$AUNMP= <proc_prof1d_extract_pilot.lims>
##$AXLEFT= 0
##$AXNAME= <>
##$AXNUC= <1H>
##$AXRIGHT= 0
##$AXTYPE= 0
##$AXUNIT= <>
##$AZFE= 0.1
##$AZFW= 0.1
##$BCFW= 0
##$BC_mod= 0
##$BYTORDP= 0
##$COROFFS= 0
##$CY= 15
##$DATMOD= 1
##$DC= 0
##$DFILT= <>
##$DTYPP= 0
##$F1P= 0
##$F2P= 0
##$FCOR= 0.5
##$FTSIZE= 32768
##$FT_mod= 6
##$GAMMA= 0
##$GB= 0
##$INTBC= 1
##$INTSCL= 1
##$ISEN= 128
##$LB= 0
##$LEV0= 0
##$LPBIN= 0
##$MAXI= 10000
##$MC2= 0
##$MEAN= 0
##$ME_mod= 0
##$MI= 0
##$NCOEF= 0
##$NC_proc= -8
##$NLEV= 6
##$NOISF1= 0
##$NOISF2= 0
##$NSP= 0
##$NTH_PI= 0
##$NZP= 0
##$OFFSET= 14.98509
##$PC= 1
##$PHC0= 90.99426
##$PHC1= 0
##$PH_mod= 1
##$PKNL= yes
##$PPARMOD= 0
##$PPDIAG= 0
##$PPIPTYP= 0
##$PPMPNUM= 2147483647
##$PPRESOL= 1
##$PSCAL= 4
##$PSIGN= 0
##$PYNMP= <proc.py>
##$REVERSE= no
##$SF= 400.02
##$SI= 32768
##$SIGF1= 0
##$SIGF2= 0
##$SINO= 400
##$SIOLD= 32768
##$SPECTYP= <>
##$SREGLST= <1H.CDCl3>
##$SSB= 0
##$STSI= 32768
##$STSR= 0
##$SW_p= 8223.68421052631
##$SYMM= 0
##$S_DEV= 0
##$TDeff= 65536
##$TDoff= 0
##$TI= <>
##$TILT= no
##$TM1= 0
##$TM2= 0
##$TOPLEV= 0
##$USERP1= <user>
##$USERP2= <user>
##$USERP3= <user>
##$USERP4= <user>
##$USERP5= <user>
##$WDW= 1
##$XDIM= 32768
##$YMAX_p= 470820231
##$YMIN_p= -686027
##$CURPLOT= <Network HP LaserJet P1505>
##$CURPRIN= <$Network HP LaserJet P1505>
##$DFORMAT= <normdp>
##$LAYOUT= <+/1D_H.xwp>
##$LFORMAT= <normlp>
##$PFORMAT= <normpl>
##$SURQMSG= 1
$$ End of Bruker specific parameters
$$ ---------------------------------
##NTUPLES= NMR SPECTRUM
##VAR_NAME=  FREQUENCY,     SPECTRUM/REAL,   SPECTRUM/IMAG
##SYMBOL=    X,             R,               I
##VAR_TYPE=  INDEPENDENT,   DEPENDENT,       DEPENDENT
##VAR_FORM=  AFFN,          ASDF,            ASDF
##VAR_DIM=   32768,         32768,           32768
##UNITS=     HZ,            ARBITRARY UNITS, ARBITRARY UNITS
##FACTOR=    0.250966925370066, 1,           1
##FIRST=     8223.43324360094, 41456,        -109334
##LAST=      0,             -238031,         -123109
##MIN=       0,             -686027,         0
##MAX=       8223.43324360094, 470820231,    0
$$ Real data points
##PAGE= N=1
##DATA TABLE= (X++(R..R)), XYDATA
$$ [...]
19543F7856i9437n6991n5801L7497I55c48441a18390H1752A7514a82527A85979
19531a96616c1189l7458J39b8966o7621N112k45828D6460h5316c0698B1983a39338
19518a67995B1704J15229a30885F4864O7111f2097p4742B15070A9059c3730A6096
19506A71401a36004e9508G1962b71919j13745a6716j2487A0631b49363a05718
19495d00773C1085P0134B7234a19571j03791R6029A05112f3386q2919I4160b276
19483B20318a92260B36705b16594f6867A45755F2876a09229A45653i0490A3922
19472E6825L3229K7842n2872g8812a2774k88739b8977p4625L2203k90849Q0071
19461b82177B17657b76597C8345i4150b3507j53307M0702d1115B1277c1093A89953
$$ plain form
19543 67856 -99437 -156428 -212229 -174732 955 -348441 -118390 81752 17514 -182527 185979
19531 -196616 -31189 -68647 -68508 -28966 -96587 -91475 -337303 46460 -85316 -30698 21983 -139338
19518 -167995 21704 136933 -130885 64864 131975 -62097 -136839 215070 19059 -33730 16096
19506 171401 -136004 -59508 71962 -271919 -385664 -16716 -29203 10631 -249363 -105718
19495 -400773 31085 101219 27234 -119571 -223362 -127333 105112 -63386 -146305 94160 -2276
19483 220318 -192260 236705 -216594 -66867 145755 62876 -109229 145653 -90490 13922
19472 56825 90054 117896 65024 -78812 -12774 -301513 -28977 -103602 -71399 -362248 -282177
19461 -282177 217657 -276597 38345 -94150 -23507 -176814 -136112 -41115 21277 -31093 189953
19449a09625a5778q4102H6635a9955B3494L5165J73612G2346c53592a5250A24401
19437a3845j55101B9139J44380C2666J42677a88789N2543j93223j07601g9392
19426a26594A76898B6872J35381k6791N1285c74459A6811a11882J1395I024N4003
19415F3027d2387k5723j58059O7196e7737j05046D5466b33586A10032c8232j33836
19404a72068A8074h4038o7718M5765F3025a14337A28969c06145J09988B8143a89155
19392b36713a15811d8535k06138a2466A29083i1236F1649a06028K0785A31601
19381B95754a19456B50448G8818C8017e0532k00294P9784b1349k56028a17312
19370A6645K07699d26733a890k44990N3191C5018a59107A91644J79395E822a56705
$$ plain form
19449 -109625 -15778 -99880 86635 -19955 23494 58659 232271 72346 -353592 -15250 124401
19437 -13845 -168946 29139 173519 32666 175343 -188789 -136246 -329469 -437070 -79392
19426 -126594 176898 26872 162253 135462 186747 -374459 16811 -111882 -100487 9024 63027
19415 63027 -42387 -68110 -226169 -158973 -57737 -162783 45466 -233586 110032 -38232 -172068
19404 -172068 18074 -84038 -151756 -105991 63025 -114337 128969 -306145 -196157 28143 -189155
19392 -236713 -115811 -48535 -254673 -12466 129083 -91236 61649 -106028 -85243 131601
19381 295754 -119456 250448 78818 38017 -50532 -250826 -171042 -21349 -277377 -117312
19370 16645 224344 -426733 -1890 -246880 -193689 35018 -159107 191644 371039 5822 -156705
19358E3744g2065j55964J11824k58639R007d926A36265a59872j9805P9380k36861
19347c37158d3709M138A11113b36324A2582a38702j06364j5909m25052c7647j03844
19336a41491b1721p9512A77711a24769A28717a82273L4939f9439k25815I7738
19325A55220b70710G7134a8454A74601a04225j11535D8061J13567h7935C6555
19314a20325k23285E0270i9693p3188I9760d1831j57374i1601H8974a69316A55405
19302A98724c92389m8085C30271c14494D4608Q4967B1743E842K1726a92656h1610
19290H0542a45235A48614m8409b32574j4814b0393R63j73905a246k30085B2515
19278h7585n1738B86248a78637L5692B2547M4199K3643A4942a16852B07456j3451
$$ plain form
19358 53744 -72065 -228029 -116205 -374844 -365837 -4926 136265 -159872 -179677 -100297 -337158
19347 -337158 -43709 -39571 111113 -236324 12582 -138702 -245066 -260975 -686027 -37647 -141491
19336 -141491 -21721 -101233 177711 -124769 128717 -182273 -147334 -69439 -295254 97738
19325 155220 -270710 77134 -18454 174601 -104225 -215760 48061 161628 -87935 36555
19314 -120325 -343610 50270 -99693 -172881 99760 -41831 -199205 -91601 88974 -169316 155405
19302 198724 -392389 -440474 330271 -314494 44608 129575 21743 5842 27568 -192656 -81610
19290 80542 -145235 148614 100205 -232574 -247388 -20393 -19430 -193335 -1246 -231331 22515
19278 -87585 -139323 286248 -178637 -142945 22547 66746 90389 14942 -116852 207456 194005
19267A94005b05723g8203F3806B9943d9627p8978A50164m1057a47313D3289K95813
19256C39102A53404D9492P3834i1382C3802b82552H4558g6830j15419J4410B5459
19244h2508K8819C7277b03903j82378E0556J22779b88045a34523j4551m9951D20
19232A02791a71204O0161B9979a02553m00403E8680a83l23950P0468j91746a79846
19220d72287d0327j45388h678r8384j59050h209B34d92238J41991a50872j65961
19209c16833G2549j0444i5393A63505a55248h488k27587j10681A5270g021A18746
19197a03135B56212a57699E0901K1050k6241e4804a2290j76344P2555A2181K50276
19186B62457a8902j27311N961A31343b68529A83184o3035a04570c4525G0239c0768
$$ plain form
19267 194005 -205723 -78203 63806 29943 -49627 -128605 150164 109107 -147313 43289 339102
19256 339102 153404 49492 123326 -91382 33802 -282552 84558 -76830 -192249 -177839 25459
19244 -82508 -53689 37277 -203903 -386281 50556 173335 -288045 -134523 -149074 -199025 420
19232 102791 -171204 -111043 29979 -102553 -502956 58680 -183 -324133 -253665 -445411 -179846
19220 -472287 -40327 -185715 -8678 -107062 -266112 -8209 234 -492238 -350247 -150872 -316833
19209 -316833 72549 62105 -95393 163505 -155248 -8488 -236075 -346756 15270 -7021 118746
19197 -103135 256212 -157699 50901 71951 45710 -54804 -12290 -188634 -116079 12181 262457
19186 262457 -18902 -146213 -140252 131343 -268529 183184 120149 -104570 -34525 70239 -30768
19174A69836a85011Q9371j6912j71541o8424a26894A86286c39333a02117A79758
19163H5723a16129D7173J85403E6657J610b29730b3592m91k24092d64l13851C976
19150C63415c3649k79319B2491a1793k5303k2204a3161j21399j30350M9609D2739
19138b25693j18987J62486b8131A25569n3192j4030a89475k9492a4102D2848g9300
19126a74120h5770M691j39482K8806r3624L4155d7076j54793j42794a41081c3705
19114a85054a3805j35950A16298j3290h1314j52460B09596b46780d9206J8686
19104c0520C2674a42139j44689m0351k9800e8869F0609a36414O6339k1601j64447
19093b56123A27429J8736A6821b61123J30183c6256a0653B4593L0771K10821d0270
$$ plain form
19174 169836 -185011 -95640 -112552 -284093 -352517 -126894 186286 -339333 -102117 179758
19163 85723 -116129 47173 232576 56657 58267 -229730 -23592 -24083 -248175 -464 -314315 3976
19150 363415 -33649 -312968 22491 -11793 -37096 -59300 -13161 -134560 -264910 -215301 42739
19138 -225693 -344680 -182194 -28131 125569 72377 58347 -189475 -218967 -14102 42848 -79300
19126 -174120 -85770 -81079 -220561 -191755 -285379 -251224 -47076 -201869 -344663 -141081 -33705
19114 -185054 -13805 -149755 116298 103008 -81314 -233774 209596 -246780 -49206 -30520
19104 -30520 32674 -142139 -286828 -327179 -356979 -58869 60609 -136414 -70075 -91676 -256123
19093 -256123 127429 146165 16821 -261123 -130940 -36256 -10653 24593 55364 266185 -40270
19081A18178a07309k92815e8889E7874K4298f1847D5398E980a74676C29738a236
19069b37052f4592D4933b51897e4044B63895J83099b40044j94926e1724F8704
19058a9742C76396n6832i0713k0952N2234n1463G7972a70224p8221A45896c50547
19046B41506H0051L02738j18125F2723C0796K8532K15823d5899r0868c9535j62977
19035b02512C3626a84948a0756j98900B21503C8735a73442f0422C8290A1717b29529
19023B62833B301M9163K76887H0670K8544j6251m6376b3574k46715B36559h2840
19011H2001a6809r4537j83057a39982j70173A56379b81454A61332D5937g3008
19000b24073A83615r0905c09693i4572d1195a8731l6472o3690L1557j13984k098
$$ plain form
19081 118178 -107309 -400124 -58889 57874 82172 -61847 45398 5980 -174676 329738 -1236
19069 -237052 -64592 44933 -251897 -54044 263895 446994 -240044 -434970 -51724 68704
19058 -19742 376396 319564 -90713 -111665 -59431 -110894 77972 -170224 -248445 145896 -350547
19046 241506 80051 382789 264664 62723 30796 59328 275151 -45899 -136767 -39535 -202512
19035 -202512 33626 -184948 -10756 -209656 221503 38735 -173442 -60422 38290 11717 -229529
19023 262833 2301 51464 328351 80670 109214 92963 46587 -23574 -270289 236559 -82840
19011 82001 -16809 -111346 -294403 -139982 -310155 156379 -281454 161332 45937 -73008
19000 -224073 183615 92710 -309693 -94572 -41195 -18731 -55203 -118893 -87336 -201320 -203418
18989b03418f2384B59073a10290A28197a18732J8637j06154B3412M5268a1512
18978D4425a93515B1690J62270a35817j02106A22247d4797o4779D3368f4513h15
18966b27165a11129j71538E3682c26609A77883d18893a19284j06330B37419G870
18955H0021a21130b0984R12A8198a47728A43756l3520J7390b9306B17911G0946
18943d58221a45046H2390a33289D12a83805N4342E23999A209b03046a5733m6610
18932f2343j52766A77160c1308A67470E3477a4427q4694k96527a897A29278o4473
18921F4805a75225J675A68924e45547d2126l25133a20681C9165b34344C38248
18910a3147H1176b06805r0142b581l58959j9141c1076l94207F7396b8968I3819
$$ plain form
18989 -203418 -62384 259073 -110290 128197 -118732 -100095 -206249 23412 68680 -11512
18978 44425 -193515 21690 183960 -135817 -237923 122247 -44797 -109576 43368 -64513 -815
18966 -227165 -111129 -282667 53682 -326609 177883 -418893 -119284 -225614 237419 7870
18955 80021 -121130 -20984 -20072 18198 -147728 143756 110236 127626 -29306 217911 70946
18943 -458221 -145046 82390 -133289 412 -183805 -129463 523999 1209 -203046 -15733 -62343
18932 -62343 -215109 177160 -31308 167470 53477 -14427 -99121 -395648 -1897 129278 64805
18921 64805 -175225 -173550 168924 -545547 -42126 -367259 -120681 39165 -234344 338248
18910 -13147 81176 -206805 -296947 -2581 -361540 -380681 -31076 -425283 67396 -28968 93819
18898A10370a99679m2626a14056G3733k3468i7888A78012N7135j05928E9045d53253
18886b6926j96806F6408f1861A03344a28261C17431e6696m1681M3561B21940c17998
18874B03119a37907a5085H8023a086H9106b43388E8420K83529b44536a09491p2315
18863a81806l220h2663B12159d44200a91308q8057g9673c9548r3198A0680M70217
18852D80897A71418a54112M2727j17402A72718C8127c10270f9856l3720a1043
18841A63902a16083M2857j87134J18268j11969Q0627E5095a3502j38710P436L7351
18830a07425C24430a03324g333I8774a34293D30281g1624I4593b88650J15164
18820a73486l9039B23049J06731a06436B08873a0056k8598A13662m2686M2289
$$ plain form
18898 110370 -199679 -242305 -114056 73733 50265 -97888 178012 235147 129219 59045 -453253
18886 -26926 -223732 66408 -61861 103344 -128261 317431 -56696 -98377 -54816 221940 -317998
18874 203119 -137907 -15085 88023 -1086 89106 -243388 58420 341949 -244536 -109491 -181806
18863 -181806 -185026 -82663 212159 -444200 -191308 -279365 -79673 -39548 -132746 10680 480897
18852 480897 171418 -154112 -111385 -228787 172718 38127 -310270 -69856 -103576 -11043
18841 163902 -116083 -73226 -260360 -142092 -254061 -173434 55095 -13502 -152212 -144776 -107425
18830 -107425 324430 -103324 -7333 98774 -134293 430281 -71624 94593 -288650 -173486
18820 -173486 -212525 223049 329780 -106436 208873 -10056 -38654 113662 70976 113265
18810A13265j4786D9171b5136o1796D7509d4847A32426A6144d4312k32592P564
18799b69340n1315d5383k00548B5546L16407d4725b0232F0547A414g6237q3361
18788a59598d5040a6893k43697J19773K7250A75777a57263C4818c31269J47593
18778a83676A46086a43244f1649B03123c10461J25165o4808j0552H3249f0648
18767A02444d4063q6709A74249e8453A27275b65828g3340k48070O8465A68983
18756a94965C26038b03001l531L8281J8218F1339f4437m5255B08829a36607k61544
18745c98151a94554i1892L9288j05840g2133l30651J75446K2289f9525o3486B62696
18733B11460C8234c45949H3338c9932k74153J38807a6822C12311c9071A74028
$$ plain form
18810 113265 98479 49171 -25136 -86932 47509 -44847 132426 16144 -44312 -276904 -269340
18799 -269340 -320655 -45383 -245931 25546 341953 -44725 -20232 60547 1414 -76237 -159598
18788 -159598 -45040 -16893 -260590 -140817 -113567 175777 -157263 34818 -331269 -183676
18778 -183676 146086 -143244 -61649 203123 -310461 -185296 -250104 -260656 83249 -60648
18767 102444 -44063 -130772 174249 -58453 127275 -265828 -73340 -321410 -252945 168983
18756 -194965 326038 -203001 -206532 -168251 -150033 61339 -64437 -109692 208829 -136607 -398151
18745 -398151 -194554 -91892 -52604 -158444 -72133 -402784 -227338 -205049 -69525 -133011 262696
18733 211460 38234 -345949 83338 -39932 -314085 -175278 -16822 312311 -39071 174028
18722F0200a92668p6777A10224J87407c47664J25786j75393J96124O2302C58352
18711A66051a78449f4375B7202J52440E9858b36772J06989c1692j78197I6439
18700f2135f096k47517A29003J56048A9416c03685D22175E5143g9115A5276i9262
18688b47962j00503B52929q2955c2879A56629o6157a6795q2704a9535k71675d1932
18676f1470A45053e2805j14774r864C33687b24652G1056O5641c6948I3505a05821
18664d5736B35465K46470I7747a29642C9766A7876d0677a8556l81489J95611A7500
18652b75932p6840R0132a05287I6639g8306l17795B73266e1766J2224m16083C7019
18640a4112C485g2404r4043k11416I8270O0091i5506I8703h8649E3701B5483J7863
$$ plain form
18722 60200 -192668 -269445 110224 297631 -347664 -221878 -397271 -201147 -138845 358352
18711 166051 -178449 -64375 27202 179642 59858 -236772 -129783 -31692 -209889 96439
18700 -62135 -6096 -253613 129003 285051 19416 -303685 422175 55143 -79115 15276 -99262
18688 -247962 -348465 252929 169974 -32879 156629 90472 -16795 -99499 -19535 -291210 -41932
18676 -61470 145053 -52805 -167579 -177443 333687 -224652 71056 136697 -36948 93505 -105821
18664 -45736 235465 481935 97747 -129642 39766 17876 -40677 -18556 -400045 -204434 17500
18652 -275932 -352772 -262640 -105287 96639 -78306 -396101 273266 -51766 -39542 -455625 37019
18640 -14112 3485 -72404 -166447 -377863 98270 158361 -95506 98703 -88649 53701 25483 43346
18628D3346i3747A60795e6509m9562B2113a30747B3265a90631I8254Q6567a60468
18616f2736G4179J01663d84G6516f6765F2850e25417d7986l536C15939c42197
18604a83298d0548j36251Q6817l59034A30433c29613e0311m2766A75676F4073
18593H7544b01205I9885J7957a40540m859E0162b49883J9605Q8867B58289j19061
18582A39228f1474f673r1828k2658p4604j44419b7952l10714h2932k02021L838
18571b81115B73353j04513f0957B11259B0199b69958B11376k7190J92335A07724
18560A1571b14479F6707K52754g5485A00114h3478N712K9336A8864Q4412J39798
18549B43074d47107B7388d76140a17566l12907E85148d25286A34747m2952f8571
$$ plain form
18628 43346 -93747 160795 -56509 -106071 22113 -130747 23265 -190631 98254 184821 -160468
18616 -62736 74179 175842 -484 76516 -66765 62850 -525417 -47986 -51522 315939 -342197
18604 -183298 -40548 -176799 -89982 -449016 130433 -329613 -50311 -93077 175676 64073
18593 87544 -201205 99885 117842 -140540 -145399 50162 -249883 -230278 -141411 258289 139228
18582 139228 -61474 -6673 -98501 -121159 -195763 -340182 -27952 -338666 -82932 -284953 -281115
18571 -281115 273353 168840 -60957 211259 20199 -269958 211376 184186 376521 107724
18560 11571 -214479 66707 319461 -75485 100114 -83478 -77766 -48430 18864 103276 243074
18549 243074 -447107 27388 -476140 -117566 -430473 585148 -425286 134747 91795 -68571
18538a29840N9494B02027c24260o919a27961o1057E955R5201k0404a85801A08807
18526A65066e8574D5095P0153J21481b24499I1522a4770m6085j70327d181C385
18514i1914A8085a37164G9690K02627P8880j62196a30220a556B01048b11974M2368
18503a69606P466N7403l34311C3150b89204A01307f1662k62782J38314D8973L2650
18492H1623c8710A80940A6243M0802b28693B82751A0917a6656l07842a32296K7277
18481a05019e0436I3270b4646k99700J6382d3316A7557a24378e5536K974j58186
18470b10748d5509k84262a52606j55780A04477a7493B16093i6577D82g9552G6108
18458a30243d8006k59295A21809B4954g3937A63636a53627P1673C4451c41959
$$ plain form
18538 -129840 -70346 202027 -324260 -331179 -127961 -189018 5955 101156 80752 -185801 108807
18526 165066 -58574 45095 115248 236729 -224499 91522 -14770 -60855 -231182 -4181 3385
18514 -91914 18085 -137164 79690 282317 361197 199001 -130220 -1556 201048 -211974 -169606
18503 -169606 -162140 -104737 -439048 33150 -289204 101307 -61662 -324444 -186130 48973 81623
18492 81623 -38710 180940 16243 57045 -228693 282751 10917 -16656 -324498 -132296 -105019
18481 -105019 -50436 93270 -24646 -324346 -307964 -43316 17557 -124378 -55536 -52562 -210748
18470 -210748 -45509 -329771 -152606 -308386 104477 -17493 216093 -96577 482 -79552 76108
18458 -130243 -48006 -307301 121809 24954 -73937 163636 -153627 -81954 34451 -341959
18447e36815A70543L9316b5858k31139Q1195A13795a36809n0295b2640b676l65674
18436c68350A32348D0331K64203d2625l61340D4933a97704F2451b84993N9342
18426b25651A44464c3204j21790C77949b64247g1106p7666J920C9168A0250I00
18414d10224A58340b56202J27062k7631N9990B27169A4855c78420K0556a5905
18403a55456A3911b37351a17752A24029J22074J5731c82519A26384a94804Q7767
18393a07037N2829A66367c14387B81299a62112P7721B9330J42578c7114C9369
18382F0428b5851k50497j61915A16853g5846r9848A18125a73468B63520H0238
18371b36825f3776A71447C0796a8838A79959i7119k92862A93411E5083d6848A09428
$$ plain form
18447 -536815 170543 209859 -25858 -256997 -175802 113795 -136809 -187104 -22640 -2676 -368350
18436 -368350 132348 40331 304534 -42625 -403965 44933 -197704 62451 -284993 -225651
18426 -225651 144464 -33204 -154994 377949 -264247 -71106 -148772 -146852 39168 10250 900
18414 -410224 158340 -256202 -129140 -156771 -96781 227169 14855 -378420 -357864 -15905
18403 -155456 13911 -237351 -117752 124029 246103 261834 -382519 126384 -194804 -107037
18393 -107037 -54208 166367 -314387 281299 -162112 -84391 29330 171908 -37114 39369
18382 60428 -25851 -276348 -438263 116853 -75846 -175694 118125 -173468 263520 80238
18371 -236825 -63776 171447 30796 -18838 179959 -97119 -389981 193411 55083 -46848 109428
18359b9525j5219j94676i4588G6428a22429E50f2834r9378R048F1412R1331J09541
18347B62284p9942l5469k4146b63483a15617c0930k4063k84068B58564G1196a21270
18335a65886r9268e360A92030A7228a54804j30308a04089L6114D6331J72450a19627
18323a57580O8892A28074k9501b52099B14187o6080a64024M2686H2866a22596
18312A80792b47562N879o191B24080c12766a43734P821D3981J8684Q4587l0178
18301A17074d6599j15043o14a5874j39038E5169e4664h762j22798a5937F8901
18289b98093B2316Q7215N5987a53428D2659g8898J8004A41241K2342o4696J37937
18278B36824a82072K0078o9810k1331A11874D665a09887A34724g8832D7205g2737
$$ plain form
18359 -29525 -44744 -239420 -94588 76428 -122429 550 -62834 -162212 -153164 61412 152743 262284
18347 262284 182342 146873 122727 -263483 -115617 -30930 -54993 -339061 258564 71196 -121270
18335 -165886 -265154 -5360 192030 17228 -154804 -285112 -104089 -67975 46331 218781 -119627
18323 -157580 -88688 128074 98573 -252099 214187 148107 -164024 -121338 82866 -122596
18312 180792 -247562 -241683 -247874 224080 -312766 -143734 -135913 43981 62665 147252 117074
18301 117074 -46599 -161642 -162256 -15874 -154912 55169 -54664 -8762 -131560 -15937 68901
18289 -298093 22316 109531 165518 -153428 42659 -78898 -60894 141241 163583 98887 236824
18278 236824 -182072 -161994 -231804 -253135 111874 4665 -109887 134724 -78832 47205 -72737
18266c8746k5930A82409b23545G1938N9915f9231K2639C31689e7365j56267H3554
18254A57521n8278c5523k03995R6402f0540o1599I0297B351a29718j41278e9436
18242G6021J03651F006O3102d12167a31402G0133Q4854d23615J77399a3708k23105
18231b36813m6269A78586a52869a2297a040H8169D2459L6910b56521N8812O9420
18220a28289j38871c0248k4838a5552F2455d45915G1305J8216h0092n6520O1008
18209g5604B34697f35229F2512d61j02735d3756j87667A62341a19774B50949a01498
18197A56817a10112j78889F1426b29692l08907C00451a79300J3874p1302C4006
18186c21390A71321a41762M9739B858a50132C46168c10068e593B4597L2093E38
$$ plain form
18266 -38746 -64676 182409 -223545 71938 131853 -69231 -46592 331689 -57365 -213632 83554
18254 157521 99243 -35523 -239518 -143116 -60540 -122139 90297 2351 -129718 -270996 -59436
18242 76021 179672 6006 69108 -412167 -131402 70133 154987 -423615 -246216 -13708 -236813
18231 -236813 -283082 178586 -152869 -12297 -1040 88169 42459 79369 -256521 -197709 -128289
18220 -128289 -267160 -30248 -55086 -15552 62455 -445915 71305 89521 -80092 -136612 -75604
18209 -75604 234697 -635229 62512 -461 -103196 -43756 -231423 162341 -119774 250949 -101498
18197 156817 -110112 -289001 61426 -229692 -538599 300451 -179300 -165426 -236728 34006
18186 -321390 171321 -141762 -92023 2858 -150132 346168 -310068 -5593 24597 56690 538
18174h8831n073b5628C25070C1741a27129o515b5721f07k8545F9676a44580m786
18162a49366a4539B1973J96558b6520D3825J49440a93766A41674i9686A94847
18151b99285D7328a50104k41670J37399M5083a1294D1840a80127j43794n3144
18141c77065C53013e0421E306K318a16628d3332K0802I4222b5377B16270N8787
18130B75057a46174A9433J11118C4599a13143M3332m0388k4912K4237b8655k62522
18119b91177B32918h8966j1276j4143A18555J8438M9782a82967M072e8105A49050
18107f587B2142i0472j50343f1489j81030L1829f1474c116j15098A33711g6765
18095A31358a19293j6196A1627a36191A24509c02140a42594j40334B4417N3265
$$ plain form
18174 -88831 -93904 -25628 325070 31741 -127129 -133644 -25721 -607 -29152 69676 -144580 -149366
18162 -149366 -14539 21973 218531 -26520 43825 193265 -193766 141674 -99686 194847
18151 -299285 47328 -150104 -391774 -254375 -209292 -11294 41840 -180127 -323921 -377065
18141 -377065 353013 -50421 5306 7624 -116628 -43332 -22530 94222 -25377 216270 275057
18130 275057 -146174 19433 130551 34599 -113143 -69811 -110199 -135111 -110874 -28655 -291177
18119 -291177 232918 -88966 -100242 -114385 118555 136993 186775 -182967 -178895 -58105 149050
18107 -6587 22142 -90472 -240815 -61489 -242519 -210690 -61474 -3116 -118214 133711 -76765
18095 131358 -119293 -135489 11627 -136191 124509 -302140 -142594 -282928 24417 77682
18085G7682c9422a2899A9695J08445a27134A02116b07317A60814a08014r9451
18075b07465p724G087a2507A43865b00847a2251j7965k63126A77033a17627J0664
18064a06963J9143j03682A16367B6529J4769b32709B19698b85882i7957j2873
18054a10830B17381j02961b35225o7627G5583b07042D3598b45218d6921l9835
18044h6756b9628A94056d1342I113a40337C2043M05693f5048j13052A17861c76894
18032a70557m2463G2812d08250i052A31511d5303p0399L7838H3416o697b13391
18020A88515a56390j28591A52350D4776a16574J3970b4386q0796B419J70686E0748
18008B36682a34527F3887a46107E7140a21094A75451D3994L9165a61859N9979
$$ plain form
18085 77682 -39422 -12899 19695 128140 -127134 102116 -207317 160814 -108014 -207465
18075 -207465 -215189 7087 -12507 143865 -200847 -12251 -30216 -293342 177033 -117627 -106963
18064 -106963 -87820 -191502 116367 26529 41298 -232709 219698 -285882 -97957 -110830
18054 -110830 217381 114420 -235225 -302852 75583 -207042 43598 -245218 -46921 -86756
18044 -86756 -29628 194056 -41342 9113 -140337 32043 437736 -65048 -178100 117861 -376894
18032 -170557 -213020 72812 -408250 -9052 131511 -45303 -115702 -77864 83416 76719 -213391
18020 188515 -156390 -284981 152350 44776 -116574 -102604 -24386 -105182 2419 173105 50748
18008 236682 -134527 63887 -146107 57140 -121094 175451 43994 83159 -161859 -101880
17998a01880I830K15497B0159K42143D4632f286k95390A26581a3939E9327L05161
17987C64488j2160A10330e1673k18459G5001b1838C16219J03635a13328I2491
17976b12470K4749B82444J25043h6888B9109b37322F7135a11534C19490j42190
17966A77300m8235B6881J22105N1638e7355N870A59428c03261B8445a68771L0461
17955a38310e6296H7190a00896j60245B49372H9785b6247C71111a83515A37562
17944e3884j89463A01056d60445g502k96272j10944K06741A47509d6623k44781
17934b91404A40872l136j9578J95946B5488j1595K64535D2799d41812C946d4976
17922b63692A44076a43482I6805J19289a23737L6226k33424J19954L1174f3113
$$ plain form
17998 -101880 9830 225327 20159 262302 44632 -6286 -301676 126581 -13939 59327 364488
17987 364488 352328 110330 -51673 -270132 75001 -21838 316219 419854 -113328 92491
17976 -212470 -187721 282444 407487 -86888 29109 -237322 67135 -111534 319490 177300
17966 177300 129065 26881 148986 200624 -57355 -51485 159428 -303261 28445 -168771 -138310
17955 -138310 -56296 87190 -100896 -261141 249372 89785 -26247 371111 -183515 137562
17944 -53884 -243347 101056 -460445 -7502 -303774 -414718 -207977 147509 -46623 -291404
17934 -291404 140872 137736 118158 314104 25488 13893 278428 42799 -441812 3946 -44976
17922 -263692 144076 -143482 96805 216094 -123737 -87511 -320935 -200981 -169807 -63113
17911a24695e2298C33157b09158F3433a54335A2927E169L18684b64632B31050
17900A92170a92695D8963c1276A44628L3174J89724c58704a57682b714m00252
17890d02966d9586o2115N4852l4067j20843a7781C1834O5655b5834k18041C48313
17878B8166c02522c8740C54652C1283l257J44084m3261N6441a37587c9616a6765
17866a43334l9503d4319m75171c2377m7060A8922g1423B13681a47656r5001l2760
17855b75417f6127k2928j19192N5503B50953C1795J22551n9715h9823j31935b2457
17843E0163L41351d15400h7153Q614A37208O7167C2431J7842c43478A01320B3924
17831b12829p650d6994k24940H2763A0300b3089E414J20058a27318H2052A489
$$ plain form
17911 -124695 -52298 333157 -209158 63433 -154335 12927 5169 323853 -264632 231050
17900 192170 -192695 48963 -31276 144628 177802 367526 -358704 -157682 -2714 -402966
17890 -402966 -49586 -111701 -56849 -90916 -211759 -17781 31834 97489 -25834 -243875 348313
17878 28166 -302522 -38740 354652 31283 28026 172110 128849 185290 -137587 -39616 -16765
17866 -143334 -182837 -44319 -519490 -32377 -79437 18922 -71423 213681 -147656 -242657 -275417
17855 -275417 -66127 -89055 -208247 -152744 250953 31795 154346 94631 -89823 -221758 -22457
17843 50163 391514 -415400 -87153 -78539 137208 204375 32431 50273 -343478 101320 23924
17831 -212829 -220479 -46994 -271934 82763 10300 -23089 5414 125472 -127318 82052 1489
17819A24094B3578a25733R567j04072d5189k56981B83299H6533O161a15173A57538
17807c10735A98698o5287a88232A50268k149J65746a22026a0100k6189j75143
17797b11432c8821A09153b26384A51013d5820l5887B60252a99093A47440b17578
17786b22457P0214g1548L2037k6093B02349g8041C1479K3366g8292H9885b1245
17774F2956f7684J1323G7070b24758L2159A26385m4225C8556c2077k8312B9762
17762a26167A10970i9692k54955B8731a84979D11238A5564J51622i2569B24733
17751C33318a61919N7730A27784j3188f1489H3398K06531b88590C2452K65254
17741B97706H9099C392J33313b89507A27390G252J04896j6432a66387k7497f1096
$$ plain form
17819 124094 23578 -125733 -116166 -220238 -45189 -302170 283299 86533 92694 -115173 157538
17807 -310735 198698 133411 -188232 150268 148119 313865 -122026 -10100 -36289 -211432
17797 -211432 -38821 109153 -226384 151013 -45820 -81707 260252 -199093 147440 -217578
17786 -222457 -152243 -71548 -39511 -65604 202349 -78041 31479 54845 -78292 89885 -21245
17774 62956 -67684 -56361 77070 -224758 -192599 126385 82160 38556 -32077 -60389 29762
17762 -126167 110970 -99692 -354647 28731 -184979 411238 15564 167186 -92569 224733
17751 333318 -161919 -104189 127784 114596 -61489 83398 289929 -288590 32452 297706
17741 297706 89099 3392 136705 -289507 127390 7252 112148 95716 -166387 -193884 -61096
17729E21586B29508a48200B12534a36917D638a75048A01785J35436a32579M9135
17719h3444I648R4642b00809A1162d03865c2111B36059I2861m3091J95383f0804
17707i2287B21438C1326K11381C5457a83232R0842a6853C1946a5225k18907G4299
17695a81865G9385C9447L3220a40286a1650l52999a49939B85011a91529A68067
17684B54937a21150j5848R068j2256A87703n8062N8524h8824A45676c25718D20931
17672b28543B26880j13388L44834b03453K1455d2612A4486J09974H816J73832
17662A82648M2394O8958A02809h058D60376h6730C98712b54923A18009l9196a88913
17650b1932L415A2535g579F2556b92595A15610l4408M5504b69366A72061k0539
$$ plain form
17729 521586 229508 -148200 212534 -136917 4638 -175048 101785 237221 -132579 -83444
17719 -83444 9648 104290 -200809 11162 -403865 -32111 236059 92861 49770 245153 -60804
17707 -92287 221438 31326 242707 35457 -183232 -92390 -16853 31946 -15225 -234132 74299
17695 -181865 79385 39447 72667 -140286 -11650 -364649 -149939 285011 -191529 168067
17684 254937 -121150 -136998 -127930 -140186 187703 129641 188165 -88824 145676 -325718 420931
17672 -228543 226880 113492 458326 -203453 -181998 -42612 14486 124460 8816 182648
17662 182648 225042 294000 102809 -8058 460376 -86730 398712 -254923 118009 78813 -188913
17650 -21932 -18517 12535 -7579 62556 -292595 115610 81202 126706 -269366 172061 151522
17639A51522f2902j27488M1923C44093e7735o9662C13744a969A29135d0879a5561
17627H4782d5445C18576A51064i2858r3432A15031R4625G0142d534j07087c8198
17615A51979J62582d1225M550D7719a86055b6064l20224R6496i40j24084A08863
17603d0311a2471j34371A37625L9335B1134J23879g7982C28705A56840i3716H2129
17591D7324K6695a40097D9611L25771a89433p2510b6091C30601p5559F3525P4872
17580A38397b9798k74999e1165A47688i3066h708B84978J83840a71126B70091
17569a09981L2152A84091d6498C090a12932G3978q252a08145B02514a38542A16861
17557a41745C66978d36374D16990J9780a58432k67984J13888J53886C09410p9746
$$ plain form
17639 151522 -62902 -190390 -148467 344093 -57735 -127397 313744 -1969 129135 -40879 -15561
17627 84782 -45445 318576 151064 -92858 -186290 115031 209656 70142 -4534 -111621 -38198
17615 151979 314561 -41225 -36675 47719 -186055 -26064 -346288 -249792 -940 -125024 108863
17603 -40311 -12471 -146842 137625 176960 21134 145013 -77982 328705 156840 -93716 82129
17591 47324 74019 -140097 49611 375382 -189433 -261943 -26091 330601 255042 63525 138397
17580 138397 -29798 -304797 -51165 147688 -93066 -8708 284978 468818 -171126 270091
17569 -109981 -77829 184091 -46498 3090 -112932 73978 65726 -108145 202514 -138542 116861
17557 -141745 366978 -436374 416990 436770 -158432 -426416 -312528 -158642 309410 229664
17547B29664h662G4862j4317J58908F0814N3252i7997D5268R5593c14752A38983
17535A5392K64579f9136r4228P7290O060o8195A31372n3628J15079M7110P7393
17524C17326A11675L48606A94892A4484J40973b06937Q4583L6061C05701l0447
17514B75254a53014A23708h9975I716d9645D6961K3697h1885m066A37793j0196
17503A27597b06751E7975R277J90666E0786L13553C380b23448I5288A2549b00131
17491A6525L61206j56522J3364J39259B1774K5875J70686m9187J56765L4905A74025
17479C54217A37051a07118B67389I3293N9909e4903B49837K27802c71086B45711
17468D02619a07428A09909J36858H0016k744c57076B47739b51178f1931a5319
$$ plain form
17547 229664 -8662 74862 60545 219453 60814 114066 -97997 45268 140861 -314752 138983
17535 15392 279971 -69136 -163364 -86074 -80014 -148209 131372 77744 192823 239933 317326
17524 317326 111675 460281 194892 14484 155457 -206937 -122354 -86293 305701 275254
17514 275254 -153014 123708 -89975 9716 -49645 46961 70658 -81885 -85951 137793 127597
17503 127597 -206751 57975 67252 257918 50786 364339 3380 -223448 95288 12549 -200131
17491 16525 377731 221209 234573 373832 21774 47649 218335 169148 325913 360818 174025
17479 354217 137051 -107118 267389 93293 153202 -54903 249837 477639 -371086 245711
17468 402619 -107428 109909 246767 80016 77272 -357076 247739 -251178 -61931 -15319
17457B33705N7133B174M53332O3749I8329J22922r2576N5303j7821L8439J09383
17446C13979r9096J58787o8201A43501O0741M94719B55555P7849j62810p4989
17436I5605K21840M839J0908m4305J04348c8285H6663K71883r0356b30962H4250
17424b71415I6326L41605j45645j13052D1042J83964M376J6768c5546B98445j11117
17413A87328J24501I4812J26123q2294L2927J81943A16215D4671e1310B51953
17402A97710I871a4333G0440a43070B66824J26068i2304B87704j14624L8825J08986
17391C20891A12601c9276A24452n1201l4932I73a54988B08766F1075P5890J8852
17380A55817f2638k3866D26206A80608a7525A94054a7418C66602J03116a42499
$$ plain form
17457 233705 290838 2174 455506 519255 98329 221251 128675 183978 166157 204596 313979
17446 313979 214883 373670 305469 143501 204242 698961 255555 333404 170594 95605
17436 95605 317445 322284 333192 288887 393235 -38285 86663 358546 268190 -230962 84250
17424 -271415 96326 437931 292286 179234 41042 225006 229382 246150 -35546 298445 187328
17413 187328 311829 94812 220935 138641 171568 353511 116215 44671 -51310 251953
17402 197710 9871 -14333 70440 -143070 266824 392892 -92304 287704 173080 211905 320891
17391 320891 112601 -39276 124452 73251 38319 973 -154988 208766 61075 136965 155817
17380 155817 -62638 -86504 426206 180608 -17525 194054 -17418 366602 469718 -142499
17369d5352B32135q8619Q8469a49677B18450H7051P0359j1145K28818A02067P8665
17358A80732K7855a37480A09332e5128D44613A69382B2048L65372E436a93585
17347C0778J19270J64669B1936J69319K3567m2023a02806B04678k6664a9416k6108
17336d5524E4991K76819p1377j17247a792H2218K37192l7052r4400J19546n3024
17325B54480j07834b906B09852F6596d4558D94627B07147a91001B1745Q7418J69466
17314B78629f5615A25333J53055J07287K0236B8635J46384K0087m7129J08196
17304B56173E9826d6114C87083r4581J44465A84359H9505k5401J31011o6605J07616
17293B36126M71283B7887J02175R4753C0603K38865K04183A31715P8377E6751
$$ plain form
17369 -45352 232135 143516 231985 -149677 218450 87051 157410 146265 375083 102067 180732
17358 180732 208587 -137480 109332 -55128 444613 169382 22048 387420 5436 -193585
17347 30778 150048 314717 21936 191255 214822 172799 -102806 204678 178014 -19416 -45524
17336 -45524 54991 331810 260433 143186 -1792 82218 319410 282358 187958 307504 254480
17325 254480 146646 -2906 209852 66596 -44558 494627 207147 -191001 21745 109163 278629
17314 278629 -65615 125333 278388 385675 405911 28635 175019 195106 147977 256173
17304 256173 59826 -46114 387083 292502 436967 184359 89505 64104 195115 128510 236126
17293 236126 707409 27887 130062 224815 30603 269468 473651 131715 210092 56751
17282A74090G6495J27194m8997J91610m3991c6394e23A53566J12084n2523L020
17271B16147K5864B0478N26718f5139A76598K24468A7383I72L1635J26435b71855
17259A89901m0781a81014I2249P2281E6845a99407C62140q5955J12491A84064
17248B96426Q3362I4218a27484b6803A77646K29218j26502J40223p2120K15134
17238E63599A79738k1168p5701B3882a49180B71047j9024L9656n5584m8319o567
17227A81209J46124Q7853j04330j12351n7756J57412H1329J94387A36760K44942
17217C81702N5379P292H3435J12071M18953i584F72951j43528q2731F8998J26352
17206A95350m2536j389F4351J54506m7587R5653H0938J78166C309L6382j5022
$$ plain form
17282 174090 76495 203689 154692 346302 302311 -36394 -523 153566 265650 213127 216147
17271 216147 242011 20478 547196 -65139 176598 401066 17383 972 32607 159042 -271855
17259 189901 149120 -181014 92249 164530 56845 -199407 362140 276185 388676 184064
17248 296426 379788 94218 -127484 -26803 177646 406864 280362 420585 348465 563599
17238 563599 179738 158570 82869 23882 -149180 271047 252023 291679 236095 187776 181209
17227 181209 327333 415186 310856 198505 140749 298161 81329 275716 136760 381702
17217 381702 437081 444373 83435 195506 614459 -9584 672951 529423 446692 68998 195350
17206 195350 152814 151425 64351 218857 171270 266923 80938 259104 3309 39691 24669
17195B4669L63075F7684Q3433m693J30815A8398J35977J9653p5996L77092p114
17184D68010a16307L8580B52585I9146J32682K5329e3871C20207O601J020b10194
17172B27126o8174M56585E3432L78568h9471B37780F8691K55658j00344K16950
17162D40955P2522B16533K39323B10495K257O0433M6097m7422L28987B21049J17327
17151C38376J85352q1038m5292j65943l2095K95663b9000D43195j22493j56262
17141A64440J64788r739K45465k7500B64266l2811J46804r6862o4463M1695M4425
17130C03054M4207J45233A75760K93604Q7599r3402K3767k03023q0843K97968
17120E01430M8138D9664J32871K02156j73077M6639j11186L94468R0567A07385
$$ plain form
17195 24669 387744 67684 151117 146424 277239 18398 154375 174028 98032 475124 468010
17184 468010 -116307 -77727 252585 99146 231828 257157 -53871 320207 326808 327828 -210194
17172 227126 158952 615537 53432 432000 -89471 237780 68691 324349 224005 440955
17162 440955 513477 216533 455856 210495 212752 273185 319282 271860 600847 221049 338376
17151 338376 523728 442690 397398 231455 199360 495023 -29000 443195 320702 164440
17141 164440 329228 319489 564954 537454 264266 231455 378259 281397 216934 258629 303054
17130 303054 347261 492494 175760 469364 556963 463561 487328 284305 203462 501430
17120 501430 549568 49664 182535 384691 211614 258253 147067 541535 632102 107385
17109I8213L90757n1870K28703A82869J84525L2478j3668j03250J67563O3710
17099E14227K5810A79384q375G4140L41128N1232j01343k7525M71363B65936K09016
17088D74952P8170j28682p8374r623r5857K07422J62487A98083K49116R4157O2801
17077F04157k46282L37620C37416m4197J3673K31004k61885L359L84276k7642
17067F36004j07045r2994O428j43623m1712L10305j49267R5484J14949j57559
17057D70970M2195J32932A70251K93544j73358J24530J37756j29608K19779C07473
17046B92289N04600J30032l22484k58913J99353j94106K48458p0229J04901q4279
17036E49622A19485M33916K26342J0136j615j52619k56350K79666j58118J03479
$$ plain form
17109 98213 488970 437100 665803 182869 367394 399872 386204 282954 450517 514227
17099 514227 540037 179384 171009 74140 415268 466500 365157 337632 808995 265936 474952
17088 474952 553122 424440 346066 336443 240586 448008 610495 198083 447199 541356 604157
17077 604157 357875 695495 337416 293219 306892 537896 276011 279370 663646 636004
17067 636004 528959 435965 442393 298770 257058 567363 418096 513580 628529 470970
17057 470970 513165 646097 170251 463795 290437 414967 552723 423115 642894 307473
17046 292289 796889 926921 604437 345524 544877 350771 599229 529000 633901 549622
17036 549622 119485 553401 779743 789879 788264 635645 379295 658961 500843 604322
17026F04322j59767R5129K88761r5388k07690K45282C67109L30882k13647P50775
17016A235119n21554j93866n6175K39272L5558k34072M58340l27875K50494k60858
17006F24383J65895k5310J23831m05382l6726j29923L96166M3882j42863K65015
16996H78968Q0253j70203j89510J21151J05370J03035m04256J82442J10352j19874
16986F97728O7683L47951l47911p5952K6121o169k03841K36596K57776D64439
16975A211525m09015K33422R7895j70542j1400L1676m8058M90370m73480j7417
16965I34976J06316j57529J7019J88612p6006j94392K92937j38325J53692n13442
16955F13858L75629J42051j89241L86071j28277j18432L23087J9640m69555J51523
$$ plain form
17026 604322 444555 539684 828445 733057 525367 770649 367109 697991 484344 1235119
17016 1235119 713565 519699 463524 702796 738354 504282 962622 634747 885241 624383
17006 624383 790278 764968 888799 483417 446691 316768 712934 756816 613953 878968
16996 878968 959221 789018 599508 720659 826029 929064 524808 707250 817602 697728
16986 697728 765411 1113362 765451 689499 715620 709451 505610 742206 999982 464439
16975 1211525 802510 1035932 1133827 963285 951885 983561 935503 1425873 952393 934976
16965 934976 1041292 883763 900782 1089394 1013388 818996 1111933 973608 1127300 613858
16955 613858 989487 1131538 942297 1328368 1200091 1081659 1404746 1424386 954831 1106354
16945A106354l3310k62421L55235n4087m846L76818n0887l94350K22863R6918
16935A358287j82658J78541p8715J58251q1636Q5554l4147j61581K99405n10332
16925A030969K17802k30046N67387m77019J79638j02683J60920K08740p0259J23773
16915A609222j27004L75660o14106K41489k33150L31037J79568l17156R6779L7357
16905A579696j73662L60402k64895P0928K52216l24474L51K7469J03274K02218
16895A833523J18777j11929j09199n5922P6558J09603k15454J65327K21142L3963
16885B066389l1625r7546M17285j42210j80456J84024k53833K49730r8953L6573
16875B149378L06153j03406j28367J52474N20642k95811j17912K93640l09144
$$ plain form
16945 1106354 1073044 810623 1165858 1111771 1106925 1483743 1432856 1038506 1261369 1358287
16935 1358287 1175629 1354170 1275455 1433706 1352070 1437624 1403477 1241896 1541301 1030969
16925 1030969 1248771 1018725 1586112 1109093 1288731 1186048 1346968 1555708 1485449 1609222
16915 1609222 1482218 1857878 1243772 1485261 1252111 1583148 1762716 1445560 1542339 1579696
16905 1579696 1406034 1766436 1501541 1572469 1824685 1500211 1500562 1528031 1631305 1833523
16895 1833523 1952300 1840371 1731172 1675250 1751808 1861411 1645957 1811284 2032426 2066389
16885 2066389 2034764 1937218 2354503 2212293 2031837 2215861 1962028 2211758 2112805 2149378
16875 2149378 2455531 2352125 2223758 2376232 2896874 2601063 2483151 2776791 2467647
16866B467647J69849n03389O37178l39604J36294K65163l15370L38477k2895o1462
16856B771888K16581j60929k8162J62730J75295j55780J1289Q4669J82525k33553
16846C026553P4155J68656L34439j92547J48774o744R8799N9713K30678K52853
16836D195329m37316J26301J89125l27846M28683j50805L25877k12989o5892L42343
16826D412810j90185N91564n871J38916j05900M41831o67637O32870n2831J23857
16816E319424L35912K4826k99100O43999k43189J86628J14352J61048N9658J44885
16806F448443K58279J59710J71726P2455J51383J00996J64716J58427L11531k49139
16796G748527N94843l8865j2711N81529J46034P7706N38241K0471K19138K24738
$$ plain form
16866 2467647 2637496 2134107 2771285 2431681 2567975 2833138 2517768 2856245 2833350 2771888
16856 2771888 2988469 2827540 2799378 2962108 3137403 2981623 2992912 3077581 3260106 3026553
16846 3026553 3100708 3269364 3603803 3411256 3560030 3553286 3652085 3711798 3942476 4195329
16836 4195329 3758013 3884314 4073439 3745593 4174276 4023471 4349348 4136359 4070467 4412810
16826 4412810 4222625 4814189 4808318 4947234 4841334 5283165 4615528 5248398 5195567 5319424
16816 5319424 5655336 5680162 5381062 6025061 5781872 5968500 6082852 6243900 6303558 6448443
16806 6448443 6706722 6866432 7038158 7110613 7261996 7362992 7527708 7686135 7997666 7748527
16796 7748527 8343370 8304505 8291794 8873323 9019357 9097063 9635304 9655775 9874913 10099651
16786A0099651N29382K9927L38056N5427J59436O50447L03770L18335M54638J76899
16776A3115968M09659N93372L89151N45295K71743N47009O29410O50969M10289
16767A7562865N70922N33303J111216O03621K79441J054472O09681R83593J260246
16758B4569360O63450Q18418J728490M42989J279983J258808J865868J131800
16750C3759166J531541J667238J820849J810072K074328K320710K265149K398467
16742D9647520K626688K642867L041698L282501L357133L796825M036026M454534
16734G6885792N086234M769599N409449N466500O316446O313687O893007O842200
16726A23982914P379410P694969Q231358P702544P771885P145114P279787O363468
$$ plain form
16786 10099651 10629033 10658960 10997016 11052443 11211879 11862326 12166096 12484431 12939069 13115968
16776 13115968 13525627 14118999 14508150 15053445 15325188 15872197 16501607 17152576 17562865
16767 17562865 18133787 18667090 19778306 20381927 20661368 21715840 22325521 23309114 24569360
16758 24569360 25232810 26051228 27779718 28222707 29502690 30761498 32627366 33759166
16750 33759166 35290707 36957945 38778794 40588866 42663194 44983904 47249053 49647520
16742 49647520 52274208 54917075 57958773 61241274 64598407 68395232 72431258 76885792
16734 76885792 81972026 86741625 92151074 97617574 103934020 110247707 117140714 123982914
16726 123982914 131362324 139057293 147288651 154991195 162763080 169908194 177187981 183551449
16718A83551449N703021M324646L463228K285454Q69038n95319k395516l172047
16710A94033954m537146n697035o378193p183529p461739q056172q267890p743816
16702A38708434q134320p522359p050053p456812o417916o736976n201497n772016
16694H4416485n393133m721339m354022m027048l589918l475557l799314k956179
16686E2099975k826194k650669k356551k104884k093560k097881k102304j583919
16678C4284013j557551j530900j234402j721033q82002j009792j515843j186978
16670B3645512q32879p51307j125232o93688r23490n41365n54211q52328p91146
16661A6579866n29449p30260m08700m36368l73090o16760n94739k78742n83149
$$ plain form
16718 183551449 189254470 193579116 197042344 199327798 200196836 199601517 197206001 194033954
16710 194033954 189496808 183799773 177421580 170238051 162776312 154720140 146452250 138708434
16702 138708434 130574114 123051755 116001702 108544890 102126974 95389998 90188501 84416485
16694 84416485 79023352 74302013 69947991 65920943 62331025 58855468 55056154 52099975
16686 52099975 49273781 46623112 44266561 42161677 40068117 37970236 35867932 34284013
16678 34284013 32726462 31195562 29961160 28240127 27358125 26348333 24832490 23645512
16670 23645512 22812633 22061326 20936094 20242406 19318916 18777551 18223340 17371012 16579866
16661 16579866 16050417 15320157 14911457 14475089 14101999 13485239 12890500 12611758 12028609
16652A2028609j94538o16306J12417m16688l96635o26395Q1098j95058m12167
16643I364337k5024o25689j61400k04424l87038J3141o8039k20012m73365N430
16633G217917l73909j93731J04526j14849n67033J16638n27500L32730l94011
16624E600778l7631o4283k97608l4351j34293k13894o1923j84682J40921l22531
16614D390503J72311o8010m59563j50977K95067l43327R9495r6611Q217m6516
16604C800589j28738m0540l7355k76760J44730k86943j79463o8436M55269l13012
16594C069341j23132k43846K22262m0745j21353k37086K51452K02675l77257l74771
16584B227540J26144L32068k05582q1227j71922j85939N87802j92596l61593R6972
$$ plain form
16652 12028609 11834071 11217765 11330182 10913494 10516859 9890464 9971562 9776504 9364337
16643 9364337 9339313 8713624 8552224 8347800 7960762 7973903 7905864 7685852 7212487 7217917
16633 7217917 6844008 6650277 6754803 6639954 6072921 6189559 5662059 5994789 5600778
16624 5600778 5563147 5498864 5201256 5166905 5032612 4818718 4756795 4572113 4713034 4390503
16614 4390503 4562814 4494804 4035241 3884264 4179331 3836004 3935499 3838888 3847105 3800589
16604 3800589 3671851 3631311 3593956 3317196 3461926 3174983 2995520 2927084 3382353 3069341
16594 3069341 2946209 2702363 2924625 2883880 2762527 2525441 2776893 2979568 2602311 2227540
16584 2227540 2353684 2685752 2480170 2398943 2227021 2041082 2628884 2436288 2074695 2171667
16574B171667J25947j16754k24716J60263m723j29005r670L6385Q8157l72701
16564A724850J98069k35432L0894J4625J93934j35646J19137K26153m51951l69002
16554A315631J03558L02746j64962k12263j18273K38345p5455L05093k82220P5989
16544A488189q4425M2049L4247m86345J10969L76987l35650J13633k2882N28116
16534A764888n80122J00074J35535R1599j85529m4300O848k22061L95698n26267
16524I36363L68245j06425j18005m2704O3627q8517l3542o8234J72435j40957
16514I42286J13839M0503l99508N1751k5196J3973K08890m33297J75181J5938
16504G04360L54480m6074l20675P017r8757K03826C84599P21819k29109K21192
$$ plain form
16574 2171667 2297614 2180860 1956144 2116407 2111684 1982679 1973009 2009394 2097551 1724850
16564 1724850 1922919 1687487 1718381 1733006 1926940 1791294 1910431 2136584 1684633 1315631
16554 1315631 1419189 1721935 1556973 1344710 1226437 1464782 1389327 1694420 1412200 1488189
16544 1488189 1403764 1445813 1480060 993715 1104684 1481671 1146021 1259654 1236772 1764888
16534 1764888 1184766 1284840 1420375 1511974 1326445 1282145 1288993 1066932 1462630 936363
16524 936363 1304608 1198183 1080178 1037474 1101101 1012584 979042 910808 1083243 942286
16514 942286 1056125 1096628 697120 748871 723675 737648 946538 513241 688422 704360
16504 704360 1058840 1012766 692091 699108 600351 804177 384599 1106418 877309 1098501
16494A098501k22402l1433l1663J68627o5631j4319C51179M10153l56607L69527
16484G74252l7871R85o9127j81802L02290K3338k27181K08462l11767K8571K48733
16473G58883k90471j23038L92319l66655K94110O291m5015J23809B72537K24643
16463D97180A58554K83155K164R3162J73636k96439J27523L7621R2212j29973
16453E41615B36616K8988K68449r4109K67435K8859K2129j49268k217k88462J49883
16442D68303K36288p7490p6812o0418B02361L53986j44519o4292l1531k2699M30648
16431G23954c8834E68743p5601j75002R7863A62369M66795k67439r195p0464K0924
16420C02990n8572R2748q1504N2926p7339J8808J98512A62883J85995R9992O2312
$$ plain form
16494 1098501 876099 844666 813003 981630 915999 901680 351179 761332 404725 774252
16484 774252 736381 737366 668239 486437 788727 812065 584884 793346 481579 510150 758883
16473 758883 468412 345374 737693 371038 665148 671439 626424 750233 272537 497180
16463 497180 158554 441709 443873 537035 710671 414232 541755 579376 671588 541615
16453 541615 236616 265604 534053 439944 707379 736238 758367 609099 606882 318420 468303
16442 468303 704591 627101 550289 489871 202361 556347 411828 347536 316005 293306 723954
16431 723954 -38834 568743 493142 318140 416003 162369 629164 361725 352530 282066 302990
16420 302990 244418 337166 255662 308588 231249 250057 448569 162883 348878 448870 511182
16409E11182B51444l7551J45406K70614j90242k0371G9890d2947B57387K06438
16399D63825A40960J57307e8035B51076J38929R4077r9910J61783A52556d3982
16388D19925K02303l00862j4656A26917j969l4684B1352K71269j32876J245k5821
16377A35169L05192a13468B44760A7569K94521g7294C44840K9439J40297k31886
16367B82690a97025C29233m7364H4271o065L67454a12284K3023E84058a10354
16356D313L0121L8601J45430b39419D60813D5815J60004Q267O6042c346A09371
16344C21222j05093Q2408A22437m712n5801J49756L35171B52473O6915F7778J53388
16333B21166H9873k0552K81084k6951a57409C54003K1444m6783i4395I1221e8520
$$ plain form
16409 511182 251444 213893 359299 629913 439671 419300 79890 -42947 257387 463825
16399 463825 140960 298267 -58035 251076 390005 484082 384172 545955 152556 -43982
16388 419925 622228 321366 306710 126917 124948 90264 21352 292621 159745 160990 135169
16377 135169 440361 -113468 244760 17569 312090 -77294 344840 374279 514576 282690
16367 282690 -197025 329233 281869 84271 78206 445660 -112284 -89261 584058 -110354
16356 4313 34434 73035 218465 -239419 460813 45815 205819 214086 280128 -3346 109371
16344 321222 216129 298537 122437 117725 61924 211680 546851 252473 319388 67778 221166
16333 221166 89873 69321 350405 323454 -157409 354003 375447 328664 -94395 91221 -58520
16321b59194B31711J2003J31781q3950o9912n6630a40406C50692D1759K61484
16311C03243F4882Q551P0238J23605r5894c4658A38803L16803h2957B95468A38136
16299H8102j7993d1180Q237o4467C2986J94522b1074Q979j6C50917H4027J05574
16287A89601a27788A56618c3873I2300P94j9428R8096K86820H3923L77280a0343
16275A00615P366l1372J55466B5747K18609J129f3790a4389m6226n1190D11716
16263A54485A355J35717M8794E1839K8711a15623J0214E2176J15598k5168f8038
16251B69494C0910a97573A35929B6267a391B56326a31648N6214N835B83459A9278
16239B17180C5666J51529b17013f5985A77784q6012J10447J383k4613d1308l3237
$$ plain form
16321 -259194 231711 243714 375495 291545 221633 165003 -140406 350692 41759 303243
16311 303243 64882 73433 143671 267276 171382 -34658 138803 455606 -82957 295468 138136
16299 88102 70109 -41180 -32943 -97410 32986 227508 -21074 -12095 -12111 350917 84027 189601
16287 189601 -127788 156618 -33873 92300 93094 73666 171762 458582 83923 461203 -10343
16275 100615 107981 76609 232075 25747 244356 245485 -63790 -14389 -60615 -111805 411716
16263 154485 1355 137072 185866 51839 80550 -115623 -105409 52176 167774 142606 -68038
16251 269494 30910 -197573 135929 26267 -1391 256326 -131648 -75434 -69599 283459 19278
16239 217180 35666 187195 -217013 -65985 177784 91772 202219 203602 178989 -41308 -74545
16228g4545K0393k22025G6042b02445B54422n4664g4211j90572a16954M6884a5644
16216C7893c6237k65985a46175B34268k0863A7479g8479B47031a90281C8327a95545
16204H5390m109a47868A93425d5809a2755k5121a3401C779K15673b54436A3471
16192I0961J3394K5679K70147a3754o9981A78250a20898j73790a35605j23575
16182b59180G5208a7771B13686f5690e661r7695q0543B57600F6588L09230B3403
16170A04205d9200A05801g7148D7638K57604C2927a67193n4463J01700K2375p8549
16159a76130C37909I6890D7992b48005B7087J24226A3249a17020m13949A63939
16148B09471E7072A7740L965Q0433P1533b09807o423O0449q1503f1027k40928
$$ plain form
16228 -74545 -54152 -276177 76042 -202445 254422 199758 -74211 -264783 -116954 -70070 -15644
16216 37893 -36237 -302222 -146175 234268 213405 17479 -78479 247031 -190281 38327 -195545
16204 85390 81281 -147868 193425 -45809 -12755 -37876 -13401 3779 219452 -254436 13471
16192 90961 104355 130034 400181 -13754 -83735 178250 -120898 -294688 -135605 -259180
16182 -259180 75208 -17771 213686 -65690 -5661 -103356 -183899 257600 66588 375818 23403
16170 104205 -49200 105801 -77148 47638 305242 32927 -167193 -221656 -119956 -97581 -176130
16159 -176130 337909 96890 47992 -248005 27087 151313 13249 -117020 -530969 163939
16148 209471 57072 17740 21705 102138 173671 -209807 -216230 -155781 -237284 -61027 -301955
16137c01955A03848i784D833c2627A67393G9401b48506I7791a63189D00741j19171
16126B81570g5655o466j74286M0367O9931A45945c0553m28752a39414j00849c5377
16114A165g808l26362h8915j58956B4618f6246p4611A40543a86446C0290a36128
16102B08314B8667K86380F3202f7956C2545a16276a2989k38056A40874L9998K9368
16091B10240b7406j40638B3071O2343L982K2541k3370A9558a65158D3148J81686
16080B24834e9623K3693j83426B62652H832a17960j37559M1989H1693b88003a02181
16068A22483b30595E3875f2666k02443a5399A62950l7279h1092A63318J2780b972
16056I5620g5113C08842A38335J18272a07984b2905k67285J4912c5440q6197j02134
$$ plain form
16137 -301955 103848 -9784 4833 -32627 167393 79401 -248506 97791 -163189 400741 281570
16126 281570 -75655 -82121 -256407 -216040 -146109 145945 -30553 -459305 -139414 -240263 -35377
16114 1165 -7808 -334170 -88915 -247871 24618 -66246 -140857 140543 -186446 30290 -136128
16102 208314 28667 315047 63202 -67956 32545 -116276 -12989 -251045 140874 180872 210240
16091 210240 -27406 -168044 23071 85414 89396 111937 88567 19558 -165158 43148 224834
16080 224834 -59623 -35930 -219356 262652 8832 -117960 -255519 -213530 81693 -288003 -102181
16068 122483 -230595 53875 -62666 -265109 -15399 162950 125671 -81092 163318 176098 -2972
16056 95620 -75113 308842 138335 256607 -107984 -22905 -290190 -275278 -35440 -121637 -223771
16045b23771B93680a07549A08096i769j15930C25698b11046F1743b00795Q8313
16035a12482r7561B04344a66008D2502a3734n1963B1803M4395N6941M4055I14
16023C94957F1588a15125B06627b03149h5443k5529m2670D2684j8377a71368A161
16011I1185b13736d0171G3193k9921J30596c41903G245J4796b47311o7458A44400
15999B16285h8869J8751A46053B2884K24231C2425b14526d9371A24553B260a81895
15987D09204h9065A32939e3155p9597D05114A40279M04474k50910b8255j35473
15977a63728N8857A08989Q6742Q6812h1225m4784j584B44912b0950j52371p9125
15966b52446C93216c07505e8100a6255q9684F1125b41704A5338a39745j46864
$$ plain form
16045 -223771 293680 -107549 108096 -9769 -125699 325698 -211046 61743 -200795 -112482
16035 -112482 -210043 204344 -166008 42502 -13734 -65697 21803 66198 123139 167194 914
16023 394957 61588 -115125 206627 -203149 -85443 -110972 -153642 42684 24307 -171368 1161
16011 91185 -213736 -40171 73193 43272 173868 -341903 7245 22041 -247311 -314769 144400
15999 216285 -88869 -70118 146053 22884 247115 32425 -214526 -49371 124553 2260 -181895
15987 409204 -89065 132939 -53155 -132752 405114 140279 544753 293843 -28255 -163728
15977 -163728 -104871 108989 195731 282543 -81225 -126009 -127593 244912 -20950 -173321 -252446
15966 -252446 393216 -307505 -58100 -16255 -105939 61125 -241704 15338 -139745 -286609
15956b86609B56324b42711J09467A3386d277H7699m1491K25387b7599r0098H7692
15944a38254C38692j20725e0562B63615b11835D210d4892m3601j91258F8938b42292
15932B89129a23725A47462a80807q700M5816N065A88637g2893p9835j12280n6339
15921c21347C85234A8369b13974B7608a0727A16800n7649a41439G0526P0488i0140
15909A0872e4778j57840c3432j65371G4503k7408A143J01976a01983I48a62163
15897i5767C07712L55E6299a58507C09398c39610B7120L13083b60009g2941L6466
15886c6475a5438D12098a63583j687P2388H7342P9235F3078a72486j97931C5816
15874b89199P8910A6122a79595l81450a16327C27540A18959J54785p1242b10192
$$ plain form
15956 -286609 256324 -242711 -133244 13386 -4277 87699 46208 271595 -27599 -117697 87692
15944 -138254 338692 217967 -50562 263615 -211835 4210 -44892 -88493 -279751 68938 -242292
15932 289129 -123725 147462 -180807 -189507 -143691 -138626 188637 -72893 -152728 -265008 -321347
15921 -321347 385234 18369 -213974 27608 -10727 116800 59151 -141439 70526 141014 -90140
15909 10872 -54778 -212618 -33432 -198803 74503 47095 1143 103119 -101983 948 -162163
15897 -95767 307712 308067 56299 -158507 309398 -339610 27120 340203 -260009 -72941 -36475
15886 -36475 -15438 412098 -163583 -165270 -92882 87342 166577 63078 -172486 -370417 35816
15874 -289199 -210289 16122 -179595 -561045 -116327 327540 118959 273744 202502 -210192
15863I5356c01121A83476i40A50731B8127c41795a28884A69619e5901A39413J38839
15852B78252f5054m01425M6905B21106h8556A47697e6943k3833C11990a0812j48953
15841a59765A44270B5568a25288B29410C2839a49910B08856k2396b85423J29904
15831a55519A32569a85748A70785a83410Q1968B42296a71402b9869j78383H6547
15820b65661h3195l3822E0380e0886k94566H9259d8689j47163k03920J4869A31436
15808a42027D6996b35572D5309L6519J71953b63082f7193F8138k1767a42166A46656
15796a72452k2909D6677J77316r3889b3281k7989A47513J91409H7353A1157b49434
15784A01834a48509C7029K27633a29958q3733L7521A86456q5857B4947J96116
$$ plain form
15863 95356 -301121 183476 -940 150731 28127 -341795 -128884 169619 -55901 139413 278252
15852 278252 -65054 -466479 -419574 221106 -88556 147697 -56943 -80776 311990 -10812 -159765
15841 -159765 144270 25568 -125288 229410 32839 -149910 208856 186460 -285423 -155519
15831 -155519 132569 -185748 170785 -183410 -101442 242296 -171402 -29869 -208252 86547
15820 -265661 -83195 -117017 50380 -50886 -345452 89259 -48689 -195852 -399772 -384903 131436
15808 -142027 46996 -235572 45309 81828 253781 -263082 -67193 68138 46371 -142166 146656
15796 -172452 -195361 46677 223993 130104 -23281 -51270 147513 338922 87353 11157 -249434
15784 101834 -148509 37029 264662 -129958 -213691 -176170 186456 100599 24947 221063
15774B21063a04202A35732b94273J4991O4205j0407A11462c7696j93146h5054
15763a94424B58343A1223K86630A27945J43691j09025b8384k53235J09369B6273
15752A06984B1240a7829B23695p0917a00589I8535c7443A5186a08664C41546c03021
15740C3017L98009k12287a18113I302M0251a92730C8605d9507b2324g681H5195
15728b54800B9005P5991L618c40255n6175A20551a56568A02871L6848a58795a0274
15716B3117F132h4198K4912B20680l2266c16404a02751b2415q1207c4008q8266
15705a22274A64051a19444j20341O1840c210D4556K88200c9068q7262k8462L0265
15694a24527j1091j04294D6033H522O6107K58891H54f58470B1675a69062G3217
$$ plain form
15774 221063 -104202 135732 -294273 -279282 -215077 -225484 111462 -37696 -230842 -85054
15763 -194424 258343 11223 297853 127945 271636 162611 -28384 -281619 -172250 26273
15752 106984 21240 -17829 223695 152778 -100589 98535 -37443 15186 -108664 341546 -303021
15740 33017 431026 218739 -118113 9302 49553 -192730 38605 -49507 -22324 -7681 85195
15728 -254800 29005 104996 108614 -340255 -396430 120551 -156568 102871 139719 -158795 -10274
15716 23117 6132 -84198 -59286 220680 188414 -316404 -102751 -22415 -103622 -34008 -122274
15705 -122274 164051 -119444 -239785 -177945 -3210 44556 332756 -39068 -126330 -154792 -124527
15694 -124527 -135618 -239912 46033 8522 74629 333520 854 -658470 21675 -169062 73217
15682G8535l4436J18520p2928d0267j73486P9904K1200A00820a23792c3254G5776
15670a03241K4404j66708M8890P0784B862L9105K0616c36864J32846p5736I3115
15658e1886j18433P54A58486J20746b842n8133r2903j74706B8647a39962N1394
15647h8568k45010A9914K44931o3256e4403F6183L07697i5049B51432F604i2089
15635a47499D3664c88233a40205j6307B10849q4115i942d597A41799Q0259i8804
15623a62652e7378G874Q6977J49087O5017a04703B39638a24522A58369J57140
15613C15509a46189E0957a72326e2695l7502k6644B66040g9313m0245D0253b7272
15601a12406K634j5164j49658J23812O7790c2058E3054g0007C96209b73009a19994
$$ plain form
15682 78535 44099 162619 89691 -40267 -213753 -133849 -112649 100820 -123792 -33254 75776
15670 -103241 -78837 -245545 -196655 -125871 2862 41967 62583 -336864 -204018 -279754 93115
15658 -51886 -170319 -169565 158486 279232 -2842 -60975 -153878 -328584 28647 -139962 -88568
15647 -88568 -333578 19914 264845 201589 -54403 66183 373880 -95049 251432 6604 -92089
15635 -147499 43664 -388233 -140205 -156512 210849 126734 -9942 -4597 141799 222058 -98804
15623 -162652 -57378 7874 94851 243938 308955 -104703 239638 -124522 158369 315509
15613 315509 -146189 50957 -172326 -52695 -90197 -116841 266040 -79313 -119558 40253 -27272
15601 -112406 -109772 -124936 -274594 -150782 -82992 -32058 53054 -70007 396209 -273009 -119994
15589a29837A47816K1538a60432H221d6034j47513J4005A85934k8235a42548M4133
15578i8415K6770a0829j12054C3082a8073A18247L746b25880i7486j84528f4354
15566f6167A20912b80669m2526J09988A77945R970c92085A81921o4455a61957
15555i2159F8673f5641j07910J6810n7950A48658D6900J40908m9419K709D6508
15543D46267A05227K576c9164r1324q597E4318a74528A42150b31902B06883e0523
15531B42457a30764k14417J12906B79073A01597a55078B17024G3006K49026b56350
15520a20796e6853B60117A1936J49553j5154b90172j91141e8904g375C85868L41
15509C86209b46689A71408a68053f3940j0248F9918j4268P3086h038j47489G2543
$$ plain form
15589 -129837 147816 169354 -160432 8221 -46034 -193547 -179542 185934 157699 -142548 -98415
15578 -98415 -71645 -10829 -122883 33082 -18073 118247 121993 -225880 -97486 -282014 -64354
15566 -66167 120912 -280669 -323195 -213207 177945 187915 -392085 181921 117466 -161957
15555 -92159 68673 -65641 -173551 -156741 -214691 148658 46900 187808 138389 141098 46508
15543 446267 105227 107803 -39164 -130488 -139085 54318 -174528 142150 -231902 206883 -50523
15531 242457 -130764 -345181 -232275 279073 101597 -155078 217024 73006 322032 -256350
15520 -120796 -56853 260117 11936 161489 146335 -290172 -481313 -58904 -7375 385868 386209
15509 386209 -246689 171408 -168053 -63940 -74188 69918 55650 128736 -8038 -155527 72543
15497b10728D258N9466D088b0116A07859N1309a85442b5623j26068k94794b1964
15485A30586i4577l2430C99982h6521A95743b13910l8311C02463B1107b9732A42092
15473e5949j96767k72100G5364a53389r751J6459A93669K4136a89230F8646B8511
15461C823d2536j47810E7140K2070k0521a00006C078M8100d8095k4208l2319b5806
15448a82071e6114m652F487N3815c4388A24553R9021q3149a85411A09559b4692
15436b39738A01067b39808A57581o3157b89133a24708C33787j54949H4438D189
15425g6475A18029D0379O9088m2055a90000j28976a12091A40318a57638N3469
15415a04169K3638A3373M505a77271E990B34K3344a61958b320A74269C7085i4930
$$ plain form
15497 -210728 4258 63724 4088 -20116 107859 159168 -185442 -25623 -151691 -446485 -21964
15485 130586 -94577 -127007 399982 -86521 195743 -213910 -252221 302463 21107 -29732 142092
15473 -55949 -252716 -524816 75364 -153389 -163140 -146681 193669 217805 -189230 68646 28511
15461 3823 -42536 -190346 57140 79210 58689 -100006 3078 51178 -48095 -72303 -104622 -25806
15448 -182071 -56114 -60766 6487 60302 -34388 124553 223574 140425 -185411 109559 -24692
15436 -239738 101067 -239808 157581 94424 -289133 -124708 333787 178838 84438 4189
15425 -76475 118029 40379 109467 67412 -190000 -318976 -112091 140318 -157638 -104169
15415 -104169 -80531 13373 17878 -177271 5990 234 23578 -161958 -2320 174269 37085 -94930
15402H6047a29794A5329J11693b10922B32461a69852A72637q1557i513H8949B2059
15390a42631N3114H5687d22794A79158N716q7822D5780b74887J9155A48095n7207
15379I0888a88620B36515b5491E69160B55020a31713A52375c50186G2964L0720
15369A03684A8470L9109a49133f7583j99646G6316O6988J57651a78110A75315
15358A93734i750m0861B01738A0296J540J55886D7862f975A75736g6675j29795
15347b06470e0455a678j61370m1989C12737P8139f7162o9563A77071P6472c7579
15335A95320a06349C3288O0236h2475q3956C62675a96765D99164A11118K5689
15325A36807D7124J81369F0608b35764e8323C6193a19983J9814b4709b262j50760
$$ plain form
15402 86047 -129794 15329 127022 -210922 232461 -169852 172637 91080 -9513 88949 22059
15390 -142631 -89517 85687 -422794 179158 184874 97052 45780 -274887 -255732 148095 90888
15379 90888 -188620 236515 -25491 569160 255020 -131713 152375 -350186 72964 103684
15369 103684 18470 57579 -149133 -67583 -267229 76316 143304 300955 -178110 175315
15358 193734 -9750 -50611 201738 10296 11836 167722 47862 -6975 175736 -76675 -206470
15347 -206470 -50455 -1678 -163048 -205037 312737 390876 -67162 -136725 177071 253543 -37579
15335 195320 -106349 33288 93524 -82475 -166431 362675 -196765 499164 111118 136807
15325 136807 47124 228493 60608 -235764 -58323 36193 -119983 -100169 -24709 -2262 -153022
15314a53022G6533i7820D0634M9839b55048g8853B1760c447l7119A29086J4271
15303A43357o2184f4058j3405m3160a9497j49099C38538a33482k0717a4883A12616
15291D09067j40557A05737l6355m23L1450J26077D3853J82039E1556c10660D4229
15279G786J72755D5771a18780d4112j9927a105o3265K4064A94577J44120h6424
15267B7251M3537N0303h7604A4533J41858o5399a42194m6426M4798A17782j7336
15256A00446J85539a2236B96028q1337D4350K34470M0887O3385P30017M13267
15246A526376p5216J49159k64319C29546l0628c8348B20977L1350a36357J0837
15236a25520r8563a0400m5533o924k2251H3802J31944b85939D4197K15713b6617
$$ plain form
15314 -153022 76533 -97820 40634 90473 -255048 -78853 21760 -3447 -40566 129086 143357
15303 143357 81173 -64058 -77463 -120623 -19497 -168596 338538 -133482 -154199 -14883 112616
15291 409067 268510 105737 69382 68959 100409 226486 43853 225892 51556 -310660 44229
15279 7786 180541 45771 -118780 -44112 -64039 -1105 -64370 -40306 194577 338697 -86424
15267 27251 70788 121091 -87604 14533 156391 90992 -142194 -188620 -143822 117782 100446
15256 100446 285985 -12236 296028 214691 44350 278820 319707 383092 1113109 1526376
15246 1526376 1451160 1600319 1336000 329546 298918 -38348 220977 252327 -136357 -125520
15236 -125520 -224083 -10400 -55933 -62857 -85108 83802 215746 -285939 44197 259910 -26617
15224f0729A36806K31732A37181a75417n0042A00618J3680J8779a10685E6114
15213A15132f9666j25590B64309c8568B41942a57712C71000A44622d5727B38310
15202b6723B40013d5018m6866j9707D88780k27803A14671f3430A61969D0783f5961
15190c703A02244B8415L12246A18124a24518J7432A43259m2618A0675g136n1408
15179e8544B7097M9390J27517k3447a87625G1530b68301b3285D68326g2150b8709
15167A82960J0109O2363o1996L79532k75216c8647B7975J89882p9256J02768H6243
15155c96324C98391j92581a25061I8212A1558J11097L6669k2049i0557A90827
15144C9773K3641O2920K3472a1421k06153A88255M3401e7188A80568M7970d6322
$$ plain form
15224 -60729 136806 368538 137181 -175417 -225459 100618 114298 133077 -110685 56114
15213 115132 -69666 -195256 264309 -38568 241942 -157712 371000 144622 -45727 238310
15202 -26723 240013 -45018 -91884 -111591 488780 260977 114671 -63430 161969 40783 -65961
15190 -3703 102244 28415 340661 118124 -124518 -107086 143259 100641 10675 -7136 -58544
15179 -58544 27097 76487 204004 180557 -187625 71530 -268301 -23285 468326 -72150 -28709
15167 182960 193069 255432 193436 572968 297752 -38647 27975 217857 138601 241369 86243
15155 -396324 398391 205810 -125061 98212 11558 122655 159324 137275 -90557 190827
15144 39773 63414 126334 149806 -11421 -217574 188255 231656 -57188 180568 228538 -46322
15132A4122e75I2463K64051p0416B052c2840A1452b0619C00515g1012o7809d1119
15119c0733I9190c944B45207n9520g6219A30142h60A58333a62475j83725B0870
15107a15939b0800j43134A92833n6693J51599Q2108A19362c8752E2998J03465
15097A56463R941J4041K26186f3056B56920R4629G8211K46427E3706J28852C3395
15085A99206r2984g9727A42706L1414J51940A14331K60432F2649J00233L3238
15075A96120r696h0222A58349g5308j9190c3872A79461K67394B3878J17790K16946
15064C58614G4374L30168r4604e2305p1302B6062M29795C9069J69033I2797N7635
15053A50432F7450h5067B01208O7995R3936J4411A41171h6432L8329A38274o2329
$$ plain form
15132 14122 -575 92463 356514 286098 2052 -32840 11452 -20619 300515 -71012 -138821 -41119
15119 -30733 99190 -3944 245207 185687 -76219 130142 -860 158333 -162475 -346200 20870
15107 -115939 -20800 -163934 192833 136140 287739 369847 119362 -38752 52998 156463
15097 156463 166404 180445 406631 -63056 256920 351549 78211 324638 53706 182558 33395
15085 199206 106222 -79727 142706 174120 326060 114331 374763 62649 162882 196120
15075 196120 186424 -80222 158349 -75308 -94498 -33872 179461 446855 23878 141668 358614
15064 358614 74374 404542 309938 -52305 -123607 26062 455857 39069 208102 92797 150432
15053 150432 67450 -85067 201208 269203 363139 377550 141171 -86432 -48103 138274 75945
15042G5945L82024k0287B09886m1446f0145G1173K31198H8164K88906L7956j55162
15031B59864m971N0895F7692J79279N9442r8785O3295H9301B9040g1536B09593
15019B57696J03402l4938j38706R8462O7306o4251J85484H6358P9673H989J38868
15008A47857J73254A12682K54464G2350J95463q330l6177H1059J7522k5376M76652
14997E49857k33433E2959K22734j9988N5170O3853A29442a21287B29563J8920
14987B48483k2542J27503n0726k2630q2867L9100J92671A24363N54448k57368
14977D21443N8444A05874h867A02808K14632p4764r1395J63185m2666j28962K94584
14966D37422J1088j87835o4106K26695j90187j05736L60476D6359L57162E3014
$$ plain form
15042 75945 457969 437682 209886 168440 -60145 71173 302371 88164 377070 415026 259864
15031 259864 254893 305788 67692 246971 306413 207628 270923 89301 29040 -71536 209593
15019 257696 361098 326160 187454 285916 353222 288971 474455 86358 166031 8989 147857
15008 147857 321111 112682 367146 72350 267813 259483 223306 81059 98581 73205 549857
14997 549857 316424 52959 275693 255705 310875 374728 129442 -121287 229563 248483
14987 248483 225941 353444 302718 280088 197221 236321 428992 124363 678811 421443
14977 421443 479887 105874 -8867 102808 317440 242676 151281 314466 271800 142838 437422
14966 437422 448510 260675 196569 423264 233077 127341 487817 46359 403521 53014
14955C93110r0741j50048F4925J51277J7699K93891B45145G8663k2228M4974J34825
14944B36234j4938k0162K2715J5249o6171D8487L94684A66642k986L04648r9886
14933C68418A71198J85318J33404A19234J80328r8312P5546A04342M19445j55423
14923C68364M3537j70540J67859q1980a0054C50656I3181J79410R0891K87193
14913F50675A85945J07776K3091O3114j34167J06697j16942J01062K03939j07398
14903D33117A27723J0662K51201P3383A79496J04743A40873K38746A44034F2694
14892B70296n9912K84027l1305K1985f5738G3032K21613J31101r5581A43818N8127
14881B01945K52673j63029q7534n6800K5780J87053N945J91322B04205J89924
$$ plain form
14955 393110 302369 152321 64925 216202 233901 527792 245145 78663 56435 101409 236234
14944 236234 221296 201134 223849 239098 172927 48487 443171 166642 163656 468304 368418
14933 368418 171198 356516 489920 119234 299562 201250 276796 104342 523787 368364
14923 368364 411901 241361 409220 327240 -10054 350656 93181 272591 363482 650675
14913 650675 185945 293721 316812 379926 245759 352456 235514 336576 540515 433117
14903 433117 127723 138385 389586 462969 179496 284239 140873 379619 144034 62694
14892 270296 210384 494411 463106 485091 -65738 73032 294645 425746 330165 143818 201945
14881 201945 454618 291589 204055 147255 173035 360088 366033 557355 204205 394129
14871C94129l8205A72898J852K52569K13522j36477K18637L5589l11118q4714
14861C62758A80994J60968L8649j6097P0763A89071J7841N62170l76528j4145
14851C78409Q497p340K2357J7950A60146K82103Q2362J67087j37661J36087N0919
14840G41043j07316r8342k22663L730K3675J59277O7390o6142p9224o0907J35102
14829D95623j25520K14009j98683L16625j97896j28364K26119J28358k08972J62956
14819F84255B81990o5720K05319j7892j88696L68631j88244J19857j0791j78004
14809C26450K30350R0049k87444K32875B11441M20163K64456j93610k40064P8224
14799E40610B06884J16116J62263L6172J541j56279k4134p9599L20211P5300j56369
$$ plain form
14871 394129 355924 172898 174750 427319 640841 504364 723001 758590 447472 362758
14861 362758 180994 341962 380611 364514 435277 189071 206912 769082 392554 378409
14851 378409 386906 379566 401923 419873 160146 442249 524611 691698 554037 690124 741043
14840 741043 633727 535385 312722 316452 340127 499404 566794 500652 421428 360521 495623
14829 495623 370103 584112 385429 702054 504158 375794 601913 730271 521299 684255
14819 684255 281990 216270 421589 403697 215001 583632 395388 515245 504454 326450
14809 326450 556800 646849 359405 592280 211441 631604 896060 702450 462386 540610
14799 540610 206884 323000 485263 521435 522976 366697 342563 262964 583175 658475 502106
14788E02106R8007j88954L07359o4235k44141j05850J013J00117q5644L66189
14778F85967j80351J06066k06938O00519l89900k69150M13659q0425r9688j38731
14768D41028J80282L697L15730k13571k09368O1708J97606j85165J25469J18145
14758H35561k2566B10727K11365J8020K62311l44004M58133k68294J25424J05955
14748G79637l58885L03210p0941j17330J26431j28909K43735q2062K36528r0997
14738H40417k31633q5395L52395j41677J37711j70687r5485Q6429k46161M46975
14728H92889Q0901m25207J26226J57287n6908k91842M74421m38443L5511M31883
14718I86718j93819J77079j35311r5968J57531J02671j83572j12867L5330J87713
$$ plain form
14788 502106 600113 411159 718518 654283 410142 304292 305305 405422 319778 685967
14778 685967 505616 611682 404744 1005263 615363 346213 759872 679447 579759 441028
14768 441028 621310 625007 940737 727166 517798 579506 777112 591947 717416 835561
14758 835561 812995 210727 422092 440112 702423 358419 816552 548258 673682 779637
14748 779637 420752 723962 653021 535691 662122 533213 776948 694886 931414 840417
14738 840417 608784 523389 875784 734107 871818 701131 605646 692075 445914 892889
14728 892889 973790 548583 674809 832096 775188 483346 957767 519324 554835 986718
14718 986718 792899 969978 834667 738699 896230 998901 815329 702462 737792 925505
14708I25505k57908J30287J11479Q3269k11934j21106K21257K97137k79505N3582
14698I52063j83134K84392j4638j08250Q2669j71073M0568Q5475l82953N59946
14688A145065n08995O47337l28337k96434J53176j01969L88992K43938l10971
14679A031802l3918P5653J1672j94707L4061j83502M23940k49792J44492j86890
14669H72811P4737K35915j36115N955J7409J37806k70440K67172k52577k50269
14659G02404J53947K30463M7706k93321N28420m38806o4157K27274O9253q7354
14649A075829K672K26081P4562m85965M77448l19121j38974L28605L39348l62281
14639A218204l4755j40304Q0155j11855M48257k72837j46692J48528J16570m1362
$$ plain form
14708 925505 667597 797884 909363 992632 780698 659592 880849 1177986 898481 952063
14698 952063 768929 1053321 1038683 930433 1013102 842029 882597 968072 585119 1145065
14688 1145065 636070 1283407 955070 658636 811812 709843 1098835 1342773 1031802
14679 1031802 997884 1073537 1085209 890502 924563 741061 1165001 915209 1059701 872811
14669 872811 947548 1183463 1047348 1053303 1070712 1208518 938078 1205250 952673 702404
14659 702404 856351 1086814 1134520 841199 1369619 930813 866656 1093930 1163183 1075829
14649 1075829 1078501 1304582 1379144 893179 1370627 1051506 912532 1241137 1580485 1218204
14639 1218204 1183449 1043145 1123300 1011445 1459702 1186865 1040173 1188701 1305271 1263909
14629A263909J47581o8740J1367j4938k32662N3583j09393K05835K6030K18174
14619A500746l98582L82453J83558m1139l05103K01665m26845P78497k21228j91147
14609A462875J29922j10144O9907M7973j28246O7260K49652m13272M20243k80150
14599A516020J40189r7586j64505o9736L40481l44647O74767n28771o0389J42749
14589A548572N25468l26739J14945P2569j39134K27056o0306J46777K890l2825
14579B079273l61854K16390j23455j7933M77213k51039K4285j18994L41711k04378
14569B061219j29858K65067J20605J92031l83061L36401j15703L4473O4879J86437
14559B632490J0052J13357L00343j7339J32090O7937L96348L54931R18051R69918
$$ plain form
14629 1263909 1411490 1342750 1354117 1339179 1106517 1160100 1050707 1256542 1282572 1500746
14619 1500746 1102164 1484617 1668175 1627036 1321933 1523598 1096753 1875250 1654022 1462875
14609 1462875 1592797 1482653 1552560 1600533 1472287 1539547 1789199 1375927 1796170 1516020
14599 1516020 1656209 1558623 1394118 1324382 1664863 1320216 1994983 1466212 1405823 1548572
14589 1548572 2074040 1747301 1862246 1934815 1795681 2022737 1962431 2109208 2112098 2079273
14579 2079273 1717419 1933809 1810354 1792421 2269634 2018595 2042880 1923886 2265597 2061219
14569 2061219 1931361 2196428 2317033 2509064 2126003 2462404 2346701 2381174 2446053 2632490
14559 2632490 2642542 2755899 3056242 3038903 3170993 3238930 3635278 3990209 4908260 5878178
14549E878178J811127N339146J3955873J4346275o58625j9147997H978956D461444
14540B544061o95373k44066L60685j57704J69121P5716l29030N12400k49284K94663
14530B281189j36093P689k49292Q6145j10149N37864j7713j46594J1060M2481
14520B306587J93732j70182o1976J70361j21955L46317l01703L92198l1977K04151
14510B925553l12032m163M23072o361j90284P2040K26859l96136J91163K9019
14500B958730J44940l7033O1012J13867j95846N0775K36805o3332Q8108J49581
14490C507607o357p6964R9183J08383k78215J6455L40416p5419K72804k10682
14480C697211J25851j01654K72025J45635N8554j33880O9282j3284K96943l20951
$$ plain form
14549 5878178 7689305 13028451 26984324 41330599 40671974 21523977 8978956 4461444
14540 2544061 1848688 1604622 1965307 1807603 1976724 2052440 1723410 2235810 1986526 2281189
14530 2281189 2145096 2152785 1903493 1989638 1879489 2417353 2399640 2253046 2264106 2306587
14520 2306587 2500319 2330137 2268161 2438522 2316567 2662884 2361181 2753379 2721402 2925553
14510 2925553 2613521 2609358 3032430 3026069 2835785 2907825 3134684 2738548 2929711 2958730
14500 2958730 3103670 3066637 3127649 3241516 3045670 3096445 3333250 3269918 3358026 3507607
14490 3507607 3501250 3424286 3523469 3631852 3353637 3370092 3710508 3635089 3907893 3697211
14480 3697211 3823062 3721408 3993433 4139068 4197622 4063742 4133024 4119740 4416683 4095732
14470D095732J0047K07003J04256P8371J32185k75047j45523J46765N84969k16739
14460D722019M28928o16810O22294q0179j27974J13643J97326j08464j9999M15893
14450E546677l51954N16532j87212N9249O5684K48336P1155K2251L24340j41130
14440F173928q498r9275J02235j15133N13848l42525q5M66033j70155L18583j8796
14429F820160j2286M36172q4760N7880m206K58678K51874k24932K25838K63911
14419G988329Q348k8290K10298L54044n9730L49572l39626L42850Q2956K47599
14409I156350q105J2696K47387M82230J44362K36390m33787K65648L17524n6048
14399A0364647M31791J98130p2500L11474J13486k8267N49627Q6751M49370K10024
$$ plain form
14470 4095732 4105779 4312782 4417038 4495409 4627594 4352547 4207024 4353789 4938758 4722019
14460 4722019 5150947 4534137 5156431 5076252 4948278 5061921 5259247 5150783 5130784 5546677
14450 5546677 5194723 5711255 5524043 5583292 5648976 5897312 5968467 5990718 6315058 6173928
14440 6173928 6165430 6066155 6168390 6053257 6567105 6224580 6224495 6690528 6520373 6838956 6820160
14429 6820160 6807874 7244046 7159286 7217166 7212960 7471638 7723512 7498580 7724418 7988329
14419 7988329 7996677 7968387 8178685 8532729 8472999 8822571 8482945 8825795 8908751 9156350
14409 9156350 9148245 9160941 9408328 9890558 10034920 10271310 9837523 10103171 10420695 10364647
14399 10364647 10796438 10994568 10922068 11233542 11347028 11318761 11868388 11955139 12404509 12614533
14389A2614533M4819j42343N46715J60821M99747K58732K12330K01144L83641
14380A4780139r1746M32950N3439K90528O81264J54387M60748r837N71815j14148
14370A7209539P47185K88525K89220P58765L63227R643L72686P54421K49412P05963
14360B1748586P31221M656O84867N83401N34455J87267Q16614Q27881J34514R56192
14350B7209654M04448J338428K31469P53254Q39089P16853P35962J114378P23099
14341C4066634J088809O41501J101502J127786Q81243J378229J077461J294192
14333D2657357J169123J319803J725611J244804J681565J259388J514197J978529
14325E4550377J962482J767346K064058J917919K899723J980441K310273K675746
$$ plain form
14389 12614533 12659352 12517009 13063724 13224545 13724292 13983024 14195354 14396498 14780139
14380 14780139 14688393 15121343 15174782 15465310 16146574 16300961 16761709 16751872 17323687 17209539
14370 17209539 17956724 18245249 18534469 19293234 19656461 19666104 20038790 20793211 21042623 21748586
14360 21748586 22479807 22484463 23169330 23752731 24287186 24474453 25291067 26118948 26253462 27209654
14350 27209654 27614102 28952530 29183999 29937253 30776342 31493195 32229157 33343535 34066634
14341 34066634 35155443 35796944 36898446 38026232 38907475 40285704 41363165 42657357
14333 42657357 43826480 45146283 46871894 48116698 49798263 51057651 52571848 54550377
14325 54550377 56512859 58280205 60344263 62262182 65161905 67142346 69452619 72128365
14317G2128365K967959K722074L038416L355377K926050L909519L683475L929227
14309I8660462M234885M633828M835467M749618N495819N632228O186708O450790
14301A40879805O615520P258615P559127Q170436Q675961R213477R703665J0328738
14293B08405344J0695988J1264137J2336223J2579639J2994790J4003780J4195671
14286B96475572J4896780J5317641J5815863J5350788J5754661J5456646J5226166
14279D04294117J4213696J3333576J1777509J0271745Q204504N890766K834318
14272D70820231j787069o431025o009817k864511j626505m861136r198981j1298833
14264D26742354j2364497j3886912j5302874j5710412j6033755j6159502j5602244
$$ plain form
14317 72128365 75096324 77818398 80856814 84212191 87138241 91047760 94731235 98660462
14309 98660462 102895347 107529175 112364642 117114260 122610079 128242307 134429015 140879805
14301 140879805 147495325 154753940 162313067 170483503 179159464 188372941 198076606 208405344
14293 208405344 219101332 230365469 242701692 255281331 268276121 282279901 296475572
14286 296475572 311372352 326689993 342505856 357856644 373611305 389067951 404294117
14279 404294117 418507813 431841389 443618898 453890643 462095147 467985913 470820231
14272 470820231 469033162 462602137 456592320 453727809 452101304 447240168 438041187 426742354
14264 426742354 414377857 400490945 385188071 369477659 353443904 337284402 321682158
14257C21682158j5844260j5171075j4227606j3572700j2580334j3187776j2126277
14250B24972130j1081630j0737818j0101661r656216r086498q282917p641581
14243A58383809p389844p101481o855314o073536o096233n340264m825030n227067
14235A09475040m617811m583276l764566l528392l482716l923106l573138k916418
14227G9085617l155682k717223k594637k684099k156503k537380j873795j919239
14219E9447059k370863j898737j660370j943430j622717j119059j305231j284929
14211D6241723k221837j031801j417247o44279p81475j309094j383378r22164
14203C6530448j144051p81076j032401m08633j058928j313110n10234r00359n7175
$$ plain form
14257 321682158 305837898 290666823 276439217 262866517 250286183 237098407 224972130
14250 224972130 213890500 203152682 193051021 183394805 174308307 166025390 158383809
14243 158383809 150993965 143892484 137037170 130963634 124867401 119527137 114702107 109475040
14235 109475040 104857229 100273953 96509387 92980995 89498279 85575173 82002035 79085617
14227 79085617 75929935 73212712 70618075 67933976 65777473 63240093 61366298 59447059
14219 59447059 57076196 55177459 53517089 51573659 49950942 48831883 47526652 46241723
14211 46241723 44019886 42988085 41570838 40926559 40145084 38835990 37452612 36530448
14203 36530448 35386397 34605321 33572920 33164287 32105359 30792249 30282015 29381656 29324481
14194B9324481j128304m69676p82920n85260o63015q48098m79376m54096q41289
14185B3072447l64855m60084m25686m68026m91821k86645p10930o05226J32522
14176A9391696n01775o22646K8570m74395n97048k29245m04502l11290l03927
14167A5975438k91200l57715l81338L308l99995j32818k08446j49005l27326k73750
14157A3457153l46507K381n71822j90648N7046o25229N8731k2475n23201n7302
14147A1238127j58755k13506m4011n16317L89975o15083l68113J76703J90528
14138A0079548J99286q21962Q4551k29153j40236j61039l9295k85777L522k01693
14128H487752j72664K8255M5344m22754j88071J14299K32455n47670R9286N6466
$$ plain form
14194 29324481 28196177 27726501 26943581 26358321 25695306 24847208 24367832 23913736 23072447
14185 23072447 22707592 22247508 21821822 21353796 20861975 20575330 19864400 19259174 19391696
14176 19391696 18889921 18267275 18295845 17821450 17224402 16995157 16590655 16279365 15975438
14167 15975438 15684238 15326523 14945185 14948493 14548498 14415680 14207234 14058229 13730903 13457153
14157 13457153 13110646 13113027 12541205 12350557 12407603 11782374 11841105 11818630 11295429 11238127
14147 11238127 11079372 10865866 10821855 10305538 10695513 10080430 9712317 9889020 10079548
14138 10079548 10278834 9456872 9541423 9312270 9172034 9010995 8971700 8685923 8689445 8487752
14128 8487752 8315088 8343343 8388687 7965933 7777862 7892161 8124616 7576946 7676232 7732698
14118G732698m42266j22249j05826K32015m80207K75713m25575j62459K25090
14109F726934j51588j38065J86813K0537o14189J72368q5734L02018n13888K94274
14099F199480j30691n06138J12311k35469J09516l02953J63491P4933m18963j06361
14089D959156K70903k47072K90354l48743M1035M8810J85873m84534L39668m65335
14079D590115o5374J92993J7692m26735J07939j80863Q2902j82103M00175k94552
14069D242189O167k7459K64272j88054l88816Q4366M71288n27921J32732o4413
14059D004351j09921K44281j74191J91126m06213L8097r2087j97663m5113R3969
14049C546636r1599J06517l17149M49007l97093J15611j5780R9645J8039k40190
$$ plain form
14118 7732698 7290432 7168183 7062357 7294372 6814165 7089878 6664303 6501844 6726934
14109 6726934 6575346 6437281 6624094 6644631 6030442 6202810 6117076 6419094 5905206 6199480
14099 6199480 6068789 5562651 5674962 5439493 5549009 5246056 5409547 5484480 5065517 4959156
14089 4959156 5230059 4982987 5273341 4924598 4965633 5014443 5200316 4715782 5055450 4590115
14079 4590115 4524741 4717734 4735426 4308691 4416630 4235767 4318669 4136566 4536741 4242189
14069 4242189 4248356 4220897 4485169 4297115 3908299 3992665 4463953 3936032 4068764 4004351
14059 4004351 3894430 4138711 3964520 4155646 3749433 3787530 3695443 3497780 3452667 3546636
14049 3546636 3455037 3561554 3244405 3693412 3296319 3411930 3396150 3495795 3513834 3273644
14039C273644J59066l56431P6329j88845p0040L79714m01616L08282K09070l50570
14029C038603K63777p54m52662K62887O4076m77823j1837J19649k61558J24250
14019B668608K44917j62880l21150J7706J45155m1615p9030M816l36548L65188
14009B505167P6464k80681P0490j49159k0426N3396o7925k17296L26014l23467
13999A972577K90314l09339J17234r3861j45342K42726j4751K14030j2204L6897
13989B298281R31714L659363J2197308J6724958O284896j6200176A2290523m901964
13981G388559k235257j021311l22332l52121k5518n06161L85407l09881j84701
13972B816684l33833K63889m11396K89996L007l75771J57872p1191j26150j01934
$$ plain form
14039 3273644 3432710 3076279 3152608 2963763 2893723 3273437 2871821 3180103 3389173 3038603
14029 3038603 3302380 3301626 2848964 3111851 3175927 2698104 2686267 2805916 2544358 2668608
14019 2668608 2913525 2750645 2429495 2447201 2592356 2550741 2471711 2476527 2139979 2505167
14009 2505167 2581631 2300950 2371440 2222281 2201855 2255251 2187326 1970030 2296044 1972577
13999 1972577 2262891 1953552 2070786 1976925 1831583 2074309 2059558 2273588 2261384 2298281
13989 2298281 3229995 6889358 19086666 35811624 42096520 25896344 12290523 7388559
13981 7388559 5153302 4131991 3809659 3457538 3432020 2925859 3311266 3001385 2816684
13972 2816684 2482851 2746740 2335344 2625340 2628347 2252576 2410448 2339257 2213107 2111173
13962B111173K09204j76129K89175m47540R7806k40435J64838M2949m8599J81424
13952B183866k80650J34467j31486m8253l16730Q2066R6547K5975K20055L1985
13942A997842k28859K62340l06348j46406K82224k93056K44609k56024J10974
13933A667296N2574l44001K59686o3085J41245k51123n3310J18795Q355L07309
13923A843741k16905K49557l27428J51539l87703L0831N3073O7681K015J57487
13913A623888k7410j18344j31435J24830j84817J99719K42253o59662J69954K71230
13903A510206k48028n580o3941O599P9143k95166M27229n8901J52345k73981P139
13892A237064j89800J87661r8109R4575j18391P813K81404K45541m22100q960
$$ plain form
13962 2111173 2320377 2144248 2433423 1985883 2083689 1843254 2008092 2051041 2002442 2183866
13952 2183866 1903216 2037683 1906197 1857944 1541214 1623280 1719827 1745802 1965857 1997842
13942 1997842 1768983 2031323 1724975 1578569 1860793 1567737 1812346 1556322 1667296
13933 1667296 1719870 1375869 1635555 1572470 1713715 1462592 1409282 1528077 1536432 1843741
13923 1843741 1626836 1876393 1548965 1700504 1312801 1343632 1396705 1464386 1466401 1623888
13913 1623888 1596478 1478134 1346699 1471529 1286712 1486431 1728684 1069022 1238976 1510206
13903 1510206 1262178 1256598 1192657 1199256 1278399 983233 1410462 1351561 1503906 1229925 1237064
13892 1237064 1047264 1234925 1136816 1231391 1113000 1120813 1402217 1647758 1225658 1216698
13882A216698j40580M28400l85018K3426m9685r5121J12477M93391n56177p8686
13872I69125N8482N8809K71169j58312j25300J53608j37136r0241q4137L3013
13862I49080K75836j83980L96214j64723k78600r069o3100O7350J63510q7655
13852A064863P166J2132Q8077k54482j3982J3613K83841k78438L13958k92729
13842I44019J78106l78319K75344p8446m0653L80608k73635n0108j05554k15938
13832F35424M80400j09747l6532O3889r4487L15972j43081N0310l0682k40649
13822H90817j23281L78338p333n49281K37244k36034K27102k48297J04817K51111
13812I25203p2057J99296k23405k8781J40733j9546k62534K34129l03172L29800
$$ plain form
13882 1216698 1076118 1504518 1119500 1142926 1093241 998120 1110597 1603988 1047811 969125
13872 969125 1027607 1086416 1357585 1199273 1073973 1227581 1090445 1000204 916067 949080
13862 949080 1224916 1040936 1437150 1272427 993827 984758 921658 989008 1152518 1064863
13852 1064863 1072029 1084161 1172238 917756 903774 917387 1201228 922790 1236748 944019
13842 944019 1122125 743806 1019150 940704 900051 1280659 1007024 956916 851362 635424
13832 635424 1115824 1006077 969545 1033434 938947 1254919 1111838 1162148 1131466 890817
13822 890817 767536 1145874 1138541 589260 826504 590470 817572 569275 674092 925203
13812 925203 853146 1052442 829037 800256 940989 921443 658909 893038 589866 919666
13802I19666J04396m33068K02551m878P2347j15091j5641J46329l14156J57051
13792G19506L9891J6133l4542k86768K95483k07713J287j51657L77766k1833k69559
13781D77994N64754k17838j3885j05020r498j97102K61571l028r1578J26787k40656
13770E52501L40349j21965k37144K628o4981J33266M0206j94445K08654K76155
13760I35224C90227J07089J30478O726J0306M6842J70934O4331p8153j76821k56047
13749D15912j11018N31535C93931K82802K47933j43970k16854L8537k12403J98697
13739E88673P158M1826K34667k50006R7839n0623R8329l40526K82387n600K127
13728G06251J57140j87193n6954J81127C52974N46164m27761J39634Q2198O4546
$$ plain form
13802 919666 1024062 590994 793545 788667 861014 745923 730282 876611 562455 719506
13792 719506 759397 775530 740988 454220 749703 541990 543277 391620 769386 747553 477994
13781 477994 1042748 824910 811025 706005 696507 499405 760976 757948 666370 793157 552501
13770 552501 892850 770885 533741 536369 471388 604654 644860 450415 659069 935224
13760 935224 390227 497316 627794 634520 644826 691668 862602 926933 848780 671959 415912
13749 415912 304894 836429 393931 676733 924666 780696 563842 602379 389976 588673
13739 588673 595831 637657 872324 622318 720157 669534 767863 427337 709724 704124 706251
13728 706251 863391 676198 619244 800371 352974 899138 471377 611011 693209 757755
13718G57755l01807K59800k59328J23056J63134l19188l713L22602k31423J77141
13708F88029k15402Q5105K95256o1224l32018J93086m2586k21737J38545K58213
13698G85267k88989L15813j10606j16362p1114j16044N4460L35810C42734M66783
13688H09517k10129j92439j84645Q3399K55337l6262Q2009k56636M3543Q053m6568
13677C55179L22761k44455o0639J10304J22910k31060j48083N1986K08647B38230
13666D97928k6710o327j19601j15069K98926A36484M72976k56410K8079J43181
13656E24310k59817J63149J30553c028B27327K08391O1205o7012j1833J08238
13646E26316j55527j18822o4391L02596I3326M41503j49759J59632B7840N37913
$$ plain form
13718 757755 455948 715748 456420 579476 742610 423422 419709 742311 510888 688029
13708 688029 472627 557732 852988 791764 459746 652832 610246 388509 527054 785267
13698 785267 496278 812091 701485 585123 514009 397965 452425 788235 342734 809517
13688 809517 599388 406949 222304 305703 561040 524778 606787 350151 393694 401747 355179
13677 355179 677940 433485 372846 483150 606060 375000 226917 278903 487550 238230
13666 497928 471218 464891 345290 230221 529147 136484 609460 353050 381129 524310
13656 524310 264493 427642 558195 -3028 227327 435718 496923 429911 418078 526316
13646 526316 370789 251967 187576 490172 93326 534829 385070 544702 27840 565753
13636E65753k42372K06527k23756E2257J62976K34225B06296K50479n7479R981
13626D09277m389O2362K1725p5779A91947Q4231K21362A0506L46751J2175L09441
13615F78873k71248j28193L05351A25633L79465k23123n1816K04301n9257N758
13605C80961j51235I3615L76445j43032J06952j42525j41701M14300k27072j6395
13595C20587A56136O24748C01864N7260K06617k59000k6864M174L0635j39678
13585A75008M01750n0835B55631J12449G2025K91732I369J01358J89254l4294
13575B65687J3429j534K01637o9712J816k2845p7500J97824k53617f5712C55579
13563B73091k2634K45713J45429A77263L3478J56377n7231L1255q4164K98419
$$ plain form
13636 565753 323381 529908 306152 52257 215233 449458 206296 456775 399296 409277
13626 409277 404888 467250 488975 413196 191947 276178 497540 10506 357257 369432 678873
13615 678873 407625 279432 584783 125633 505098 281975 230159 434460 375203 380961
13605 380961 229726 93615 470060 327028 433980 291455 149754 564054 336982 320587
13595 320587 156136 780884 301864 359124 565741 306741 279877 284051 314686 175008
13585 175008 576758 525923 255631 368080 72025 363757 9369 110727 299981 265687
13575 265687 279116 277582 479219 409507 411323 388478 310978 508802 255185 -65712 355579
13563 273091 250457 496170 641599 177263 210741 367118 309887 341142 256978 555397
13553E55397B68450J91767j37753R2570n2261o2636D6055O98429B30168p1374
13543A58794K60089j09495J62900I9681J27969K70001B19278J83255o8875J7641
13533C51299j15623Q174E099K63781J42914m5255A04554K49934j64500M42751
13523F32739B92322A0573K72088N1688E6589K48278J30532Q5635k20787J04794
13513D05041Q1047A49766a73875B45099f846B94837r2290J21279o9245J26830
13503C81411M1831B1868P10982B52789q0166Q481C8263L14488A10043J41195J24319
13492C75557j25281E6578L07927N6843A45364G2613J70287b16014A36400P0261
13482B06661q4650L75115j19006B3693M61086k16492J42355b9382D58503j84653
$$ plain form
13553 555397 268450 460217 322464 415034 362773 300137 46055 744484 230168 158794
13543 158794 418883 309388 472288 99681 227650 497651 219278 402533 333658 351299
13533 351299 235676 243850 5099 268880 411794 366539 104554 354488 189988 632739
13523 632739 292322 10573 282661 334349 56589 304867 435399 521034 300247 405041
13513 405041 486088 149766 -173875 245099 -6846 294837 202547 323826 254581 381411
13503 381411 423242 21868 732850 252789 172623 181104 38263 352751 110043 251238 375557
13492 375557 250276 56578 364505 421348 145364 72613 242900 -216014 136400 206661
13482 206661 122011 497126 378120 23693 484779 268287 410642 -29382 458503 273850
13472B73850j5655I3278L8974k7676K75441a51192A59184K64957n5856p888J55264
13461E15661d1731H7974K22122J85088q4400A9572J80967p8663O2355k7298J88605
13450C45538G6908K00168i6734A98175J04307B9821K97663J42321a46137A32781
13439B78217m7441E99M05521j0579L5999J98751B93900k7119o0322b5365C97451
13427C00479H2785J99337A7751J05907N5765o1406J90725n0953R1665A50933M38792
13416E89725i3985A37903a54140E7183N65757I6587k2352R6208O6073a40490B65005
13404D59416A78758J13660n9618k9014K4758p8352J16881r615p1485R5085r4987
13393A86071a36662A51244J01509q0016m6102o1033a39274C67672l3956j43920
$$ plain form
13472 273850 258195 93278 132252 104576 380017 -151192 159184 424141 368285 360397 515661
13461 515661 -41731 87974 310096 495184 410784 19572 200539 121876 184231 156933 345538
13450 345538 76908 277076 -96734 198175 302482 29821 327484 469805 -146137 132781
13439 278217 230776 599 406120 395541 431540 630291 293900 266781 206459 -25365 397451
13427 300479 82785 282122 17751 123658 179423 118017 308742 257789 349454 150933 589725
13416 589725 -93985 137903 -154140 57183 622940 96587 74235 170443 236516 -140490 265005
13404 459416 178758 292418 232800 203786 228544 150192 267073 257458 185973 281058 186071
13393 186071 -136662 151244 252753 172737 126635 65602 -139274 367672 333716 189796
13383A89796e7479J6738C56982a07292B51309j17801D168K20991J45137F9146
13372B21161K1300J32942r5502R5903j77351K0422I3263K27858i6707C87359j58315
13361B29044A2616J22721K8934B730L16569D3196K96894a2306F136J88958r959
13350A85135j4723K39978n359q2325C7977P2034L84180j00812m4873n5813q4584
13339B08109N5823A29208Q914K58887A67156G5555K29370j15064j5425K07413
13329C81849l4176G6748H803K18064k0871b5524E11384A14130L08490j65578b70367
13317g2041B59843K0358N990M0603N723a37729j31964C7508K47299a38249A60994
13305B61080h5977q8981B92610a9034H4837b10771D9851b35677A19292B2495K89522
$$ plain form
13383 189796 -57479 -40741 356982 -107292 251309 133508 4168 225159 370296 69146
13372 221161 242461 375403 279901 375804 198453 218875 93263 321121 -96707 387359 229044
13361 229044 12616 135337 164271 2730 319299 43196 340090 -12306 6136 195094 185135
13350 185135 170412 410390 405031 322706 37977 110011 494191 393379 348506 292693 208109
13339 208109 263932 129208 138122 397009 167156 75555 304925 189861 174436 381849
13329 381849 347673 76748 8803 226867 205996 -25524 511384 114130 422620 257042 -270367
13317 -72041 259843 280201 286191 326794 332517 -137729 -269693 37508 284807 -138249 160994
13305 261080 -85977 -174958 292610 -19034 84837 -210771 49851 -235677 119292 22495 312017
13294C12017K2755D2683J79425k3813G3650O587O499M9175e813j9762a1999C19531
13281b7304A9666J61014a86975B47510p9553j9871b4428C68025M6723j28737N3509
13270C39520J96489b5346B01614J2060K29661E2272e5157q8539o8417A86782J5511
13259B02293O1354R5711A43955M625j7471E2962J04740O3410I2489J02437a6487
13247h2528a1309q2366A60182P3981a48625A4336M46759A96484p2147E3563A9705
13235A46455m8024M7916c286C948d0775C24959j58237o853J1845B0470L19605
13224C40075i962j0829C74048j19237O9261D2999J64722F1228L46103D3778J4717
13213E8495B9158K98945b26613A92444m2480J22713J94663j64813A01978J91102
$$ plain form
13294 312017 334772 42683 222108 198295 73650 80237 86736 135911 -5813 -25575 -11999 319531
13281 -27304 19666 180680 -186975 247510 167957 148086 -24428 368025 414748 286011 339520
13270 339520 536009 -25346 201614 213674 443335 52272 -55157 -143696 -212113 186782 202293
13259 202293 263647 359358 143955 148580 131109 52962 157702 221112 92489 194926 -16487
13247 -82528 -11309 -93675 160182 234163 -148625 14336 461095 196484 124337 53563 19705
13235 146455 98431 146347 -3286 3948 -40775 324959 166722 159869 171714 20470 340075
13224 340075 -9962 -20791 374048 254811 324072 42999 207721 61228 407331 43778 58495
13213 58495 29158 328103 -226613 192444 149964 272677 467340 302527 101978 293080
13203B93080n6157a32060A72057m8753K7774F0510J40724J49530j14914a366C09332
13191A7789K24612r1483C7330R3406f3782I2202M6480a79377A18881J36064q6746
13180A68199l8603M5577J5868d0737a64B95300i385A96696a53968l960A16092
13168a61745H1432K9844C9825a45125a3007G982L71090j02529b25770I7564I235
13156a00360I4507J94668a19163A85226e6245C10659q9059a74873D62269A43780
13145C06045a16656j0537F2930j9061f5073B4467d7361B1755N31561f272r3928
13134a00200B36254o0277j2825B487e90424h9958l26549g9500A1306J32414O925
13123A50645P137b38693I7290A4071b01339A60006b63891C33876j62841A8923
$$ plain form
13203 293080 236923 -132060 172057 123304 151078 60510 201234 350764 235850 -1366 309332
13191 17789 242401 150918 37330 130736 -63782 92202 138682 -179377 118881 254945 168199
13180 168199 129596 175173 191041 -40737 -164 295300 -9385 196696 -153968 -157928 116092
13168 -161745 81432 111276 39825 -145125 -13007 7982 379072 276543 -225770 97564 9235
13156 -100360 94507 289175 -119163 185226 -56245 310659 221600 -174873 462269 143780
13145 306045 -116656 -127193 62930 43869 -65073 24467 -47361 21755 553316 -6272 -100200
13134 -100200 236254 175977 163152 2487 -590424 -89958 -416507 -79500 11306 143720 150645
13123 150645 157782 -238693 97290 14071 -201339 160006 -263891 333876 171035 18923
13112I5016L7732Q8622J50714b3046E3270K52039l9188D5499b1725B07011J20434
13101C27445j17685L44726c8582G6193J81887a66139I6810a91685A47311C0957
13090e9049b5141m0893D56639j6307a17097H2684J8045L9531B7094J75486o3636
13079A38944N1421Q4641G7619N0862J85160a57296C20065D5128J08195a1227j75981
13068a87208b5024A62936G5540K13916I03L04235j18731a14215B13193R9093j23040
13057A89246a71185A73276b08979c8630G6876J69425J05385A26506J22256F5890
13046a73194K1902G2893a41427B13290b64198A01898h1798G9412L4842J78565
13036B92819e8234D6671J28245B190J84659K43948d0990C01032J08807q2450c9304
$$ plain form
13112 95016 132748 221370 372084 -23046 53270 305309 266121 45499 -21725 207011 327445
13101 327445 209760 554486 -38582 76193 258080 -166139 96810 -191685 147311 30957
13090 -59049 -25141 -66034 456639 440332 -117097 82684 100729 140260 27094 202580 138944
13079 138944 190365 275006 77619 128481 313641 -157296 320065 45128 153323 -11227 -187208
13068 -187208 -25024 162936 75540 289456 903 305138 186407 -114215 213193 312286 189246
13057 189246 -171185 173276 -208979 -38630 76876 246301 351686 126506 248762 65890
13046 -173194 -151292 72893 -141427 213290 -264198 101898 -81798 79412 114254 292819
13036 292819 -58234 46671 174916 2190 186849 430797 -40990 301032 409839 327389 -39304
13024C27132I2383a53209A93645c01637A56857J03582K36758D9594K31757k6276
13014B55075j18754J85040J17352j4012f370k65601B72617B6294H254O2573J10102
13003A80929a81519A95994I2102g0821A26939a9870j9425D6532L11143A04665
12992A27198K41670A57372p6838J48498O1852l5568A09619c6133l6359j58530
12982b31022R4170b9557A14138l5413J4748J1838D9694K36442H8960K12146G7259
12970C25682Q7903k05158o7561M5013c2701C37524A52700c2821j53752I7162h3153
12958B90781A26146k2460f9571m3679D2613f3494A01156d1567C37252b15243A25788
12946G2223a72713o4728B3306J70685K8347b17587i2283m3398A28372c41802f5348
$$ plain form
13024 327132 92383 -153209 193645 -301637 156857 260439 497197 49594 281351 255075
13014 255075 136321 321361 438713 424701 -6370 -271971 272617 26294 8254 70827 180929
13003 180929 -181519 195994 92102 -70821 126939 -19870 -39295 46532 357675 104665
12992 127198 368868 157372 80534 229032 290884 255316 109619 -36133 -72492 -231022
12982 -231022 -136852 -29557 114138 78725 93473 105311 49694 286136 88960 301106 77259
12970 325682 413585 208427 140866 185879 -32701 337524 152700 -32821 -186573 97162 -83153
12958 290781 126146 103686 -69571 -113250 42613 -63494 101156 -41567 337252 -215243 125788
12946 72223 -172713 -237441 23306 193991 222338 -217587 -92283 -135681 128372 -341802 -65348
12934b64106A47880b51149A33389N4081C2261K09662c54654a42726M5829A97875
12923b40428B15143a9482I3843e8306C13375A56494i3651C4729L8602a04695j40271
12912b44966N2044B37767D4984f5925k0542C07156B8410J49277b58241A43400
12901b55152g5517a3064q512m491C21738e0925H3902b15006E345d5575J0926j19430
12889a54079K7774e2909B11201I0294f1890F3026K29721c1806B02220I1845h583
12877F7096A3373c44250n2357a62727f5196C5487g6377A09743f7454B23151A10953
12865C4141L6649O2071A9055J88063p8402g047k69937C29393G3164j7289Q7183
12854A43058J38111r6078e8309j58264a6287j20912D1151L0221b9174B3685a03634
$$ plain form
12934 -264106 147880 -251149 133389 187470 32261 241923 -354654 -142726 -96897 197875
12923 -240428 215143 -19482 93843 -58306 313375 156494 -93651 34729 73331 -104695 -244966
12912 -244966 -192922 237767 44984 -65925 -86467 307156 28410 177687 -258241 143400
12901 -255152 -75517 -13064 -21576 -26067 321738 -50925 83902 -215006 5345 -45575 -34649 -154079
12889 -154079 -126305 -52909 211201 90294 -61890 63026 292747 -31806 202220 91845 -8583
12877 67096 13373 -344250 -396607 -162727 -65196 35487 -76377 109743 -67454 223151 110953
12865 34141 70790 132861 19055 207118 128716 -7047 -276984 329393 73164 55875 143058
12854 143058 281169 185091 -58309 -216573 -16287 -137199 41151 71372 -29174 23685 -103634
12842i3073A86921B3313h7933L5633j01818A76221h567A01201K0295R6948G4425
12830B9719K8475R5949J50388a47765A33949c8160A86220F8572J55280a65439
12819B35180H2441J2794L2959h1222B46835r3553a63889G3745a10897O479d6099
12807D1524K6525J05376b66023C5692J71910c5873B1464P1287K15613j15980o0230
12796A32154d7517k66309J46532e422A82800b75575g8339A63551a31642A41737
12785B29028a7747j94804C1196a60730c4132I254O8927r214A0151J39894B8578
12773e3878q4324C14483a89109R0693A95890a85113A10920D4015O1108e7091H779
12761a71471B95374C7290K76637d02128I4523a5005p4656c7330F7190B3528L08572
$$ plain form
12842 -93073 186921 23313 -87933 -52300 -154118 176221 -8567 101201 121496 218444 74425
12830 29719 58194 154143 304531 -147765 133949 -38160 186220 68572 223852 -165439
12819 235180 82441 95235 128194 -81222 246835 153282 -163889 73745 -110897 -104418 -46099
12807 41524 68049 173425 -266023 35692 207602 -35873 21464 92751 308364 192384 132154
12796 132154 -47517 -313826 -167294 -5422 182800 -275575 -78339 163551 -131642 141737
12785 229028 -17747 -212551 31196 -160730 -34132 9254 78181 68967 10151 150045 28578
12773 -53878 -138202 314483 -189109 -98416 195890 -185113 110920 44015 105123 -57091 8779
12761 -171471 295374 37290 313927 -402128 94523 -15005 -89661 -37330 67190 23528 332100
12750C32100H0012L03311A29798E9524a45127C50869i61A8001N4414d5423C16876
12738E5016b73512F9303N7775Q0613C878K79731a96518f8451j64395b4499B34971
12726a67844A20036m7619A3449J82653F5404Q9170c9399k05395A25215C6615I846
12714C09178d4265J1722p9353E5277O8444J29528A02896l172R6942F2917a36007
12702b9173B01777a26002k4257A89795g5157A28905M8960q5957J29640Q6189A20338
12690B33915J36587b87976I5918O4588K92825A26125a12292n3488d0914B79186
12679c14542C04424a07131D32510c8441k14800B25155A8905L28186a87606D05080
12668g7874B0366J96031e7136B078a0151F4045K1811d3156k6607B10597j9965
$$ plain form
12750 332100 80012 383323 129798 59524 -145127 350869 -961 18001 72415 -45423 316876
12738 55016 -273512 69303 127078 207691 3878 283609 -196518 -68451 -232846 -24499 234971
12726 -167844 120036 72417 13449 196102 65404 154574 -39399 -244794 125215 36615 9846
12714 309178 -44265 -32543 -111896 55277 123721 253249 102896 99724 196666 62917 -136007
12702 -29173 201777 -126002 -150259 189795 -75157 128905 177865 91908 221548 307737 120338
12690 233915 370502 -287976 95918 160506 453331 126125 -112292 -165780 -40914 279186
12679 -314542 304424 -107131 432510 -38441 -253241 225155 18905 347091 -187606 405080
12668 -77874 20366 216397 -57136 2078 -10151 64045 85856 -43156 -69763 210597 190632
12657A90632k41J89891B7327e4072I5255K11598C5942a5314B13801b6186n3148
12646g9334B18130H6477b05778B26226n4290e19684a00782D5699c426l41292a29326
12634A73100a25447C00033n1488f1356I8547L17878A31965R8727A02787J69304
12624B72091h356l1728n994B0563J52508D4100J10716a1135B36269F9183a96606
12612d2247A57473k6585a23032H6968C3125A3778L56957b14891C8897b68736a10428
12600a27551B15540J2254G0003K4668a80347A38922J59807a93080B15348b33166
12589A75214a45967N4922A68706J3313b24313G7333K97801E4222a54444a0379
12578a33780B3473i0658l18717A28410R904K39459j72046a52882A69811b38948
$$ plain form
12657 190632 190391 380282 27327 -54072 95255 306853 35942 -15314 213801 -26186 -79334
12646 -79334 218130 86477 -205778 226226 171936 -519684 -100782 45699 -3426 -344718 -129326
12634 173100 -125447 300033 248545 -61356 98547 416425 131965 230692 102787 272091
12624 272091 -8356 -40084 -46078 20563 173071 44100 154816 -11135 236269 69183 -196606
12612 -42247 157473 130888 -123032 86968 33125 13778 370735 -214891 38897 -268736 -110428
12600 -127551 215540 227794 70003 94671 -180347 138922 298729 -193080 215348 -233166
12589 175214 -145967 -91045 168706 182019 -224313 77333 375134 54222 -154444 -10379
12578 -133780 23473 -90658 -409375 128410 138314 377773 205727 -152882 169811 -238948
12567c6821k1798k46827B60313B390K264b39143B41588N3278h7449j16683B46591
12555a2061C1903p440J882J19232J88891b5415B74468d4687r2805e1570m5664
12544i7234A04674P3335a52839k32512A13044a06784B33945c1113A65604L31742
12534D97346A0628l004a33362J2247e4619j1124A09757m1012Q8952a48653A76288
12522b2087c25A40394a6304k06448c2854m469a3286l6187B57062O680j26475a7744
12509F351J50960l2951n3879c7049a3119j4524E4999b20712A77512J00996H3404
12497C3245f6887j39177F3620b99684b7132j87087O3980C2109h055A97766a62565
12485b52398i4774r2369b8276B0677i5846l28695F9649B3831b76764B32828g6513
$$ plain form
12567 -36821 -58619 -305446 260313 2390 4654 -239143 241588 294866 -87449 -204132 246591
12555 -12061 31903 24463 26345 145577 334468 -25415 274468 -44687 -137492 -51570 -97234
12544 -97234 104674 178009 -152839 -385351 113044 -106784 233945 -31113 165604 497346
12534 497346 10628 7624 -133362 -121115 -54619 -65743 109757 68745 157697 -148653 176288
12522 -22087 -325 140394 -16304 -222752 -32854 -37323 -13286 -49473 257062 263742 137267 -17744
12509 6351 157311 124360 70481 -37049 -13119 -27643 54999 -220712 177512 278508 83404
12497 33245 -66887 -206064 63620 -299684 -27132 -214219 -150239 32109 -8055 197766 -162565
12485 -252398 -94774 -187143 -28276 20677 -95846 -424541 69649 23831 -276764 232828 -76513
12473b59349A18553a26375K4401A19454d14558b1217I665Q8503a15987N2905a8034
12461F3404o971g497B8780j192a6354l97327D2209j6006c15345h0017G8564b88724
12448c5556C2627e7889b7851r4199j26923A44660a57730j2650C44370A36090J23533
12437B59623a13278I2967N4789j5477a96671F4744R4912c9769B92432a30756B77902
12425a05120d6192E1444R6658f2680E9867C153K7531J45998e3189F8361J6209
12414H4570N6212C9691a04952c6112A57552F566a26713A11035B8077d4519q9606
12403a34125C63070c74687A04221e5935j00358e0031B5861O713O6250M2323b63938
12391a78758B27763c08472a53626L2482G8132c0860C67962r8582B1000K89691
$$ plain form
12473 -259349 118553 -126375 -101974 119454 -414558 -21217 9665 98168 -115987 -63082 -18034
12461 63404 56433 -7497 28780 27588 -16354 -413681 42209 26203 -315345 -80017 78564 -288724
12448 -35556 32627 -57889 -27851 -122050 -248973 144660 -157730 -170380 344370 136090 259623
12437 259623 -113278 92967 147756 132279 -196671 64744 159656 -39769 292432 -130756 277902
12425 -105120 -46192 51444 148102 -62680 59867 3153 30684 176682 -53189 68361 84570
12414 84570 140782 39691 -104952 -36112 157552 6566 -126713 111035 28077 -44519 -134125
12403 -134125 363070 -374687 104221 -55935 -156293 -50031 25861 32574 98824 141147 -263938
12391 -178758 227763 -308472 -153626 -121144 78132 -30860 367962 269380 21000 310691
12381C10691h885j0942H4184a0364j53582a0168j42069E5333K60734q6759H5340
12369A75876a8235n0936J3104a1282j7268m104p5822H2988B9611a84862A64375
12357B99271D6639a30657A64184c3790o0448i188j87643B31283J7634H1963J98274
12346B80237A05937a82496E9129P1602B0404c46467C9776R5950a25460G0578Q7523
12335A58101m7938c2611j611j31055E1516g5580A3643a65680e2911j65265C13363
12323A41813c58112a11286b4329k84110A3777l041g274o5667B23723o7889a05942
12311H1765d9927j13961H7494a64218d0183B2646h693j0723l9911K613G7352N2492
12299A29844a26220b1282B06368Q5575G4367d1486P781A60919j3850B4889i382
$$ plain form
12381 310691 -8885 -19827 84184 -10364 -163946 -10168 -152237 55333 316067 229308 85340
12369 175876 -18235 -69171 -56067 -11282 -28550 -32654 -108476 82988 29611 -184862 164375
12357 299271 46639 -130657 164184 -33790 -94238 -9188 -196831 231283 248917 81963 280237
12346 280237 105937 -182496 59129 130731 20404 -346467 39776 135726 -125460 70578 158101
12335 158101 110163 -32611 -34222 -165277 51516 -75580 13643 -165680 -52911 -218176 313363
12323 141813 -358112 -111286 -24329 -308439 13777 10736 -7274 -72941 223723 155834 -105942
12311 81765 -49927 -163888 87494 -164218 -40183 22646 -8693 -19416 -59327 -56714 77352 129844
12299 129844 -126220 -21282 206368 291943 74367 -41486 -33705 160919 147069 24889 -9382
12287a53096B11467C0560M7256e7392B64245b18890A71424k3655Q4440N7796j06805
12276A83200D665L4404J41420J58108c4117A15715m0561L9944C3860K52336I94
12264b68499C1569Q4445L37276a09133i766q7998c5080j65647F3955c6897j080
12253c7977k4000C01747C7770d0429I1107C0318b4608C41205A39871J31987l1509
12242B40349L6026A17999L30561H9773A0985a59705H2422i7457B20050k0222a59078
12230e6754B41426A3563e5359B91418L5423n0926o195a05094B34434L4068j1203
12219B57299q6060i8441h00C19527A6964N5643K70382B1692L91925i2124C4681
12207e0945A3876R7384M2320n6089K19936q8726H7964K70575A23996N2510Q3272
$$ plain form
12287 -153096 211467 30560 77816 -57392 264245 -218890 171424 147769 232209 290005 183200
12276 183200 4665 39069 180489 338597 -34117 115715 75154 115098 33860 286196 994
12264 -268499 31569 116014 453290 -109133 -9766 -97764 -35080 -200727 63955 -36897 -37977
12253 -37977 -61977 301747 37770 -40429 91107 30318 -24608 341205 139871 271858 240349
12242 240349 276375 117999 448560 89773 10985 -159705 82422 -97457 220050 199828 -159078
12230 -56754 241426 13563 -55359 291418 326841 275915 269720 -105094 234434 268502 257299
12219 257299 171239 -98441 -800 319527 16964 72607 342989 21692 413617 -92124 34681
12207 -50945 13876 111260 153580 97491 317427 228701 87964 358539 123996 176506 259778
12196B59778p8917R0312a16812B38113a68665B26243K68851A5543K74592a37263
12185A2958R5416D0183N6471K6579E2269K7690J94299j7279A28124J3324p518
12174A33930J68773j37937a73818C6943a7396C67038D4567K96628N2680E6000
12163E85346C1471a17960D2982M19548A08885i7838I8579j3994a780A47507Q9476
12152B36983m4709N540j7397L297a6515j06124B14141a86670B93108a97558E1121
12140A24599E6443a14423L5366A17762C4464a39487D7438a47583B98311a62835
12129D0189p890c5314A18377a47299d7557B0156K8805h8563k4494A38986d947
12117c9836A05429a54515J342o5445A52961b41470P6815g8401j87935d5349D48292
$$ plain form
12196 259778 180861 271173 -116812 238113 -168665 226243 495094 15543 290135 -137263
12185 12958 108374 40183 96654 123233 52269 79959 274258 256979 128124 141448 133930
12174 133930 302703 164766 -173818 36943 -17396 367038 44567 341195 393875 56000
12163 585346 31471 -117960 42982 462530 108885 -97838 98579 84585 -1780 147507 236983
12152 236983 192274 197814 180417 183714 -16515 -122639 214141 -186670 293108 -197558 51121
12140 124599 56443 -114423 -79057 117762 34464 -139487 47438 -147583 298311 -162835
12129 40189 32299 -35314 118377 -147299 -47557 20156 48961 -88563 -113057 138986 -4947
12117 -39836 105429 -154515 -153173 -218618 152961 -241470 -164655 -78401 -266336 -45349 448292
12105H8360B0500K24445g0257B74863b03886C6878a54341f0679B33867A04208
12094e7849c128l15527d9612n6217G5928a16443C9536Q2821a34578A210K24724
12083B25934J99740J08974J025519L5204p70247B05545H1045l811K14482i4274
12072F22185a23343a7667j5508k64475a38730M5000C16398a61435A56911g8218
12061C22899i226I6174Q091d2236C01692a5547p2494D4705c1135k49821J25035
12050a55921C53632A09732e4212b6231A50582a59794B58669q3403j2794B7906
12039C69150I123a9287r0337B50125A21057f7135j95932G2365b33225a06470b0977
12027A79339N2847n5440e3157k1178j22272l854F4653J0811K59622m4906a63415
$$ plain form
12105 88360 20500 244945 -70257 274863 -203886 36878 -154341 -60679 233867 104208
12094 -57849 -3128 -318655 -49612 -105829 75928 -116443 39536 122357 -134578 1210 225934
12083 225934 425674 534648 1560167 1595371 825124 205545 81045 77234 291716 -94274
12072 622185 -123343 -17667 -33175 -297650 -138730 -93730 316398 -161435 156911 -78218
12061 322899 -9226 96174 104265 -42236 301692 -15547 -88041 44705 -31135 -280956 -155921
12050 -155921 353632 109732 -54212 -26231 150582 -159794 258669 175266 162472 27906
12039 369150 9123 -19287 -109624 250125 121057 -67135 -263067 72365 -233225 -106470 -20977
12027 179339 232186 176746 -53157 -74335 -196607 -200461 64653 75464 335086 290180 -163415
12015e2783q4487H9278Q725b03374k3363g0241C3979g6466c8050E3666a98184
12003f1352k99270I7864e302A64276l2849b32339j03081E833b63406A99616D2629
11991i231l05088J02697B2908f8966B47228E1659f6532j72571I5276h4349o9413
11980a53762A83765a18240B13029i6382A19926a83802B08215J4812a85303B46615
11969a79598M9272K6820M5472p312C5903D214a39493b8155j09420D56242e4388
11957b4290A0867M002i2149q4762j01426A25026h4151n6392A09084g5966a3988
11945A33847a04129o0929B22260e02628A34168g8146H0203a21802n280l05829
11935d32911h9613K6218j4011B11358f3607j06265q352A55189P9109G7321a89690
$$ plain form
12015 -52783 -137270 89278 98003 -203374 -226737 -70241 33979 -76466 -38050 53666 -198184
12003 -61352 -360622 97864 -5302 164276 131427 -232339 -335420 5833 -263406 199616 42629
11991 -9231 -314319 -211622 22908 -68966 247228 51659 -66532 -239103 95276 -84349 -153762
11980 -153762 183765 -118240 213029 -96382 119926 -183802 208215 223027 -185303 246615
11969 -179598 -130326 -103506 -58034 -65346 35903 4214 -139493 -28155 -137575 456242 -54388
11957 -24290 10867 14869 -92149 -176911 -278337 125026 -84151 -140543 109084 -75966 -13988
11945 133847 -104129 -165058 222260 -502628 134168 -78146 80203 -121802 -127082 -432911
11935 -432911 -89613 -63395 -77406 211358 -63607 -169872 -178224 155189 234298 77321 -189690
11923B70375A00637J02696a88531C35144a27058A94935q2254I407a32969L1545
11913a01424j00689G6960K96482F0976L9876a66750D346a46710p9317B15208C5945
11901a34126N5145A05920a16526j88104A93L1127J2498b2360m0916p4736O3437
11890g4575A29700l6245b78643A5959Q4866C6474a17589d527k49666F7796c6714
11878b27819I7209A7632K53716a95361A55538k4599k8584l5692N1640c30209i3220
11866c95354a68956c965k61430J15989k417d2905k37340A23643c19202A95063
11855h4981C8082b43243P9763e935j26276A93069c1399k82370e01k08719l8082
11844b47302o2116L0870J26569j00081j07642C6384N7464K5667b32405J14837
$$ plain form
11923 270375 100637 203333 -188531 335144 -127058 194935 112681 9407 -132969 -101424
11913 -101424 -202113 76960 373442 60976 100852 -166750 4346 -146710 -226027 215208 35945
11901 -134126 -78981 105920 -116526 -304630 193 31320 43818 -22360 -63276 -138012 -74575
11890 -74575 129700 93455 -278643 15959 100825 36474 -117589 -4527 -254193 67796 -36714
11878 -227819 97209 17632 271348 -195361 155538 130939 102355 66663 118303 -330209 -93220
11866 -395354 -168956 -3965 -265395 -149406 -151823 -42905 -280245 123643 -319202 195063
11855 -84981 38082 -243243 -163480 -5935 -132211 193069 -31399 -313769 -501 -209220 -247302
11844 -247302 -309418 -278548 -151979 -252060 -359702 36384 93848 119515 -232405 -117568
11834a17568F4097c21489A63539p6228K00088f0945k0202p469o2387c7217B0249
11822I7127d067j9162B25579D0651a19937o1718B4053N1617K40477a10074Q240
11811a01834j26077A94340b14839E6306R6263K1414h013A94425q5406D549a7577
11799A3880c0378k48024a12157H5338i0730A73099a43867A1518b06571b2926B31527
11787d79404b24199A34528b14456A43125j2918A601b38392F2037b0116j04455
11777a24571C29568a6368m99073A05540b37352c1857l5476l811A3573N1368e8243
11765A07191a94698I1282J11479c3358A33496p210d48515a57873c481m9867A66829
11753a05432A63152A5744M533b56309i7068K824r501A17334P8746o6227l6404
$$ plain form
11834 -117568 64097 -321489 163539 87311 287399 -60945 -81147 -88616 -151003 -37217 20249
11822 97127 -4067 -23229 225579 40651 -119937 -181655 24053 75670 316147 -110074 -101834
11811 -101834 -227911 194340 -214839 56306 152569 173983 -8013 194425 109019 4549 -17577
11799 13880 -30378 -278402 -112157 85338 -90730 173099 -143867 11518 -206571 -22926 231527
11787 -479404 -224199 134528 -214456 143125 130207 1601 -238392 62037 -20116 -124571
11777 -124571 329568 -16368 -515441 105540 -237352 -31857 -67333 -71144 13573 64941 -58243
11765 107191 -194698 91282 202761 -33358 133496 126286 -448515 -157873 -3481 -53348 166829
11753 -105432 163152 15744 20277 -256309 -97068 -94244 -103745 117334 196080 129853 93449
11742I3449L4589D1774o75C29L38349p8364a74071G8695a63243B37739j02781
11731A34958a13869N1534G9392H220L4557O7100C9910R2303A4627N1225a17364
11719A53860C6867L9753a3673A18039n8002J20409j0077G6834Q6590a17545B79425
11707a92743O5936A29718B1368J11765B6838J38478a6711A31372k1872f1572k65792
11696c27364g8150j32130A24887c7400E5256i5854A34396b27627A37874b24880
11685F295a6033F7216N6094g4515o7882A10601a46817C04247F6222J64371r0961
11674A39632i2381o3359F0051O9689D867a68308M6302I5820i5842A73970J7126
11663A91096q2204l3803j6642c656H7783a39980d0913p0879K0402F0610L85727
$$ plain form
11742 93449 128038 41774 41099 329 338678 260314 -174071 78695 -163243 237739 134958
11731 134958 -113869 -62335 79392 8220 42777 109877 39910 132213 14627 65852 -117364
11719 153860 36867 76620 -13673 118039 60037 180446 170369 76834 163424 -117545 279425
11707 -192743 -126807 129718 21368 133133 26838 165316 -16711 131372 109500 -61572 -327364
11696 -327364 -78150 -210280 124887 -37400 55256 -95854 134396 -227627 137874 -224880
11685 6295 -16033 67216 123310 -74515 -142397 110601 -146817 304247 66222 230593 139632
11674 139632 -92381 -155740 60051 129740 4867 -168308 -122006 95820 -95842 173970 191096
11663 191096 108892 75089 58447 -3656 87783 -139980 -40913 -111792 -91390 60610 446337
11652D46337j35258e5599D6893J02901l2693K739N6114a58876A29750l1010a60201
11640I8758L08918j78949b10870D3955A0997L1858a21605j15294A44412a56215
11629d4718A90066C8066C627O7858B1753O0874a08049A37077J5203j8261c89362
11617d0789j53452C942K35863E1614c25350C2570f0435A63992b29732A21892R8595
11606B20487e8648a2291A38410b68341H9026L2723c30535J62058I9211M109K11609
11595C14929e3356A32095b39380i8025r4495N5075A81118d1438D4089c94173A33523
11583A62220d4636n1744q9486B13020I9518b98953M3858A49334F1419J03760a50209
11571B67522g2945o3720N6572B52863p1142c5619B7731L96387h0866p2343L9028
$$ plain form
11652 446337 311079 -55599 46893 149794 117101 119840 175954 -158876 129750 98740 -160201
11640 98758 407676 228727 -210870 43955 10997 42855 -121605 -236899 144412 -156215
11629 -44718 190066 38066 3627 71485 21753 82627 -108049 137077 152280 134019 -389362
11617 -40789 -194241 3942 239805 51614 -325350 32570 -60435 163992 -229732 121892 220487
11606 220487 -58648 -12291 138410 -268341 89026 121749 -330535 -168477 99211 103320 314929
11595 314929 -53356 132095 -239380 -98025 -192520 -137445 181118 -41438 44089 -394173 133523
11583 162220 -44636 -96380 -185866 213020 99518 -298953 -255095 149334 61419 165179 -150209
11571 267522 -72945 -136665 -80093 252863 181721 -35619 27731 424118 -80866 -153209 -114181
11560a14181l0547a1430B05299A3616f9126l1504K0831B55327i3500B27332G980
11548B2629a10873F20216C8304I072J16818O6931p8184J07788J5805o1718c47873
11536D239a95365P8917B65676e5224C43356M7705d3540i972I9978P8019f8759
11524a8714A63328f2420A36354b7639A0670P871K5013d5767A50840m3520f1664
11512B7546J75003o6666l2330P0555n5320K60042l8972I899K21486l5413a25193
11500A64216n8177L13629a07633D7432b43151g6680n4932o440D6987L15118C4163
11488B8015J44163l6136q451J51763b11381B02094k8903J68729A48199a40202
11477F6746L18902j29375K0629a22668A81623d5357B5925K73472C691L8277J26371
$$ plain form
11560 -114181 -144728 -11430 205299 13616 -69126 -100630 -79799 255327 -93500 227332 7980
11548 22629 -110873 620216 38304 9072 125890 192821 114637 222425 238230 176512 -347873
11536 4239 -195365 -116448 265676 -55224 343356 391061 -43540 -9972 99978 177997 -68759
11524 -18714 163328 -62420 136354 -27639 10670 18541 43554 -45767 150840 107320 -61664
11512 27546 202549 135883 103553 174108 118788 378830 339858 9899 231385 195972 -125193
11500 164216 106039 419668 -107633 47432 -243151 -76680 -131612 -138052 46987 362105 34163
11488 28015 172178 136042 127591 279354 -211381 202094 173191 341920 148199 -140202
11477 66746 385648 256273 276902 -122668 181623 -45357 25925 299397 3691 41968 168339
11466A68339e9293D13986C3772g5034B12652J91459I3089a56634D6458c6353k549
11455c8902B10619k3207d1037a8643A7129b47225I5568J77633j6235a33308O3713
11444f9595j46324P8604a460B08568a11686A30080h7985b0956j96185A7117J45093
11433A62210c040A13312A2879d8773A06843a08093k82918B9119c1283A41232A5841
11421b98157I8606h2688B96864A09575c9483G8368a08321J3620m1239A48021a05136
11409f6629p3998L3838n8613A13518A3901a14307B23757h1836A4325a16906E454
11397a35414F2282a40971O8261A09963L9337m0946D148a16624D29476h8991B06070
11385C30972H68a65320B18821G1027B4911N16686A54307K63778a35748A7426d4452
$$ plain form
11466 168339 -59293 413986 33772 -75034 212652 404111 93089 -156634 46458 -36353 -38902
11455 -38902 210619 187412 -41037 -18643 17129 -247225 95568 273201 256966 -133308 -69595
11444 -69595 -215919 -137315 -1460 208568 -111686 130080 -87985 -20956 -217141 17117 162210
11433 162210 -3040 113312 12879 -48773 106843 -108093 -391011 29119 -31283 141232 15841
11421 -298157 98606 -82688 296864 109575 -39483 78368 -108321 -94701 -135940 148021 -105136
11409 -66629 -140627 -106789 -165402 113518 13901 -114307 223757 -81836 14325 -116906 5454
11397 -135414 62282 -140971 -72710 109963 149300 108354 4148 -116624 429476 -88991 206070
11385 330972 868 -165320 218821 71027 24911 541597 154307 418085 -135748 17426 -44452
11373a45107A57231a6925l07241A18738b0045l15802a34470o5602G7144P5061
11363A52205l6188b51438B11588a03588r7801l467B20065F4982b9031j55895J6904
11352a68022B81246J38484A15588b74216E9017g9398n1440I5408d1278n5451a4769
11340E0926d0493j0988B32450E6075j994J32680E1614J29204d5977A9402b3578
11328B56086h781B86912i7682L0638n2656E8840J8730A9545d27246b7979j44669
11317a72648j6492B1041c3474J3259I3069a20131j60065F0693b8915k5649C37374
11305a04312I8722a45852O5083A79367d1721j34450D8333f6744n8789E0478J55307
11294B05785r1852a09211k33867A13648D3165a10935k28375J66283m2554C2471
$$ plain form
11373 -145107 157231 -16925 -324166 118738 -20045 -335847 -134470 -200072 77144 152205
11363 152205 116017 -251438 211588 -103588 -201389 -204856 220065 64982 -29031 -184926 -168022
11352 -168022 281246 419730 115588 -274216 59017 -79398 -130838 95408 -41278 -96729 -14769
11340 50926 -40493 -51481 232450 56075 54081 186761 51614 180818 -45977 19402 -23578
11328 256086 -8781 286912 -97682 -67044 -119700 58840 77570 19545 -427246 -27979 -172648
11317 -172648 -189140 21041 -33474 -20215 93069 -120131 -280196 60693 -28915 -54564 337374
11305 -104312 98722 -145852 -80769 179367 -41721 -176171 48333 -66744 -125533 50478 205785
11294 205785 113933 -109211 -343078 113648 43165 -110935 -339310 -173027 -215581 32471
11283d9370o002E278L08457g25A13071R6410C4740i3164j84726d7788j08132P7279
11271g8641n871j22887g8088C0041d13490a25132j27553A18846b33081K6460B62327
11259h9894D3469g1138A12110Q507b29749B38876a89353j61785B86760h487j08894
11248a17381A16416J47522F3627A6191O6411a59161P4354m500c6700H6870a3617
11236A2675J87024b21577k84073B24055a75578j42722e7268j2156B51779G6412
11225A39293O0678p0319b9067E1905b59786R2429B15186K1908a18667j42450L4065
11214b27052B25211q4801J31345b35932j1789o6651B44276J30815a86514a3799
11203b38726A19519a48057H700a88586B15164E1326a61176A80477p1199e36478
$$ plain form
11283 -49370 -55372 5278 313735 -725 113071 209481 34740 -93164 -277890 -47788 -155920 -78641
11271 -78641 -84512 -207399 -78088 30041 -413490 -125132 -252685 118846 -233081 -206621 262327
11259 -89894 43469 -71138 112110 120617 -229749 238876 -189353 -351138 286760 -8487 -117381
11248 -117381 116416 263938 63627 16191 82602 -159161 -84807 -89307 -36700 86870 -13617
11236 12675 199699 -221577 -505650 224055 -175578 -318300 -57268 -69424 251779 76412
11225 139293 199971 129652 -29067 51905 -259786 -167357 215186 237094 -118667 -261117 -227052
11214 -227052 225211 140410 271755 -235932 -247721 -314372 244276 375091 -186514 -13799
11203 -238726 119519 -148057 8700 -188586 215164 51326 -161176 180477 109278 -536478
11192h1823p8123A52434d2236A91020A6559b3461A76897C9177a14843B16682B2020
11180H1976b52806E6554e119k29230A93202g002G7549c2101I7405b55891c2629
11168A41995m6054a76226j08519a42337q9119b2869F4317b06167j65370A73929
11157b36913P4024A16619k6113L9276i8967D1047d4091n8785H6438D1543d1639
11145b14970P1723B36251i4041c6095a3624F2359R2036D8711a41292H7211b72283
11133B54952b65442B75122K40563I9588D9410Q1309b9035K276E1664A5992J66901
11122A82893R9781C4358f6278H4051l9009K4627R5707l3812K47480C9459J57472
11111A96931o4025K99540A88507a78356D0927L44584A47521R5882o8013C7996
$$ plain form
11192 -81823 -159946 152434 -42236 191020 16559 -23461 176897 39177 -114843 216682 22020
11180 81976 -252806 56554 -5119 -234349 193202 -7002 77549 -32101 97405 -255891 -32629
11168 141995 95941 -176226 -284745 -142337 -231456 -22869 64317 -206167 -371537 173929
11157 -236913 -162889 116619 90506 129782 -98967 41047 -44091 -102876 86438 41543 -41639
11145 -214970 -143247 236251 -94041 -36095 -13624 62359 154395 48711 -141292 87211 -272283
11133 254952 -265442 275122 515685 99588 49410 130719 -29035 -26759 51664 15992 182893
11122 182893 282674 34358 -66278 84051 45042 69669 165376 131564 379044 39459 196931
11111 196931 132906 432446 188507 -178356 40927 385511 147521 243403 175390 37996
11100A27749c81017a12004C2758i3299A23753L67373A32332B8495b02833A84846
11089e7326B28797H7974K46016j54592I066M04194A75076M00369C0102J35770
11079A65872a50896f9972c3638H0441m077J12177L1812K53553j59515J70719r833
11068D75277j21690r8681M53696j39426j88842j30722r7812J67124H6863L74777
11058D61640K36139C18012L68677k83913J53148J15135n3630j01262p9635K3617
11048D60149K30463j38968l3296J19142j6236n0459N9558B43794r932N80193j68233
11037F45822q4308P7021k45756J16652J14477J83267l73001N8356j74961J66922
11027D84491r8565L18062J29424n7854C37766J60922A73972J9968M16015j16084
$$ plain form
11100 127749 -381017 -112004 32758 -93299 123753 491126 132332 28495 -202833 184846
11089 -57326 228797 87974 333990 179398 9066 413260 175076 575445 30102 165872
11079 165872 -150896 -69972 -33638 80441 76364 188541 220353 473906 314391 485110 475277
11068 475277 353587 254906 708602 569176 380334 249612 151800 318924 86863 461640
11058 461640 697779 318012 686689 402776 555924 671059 617429 516167 436532 460149
11048 460149 690612 551644 518348 637490 621254 570795 630353 243794 233862 814055 645822
11037 645822 561514 638535 392779 509431 623908 807175 434174 492530 317569 484491
11027 484491 385926 703988 833412 775558 337766 498688 173972 193940 609955 493871
11017D93871k03207O1606K1835j84349N52726l21614K53965k81137j9389N2388
11007D26695j77607J79387K71977l21440J18847J43691k38155M01220C73059J33467
10997E06526j9544L43836P4987D51885J67900J00857B70617K84138Q6595q6546
10987E54804J77784Q4669k34576R370N11337n17985R9946K22879J99514j02801
10977A004941L28717J63410j76102K97625K26479M64556l02383K24692O6555r0304
10967B208186l39175j58266k56016J17951K85311n25792p467M8164L55892k36938
10957A491850j63011j15139L50581J54126n04534k70474J43726k84834l67342
10948D34949J24489k24567K42832B46476o9166c1238D20559j01107E5701N2620
$$ plain form
11017 493871 290664 352270 374105 189756 742482 420868 674833 393696 374307 426695
11007 426695 249088 428475 700452 379012 497859 641550 403395 804615 373059 506526
10997 506526 486982 830818 905805 451885 619785 720642 270617 554755 641350 554804
10987 554804 732588 817257 582681 592051 1103388 585403 685349 908228 1107742 1004941
10977 1004941 1333658 1497068 1320966 1618591 1845070 2309626 2007243 2231935 2298490 2208186
10967 2208186 1869011 1710745 1454729 1572680 1857991 1332199 1324732 1372896 1728788 1491850
10957 1491850 1328839 1213700 1564281 1718407 1213873 943399 1087125 802291 434949
10948 434949 559438 334871 577703 246476 177310 -31238 420559 319452 55701 108321
10938A08321H781c931B11524q9183J14213f7800B24508a13115D8455a7465j2647
10927c0112A83308o6678D3125c51290A63563c96071G2822L7531a33767L9573B70794
10915b37816A26443j4117O4631a41635b8925F4386b3055k9245b0902I7220f0524
10903B6253J86566h2053A91371r2231d8092C2094a46563l4224C58037b65159g9436
10891A43004a6372A95886b02314A42933N4602B1940e1723l8787M2723j04757j3567
10880a66111g0475j2168j01968j50798B2931L8676Q8235b20745J83J07595K4821
10869h8146H3785a77793E1059g3769A58741K1292a9772j08499B79056a17093C31445
10857a57509d7883B9229g7064K6764k9034A69415e8429C0625e5077k8010b2571
$$ plain form
10938 108321 8781 -3931 211524 122341 236554 -67800 224508 -113115 48455 -17465 -30112
10927 -30112 183308 116630 43125 -351290 163563 -396071 72822 110353 -133767 -94194 270794
10915 -237816 126443 112326 176957 -141635 -28925 64386 -23055 -52300 -20902 97220 -60524
10903 26253 212819 -82053 191371 99140 -48092 32094 -146563 -180787 358037 -265159 -79436
10891 143004 -16372 195886 -202314 142933 197535 21940 -51723 -90510 -47787 -152544 -166111
10880 -166111 -70475 -82643 -184611 -335409 22931 61607 149842 -220745 -220562 -112967 -88146
10869 -88146 83785 -177793 51059 -73769 158741 180033 -19772 -128271 279056 -117093 331445
10857 -157509 -47883 29229 -77064 -50300 -79334 169415 -58429 30625 -55077 -83087 -22571
10845f9120C6287a29241A43987a45151A678a41671k72163e2995n5239k6367C9257
10833D0804f1631j36048a4486B2184b97553C56762G2171b27950E9643f5838C18613
10821B51721a51061A37315b06102A8586J22669a16882j26986b5348j05984j11834
10811b43166B984K39931c0349k68236K7879I1581j0615b46829I8662L7720E1890
10799a3149j02266j30093J19041K3195L6370l56376H3141b3091j43956A69048
10788c24738f5068E8135M334R7897b94045P6457r9927a29471J0059B3394a03170
10776a73934M0685K4175F7584b17049m164D174g9846j53105A10396d53798a84898
10764B83016G7562i033l52657a5771j83512k5203B45458e8487G1261f7961J0673
$$ plain form
10845 -69120 36287 -129241 143987 -145151 1678 -141671 -413834 -52995 -108234 -134601 39257
10833 40804 -61631 -197679 -14486 22184 -297553 356762 72171 -227950 59643 -65838 318613
10821 251721 -151061 137315 -206102 18586 141255 -116882 -243868 -25348 -131332 -243166
10811 -243166 2984 242915 -30349 -298585 -270706 91581 80966 -246829 98662 136382 51890
10799 -13149 -115415 -245508 -126467 -103272 -66902 -423278 83141 -23091 -167047 169048
10788 -324738 -65068 58135 62469 160366 -294045 -217588 -317515 -129471 -119412 23394 -103170
10776 -173934 -133249 -109074 67584 -217049 -221213 4174 -79846 -232951 110396 -453798 -184898
10764 283016 77562 -9033 -361690 -15771 -199283 -224486 245458 -58487 71261 -67961 -57288
10753e7288j78280J3094N6064f5385J0637q8081A42072h8917m9710B16259i5260
10741A41205g1593n9602L8100j714A61887a34659J2518e5836n2090A76083a6093
10729H5151e282l09061a22481A02072a09601j65908A02776h5266l7312j7356M2300
10718i7634A23236f4751J7264J2148j43340g5608l5582R288j39765B8309J83111
10707B11420q6582B18R9882k5683A2595N7576e9214p2419A10340k6881J35262
10696B18721a13907B33906b07183d4543j49991a0097j22221f645k57293R6119
10686a67819m0553c2177H1249b17561j38205D3158K9482c87875a33833a0517j0515
10675b1032H0808J6623g1767l7877C51722i3931A29681I145b14731C1902K16102
$$ plain form
10753 -57288 -235568 -222474 -166410 -65385 -54748 -142829 142072 -88917 -138627 216259 -95260
10741 141205 -71593 -131195 -93095 -94809 161887 -134659 -122141 -55836 -107926 176083 -16093
10729 85151 -5282 -314343 -122481 102072 -109601 -275509 102776 -85266 -122578 -139934 -97634
10718 -97634 123236 -64751 -47487 -35339 -178679 -75608 -111190 -101902 -241667 28309 211420
10707 211420 124838 218 100100 74417 12595 70171 -59214 -131633 110340 83459 218721
10696 218721 -113907 233906 -207183 -44543 -194534 -10097 -132318 -6645 -263938 -167819
10686 -167819 -208372 -32177 81249 -217561 -355766 43158 72640 -387875 -133833 -10517 -21032
10675 -21032 80808 97431 -71767 -109644 351722 -93931 129681 9145 -214731 31902 248004
10664B48004b16330j5069B23893b56705R4334K5221A28938a75600A03522P3163
10654A76685C7815J13976B6594J81490a72283d6760j85871F5079b76792i7256
10643I0757b7690k11935k00601C14095F0453b33389A42638d80201h3965D20935
10632e00k52073I4810d2570j73839B52313A08552c39746J43733C5217b91060F0925
10620B2534J09805h3974K3768b2269k11233e7637g671l79210P3829a3049j11279
10609a24328E5268M5492a44861j38643A5483a47522a0983j3343J1240k18419A29264
10597c88461E334J77936B9875a58200A71612e8448o812A43447a13982j02153B20727
10585e9644l9520A11191a42841B32615a96474K1898A19493a0741A33546E8850
$$ plain form
10664 248004 -216330 -231399 223893 -256705 -162371 -137150 128938 -175600 103522 176685
10654 176685 37815 151791 26594 208084 -172283 -46760 -232631 65079 -276792 -97256
10643 90757 -27690 -239625 -440226 314095 60453 -233389 142638 -480201 -83965 420935
10632 -500 -252573 94810 -42570 -216409 252313 108552 -339746 -196013 35217 -291060 60925
10620 22534 132339 -83974 -60206 -22269 -233502 -57637 -7671 -386881 -313052 -13049 -124328
10609 -124328 55268 100760 -144861 -283504 15483 -147522 -10983 -24326 -13086 -231505 129264
10597 -388461 5334 183270 29875 -158200 171612 -58448 -65260 143447 -113982 -216135 220727
10585 -59644 -99164 111191 -142841 232615 -196474 -174576 119493 -10741 133546 58850
10574b01978q1406P9443B76352F8517J23040A0245K06371P3757b13863C22392
10563B35165K3266E4843Q3775Q2079b98939r9372g1960k92924b1180n1989D1917
10551a00227o8121B10688a71168r6254B0517N93169a56386B91337F2317a74070
10540e36939a79791N9485A73641b1778C9545j3733b68111A57315a49044d5033
10529a61649D8232b49751m550P3112k17591G4180Q8809a36143c0957h003B9643
10517b3412j38221A45332E8582b9971j02178D739b91342D538e7978C46921b11814
10505b1940F646d3740m2675A18759P5322f9289F748i0256j0915j58436R8063c798
10492F6065K4510A0209a4471k85038a06636d4427E8489J3722O64c4554A30796
$$ plain form
10574 -201978 -283384 -203941 276352 68517 191557 10245 216616 290373 -213863 322392
10563 235165 258431 54843 138618 220697 -298939 -398311 -71960 -364884 -21180 -73169 41917
10551 -100227 -168348 210688 -171168 -267422 20517 613686 -156386 291337 62317 -174070
10540 -536939 -179791 -120306 173641 -21778 39545 25812 -268111 157315 -149044 -45033
10529 -161649 48232 -249751 -254301 -181189 -398780 74180 162989 -136143 -30957 -8003 29643
10517 -23412 -161633 145332 58582 -29971 -132149 4739 -291342 4538 -57978 346921 -211814
10505 -21940 6646 -43740 -86415 118759 194081 -69289 6748 -90256 -101171 -259607 -161544 -3798
10492 66065 90575 10209 -14471 -299509 -106636 -44427 58489 72211 72875 -34554 130796
10480D00616J29933j57354J19865c3435e394A62428K49916A33522j888F4620a69289
10468B8156J59208c22436G795g165k56605A25829b82896A53106F8840a78350g257
10456B8285a06269l4768F9150A8213i7973A8183a033j42001j2949c9871j53760
10445a93631q8992J22004L422M8286i336k42183A41602B5889M0587h9982j57113
10434b47095J18606b0362A14759O7384p9782c803A23255o0432h3595O575G3377
10422e6076A13348P0920M9440R1217n1554H6181J68065q9852n9348r348f7005
10410A8894J31788b93429j98947h2457C2875i3419c4150E2502J99273j10627a53875
10398b71387B91624b05882e15o1407I009M3365M79644k39090d6054L65p7617n0213
$$ plain form
10480 400616 530549 373195 493060 -33435 -5394 162428 412344 133522 131634 64620 -169289
10468 28156 187364 -322436 7795 -7165 -263770 125829 -282896 153106 68840 -178350 -7257
10456 28285 -106269 -141037 69150 18213 -97973 18183 -1033 -143034 -155983 -39871 -193631
10445 -193631 -282623 -160619 -157197 -108911 -9336 -251519 141602 25889 66476 -89982 -247095
10434 -247095 -128489 -20362 114759 182143 102361 -3803 123255 62823 -83595 -77020 73377
10422 -56076 113348 184268 233708 324925 273371 86181 254246 164394 105046 95698 -67005
10410 18894 150682 -293429 -492376 -82457 32875 -93419 -34150 52502 251775 141148 -153875
10398 -271387 291624 -205882 -515 -61922 9009 52374 532018 292928 -46054 -45689 -123306 -173519
10386a73519C00117b35599H3397K76607D5822g1931k8204A28398L7074K5460E9258
10374A56653P249Q3982I7945g9262F5210N46661A70683J60672R2337F5783J00275
10363A66058J64286n523A14590J75275D2874b1915m3004B59641O2142A43605A4735
10351B00025N38484b3041A75672J18083J3572A43248p1410J53507L298E6391K03787
10340B60178f3508j39025C7512J42009N7602J57034C943O4686a71388A81441i1587
10328A89362J62614j30917K3452G5138K95718q5545j09623K93140k23188G7090
10317B65141i5761A40518J25847a16420B20551q9305P0511P0799I4006a01034
10306A9295K88935a25741a4335j73708o8489m3293e9105i357I3120K272j1497
$$ plain form
10386 -173519 300117 -235599 83397 360004 45822 -71931 -100135 128398 165472 190932 59258
10374 156653 163902 247884 97945 -79262 65210 611871 170683 331355 423692 65783 166058
10363 166058 330344 324821 114590 289865 42874 -21915 -64919 259641 321783 143605 14735
10351 200025 738509 -23041 175672 293755 307327 143248 71838 225345 228643 56391 260178
10340 260178 -63508 -202533 37512 179521 237123 394157 3943 68629 -171388 181441 -91587
10328 189362 351976 221059 244511 75138 370856 285311 175688 468828 245640 77090
10317 265141 -95761 140518 266365 -116420 220551 131246 201757 272556 94006 -101034
10306 19295 308230 -125741 -14335 -188043 -256532 -299825 -59105 -9357 93120 95392 83895
10295H3895h4065D6940K38262o6646j3515b54488A69577d8202D1019a01655B23105
10283c07900R3979C058a74642A67712d0633b584k50545B68174r1157c0011B52261
10271g2749j82691A93956d28894H5531d9824r6610o3962k3822I2932h0747C27435
10259A10882Q8611J37377L24666k28608O7993A74664a54742I1836a89017b5099
10248A11710g2058A02825C9673d1160A35093E6028J9551L4049f8171m8C00644
10236B743J87075b708k27537J10753Q603c9755k77715B30950G2790b79070B82585
10224b7679q8276C7231f8813b3658A12509K065J96448a03488E1178d8844o6374
10213a15218l6339E8308D151J79198N1530a72608a3338k37513O9308A82075H1540
$$ plain form
10295 83895 -84065 46940 285202 218556 205041 -254488 169577 -48202 41019 -101655 223105
10283 -307900 -213921 3058 -174642 167712 -40633 -2584 -253129 268174 177017 -30011 252261
10271 -72749 -255440 193956 -428894 85531 -49824 -146434 -210396 -234218 92932 -80747 327435
10259 110882 199493 336870 661536 432928 500921 174664 -154742 91836 -189017 -25099
10248 111710 -72058 102825 39673 -41160 135093 56028 75579 109628 -68171 -68219 300644
10236 2743 189818 -2708 -230245 -119492 -110889 -39755 -317470 230950 72790 -279070 282585
10224 -27679 -115955 37231 -68813 -23658 112509 114574 311022 -103488 51178 -48844 -115218
10213 -115218 -151557 58308 4151 183349 234879 -172608 -13338 -250851 -181543 182075 81540
10201E5359i9087B2613b53893j62400B9950J80660H5484a29474F9832Q0994G2308
10189e8294K232Q669A27127a57561q9304r2804Q7275I060a91361d4632o3425k13521
10177c21578B66500E0463a30660a835B6703J76173b40009A38200a46970r5151
10167b42121I9747d14116A88424c24226A01666e70063A94904b25194G9059p718
10157G1341J12723a83032N9724A08319d8644J3090j30347e9474A79695d72201
10146B05609l3545a29609B6136a62465d7576j17651O7696A8423b59391D1195a83223
10134a16321M1866k6752l5612I5921c04128h3386p3878O8685a2893k987k56093
10123b71973f2942k41401A47438b37227A2948K61693E6999b9277k84982A88623
$$ plain form
10201 55359 -99087 22613 -253893 -416293 29950 210610 85484 -129474 69832 150826 72308
10189 -58294 -56062 -47393 127127 -157561 -246865 -339669 -252394 9060 -191361 -44632 -108057 -321578
10177 -321578 266500 50463 -130660 -1835 26703 202876 -240009 138200 -146970 -242121
10167 -242121 99747 -414116 188424 -324226 101666 -570063 194904 -225194 79059 71341
10157 71341 184064 -183032 -123308 108319 -48644 -35554 -165901 -59474 179695 -472201
10146 205609 172064 -129609 26136 -162465 -47576 -165227 -97531 18423 -259391 41195 -183223
10134 -116321 -74455 -101207 -136819 95921 -304128 -83386 -157264 -88579 -12893 -15880 -271973
10123 -271973 -62942 -304343 147438 -237227 12948 274641 56999 -29277 -314259 188623
10112b01863m3828F4982c5239k44813R7009k3706B32190c6175o088p8183q8765
10101b09211j566J4643A32117n819j0712e543k97883a05010j8946H7541b70504
10089a2000H6045b07944G1199M3744b81731h1014k35605J12060B56054a34507
10078b00314A25611g6024p2980j13631h3863r9710G0553b66731Q1378i1103j62702
10067b53805J03997n5679A95543l8255a83878A10981b24429B6258J12205a9444
10056f1836p0457k19093d5423j95571R9935A88911m6410g0843p8354B09195b5010
10044a22178B32c84914J73393B50700d0580k66805A74419N2471K1570c72105E6654
10032A10006i5403D8563a33153e6346j29336g3877k35044J16843G5456g0789B67799
$$ plain form
10112 -201863 -245691 64982 -35239 -280052 -183043 -206749 232190 -36175 -42263 -120446 -209211
10101 -209211 -210777 -196134 132117 126298 115586 -5543 -303426 -105010 -123956 87541 -270504
10089 -12000 86045 -207944 71199 114943 -281731 -81014 -316619 -204559 256054 -134507
10078 -200314 125611 -76024 -149004 -262635 -83863 -183573 70553 -266731 -185353 -91103 -253805
10067 -253805 -149808 -205487 195543 157288 -183878 110981 -224429 26258 138463 -19444
10056 -61836 -132293 -351386 -45423 -240994 -141059 188911 142501 -70843 -149197 209195 -25010
10044 -122178 232 -384914 -211521 250700 -40580 -307385 174419 226890 248460 -372105 56654
10032 110006 -95403 48563 -133153 -56346 -185682 -73877 -308921 -192078 75456 -70789 267799
10020G2723a02288j46319b8437l7532k420A5390a24781J0609F6959C1120b06474
10008c29530a50391A34278k3423b90901A94076a51829A98763A9669b68545A59531
9997a17615D5602a0708o6532A29131g7549j20556J131k07353C37701A55231e4928
9985D4304a76651A44997a61254D7025N3696j0359A3049J6836d51897a04375l9384
9974a43759d8786l3254k13893I9104C9580J35781b66792J28291I1234a09146j27665
9963b36811B35893k7944G0953a50084B5588a70220A74626g7034q8814m03480D1575
9951A58475a56195H5552b11799c8233j02738K0876C71777a66253C720e4159R566
9940d4593j1925D7437p383a0115j68108B4302a20050c2482j6249A47277a30294
$$ plain form
10020 72723 -102288 -248607 -28437 -65969 -68389 15390 -124781 -114172 66959 31120 -206474
10008 -329530 -150391 134278 110855 -290901 194076 -151829 198763 19669 -268545 159531
9997 -117615 45602 -10708 -77240 129131 -77549 -198105 -196974 -404327 337701 155231 -54928
9985 44304 -176651 144997 -161254 47025 100721 90362 13049 29885 -451897 -104375 -143759
9974 -143759 -48786 -82040 -295933 99104 39580 175361 -266792 -138501 91234 -109146 -236811
9963 -236811 235893 207949 70953 -150084 25588 -170220 174626 -77034 -165848 -569328 41575
9951 158475 -156195 85552 -211799 -38233 -140971 -120095 371777 -166253 3720 -54159 -44593
9940 -44593 -56518 47437 40054 -10115 -178223 24302 -120050 -32482 -48731 147277 -130294
9928D5398a10767r7490j30340M5844G6640b06781P8629p3654d8132P297D449d0015
9915A43719g0338C1623L0113J37589a58501A07867J1385a16015B37351j18045
9905A19306a41601d9939k97624A49645c73013c8920r1224a9502k10395M630A02540
9893A09067a21844j67208A12985b83883a10999F4400c14076J12487A14814a25334
9882a14009A700d4780k25973e2074A19823m3949i1888M1070o7705j49293E8128
9870A37120N1655b1757k29523B25184g5895G2946a3822q792A7376M5172O8917
9859A31465L39508b06327h1867F7221a15358A62286i8414f137p4642c851j86218
9848a90069e9211B16439b12357A5562b70987P2556A9407a60231E8581a34587P831
$$ plain form
9928 45398 -110767 -208257 -338597 -292753 76640 -206781 -128152 -201806 -48132 -40835 4449 -40015
9915 143719 -70338 31623 61736 199325 -158501 107867 119252 -116015 237351 119306
9905 119306 -141601 -49939 -347563 149645 -373013 -38920 -130144 -19502 -229897 -225267 102540
9893 109067 -121844 -289052 112985 -283883 -110999 64400 -314076 -201589 114814 -125334
9882 -114009 1700 -44780 -270753 -52074 119823 75874 -91888 -50818 -118523 -267816 58128
9870 137120 188775 -21757 -251280 225184 -75895 72946 -13822 -22614 17376 62548 131465
9859 131465 470973 -206327 -81867 67221 -115358 162286 -98414 -6137 -80779 -3851 -190069
9848 -190069 -59211 216439 -212357 15562 -270987 -198431 19407 -160231 58581 -134587 -126756
9837a26756k36531a68738b9467B42565b94703P3464P4677m8066F5418j4773f0035
9825I9963n263N4599o9853c0348k59252Q7949F2910f1747o2680H4019c2702l48939
9813c81641A99476b12321R8850J5197q2599j0086B04040j8553d23637m348G9385
9801c74597a30812C3801b44163e3949A68941f3979j21570j9026q588m7796E625
9789d4189A32960J83625b3256j29972k3647b621l6681j9235J66p7403d041j9086
9777b3127B32657f8284A70966A815i9620k63138I9432J16658b40558a8574c480
9765b0312r9316k80181A26193b54439A00314B9913c00275f3569j70410N5196O2326
9754a16457M3338r419G0634J0258l2746b48158P8294M4855E509d69818B93425
$$ plain form
9837 -126756 -363287 -168738 -29467 242565 -294703 -221239 -146562 -194628 65418 50645 -60035
9825 99963 94700 149299 79446 -30348 -289600 -201651 62910 -61747 -124427 84019 -32702 -381641
9813 -381641 199476 -212321 -113471 -98274 -180873 -190959 204040 185487 -423637 -427985 79385
9801 -374597 -130812 33801 -244163 -53949 168941 -63979 -185549 -204575 -213163 -260959 5625
9789 -44189 132960 316585 -23256 -153228 -176875 -2621 -39302 -58537 -58371 -135774 -4041 -23127
9777 -23127 232657 -68284 170966 1815 -99620 -362758 99432 216090 -240558 -18574 -3480
9765 -20312 -119628 -399809 126193 -254439 100314 29913 -300275 -63569 -233979 -178783 -116457
9754 -116457 -73119 -82538 70634 80892 48146 -248158 -169864 -125009 5509 -469818 293425
9742e8018A82184c4514E9750b35220k1960g0253D0506e1295D5610L16799H4767
9730A09693a3831l68868A66226a92232A18873A5381k480b75727J5164e0286j66120
9719b16406j24760a03878D2789J41663b21743i4371K4706j4922a2165l12124F9995
9707h2027A14926c353m18191d5273C03016a58558I9844f0883j35713B51120a84080
9695b1144q6323E8234c21136J51405L3573C61205a22004m3765e0419G8620a58198
9683I2140Q0513d84617a09222l16741J94386J9616A0843J26793a12920j49337
9673b62257A68847J15706b8890n114j41164I5621a79203E21P8407L1536i2078
9661c25067A69724c28831g9346n1009N7989k8301j89558C61615b72772c2343k24380
$$ plain form
9742 -58018 182184 -34514 59750 -235220 -257180 -70253 40506 -51295 45610 362409 84767
9730 109693 -13831 -382699 166226 -192232 118873 15381 12901 -275727 -260563 -50286 -216406
9719 -216406 -341166 -103878 42789 184452 -221743 -94371 -69665 -84587 -12165 -324289 69995
9707 -82027 114926 -3353 -421544 -45273 303016 -158558 99844 -60883 -196596 251120 -184080
9695 -21144 -107467 58234 -321136 -169731 -136158 361205 -122004 -165769 -50419 78620 -158198
9683 92140 172653 -484617 -109222 -425963 -231577 -211961 10843 137636 -112920 -262257
9673 -262257 168847 284553 -28890 -34004 -175168 95621 -179203 521 78928 110464 -92078
9661 -325067 169724 -328831 -79346 -130355 -72366 -100667 -290225 361615 -272772 -32343 -256723
9650b56723B3671f9737o7288J234A28140J23687B4022c66313g1166j11467h342
9638I2476P7172k3081k5787Q8765F7375a92282j04249J2689a27124M8214p1850
9627a50760m2955n3021O5274B11653b45895J9238d2102k61476B3417a23286j98539
9616c21825a57742A62506a37757O095d7969H5816A8115a06547b2664p1036A98314
9604C2049a12230m7323i457b089B51814a25206q3890K9845N1653F5830J59647
9593B25477a5612B55128a16523j6873k0897J9074c4021f086j23626p4587G5908
9581B25762r0585B2365b36043I8470b01128h5138A5702J6233N3527O9711b80137
9569b34210A13480a67491d4327r3177l4082j17832A25288a47697a3008A24506
$$ plain form
9650 -256723 23671 -69737 -137025 -135791 128140 251827 24022 -366313 -71166 -182633 -8342
9638 92476 169648 146567 120780 209545 67375 -192282 -296531 -283842 -127124 -78910 -150760
9627 -150760 -193715 -246736 -181462 211653 -245895 -226657 -42102 -303578 23417 -123286 -321825
9616 -321825 -157742 162506 -137757 -131662 -47969 85816 18115 -106547 -22664 -93700 198314
9604 32049 -112230 -159553 -9457 -2089 251814 -125206 -209096 -179251 -127598 65830 225477
9593 225477 -15612 255128 -116523 -133396 -154293 -135219 -34021 -6086 -129712 -204299 75908
9581 225762 135177 22365 -236043 98470 -201128 -85138 15702 31935 85462 155173 -280137
9569 -234210 113480 -167491 -44327 -137504 -171586 -289418 125288 -147697 -13008 124506
9558b80936F5114b7696l56183D5647b7866C10975a45342o5299m4558E181c36212
9546e0178F2909a37015d1231A50020d6576p9284j33374d6241k57132A34523a35603
9534a00568A91813e5093p5654H9179k9677a83764A8306a9893I9915M546c79124
9522d46627E8118a58263k8032K2382C47870b19830j51583a30524A7932J5654J89913
9511B23499q7515n7093i7155j31950a10721B0300b08093E641M3443b82954i770
9499a52841A71185A9912a07974G8885h9865c99l47822a43145H2694a91537M4551
9488a46986D8818G131e30147i0433K0802j99884B5895f2097A80521q8782m4886
9477D6853a90490l7278k37896a55467l7705A08853B8739f1868o4592g780G2781
$$ plain form
9558 -280936 65114 -27696 -383879 45647 -27866 310975 -145342 -210641 -255199 5181 -336212
9546 -50178 62909 -137015 -41231 150020 -46576 -125860 -259234 -46241 -303373 134523 -135603
9534 -100568 191813 -55093 -130747 89179 59502 -183764 18306 -19893 99915 104461 -379124
9522 -446627 58118 -158263 -186295 -163913 347870 -219830 -371413 -130524 17932 33586 223499
9511 223499 135984 78891 -97155 -229105 -110721 20300 -208093 5641 49084 -282954 -9770
9499 -152841 171185 19912 -107974 78885 -89865 -399 -348221 -143145 82694 -191537 -146986
9488 -146986 48818 7131 -530147 -90433 -69631 -269515 25895 -62097 180521 91739 46853
9477 46853 -190490 -227768 -465664 -155467 -193172 108853 28739 -61868 -126460 -7780 72781
9465i8376l2766k74710a26435A26176i598B24974C5604a30621k1390A20008j0782
9454A09226k8493a65251M0001B4717N3415d37024A46036a50822P0255D05547b4093
9442a76192A41737C1182g5150j10752A43207d299B3573J8329a64970A97605G3084
9430a35111j64389e636m5746l23622a58220q5130J13415l2715A34866a40908n0003
9419a90911A48830p0116k1848j7909L9283e17767d4870l4501c6279C26701b93642
9407a30611q25A6625J4067J16260D5332a88044A47676E623b81588h7176c2617
9395A71793a462k20871f7562B20599b11725K2606A21416a87828B05047q3091Q2717
9384B04673c62610J47779M3489a3581a32j18751L6734j01861l14339A94643f2496
$$ plain form
9465 -98376 -131142 -405852 -126435 126176 -9598 224974 35604 -130621 -152011 120008 109226
9454 109226 80733 -165251 -125250 24717 78132 -437024 146036 -150822 -80567 405547 -24093
9442 -176192 141737 31182 -75150 -185902 143207 -4299 23573 41902 -164970 197605 73084
9430 -135111 -299500 -5636 -51382 -375004 -158220 -243350 -129935 -162650 134866 -140908 -190911
9419 -190911 148830 78714 56866 38957 78240 -517767 -44870 -79371 -36279 326701 -293642
9407 -130611 -131436 16625 30692 146952 45332 -188044 147676 5623 -281588 -87176 -32617
9395 171793 -1462 -222333 -67562 220599 -211725 -189119 121416 -187828 205047 121956 204673
9384 204673 -362610 -214831 -171342 -13581 -132 -118883 -82149 -184010 -498349 194643 -62496
9372a60463d6534A08013d422j66245l5572j52228e4098n9714F3043J69448H5605
9360D4853a59580A91867i2420G1030a45905A23583d2873j40777k78526a50404
9349c6689E2832b18253B80203f6854k13285a24600E740a48735j38700I668c33992
9337A00499a06680G7848b55016H5669J6990D0043e5330l4057k21398e7203j57792
9326b14995R0664j15675J00488c777j10806B7773h1217C2585J04763o4102i2648
9314b29331J5853i9349j52771L5278e0232J2399J6464K358j19010b5751j62443
9303a88194N0133A45974a6303j63323n6342f6063j76090b4038Q971o32k01131
9292b16830C06352D7943a0120B6532b35685d7553r6813j42833C106Q7893a61052
$$ plain form
9372 -160463 -46534 108013 -4422 -170667 -206239 -358467 -54098 -113812 63043 232491 85605
9360 44853 -159580 191867 -92420 71030 -145905 123583 -42873 -183650 -462176 -150404
9349 -36689 52832 -218253 280203 -66854 -280139 -124600 5740 -148735 -287435 9668 -333992
9337 100499 -106680 77848 -255016 85669 102659 40043 -55330 -89387 -310785 -57203 -214995
9326 -214995 -124331 -240006 -139518 -3777 -114583 27773 -81217 32585 137348 73246 -92648
9314 -229331 -213478 -99349 -252120 -216842 -50232 -37833 -21369 -19011 -138021 -25751 -188194
9303 -188194 -138061 145974 -16303 -179626 -235968 -66063 -242153 -24038 -15067 -15699 -216830
9292 -216830 306352 47943 -10120 26532 -235685 -47553 -144366 -287199 3106 90999 -161052
9280a2466A10279e02023K22715l0549R6688e4657j4963A5784J0413J48915M1529
9269B16641b17669g7075B07397d212C7007b33561P9304A3242J36344a17345A31211
9257d5000D7288g3944B78592a77966l558b2917k52309C2493b14970j3887B5602
9245i9945M3039p8331H4113B9095J94110c01797i3950M4089j99944J08331J6139
9234a25335j11284I6692J2201n1300P4410a7050l10913A29007a57104D1923a40031
9222E8268J83864h2711A90541e7377m5504A97485a5086k18241C0317J36370c4997
9210G4263f7094l2079l9913j74492a6766k4389k7712j22375A2127J84692D4609
9198B07145b58075B48115b93693d6559r7130f1697k2997b6953l4096n3386M2570
$$ plain form
9280 -12466 110279 -502023 -279308 -309857 -213169 -54657 -69620 15784 26197 175112 216641
9269 216641 -217669 -77075 207397 -4212 37007 -233561 -154257 13242 149586 -117345 131211
9257 -45000 47288 -73944 278592 -177966 -181524 -22917 -275226 32493 -214970 -228857 25602
9245 -99945 -56906 -135237 84113 29095 223205 -301797 -93950 -49861 -249805 -141474 -125335
9234 -125335 -236619 96692 108893 57593 132003 -17050 -327963 129007 -157104 41923 -140031
9222 58268 242132 -82711 190541 -57377 -102881 197485 -15086 -233327 30317 166687 -34997
9210 74263 -67094 -99173 -139086 -313578 -16766 -41155 -68867 -191242 12127 196819 44609
9198 207145 -258075 248115 -293693 -46559 -143689 -61697 -84694 -26953 -61049 -114435 -71865
9187g1865C2537a46586A86897a32147l0936K105B47140b44487h6588I38J61296
9176A62234b18805C0269c28920Q6134A23236e39142d0944j51130O2992J3809K7372
9165h7901A68463A5606L16244f6971D1875b02640j08870N8960B25650C9149O5841
9154A04990q950O1107J15265H6370e2333k5176F2134g2734B2563a46230A9098
9142A4387a66117G619d6810G9330J36382c19320I4323K70457H5381g8979B46457
9130b03105P0924A30217F0116a241j27862A92237a17348O415l27778A23107a07461
9118a80247h2630B11155g0308j93470A70743a14986B7360c4124r5729k6897j86339
9107c43089P4091A52225j8442b45408N258B88343b28382G3796A090M2325d652
$$ plain form
9187 -71865 32537 -146586 186897 -132147 -163083 -160978 247140 -244487 -86588 938 162234
9176 162234 -218805 30269 -328920 -242786 123236 -539142 -40944 -192074 -129082 -115273 -87901
9165 -87901 168463 15606 331850 -66971 41875 -202640 -311510 -252550 225650 39149 104990
9154 104990 96040 157147 272412 86370 -52333 -77509 62134 -72734 22563 -146230 19098
9142 14387 -166117 7619 -46810 79330 215712 -319320 94323 364780 85381 -78979 246457
9130 -203105 -132181 130217 60116 -1241 -129103 192237 -117348 -110933 -438711 123107 -107461
9118 -180247 -82630 211155 -70308 -263778 170743 -114986 27360 -34124 -129853 -156750 -343089
9107 -343089 -268998 152225 133783 -245408 -240150 288343 -228382 73796 1090 43415 -4652
9095a66125K2665b0693o552A81525d094D3424d62672a75914J4600j0270B79433
9083b12114e4661A21718a17448D9608o02L0258A8932b35381n0650F1488c09330
9071A08668a41767e3060m00440A0422a02225k47149A63430J47269h7429A84040
9060f5953j19107j05291Q4419K9601L9755j01889p4271J0612R9993A93164h1185
9048B847b5626k8378G0038b60839A11181L00902A29712c52239a06825F0259a43914
9036a28699k03562g7513A09364b4577A631J45140e6136A21845L48694a17572L519
9025a14053b8324A7718Q1524b33504q5774b4920C28173a78188B55059b61072a06433
9013c31675D8699N451Q825J24325h6322p0657C9875K7767K6109c18138C68621
$$ plain form
9095 -166125 -143460 -20693 -27245 181525 -4094 43424 -462672 -175914 -161314 -171584 279433
9083 -212114 -54661 121718 -117448 49608 49006 79264 18932 -235381 -286031 61488 -309330
9071 108668 -141767 -53060 -453500 10422 -102225 -349374 163430 310699 -87429 184040
9060 -65953 -185060 -290351 -205932 -176331 -136576 -238465 -312736 -302124 -202131 193164 -81185
9048 2847 -25626 -54004 70038 -260839 111181 412083 129712 -352239 -106825 60259 -143914
9036 -128699 -332261 -77513 109364 -24577 1631 146771 -56136 121845 470539 -117572 -114053
9025 -114053 -28324 17718 99242 -233504 -319278 -24920 328173 -178188 255059 -261072 -106433
9013 -331675 48699 54150 62975 187300 -86322 -156979 39875 67642 93751 -318138 368621
9001a44262A84736H3306J84547c93289l0213J61382A39709h3111A5754J91379
8991B07133I2074h8538j19703j9482J11333F6680c16962c8059o1717M5595j7594
8980g1775E4258e15448a04496A77415g4653G8922e4383A35194n9019M5368l7229
8969H4314L3019b99246d9175B94286C2706b80547A52261b657A9750J2209e7561
8957b22750Q1640b0457j50396K8012E3659a57624O2102B00566a95406a8341A2884
8945a62552e1499F4660P8996O2040a16979A9519M6160O219A0934a99385A57293
8933I5543D4092a49426A00277a61054G7438L002L764L21811K02693L93358K608069
8922C610135M794449K287491D573075A164732l54968C30193M2968K9025E7018
$$ plain form
9001 -144262 184736 83306 267853 -393289 -423502 -262120 139709 -83111 15754 207133
8991 207133 92074 -88538 -208241 -227723 -116390 66680 -316962 -38059 -99776 -54181 -71775
8980 -71775 54258 -515448 -104496 177415 -74653 78922 -54383 135194 76175 121543 84314
8969 84314 117333 -299246 -49175 294286 32706 -280547 152261 -2657 19750 31959 -57561
8957 -222750 -141110 -20457 -170853 -142841 53659 -157624 -95522 200566 -195406 -18341 12884
8945 -162552 -51499 64660 143656 205696 -116979 19519 65679 71898 10934 -199385 157293
8933 95543 44092 -149426 100277 -161054 77438 80440 84204 406015 608708 1002066 3610135
8922 3610135 8404584 10692075 4573075 1164732 809764 330193 373161 402186 57018
8912A5727J10928c7565A16214i7901C82500F9837g1314A64589c44712a72095A52657
8900I3125b07852g4394D0702i9307k75425a670j58317g6897B96272b83469R7520
8889a85949j50512a30885A36002a8888F2786L7334a15061M7809b7322B98723a11487
8877b75141c1932G9344M3547a06495j27243j05597l7339A62288N0761b35018A0070
8865a27508r2910d8018j15643A93724b11668L1251q3839J00008j41015f4925B54081
$$ plain form
8912 15727 126655 -37565 116214 -97901 382500 69837 -71314 164589 -344712 -172095 152657
8900 93125 -207852 -74394 40702 -99307 -374732 -1670 -159987 -76897 296272 -283469 -185949
8889 -185949 -336461 -130885 136002 -18888 62786 100120 -115061 -67252 -27322 298723 -111487
8877 -275141 -31932 79344 122891 -106495 -233738 -339335 -376674 162288 213049 -235018 10070
8865 -127508 -220418 -48018 -163661 193724 -211668 -180417 -264256 -164248 -305263 -64925 254081
$$ [...]
##END NTUPLES=NMR SPECTRUM
##END=
