##TITLE=AC1620_CTIAH13351_8326046_aCbfBM7ZLF
##JCAMPDX= 6.0         $$ Bruker NMR JCAMP-DX V2.0
##DATA TYPE= NMR SPECTRUM
##DATA CLASS= NTUPLES
##ORIGIN= BRUKER
##OWNER= Administrator
$$ 1.72 TOPSPIN		Version 2.1
$$ 2013-11-13 20:46:30.683 -0800  Administrator@X
$$ Compression mode = diff/dup
##.OBSERVE FREQUENCY= 400.02188249412
##.OBSERVE NUCLEUS= ^1H
##.ACQUISITION MODE= SIMULTANEOUS (DQD)
##.ACQUISITION SCHEME= undefined
##.AVERAGES= 64
##.DIGITISER RES= 22
##SPECTROMETER/DATA SYSTEM= spect
##.PULSE SEQUENCE= noesygpps1d.comp
##.SOLVENT NAME= COFFEE_meoh
##.SHIFT REFERENCE= INTERNAL, COFFEE_meoh, 1, 14.96107
##AUDIT TRAIL= $$ (NUMBER, WHEN, WHO, WHERE, PROCESS, VERSION, WHAT)
$$ ##TITLE= Audit trail, TOPSPIN		Version 2.1
$$ ##JCAMPDX= 5.01
$$ ##ORIGIN= Bruker BioSpin GmbH
$$ ##OWNER= Administrator
$$ $$ E:\/data/COFFEE/nmr/AC1620_CTIAH13351_8326046_aCbfBM7ZLF/12/pdata/1/auditp.txt
$$ ##AUDIT TRAIL=  $$ (NUMBER, WHEN, WHO, WHERE, PROCESS, VERSION, WHAT)
(   1,<2013-11-13 20:46:25.292 -0800>,<Administrator>,<X>,<go>,<TOPSPIN 2.1>,
      <created by zg
	started at 2013-11-13 20:34:55.087 -0800,
	POWCHK enabled, PULCHK disabled,
       configuration hash MD5:
       C8 4E 4E 5D D3 5C D8 9E 9F 52 82 E0 59 8A DE 15
       data hash MD5: 64K
       02 3C 6C BC E2 C0 C2 28 B8 94 02 18 EE 81 58 1D>)
(   2,<2013-11-13 20:46:28.386 -0800>,<Administrator>,<X>,<proc1d>,<TOPSPIN 2.1>,
      <Start of raw data processing
       efp LB = 0.3 FT_mod = 6 PKNL = 1 PHC0 = 0 PHC1 = 0 SI = 128K 
       data hash MD5: 128K
       B3 61 8B D6 3A 9D 78 02 31 D3 62 E2 A8 56 E8 6D>)
(   3,<2013-11-13 20:46:29.589 -0800>,<Administrator>,<X>,<proc1d>,<TOPSPIN 2.1>,
      <pk PHC0 = -87.14905 PHC1 = 0 
       data hash MD5: 128K
       21 53 76 4E 86 5D 59 BF 03 AB F0 B7 C3 1D 75 84>)
(   4,<2013-11-13 20:46:30.089 -0800>,<Administrator>,<X>,<proc1d>,<TOPSPIN 2.1>,
      <abs ABSG = 1 
       data hash MD5: 128K
       C4 E5 84 23 61 24 70 88 55 C4 75 9E 15 98 8A 7E>)
(   5,<2013-11-13 20:46:30.183 -0800>,<Administrator>,<X>,<proc1d>,<TOPSPIN 2.1>,
      <abs ABSG = 2 
       data hash MD5: 128K
       77 4F 22 13 49 4E 20 CA E5 23 DE 07 E9 D7 78 75>)
(   6,<2013-11-13 20:46:30.292 -0800>,<Administrator>,<X>,<proc1d>,<TOPSPIN 2.1>,
      <abs ABSG = 3 
       data hash MD5: 128K
       A3 FD 6B 41 33 37 09 18 39 2A A6 E8 A1 E6 13 43>)
(   7,<2013-11-13 20:46:30.386 -0800>,<Administrator>,<X>,<proc1d>,<TOPSPIN 2.1>,
      <abs ABSG = 4 
       data hash MD5: 128K
       A4 78 0F 6F 08 06 40 B4 DF 23 B6 B9 6F A1 4B F5>)
(   8,<2013-11-13 20:46:30.480 -0800>,<Administrator>,<X>,<proc1d>,<TOPSPIN 2.1>,
      <abs ABSG = 5 
       data hash MD5: 128K
       41 C2 EC A1 8F C4 76 A1 42 4B 5C B5 96 7D FC 55>)
$$ ##END=
$$ 
$$ $$ hash MD5
$$ $$ 7F 62 57 9F B5 C4 69 D7 B7 BA D3 94 36 34 B0 51
##$RELAX= 
##$RELAX= 
##$RELAX= 
##$RELAX= 
##$RELAX= 
##$RELAX= 
##$RELAX= 
##$RELAX= 
$$ Bruker specific parameters
$$ --------------------------
##$DU= <E:\>
##$EXPNO= 12
$$ [...]
##$TP07= 0
##$TPNAME0= <>
##$TPNAME1= <>
##$TPNAME2= <>
##$TPNAME3= <>
##$TPNAME4= <>
##$TPNAME5= <>
##$TPNAME6= <>
##$TPNAME7= <>
##$TPOAL= (0..7)
0.5 0.5 0.5 0.5 0.5 0.5 0.5 0.5
##$TPOFFS= (0..7)
0 0 0 0 0 0 0 0
##$TUNHIN= 0
##$TUNHOUT= 0
##$TUNXOUT= 0
##$USERA1= <user>
##$USERA2= <user>
##$USERA3= <user>
##$USERA4= <user>
##$USERA5= <user>
##$V9= 5
##$VALIST= <valist>
##$VCLIST= <CCCCCCCCCCCCCCC>
##$VD= 0
##$VDLIST= <DDDDDDDDDDDDDDD>
##$VPLIST= <PPPPPPPPPPPPPPP>
##$VTLIST= <TTTTTTTTTTTTTTT>
##$WBST= 1024
##$WBSW= 4
##$XGAIN= (0..3)
0 0 0 0
##$XL= 0
##$YL= 0
##$YMAX_a= 5670887
##$YMIN_a= -11768307
##$ZGOPTNS= <>
##$ZL1= 120
##$ZL2= 120
##$ZL3= 120
##$ZL4= 120
##$ABSF1= 14.96107
##$ABSF2= -5.597112
##$ABSG= 5
##$ABSL= 3
##$ALPHA= 0
##$AQORDER= 0
##$ASSFAC= 0
##$ASSFACI= 0
##$ASSFACX= 0
##$ASSWID= 0
##$AUNMP= <proc_prof1d_extract.lims>
##$AXLEFT= 0
##$AXNAME= <>
##$AXNUC= <1H>
##$AXRIGHT= 0
##$AXTYPE= 0
##$AXUNIT= <>
##$AZFE= 0.1
##$AZFW= 0.1
##$BCFW= 0
##$BC_mod= 0
##$BYTORDP= 0
##$COROFFS= 0
##$CY= 15
##$DATMOD= 1
##$DC= 0
##$DFILT= <>
##$DTYPP= 0
##$F1P= 0
##$F2P= 0
##$FCOR= 0.5
##$FTSIZE= 131072
##$FT_mod= 6
##$GAMMA= 0
##$GB= 0
##$INTBC= 1
##$INTSCL= 1
##$ISEN= 128
##$LB= 0.3
##$LEV0= 0
##$LPBIN= 0
##$MAXI= 10000
##$MC2= 0
##$MEAN= 0
##$ME_mod= 0
##$MI= 0
##$NCOEF= 0
##$NC_proc= -2
##$NLEV= 6
##$NOISF1= 0
##$NOISF2= 0
##$NSP= 0
##$NTH_PI= 0
##$NZP= 0
##$OFFSET= 14.96107
##$PC= 1
##$PHC0= -87.14905
##$PHC1= 0
##$PH_mod= 1
##$PKNL= yes
##$PPARMOD= 0
##$PPDIAG= 0
##$PPIPTYP= 0
##$PPMPNUM= 2147483647
##$PPRESOL= 1
##$PSCAL= 4
##$PSIGN= 0
##$PYNMP= <proc.py>
##$REVERSE= no
##$SF= 400.020009608304
##$SI= 131072
##$SIGF1= 0
##$SIGF2= 0
##$SINO= 400
##$SIOLD= 131072
##$SPECTYP= <>
##$SREGLST= <1H.CDCl3>
##$SSB= 0
##$STSI= 131072
##$STSR= 0
##$SW_p= 8223.68421052631
##$SYMM= 0
##$S_DEV= 0
##$TDeff= 65536
##$TDoff= 0
##$TI= <>
##$TILT= no
##$TM1= 0
##$TM2= 0
##$TOPLEV= 0
##$USERP1= <user>
##$USERP2= <user>
##$USERP3= <user>
##$USERP4= <user>
##$USERP5= <user>
##$WDW= 1
##$XDIM= 131072
##$YMAX_p= 399352718
##$YMIN_p= -11512
##$CURPLOT= <Network HP LaserJet P1505>
##$CURPRIN= <$Network HP LaserJet P1505>
##$DFORMAT= <normdp>
##$LAYOUT= <+/1D_H.xwp>
##$LFORMAT= <normlp>
##$PFORMAT= <normpl>
##$SURQMSG= 1
$$ End of Bruker specific parameters
$$ ---------------------------------
##NTUPLES= NMR SPECTRUM
##VAR_NAME=  FREQUENCY,     SPECTRUM/REAL,   SPECTRUM/IMAG
##SYMBOL=    X,             R,               I
##VAR_TYPE=  INDEPENDENT,   DEPENDENT,       DEPENDENT
##VAR_FORM=  AFFN,          ASDF,            ASDF
##VAR_DIM=   131072,        131072,          131072
##UNITS=     HZ,            ARBITRARY UNITS, ARBITRARY UNITS
##FACTOR=    0.0627417313425164, 1,          1
##FIRST=     8223.62146879497, -677,         -53108
##LAST=      0,             312,             -53010
##MIN=       0,             -11512,          0
##MAX=       8223.62146879497, 399352718,    0
$$ Real data points
##PAGE= N=1
##DATA TABLE= (X++(R..R)), XYDATA
$$ [...]
67789 70758 69927 69777 70239 70640 70286 69129 67669 66365 65411 64969 65197 65932 66621 66801 66597 66534 66913 67558
67771 67558 68207 68905 69867 71131 72616 74368 76428 78546 80420 82190 84276 86625 88585 89730 90351
67756 90351 90845 91062 90637 89617 88344 87045 85941 85472 85842 86545 86835 86534 85905 84957 83499 81767 80366
67739 80366 79516 78924 78408 78115 77958 77431 76209 74566 73028 71959 71507 71482 71186 69944 68024 66514 66021
67722 66021 65972 65576 64945 64772 65268 66054 66939 68149 69647 70749 70704 69559 68202 67556 67811 68501 69218 69957
67704 69957 70665 70823 69934 68320 66956 66424 66431 66460 66445 66638 67211 68243 69753 71412 72525 72639 72053 71464
67686 71464 71292 71514 71930 72331 72581 72793 73271 74084 74917 75507 75971 76504 77100 77888 79332 81507 83469 84048
67668 84048 83309 82646 83272 85072 87059 88465 89068 88918 88230 87440 86973 86923 87101 87288 87262 86712 85484 83961
67650 83961 82909 82754 83160 83425 83253 82925 82775 82722 82442 81853 81269 81027 81091 81086 80776 80452 80763 82091 84095
67631 84095 85963 87077 87385 87250 87196 87746 89166 91111 92766 93552 93589 93347 93128 93146 93844 95643 98399 101384
67613 101384 103791 105090 105179 104601 104408 105263 106620 107327 107097 106864 107541 108929 110066 110184 109025 106694 103629
67596 103629 100489 97653 94977 92233 89599 87415 85675 83980 81906 79310 76511 74308 73439 73780 74374
67581 74374 74525 74549 75112 76203 77225 77831 78200 78551 78876 79101 79129 78764 77937 76955 76138 75274 73855 71893
67563 71893 70130 69352 69767 71069 72773 74356 75365 75573 74978 73643 71756 69786 68307 67596 67526 67845
67547 67845 68379 68992 69578 70102 70495 70603 70429 70336 70631 71004 70697 69381 67590 66190 65636 65804 66268 66626
67529 66626 66721 66728 66885 67088 66934 66248 65422 65071 65434 66196 66797 66884 66557 66220 66163 66257 66116 65507 64519 63476 62846
67508 62846 63099 64355 66125 67578 68132 67702 66518 64942 63435 62414 62026 62192 62786 63581 64138 64113 63669
67491 63669 63301 63227 63280 63371 63640 64082 64451 64749 65377 66484 67486 67623 66826 65722 64854 64204 63448 62481 61662
67472 61662 61550 62256 63089 63140 62344 61626 61744 62344 62508 61986 61408 61436 62163 63294 64413 65015 64761 63924 63302
67453 63302 63506 64502 65915 67368 68391 68408 67247 65493 63969 62950 62228 61833 62245 63728 65826 67761
67437 67761 69199 70366 71505 72440 72750 72244 71224 70291 69856 69793 69589 68882 67804 66722 65786 64889 63998
67420 63998 63270 62726 62053 60930 59466 58189 57600 57852 58760 59944 61011 61749 62243 62661 62940 62805 62170
67403 62170 61389 60983 61164 61745 62473 63221 63844 64045 63636 62872 62329 62387 62981 63885 65011 66233 67136 67272 66712
67384 66712 66079 65967 66453 67182 67664 67485 66521 65135 63985 63429 63230 62978 62638 62487 62648 62896 62935 62741 62586
67365 62586 62743 63121 63298 63061 62805 63076 63757 64119 63793 63242 63037 63161 63398 63924 64914 65908 66250 66066 66092
67346 66092 66538 66741 66170 65186 64519 64357 64278 63879 63253 62975 63656 65336 67316 68842 69869 70920 72269
67329 72269 73766 75336 77060 78634 79390 79178 78672 78436 78130 77110 75459 73907 72918 72315 71714 70934 70050
67312 70050 69314 69014 69204 69679 70327 71269 72479 73587 74340 74946 75620 76102 76161 76313 77347 79150 80623 80982
67294 80982 80631 80471 80739 80911 80620 80232 80412 81297 82257 82528 81998 81247 80880 81046 81619 82503 83474 83981 83457
67275 83457 81827 79552 77293 75660 75008 75127 75353 75305 75388 76161 77424 78453 79032 79621 80432 80970 80840 80463
67257 80463 80565 81195 81613 81059 79399 77205 75404 74651 74736 74732 73967 72799 72210 72724 73920 74940 75230 74789
67239 74789 74012 73402 73285 73545 73640 73029 71774 70646 70473 71331 72539 73523 74425 75624 76867 77353 76635 75118
67221 75118 73617 72801 73082 74546 76660 78375 78973 78677 78236 78039 77925 77693 77431 77319 77392 77582 77845 78174
67203 78174 78573 79061 79668 80487 81694 83361 85141 86378 86677 86227 85437 84487 83447 82559 82069 81934 82071
67186 82071 82697 83992 85521 86538 86895 87124 87496 87604 87160 86603 86416 86251 85389 83899 82677 82340 82619
67169 82619 83005 83482 84322 85501 86677 87598 88287 88872 89419 89917 90267 90325 89984 89228 88170 87156 86738 87245
67151 87245 88283 88948 88772 88265 88294 89070 90007 90439 90212 89620 89092 89010 89556 90627 91972 93413 94821 95996
67133 95996 96868 97769 99144 100874 102221 102658 102467 102292 102332 102289 102029 101954 102649 104245 106181 107578 107995 107888
67115 107888 108140 109068 110146 110865 111484 112571 114076 115427 116405 117268 117957 117919 117124 116670 117691 119862 121628
67098 121628 121969 121391 120974 120979 120820 120194 119692 120138 121629 123451 124782 125305 125237 125084 125385 126376 127713 128706
67080 128706 129054 129273 130197 132122 134614 136966 138532 138773 137606 135870 134941 135424 136507 137005 136819 136859 137716
67063 137716 139067 140461 141987 143771 145361 146222 146651 147549 149246 151031 152037 152255 152450 153350 155145 157533
67047 157533 159936 161754 162720 163100 163439 164135 165287 166779 168344 169676 170747 171975 173827 176271 178835
67032 178835 181179 183359 185470 187361 188816 189845 190679 191667 193206 195482 198179 200666 202632 204295 205913
67017 205913 207448 208963 210936 213689 216656 218715 219354 219280 219868 222115 225930 230165 233414 235166 236267
67002 236267 238132 241560 246393 252014 257761 263011 267340 270704 273256 275119 276609 278382 280766 283143
66988 283143 284669 285576 287041 289681 292977 296385 300096 304205 307982 310815 313304 316567 320784 325279
66974 325279 329756 334527 339512 344018 347820 351764 356818 362954 369301 375157 380594 386255 392711 399856
66960 399856 406896 413115 418635 424144 429969 435906 441946 448570 456058 464002 471843 479542 487359 495336
66946 495336 503450 511994 521279 531047 540614 549627 558377 567417 577191 588030 600075 613010 626119
66933 626119 638821 651069 663165 675322 687596 700139 713337 727613 743075 759425 776206
66922 776206 793167 810330 827768 845466 863498 882126 901489 921211 940587 959309 977860
66911 977860 997051 1017270 1038368 1060215 1082999 1106836 1131400 1156392 1182258 1209889 1239408
66900 1239408 1269713 1299675 1329502 1360374 1392871 1426352 1459992 1493845 1528627 1564869 1602576
66889 1602576 1641414 1680901 1720678 1760926 1802324 1845282 1889361 1933711 1977851 2021700 2065130
66878 2065130 2108061 2150909 2194383 2238664 2283204 2327428 2371269 2414818 2457823 2499887 2540938
66867 2540938 2581283 2621207 2660705 2699459 2736942 2772632 2806269 2837829 2867122 2893557 2916460
66856 2916460 2935665 2951683 2965232 2976542 2985088 2990023 2990959 2988297 2982781 2974802 2964256 2950849 2934293
66843 2934293 2914326 2891013 2865078 2837513 2808685 2778103 2745252 2710263 2673511 2634947 2594353
66832 2594353 2552060 2508887 2465343 2421290 2376484 2331075 2285466 2239937 2194511 2149005 2103181
66821 2103181 2057146 2011666 1967700 1925391 1883749 1841618 1798820 1756178 1714634 1674635 1636183
66810 1636183 1598992 1562459 1525844 1488856 1451955 1415962 1381318 1347850 1315120 1282870 1251106
66799 1251106 1219922 1189442 1159940 1131906 1105784 1081554 1058635 1036288 1014113 992114 970384
66788 970384 948955 927983 907850 888861 870858 853272 835567 817560 799419 781569 764531
66777 764531 748611 733622 719074 704738 690848 677624 664809 651933 638956 626408 614801
66766 614801 604095 593798 583465 572996 562564 552355 542465 532981 524071 515836 508067 500308 492270
66753 492270 484093 476121 468548 461454 454952 449042 443426 437711 431770 425654 419291 412626 406016 400061
66739 400061 394941 390253 385595 380880 375927 370288 363822 357093 350807 345123 339910 335398 332019 329630
66725 329630 327343 324177 319649 313923 307777 302358 298422 295659 293073 290072 286865 283804 280786 277498
66711 277498 273877 270113 266417 262920 259580 256160 252597 249456 247496 246527 245177 242309 238410 235062
66697 235062 233165 232160 230895 228713 225602 221874 218107 215106 213393 212651 211866 210143 207388 204282 201657
66682 201657 199852 198498 196889 194599 191758 188754 185797 182908 180244 178131 176620 175266 173677 172177
66668 172177 171548 171969 172557 172181 170495 167946 165043 162078 159443 157640 156782 156418 156078 155749 155574 155370 154804
66651 154804 154014 153617 153920 154376 154068 152707 150890 149297 147934 146407 144707 143240 142061 140663 138837
66636 138837 137261 136741 137121 137494 137342 136876 136309 135452 134158 132655 131185 129768 128459 127393 126408 125124
66620 125124 123635 122597 122265 121996 121158 120062 119444 119411 119553 119801 120424 121245 121560 120924 119491 117537 115215
66603 115215 112889 111138 110153 109464 108521 107308 106251 105775 106044 106818 107456 107346 106501 105499 104794 104396 104282
66586 104282 104674 105609 106603 107074 106943 106515 105934 105079 103933 102748 101834 101372 101408 101862 102493 103018 103311 103422
66568 103422 103404 103235 102924 102604 102350 101902 100721 98598 96201 94714 94712 95560 96155 96069 95620 95100 94512 94056 94205
66549 94205 94951 95480 95068 94002 93131 92759 92518 92225 92204 92587 92846 92423 91539 90953 91060 91559 91967 92068 91778
66530 91778 90961 89645 88204 87064 86304 85782 85512 85580 85729 85430 84492 83305 82338 81686 81259 81060 81042 80969 80776
66511 80776 80804 81307 81922 82060 81700 81427 81708 82491 83379 83801 83121 81173 78759 77105 76647 76731 76628 76395 76547
66492 76547 77291 78368 79348 79808 79464 78409 77087 75904 75045 74658 74865 75445 75907 76011 75904 75601 74858 73828
66474 73828 73324 73956 75326 76499 76984 76858 76252 75299 74371 73835 73639 73548 73660 74242 75163 75990 76562 76999 77173
66455 77173 76749 75804 74909 74461 74359 74445 74813 75473 76124 76580 77171 78422 80448 82792 84734 85682 85491 84537
66437 84537 83419 82531 82004 81925 82322 82939 83416 83700 83987 84215 84065 83595 83413 83898 84617 84926 84853 84929 85230 85070
66417 85070 83796 81592 79371 77963 77483 77385 77076 76482 76007 75966 76216 76400 76394 76356 76458 76721 77045 77255 77120
66398 77120 76519 75578 74560 73595 72630 71654 70898 70705 71161 71885 72276 72040 71410 70752 70040 68965 67566 66448
66380 66448 66199 66798 67808 69007 70497 72260 73971 75388 76684 78155 79680 80662 80590 79573 78256 77208
66364 77208 76484 75821 75208 75014 75420 75877 75475 74015 72473 72118 73170 74562 75114 74710 74146 74037 74254 74425
66346 74425 74563 74896 75289 75264 74602 73686 73136 73245 73859 74617 75213 75533 75682 75833 75980 75923 75560 75121 74932 75040
66326 75040 75254 75508 75959 76578 76918 76534 75609 74865 74756 74974 74892 74314 73545 72851 72158 71294 70264 69164 68091
66307 68091 67265 67044 67619 68796 70193 71505 72459 72756 72323 71505 70777 70381 70459 71291 72936 74659 75329 74595
66289 74595 73386 72946 73579 74546 74960 74526 73544 72557 72008 71995 72244 72385 72255 71984 71829 71975 72394 72837 73070
66270 73070 73146 73309 73538 73386 72458 70937 69457 68589 68569 69288 70238 70641 70140 69361 69360 70324 71289 71385 70897 70693
66250 70693 70956 71178 71278 71931 73539 75434 76529 76437 75579 74563 73884 73971 74868 75916 76295 75979 75668 75774
66232 75774 76028 76286 77012 78474 79921 80239 79265 77915 77086 76903 76992 76974 76647 76144 76032 76807 78100 78805
66214 78805 78233 76774 75235 73942 72882 72348 72816 74210 75809 76958 77547 77768 77804 77935 78535 79624 80612
66197 80612 80862 80372 79647 78922 77987 76833 76098 76527 78162 80270 81939 82543 81874 80296 78726 78030 78245
66180 78245 78674 78812 78856 79193 79763 80187 80216 79744 78674 77129 75622 74642 74167 73922 73928 74455 75486 76598 77331
66161 77331 77440 76930 76164 75771 76021 76469 76643 76884 77871 79452 80737 81378 81909 82611 82958 82706 82641 83467 84543
66142 84543 84627 83514 82065 80850 79724 78698 78247 78515 78994 79337 79801 80494 80826 80316 79486 79342 80143 81337
66124 81337 82525 83842 85302 86407 86758 86620 86559 86769 87146 87776 88815 89874 90066 88990 87391 86529 86982
66107 86982 88297 89688 90711 91276 91377 91071 90581 90188 89960 89641 88859 87519 86034 85091 85047 85615 86268 86783
66089 86783 87229 87605 87853 88197 89004 90189 91123 91368 91190 91127 91301 91461 91489 91561 91877 92466 93207 93871 94262 94452
66069 94452 94742 95254 95747 96043 96368 96965 97537 97522 96903 96366 96484 97043 97341 97023 96449 96230 96540 96965 97041 96797
66049 96797 96592 96516 96298 95859 95602 95928 96743 97699 98660 99631 100482 101065 101419 101446 100618 98577 96012 94395 94714
66030 94714 96781 99793 103045 105927 107747 108123 107454 106663 106370 106359 105891 104556 102884 102060 102868 105002 107537
66013 107537 109876 111983 113894 115526 116957 118426 119916 121214 122549 124723 128270 132790 137444 141792
65999 141792 145846 149586 152900 155890 158821 161778 164679 167573 170547 173263 174956 175095 173919 172155
65985 172155 170243 167982 164942 161142 157185 153670 150603 147604 144652 142274 140813 139808 138369 136078
65971 136078 133286 130671 128705 127440 126466 125175 123406 121891 121687 123031 124995 126460 127200 127763 128498
65956 128498 129061 128947 128217 127496 127350 127825 128619 129583 130910 132843 135300 137857 140077 141818 143286 144873
65940 144873 146876 149209 151356 152758 153362 153719 154404 155431 156360 156938 157460 158424 160005 162004 164237 166835
65924 166835 170123 174241 178878 183376 187209 190447 193701 197536 201950 206471 210604 214055 216709 218662
65910 218662 220244 221721 222913 223411 223246 223091 223593 224668 225591 225658 224682 223047 221451 220383 219651 218526
65894 218526 216462 213509 209931 205779 201093 196177 191240 186002 180141 173983 168234 163097 158211 153482
65880 153482 149346 145983 142874 139480 135983 132965 130692 129105 128196 127874 127613 126766 125282 123788 122830
65865 122830 122295 121650 120545 119133 118006 117836 118853 120541 121977 122626 122723 122833 123151 123417 123430 123413 123749 124515
65847 124515 125470 126433 127449 128521 129454 130161 130934 132144 133742 135346 136752 138066 139369 140565 141668
65832 141668 142941 144669 147058 150380 154797 159844 164489 168074 171007 174204 178052 182262 186515 190804
65818 190804 195094 199051 202221 204293 205143 204827 203541 201430 198487 194815 190861 187057 183326 179344 175332
65803 175332 172090 170003 168398 166262 163385 160420 157958 155940 154053 152311 151065 150568 150726 151234 151867
65788 151867 152662 153851 155584 157708 159878 161882 163809 165914 168469 171792 176216 181817 188216 194767
65774 194767 200874 205998 209533 211081 210951 210050 209033 207701 205330 201430 196026 189572 182925 177165 172919
65759 172919 169836 167164 164873 163836 164790 167553 171442 176103 181597 187948 194967 202425 210144 217998
65745 217998 225952 233981 241777 248679 254119 258013 260566 261832 261650 259847 256293 250941 244109 236524
65731 236524 228793 220898 212531 203811 195298 187338 179830 172685 166089 160147 154649 149454 144880 141375
65717 141375 138881 136712 134076 130695 127012 123883 121932 121062 120643 120197 119797 119767 120187 120815 121422 122019 122807
65700 122807 123934 125292 126519 127276 127511 127349 126846 126085 125531 125884 127283 128970 130050 130464 130852 131579 132411
65683 132411 133185 134293 136170 138709 141593 145033 149666 155725 162735 170165 177972 186333 195191 204426
65669 204426 214262 225064 236704 248449 259510 269501 278418 286436 293809 300689 306931 312294 316823
65656 316823 320764 324033 326163 327002 327130 327313 327768 328286 328800 329375 329808 329742 329222 328649 328057 326740 323811
65639 323811 318887 312112 303744 293943 282830 270590 257555 244237 231144 218585 206764 196066
65627 196066 186987 179689 173839 168916 164478 160068 155307 150371 146052 142953 140773 138785 136876 135572
65613 135572 134977 134285 132726 130620 129025 128422 128244 127762 126941 126162 125435 124422 123148 122153 121724 121412 120696
65596 120696 119902 119934 121110 122679 123673 123889 123859 124151 125083 126864 129532 132728 135984 139414 143777 149568
65580 149568 156297 163058 169672 176817 184943 193566 201929 210044 218560 227724 236962 245605 253565 261025
65566 261025 267747 273068 276477 277935 277616 275598 271810 266195 258980 250838 242598 234599 226479 217804
65552 217804 208755 199889 191451 183354 175767 169186 163795 159270 155433 152679 151391 151279 151675 152318 153412
65537 153412 155069 157095 159321 161750 164342 166935 169395 171612 173334 174253 174302 173580 171993 169293 165630
65522 165630 161751 158415 155767 153441 151078 148586 146106 143998 142641 141970 141376 140368 139218 138513 138131
65507 138131 137245 135480 133576 132549 132574 133180 134203 135924 138204 140110 140662 139760 138245 137287 137773 139867
65491 139867 142901 145928 148648 151651 155584 160294 165055 169403 173397 177154 180514 183166 184816 185300
65477 185300 184825 184051 183564 183212 182296 180449 177955 175147 171948 168234 164289 160548 157146 154051 151388
65462 151388 149299 147562 145730 143618 141443 139508 137973 136855 136049 135416 135074 135417 136541 137790 138341
65447 138341 138237 138333 139108 140023 140400 140481 141171 142902 145275 147746 150204 152732 155270 157768 160429 163425
65431 163425 166464 168928 170523 171563 172459 173089 172822 171212 168538 165665 163381 161796 160268 157931 154500
65416 154500 150655 147556 145868 145321 145229 145248 145480 146063 146974 148194 149715 151289 152488 153230 154096 155877 158853
65399 158853 162574 166248 169249 171439 173198 175088 177317 179528 181217 182207 182578 182343 181459 180126 178716
65384 178716 177400 176052 174540 172891 171210 169708 168841 169013 170008 171082 171841 172718 174299 176468 178567
65369 178567 180246 181758 183490 185507 187530 189114 190015 190737 192610 196876 203549 211483 219614 227818 236541
65354 236541 246050 256276 266996 277800 287996 296826 303694 308131 309847 309096 306772 303807 300502
65341 300502 296644 292121 287104 281686 275653 268724 260857 252302 243531 235082 227293 220130 213393 207080
65327 207080 201389 196392 191964 188095 185041 182933 181372 179621 177233 174413 171727 169575 167966 166686
65313 166686 165484 164134 162512 160825 159645 159526 160498 161990 163203 163477 162544 160809 159401 159529 161501
65298 161501 164542 167753 171012 174719 178922 183089 186695 189690 192283 194483 196020 196614 196244 195113 193456
65283 193456 191476 189529 188190 187855 188284 188843 189248 189783 190676 191595 192008 191707 190749 189184 187151 184996 182914
65266 182914 180654 177967 175161 172816 171110 169772 168556 167334 165877 164058 162253 161007 160272 159465 158336
65251 158336 157325 156894 156943 157059 156941 156377 155179 153429 151566 150065 149178 149043 149756 151154 152722 153831
65235 153831 153999 153127 151799 151176 151988 153642 154831 155065 154964 154953 154511 153138 151359 150147 149792 149936 150372
65218 150372 151235 152589 154298 156130 157621 158146 157596 156691 156190 156107 156160 156569 157645 158855 159166 158365 157322
65201 157322 156922 157384 158632 160494 162300 163087 162664 161938 161715 161715 161263 160538 160485 161632 163565 165590 167469
65184 167469 169374 171398 173320 174855 176086 177508 179528 181934 184082 185641 186896 188279 189938 191834
65170 191834 193938 196118 198160 200221 202997 207085 212317 217981 223494 228567 232937 236548 240038 244608
65156 244608 251210 260013 270680 282891 296609 312157 330187 351328 375823 403719 435321 471027
65144 471027 510611 553173 598050 645340 695124 746495 797798 847546 894601 937762 976040
65133 976040 1009481 1039070 1065337 1087334 1103246 1111879 1113400 1108805 1098781 1082976 1060419 1030901
65121 1030901 995822 957276 916330 872748 826392 778164 729267 680335 631883 584953 540576
65110 540576 498959 460026 424447 393300 366816 344216 324746 308113 293940 281607 270746
65099 270746 261197 252367 243471 234658 227162 221928 218638 216375 214580 213040 211635 210569 210251 210479 210266
65084 210266 208960 207037 205331 204009 202812 201695 200620 199297 197846 197164 197775 198731 198591 197256 195945
65069 195945 195468 195484 195364 194909 194086 192942 191972 191800 192248 192391 191804 191113 191054 191588 192276 192998 193817 194531 194791
65050 194791 194518 194021 193824 194368 195562 196680 197145 197365 198167 199335 199507 197878 195281 193052 191422 189707
65034 189707 187637 185672 184128 182760 181312 179870 178430 176618 174190 171536 169314 167654 166095 164354
65020 164354 162864 162236 162389 162620 162586 162754 163633 164990 166255 167386 168800 170593 172428 174219 176383 179285
65004 179285 182845 186787 190851 194668 197832 200286 202289 203918 204977 205451 205639 205768 205940 206571 208217
64989 208217 210715 213047 214504 215533 217071 219347 221763 223562 224208 223473 221743 219986 218915 218201 216873
64974 216873 214381 210993 207306 203784 200640 197818 195086 192421 190166 188533 187075 185018 182143 179081
64960 179081 176715 175435 174924 174513 173781 172841 171966 171026 169657 168029 166936 166824 167157 167095 166472 165703 165061
64943 165061 164552 164286 164432 164869 165312 165727 166248 166831 167381 168144 169484 171308 173116 174560 175579 176047 175769
64926 175769 174891 173896 173138 172700 172727 173459 174803 176256 177372 178025 178127 177501 176287 175186 175007 176075 178230
64909 178230 181264 185098 189487 193777 197218 199690 202046 205465 210424 216462 222993 229862 236941 243660
64895 243660 249486 254588 259491 264141 267877 270277 271550 272079 272082 271794 271445 270838 269321 266446 262423 257833
64879 257833 253179 248799 244898 241459 238333 235490 232978 230659 228342 226231 224859 224449 224630 224874 224868 224371
64863 224371 223146 221240 218976 216444 213404 209922 206651 204080 201862 199359 196610 194250 192568 191161
64849 191161 189595 187933 186504 185462 184828 184754 185466 186940 188731 190217 191014 191169 190944 190516 189960 189418 189058
64832 189058 188861 188646 188368 188184 188224 188541 189320 190775 192686 194450 195886 197728 200866 205319 210434 216008
64816 216008 222613 230642 239565 248545 257517 267236 278230 290040 301526 311732 320351 327504 333221
64803 333221 337119 338542 337117 333166 327448 320402 311873 301769 290822 280322 271051 262737 254674
64790 254674 246606 238897 232130 226721 222701 219647 217030 214866 213796 214280 215912 217861 219765 221853
64776 221853 224398 227552 231588 236701 242535 248466 254543 261635 270371 280287 290288 299646 308280 316344
64762 316344 323874 330678 336357 340543 343302 345166 346609 347646 348060 347754 346697 344713 341585 337311 332111
64747 332111 326295 320112 313565 306347 298236 289590 281092 272961 264838 256645 249001 242464 236843 231769
64733 231769 227503 224525 222611 221044 219688 219125 219583 220384 220745 220654 220665 221145 222053 223261 224752 226563 228659
64716 228659 230855 232869 234592 236276 238212 240215 241674 242152 241693 240501 238637 236173 233310 230121 226453
64701 226453 222314 218169 214561 211608 209130 207138 205829 205157 204754 204389 204233 204542 205285 206246 207397 209056
64685 209056 211699 215656 220912 227146 234023 241443 249499 258241 267588 277479 287888 298624 309306
64672 309306 319680 329720 339171 347157 352675 355518 356331 355636 353145 348312 341261 332779 323539 313778
64658 313778 303765 294161 285712 278858 273810 270744 269619 269905 270832 272003 273725 276726 281635 288664
64644 288664 297609 308065 319770 332882 347932 365359 385001 406045 427490 448545 468494 486409
64632 486409 501419 513359 522788 530091 534754 535755 532490 525089 514127 500487 485327 469561 453240
64619 453240 435859 417409 398748 380739 363481 346687 330511 315631 302643 291629 282222 273903
64607 273903 266263 259145 252508 246285 240536 235672 232099 229564 227265 224758 222349 220421 218810 217164
64593 217164 215511 214094 212981 212229 212090 212668 213737 215312 217954 221890 226223 229846 232897 236418 240636
64578 240636 244551 247430 249736 252082 254067 254857 254487 253850 253583 253456 252828 251316 249009 246307 243536 240616
64562 240616 237250 233492 229887 226838 224097 221174 218068 215250 213044 211333 209887 208719 208035 207914 208088
64547 208088 208039 207404 206324 205287 204667 204566 205040 206115 207464 208490 208979 209420 210365 211624 212444 212331 211470
64530 211470 210434 209767 209723 210180 210811 211502 212460 213806 215344 216990 219089 221830 224593 226492 227546 228715
64514 228715 230712 233381 236482 240480 246024 252940 260336 267618 275049 283265 292599 302935 313929 325147
64500 325147 336069 346150 355013 362573 368921 373937 377051 377550 375196 370453 364026 356314 347411 337530
64486 337530 327189 317026 307511 298825 290875 283437 276428 270046 264546 259850 255557 251397 247541 244323
64472 244323 241780 239660 237835 236440 235520 234834 234276 234325 235640 238125 240707 242290 242741 242778 243070 243728 244546
64455 244546 245368 246185 247134 248444 250193 252060 253570 254614 255486 256353 257072 257729 258993 261515 265124 269005
64439 269005 272666 276400 280811 286256 292886 300898 310431 321325 333258 346181 360445 376529 394854
64426 394854 416029 441194 471781 508756 552178 601756 657736 720876 791392 868266 949797
64415 949797 1034466 1120785 1206533 1288862 1365410 1434905 1496462 1548705 1589974 1619128 1635758
64404 1635758 1639722 1630879 1609315 1575581 1530706 1476173 1413767 1345118 1271299 1193178 1112194 1030481
64392 1030481 950056 872219 797986 728829 666422 611524 563499 521228 484364 453399 428513
64381 428513 408711 392346 378350 366643 357311 349759 342906 336024 329069 322258 315627 309126 302884
64368 302884 297149 292031 287420 283177 279336 276110 273683 271994 270812 270115 270311 271862 274703 278309 282444
64353 282444 287523 293975 301514 309454 317653 326584 336264 345594 353242 359023 363895 368548 372474 374668
64339 374668 374879 373800 372253 370626 369056 367682 366599 365895 365927 367228 369911 373380 376882 380151 383283
64324 383283 386235 388804 390860 392161 392003 389604 384984 379077 372812 366355 359372 351739 343785 336059
64310 336059 329093 323173 318119 313353 308321 302862 297186 291705 286851 282753 279021 275175 271441 268774
64296 268774 267900 268665 270524 273244 276702 280442 284087 288071 293301 300052 307669 315515 323656 332415 341641
64281 341641 350787 359487 367760 375727 383355 390442 396772 402322 407338 412090 416467 419918 421816 421903 420436
64266 420436 418042 415333 412490 409232 405404 401451 398045 395354 393060 391059 389592 388505 386850 383577
64252 383577 378326 371330 362926 353566 344020 335011 326679 318754 311216 304426 298624 293616 289015 284532
64238 284532 280102 275993 272787 270899 270062 269577 269094 268854 269145 269900 270957 272297 273766 274877 275249 275062
64222 275062 274810 274699 274524 274006 272995 271454 269549 267674 266121 264806 263563 262580 262150 262063 261742 261123 260945
64205 260945 261914 263881 266093 267989 269465 270690 271996 273792 276203 278978 282160 286663 293583 302932
64191 302932 313630 324888 337021 350617 365417 380477 394984 408359 419893 429018 435892 440963
64179 440963 443823 443172 438293 430035 419915 408655 396203 382862 369682 357666 347166 338206 330888
64166 330888 325215 320901 317735 315842 315269 315550 316109 316900 318181 319786 321148 322046 322735 323148 322656 321035
64150 321035 319158 318088 317768 317329 316515 315983 316035 315854 314538 312406 310658 309890 309462 308363 306313 303930
64134 303930 302060 301090 300827 300913 301273 302013 302911 303362 303110 302826 303595 305838 309026 312462 316101 320527 326351
64117 326351 333691 342122 351071 360403 370563 381907 393928 405466 415785 425095 433803 441585 447604
64104 447604 451565 454140 456311 458596 461074 463909 467545 472357 478205 484340 489724 493568 495711 496522
64090 496522 496389 495350 493279 490274 486610 482326 477158 471058 464490 457918 451137 443503 434861 425949
64076 425949 417763 410776 404844 399570 394545 389450 384214 379057 374247 369877 365965 362586 359739 357242
64062 357242 355025 353420 352858 353314 354285 355320 356317 357324 358367 359656 361681 364903 369450 375253 382298
64047 382298 390512 399523 408930 418905 430188 443246 457553 471963 485719 498741 511025 522251
64035 522251 532163 540845 548235 553800 557206 559041 560198 560692 559824 557479 554431 551243 547714 543805 540151
64020 540151 537016 533448 528334 521782 514638 507062 498525 488960 478955 468903 458888 449428 441375
64007 441375 434868 429168 423729 418688 414188 410132 406862 405101 404677 404172 402574 400608 399675 400028 400898
63992 400898 402048 404249 408157 413456 419202 424525 429002 432843 436801 441585 447288 453606 460462 468058
63978 468058 476468 485598 495560 506730 519376 533406 548435 564016 580024 597055 616192 637980
63966 637980 661803 686596 711987 738402 766406 796481 829311 865670 906083 951170 1002340
63955 1002340 1061554 1130356 1209676 1300695 1405269 1525258 1661956 1816456 1990068 2183956
63945 2183956 2398570 2633610 2888117 3160186 3446760 3743933 4047203 4351393 4650882
63936 4650882 4940352 5215044 5469899 5698827 5895456 6054532 6172288 6245784 6272700 6251999
63926 6251999 6184392 6072032 5918079 5726668 5502888 5252450 4981378 4695887 4402013 4105057
63916 4105057 3809560 3519971 3240926 2976454 2729032 2499829 2289767 2099878 1930502
63907 1930502 1780597 1648175 1531256 1428304 1338107 1259655 1192110 1134460 1085114 1042085
63897 1042085 1003743 969219 937989 909274 882074 855670 829917 805051 781288 758548 736425
63886 736425 714449 692483 670861 650070 630374 611898 594971 580144 567754 557602 549231 542488
63874 542488 537719 535332 535268 536980 539936 543990 549216 555499 562484 569836 577406 585163 593178 601610 610405
63859 610405 618969 626485 632720 638236 643538 648287 651626 653053 652589 650283 646126 640523 634369 628336
63845 628336 622223 615156 606264 595218 582427 568926 555759 543119 530161 515950 500540 484936
63833 484936 470066 456076 442653 429687 417326 405593 394293 383293 372658 362479 352870 344213
63821 344213 337052 331429 326531 321421 316090 311440 308228 306315 305057 304054 303309 302917 302921 303387 304375 305820
63805 305820 307435 308660 308756 307282 304619 301777 299464 297528 295433 292982 290342 287596 284654 281471 278084
63790 278084 274559 271118 268126 265677 263355 260716 257842 255078 252444 249769 247302 245600 244745 244152 243325
63775 243325 242433 241967 242127 242736 243455 243928 243904 243352 242351 240896 239157 237837 237776 238976 240386 240962 240636
63758 240636 239974 239266 238438 237635 237297 237512 237764 237610 237362 237738 238922 240319 241353 242225 243601 245731 248280
63741 248280 250979 253955 257250 260475 263330 266106 269248 272584 275526 277891 280088 282508 285200 288126
63727 288126 291293 294562 297776 301094 304776 308629 312210 315658 319716 324614 329524 333450 336228 338238
63713 338238 339567 339944 339207 337410 334718 331601 328915 327276 326492 325937 325321 324736 324209 323764 323789 324799 326769
63696 326769 329147 331558 334074 336737 339229 341258 342986 344922 347462 350589 353740 355981 356586 355672 354131
63681 354131 352885 352279 352132 352094 351887 351471 351086 351010 351198 351371 351523 352048 353166 354406 354927 354346 353042 351720
63663 351720 350803 350224 349544 348207 345874 342776 339657 337127 334981 332320 328510 323892 319365 315412 311832
63648 311832 308439 305613 303873 303121 302619 301740 300548 299608 299359 299735 300375 301132 302293 304196 306768 309650
63632 309650 312769 316477 320942 325662 329879 333399 336860 341185 346915 353918 361593 369389 377240 385515
63618 385515 394604 404777 416488 430423 446903 465472 485446 506753 529818 554663 580550 606615
63606 606615 632448 657743 681665 702972 720829 735272 746730 755223 760225 761386 759236 754991
63594 754991 749674 743566 736476 728214 718664 707669 695158 681296 666277 650087 632740 614663
63582 614663 596597 579069 562189 545957 530584 516528 504383 494669 487474 482324 478611 476118
63570 476118 474940 474988 475999 478039 481508 486407 491947 497200 501934 506566 511520 516994 523214 530482 538858
63555 538858 548145 558404 570352 585108 603536 625795 651316 679056 707877 736917 765683 793775
63543 793775 820474 844649 865125 881178 892661 899639 902048 899864 893681 884939 875336 865915 856766
63530 856766 847519 837904 827749 816637 803845 788589 770254 748588 723997 697626 670767 644105
63518 644105 617742 591936 567411 544865 524614 506873 491867 479279 468090 457492 447567 438568
63506 438568 430044 421591 414093 409049 406534 404904 402814 400476 398482 396510 394151 392189 391831 392934
63492 392934 394126 394597 394795 395226 395477 394860 393405 391775 390562 390045 390416 391860 394359 397550 400832 403694
63476 403694 406018 407973 409597 410732 411409 411927 412267 411832 410214 407937 405874 404146 402197 399846 397593
63461 397593 395811 394222 392422 390534 389160 388958 390266 392803 395731 398402 401051 404349 408355 412475
63447 412475 416526 421240 427449 435193 443777 452328 460234 467596 475463 485066 496602 509262 522655
63434 522655 537490 554469 573152 592451 611652 630285 647502 662490 675418 687237 698637
63423 698637 709895 721686 735243 751368 769829 790009 811750 835134 859677 884145 907204
63412 907204 928088 946547 962259 974479 982423 985975 985786 982609 976774 968457 958166 946601 934129
63399 934129 920651 905912 889656 871547 851264 828716 804008 777280 748901 719820 691397
63388 691397 664685 640006 617328 596863 579152 564586 553080 544290 538077 534602 533956 535882 540030
63375 540030 546311 554684 564672 575505 586794 598694 611202 623650 635178 645519 655107 664642
63363 664642 674776 685967 698379 712088 727487 745154 765031 786184 807785 829961 853025
63352 853025 876155 897493 915552 929879 940391 946884 949471 948875 945800 940384 932581 922759 911559
63339 911559 899402 886428 872664 857872 841430 822776 802051 780023 757420 734535 711572
63328 711572 689234 668798 651451 637385 625583 614729 604375 595088 587486 581481 576521 572119
63316 572119 567770 562660 555980 547517 537682 526984 515757 504368 493391 483483 475305 469529 466605
63303 466605 466395 468192 471169 474674 478151 481133 483481 485350 486700 486979 485527 482109 476854 469794 460908
63288 460908 450560 439581 428722 418215 407977 398114 389073 381416 375485 371165 367943 365286 362995
63275 362995 361052 359227 357253 355471 354822 355784 357575 358871 359204 359238 359751 360860 362306 364039 366246 369064
63259 369064 372477 376303 380205 383962 387820 392272 397387 402619 407470 412057 416877 422342 428748 436305
63245 436305 444848 453792 462749 472021 482110 492968 504246 516221 529957 546355 565276 585664
63233 585664 606383 626948 647648 669010 691035 713119 734818 756449 778589 801278 824160
63222 824160 847231 870810 894737 918254 940954 963346 986083 1008901 1030689 1050373 1067447
63211 1067447 1081794 1093310 1101671 1106313 1106673 1102584 1094405 1082709 1068016 1050886 1032117 1012660
63199 1012660 993316 974565 956542 939248 922946 908292 895773 884983 874819 864535 854330
63188 854330 844747 836028 828391 822558 819377 819006 820894 824543 829886 836996 845849 856434 868578 881506
63174 881506 894070 905786 917353 929699 942639 954832 965026 972950 978925 982985 984669 983445
63162 983445 978997 971163 959918 945552 928663 909830 889399 867657 845018 821861 798385 774859
63150 774859 751958 730542 711072 693500 677721 663903 652231 642618 634800 628562 623705 619935
63138 619935 616979 614806 613645 613830 615599 618873 623171 627949 633189 639520 647629 657640 669096 681346
63124 681346 693811 706114 718204 730207 741836 752046 759594 764005 765782 765623 763631 759414 752888
63111 752888 744788 736309 728209 720361 712343 704342 697184 691405 686608 681946 676957 671751 666677 662153
63097 662153 658566 655897 653588 651157 648839 647221 646401 646020 646020 646681 647777 648346 647732 646458 645681 646048 647424
63080 647424 649449 651960 654933 658369 662269 666627 671454 676845 682820 689121 695454 702050 709649 718745
63066 718745 729161 740586 753150 767194 782857 800297 820008 842398 867196 893807 922218
63055 922218 953180 987509 1025506 1066916 1111027 1156875 1203792 1251828 1301354 1352334 1404304
63044 1404304 1456861 1509707 1562336 1614299 1665787 1717362 1769020 1820054 1869934 1918700 1966284
63033 1966284 2012056 2055192 2094809 2129409 2156875 2175668 2185544 2186657 2178456 2160098 2131523 2093429
63021 2093429 2046527 1991627 1930401 1865278 1798476 1731583 1666018 1603254 1544399 1489980 1440279
63010 1440279 1395603 1356248 1322614 1295361 1275022 1261344 1253390 1250354 1251988 1258155 1268373 1281906
62998 1281906 1298041 1316178 1335924 1357160 1379780 1403372 1427410 1451718 1476396 1501310 1525961
62987 1525961 1549754 1572014 1591818 1608258 1620868 1629337 1632945 1630827 1622800 1609244 1590210 1565384
62975 1565384 1535058 1500311 1461986 1420328 1376045 1330795 1285977 1241730 1197909 1155358 1115312
62964 1115312 1077898 1042210 1007709 974783 944042 915806 890191 866983 845410 824686 804772
62953 804772 786038 768254 750642 732924 715601 699132 683510 668814 655406 643294 631954
62942 631954 621139 611333 602987 595815 589232 583119 577652 572734 568083 563725 559966 556943 554572 552903
62928 552903 552203 552566 553548 554261 553947 552566 550725 548887 546846 544245 541351 538732 536227 532975 528643
62913 528643 523984 519828 516186 512747 509695 507354 505485 503622 501832 500451 499312 497969 496645 496074
62899 496074 496249 496055 494591 492297 490318 489094 488081 486752 485369 484609 484645 484856 484501 483653 483256 484149 486149
62882 486149 488330 490049 491342 492351 492863 492698 492186 491869 491888 491956 491845 491545 490970 489875 488225 486420 484991
62865 484991 484143 483668 483172 482333 481076 479678 478628 478246 478426 478833 479302 479926 480821 481976 483312 484672 485698
62848 485698 485942 485286 484198 483485 483783 485200 487185 488723 488948 487881 486390 485208 484216 482942 481559 480800
62832 480800 480927 481317 481284 480879 480621 480788 481350 482391 484151 486646 489479 492075 494020 495340 496616 498669
62816 498669 501833 505567 509041 512053 515163 518907 523206 527602 531864 536188 540905 546164 551871 557879
62802 557879 564227 571149 578764 586914 595437 604518 614499 625341 636687 648661 662288 678716 698127
62789 698127 719839 743574 770268 801397 837691 878800 924171 973928 1028823 1089479 1155839
62778 1155839 1227223 1302715 1381366 1462122 1543726 1624874 1704443 1781345 1853958 1919840 1976324
62767 1976324 2021507 2054543 2075027 2082428 2076293 2056793 2024846 1981878 1929598 1869752 1803665 1732080
62755 1732080 1655747 1576173 1495543 1415863 1338374 1263789 1192754 1125938 1063873 1006802 954537
62744 954537 906475 862020 821156 784435 752282 724397 699828 677497 656714 637458 620193
62733 620193 605174 591936 579783 568769 559690 552962 548005 544044 540993 539118 538250 537979 538356 539682
62719 539682 541679 543629 545503 548321 553059 559659 567448 576141 586055 597669 611431 627856 647277
62706 647277 669455 693827 720246 749223 781258 816215 853532 892940 934700 979230 1026756
62695 1026756 1077341 1130876 1186737 1243480 1299185 1352172 1401278 1445480 1483533 1514141 1536376
62684 1536376 1549732 1553918 1548830 1534719 1512142 1481701 1444001 1399972 1351018 1298652 1244042 1188123
62672 1188123 1132065 1077336 1025031 975309 927769 882429 840047 801364 766309 734275 705065
62661 705065 679143 656802 637407 619741 603042 587513 573770 561911 551210 540827 530793
62650 530793 522041 515215 509638 503905 497520 491469 486897 483619 480401 476467 472214 468508 465785 464024
62636 464024 463224 463542 464971 467028 468864 469778 469750 469361 469038 468530 467375 465787 464657 464535 464997 465334 465693
62619 465693 467120 470419 475161 480043 484151 487763 491895 497162 503257 509514 515697 522031 528647 535483
62605 535483 542848 551683 562827 576184 591070 607435 626324 648811 674764 703139 733407 766096
62593 766096 801684 839407 877698 915605 953215 990693 1027424 1062220 1093847 1121031 1142380
62582 1142380 1156853 1164241 1164882 1159043 1146899 1128966 1106129 1079241 1049020 1016311 982064 946950
62570 946950 911301 875607 840802 807913 777570 749865 724471 700846 678696 658445 640946
62559 640946 626483 614221 602944 592159 582202 573471 566026 559924 555375 552269 549849 547206 544048
62546 544048 540749 537795 535463 533945 533349 533448 533681 533650 533447 533342 533321 533185 532984 533024 533459 534163 535081 536516
62528 536516 538924 542529 547207 552685 558866 566066 574896 585757 598503 612836 628950 647487 668839
62515 668839 692839 719191 747812 778578 811065 844803 879552 915053 950728 985829 1019677
62504 1019677 1051595 1080849 1106892 1129403 1147908 1161795 1171145 1177189 1181456 1184738 1187423 1190606
62492 1190606 1196064 1205069 1217925 1234850 1256783 1284946 1320016 1361961 1410289 1464034 1521711 1581634
62480 1581634 1642377 1702809 1761729 1817389 1867228 1908158 1937551 1954114 1957716 1948456 1926302 1891607
62468 1891607 1845471 1789280 1724219 1651560 1573216 1491747 1409839 1329792 1253141 1180537 1112126
62457 1112126 1048269 989774 937416 891566 852405 820043 794029 773046 755608 741043 729539
62446 729539 721361 716406 714423 715102 717771 721407 725308 729655 735103 741826 749151 756166 762440 767933
62432 767933 772444 775554 777198 777805 777581 776035 772706 768120 763401 758938 754050 748049 741006 733233 724647
62417 724647 715068 704693 693762 682095 669487 656348 643499 631473 620438 610564 601943 594254
62405 594254 587086 580613 575474 571893 569362 567318 565736 564902 564964 565911 567688 570111 572838 575634 578595
62390 578595 581988 585981 590591 595807 601623 608032 614983 622311 629730 637007 644107 651109 658042 664969
62376 664969 672113 679666 687532 695427 703233 711014 718771 726468 734297 742718 752254 763483 777097 793623
62362 793623 813138 835725 862181 893669 930424 971290 1014825 1060337 1107347 1154545 1200035
62351 1200035 1242467 1281237 1315605 1344370 1366686 1382589 1392294 1395403 1391295 1380106 1362856 1340709
62339 1340709 1314565 1285331 1254080 1221680 1188605 1155392 1122983 1092264 1063379 1035967 1010030
62328 1010030 986159 964730 945274 926929 909264 892324 876071 860206 844443 828537 812044
62317 812044 794555 776343 758353 741321 725223 709885 695760 683600 673530 664962 657408 650886
62305 650886 645440 640753 636454 632556 629310 626849 625191 624399 624486 625250 626368 627602 628851 630258 632432
62290 632432 636201 641721 647974 653684 658726 664222 671190 679626 689066 699419 710753 722654 734515
62277 734515 746430 759251 773632 789365 805721 822023 837710 852283 865627 878261 890972
62266 890972 904265 918378 933655 950531 969098 989128 1010767 1034991 1063025 1095302 1131239
62255 1131239 1170089 1211644 1255810 1301604 1346983 1389832 1428888 1463577 1493316 1517373 1535198
62244 1535198 1546388 1550286 1546231 1534483 1516391 1493191 1464949 1431251 1392724 1351178 1308195 1264333
62232 1264333 1220019 1176581 1135737 1098291 1063904 1032028 1002580 975731 951609 930341 911997
62221 911997 896284 882640 870750 860658 852216 844853 838168 832396 827856 824249 820969 818022 816143
62208 816143 816041 817877 821434 826353 832204 838720 846086 854659 864332 874472 884519 894253 903382 911346
62194 911346 917799 922952 927164 930461 932717 934165 935448 937246 939878 943057 946027 948252 950032 952085
62180 952085 954484 956549 957923 959124 960634 962063 962821 963221 964282 966749 970972 977533 987269 1000605
62166 1000605 1017332 1036966 1058876 1082232 1106407 1131320 1156847 1181879 1204535 1223266 1237268
62155 1237268 1245979 1248962 1246436 1239271 1228251 1213728 1195991 1175305 1151581 1124705 1095471 1065547
62143 1065547 1036234 1007858 980614 955261 932460 911959 893021 875412 859564 845998 834887
62132 834887 825861 817988 810206 802035 793649 785257 776908 768915 761803 755498 749283 742908 737185 733012
62118 733012 730425 729048 728830 729687 731030 732399 734093 736335 738212 738316 736252 732744 728452 723528 718189
62103 718189 712822 707358 701280 694432 687223 679910 672239 664008 655498 647122 639074 631521 624866 619627
62089 619627 616198 614674 614757 615982 618223 621780 626695 632369 638292 644861 652946 662923 674634 687906
62075 687906 702383 717151 731473 745864 761583 779028 797483 816415 836023 856291 876569
62064 876569 896639 917311 939274 961869 983593 1003416 1021098 1036664 1050023 1060763 1067852 1069957
62052 1069957 1066580 1058648 1047525 1033660 1016614 996135 972662 946843 919087 889627 858811 827274
62040 827274 795950 765819 737460 710872 685806 662182 640249 620493 603279 588321 574627
62029 574627 561400 548933 538087 528953 520686 512746 505449 498988 492732 486139 479748 474540 470691
62016 470691 467577 464702 461956 459249 456528 454000 451780 449559 447208 445480 445355 446815 448921 451072
62002 451072 453468 456314 459410 462793 467055 472551 478732 484661 489791 493905 496732 498148 498553 498466 497720
61987 497720 495451 491078 485057 478517 472204 465918 458976 451128 442929 435242 428512 422612 417273 412479
61973 412479 408413 405183 402649 400497 398443 396436 394648 393265 392317 391670 391099 390347 389285 388037 386843
61958 386843 385724 384533 383392 382802 383083 383932 384836 385796 387301 389677 392781 396354 400342 404777 409661
61943 409661 415141 421626 429530 438926 449475 460585 471617 482143 492246 502499 513453 524999
61931 524999 536306 546445 555091 562567 569246 575064 579684 582952 584997 585945 585790 584594 582580 579947
61917 579947 576811 573421 570286 568028 567217 568359 571734 577080 583681 590947 598802 607417 616805 626857
61903 626857 637473 648315 658576 667350 674180 679126 682459 684609 686251 688055 690260 692740 695389
61890 695389 698226 701129 703832 706249 708516 710659 712403 713383 713298 711778 708324 702590 694612 684660 672970
61875 672970 659823 645876 632302 620405 610871 603325 596762 590597 585177 581089 578183 575759 573764
61862 573764 573276 575376 579778 585037 590155 595568 602461 611430 622174 634227 647507 661999 677335
61849 677335 693044 709084 725815 743427 761530 779236 795462 809234 820057 828047 833557 836684
61837 836684 837436 836293 834170 831620 828439 824337 819788 815951 813911 814160 816569 820586 825598 831387 838137
61822 838137 845798 853677 860884 867054 872364 876969 880797 883833 886245 888115 889274 889508 888895 887915 887207
61807 887207 886937 886255 883615 877953 869414 858713 846067 831188 814154 795716 776690 757562 738846
61794 738846 721341 705656 691747 679229 668039 658508 650829 644672 639374 634448 629909 626131 623376
61781 623376 621452 619896 618413 617059 615961 615086 614344 613877 614114 615470 618015 621444 625407 629824 634841
61766 634841 640622 647307 655118 664227 674548 685900 698347 712018 726465 740648 753809 766007
61754 766007 777454 787617 795420 800097 801455 799465 794141 785762 774798 761585 746470 730174 713580
61741 713580 697104 680714 664626 649518 635892 623634 612466 602501 594052 587082 581073 575418
61729 575418 569864 564662 560306 557049 554723 553075 552041 551375 550358 548492 546456 545659 546560 547983 548432
61714 548432 547644 546398 545187 543740 541729 539349 536938 534359 531027 526598 521510 516774 513100 510261
61700 510261 507407 503993 500186 496418 492877 489581 486643 484183 482127 480257 478351 476131 473315 469954
61686 469954 466507 463353 460394 457371 454415 451923 450009 448452 447101 445926 444650 442815 440421 438162
61672 438162 436733 436124 435862 435748 436063 437106 438900 441333 444294 447639 451370 455912 461908 469480 477980
61657 477980 486646 495220 503608 511325 517781 523010 527474 531141 533304 533490 531998 529360 525823 521733
61643 521733 517911 515109 513400 512595 513034 515364 519692 525469 532172 539617 547536 555291 562124 567425 570692
61628 570692 571590 570110 566508 561056 554006 545648 536191 525731 514632 503739 493816 484901 476606 468924
61614 468924 462229 456564 451474 446610 441989 437657 433582 429948 426997 424436 421515 417937 414238 411043
61600 411043 408339 405723 403020 400423 398273 396837 396013 395214 393895 392224 390800 389716 388476 386845 385124
61585 385124 383443 381550 379615 378453 378439 378884 379034 379066 379467 380084 380577 381296 382745 384441 385342 385395 385771 387425
61567 387425 390110 393034 395866 398823 402174 405944 409905 413746 417406 421129 424955 428410 431121 433514
61553 433514 436299 439333 441622 442538 442511 442444 442919 444030 445406 446241 445897 444780 444106 444509 445347 445791 446118
61536 446118 447369 449926 452941 455098 455652 454807 453498 452741 452855 453227 452997 451893 450179 447982 445142 441858
61520 441858 439012 437471 437203 437393 437403 437327 437520 437943 438283 438525 438995 439712 440069 439496 438371 437956 439376 442773
61502 442773 447470 452822 458756 465517 473038 480766 488222 495566 503344 511740 520388 528962 537479 545729
61488 545729 552862 558123 561915 565609 570216 575625 581199 586660 592103 597517 602749 607855 613111 618535
61474 618535 623546 627202 628781 628226 626202 623744 621671 620114 618559 616401 613463 609956 605986 601279
61460 601279 595481 588600 581035 573323 566023 559711 554763 551126 548513 546889 546539 547660 550114 553564
61446 553564 557536 561380 564585 567339 570399 574179 578303 582263 586095 589954 593324 595213 595117 593465 591103
61431 591103 588619 586114 583392 580325 577228 574729 573151 572206 571515 571194 571577 572564 573625 574333 574519 574027
61415 574027 572728 570784 568524 566044 563181 559850 556141 552233 548503 545502 543374 541447 538904 535747
61401 535747 532598 529719 526928 524405 522662 521461 519659 516672 513500 511674 511577 512403 513389 514438 515669
61386 515669 517057 518625 520537 522895 525713 529126 533322 538221 543483 548950 554889 561588 568798 575749
61372 575749 581787 586891 591349 595036 597406 598436 599125 600454 602048 602562 601425 599466 597628 595877 593880
61357 593880 592068 591333 592009 593841 596617 600139 603848 607255 610607 614309 617747 619607 619546 618696 618122 617507
61341 617507 615937 613374 610641 608306 606305 604524 603112 602161 601549 601177 600995 600763 600143 599117 598024 597109
61325 597109 596296 595512 594978 595025 595817 597384 599819 603315 608066 614096 621060 628322 635482 642894 651426 661690
61309 661690 673701 687209 701835 716768 730888 743651 755525 767109 778028 787157 793711 797545
61297 797545 798587 796763 792615 787246 781250 774210 765681 756225 746917 738144 729521 720860 712589 705118
61283 705118 698383 692293 687212 683635 681565 680514 680103 680427 681862 684703 688947 694246 699957 705394 710259
61268 710259 714834 719690 725153 731094 737229 743468 749928 756760 764070 771869 779902 787646 794699 801114
61254 801114 807116 812566 817071 820646 823888 827345 831045 834877 839045 843765 848689 853129 856872 860426
61240 860426 864362 868638 872704 876008 878264 879395 879620 879700 880844 884004 889223 895834 903352 911886 921618
61225 921618 932306 943611 955576 968296 981338 994100 1006669 1019661 1033109 1046132 1057897
61214 1057897 1068397 1078043 1087130 1096024 1105276 1115048 1124777 1133844 1142270 1150448 1158640 1167175 1176683 1187594
61200 1187594 1199752 1213052 1228024 1245177 1264025 1283391 1302457 1320927 1338415 1354339 1368322
61189 1368322 1380148 1389471 1396104 1400363 1402552 1402348 1399350 1393921 1386751 1377909 1367257 1355558 1343959
61176 1343959 1332330 1319259 1303992 1287348 1270350 1252997 1234983 1216755 1199049 1181898 1164680
61165 1164680 1146803 1127975 1108332 1088696 1070206 1053319 1037613 1022764 1009044 996570 984940
61154 984940 974165 965088 958132 952345 946545 940840 936046 932062 927837 922676 916545 909217 900122 889169
61140 889169 876963 864165 851369 839526 829548 821250 813572 806272 800699 798338 799037 801217 803583
61127 803583 806191 809987 815705 823278 832120 841879 852787 865242 879188 894167 909864 926286 943418
61114 943418 961101 979245 997841 1016639 1035129 1052975 1070165 1086582 1101665 1114772 1125710
61103 1125710 1134661 1141577 1145824 1146481 1142963 1135379 1124328 1110447 1094239 1076229 1056931 1036523 1014842
61090 1014842 992030 968980 946711 925397 904449 883632 863673 845491 829221 814348 800623
61079 800623 788340 777669 768113 758937 749973 741673 734429 728195 722845 718526 715377 713176 711633 710832
61065 710832 710935 711592 712170 712619 713587 715538 718267 721495 725438 730434 736388 742984 750155 758078 766978
61050 766978 777285 789608 804135 820230 836991 853990 871248 888884 907252 927007 948377
61039 948377 970509 992153 1012972 1033661 1054920 1076916 1099756 1123825 1149412 1176493 1205054
61028 1205054 1235217 1266867 1299560 1333081 1367841 1404516 1443513 1484883 1528571 1574724 1624017
61017 1624017 1677741 1737289 1803567 1877235 1959599 2052887 2159583 2281994 2422887 2586480
61007 2586480 2778849 3008116 3285243 3625278 4048058 4577753 5241111 6063862 7064523
60998 7064523 8246239 9590412 11057892 12600366 14175933 15756197 17317248 18822256
60990 18822256 20213585 21424256 22399582 23111283 23557419 23756918 23747288 23580613 23307247
60981 23307247 22949767 22486276 21859659 21008480 19898671 18538915 16978201 15293328 13572831
60972 13572831 11900853 10344611 8948446 7733771 6702055 5839636 5124541 4533429
60964 4533429 4045425 3642210 3307202 3026067 2787731 2584233 2409570 2258705 2127280
60955 2127280 2011741 1909531 1819005 1738854 1667566 1603603 1545983 1494299 1448013 1405976 1366693
60944 1366693 1328849 1291544 1254340 1217180 1180160 1143378 1107126 1072072 1038925 1007942 978958
60933 978958 951786 926298 902235 879380 857824 837748 819040 801518 785403 771097 758534
60922 758534 747257 737085 728127 720157 712582 705156 698156 691782 685948 680843 676996 674496 672695 671012
60908 671012 669523 668476 667774 667357 667502 668245 668931 668896 668318 667789 667323 666289 664234 661252 657561 653090 647604
60891 647604 641089 634056 627499 622222 618053 613972 609252 604170 599413 595180 591229 587443 583844 580224
60877 580224 576230 571821 567317 563043 559156 555701 552607 549708 546947 544437 542265 540443 539157 538653
60863 538653 538712 538610 537893 536819 535742 534596 533432 532955 533756 535216 535878 534950 532946 530901 529445 528618
60847 528618 528110 527605 527207 527404 528224 528637 527354 524206 520214 516318 512572 508671 504631 500724 497065 493489
60831 493489 489603 485014 479823 474838 470845 467781 465134 463053 462289 462891 463784 464011 463800 463924 464580 465378
60815 465378 465961 466026 465118 463071 460502 458212 456221 453914 451115 448404 446304 444707 443290 442096 441340
60800 441340 440865 440124 438715 436807 435022 433838 433109 432251 430969 429592 428519 427582 426350 424951 424088 424105
60784 424105 424425 424177 423092 421553 419973 418483 417145 416140 415662 415714 416014 416109 415737 415234 415359 416486 418089
60767 418089 419378 420346 421759 424029 426562 428475 429703 431020 433102 435845 438589 440757 442288 443645
60753 443645 445391 447609 449799 451508 452937 454669 456841 458980 460744 462490 464796 467580 469974 471053
60739 471053 470515 468640 465809 462222 458024 453509 449005 444571 440032 435418 431186 427763 424968 422191
60725 422191 419177 416400 414550 413832 413764 413474 412190 409819 407244 405722 405656 406049 405439 403330 400499 398004
60709 398004 396221 394884 393778 393070 392980 393303 393471 393107 392397 391847 391810 392436 393874 396096 398421 399679 399211
60692 399211 397560 395904 394997 394895 395512 396949 399244 402159 405379 408686 411787 414213 415686 416576 417845
60677 417845 420436 424621 429831 435077 439664 443555 447048 450151 452440 453551 453581 452848 451388 448953 445497
60662 445497 441478 437640 434645 432881 432295 432268 431952 431030 430084 429980 431041 433037 435734 438933 442059 444320
60646 444320 445513 446249 447148 448228 449246 450087 450448 449636 447285 443959 440571 437472 434632 432337 430998
60631 430998 430432 430049 429703 429677 429903 429961 429924 430430 431674 433020 433858 434281 434644 435046 435535 436238 436979 437302 437188
60612 437188 437236 437854 438828 439984 441559 443505 445118 445890 446118 446116 445510 444050 442471 441676 441532 441400 441457 442486
60594 442486 444551 446906 449130 451383 453551 455174 456400 458045 460370 462647 464296 465678 467263 468737
60580 468737 469545 469866 470401 471483 472958 474773 477192 480464 484618 489600 495389 501934 509070 516508 523990
60565 523990 531585 539701 548540 557497 565481 571918 577142 581652 585277 587310 587292 585466 582569 579305 576026
60550 576026 572860 570117 568425 568261 569490 571585 574275 577773 582488 588771 596814 606448 617194 628860
60536 628860 641986 657232 674436 692765 711728 731408 751603 771391 789763 806030 819347
60525 819347 828486 832700 832409 828502 821288 810649 796993 781429 765089 748802 733373 719570 707567
60512 707567 696839 686963 678411 672263 669217 669070 671211 675416 681989 691292 703527 719056 738559
60499 738559 762393 789902 819811 851383 884892 920778 958614 997074 1034750 1070849 1105200
60488 1105200 1137763 1168148 1195625 1219611 1240013 1256852 1269688 1277633 1279897 1276055 1265861 1249162
60476 1249162 1226028 1196680 1161293 1120213 1074451 1025623 975462 925676 878129 834418 794946
60465 794946 758890 725495 695106 668646 646399 627675 611448 596957 583830 571888 560870
60454 560870 550371 540242 531002 523389 517352 511977 506643 501757 497942 494992 492245 489628 487633 486361
60440 486361 485256 483877 482385 481093 480001 479025 478331 478143 478347 478486 478131 477187 475933 474771 473858 472968
60424 472968 471878 470828 470469 471244 472944 474915 476654 478093 479421 480759 482144 483729 485824 488613 491935
60409 491935 495440 498844 501915 504395 506212 507658 509101 510589 511966 513275 514672 516030 517147 518362
60395 518362 520459 523752 527686 531549 535155 538599 541808 544741 547691 550934 554222 557000 559021 560538
60381 560538 561998 563772 565937 568134 569831 570897 571692 572447 572923 572974 573083 573965 575813 578247 580770 582960
60365 582960 584565 585796 587343 589727 592814 596283 600218 604780 609615 614159 618394 622763 627462 632282
60351 632282 637023 641511 645299 647896 649270 649590 648597 645894 641959 638167 635470 633479 631084 627603 623166
60336 623166 618358 613738 609506 605468 601521 598056 595535 593698 591692 589068 586192 583580 581334 579425
60322 579425 578018 577214 576906 577240 578788 581863 585961 590271 594546 599116 604297 610125 616491 623169 629821
60307 629821 636325 642989 650158 657663 664974 671818 678376 684832 690976 696272 700147 702210 702338 700590
60293 700590 697030 691712 684909 677190 669155 661269 653991 647721 642362 637204 631694 626197 621596 618192
60279 618192 615386 612452 609140 605431 601180 596364 591360 586578 581965 577241 572499 568216 564672 561689
60265 561689 559039 556808 555214 554266 553757 553427 553087 552791 553009 554299 556614 559165 561283 563186 565528 568442
60249 568442 571471 574297 576911 579089 580388 580870 581184 581588 581454 580194 578193 576275 574666 573100 571647
60234 571647 570711 570418 570710 571993 574820 578826 582744 585845 588776 592627 597691 603630 610334 617949 626251
60219 626251 634694 643223 652598 663623 676208 689416 702408 715175 728212 741579 754601 766676
60207 766676 778100 789686 801693 813596 824940 835903 846780 857316 866938 875384 882753 889094
60195 889094 894254 898071 900376 900824 898998 894872 889024 882318 875318 867994 860005 851238 842028 832789
60181 832789 823620 814465 805530 797258 789887 783344 777570 772624 768422 764706 761383 758586 756268 754059
60167 754059 751739 749463 747265 744730 741503 737900 734604 731930 729753 727963 726574 725422 724220 722971
60153 722971 722038 721760 722202 723287 724867 726612 728080 729051 729713 730463 731564 732996 734580 736363 738886 742877
60137 742877 748511 755180 762185 769456 777330 785843 794602 803145 811034 817737 823004 827404 832010 837346
60123 837346 842983 848296 853229 858126 863206 868542 874362 880985 888423 896245 903785 910436 915842 919949
60109 919949 922867 924706 925646 926009 925976 925203 923056 919351 914645 909661 904724 899850 895081 890509 886227
60094 886227 882463 879491 877174 874802 871733 868004 864029 859914 855419 850409 844929 839008 832838 827065
60080 827065 822353 818600 815053 811258 807390 803466 798785 792635 785224 777427 769765 762118 754362 746815
60066 746815 739864 733509 727511 721813 716510 711464 706309 701034 696388 693390 692356 692586 693074 693319 693384
60051 693384 693572 694367 696380 699783 703827 707431 710409 713723 718423 724718 732199 740410 748854 756815 763691
60036 763691 769356 773949 777472 779826 780902 780351 777590 772448 765534 757566 748676 738848 728675 718940
60022 718940 709639 700179 690452 680935 671767 662663 653948 646681 641238 636556 631399 625767 620426 615682
60008 615682 611460 608099 606041 604838 603381 601217 598919 597074 595674 594730 594730 596026 598204 600526 602706
59993 602706 604923 607381 610262 613863 618312 623267 628267 633346 638939 645136 651315 656606 660475 662793
59979 662793 663644 663294 662159 660516 658228 654926 650516 645419 640303 635695 631815 628667 626221 624571 623878
59964 623878 624042 624554 625022 625869 628098 632073 636848 641109 644564 647918 651624 655281 658321 660668 662427
59949 662427 663461 663774 663975 664828 666366 667887 668903 669787 671375 674030 677223 680080 682360 684775 688178
59934 688178 692503 696809 700313 703001 705174 706875 708088 709036 709878 710362 710205 709646 709213 709085 709089 709272 710112
59917 710112 712148 715674 720736 727097 734154 741125 747432 752805 757149 760495 763041 764996 766391 767081
59903 767081 766819 765273 762225 757963 753245 748658 744242 739933 736062 733088 731095 729912 729503 729887 730933
59888 730933 732594 735118 738625 742729 747013 751600 756751 762239 767742 773589 780322 787616 794408 800100
59874 800100 804854 808649 810947 811619 811509 811611 812087 812334 811608 809421 805866 801827 798411 795890 793579 790895
59858 790895 788125 785968 784775 784519 785034 786090 787585 789769 792808 796120 798761 800654 802707 805491 808606
59843 808606 811748 815501 820359 825630 830173 833755 836937 840029 842958 845848 848863 851600 853430 854377
59829 854377 854892 854744 852931 848980 843755 838677 834512 831169 828417 826526 826265 828346 832856 839266 846972
59814 846972 855579 864632 873483 881718 889371 896418 902366 906680 909295 910344 909788 907808 905249 903015
59800 903015 901189 899191 896576 893195 888866 883608 877960 872362 866300 858875 850211 841477 833351 825268
59786 825268 816495 807260 798448 790648 783852 777654 771445 764829 758181 752484 748397 745824 744529 744632
59772 744632 746159 748654 751742 755761 761270 768099 775358 782337 789028 795814 803004 810739 819163 828522
59758 828522 839051 850666 862764 874633 886127 897706 909705 921829 933559 944691 955115
59747 955115 964262 971256 975668 977891 978704 978592 977444 974801 970417 964681 958438 952298 946161 939527 932143
59732 932143 924311 916691 909973 904524 900151 896263 892475 888968 886105 883779 881464 878879 876334 874298
59718 874298 872902 872029 871748 872315 873758 875711 877912 880734 885047 891471 899875 909595 919966 930647
59704 930647 941707 953580 966786 981466 997259 1013806 1031154 1049355 1067728 1084929 1099932
59693 1099932 1112695 1123802 1133694 1142357 1149563 1155163 1159224 1161937 1163358 1163280 1161547 1158472 1154657 1150302
59679 1150302 1144972 1138211 1130155 1121309 1111992 1102323 1092623 1083454 1075265 1068234 1062489 1058212 1055492 1054309
59665 1054309 1054691 1056697 1060192 1064875 1070698 1078013 1087161 1098037 1110276 1123671 1138151 1153388 1168721
59652 1168721 1183470 1197074 1208805 1217706 1223071 1224866 1223482 1219176 1211876 1201371 1187440 1169998
59640 1169998 1149555 1127477 1105369 1083990 1063040 1042109 1021534 1002166 984617 968907 954593
59629 954593 940926 927196 913246 899487 886141 872724 858636 844039 829638 815700 801915
59618 801915 788318 775726 764888 755621 747231 739582 733268 728772 725907 724192 723464 723830 725136 726814
59604 726814 728378 729923 731963 734796 738157 741408 743899 745212 745354 744896 744670 745116 745997 746850 747517 748089
59588 748089 748519 748542 747842 746106 743153 739280 735282 731772 728616 725382 722116 719133 716153 712363 707480
59573 707480 702214 697403 693273 689855 687468 686136 684941 682810 679890 677457 676306 675869 675224 674409 674219
59558 674219 674984 676242 677610 679365 681822 684506 686456 687336 687881 689128 691541 695007 699440 705071 712251
59543 712251 721259 732296 745429 760396 776556 793098 809345 824931 839756 853624 865873 875467
59531 875467 881648 884455 884518 882496 878925 874429 869702 865196 861048 857337 854131 851212 848032 844102 839288
59516 839288 833639 827149 819866 812043 803927 795495 786607 777391 768270 759566 751299 743417 736102 729704
59502 729704 724446 720315 717178 714892 713357 712607 712919 714631 717738 721807 726420 731592 737512 743989 750397
59487 750397 756185 761253 765876 770520 775674 781572 787957 794359 800596 806764 812756 818227 823099 827620
59473 827620 831786 835163 837584 839544 841523 843320 844476 844981 845030 844446 842998 841189 840076 840318 841853
59458 841853 844529 848498 853911 860604 868246 876460 884726 892441 899178 904743 909132 912640 915898 919367
59444 919367 922799 925392 926425 925564 922856 918808 914249 909665 904898 899966 895826 893630 893353 893922 894675
59429 894675 895918 898026 900908 904676 910033 917445 926422 936120 946385 957847 971267 986992 1004730
59416 1004730 1023578 1042505 1060962 1078903 1096246 1112615 1127452 1139874 1148514 1152240 1151189 1146547
59404 1146547 1139406 1130554 1121318 1113422 1107468 1102523 1097805 1093919 1091556 1089628 1085667 1077821 1065843 1050589
59390 1050589 1033388 1015683 998516 982330 967590 955244 946061 939893 936187 934829 935766 938194 941069
59377 941069 944297 948621 954321 960744 967096 972979 978125 982303 985647 988475 990700 991946 992321 992543 993207
59362 993207 994395 995940 997497 998428 998377 998102 999054 1001999 1006653 1012748 1020555 1030043 1040410 1051079 1062488
59347 1062488 1075156 1088458 1101136 1112798 1124183 1135969 1147856 1158822 1167858 1174425 1178575 1180715
59335 1180715 1181048 1179259 1174894 1167884 1158560 1147372 1134921 1121976 1109019 1095886 1082262 1068393
59323 1068393 1054811 1041564 1028368 1015541 1004013 994083 984871 975519 966377 958309 951172 943798 935476
59310 935476 926714 918385 910681 903176 895470 887551 879982 874071 871486 873195 878819 887108 896828 907089
59296 907089 917350 927556 937896 947912 956055 960663 961295 958693 953713 946928 939132 931448 924717
59283 924717 919289 915551 914132 915421 919333 925682 934288 944582 955717 967359 979906 993649 1008163
59270 1008163 1022728 1036801 1049828 1061229 1071026 1079900 1088033 1094413 1097883 1098490 1097093 1094000 1088826
59257 1088826 1081515 1072606 1062428 1050841 1037997 1024718 1011765 999195 986803 974887 964161 954998
59245 954998 947053 939650 932438 925616 919611 914615 910533 907313 905031 903583 902496 901206 899330 896644
59231 896644 893139 889254 885638 882345 878602 873772 868222 862744 857329 851093 843425 834732 825988 817976
59217 817976 811009 805004 799630 794524 789490 784422 779210 773937 768999 764646 760516 755982 750970 746085
59203 746085 741895 738381 735200 732192 729508 727451 726311 726210 726996 728399 730366 733197 737279 742644 748762
59188 748762 754865 760567 766065 771596 776883 781456 785349 788926 792032 793983 794564 794380 793903 792854 790996
59173 790996 788863 787030 785198 782733 779750 776906 774460 772329 770790 770191 770077 769511 768362 767422 767071
59158 767071 766557 764904 761979 758310 754399 750503 746789 743337 740109 736986 733755 730220 726508 723013
59144 723013 719675 715710 710618 705097 700260 696162 691986 687490 683193 679137 674656 669849 666175 664852
59130 664852 665424 666693 668440 671363 675727 681041 687008 694018 702484 712197 722552 733147 743950 754998
59116 754998 766076 776755 786749 796112 804982 813262 820809 827802 834569 841021 846653 851156 854710 857584
59102 857584 859686 860616 859980 857703 854299 850713 847552 844593 841363 838030 835155 832773 830396 827956 825968
59087 825968 824625 823466 822177 821000 819946 818201 814882 809974 804122 797837 791325 784772 778452 772746
59073 772746 768184 765079 762891 760464 757232 753809 750987 748598 745806 742221 738255 734537 731330 728361
59059 728361 724988 720776 716141 712128 709334 707393 705683 704054 702487 700658 698483 696759 696529 697858
59045 697858 699781 701411 702620 703606 704336 704638 704632 704837 705813 707635 709718 711355 712470 713656 715403 717671
59029 717671 720391 723981 729028 735711 743864 753398 764281 776196 788510 800567 811852 822007 830828
59016 830828 838153 843644 846828 847463 845718 842030 836999 831398 825851 820437 815026 810055 806467 804747
59002 804747 804537 805426 807518 810884 815043 819405 823744 827849 831283 833995 836597 839385 841602 842366 841962
58987 841962 841447 841296 841310 841608 842819 845265 848797 853498 859760 867519 876197 885726 896987 910827 927013
58972 927013 944493 962273 979747 996470 1012053 1026175 1038483 1048608 1056384 1061911 1065230 1066055
58960 1066055 1063969 1058887 1051283 1041990 1031704 1020545 1008202 994610 980295 965781 950888 935094
58948 935094 918609 902594 888097 875117 863069 851892 842181 834216 827347 820689 814229 808844 805270
58935 805270 803435 802925 803605 805390 807772 810187 812752 815972 819662 822743 824364 824722 824542 824229 823879 823590
58919 823590 823285 822553 821268 820177 820359 822140 824925 828102 831765 836576 843155 851644 861629 872519 884062
58904 884062 896404 909608 923359 937295 951302 965305 979094 992611 1006083 1019539 1032555
58893 1032555 1044931 1057351 1070811 1085520 1100856 1116371 1132295 1148995 1166384 1184044 1201573
58882 1201573 1218556 1234386 1248360 1260046 1269540 1277272 1283454 1287748 1289767 1289906 1289226 1288186 1285853
58869 1285853 1280862 1273035 1263603 1253815 1243699 1232353 1219214 1204805 1190278 1176325 1162653 1148486
58857 1148486 1133374 1117368 1100698 1083772 1067418 1052521 1039123 1026286 1013092 999549 986273
58846 986273 973619 961366 948959 935822 921707 907060 892846 879769 867769 856340 845059
58835 845059 833744 822516 811945 802764 795236 789075 784059 780272 777649 775873 774958 775369 777192 779755
58821 779755 782473 785521 789273 793673 798666 804616 811586 818635 824513 828796 831775 833678 834637 835026 835056
58806 835056 834231 831885 828086 823469 818408 812982 807504 802309 797179 791666 785921 780630 776213 772645
58792 772645 769903 768028 766888 766528 767570 770611 775270 780547 786136 792726 800959 810656 821204 832218
58778 832218 843642 855515 867648 879307 889328 896814 901549 903522 902476 898335 891667 883092 872617
58765 872617 860172 846426 832383 818488 804901 792304 781457 772061 763037 754027 745853 739401
58753 739401 734745 731435 728901 726418 723390 719978 717058 715455 715487 717058 719684 722582 725311 728228 731889
58738 731889 736319 741388 747352 754166 760712 765826 769909 774404 779778 785198 790185 795243 800591 805561
58724 805561 809859 814384 820193 827471 835970 845625 856118 866640 876748 886859 897280 907313 915973
58711 915973 923086 928981 933416 935467 934351 929921 922438 912248 899651 884826 867878 848953 828300
58698 828300 806358 783941 762134 741663 722556 704739 688616 674559 662222 651107 641546 634224
58686 634224 628837 624137 619351 614740 610713 607291 604602 602961 602148 601377 600291 599315 598851 598845 599354 600745
58670 600745 603022 605756 609000 613531 619776 627173 634972 643003 651191 658915 665257 669441 670772 668741
58656 668741 663617 656526 648613 640405 632011 623420 614527 605479 597016 589873 583832 578127 572738 568375
58642 568375 565131 562230 559403 557421 556770 556729 556374 555772 555576 556079 557179 558676 560166 561121 561466 561580 561565
58625 561565 561137 560384 559837 559610 559312 559010 559326 560296 561209 561991 563700 567048 571422 575996 580845 586221 591661
58608 591661 596649 601446 606473 611499 616100 620315 624177 627247 629205 630316 630821 630569 629777 629332 629772
58593 629772 630688 631765 633575 636761 641278 647086 654658 664014 674139 684178 694349 704928 715310
58580 715310 725089 735125 746413 758575 770470 781558 791662 800364 808000 816594 828359 843643
58568 843643 861510 881759 904970 931048 959312 989826 1023016 1057778 1091371 1121601 1148122
58557 1148122 1171293 1190829 1206039 1216608 1222607 1224175 1221571 1215400 1206694 1196856 1187212 1178242 1169398
58544 1169398 1159961 1149711 1138455 1125403 1109586 1090545 1068187 1042465 1013813 983523 953071
58533 953071 923355 895007 868822 845234 823836 804129 786421 771379 759040 748863 740323 732951
58521 732951 726203 719904 714405 709853 705766 701743 697911 694263 690420 686716 684521 684620 686011 687238 688151
58506 688151 689342 690621 691274 691342 691504 692051 692901 694174 695837 697272 698128 699130 701145 704070 707644 712613
58490 712613 719860 728937 738745 749295 761604 776155 792616 810705 830188 850362 870651 891380
58478 891380 912810 933778 952429 967992 980697 990341 996143 997675 994770 986978 974538 959609
58466 959609 945037 931964 919849 908701 899892 894751 893629 896452 903017 912584 924153 937252 951710
58453 951710 966814 981461 994779 1005737 1012749 1014843 1012721 1007419 998441 984629 966510 946255
58441 946255 925618 905366 886417 869840 855690 843399 833300 826319 822213 819714 818527 819642
58429 819642 823458 829104 835916 844198 854099 864824 875290 884615 891916 896684 899305 900177 898487 893049
58415 893049 884154 873323 861538 849086 836774 825594 815299 805009 795205 787426 781952 777521
58403 777521 773489 770467 768620 767178 766116 766628 769363 773573 778358 783356 787958 791479 794480 798387
58389 798387 803408 808333 812685 817369 822725 827670 831402 834408 837111 839043 840111 841333 843589 846800
58375 846800 850825 855931 861953 868232 874871 882806 892296 902635 913539 925451 938219 951040 963942
58362 963942 977773 992455 1006844 1020537 1033982 1046486 1056157 1062439 1066799 1070186 1071730 1070803 1068589
58349 1068589 1066589 1065158 1064359 1064673 1066054 1067881 1070625 1075912 1084047 1093229 1102224 1112183 1124654 1139307
58335 1139307 1154850 1170923 1187852 1205540 1223451 1240842 1256454 1269127 1279194 1288033 1295879 1301481
58323 1301481 1304245 1305110 1304953 1303849 1302329 1301557 1301702 1301947 1302627 1305461 1311131 1318555 1327026 1337001 1348218
58308 1348218 1359346 1370243 1382290 1395751 1409101 1421769 1435012 1449147 1462561 1474678 1487226
58297 1487226 1501201 1515189 1528299 1542192 1558374 1575854 1593328 1611421 1630864 1650581 1669630
58286 1669630 1689100 1710188 1732201 1754280 1777275 1802147 1828283 1855090 1883535 1914588 1947941
58275 1947941 1983625 2022824 2065585 2109864 2154440 2200666 2249784 2300719 2352121 2404371 2457981
58264 2457981 2512300 2567281 2624083 2682437 2740125 2796513 2853690 2912414 2970226 3025560 3080424
58253 3080424 3136740 3193478 3250040 3309208 3373729 3442935 3515616 3593269 3677527 3767224 3861107
58242 3861107 3960769 4068004 4182057 4302204 4430144 4567060 4711443 4862633 5023197 5195092
58232 5195092 5377189 5569473 5775602 5998071 6235179 6486460 6756674 7050424 7367413
58223 7367413 7707374 8075049 8475594 8909796 9378936 9889711 10449198 11059921 11725608
58214 11725608 12457020 13266418 14161688 15152421 16256678 17495694 18888313 20458656 22244341
58205 22244341 24291057 26647784 29378993 32578967 36370565 40905254 46386230 53099391
58197 53099391 61427595 71855101 84965595 101387726 121642042 145923478 173918267
58190 173918267 204747318 237096781 269532502 300835032 330060222 356202228 377769862
58183 377769862 392785773 399352718 396382233 383979476 363360118 336509245 305774969
58176 305774969 273459389 241479091 211202342 183469244 158685810 136917993 118003398
58169 118003398 101682978 87690414 75767351 65654436 57104311 49896599 43829412
58162 43829412 38710495 34370763 30677253 27522454 24810095 22459983 20415438 18633067
58154 18633067 17070087 15688656 14464038 13378182 12410018 11539306 10754091 10046297 9404507
58145 9404507 8817887 8282470 7796665 7354498 6949135 6578644 6242060 5933661 5647122
58136 5647122 5381627 5138070 4912525 4699158 4496602 4306122 4126247 3954382 3791159
58127 3791159 3638281 3494332 3357225 3228310 3109594 2999239 2894175 2794859 2703054 2617127
58117 2617127 2534060 2454258 2379985 2310598 2243491 2178379 2116699 2057975 2000524 1944689 1891876
58106 1891876 1841397 1791493 1742507 1696011 1651850 1608843 1567300 1528108 1490600 1453971 1419551
58095 1419551 1388991 1361471 1335276 1310744 1289050 1269545 1251046 1234319 1220447 1207959 1194425
58084 1194425 1179849 1165852 1152564 1138866 1124584 1109894 1093751 1075450 1056649 1039281 1022660
58073 1022660 1005228 987869 972567 958912 944896 930392 916931 904686 892558 880743 870408
58062 870408 861123 851212 840398 829730 819197 807779 795504 783146 770263 755967 741405 729049
58050 729049 719481 710969 702186 693355 684870 676799 669635 663652 657601 649926 641112 633067 626386 620010
58036 620010 613390 607105 601364 595575 589380 582714 575179 566797 558908 552702 547371 541342 534745 528839
58022 528839 523579 517801 511422 505433 499936 494258 488837 484962 482586 480260 477314 474378 471736 468934
58008 468934 466082 463864 462210 460532 459196 459078 459683 459452 457945 456050 454007 450990 446836 442561 438941
57993 438941 436069 434375 434430 435613 436583 437309 439106 442500 446595 450739 455190 459828 463826 467064 470451
57978 470451 474400 478312 481944 486000 490914 496300 501968 508339 515450 522582 529146 534928 539339 541554
57964 541554 541618 540364 538132 534591 529769 524057 517205 508688 499114 489934 481601 473365 464988 457225 450388
57949 450388 443940 437955 433543 431292 430514 430552 431672 434180 437810 442553 448973 457159 466279 475711 485676
57934 485676 496277 506754 516176 524142 530514 535184 538264 539735 538820 534661 527662 519189 509862 499304
57920 499304 487694 476256 465791 455906 446235 437407 430268 424975 421312 419133 418081 417590 417455 417773
57906 417773 418265 418413 418208 417869 416826 414098 409726 404713 399487 393638 387334 381677 377298 373833 371113
57891 371113 369611 369270 369109 368557 368092 368092 368126 367927 367924 368247 368198 367317 366019 364641 362842 360438 357870 355330
57873 355330 352475 349576 347845 347909 348890 349743 350605 352152 354517 357567 361419 365920 370329 374283 378466
57858 378466 383735 390151 397381 405330 413801 422147 429794 436589 442353 446802 450186 453142 455654 457071
57844 457071 457433 457669 458083 457848 456671 455700 455875 456433 456065 454768 453609 453349 454130 455874 458158 460272 462075
57827 462075 464179 466668 468451 468566 467361 465681 463753 461648 459934 458861 457680 455733 453502 451585
57813 451585 449339 445657 440564 434977 429408 423941 419007 414986 411337 407232 402884 399305 396907 395272
57799 395272 394186 393980 394864 396701 399427 403100 407549 412520 417998 423898 429695 434864 439433 443601 447170
57784 447170 449934 452285 454824 457685 460829 464625 469410 474710 479494 483033 485052 485400 484191 481954
57770 481954 479039 475043 469341 461917 453263 443821 434032 424541 415801 407706 399990 392601 385377 378022
57756 378022 370882 365103 361330 358831 356552 354369 352637 351202 349831 349024 349363 350458 351487 352391 353601
57741 353601 354946 355872 356429 357056 357640 357820 357908 358484 359297 359731 360247 362083 365383 368757 371018 372453 374007
57724 374007 376062 378402 380706 382691 384261 385774 387750 390208 392675 394867 396870 398708 400255 401635
57710 401635 403195 405036 406971 408871 410593 411731 411984 411680 411458 411514 411688 412046 412753 413485 413616 412962 411777
57693 411777 410115 407817 405031 402106 399019 395474 391506 387412 383253 379065 375457 373313 372931 374096
57679 374096 376910 381906 389503 400084 414587 434239 459616 490560 526895 568473 614423 663012
57667 663012 712248 760065 804066 841830 871374 890643 896956 888244 865100 830803 789241 743619
57655 743619 697000 652539 612400 577151 546670 520894 499429 481399 466313 454405 445596 438771
57643 438771 432628 426707 421083 415656 410317 405278 400682 396198 391479 386622 381793 376816 371585 366511
57629 366511 362060 358093 354056 349612 344871 340217 336161 333025 330563 328185 325694 323430 321528 319488
57615 319488 316737 313214 309230 305185 301632 299073 297422 296075 294716 293487 292214 290240 287491 285029
57601 285029 283879 283789 283798 283516 283102 282354 280786 278577 276635 275458 274471 272766 270184 267472 265546 264796 265003
57584 265003 265789 267012 268656 270480 272078 273249 273988 274038 272859 270217 266474 262139 257555 253215 249869
57569 249869 247805 246355 244613 242418 240173 237899 235162 231945 228940 226681 224805 222581 219963 217768
57555 217768 216826 217282 218750 220763 222810 224219 224545 224163 224072 224885 226305 227763 229218 231009 233200 235451
57539 235451 237386 238710 239148 238645 237541 236254 234967 233853 233280 233342 233481 233051 232004 230524 228468 225920
57523 225920 223962 223888 225670 228091 230371 232691 235090 236992 238222 239459 241138 242788 244040 245455 247599
57508 247599 249927 251404 251798 251707 251626 251602 251487 251004 249848 248221 246871 246153 245451 244095 242454 241431 241196
57491 241196 241112 240794 240468 240291 239951 239088 237795 236571 235978 236173 236553 236102 234441 232332 230780 229893 229036
57474 229036 227825 226341 224477 221787 218155 214217 210817 208249 206172 204147 202193 200796 200328 200497 200598
57459 200598 200341 200064 200004 199828 199240 198639 198698 199561 200916 202601 204506 206032 206325 205301 203987 203586 204405
57442 204405 205811 207036 207858 208567 209420 210249 210757 211153 212149 214190 216915 219631 222066 224426 226882 229313
57426 229313 231440 232961 233637 233468 232696 231533 230009 228251 226697 225802 225657 226039 226704 227531 228584 230137
57410 230137 232408 235118 237622 239591 241271 242872 244104 244519 243938 242270 239396 235660 232150 229942 229199
57395 229199 229337 229800 230352 230962 231863 233433 235508 237085 237339 236764 236728 237944 239978 242222 244694 247616
57379 247616 250729 253414 255332 256735 258128 259648 260719 260463 258588 255787 253114 251106 249639 248402
57365 248402 247269 246328 245734 245423 244918 243796 242410 241703 242049 242755 243076 243222 243873 245136 246620 248172 249857
57348 249857 251409 252373 252732 252871 253041 253334 253959 254883 255416 254869 253603 252708 252597 252570 251866 250520 249045 247923
57330 247923 247561 248175 249428 250631 251550 252567 253871 254989 255421 255325 255161 254992 254517 253718 253121 253350 254479
57313 254479 255920 256954 257391 257576 257808 258073 258406 259057 259994 260746 261181 261990 263799 266150 268040 269147 269842
57296 269842 270342 270806 272023 274849 278786 282161 284042 285040 285961 286702 287055 287673 289314 291699 293948 295813
57280 295813 297710 299779 301635 302991 303904 304418 304426 303960 303252 302446 301522 300576 299971 300166 301398 303475 305862
57263 305862 308063 309931 311515 312709 313362 313683 314161 315024 316160 317569 319368 321170 322093 321823 321296 321883
57247 321883 324140 327715 332092 336898 341652 345842 349372 352554 355608 358469 361126 363833 366868 370297
57233 370297 374017 377812 381231 383683 384955 385599 386543 388188 390019 391187 391396 391063 390863 391387 393142 396314
57217 396314 400324 403982 406436 407807 408783 409861 411183 412681 413984 414528 414239 413882 414274 415346 416457
57202 416457 417364 418314 419307 419985 420372 421252 423674 428286 435005 443000 451203 459332 468226 478715 490381
57187 490381 502019 512972 523259 532699 541011 548802 557460 567790 579588 592784 608069 626036
57175 626036 646500 669145 694151 721616 750957 781449 812968 845832 880271 916333 953895
57164 953895 992548 1031870 1071874 1112599 1153224 1192397 1229693 1265993 1302128 1337938 1372946
57153 1372946 1406967 1439511 1469469 1496161 1520001 1541536 1560542 1576839 1591278 1605051 1618510
57142 1618510 1631478 1644314 1657840 1672535 1688447 1705573 1723688 1742139 1760378 1778376 1796076
57131 1796076 1813045 1829304 1845864 1863648 1882284 1900698 1918314 1934845 1949362 1960508 1967409
57120 1967409 1969902 1968716 1966867 1970733 1988523 2027170 2090674 2180294 2294884 2431330 2586682
57109 2586682 2761451 2961221 3194952 3470930 3792587 4156882 4557438 4991141 5463129
57100 5463129 5986775 6581145 7269745 8080049 9041458 10182826 11531692 13113202 14945488
57091 14945488 17033884 19369496 21932753 24697746 27635618 30718613 33924629 37240738
57083 37240738 40666297 44213435 47894275 51688152 55505339 59178978 62497111 65250193
57075 65250193 67260676 68387983 68527302 67617232 65654266 62705427 58912834 54484305
57067 54484305 49666009 44703851 39810100 35147040 30825637 26910744 23428442 20375017
57059 20375017 17726276 15445352 13489209 11814399 10380927 9153262 8100003 7194038
57051 7194038 6412728 5737025 5150308 4638338 4189738 3795568 3448234 3141145 2869133
57042 2869133 2628436 2415853 2228084 2061875 1914453 1783600 1667457 1564459 1473391 1393382
57032 1393382 1323824 1264341 1214815 1175410 1146507 1128470 1121172 1123471 1133260 1148446 1167931 1190894
57020 1190894 1214349 1231653 1234517 1217227 1179045 1123006 1053520 975463 894237 814993 741349
57009 741349 675212 617562 568671 527718 493098 463475 438108 416115 396183 377394 359872
56998 359872 344216 330568 318547 307753 297926 288852 280547 273467 268150 264608 262355 261100 261158 263092
56984 263092 267024 272466 278679 285001 290677 294492 294910 290893 282613 271215 257934 243631 229108
56971 229108 215445 203680 194299 187295 182706 180844 182015 186279 193587 203896 216982 232297 249240
56958 249240 267498 286804 306310 324389 339111 348724 351745 347169 335097 317129 295744 273160
56946 273160 250863 229956 211511 196407 185159 178089 175488 177486 183974 194854 210203 229899
56934 229899 253085 278216 303784 328955 353408 376500 396620 411471 418975 417871 407708 388918
56922 388918 363236 333599 302912 272813 243902 216871 192768 172175 154875 140599 129435
56911 129435 121107 114450 108231 102211 96909 92541 88740 85206 82127 79853 78480 77848 77759 78203 79494
56896 79494 82094 86231 91960 99759 110697 125516 143753 164188 186010 209036 232855 256369
56884 256369 278285 297567 313196 323971 328974 328117 322079 311920 299003 285059 271995 261439
56872 261439 254472 251612 253057 259070 270283 287563 311535 342338 379796 423454 472160 523699
56860 523699 575200 624100 668588 707026 737071 755726 760535 750888 728245 695371 655612 612721
56848 612721 570631 532716 501186 477352 462404 457690 464412 483448 515422 560530 618086 686448
56836 686448 763394 846180 931099 1013454 1088383 1151653 1199448 1227888 1233597 1215166 1174056 1114088
56824 1114088 1040341 958367 873858 792354 718844 657223 609589 575913 554841 545338 547658 562674
56812 562674 590486 629893 678803 734520 793677 852551 907743 956176 994239 1017553 1022341 1007200
56800 1007200 973450 924153 863265 795518 726115 659740 599509 546809 502003 465341 437456
56789 437456 419140 410689 411488 420265 435660 456461 481425 509083 537704 565317 589777 608894
56777 608894 620458 622319 612955 592436 562647 526243 485478 442279 399009 358366 322263 291135
56765 291135 264419 241393 221496 204289 189373 176292 164555 153935 144648 136901 130381 124562
56753 124562 119435 115436 112629 110430 108215 105776 103148 100500 98293 97006 96518 96213 95775 95347 94798
56738 94798 93591 91694 89946 89032 88648 88209 87832 87951 88360 88354 87704 86960 86887 87933 90053 92636 94836 96329
56720 96329 97569 99022 100511 101684 102721 104025 105587 107165 108750 110275 111289 111622 112109 113794 116578
56705 116578 119415 121715 123661 125218 125875 125677 125589 126360 127658 128757 129491 130134 130826 131625 132639 133617 133810
56688 133810 132746 130947 129389 128544 128396 129130 131149 134388 138131 141596 144359 146199 147032 147182 147336 147842
56672 147842 148262 147884 146528 144557 142289 139865 137698 136478 136391 136727 136654 136152 135755 135609 135379 135000 134876
56655 134876 135155 135447 135556 135995 137382 139652 142201 144530 146467 148052 149511 151086 152632 153697 154247
56640 154247 154867 155910 156869 157104 156765 156363 155798 154561 152815 151504 151294 151895 152485 152341 151062 148674 145739
56623 145739 143064 141188 140194 139822 139516 138664 137260 136093 135788 135871 135377 134221 133256 132945 132699 131758 130195
56606 130195 128829 128451 129275 130755 131898 132090 131710 131659 132348 133546 135031 136814 138713 140300 141398 142134
56590 142134 142424 141992 141093 140673 141556 143785 146843 150052 152644 153976 154044 153522 153125 153174 153747 154805 156084
56573 156084 157298 158585 160366 162710 165321 168219 171916 176736 182448 188777 195787 203542 211861 220605
56559 220605 229802 239256 248428 256854 264222 269904 273006 273190 271050 267427 262864 257874 253124 248870
56545 248870 244704 240292 235958 232186 228993 226205 223857 221773 219164 215362 210832 206906 204504 203502
56531 203502 203252 203288 203465 203716 203903 203912 203833 203835 203698 202711 200541 198056 196589 196275 195830 194263 192069 190283 189014
56512 189014 187677 186161 184936 184085 183029 181341 179349 177747 176921 176707 176605 176185 175470 174920 174926 175373 175814
56495 175814 175985 175981 175988 175969 175648 174789 173504 172159 170921 169607 168181 167093 166755 166935 167154 167426 168021 168726
56477 168726 169142 169576 170726 172414 173592 173858 174008 174677 175380 175501 175469 176231 178078 180583 183160 185192 186162
56460 186162 186289 186494 187210 187802 187708 187435 187655 187979 187646 186982 187137 188490 190231 191452 191916 191810 191528 191698
56442 191698 192766 194478 196182 197533 198417 198471 197365 195484 193642 192197 191027 190285 190415 191358 192381 192866
56426 192866 192803 192428 191850 191147 190447 189821 189379 189454 190336 191890 193727 195636 197487 198932 199693 200037 200470 200977
56408 200977 201066 200540 199779 199240 199083 199342 200061 201157 202406 203631 204794 205986 207461 209404 211465 212863
56392 212863 213239 213123 213200 213488 213656 213724 213877 213904 213456 212671 211975 211466 211020 210800 211002 211322 211361 211473 212498 214652
56372 214652 217251 219547 221310 222618 223630 224591 225581 226338 226783 227509 229146 231397 233387 234874 236412
56357 236412 238331 240361 242317 244357 246364 247762 248385 248907 250087 251923 253886 255597 257015 258189 259126
56342 259126 259797 260199 260456 260788 261242 261695 262351 263948 267011 271126 275394 279384 283212 286966 290731 294879
56326 294879 299572 304045 307209 309060 310812 313415 316553 319206 320660 320782 319893 318650 317681 317191 317172 317896
56310 317896 319655 322050 324186 325764 327446 329976 333422 337491 342128 347457 353436 359862 366574 373522
56296 373522 380678 387828 394480 400255 405526 411281 417991 425024 431588 437840 444491 451786 459565 467985
56282 467985 477296 487130 496871 506637 517023 527983 538886 549759 561573 575068 590028 605943
56270 605943 622767 640802 660379 681746 704801 728994 754181 781545 813024 849709 891436
56259 891436 937859 989209 1046056 1109211 1180037 1260096 1350219 1450497 1561116 1682484 1814482
56248 1814482 1956330 2107128 2265700 2429895 2596962 2764665 2931019 3092865 3245902
56239 3245902 3386437 3512024 3619975 3706544 3768475 3804612 3815291 3801029 3762662 3702147 3622135
56228 3622135 3524915 3412424 3287108 3152172 3010988 2866627 2721854 2579139 2440466 2307062
56218 2307062 2179299 2057075 1940582 1830484 1727118 1629943 1538290 1452318 1372574 1298982
56208 1298982 1231081 1168884 1112468 1060883 1012618 967190 925314 887510 853609 823580 797606
56197 797606 775051 754511 735272 717741 702216 688314 675976 665849 658094 651773 645988 640744
56185 640744 636230 632168 628461 625669 624196 623585 623083 622272 620958 619176 617584 617029 617433 617931 618300 619289
56169 619289 621246 623522 625627 628005 631219 635336 640507 647112 654947 663298 672208 682571 694577 707312
56155 707312 720412 734848 751476 770138 791019 815645 845620 881483 923693 973652 1032678
56144 1032678 1100892 1177989 1264182 1359408 1462542 1572261 1687803 1807885 1929708 2049940
56134 2049940 2165925 2275159 2374714 2462504 2538558 2604083 2659850 2706253 2744073 2773980 2795659
56123 2795659 2808168 2810712 2802553 2782950 2751816 2709682 2656434 2591017 2513014 2423567 2324110 2215400
56111 2215400 2098778 1977394 1855190 1735410 1620812 1514222 1417797 1332446 1258624 1196704
56101 1196704 1145834 1103679 1068253 1039069 1015742 996802 980896 967873 957554 948708 940514 933876
56089 933876 929939 928282 927717 927826 928538 929380 930475 933173 938326 944916 951570 958373 965913 973787 981450
56074 981450 989405 998193 1007322 1016585 1027235 1040298 1054832 1069282 1083450 1097733 1111779 1125487
56062 1125487 1139953 1155662 1170975 1184249 1196235 1208586 1221283 1233478 1245648 1258807 1272685
56051 1272685 1286675 1301455 1317671 1334183 1349822 1365704 1383541 1402793 1421923 1441399 1462890
56040 1462890 1486280 1510116 1534456 1560757 1589373 1619460 1650968 1684547 1719907 1756287 1793975
56029 1793975 1833411 1873522 1913003 1952535 1993605 2035875 2077751 2118744 2159352 2199676 2240257
56018 2240257 2283121 2329757 2379181 2430084 2483454 2540769 2601236 2663570 2728920 2799165 2873780
56007 2873780 2951389 3032859 3119720 3210988 3304897 3402430 3505831 3615058 3729108 3849230
55997 3849230 3977236 4112239 4252824 4400871 4559343 4728099 4906033 5095338 5299077
55988 5299077 5516472 5745714 5989851 6254673 6542224 6851754 7185576 7548362 7942036
55979 7942036 8367310 8829099 9334530 9886931 10488087 11145253 11869793 12670666 13556283
55970 13556283 14541375 15645076 16884618 18279706 19862323 21675100 23764077 26185250
55962 26185250 29019768 32376972 36391323 41238134 47164539 54508707 63704528 75283703
55954 75283703 89846078 107943366 129879807 155512914 184151677 214621814 245522720
55947 245522720 275573747 303779211 329195067 350471207 365686801 372802605 370457891
55940 370457891 358520121 338087295 311119906 280005287 247172514 214760011 184384857
55933 184384857 157070870 133300978 113117972 96251008 82268021 70708817 61148788
55926 61148788 53210606 46573781 40987138 36259270 32234578 28784477 25811618 23242958
55918 23242958 21014171 19067245 17358573 15856943 14532994 13358529 12313858 11386064
55910 11386064 10560111 9819046 9151602 8551584 8010302 7516811 7064842 6652425 6275024
55901 6275024 5925583 5600979 5302029 5027168 4771906 4534268 4315110 4113103 3924679
55892 3924679 3748760 3586429 3436206 3294781 3162242 3041528 2932598 2831947 2738010 2652252
55882 2652252 2574583 2502185 2433467 2369077 2308428 2249029 2189679 2130803 2071385 2009144 1944079
55871 1944079 1878596 1813979 1749862 1687024 1627305 1570728 1515943 1463414 1415005 1370606 1328547
55860 1328547 1289043 1253720 1221864 1190843 1160377 1132774 1108716 1086409 1065221 1046469 1029926
55849 1029926 1013061 994636 975887 957298 937405 915783 894266 874127 854718 835764 818232
55838 818232 801993 785304 767719 751030 736292 722330 708275 695247 684348 675007 666389 658555
55826 658555 651333 643890 636173 629022 622235 614387 605120 595677 586641 577215 567327 558300 550679 543441
55812 543441 536177 530107 526085 523498 521946 522173 524482 528040 532518 538580 545928 552686 557647 561501
55798 561501 564994 567584 568670 568459 566714 562343 555159 546447 536992 526188 513967 501899 491388
55785 491388 482372 474736 469292 466200 464031 461691 459985 460092 461878 464951 470188 478772 490583 504571
55771 504571 519914 535840 551128 564595 575316 581820 582154 575498 562771 545170 523260 498090
55759 498090 471778 446032 421175 397465 376139 358182 343119 330146 319572 312161 307774 305526
55747 305526 304645 304562 304904 305939 308156 310892 312421 311944 310444 308982 307300 304812 301745 298387 294321
55732 294321 289349 284225 279525 274678 269022 262928 257015 251171 245343 240388 237084 234941 232985 231130
55718 231130 229911 229529 230018 231822 235318 240194 245906 252235 258858 265058 270402 275023 278651 280248 279309
55703 279309 276737 273640 269953 264997 258714 251620 244162 236765 229909 223490 216814 209838 203701 199396
55689 199396 196662 194787 193653 193302 193354 193694 194935 197370 200221 202734 205198 208053 210857 213093 215165
55674 215165 217487 219278 219415 217967 215780 213062 209492 205415 201861 199531 198507 198654 199552 200433 201020
55659 201020 202027 204142 206972 209782 212687 216186 219951 223102 225343 226956 227943 228127 227816 227424 226582
55644 226582 224470 220944 216595 211866 206810 201577 196447 191518 186909 182989 179840 176838 173445 170083
55630 170083 167535 165786 164275 163016 162637 163415 164978 166842 168595 169719 169871 169340 168679 167961 166807 164951
55614 164951 162392 159324 156318 154211 153261 152780 152074 151314 150975 150911 150674 150278 149938 149420 148350 146843 145165
55597 145165 143197 140884 138711 136933 134832 131678 128048 125196 123427 122096 120915 120176 119761 119121 118287
55582 118287 117876 117904 117629 116859 116530 117576 119879 122772 126026 129879 134470 139623 145064 150593 156132 161577
55566 161577 166490 170092 171825 171861 170896 169607 168373 167121 165207 161906 157388 152735 148643 144632 140010
55551 140010 134985 130224 125936 122246 119896 119501 120338 120871 120450 119647 119095 118896 119140 120041 121372 122459
55535 122459 122922 122884 122471 121692 120720 119672 118204 116028 113710 112152 111249 109935 107688 105162 103124 101528
55519 101528 100017 98645 97595 96621 95245 93384 91523 90318 90028 90219 90137 89547 89006 89060 89551 90092 90773
55502 90773 91737 92402 91932 90435 88961 88321 88520 89275 90338 91231 91403 90891 90417 90708 92104 94656 97971
55485 97971 101061 103030 104087 105242 106976 108860 110549 112367 114557 116570 117564 117384 116691 116333 116618 117007
55469 117007 116537 114757 112155 109446 106747 103871 101052 98682 96540 94050 91313 89181 88229 88247 88727
55454 88727 89241 89312 88624 87515 86713 86450 86313 85965 85452 84875 84379 84365 84990 85496 84896 83440 82522 82947 84136
55435 84136 85303 86505 88102 89932 91632 93195 94683 95838 96457 96748 96944 96918 96546 96049 95698 95486 95347
55418 95347 95367 95577 95945 96654 97888 99230 99888 99792 99791 100430 101166 101242 100730 100132 99462 98390 97029 95931 95412
55399 95412 95288 95196 94845 94071 92960 91827 90968 90599 91037 92481 94432 95779 95849 95053 94250 93830 93731 93932
55381 93932 94418 94890 94948 94504 93719 92689 91458 90183 89015 87883 86578 84967 83145 81562 80944 81669
55365 81669 83110 84053 83967 83441 83178 83070 82643 81947 81456 81342 81422 81676 82307 83209 83782 83486 82396 81128 80217
55346 80217 79676 79205 78797 78838 79434 79980 79852 79319 79171 79527 79763 79666 79837 80637 81498 81820 81899 82301 82859 83085
55326 83085 83263 84209 85959 87500 88049 88003 88274 89082 89791 89800 89239 88659 88243 87590 86354 84880 83916 83736 83814
55307 83814 83474 82551 81307 80004 78776 77812 77389 77708 78713 80069 81338 82328 83195 84105 84936 85476 85713
55290 85713 85663 85154 84226 83520 83681 84486 85182 85590 86109 86626 86357 85152 84097 84200 85133 85874 86046 85931 85624
55271 85624 85095 84870 85731 87541 88998 88880 87260 85321 84254 84425 85359 86273 86669 86562 86339 86460 87181
55254 87181 88372 89624 90714 91862 93272 94590 95187 94930 94223 93361 92393 91605 91427 91636 91377 90353 89355
55237 89355 89156 89426 89376 88977 88816 89026 89119 88833 88504 88494 88686 88697 88309 87662 87167 87169 87522 87581 86804 85305 83724
55216 83724 82713 82631 83448 84788 86184 87453 88615 89503 89875 89929 90154 90524 90458 89891 89670 90342 91193 91184 90382
55197 90382 89666 89356 88974 88247 87530 87193 87241 87635 88415 89433 90444 91503 92795 94004 94437 93957 93367 93580
55179 93580 94691 96060 97100 97828 98721 100079 101498 102158 101800 101191 101252 101956 102500 102421 102008 101619 101191 100665
55161 100665 100413 100867 101920 102945 103402 103250 102837 102452 102023 101262 100100 98829 97828 97350 97604 98669 100100
55144 100100 100972 100707 99661 98568 97635 96647 95689 95142 94977 94661 93896 92998 92344 91851 91245 90550 90076 90126
55126 90126 90889 92400 94382 96200 97183 97067 96136 95019 94326 94327 94868 95575 96088 96176 95826 95334 95150 95440 95910
55107 95910 96184 96276 96546 97327 98670 100288 101607 102126 101927 101693 102009 102826 103756 104546 105014 104908 104284 103805
55089 103805 104101 104959 105618 105827 106103 106886 107982 108999 109907 110936 112155 113370 114313 114815 114939 114955 115035 115050
55071 115050 114858 114698 114956 115532 115839 115540 115012 114870 115248 115768 116057 116092 115994 115676 114861 113516 112085 111023
55053 111023 110099 108570 106224 103947 102923 103452 104946 106816 108882 110905 112244 112320 111282 110011 109419
55038 109419 109594 109614 108395 105925 103446 102176 102096 102328 102451 102837 103742 104673 104927 104372 103435 102585 102093 102086 102572
55019 102572 103373 104156 104591 104582 104367 104320 104499 104553 104243 103887 103988 104496 104871 104970 105447 106979 109268 111159 111793
55000 111793 111439 111071 111246 111607 111547 111083 110816 111143 111874 112602 113082 113212 113013 112827 113190 114238 115487 116350
54982 116350 116632 116397 115788 115171 114982 115083 114698 113458 112129 111765 112385 113065 113128 112681 112128 111755 111817 112570 114083
54963 114083 116222 118738 121105 122576 122824 122360 121903 121557 121037 120390 119875 119272 118051 116258 114640 113809
54947 113809 113729 114056 114467 114632 114358 113888 113666 113802 114082 114465 115105 115991 116983 118106 119335 120325 120967 121988
54929 121988 124211 127286 130042 132161 134600 138140 142475 147093 152161 157918 163834 169050 173250 176546
54915 176546 178835 179773 179147 176922 173185 168337 163022 157565 151797 145717 139992 135453 132382 130498 129271
54900 129271 128058 126399 124608 123622 123824 124359 124087 122928 121785 121399 121845 122959 124668 126756 128818 130649
54884 130649 132550 135105 138678 143088 147750 152247 156727 161604 166875 172053 176735 180799 183953 185583
54870 185583 185394 183851 181593 178684 174816 170082 165140 160558 156243 151635 146435 141146 136762 133788
54856 133788 131719 129731 127688 125999 124668 123137 121173 119262 117942 117264 117111 117412 117750 117433 116401
54841 116401 115491 115303 115344 114897 114211 114110 114710 115344 115606 115703 115814 115730 115299 114714 114187 113707 113266 113055 113289 114002
54821 114002 115011 115938 116330 115940 114910 113603 112405 111710 111852 112782 113995 114898 115110 114393 112780 111007
54805 111007 110334 111433 113667 115881 117559 118838 119735 120059 119939 119776 119648 119323 118936 119129 120275 121927
54789 121927 123235 123686 123367 122786 122573 123065 124044 124947 125403 125442 125260 125038 125063 125776 127539 130349 133833 137523
54771 137523 141162 144798 148552 152318 155880 159352 163211 167713 172413 176540 179719 182107 183774 184236
54757 184236 182821 179514 175317 171495 168383 165187 161159 156659 152610 149205 145902 142636 140188 138999
54743 138999 138329 137077 134983 132568 130379 128822 128317 128946 130104 131044 131691 132583 134158 136496 139559 143240
54727 143240 147254 151269 155068 158451 161315 164010 167160 170752 173882 175832 176873 177432 177026 174921 171514
54712 171514 168088 165232 162369 158898 154937 150748 146280 141694 137738 135074 133526 132361 131070 129682
54698 129682 128505 127821 127717 128073 128698 129357 129652 129113 127698 126013 124743 124020 123574 123207 122815 122282 121794
54681 121794 121870 122535 122840 121916 120217 118918 118301 117663 116724 116014 115702 115126 113953 112903 112688 112949 112909 112523
54663 112523 112314 112464 112770 113256 114179 115481 116722 117568 118061 118417 118808 119310 119951 120784 121902 123153 123939
54646 123939 123689 122617 121606 121209 121175 121136 121239 121745 122445 122949 123293 123768 124273 124251 123254 121382 119242 117657
54628 117657 117202 117735 118513 118954 119167 119564 120232 120963 121699 122498 123139 123191 122596 121947 121987 122916 124211 125132 125419
54609 125419 125512 126069 127252 128602 129582 130073 130261 130227 129811 128843 127433 126035 125138 124828 124744 124575 124464 124702
54591 124702 125196 125544 125624 125672 125809 125808 125473 124908 124381 124159 124492 125397 126460 127194 127622 128011 128127 127405 126053
54572 126053 125170 125319 125634 125016 123716 122952 123234 123904 124307 124584 125126 125917 126798 127895 129364 130927 132106
54555 132106 132786 133257 133692 133880 133563 132853 132109 131508 130947 130410 130285 131077 132858 135099 137083 138454 139390
54538 139390 140292 141238 141727 141121 139440 137527 136245 135740 135679 135860 136150 136126 135423 134423 133919 134011 133956 133288 132441
54519 132441 131978 131787 131511 131249 131219 131113 130443 129374 128648 128729 129516 130840 132718 134964 136999 138308 138947
54502 138947 139359 139773 139884 139217 137787 136269 135301 134708 133749 132191 130713 130034 130011 129926 129391 128606 127987 127920
54484 127920 128701 130268 132106 133766 135352 137093 138632 139347 139399 139813 141273 143334 145208 146914 149103
54469 149103 151911 154581 156414 157677 159210 161246 163057 163897 163948 163990 164328 164483 164002 163099 162254 161472 160349
54452 160349 158704 156783 154833 152777 150425 147888 145645 144218 143704 143569 142997 141595 139764 138331 137867
54437 137867 138382 139542 141019 142657 144362 145862 146644 146312 145006 143345 141937 141124 141126 142048 143582 145025
54421 145025 145856 146133 146165 146111 146099 146410 147126 147785 147849 147440 147186 147304 147257 146518 145350 144524 144412 144610 144528 144193
54401 144193 144276 145337 147195 149208 151000 152626 154025 154737 154414 153392 152484 152265 152714 153428 154078 154665 155426
54384 155426 156403 157166 157227 156761 156580 157270 158637 160184 161746 163369 164897 166141 167254 168584 170178 171702
54368 171702 172785 173258 173254 173266 173858 175042 176176 176816 177385 178550 180189 181529 182189 182557 183124 183954 184776 185117
54350 185117 184305 181938 178531 175189 172470 170003 167472 165374 164329 164025 163468 162182 160659 159539 158807
54335 158807 157992 156906 155916 155499 155689 156030 155998 155464 154795 154562 155108 156218 157184 157329 156588 155570 155038 155408
54317 155408 156667 158508 160420 161890 162710 162990 162789 162030 160914 160031 159681 159360 158388 156919 155815 155541
54301 155541 155705 155727 155467 155003 154269 153277 152432 152221 152661 153305 153748 153957 154168 154626 155389 156197 156522 155975 154827
54282 154827 154032 154505 156278 158463 160116 161023 161543 161914 162036 161859 161603 161526 161803 162602 163918 165230 165826
54265 165826 165664 165459 165715 166206 166748 167795 169627 171500 172422 172451 172347 172195 171368 169922 168900 168886 169154 168833
54247 168833 168239 168312 169202 170140 170569 170714 170964 171180 170839 169680 168014 166474 165477 164926 164384 163484 162222 160993
54229 160993 160358 160496 160772 160193 158579 156957 156411 156850 157384 157579 157566 157181 156008 154431 153665 154299 155551
54212 155551 156458 157069 157860 158618 158780 158540 158751 159721 160813 161319 161207 160902 160754 160879 161258 161766 162229 162489
54194 162489 162382 161782 160787 159778 159166 159217 160175 162225 165074 167786 169480 170171 170730 172023 174261 177033
54178 177033 179754 182052 183886 185281 186004 185759 184782 183850 183458 183270 182706 181730 180604 179139 176904 174165
54162 174165 171982 171023 170713 169905 168243 166496 165587 165614 165977 166205 166367 166621 166767 166544 166105 165754 165297 164249
54144 164249 162781 161873 162150 163071 163715 164012 164597 165717 166848 167377 167170 166484 165805 165767 166795 168619 170474
54127 170474 171881 173004 174232 175698 177236 178484 178973 178409 177053 175629 174769 174695 175358 176586 178004 179124
54111 179124 179649 179593 179091 178341 177709 177573 177919 178299 178286 177775 176844 175642 174489 173735 173335 172843 172082 171585 172034
54092 172034 173358 174701 175318 175334 175539 176514 178021 179308 179974 180385 181159 182402 183682 184681 185557 186622 188007
54075 188007 189713 191761 194075 196418 198565 200427 201914 202927 203653 204607 206140 207998 209544 210338 210383
54060 210383 209960 209430 209042 208696 207949 206512 204739 203463 203345 204489 206578 209159 211819 214374 216995 220037
54044 220037 223632 227479 231103 234276 237236 240582 244921 250483 257014 264056 271292 278588 285782 292602
54030 292602 298816 304333 309128 313157 316386 318863 320710 322136 323436 324896 326540 327946 328412 327425 325157
54015 325157 322542 320658 319764 318887 316554 312122 306362 300683 295861 291603 287207 282416 277548 273046 269152
54000 269152 266035 263946 263025 262969 263139 263145 263240 263996 265548 267262 268170 267644 265647 262510 258629 254358 249997
53983 249997 245745 241663 237695 233761 229883 226301 223421 221479 220186 218858 217058 215065 213524 212707
53969 212707 212307 211978 211771 211895 212257 212582 212905 213657 215136 217113 219091 220800 222324 223840 225424 227066
53953 227066 228693 230149 231320 232325 233531 235308 237861 241278 245488 250048 254157 257238 259584 262190
53939 262190 265824 270339 274934 278866 281819 283860 285377 287036 289434 292653 296306 300056 303918 308034
53925 308034 312409 317032 322022 327451 333138 338851 344618 350673 357214 364453 372786 382484 393102 403475
53911 403475 412560 420183 426869 433125 438966 443943 447391 448837 448454 447123 445815 444835 443767 442051 439406
53896 439406 435729 430957 425237 419093 413110 407436 401626 395003 387220 378567 369809 361586 353906 346284
53882 346284 338448 330728 323668 317428 311794 306667 302222 298495 295109 291585 287899 284517 281810 279494
53868 279494 276831 273465 269889 266819 264166 261092 257238 253458 250901 249640 248738 247441 245717 243700
53854 243700 241359 238883 236688 234704 232302 229422 227186 226684 227464 227881 226837 224585 222008 219855 218752
53839 218752 219159 220933 223294 225494 227268 228541 229121 228926 228225 227388 226634 226145 226144 226619 227249 227785 228313 228934
53821 228934 229507 230013 230911 232727 235329 237917 239827 241121 242334 243808 245439 247046 248879 251499 255101
53806 255101 259138 262920 266488 270522 275404 280753 286041 291333 297119 303609 310395 316712 321959 326168
53792 326168 330016 334145 338420 342173 345197 347981 350753 352851 353535 353006 352041 350887 349130 346519 343285
53777 343285 339583 335176 329828 323658 317085 310706 305214 300952 297465 293913 289997 286124 282622 279311
53763 279311 276045 273152 270967 269304 267764 266277 264928 263479 261534 259089 256500 254019 251767 250128
53749 250128 249581 249934 250140 249288 247588 246044 245255 244900 244370 243504 242587 241958 241800 242023 242152 241612 240490 239761
53731 239761 240279 241708 242995 243833 244867 246311 247248 246901 245983 245958 247243 248923 250057 250486 250406 250058 250077
53714 250077 251356 254103 257523 260784 263803 266772 269489 271734 273865 276394 279139 281465 283247 285020
53700 285020 287177 289550 291937 294577 297843 301715 305706 309150 311593 313227 314991 317818 321565 324942
53686 324942 326719 326769 325780 324320 322597 320829 319243 317606 315318 312230 309083 306784 305443 304467 303497
53671 303497 302848 302929 303588 304255 304537 304436 304063 303402 302393 301084 299689 298595 298254 298847 300014 301150 302018
53654 302018 302880 303930 304894 305425 305717 306301 307228 307876 307788 307453 307890 309509 311687 313563 314976 316382 318036
53637 318036 319639 320838 321725 322549 323235 323602 323961 324981 326764 328532 329555 330096 330981 332476 334089 335412
53621 335412 336584 337839 339221 340953 343535 346992 350476 353188 355417 358073 361394 364814 368026 371360
53607 371360 374881 377899 379900 381484 383753 387001 390498 393431 395611 397315 398881 400466 401918 402845
53593 402845 403041 402825 402709 402798 402769 402345 401480 400149 398330 396248 394330 392855 391799 390996 390200 389037 387197
53576 387197 384760 382102 379512 377118 375104 373623 372471 371165 369373 367126 364713 362607 361276 360677
53562 360677 360151 359282 358595 358781 359543 360060 360422 361499 363273 364528 364639 364522 365109 365904 365982 365563 365497 365866
53544 365866 366253 366943 368587 370934 373099 375097 377951 382203 387352 392944 399106 405631 411633 416748 421990
53529 421990 428706 437100 446303 455541 464785 474511 485144 496597 508205 519374 530348 542001 554843
53516 554843 568707 583420 599149 615869 633113 650588 668600 687597 707705 728955 751382
53505 751382 774559 797550 819751 841330 862440 882596 901409 919431 937567 955858 973519
53494 973519 989971 1005260 1019608 1033206 1046486 1060084 1074348 1089161 1104210 1119172 1133812
53483 1133812 1148258 1163074 1178660 1194683 1210432 1225601 1240266 1254211 1266812 1277625 1286596
53472 1286596 1293616 1298369 1300821 1301505 1301032 1299518 1296648 1292059 1285506 1276893 1266402 1254557 1241997 1229179
53458 1229179 1216266 1203130 1189473 1175073 1160020 1144606 1128922 1112657 1095373 1076991 1057963
53447 1057963 1039021 1020753 1003420 987071 971768 957608 944616 932823 922445 913799 906961 901671
53435 901671 897585 894379 891525 888375 884840 881826 880623 881798 884871 889051 894038 900068 907393 915953
53421 915953 925579 936443 949093 963820 980106 996982 1013977 1031492 1050194 1070378 1092022 1115046
53409 1115046 1139285 1164480 1190541 1217554 1245367 1273560 1302154 1331922 1363592 1397072 1431940
53398 1431940 1468351 1506872 1547623 1590209 1634306 1679636 1725503 1771139 1816734 1863355 1911525
53387 1911525 1960388 2008542 2055233 2100423 2144155 2186251 2226398 2264199 2299340 2331894 2362146
53376 2362146 2389892 2414240 2434390 2450254 2462034 2469604 2472824 2472093 2467865 2459612 2445911 2425851
53364 2425851 2400088 2370245 2337528 2302095 2263621 2222201 2178636 2133961 2088806 2043286 1997391
53353 1997391 1951373 1905672 1860667 1816634 1773871 1732687 1693253 1655462 1618919 1583109 1547746
53342 1547746 1513046 1479464 1447118 1415710 1385184 1356173 1329462 1305142 1282667 1261698 1242416
53331 1242416 1224926 1208796 1193507 1179082 1165901 1154006 1142956 1132330 1122046 1112072 1102089 1091661
53319 1091661 1080674 1069462 1058527 1048225 1038763 1030422 1023598 1018470 1014614 1011218 1007900 1005203 1004019
53306 1004019 1004594 1006425 1009139 1013052 1018687 1026078 1034830 1044606 1055259 1066738 1079189 1093045 1108672
53293 1108672 1125994 1144731 1164790 1186027 1207801 1229247 1250010 1270341 1290533 1310660 1330774
53282 1330774 1350716 1369611 1386162 1399682 1410461 1418983 1425284 1429247 1430905 1430137 1426602 1420374 1412179
53269 1412179 1402588 1391439 1378421 1363657 1347224 1328680 1307872 1285817 1263923 1242478 1220611
53258 1220611 1197563 1173391 1148600 1123874 1100007 1077263 1054785 1031478 1007508 984093 961700
53247 961700 939424 916451 893222 870601 848697 827206 806279 786258 766948 747939 729525
53236 729525 712565 697390 683378 669752 656465 644188 633588 624698 616901 609509 602302 595346
53224 595346 588401 580964 572961 564922 557157 549159 540116 529767 518401 506409 494263 482634 472044
53211 472044 462466 453637 445544 438223 431313 424347 417374 410774 404519 398132 391416 384691 378223 371890
53197 371890 365551 359236 352785 345787 338187 330561 323473 316920 310747 305242 300838 297439 294560 291981
53183 291981 289708 287346 284198 280192 276161 272858 270141 267564 265387 264359 264615 265341 265571 264876 263244
53168 263244 260889 258382 256495 255515 255006 254471 253889 253347 252605 251579 250877 251143 251993 252288 251598 250790 250964
53151 250964 252259 253868 254849 254669 253406 251742 250526 250052 249864 249390 248553 247674 247103 247128 247973 249600 251650
53134 251650 253785 255925 258045 259963 261482 262514 262955 262734 262214 262240 263532 266158 269747 273912 278292
53119 278292 282531 286537 290478 294257 297356 299609 301746 304620 308053 310949 312504 312787 312230 311082 309482
53104 309482 307531 305091 301807 297532 292519 287158 281794 276787 272416 268605 265086 261890 259336 257423
53090 257423 255664 253781 252216 251487 251220 250266 247891 244596 241606 239720 238849 238637 239130 240532 242392 243574
53074 243574 243345 242245 241444 241393 241532 241287 240790 240396 240010 239335 238515 238034 238022 238055 237700 236896 235699 234033 232050
53055 232050 230500 230274 231433 233049 234202 234927 235909 237479 239331 241106 242697 243885 244289 244010 243834 244285
53039 244285 244817 244632 244042 244223 245540 246822 246684 245016 242824 241055 240090 240039 240868 242188 243390 244184 244804
53022 244804 245601 246595 247448 247762 247389 246544 245634 244898 244346 244084 244497 245803 247559 248966 249742 250367 251382
53005 251382 252743 254056 255189 256313 257453 258341 258789 258945 259108 259460 260082 261045 262274 263420 264087 264259
52989 264259 264335 264677 265191 265471 265259 264643 263792 262720 261450 260333 259912 260407 261501 262770 264166 265855 267729
52972 267729 269372 270503 271151 271383 271257 271190 271872 273476 275249 276388 277130 278381 280371 282280 283315 283542
52956 283542 283368 282771 281544 279972 278657 277753 276873 275774 274685 273815 272871 271352 269232 267161 265928 265813
52940 265813 266446 267260 267931 268290 267996 266673 264481 262269 260889 260481 260621 260987 261556 262243 262745 262847 262629
52923 262629 262223 261570 260562 259359 258327 257720 257568 257932 259059 261018 263176 264357 263817 262003 260160 259199
52907 259199 259156 259619 260280 260929 261313 261343 261273 261404 261703 261917 262039 262485 263797 266153 269065 271515 272629 272396
52889 272396 271614 271105 271142 271607 272336 273137 273824 274453 275271 276249 277067 277802 279125 281352 283735 285328 286292 287652
52871 287652 289864 292264 293905 294363 293727 292424 291144 290334 289636 288355 286595 285298 284960 284933 284305 282856
52855 282856 280783 278110 274972 272029 269895 268344 266615 264409 262096 260063 258281 256512 254527 252176
52841 252176 249629 247530 246554 246727 247439 248148 248792 249543 250437 251323 251979 252255 252247 252322 252798 253677 254786 256008
52823 256008 257092 257438 256597 254977 253535 252660 251826 250601 249522 249415 250128 250509 249694 247980 246297 245249
52807 245249 244880 245060 245630 246211 246318 245847 245242 244929 244710 243978 242573 241113 240296 240081 239854 239394 239262 240026
52789 240026 241356 242298 242359 241930 241558 241241 240720 240106 239758 239661 239416 238853 238198 237524 236512 235022 233575 232927
52771 232927 233361 234587 236061 237147 237330 236726 236194 236480 237331 237922 238032 238225 238898 239734 240367 241012 242073
52754 242073 243441 244668 245597 246479 247478 248400 248977 249258 249654 250634 252329 254382 256273 257843 259401 261280
52738 261280 263367 265152 266212 266587 266758 267230 268099 269005 269543 269626 269408 269067 268836 268967 269340 269314 268353 266732
52720 266732 265219 264162 263377 262831 262754 262956 262764 261981 261332 261519 262258 262751 262680 262261 261634 260848 260228 260176 260585
52701 260585 260899 260749 260236 259694 259513 260012 261062 261915 261883 261109 260253 259562 258785 257953 257561 257789 258110 257987 257553
52682 257553 257272 257292 257430 257548 257617 257607 257611 257941 258784 259822 260394 260047 258885 257494 256668 256962 258289 259966 261321
52663 261321 262228 262957 263682 264303 264750 265279 266431 268677 271972 275620 278734 280961 282618 284028 285015 285262
52647 285262 284905 284378 283699 282426 280433 278314 276708 275505 274144 272583 271490 271366 271855 272199 272216 272504
52631 272504 273672 275586 277515 278892 279825 280860 282331 284033 285571 286886 288199 289452 290084 289648 288438
52616 288438 287190 286204 285136 283718 282276 281304 280798 280360 279884 279746 280305 281459 282818 284082 285095 285673
52600 285673 285659 285177 284646 284363 284214 283956 283685 283752 284182 284512 284394 284108 284209 284866 285924 287391 289381 291607
52582 291607 293404 294396 294780 294848 294652 294306 294155 294368 294668 294796 294951 295421 295989 296109 295613 294953 294727 295139 295824
52563 295824 296084 295421 294039 292651 291686 290847 289560 287635 285338 283126 281484 280702 280542 280425 280207 280383
52547 280383 281323 282705 284134 285751 287630 289060 289249 288507 287888 287746 287544 287107 287110 288043 289420 290422 290777
52530 290777 290682 290404 290267 290555 291130 291557 291835 292461 293560 294580 295220 296062 297749 300078 302510 305122 308338
52513 308338 311991 315395 318277 321036 324101 327485 330891 333770 335378 335277 333854 331888 329667 326903
52499 326903 323452 319568 315458 311180 307093 303834 301571 299722 297734 295767 294303 293429 292863 292494 292452
52484 292452 292701 292954 293056 293244 293950 295403 297401 299408 300910 301800 302395 303105 304150 305621 307563 309801
52468 309801 311908 313649 315467 318171 322034 326392 330243 333024 334643 335092 334403 332928 331214 329491 327584
52453 327584 325377 323013 320479 317336 313270 308674 304344 300732 297856 295720 294313 293303 292277 291375
52439 291375 291173 291747 292383 292442 292047 291621 291192 290562 289785 289040 288302 287620 287427 288040 289079 289930 290630 291712
52421 291712 293250 294744 295965 297218 298594 299707 300548 301990 304797 308467 311716 314000 316020 318708
52407 318708 322267 326381 330937 336104 341804 347440 352222 355636 357515 357855 356748 354469 351377 347673
52393 347673 343417 338893 334694 331257 328527 326322 324814 324233 324201 323893 322925 321744 320995 320909 321459 322723
52377 322723 324752 327331 330184 333268 336681 340520 345060 350741 357499 364248 369496 372588 374106 375095
52363 375095 376111 377028 377410 376970 375858 374567 373483 372529 371429 370167 368929 367694 366299 364970 364397
52348 364397 365058 366701 368653 370393 371685 372472 372963 373653 374953 376881 379310 382370 386236 390640 395022
52333 395022 399360 404473 411183 419296 427762 435929 444406 454467 466698 480429 494537 508482 522398
52320 522398 536447 550527 564560 578582 592413 605704 618564 631767 645944 660877 676084
52309 676084 691804 708709 726696 744713 762039 779088 796519 814070 830856 846546 861605
52298 861605 876417 890646 903533 914384 922711 928296 931342 932308 931485 928846 924413 918533 911737 904527
52284 904527 897335 890428 883747 877106 870673 864927 860029 855625 851627 848809 848065 849216 851103 852919
52270 852919 855010 858250 863100 869415 876775 884680 892720 900950 909988 920470 932503 945765 959898
52257 959898 974510 989034 1003005 1016495 1029989 1043838 1057973 1071933 1084774 1095196 1102339 1106573
52245 1106573 1108959 1109839 1108535 1104575 1098556 1091321 1082879 1072854 1061630 1050238 1039157 1027951 1016175
52232 1016175 1003933 991403 978444 965048 951694 938882 926617 914673 903061 891939 881347
52221 881347 871447 862732 855609 849887 845084 841129 838393 837098 837042 837857 839225 840795 842264 843636 845197
52206 845197 847225 849853 853138 856992 861091 865178 869417 874141 879215 884074 888527 893153 898689 905274
52192 905274 912454 919662 926469 932583 937872 942306 945673 947487 947321 945086 940855 934647 926687 917681
52178 917681 908510 899665 891280 883641 877261 872314 868295 864463 860498 856641 853302 850814 849546 849966
52164 849966 852263 855874 859658 862867 865862 869490 873712 877344 879448 880526 881713 883036 883293 881829
52150 881829 879641 878242 877971 878074 878070 878256 878927 879956 881307 883220 885447 886917 886890 886139 886335 888349 891769
52133 891769 896039 901340 908045 915992 924829 934786 946556 960496 976341 993710 1012503 1032752 1054302
52120 1054302 1076719 1099442 1121990 1144182 1166063 1187544 1208250 1227914 1246717 1264923 1282268
52109 1282268 1298112 1312181 1324790 1336270 1346632 1355998 1364891 1373655 1381794 1388328 1392814 1395644 1397258
52096 1397258 1397344 1394982 1389457 1380759 1369363 1355788 1340505 1324148 1307467 1290880 1274266 1257405
52084 1257405 1240582 1224437 1209255 1194724 1180548 1167020 1154741 1143985 1134649 1126801 1120881 1117231
52072 1117231 1115613 1115418 1116368 1118832 1123400 1130236 1139051 1149590 1161862 1175716 1190549 1205778 1221441
52059 1221441 1237870 1254815 1271391 1287047 1302066 1316746 1330478 1342151 1351249 1358051 1362750 1364896
52047 1364896 1363866 1359562 1352401 1342866 1331275 1317930 1303315 1288075 1272773 1257571 1242198 1226408
52035 1226408 1210487 1195174 1181037 1168044 1155764 1143792 1131876 1119819 1107488 1094854 1081918
52024 1081918 1068641 1055114 1041696 1028785 1016468 1004608 993311 983030 974028 965946 958142 950282
52012 950282 942345 934198 925590 916639 907880 899571 891169 881794 871111 859549 847812 836413 825611
51999 825611 815521 806222 797842 790458 783806 777229 770137 762437 754339 745879 736854 727126 716674 705419
51985 705419 693245 680187 666441 652274 638122 624519 611603 598933 586203 573965 563126
51974 563126 553961 546337 540784 538372 539300 542472 546950 553113 561894 573431 587059 602019 617525
51961 617525 632607 646713 660191 673464 685946 696478 704606 710603 714292 714756 711460 704976 696333
51948 696333 686149 674725 662561 650454 639305 629946 622927 618366 616197 616462 619034 623158 627832
51935 627832 632694 638015 643649 648517 651402 651838 649941 645810 639490 631165 620988 608824 594554 578528
51921 578528 561490 544218 527498 512220 499076 488088 478636 470065 462194 455379 450273 447502 447323
51908 447323 449481 453338 458159 463305 468278 472782 476748 480247 483203 485149 485349 483366 479488 474350
51894 474350 468108 460369 451137 441395 432297 424095 416450 409612 404540 401758 400785 400995 402504 405779 410774
51879 410774 416920 423740 431055 438705 446443 454107 461641 468870 475379 480574 483887 485089 484575 483214
51865 483214 481820 480790 480237 480264 480962 482282 483997 485767 487286 488495 489619 490829 491928 492511 492259 490759
51849 490759 487352 481707 474470 466718 458715 449911 440312 431029 423002 415868 408719 401517 395088 390001
51835 390001 386150 383316 381545 380912 381332 382598 384338 386074 387590 389052 390442 391170 390685 389272 387782
51820 387782 386741 386113 385728 385394 384722 383442 381888 380697 380083 379845 379966 380584 381463 382172 382834 384041 385865
51803 385865 387738 389502 391797 394907 397937 399825 400746 401769 403319 404723 405257 404930 404048 402521 400025
51788 400025 396650 392998 389625 386628 383875 381475 379739 378659 377742 376628 375725 375967 377956 381553 386240
51773 386240 391573 397330 403552 410508 418312 426519 434392 441602 448289 454368 459245 462478 464267 464936
51759 464936 464260 461762 457505 452117 446130 439661 432719 425441 417980 410426 402923 395741 389198 383647
51745 383647 379429 376590 374725 373374 372597 372923 374713 377794 381750 386258 390965 395350 399050 402313 405821
51730 405821 409883 413978 417239 419396 421017 422794 424851 426935 429017 431208 433101 433832 433110 431818 431068
51715 431068 430834 429984 427619 423982 420037 416621 414102 412481 411477 410719 410030 409426 408777 407772 406440 405417
51699 405417 405319 405952 406467 406299 405647 405027 404697 404662 404918 405375 405669 405337 404212 402483 400369 397909 395115 392118
51681 392118 389042 385911 382865 380384 379002 378748 379071 379434 379866 380803 382599 385415 389475 395048 402118
51666 402118 410313 419312 429037 439278 449418 458874 467658 476084 483906 490206 494250 496093 496158 494643
51652 494643 491665 487717 483424 478948 474046 468688 463172 457540 451278 443803 434935 424839 413916 402973
51638 402973 393065 384738 377606 371073 365263 360828 357951 356066 354598 353535 353111 353313 353978 355111 356755
51623 356755 358593 359964 360331 359686 358434 356942 355231 353153 350839 348793 347412 346561 345787 344868 343903 342922
51607 342922 341821 340781 340384 341045 342498 344194 346203 349469 355084 363347 373519 384420 395183 405490
51593 405490 415183 423854 430921 435983 438932 439768 438576 435675 431536 426461 420603 414468 409168 405825
51579 405825 404727 405284 406875 409627 414277 421341 430536 441110 452637 465244 478977 493302 507651
51566 507651 522339 538486 556937 577638 600152 624284 649890 676499 703543 730747 757879
51555 757879 784205 808436 829100 844739 854102 856664 852891 843630 829302 810075 786597 760032
51543 760032 731392 701383 670950 641371 613574 587803 564101 542668 523518 506333 491060
51532 491060 478149 467735 458967 450755 442960 436201 430608 425446 420167 415194 411307 408632 406655 405040
51518 405040 403953 403485 403123 402045 399928 397239 394701 392603 390835 389363 388291 387453 386391 385026 383994
51503 383994 383922 384551 384972 384678 384006 383586 383712 384320 385215 386112 386662 386598 385862 384610 383175 381883 380724 379368
51485 379368 377792 376600 376259 376176 375216 373199 371190 370045 369372 368314 366758 365130 363499 361657 359896
51470 359896 358932 359046 359826 360756 361589 362195 362624 363340 364875 367112 369438 371646 374108 376936 379624 381837
51454 381837 383936 386231 388203 389054 388799 388279 388291 389120 390729 392889 395199 397442 399914 403041 406775 410744
51438 410744 414866 419282 423650 427087 428950 429303 428480 426655 424083 421238 418322 414895 410420 405040 399537
51423 399537 394635 390606 387382 384719 382370 380361 379036 378642 378979 379723 380889 382633 384723 386656 388232
51408 388232 389615 390838 391760 392563 393728 395307 396753 397818 399083 401128 403613 405791 407604 409585 411818
51393 411818 413846 415674 418172 422220 428066 435747 445520 457386 470790 485390 501877 521480 544805
51380 544805 571591 601323 633511 667516 702703 738768 775313 810934 843283 870253 890877
51369 890877 904919 912013 911463 902700 885800 861799 832610 800351 766472 731588 696109 660753
51357 660753 626384 593716 563338 535726 510987 488787 468797 451054 435765 422954 412424
51346 412424 403832 396615 390099 383909 378147 373012 368472 364457 361076 358403 356333 354870 354272 354563 355150
51331 355150 355282 354703 353564 352022 350390 349405 349718 351119 352731 354006 355050 355996 356640 356925 357339 358492
51315 358492 360539 363221 366203 369198 371976 374542 377110 379730 382077 383781 384813 385305 385107 383817 381279
51300 381279 377893 374296 370836 367489 364221 361220 358621 356153 353423 350587 348475 347841 348686 350419 352429
51285 352429 354326 355978 357740 360395 364424 369360 374253 378647 382683 386419 389665 392546 395582 398905
51271 398905 401909 404008 405432 406926 408959 411498 414300 417016 419208 420706 421919 423493 425499 427100
51257 427100 427083 424727 420270 414633 408698 402796 396897 391087 385668 380815 376431 372375 368565 364816 360903
51242 360903 356923 353368 350706 349129 348788 349808 351769 353474 353803 352810 351742 351899 353606 356189 358727
51227 358727 360813 362724 364909 367294 369259 370339 370771 371152 371705 372134 372171 372049 372377 373649 375901 378724
51211 378724 381513 383719 385003 385412 385602 386727 389726 394536 400071 405019 408597 410666 411480 411449 410950 410128
51195 410128 408905 407153 404810 401874 398423 394605 390503 386201 382158 379164 377507 376427 375019 373493
51181 373493 372808 373096 373352 372896 372259 372160 372437 372682 373228 374651 376680 378438 379582 380525 381694 383190 385049
51164 385049 387222 389388 391360 393556 396457 399727 402484 404369 405673 406482 406493 405783 404997 404459 403717 402334
51148 402334 400525 398620 396337 393174 389288 385565 382885 381564 381319 381551 381751 381914 382497 383821 385577
51133 385577 387011 387648 387814 388497 390530 393792 397261 399954 401714 402919 403772 404294 404845 406037 407983 410007
51117 410007 411287 411608 411447 411574 412481 413906 414933 414958 414515 414774 416186 418090 419685 420875 422026 423365
51101 423365 424845 426252 427260 427726 428045 428813 430003 430918 431131 430959 430842 430780 430699 430799 431114 431175 430648 429951
51083 429951 429739 430132 430961 432510 435315 439269 443502 447249 450567 454161 458746 464493 470844 477009 482912
51068 482912 489468 497579 507020 516678 525711 534048 541910 549411 556723 564120 571538 578326 583667 587177
51054 587177 589045 589728 589571 588769 587693 587113 587775 589661 592032 594382 596965 599994 602754 604139 603951 603035
51038 603035 602168 601340 600256 598957 597720 596711 595949 595332 594556 593287 591535 589565 587313 584318 580524
51023 580524 576776 574122 572714 571816 570832 569940 569582 569659 569558 568898 567890 566812 565421 563231 560269 557195
51007 557195 554687 553079 552587 553242 554325 554530 553327 551784 551384 552318 553657 554934 556620 559077 562053
50992 562053 565490 569950 575776 582607 590271 599403 610473 622819 635551 649009 664260 681346 699044
50979 699044 716465 733855 751421 768309 783535 797499 811813 827836 846046 866771 890798
50968 890798 918940 951374 987808 1028095 1072373 1120626 1172401 1226976 1283588 1341432 1399638
50957 1399638 1457428 1514165 1569083 1621037 1668763 1711397 1748632 1780424 1806774 1827772 1843594
50946 1843594 1854321 1860037 1861271 1859192 1855101 1849769 1843315 1835566 1826385 1815797 1804024 1791304 1777498
50933 1777498 1761976 1744166 1724188 1702665 1679890 1655447 1628705 1599471 1567979 1534428 1498758
50922 1498758 1460861 1420875 1379276 1336812 1294322 1252514 1211834 1172514 1134746 1098825 1065125
50911 1065125 1033900 1005080 978307 953267 929958 908615 889387 872156 856588 842233 828701
50900 828701 815997 804737 795790 789466 785093 781470 777698 773608 769596 766194 763727 762156 761210 760684
50886 760684 760581 760979 761905 763444 765786 768984 772856 777390 783078 790429 799223 808682 818482 829013 840382
50871 840382 851723 862133 872022 882857 895563 909758 924697 940397 957542 976799 998675 1023746
50859 1023746 1052529 1085252 1122147 1163904 1211472 1265469 1326151 1393944 1469599 1553662 1646068
50848 1646068 1746338 1853963 1968483 2089424 2216200 2347738 2482033 2616331 2747994
50839 2747994 2875034 2995708 3107862 3209001 3296836 3369622 3426171 3465922 3488931 3495602 3486725
50828 3486725 3464144 3431152 3391628 3348611 3304012 3259554 3217300 3178960 3145174 3115776 3090319
50817 3090319 3067865 3046534 3023799 2997236 2964791 2924708 2875831 2818003 2751652 2676945 2593823
50806 2593823 2502947 2406117 2305469 2202690 2099350 1997540 1899545 1806860 1719902 1638778
50796 1638778 1564016 1496458 1436682 1384681 1339985 1301923 1269782 1242902 1220744 1202994 1189497
50785 1189497 1179897 1173274 1168284 1163857 1159701 1156064 1153127 1150742 1148556 1146170 1143295 1139967 1136491 1132846
50771 1132846 1128215 1121505 1112408 1101645 1090131 1078305 1066370 1054717 1043681 1033163 1022873 1012848
50759 1012848 1003430 994942 987740 982379 979132 977398 976130 975071 975116 977214 981336 986912 993944 1003186
50745 1003186 1015377 1030784 1049506 1071806 1098010 1128365 1163123 1202478 1246292 1294099 1345572
50734 1345572 1400827 1460087 1523180 1589512 1658403 1729226 1801238 1873456 1944667 2013570 2079069
50723 2079069 2140559 2197736 2249895 2295498 2332703 2360307 2377979 2385711 2383356 2370755 2348122 2316390
50711 2316390 2277519 2234390 2189908 2146024 2103913 2065034 2031344 2004105 1982997 1966881 1954889
50700 1954889 1946165 1938916 1930742 1920029 1906262 1888776 1866010 1836472 1800040 1757761 1710613 1658958
50688 1658958 1603125 1544212 1484341 1426222 1372181 1323224 1279085 1239404 1204715 1176058 1153881
50677 1153881 1137763 1127085 1121393 1120044 1122066 1126769 1134220 1144719 1157955 1173024 1189236 1206539
50665 1206539 1225027 1244309 1263583 1282204 1299982 1317026 1333577 1350007 1366648 1383413 1399762
50654 1399762 1415302 1430400 1445965 1462643 1480359 1498662 1517330 1536625 1557139 1579511 1604211
50643 1604211 1631568 1661949 1695675 1732558 1771708 1812219 1853871 1896683 1939805 1981586 2021049
50632 2021049 2058701 2095385 2130807 2163757 2193362 2219383 2241545 2259491 2273442 2284013 2291057
50621 2291057 2293376 2290140 2282198 2271568 2260057 2248888 2239318 2232832 2230482 2232309 2237442 2244500 2251929
50608 2251929 2258265 2262222 2262505 2257617 2246071 2226781 2199159 2162999 2118525 2066464 2007797 1943426
50596 1943426 1874356 1802173 1729035 1657044 1587761 1522186 1460724 1403048 1348516 1297212 1250308
50585 1250308 1209005 1173200 1141580 1112967 1087168 1064562 1045354 1029482 1016908 1007673 1001772 999169
50573 999169 999778 1003254 1008959 1016345 1025318 1036005 1048271 1061689 1075954 1091105 1107307 1124579 1142759
50560 1142759 1161609 1180857 1200213 1219455 1238614 1258181 1279069 1302034 1326852 1352209 1376662
50549 1376662 1399688 1421646 1442896 1463354 1482958 1502245 1522348 1544579 1569993 1599059 1631720
50538 1631720 1667967 1708436 1754193 1805913 1863467 1926267 1993619 2064859 2139709 2218645 2302339
50527 2302339 2390401 2481215 2573490 2667462 2763892 2862098 2959618 3053708 3142502 3224745 3299055
50516 3299055 3363766 3417125 3457441 3483396 3494403 3490495 3471912 3439123 3393310 3336487 3271066
50505 3271066 3199628 3125083 3050453 2978199 2910143 2848300 2795342 2753751 2724650 2707820 2702568
50494 2702568 2708112 2723115 2745291 2771571 2798543 2822812 2841292 2851289 2850305 2835957 2806412 2760936
50482 2760936 2699910 2624495 2536597 2439027 2335115 2227913 2119862 2013211 1910267 1812931
50472 1812931 1722246 1638661 1562523 1494028 1432896 1378573 1330780 1289556 1254759 1225896 1202473
50461 1202473 1184149 1170386 1160314 1153242 1149072 1147966 1149822 1154350 1161448 1171160 1183494 1198698 1217533
50448 1217533 1240670 1267716 1297305 1328284 1360372 1393464 1426750 1458830 1488333 1514097 1535012
50437 1535012 1550097 1558696 1560539 1555966 1546390 1534150 1521399 1509200 1497877 1487891 1479902 1474215 1470739
50424 1470739 1469415 1470309 1473402 1478811 1487108 1498900 1514144 1532443 1554000 1579646 1609825 1644135
50412 1644135 1682083 1723645 1768725 1816579 1866167 1916682 1967308 2016852 2064076 2108160 2148397
50401 2148397 2183700 2212899 2235396 2251031 2259294 2259064 2249226 2229400 2200095 2162345 2117186 2065370
50389 2065370 2007759 1946064 1882900 1820857 1761696 1706714 1657437 1615327 1580985 1554258 1535183
50378 1535183 1524197 1521225 1525117 1534343 1547821 1564698 1583611 1602594 1619592 1632768 1640502 1641506
50366 1641506 1634982 1620518 1598019 1568065 1532074 1491576 1447287 1399385 1348796 1297531 1247382
50355 1247382 1198823 1151760 1106990 1066123 1030094 998465 970333 945344 923557 904936 889430
50344 889430 877116 867778 860586 854617 849546 845507 842570 840789 840426 841564 843657 846105 849207 853875
50330 853875 860342 867781 875430 883451 892374 902192 912451 922946 933918 945689 958368 971753 985388
50317 985388 998879 1012368 1026455 1041585 1057769 1075073 1094087 1115716 1140739 1169797 1203519
50306 1203519 1242330 1286153 1334249 1385136 1436708 1486888 1534303 1577857 1615461 1643711 1659253
50295 1659253 1660196 1646169 1617897 1577492 1528583 1475198 1420394 1366342 1315220 1268997 1228288 1192336
50283 1192336 1160417 1132742 1109734 1091125 1076242 1064904 1057568 1054671 1056050 1060904 1068183 1077094
50271 1077094 1087243 1098300 1109699 1120972 1132198 1143629 1154816 1164613 1172259 1178064 1182792 1186678
50259 1186678 1189420 1190871 1191266 1190750 1189059 1185789 1180828 1174431 1167017 1159001 1150741 1142441 1134054 1125413
50245 1125413 1116575 1107890 1099481 1090745 1080675 1068746 1055228 1040628 1025261 1009568 994381 980357
50233 980357 967356 954795 942539 931054 920775 911685 903429 895539 887628 879667 871958 864453 856301
50220 856301 846647 835864 825441 816465 808702 801383 794378 788197 783111 778749 774579 770559 767189 764944
50206 764944 763644 762497 760852 758769 756702 754763 752586 749825 746549 743201 740412 738661 737791 736980 735516
50191 735516 733408 730904 727776 723736 719307 715468 712459 709724 707077 704937 703256 701196 698374 695529
50177 695529 693336 691353 688908 686323 684390 683150 682162 681660 682451 684819 688420 693231 699647 707594 716442
50162 716442 726096 737464 751512 768430 787946 809813 833548 858303 883581 909824 937773 967358
50150 967358 997556 1027130 1055222 1081352 1105299 1126979 1146138 1162114 1174098 1181648 1184785 1183599
50138 1183599 1178002 1167970 1153847 1136173 1115266 1091249 1064739 1037287 1010749 986034 962722
50127 962722 940053 918029 897286 878243 860895 845357 832014 820900 811347 802522 794111 786325
50115 786325 779533 774161 770703 769363 769650 770623 771636 772695 774078 775830 777778 779918 782519 785681 788851
50100 788851 790923 791000 789050 785804 782045 778147 774206 770326 766622 763168 760184 758140 757386 757665 758313
50085 758313 759089 760530 763287 767239 771574 775663 779563 783618 787962 792613 797757 803495 809414 814826
50071 814826 819491 823748 827824 831358 833915 835671 837218 838780 840030 840717 841106 841589 842076 842048 841152 839596
50055 839596 837950 836722 836108 835935 835713 834941 833687 832957 834233 838358 844903 852802 861614 872022 885084
50040 885084 901176 919646 939349 959495 980144 1001895 1024977 1048694 1072040 1094783 1117514
50029 1117514 1140448 1162674 1182890 1200460 1215218 1226610 1233833 1236860 1236526 1233312 1226656 1215889
50017 1215889 1201375 1184076 1164249 1141284 1114893 1085879 1055576 1024986 994808 965872 939039
50006 939039 914687 892684 872924 855614 840987 829050 819765 813257 809613 808554 809419 811385 813662
49993 813662 815741 817666 819810 822050 823318 822403 819164 814468 808834 801644 791988 779891 766309 752209
49979 752209 738189 724841 712906 702813 694314 686790 679840 673518 668111 663710 659931 656147 652118
49966 652118 648252 645002 642149 639076 635742 632964 631595 631776 633183 635620 638978 642898 647001 651451
49952 651451 656855 663461 670787 678138 685208 691940 698109 703424 707956 712102 715988 719171 721073 721528
49938 721528 720725 718761 715582 711370 706679 701940 696917 690926 683687 675821 668368 661842 655935 650156
49924 650156 644535 639538 635457 632240 629914 628739 628695 629117 629306 629448 630516 633173 637056 641244 645220
49909 645220 649209 653863 659777 667124 675452 683939 692123 700387 709476 719487 729585 738826 747066 754816
49895 754816 762264 768748 773301 775587 776038 775101 772648 768291 762100 754726 746823 738536 729597 719823 709543
49880 709543 699546 690512 682400 674582 666824 659882 654746 651380 648725 645972 643351 641515 640764 641206 643134
49865 643134 646640 651128 655869 660991 667304 675137 683847 692687 701640 711063 720889 730621 739974 749035
49851 749035 757703 765363 771399 775856 779286 781932 783389 783173 781381 778493 774714 769825 763621 756185
49837 756185 747773 738885 730476 723569 718348 713981 709676 705580 702322 700043 698434 697501 697624 698779 700230
49822 700230 701292 702129 703615 706622 711490 717938 725243 732612 739522 745722 751035 755384 758986 762223
49808 762223 765170 767459 768788 769383 769725 769906 769508 768186 766137 763808 761255 758039 753810 748715 743050
49793 743050 736729 729471 721367 712898 704360 695747 687335 679899 674042 669626 666152 663365 661187 659416
49779 659416 657950 657175 657659 659582 662707 666704 671193 675781 680548 686254 693420 701379 708907 715713 722524
49764 722524 729605 736064 741032 744812 748234 751283 753062 752966 751299 748640 745070 740386 734944 729908 726339
49749 726339 724025 721572 717873 713320 709298 706740 705581 705386 705891 706863 708008 709204 710496 711848 713330
49734 713330 715519 719081 723777 728548 732920 737702 743800 750853 757630 763487 768840 774462 780932 788689
49720 788689 797964 808471 819486 830354 840669 849995 857778 863689 867813 870301 870910 869057 864439
49707 864439 857592 849773 842227 835675 830584 827553 826954 828300 830463 832665 834835 836942 838502 838918 837889
49692 837889 835366 831705 828079 825987 825836 826656 827792 830227 835373 843110 852196 862462 875376 892097
49678 892097 911876 932836 953589 973585 992436 1009642 1024824 1037652 1047514 1053583 1055368 1053178
49666 1053178 1048146 1041883 1035925 1031287 1028392 1027295 1027883 1029902 1032830 1035597 1036426 1033366 1025403 1012986
49652 1012986 997195 978712 957989 936159 914938 895486 877947 862357 849431 840050 834253 831160
49640 831160 829721 829258 829416 829862 830067 829399 827585 825040 822421 819717 816089 810779 803843 795919 787636
49625 787636 779518 771999 765060 758109 750746 743529 737555 733290 730228 727684 725465 723670 722292 721281
49611 721281 720808 721140 722291 723922 725564 726905 727958 728907 729737 730102 729712 728821 728043 727696 727585 727447 727293
49594 727293 727112 726668 725916 725367 725594 726449 727179 727307 727050 726833 726831 727083 727704 728789 730370 732616 735691 739217
49576 739217 742292 744463 746406 749220 753284 758289 764147 771281 779999 790131 801306 813062 824652
49563 824652 835304 844855 853593 861378 867480 871549 874081 875531 875551 873642 870101 865674 860654 855012
49549 855012 849183 843965 839685 836122 833256 831444 830721 830503 830211 829802 829508 829470 829781 830623 832165 834586
49533 834586 838320 844010 852079 862568 875425 890671 908209 927729 948957 971700 995490 1019351
49521 1019351 1042107 1062860 1081109 1096579 1109022 1118226 1124262 1127769 1129738 1130849 1131287 1131437 1132348
49508 1132348 1134883 1138566 1141886 1143712 1143678 1141219 1135179 1124906 1111150 1095327 1078300 1060437 1042493
49495 1042493 1025749 1011198 998974 988601 979612 971899 965632 960885 957421 954998 953761 953900 954940
49482 954940 955903 956425 957163 958725 960661 961993 962426 962478 962613 962797 962845 962726 962503 962382 962908 964729 968034 972328
49464 972328 976814 980912 984504 987885 991465 995416 999629 1003943 1008208 1012044 1014907 1016545 1017068 1016361 1013881
49449 1013881 1009417 1003713 997854 992337 987163 982602 979183 977030 975781 975204 975386 976291 977668 979552 982399
49434 982399 986549 991867 998062 1005033 1012789 1021309 1030740 1041590 1054528 1069937 1087413 1105590 1122715
49421 1122715 1137846 1151407 1164248 1176257 1186240 1192974 1195909 1195005 1190581 1183537 1175269 1167206 1160758
49408 1160758 1157550 1158874 1164624 1173337 1183719 1195762 1210064 1226505 1244048 1261521 1278160 1293609
49396 1293609 1307788 1320762 1332523 1342908 1351751 1358826 1363665 1365764 1365137 1362207 1357058 1349298 1338909
49383 1338909 1326691 1313421 1299091 1283486 1267040 1250470 1233901 1217114 1200604 1185700 1173526
49372 1173526 1164268 1157479 1152596 1149102 1146585 1144857 1143842 1143334 1143014 1142548 1141471 1139227 1135646 1131154 1126062
49357 1126062 1119946 1112213 1103119 1093622 1084375 1075555 1067635 1061495 1057513 1055261 1054451 1055618 1059469 1065948
49343 1065948 1074261 1083436 1092590 1101113 1108959 1116415 1123233 1128297 1130475 1129474 1125558 1118907 1109709 1098600
49329 1098600 1086419 1073691 1060749 1048187 1036660 1026370 1017154 1008939 1001588 994471 986813 978595
49317 978595 970526 963014 955710 948347 941463 935773 931200 927142 923686 921931 922829 926011 930156 934454
49303 934454 939328 945594 953238 961388 969334 977110 985007 992875 1000125 1006117 1010369 1012687 1013444 1013490 1013429
49288 1013429 1013064 1011840 1009681 1007075 1004488 1002020 999606 997186 994736 992444 990805 990204 990505 991424 993221
49273 993221 996405 1000702 1004858 1007783 1009527 1010906 1012434 1013860 1014496 1013810 1011939 1009749 1008173 1007441 1007317
49258 1007317 1008154 1011126 1017062 1025514 1035429 1046319 1058218 1070769 1083012 1094035 1103326 1110478 1115060
49245 1115060 1116868 1115937 1112236 1105766 1097058 1087248 1077537 1068798 1061662 1056496 1053153 1051152 1050359 1051205 1054037
49230 1054037 1058513 1063928 1069848 1076118 1082479 1088567 1094268 1099746 1105163 1110627 1116357 1122567 1129122 1135540
49216 1135540 1141486 1147059 1152542 1158025 1163390 1168462 1173066 1177149 1181106 1185853 1192245 1200386 1209729 1219918
49202 1219918 1231257 1244152 1258302 1272778 1286875 1300609 1314270 1327687 1340162 1351136 1360709
49191 1360709 1369361 1377192 1383664 1388303 1391609 1394996 1399667 1405717 1412514 1419727 1427659 1436704 1447059 1459110
49177 1459110 1473708 1491643 1513086 1537759 1565397 1595648 1627667 1660298 1692673 1724194 1753791
49166 1753791 1779630 1799952 1814104 1822517 1825896 1824831 1820163 1813290 1805764 1798664 1792485 1787430 1783526
49153 1783526 1780531 1778122 1776315 1775490 1775867 1777227 1779382 1782682 1787715 1794613 1802966 1812390 1822806 1834130
49139 1834130 1846146 1858783 1872200 1886379 1900965 1915732 1930916 1946785 1963143 1979576 1996031
49128 1996031 2012823 2030118 2047698 2065209 2082485 2099744 2117704 2137410 2159679 2184791 2212942
49117 2212942 2244914 2282079 2325948 2378177 2440977 2516967 2608093 2714663 2835672 2970352 3119603
49106 3119603 3285635 3469259 3666459 3867428 4059834 4234218 4387080 4519122 4630348
49097 4630348 4716284 4768408 4778444 4743161 4666008 4554858 4418343 4263761 4097011 3923209
49087 3923209 3747081 3573256 3406408 3250865 3109915 2985477 2878136 2787142 2710660 2646688
49077 2646688 2593882 2551124 2516474 2487308 2461630 2438713 2418291 2399859 2383161 2368665 2356844
49066 2356844 2347320 2339278 2332464 2327189 2323477 2320829 2318844 2317560 2317160 2317751 2319476 2322432 2326283 2330303
49052 2330303 2333940 2337090 2339671 2341175 2340861 2338270 2333420 2326725 2318976 2311265 2304575 2299273 2295165 2292085
49038 2292085 2290293 2290174 2291755 2294782 2299157 2305003 2312255 2320498 2329216 2337809 2345253 2350311 2352571 2352919
49024 2352919 2352463 2351294 2348902 2345563 2342464 2340389 2339101 2338235 2338050 2338826 2340144 2341352 2342456 2344099 2346903
49009 2346903 2351165 2356822 2363260 2369473 2374870 2379827 2385089 2390859 2396791 2402577 2408133 2413417 2418518 2423737
48995 2423737 2429083 2433895 2437404 2439530 2440689 2441040 2440486 2439284 2438004 2436897 2435875 2435126 2435082 2435609 2435812 2434956
48979 2434956 2433138 2430791 2427972 2424503 2420454 2416111 2411620 2406925 2401914 2396423 2390308 2383757 2377434 2372096
48965 2372096 2368100 2365397 2363858 2363523 2364594 2367287 2371629 2377429 2384556 2393212 2403693 2415916 2429462
48952 2429462 2444072 2459745 2476239 2492907 2509338 2525886 2543269 2561734 2580834 2599857 2618296
48941 2618296 2636128 2653971 2672855 2693428 2715382 2737925 2760955 2785434 2812523 2842528 2874843
48930 2874843 2908752 2944039 2980947 3019844 3060978 3104297 3149376 3195597 3242553 3290137 3338232
48919 3338232 3386524 3434875 3483689 3533485 3584056 3634440 3683785 3731923 3778913 3824428 3867908
48908 3867908 3909121 3948207 3985234 4020030 4052448 4082596 4110767 4137197 4161805 4184179 4204048
48897 4204048 4221866 4238577 4254644 4269641 4282996 4294685 4304758 4312629 4317537 4319493 4319133 4316694
48885 4316694 4311841 4304465 4294930 4283316 4269066 4251674 4231235 4208014 4181956 4152969 4121297 4087235
48873 4087235 4050754 4011714 3970153 3926069 3879252 3829846 3778905 3727927 3677742 3628139 3578608
48862 3578608 3529241 3480809 3434097 3389303 3346193 3304785 3265627 3229221 3195368 3163461 3133312
48851 3133312 3105302 3079771 3056747 3036339 3018863 3004331 2992227 2981986 2973439 2966667 2961884 2959640
48839 2959640 2960612 2964779 2971220 2979056 2988222 2998998 3011303 3025002 3040452 3058027 3077265 3097126
48827 3097126 3116959 3136707 3156347 3175793 3195349 3215608 3236780 3258635 3281116 3304370 3328040
48816 3328040 3351135 3372949 3393698 3413977 3434026 3453846 3473647 3493674 3513784 3533635 3553228
48805 3553228 3572999 3593435 3614795 3637132 3660347 3684247 3708685 3733535 3758394 3782500 3805257
48794 3805257 3826728 3847355 3867169 3885546 3901707 3915240 3926159 3934827 3941956 3948259 3953761 3957641
48782 3957641 3959058 3958007 3954983 3949916 3941936 3930342 3915351 3897588 3877129 3853479 3826361 3796186
48770 3796186 3763729 3729569 3693804 3656084 3616034 3573951 3530999 3488376 3446349 3404456 3362543
48759 3362543 3321058 3280322 3240183 3200738 3162839 3127351 3094269 3062997 3033231 3005033 2978290
48748 2978290 2952740 2928538 2906215 2885939 2867266 2849782 2833611 2819122 2806514 2795943 2787730
48737 2787730 2782038 2778416 2775937 2773859 2772056 2770894 2770815 2772008 2774360 2777720 2782248 2788355 2796155 2805025
48723 2805025 2813983 2822546 2831031 2839889 2848956 2857580 2865317 2872124 2877880 2882253 2885344 2888090 2891444 2895230
48709 2895230 2898256 2899645 2899684 2899290 2899086 2899225 2899748 2900785 2902473 2904927 2908217 2912289 2917019 2922430 2928666
48694 2928666 2935759 2943641 2952429 2962265 2972716 2982761 2991778 3000309 3009524 3020134 3032212 3045812 3061276
48681 3061276 3079018 3099503 3123579 3152609 3188210 3231994 3285382 3349313 3424011 3509113 3603864
$$ [...]
##END NTUPLES=NMR SPECTRUM
##END=
