##TITLE=AC1621_CTIAN13352_8326002_7VyrGmWWVK
##JCAMPDX= 6.0         $$ Bruker NMR JCAMP-DX V2.0
##DATA TYPE= NMR SPECTRUM
##DATA CLASS= NTUPLES
##ORIGIN= BRUKER
##OWNER= Administrator
$$ 1.72 TOPSPIN		Version 2.1
$$ 2013-11-13 16:51:56.430 -0800  Administrator@X
$$ Compression mode = diff/dup
##.OBSERVE FREQUENCY= 400.02188249412
##.OBSERVE NUCLEUS= ^1H
##.ACQUISITION MODE= SIMULTANEOUS (DQD)
##.ACQUISITION SCHEME= undefined
##.AVERAGES= 8
##.DIGITISER RES= 22
##SPECTROMETER/DATA SYSTEM= spect
##.PULSE SEQUENCE= zg30
##.SOLVENT NAME= COFFEE_meoh
##.SHIFT REFERENCE= INTERNAL, COFFEE_meoh, 1, 14.98509
##AUDIT TRAIL= $$ (NUMBER, WHEN, WHO, WHERE, PROCESS, VERSION, WHAT)
$$ ##TITLE= Audit trail, TOPSPIN		Version 2.1
$$ ##JCAMPDX= 5.01
$$ ##ORIGIN= Bruker BioSpin GmbH
$$ ##OWNER= Administrator
$$ $$ E:\/data/COFFEE/nmr/AC1621_CTIAN13352_8326002_7VyrGmWWVK/10/pdata/1/auditp.txt
$$ ##AUDIT TRAIL=  $$ (NUMBER, WHEN, WHO, WHERE, PROCESS, VERSION, WHAT)
(   1,<2013-11-13 16:51:49.633 -0800>,<Administrator>,<X>,<go>,<TOPSPIN 2.1>,
      <created by zg
	started at 2013-11-13 16:50:43.195 -0800,
	POWCHK enabled, PULCHK disabled,
       configuration hash MD5:
       C8 4E 4E 5D D3 5C D8 9E 9F 52 82 E0 59 8A DE 15
       data hash MD5: 64K
       D9 25 C4 0A D5 A0 D1 53 67 8A 77 FE 32 FC CF 6C>)
(   2,<2013-11-13 16:51:52.586 -0800>,<Administrator>,<X>,<proc1d>,<TOPSPIN 2.1>,
      <Start of raw data processing
       efp LB = 0 FT_mod = 6 PKNL = 1 PHC0 = 0 PHC1 = 0 SI = 32K 
       data hash MD5: 32K
       F3 00 CC C8 A5 69 BA 79 3F 89 02 99 A8 95 9C FF>)
(   3,<2013-11-13 16:51:52.961 -0800>,<Administrator>,<X>,<proc1d>,<TOPSPIN 2.1>,
      <pk PHC0 = 95.09766 PHC1 = 0 
       data hash MD5: 32K
       4B CD 0C 0F 33 76 A3 E1 28 E2 3B 6A F6 EB 6E E8>)
(   4,<2013-11-13 16:51:53.117 -0800>,<Administrator>,<X>,<proc1d>,<TOPSPIN 2.1>,
      <abs ABSG = 1 
       data hash MD5: 32K
       7E 56 E7 AA 87 59 36 C8 7B A9 10 7D FC 90 B6 B3>)
(   5,<2013-11-13 16:51:53.195 -0800>,<Administrator>,<X>,<proc1d>,<TOPSPIN 2.1>,
      <abs ABSG = 2 
       data hash MD5: 32K
       86 F1 D6 CD B4 B5 65 F6 F1 D6 59 53 EA FA A2 82>)
(   6,<2013-11-13 16:51:53.242 -0800>,<Administrator>,<X>,<proc1d>,<TOPSPIN 2.1>,
      <abs ABSG = 3 
       data hash MD5: 32K
       BD 41 E9 3B 56 09 6B A7 01 0D 90 A3 D1 7E 6E 66>)
(   7,<2013-11-13 16:51:53.305 -0800>,<Administrator>,<X>,<proc1d>,<TOPSPIN 2.1>,
      <abs ABSG = 4 
       data hash MD5: 32K
       E0 1C 3B 12 4C 78 4F B7 97 78 19 44 8D 8A 98 56>)
(   8,<2013-11-13 16:51:53.367 -0800>,<Administrator>,<X>,<proc1d>,<TOPSPIN 2.1>,
      <abs ABSG = 5 
       data hash MD5: 32K
       12 D1 DB 51 83 92 0E D7 3B FD 04 53 66 AC B4 3C>)
$$ ##END=
$$ 
$$ $$ hash MD5
$$ $$ 1E 72 DD 93 CB EA 15 1F B1 89 95 08 58 6B 50 11
##$RELAX= 
##$RELAX= 
##$RELAX= 
##$RELAX= 
##$RELAX= 
##$RELAX= 
##$RELAX= 
$$ Bruker specific parameters
$$ --------------------------
##$DU= <E:\>
##$EXPNO= 10
##$NAME= <AC1621_CTIAN13352_8326002_7VyrGmWWVK>
$$ [...]
150 150 150 150 150 150 150 150
##$TP07= 0
##$TPNAME0= <>
##$TPNAME1= <>
##$TPNAME2= <>
##$TPNAME3= <>
##$TPNAME4= <>
##$TPNAME5= <>
##$TPNAME6= <>
##$TPNAME7= <>
##$TPOAL= (0..7)
0.5 0.5 0.5 0.5 0.5 0.5 0.5 0.5
##$TPOFFS= (0..7)
0 0 0 0 0 0 0 0
##$TUNHIN= 0
##$TUNHOUT= 0
##$TUNXOUT= 0
##$USERA1= <user>
##$USERA2= <user>
##$USERA3= <user>
##$USERA4= <user>
##$USERA5= <user>
##$V9= 5
##$VALIST= <valist>
##$VCLIST= <CCCCCCCCCCCCCCC>
##$VD= 0
##$VDLIST= <DDDDDDDDDDDDDDD>
##$VPLIST= <PPPPPPPPPPPPPPP>
##$VTLIST= <TTTTTTTTTTTTTTT>
##$WBST= 1024
##$WBSW= 4
##$XGAIN= (0..3)
0 0 0 0
##$XL= 0
##$YL= 0
##$YMAX_a= 632315
##$YMIN_a= -538279
##$ZGOPTNS= <>
##$ZL1= 120
##$ZL2= 120
##$ZL3= 120
##$ZL4= 120
##$ABSF1= 14.98509
##$ABSF2= -5.573092
##$ABSG= 5
##$ABSL= 3
##$ALPHA= 0
##$AQORDER= 0
##$ASSFAC= 0
##$ASSFACI= 0
##$ASSFACX= 0
##$ASSWID= 0
##$AUNMP= <proc_prof1d_extract_pilot.lims>
##$AXLEFT= 0
##$AXNAME= <>
##$AXNUC= <1H>
##$AXRIGHT= 0
##$AXTYPE= 0
##$AXUNIT= <>
##$AZFE= 0.1
##$AZFW= 0.1
##$BCFW= 0
##$BC_mod= 0
##$BYTORDP= 0
##$COROFFS= 0
##$CY= 15
##$DATMOD= 1
##$DC= 0
##$DFILT= <>
##$DTYPP= 0
##$F1P= 0
##$F2P= 0
##$FCOR= 0.5
##$FTSIZE= 32768
##$FT_mod= 6
##$GAMMA= 0
##$GB= 0
##$INTBC= 1
##$INTSCL= 1
##$ISEN= 128
##$LB= 0
##$LEV0= 0
##$LPBIN= 0
##$MAXI= 10000
##$MC2= 0
##$MEAN= 0
##$ME_mod= 0
##$MI= 0
##$NCOEF= 0
##$NC_proc= -8
##$NLEV= 6
##$NOISF1= 0
##$NOISF2= 0
##$NSP= 0
##$NTH_PI= 0
##$NZP= 0
##$OFFSET= 14.98509
##$PC= 1
##$PHC0= 95.09766
##$PHC1= 0
##$PH_mod= 1
##$PKNL= yes
##$PPARMOD= 0
##$PPDIAG= 0
##$PPIPTYP= 0
##$PPMPNUM= 2147483647
##$PPRESOL= 1
##$PSCAL= 4
##$PSIGN= 0
##$PYNMP= <proc.py>
##$REVERSE= no
##$SF= 400.02
##$SI= 32768
##$SIGF1= 0
##$SIGF2= 0
##$SINO= 400
##$SIOLD= 32768
##$SPECTYP= <>
##$SREGLST= <1H.CDCl3>
##$SSB= 0
##$STSI= 32768
##$STSR= 0
##$SW_p= 8223.68421052631
##$SYMM= 0
##$S_DEV= 0
##$TDeff= 65536
##$TDoff= 0
##$TI= <>
##$TILT= no
##$TM1= 0
##$TM2= 0
##$TOPLEV= 0
##$USERP1= <user>
##$USERP2= <user>
##$USERP3= <user>
##$USERP4= <user>
##$USERP5= <user>
##$WDW= 1
##$XDIM= 32768
##$YMAX_p= 452541512
##$YMIN_p= -805928
##$CURPLOT= <Network HP LaserJet P1505>
##$CURPRIN= <$Network HP LaserJet P1505>
##$DFORMAT= <normdp>
##$LAYOUT= <+/1D_H.xwp>
##$LFORMAT= <normlp>
##$PFORMAT= <normpl>
##$SURQMSG= 1
$$ End of Bruker specific parameters
$$ ---------------------------------
##NTUPLES= NMR SPECTRUM
##VAR_NAME=  FREQUENCY,     SPECTRUM/REAL,   SPECTRUM/IMAG
##SYMBOL=    X,             R,               I
##VAR_TYPE=  INDEPENDENT,   DEPENDENT,       DEPENDENT
##VAR_FORM=  AFFN,          ASDF,            ASDF
##VAR_DIM=   32768,         32768,           32768
##UNITS=     HZ,            ARBITRARY UNITS, ARBITRARY UNITS
##FACTOR=    0.250966925370066, 1,           1
##FIRST=     8223.43324360094, -295279,      -94835
##LAST=      0,             -166704,         -118994
##MIN=       0,             -805928,         0
##MAX=       8223.43324360094, 452541512,    0
$$ Real data points
##PAGE= N=1
##DATA TABLE= (X++(R..R)), XYDATA
$$ [...]
$$ plain form
19555 240112 184945 216456 -286066 14079 -277473 3010 -315245 87855 -200829 -233888 73137
19543 -21651 -374129 13199 109183 -156472 52872 -35671 92778 -159088 32024 133472 262613
19532 262613 26421 149209 50796 -133175 -90460 -153518 55818 -31713 -79633 -110183 -65851
19521 -65851 55296 87418 -289224 -82266 177941 -297306 -142645 -240561 24553 -27863 371072
19509 -299454 186977 -190030 -48313 -222641 -3729 -381714 135962 -4170 -77593 -177157 377838
19497 -205926 286654 -30322 -71255 198657 198339 -130347 -318412 168855 -167306 161618
19486 -289579 -206192 12554 -103229 -15897 -131692 143002 -124169 -282996 -168472 -212220
19476 -212220 -250233 -70395 -230747 -182425 189140 -173626 5715 -247508 -5764 -306557 12374
$$ packed form
19555B40112n5167L1511b86066A4079b77473C010c15245H7855b00829l3059G3137
19543b1651l52478A3199R5984a56472E2872c5671I2778a59088C2024J01448J29141
19532B62613B6421J22788E0796a33175M2715o3058E5818c1713m7920l0550M4332
19521f5851E5296L2122b89224h2266A77941b97306a42645r7916B4553b7863C71072
19509b99454A86977a90030d8313j74328c729l77985A35962d170p3423r9564C77838
19497b05926B86654c0322m0933A98657l18a30347j88065A68855a67306A61618
19486b89579Q3387A2554a03229a5897j15795A43002a24169j58827J14524m3748
19476b12220l8013g0395j60352M8322A89140a73626E715b47508e764l00793A2374
$$ plain form
19464 -45029 -47680 328759 -302542 139600 -216719 -187747 147209 -221535 -229367 84523 205360
19453 205360 66862 118079 -124615 131960 299478 -208939 26250 187201 20517 -186421
19442 187464 -64920 -286776 -159300 3707 244496 -224958 8999 -148024 171414 54932 -173545
19430 21892 132856 127198 -216704 -60498 -50923 -231613 2080 168187 280606 275988 98861
19418 -3590 -322360 -294970 -101562 -251745 -273899 13525 -61088 57641 -44828 -275128 141417
19406 219642 39818 -336847 318270 -51176 -239142 137208 -199838 -41802 -365988 284445
19395 -405282 5372 181370 31762 122368 91128 -145736 158350 1219 198613 -77990 -130248
19384 -130248 -19827 156226 73579 -327050 -174929 14261 -50198 -156562 -266025 -115046
$$ packed form
19464d5029k651C28759c02542A39600b16719K8972A47209b21535p832H4523J20837
19453B05360F6862N1217a24615A31960J67518b08939B6250J60951B0517a86421
19442A87464f4920k21856J27476C707K40789b24958H999a48024A71414E4932a73545
19430B1892J10964n658b16704f0498R575j80690B080J66107J12419m618I8861
19418c590l18770K7390a01562j50183k2154A3525f1088E7641d4828k30300A41417
19406B19642C9818c36847C18270e1176j87966A37208a99838d1802l24186B84445
19395d05282E372J75998C1762R0606l1240a45736A58350A219J97394g7990n2258
19384a30248a9827A56226G3579c27050J52121A4261e0198j06364j09463a15046
$$ plain form
19373 20143 -204172 -225946 100313 -288530 38185 38593 -70996 109357 -67438 113198 102725
19362 102725 299557 -105370 152606 -88711 197965 -566629 -195008 -188763 1438 -262966
19351 -8060 -8318 -194204 -109506 157469 -247088 358594 -250494 -290082 -72390 -175212 -255765
19340 -255765 -348778 -82682 -117550 -19984 -131271 -96259 -75833 233877 -441841 237097 215003
19329 215003 -73717 -198589 -68401 119175 -166492 156221 -60584 122376 -87250 129340
19318 -100658 6017 -107812 11329 -380772 -21605 43202 -567284 84894 -372990 176915 228245
19307 228245 106748 -71506 86296 -74967 -191327 -157234 261066 -324571 -196919 -316055
19297 -316055 -243159 -86536 -176423 -144078 -272542 -163492 89294 -370571 -134646 -377594
$$ packed form
19373B0143b04172k1774A00313b88530C8185M08g0996A09357f7438A13198j0473
19362A02725J96832a05370A52606h8711A97965e66629a95008O245A438b62966
19351h060k58j85886Q4698A57469b47088C58594b50494l9588g2390j02822q0553
19340b55765r3013h2682l4868a9984j11287L5012K0426B33877d41841B37097k2094
19329B15003g3717j24872f8401A19175a66492A56221f0584A22376h7250A29340
19318a00658F017a07812A1329c80772b1605D3202e67284H4894c72990A76915N1330
19307B28245A06748g1506H6296g4967j16360L4093B61066c24571J27652j19136
19297c16055P2896h6536q9887L2345j28464J09050H9294c70571a34646k42948
$$ plain form
19287 -377594 -89799 -32090 -179273 -102278 159617 -187081 -107181 43328 -142954 59134 39943
19276 39943 54515 106704 -39311 -102180 -223750 75220 -94282 -461 -252582 95520 -11240 93907
19263 -25378 -416217 -86381 -174082 -16929 37328 -286971 -327459 -2333 41128 125155 -118848
19251 3156 143097 -490304 -62785 24173 -69994 328885 -149647 -175485 -96394 -32045 301073
19239 -78147 64816 17864 59087 -91971 -353503 -203066 418518 -36138 -78800 -38378 -18236
19227 -37830 183663 -136360 -93336 -108008 63404 -24766 -148058 106080 -173464 123542
19216 -277938 -363620 -49924 153458 113718 29422 18422 -70923 -74915 -265241 -43291 -99106
19205 -99106 -112270 1381 52889 -69790 -151645 180466 -92910 95387 -275027 -229895 -26699
$$ packed form
19287c77594h9799c2090j47183P6995A59617a87081P9900D3328a42954E9134j9191
19276C9943J4572N2189c9311o2869j21570G5220i4282d61k52121I5520a1240I3907
19263b5378l90839h6381q7701a6929C7328b86971m0488b333D1128Q4027a18848
19251C156J39941d90304f2785B4173f9994C28885a49647k5838P9091c2045C01073
19239g8147F4816A7864M1223i1971k61532J50437D18518c6138m2662c8378a8236
19227c7830A83663a36360M3024j4672F3404b4766j23292A06080a73464A23542
19216b77938q5682d9924A53458l9740B9422j1000g0923l992j90326d3291n5815
19205i9106j3164A381N1508f9790q1855A80466i2910I5387b75027M5132b6699
$$ plain form
19193 -170801 -40149 -55762 -213744 68706 -29574 18056 -303249 -158468 161980 -131805
19182 21914 -425394 83829 -14673 -149830 -117969 135548 105570 -24968 -286394 426898 -308499
19170 -244684 -125995 -141884 -85711 -135051 -71402 267243 -15781 163272 220422 -186034 134833
19158 -54332 -136627 -102411 -131578 -1922 156169 23947 -199180 155655 -237723 195727 102548
19147 102548 -216161 29481 -7337 -109323 -355203 8667 7342 -4792 234999 135483 24274
19135 13372 108184 -165255 -299818 -14165 -79806 236105 -291307 -73251 -212683 -3449 280011
19123 25884 -513529 -315845 -275108 -64156 -170216 43739 -277716 -298469 74599 289485 -40782
19111 -5973 54155 33768 -150350 111298 -188906 -206827 -268363 -147068 64204 -17482 165000
$$ packed form
19193a70801d0149j5613j57982F8706b9574A8056c03249J44781A61980a31805
19182B1914d25394H3829a4673j35157L1861A35548k9978b4968k61426D26898c08499
19170b44684J18689j5889N6173m9340O3649B67243a5781A63272N7150a86034A34833
19158e4332q2295L4216k9167a922A56169B3947a99180A55655b37723A95727r3179
19147A02548b16161B9481g337j01986k45880H667j325d792B34999r9516B4274
19135A3372R4812a65255j34563a4165o5641B36105b91307g3251j39432c449B80011
19123B5884e13529J97684M0737f4156j06060D3739b77716k0753G4599K14886d0782
19111e973E4155k0387a50350A11298a88906j7921o1536J21295F4204a7482A65000
$$ plain form
19099 116360 -100725 289944 -64230 -140686 -93605 -172107 267853 271398 -90168 -73593 -41942
19088 -41942 -79283 146466 -440274 -144199 25624 142362 48973 47550 -28511 -261630 12585
19076 -98277 5975 -106216 -262710 8434 245305 -29404 53572 76040 -21175 -172034 29562
19064 105254 -397805 -445576 -112691 -172586 78074 62875 17074 -147791 -8220 -85617 223556
19052 -137478 19720 -53171 -179052 -54700 -175199 244908 -70480 193211 -233039 -56968
19041 44442 -19238 -39076 -187960 -156940 -161506 -181869 58496 56431 -147727 -147858 -185495 -321216
19029 -321216 31958 178524 137615 -14614 31060 -126131 -58129 -289547 -32015 86600 10456
19017 -465417 152399 388350 -20140 -233101 -124554 -211289 -52347 -154658 -13446 -390988
$$ packed form
19099A16360a00725B89944f4230p6456M7081p8502B67853L545i0168J6575L1651
19088d1942l7341A46466d40274a44199B5624J16738D8973j423b8511k33119A2585
19076i8277E975a06216j56494H434K36871b9404E3572K2468b1175j50859B9562
19064A05254c97805m7771a12691n9895G8074j5199A7074a47791h220p7397B23556
19052a37478A9720e3171j25881e4700j20499B44908g0480A93211b33039e6968
19041D4442a9238j9838j48884L1020m566k0363E8496k065a47727j31l7637j35721
19029c21216C1958J46566m0909a4614C1060a26131e8129k31418c2015H6600A0456
19017d65417A52399K35951b0140k12961J08547q6735e2347j02311a3446l77542
$$ plain form
19007 -390988 -182553 29186 15396 296818 -131376 208622 88792 -204851 78193 -244745
18996 -333272 -166866 -92501 -106016 -230662 206345 -22031 59283 -60365 -244406 -16208 -107207
18985 -107207 202062 26900 -47703 139040 -141479 -230106 82361 -187441 -72426 -181758
18975 -181758 66745 -115499 -129767 66090 -57477 -213434 -108909 128008 -106468 -57428
18965 -57428 79753 -178247 -71476 132810 -180723 19731 200522 -346995 329930 94214
18954 -238453 -279729 66126 -184391 -46720 109831 -71305 123035 -155261 -268237 -5134 -46004
18943 -46004 77901 184869 -163432 -114968 58755 180289 -147557 -94321 -45462 84455 -56512
18931 -290189 -110020 40228 103789 -279981 262153 113564 -113721 258829 -145110 -39011
$$ packed form
19007c90988a82553B9186j3790K81422a31376B08622H8792b04851G8193b44745
18996c33272J66406P4365j3515j24646B06345b2031E9283f0365j84041a6208r0999
18985a07207B02062B6900d7703A39040a41479q8627H2361a87441g2426j09332
18975a81758F6745a15499j4268F6090e7477j55957J04525A28008a06468M9040
18965e7428G9753a78247g1476A32810a80723A9731J80791c46995C29930I4214
18954b38453m1276F6126a84391d6720A09831g1305A23035a55261j12976e134m0870
18943d6004G7901J06968a63432M8464E8755J21534a47557N3236d5462H4455e6512
18931b90189a10020D0228O3561b79981B62153A13564a13721B58829a45110c9011
$$ plain form
18920 166737 253367 -94852 -434873 288890 -162817 11611 -394490 38970 -11643 8480 -60224
18908 121859 -161115 40870 -180624 -73494 21607 184952 -17116 -79811 -47260 28362 -142724
18896 -91096 -46344 -222727 -225254 -62778 -212043 33952 341131 -86608 -248335 -309262 -54058
18884 -211346 21846 119496 -244400 27844 206294 -210970 -56249 -146752 53753 165928 -361772
18872 -39010 -214762 233404 -364077 110957 -305505 7948 -375008 -23782 -150331 -259891
18862 -259891 92608 -246333 -56542 -300698 70991 16344 -168633 396706 -63453 -142424 -243280
18851 -243280 -64382 67829 109923 -146000 -92817 304629 -35042 -226445 -301797 9621 89493
18840 89493 161698 -131606 -182001 153571 -123293 144195 -96593 88083 -149391 -22192 -69512
$$ packed form
18920A66737Q6630i4852l40021B88890a62817A1611c94490C8970a1643H480f0224
18908A21859a61115D0870a80624g3494B1607J63345a7116o2695L2551B8362a42724
18896i1096M4752j76383k527f2778j49265C3952L07179h6608j61727o0927e4058
18884b11346B1846R7650b44400B7844J78450b10970e6249r0503E3753J12175c61772
18872c9010j75752B33404c64077A10957c05505G948c75008b3782j26549j09560
18862b59891I2608b46333e6542k44156G0991A6344a68633C96706f3453p8971j00856
18851b43280f4382F7829M2094a46000N3183C04629c5042j91403p5352I621P9872
18840H9493P2205a31606n0395A53571a23293A44195i6593H8083a49391b2192m7320
$$ plain form
18829 -69512 -270008 29343 45116 -112897 144295 -106546 -72961 -260665 59682 14598 6572
18817 454819 -171216 252834 -103638 247003 -372453 -67720 -120470 143025 -174653 51995
18806 -44768 29719 -172839 94236 -79734 66164 -125798 -320833 -172802 -365758 122497
18795 21322 109937 -195694 428487 -221890 30911 36436 -64486 -224220 -185647 49033 -19726
18783 -75048 -107835 -122884 71052 -59480 287813 28159 119350 -33549 -159055 -275711 -334988
18772 -334988 -139218 -144412 -251282 -522737 -369055 13592 43064 5565 -233743 -98125 72526
18760 -143537 -47011 -183806 -87280 -226022 -440197 146142 60579 -34267 -36074 -180264 75210
18748 72938 78627 -55568 -29822 -251934 -54318 -150648 12722 247703 44160 154839 126375
$$ packed form
18829f9512k00496B9343J5773a12897A44295a06546L3585j87704E9682A4598F572
18817D54819a71216B52834a03638B47003c72453f7720n2750A43025a74653E1995
18806d4768B9719a72839I4236g9734F6164a25798j95035J48031j92956A22497
18795B1322Q8615a95694D28487b21890C0911N525f4486j59734L8573D9033a9726
18783g5048l2787j5049G1052e9480B87813B8159R1191c3549j25506j16656n9277
18772c34988a39218n194j06870k71455J53682A3592K9472E565b33743i8125G2526
18760a43537d7011j36795h7280j38742k14175A46142F0579c4267j807j44190G5210
18748G2938N689e5568K5746k22112e4318r6330A2722K34981D4160J10679k8464
$$ plain form
18737 126375 44421 100866 -238222 -300095 -84985 -255341 -55834 -41880 -3639 -113041 182954
18725 -129612 94294 -225256 83812 5919 -97049 -183522 132724 45579 -140990 -16521 -7806
18713 -373108 6496 -76032 314885 -52613 -25296 70768 131685 30766 -149582 -962 -31221 96632
18700 217755 99446 47158 -60072 -116307 -277659 -231139 -223436 -162507 322281 81774 -232787
18688 -487498 -131854 213155 -130983 -316802 -211527 32580 -104760 127292 -106434 45192
18677 139298 -227890 210761 157998 -34117 183055 -91490 311863 38162 142363 -28457
18666 -272308 159830 -139296 -73479 -166931 106863 -207885 -171916 48600 364842 -180657
18655 -16432 -154679 224240 -252296 -41380 -69450 -43594 16567 95057 -302676 -166173 122024
$$ packed form
18737A26375D4421N6445b38222o1873h4985j70356e5834J3954c639j09402A82954
18725a29612I4294b25256H3812E919i7049q6473A32724D5579a40990a6521g806
18713c73108F496g6032C14885e2613b5296G0768O0917C0766a49582i62l0259I6632
18700B17755I9446D7158f0072n6235j61352M6520P703O0929C22281H1774b32787
18688d87498a31854B13155a30983j85819J05275C2580a04760A27292a06434D5192
18677A39298b27890B10761n2763c4117A83055i1490C11863C8162J04201b8457
18666b72308A59830a39296O5817r3452A06863b07885L5969D8600L16242a80657
18655a6432j38247B24240b52296d1380k8070K5856A6567P8490c02676J36503A22024
$$ plain form
18643 -160534 -178287 -198237 -348180 -85801 53226 -240927 -425891 274987 -105108 -105952 277101
18631 232078 -86710 101259 83102 51012 -106849 -4039 22865 -198282 -237130 127309 -239285
18619 -210376 -313097 138763 -235970 135625 -78963 -309941 -59770 -53843 -206130 -121715
18609 -121715 -53860 -192487 -95251 390288 65849 47550 -196800 -316912 -232488 100054
18598 348755 74437 -7048 -13886 -30052 254383 -84013 155704 -53927 29573 24193 44764 65763
18586 65763 147401 -271795 -242658 93220 30431 159112 -64452 -225683 -324591 -127904 88084
18574 -218953 -139954 100085 -188620 22279 -112307 155366 -332341 47771 111030 -156859
18563 -169239 -6982 -82395 -164039 90145 -36344 -83243 -130971 -142237 66022 -40912 285977
$$ packed form
18643a60534j7753j9950j49943h5801E3226b40927j84964B74987a05108q44B77101
18631B32078h6710A01259j8157l2090a06849d039B2865a98282l8848A27309b39285
18619b10376j02721A38763b35970A35625g8963k30978e9770N927j52287Q4415
18609a21715e3860j38627i5251C90288F5849j8299a96800j20112Q4424A00054
18598C48755G4437g048o838j6166B54383h4013A55704e3927B9573n380K0571K0999
18586F5763Q1638b71795K9137I3220C0431J28681f4452j61231r8908a27904H8084
18574b18953P8999A00085a88620B2279a12307A55366c32341D7771O3259a56859
18563a69239f982p5413q1644I0145c6344m6899m7728j1266F6022d0912B85977
$$ plain form
18551 221564 75154 -243189 -190467 223569 -297316 -145787 -256848 214653 -41671 -246794
18541 -246794 31927 -54980 -45484 -156118 -164757 -79874 -278319 -32238 -53940 -125991 -166848
18530 -166848 -142310 -305195 -136021 -227885 -41707 -118201 37781 32868 4476 -252799 -82049
18518 -206244 -450537 -325866 -338550 103802 -100640 -27241 189375 354221 101751 -297592
18507 25436 -217976 -234399 -172549 -2421 125021 -172598 159879 -36840 87249 -127721 -394770
18496 -394770 137797 -93708 18848 9281 -65500 -3431 -19237 -33077 144538 -14276 26977
18484 -174540 -213725 22888 -5681 124662 21876 -61107 103417 -33513 -269548 -289301 -125246
18472 -296086 188709 -16981 -46839 21572 -48179 -231576 -269967 -76112 130538 -80915 352317
$$ packed form
18551B21564G5154b43189N2722B23569b97316a45787j11061B14653d1671k05123
18541b46794C1927e4980R496j10634q639g9874j98445c2238k1702p2051m0857
18530a66848K4538j62885a36021r1864d1707p6494C7781m913D476b52799h2049
18518b06244k44293J24671j2684A03802a00640b7241A89375J64846A01751b97592
18507B5436b17976j6423O1850b421A25021a72598A59879c6840H7249a27721k67049
18496c94770A37797i3708A8848I281f5500c431j5806j3840A44538a4276B6977
18484a74540l9185B2888e681A24662B1876f1107A03417c3513k36035j9753a25246
18472b96086A88709a6981k9858B1572d8179j83397l8391g6112A30538h0915C52317
$$ plain form
18460 54798 117693 -267298 -367166 -122654 -328540 106822 154095 24301 -306549 43481 -141792
18448 101712 -174521 286148 -232555 40611 129267 305442 -7474 -375336 -47813 -143353 61017
18436 -36464 32728 -10033 -182709 -174336 -76807 -82675 180083 -162370 -191520 -172709 -137993
18425 -137993 -74894 -280476 223438 -316251 -170276 107674 119980 -41274 -11728 -179601
18415 -179601 118948 -82841 -273897 2426 178412 -81240 7781 280860 -72833 -50523 15539
18403 278808 329794 -321126 -11137 16574 2855 -805928 -161332 -214989 97097 -215683 12969
18391 -98859 206546 214991 133116 358777 30739 51453 133049 -172384 79254 -41434 -304414
18380 -304414 149867 -71482 -131359 -327315 136001 71835 66797 300879 41190 29623 -291226
$$ packed form
18460E4798O2895b67298r9868a22654k05886A06822M7273B4301c06549D3481a41792
18448A01712a74521B86148b32555D0611Q8656J76175g474l67862d7813r5540F1017
18436c6464C2728a0033j72676Q373g6807n868A80083a62370k9150J8811L4716
18425a37993O3099k05582B23438c16251J45975A07674J2306d1274a1728j67873
18415a79601A18948h2841j91056B426J75986h1240G781K73079g2833K2310A5539
18403B78808N0986c21126a1137A6574B855h05928a61332n3657I7097b15683A2969
18391i8859B06546Q445q1875K25661C0739K0714Q1596a72384G9254d1434k62980
18380c04414A49867g1482n9877j95956A36001o4166n038K34082D1190j1567b91226
$$ plain form
18368 81250 -123687 47439 -15140 251896 201182 -343967 -184997 -41147 17653 -237005 -203567
18357 -203567 -238124 49732 56864 -161270 86534 -263764 -476168 33514 -189319 119159 -351851
18345 92307 -285916 136271 140325 -142231 -136812 52495 -131792 -42743 -242945 171447 -172128
18333 -178767 -393065 -67249 -57766 -64107 276113 -170686 -181373 -206470 23063 267266 -250624
18321 -126133 -152722 -71812 65239 7610 127447 -29829 316129 -123207 -125305 -78282 -207397
18310 -207397 -121757 -432319 -179413 25924 152172 89180 30590 -85905 43680 199188 173286
18299 173286 -61276 -22717 170621 -283870 -150745 52533 -63072 -322956 -32211 142047
18288 2411 41860 -73707 -231473 127848 -57504 224887 -146772 -25433 145245 -454385 15547
$$ packed form
18368H1250a23687D7439a5140B51896n0714c43967J58970d1147A7653b37005L3438
18357b03567l4557D9732P132a61270H6534b63764k12404C3514a89319A19159c51851
18345I2307b85916A36271M054a42231N419E2495a31792d2743k00202A71447a72128
18333a78767k14298f7249R483o341B76113a70686j0687k5097B3063K44203b50624
18321a26133k6589g1812F5239G610J19837b9829C16129a23207k098M7023j29115
18310b07397Q5640l10562a79413B5924J26248o2992C0590h5905D3680J55508k5902
18299A73286f1276b2717A70621b83870J33125E2533f3072k59884c2211A42047
18288B411L9449g3707j57766A27848e7504B24887a46772b5433A45245d54385A5547
$$ plain form
18276 20788 -211102 195277 -46741 -1852 87700 -137394 -21218 -91428 -243469 112739 -62709
18264 335924 -227147 69868 -119632 -6390 -301382 -120271 -225371 -80312 -52332 -23680 -96242
18253 -96242 -178353 -142287 -83687 95788 -4137 231592 44898 82226 281245 -20413 -11074 -89432
18241 -89432 -199446 103810 -54638 59667 151754 -47328 -172519 -95701 109593 171720 -31787
18229 -92014 -125170 336246 -15822 -133864 -296287 -66272 -36805 -128829 56647 214362 -181909
18217 -118424 -27463 -43054 310757 87447 -89182 -27651 170633 -450504 -155048 141224
18206 112929 23865 -290206 156708 -8409 223057 -375991 -266259 -162000 220820 -2001
18195 22539 221514 -149325 93561 -351740 139491 -37852 163282 77025 14383 113219 -233595
$$ packed form
18276B0788b11102A95277d6741a852H7700a37394b1218p0210j52041A12739f2709
18264C35924b27147F9868a19632f390k94992a20271j05100h0312K7980b3680p2562
18253i6242q2111L6066N8600I5788d137B31592D4898L7328J99019b0413R339p8358
18241h9432j10014A03810e4638E9667R2087d7328j25191P6818A09593O2127c1787
18229i2014l3156C36246a5822j18042j62423f6272K9467r2024E6647J57715a81909
18217a18424b7463j5591C10757H7447h9182b7651A70633d50504a55048A41224
18206A12929B3865b90206A56708h409B23057c75991J09732J04259B20820b001
18195B2539J98975a49325I3561c51740A39491c7852A63282G7025A4383R8836b33595
$$ plain form
18183 -142943 36221 180202 -163205 -5273 -66543 -133704 -112231 42201 48149 -108932 194116
18171 201551 -92002 127120 -13268 55761 38223 -23790 -48664 -83033 -33240 -65473 -59304
18160 -59304 35432 -174367 90206 -211622 -119467 20828 -200351 176124 57443 48768 196504
18149 196504 -114320 50222 -86294 -273165 -151968 54540 163021 -160092 147802 -165116
18138 60235 240045 227566 -45544 25624 -154061 -136534 172624 71655 -275315 -72776 -154754
18127 -154754 94493 58273 -253307 -210479 -201936 -291482 120330 -89811 92454 -53610 -112726
18116 -112726 68447 2934 -148391 -154422 -69922 -7657 -41960 -151971 -19717 335002 -217959
18104 -4031 193106 122828 132545 93617 -105444 -143858 186934 119181 -238922 -139732 -213760
$$ packed form
18183a42943C6221J43981a63205e273o1270o7161K1473D2201N948a08932A94116
18171B01551i2002A27120a3268E5761j7538b3790k4874l4369c3240l2233O169
18160e9304C5432a74367I0206b11622R2155B0828b00351A76124E7443q675J47736
18149A96504a14320E0222h6294j86871J21197E4540J08481a60092A47802a65116
18138F0235J79810j2479d5544B5624a54061J7527A72624G1655b75315g2776q1978
18127a54754I4493l6220b53307M2828Q543q9546A20330h9811I2454e3610n9116
18116a12726F8447B934a48391o031f9922g657l4303j10011a9717C35002b17959
18104d031A93106p0278R717l8928a05444l8414A86934o7753b38922R9190p4028
$$ plain form
18093 -213760 -93648 81192 -144476 169000 1982 -87824 236115 171871 -306791 173144 174174
18082 174174 -92364 718 8652 -72204 -70984 61726 -221537 125155 27563 -157301 -72582 20696
18069 135094 -52151 -291387 -59122 -25633 133087 -251487 37511 -279232 237682 -54622
18058 -79619 184655 459147 89703 328112 -71474 208387 -14070 -66285 -60994 49817 95001
18047 95001 37534 251115 -101083 -57463 31171 26210 49690 165604 -425517 276703 -140673
18035 -110332 -181708 173412 80780 -170730 -124325 159333 33013 206606 -174531 -23489
18024 42512 275920 -138869 281340 -246363 -105873 104821 -368840 -154417 -909 -13778
18014 -13778 -349198 -97080 10592 -166819 -210708 -138936 164683 -98905 -192463 -169401 -305985
$$ packed form
18093b13760i3648H1192a44476A69000A982h7824B36115o4244c06791A73144J030
18082A74174i2364G18P934g2204J220F1726b21537A25155B7563a57301g2582B0696
18069A35094e2151k39236e9122b5633A33087b51487C7511b79232B37682e4622
18058g9619A84655K74492H9703K38409g1474B08387a4070n2215N291D9817M5184
18047I5001C7534K13581a01083M3620C1171m961K3480J15914d25517B76703a40673
18035a10332p1376A73412H0780a70730M6405A59333C3013J73593a74531b3489
18024D2512K33408a38869B81340b46363a05873A04821c68840a54417i09j2869
18014a3778l35420i7080A0592a66819m3889P1772A64683i8905r3558K3062j36584
$$ plain form
18003 -305985 -86913 25337 56033 345375 -118095 -212352 -8495 -68438 -308185 216372 -47453
17991 -70875 161536 -62901 -16839 -137900 -32693 -234308 -107631 -177420 -13727 177725 -79398
17979 -109098 -36980 62281 57080 147871 -171764 141079 -99324 31101 48158 -82272 198970
17967 61780 82375 -76098 8452 -27771 360754 18103 91094 -39749 127802 -259481 38566
17955 366155 50236 302182 -127009 30374 -33341 -170167 133129 78356 -115963 44177
17944 36012 -36673 -88790 88343 -50226 69336 -179257 -198237 -84838 -6083 26070 -345620
17932 -3713 98710 66430 11801 139813 54016 -86793 366112 -59268 3333 115299 191181
17921 191181 -41640 224908 -88239 -193377 -241630 4673 340157 -100948 -42734 70988 84858
$$ packed form
18003c05985h6913B5337L0696K89342a18095r4257h495n9943k39747B16372d7453
17991g0875A61536f2901a6839j21061c2693k01615a07631o9789a3727A77725g9398
17979a09098c6980F2281n201R0791a71764A41079i9324C1101J7057h2272A98970
17967F1780K0595g6098H452b7771C60754A8103P2991c9749A27802b59481C8566
17955C66155E0236K51946a27009C0374c3341j36826A33129n4773a15963D4177
17944C6012c6673n2117H8343e0226F9336a79257j8980h4838f083B6070c45620
17932c713I8710l2280A1801J28012E4016h6793C66112e9268C333J11966P5882
17921A91181d1640B24908h8239j05138m8253D673L35484a00948d2734G0988J3870
$$ plain form
17910 84858 -186537 -235618 -155327 -245124 -113780 75211 168431 111924 -217159 -320393 -107523
17898 186656 -326328 -176120 106887 -8622 -68509 -185865 26651 111019 103493 -25497 -31404
17887 -31404 131638 162625 -38257 -4225 -85434 231101 132223 -20365 129715 -128138 72492
17875 -131759 -206930 -289769 21170 -226183 -59819 -241345 31969 38862 -194037 -142528 -103985
17864 -103985 221406 159391 39469 -170712 24460 -65479 -14978 296785 -158884 86833 13218
17852 134690 315036 -31618 327912 -342451 -221350 -47116 291585 -148965 269696 324142
17842 324142 -131991 -591566 -51610 329716 99033 201530 -265346 -277371 259455 171262
17832 171262 43704 147248 -177175 -332467 -381578 -42219 1156 118835 -122851 42029 96408
$$ packed form
17910H4858a86537m9081Q0291q9797a13780G5211R3220n6507b17159j03234a07523
17898A86656c26328J50208A06887h622n9887j17356B6651Q4368p526b5497n907
17887c1404A31638L0987c8257d225q1209B31101r8878b0365A29715a28138G2492
17875a31759p5171q2839B1170b26183e9819j81526C1969O893a94037N1509L8543
17864a03985B21406o2015C9469a70712B4460f5479a4978B96785a58884H6833A3218
17852A34690J80346c1618C27912c42451J21101d7116B91585a48965B69696N4446
17842C24142a31991m59575e1610C29716I9033J02497b65346j2025B59455q8193
17832A71262D3704J03544a77175j55292m9111d2219A156J17679a22851D2029N4379
$$ plain form
17821 96408 235326 -234949 14348 169076 -341261 -84607 -81289 -419559 287541 -85191 53459
17809 -225023 -35775 30519 -115754 148276 14521 135611 -355308 -329933 482 -43353 -135383
17798 -135383 -207545 110969 70447 56908 68011 -42271 -1027 252654 321909 204127 -25795
17786 -59250 -56555 50318 -299126 147811 -127627 26724 78013 95424 -101541 426338 -90780
17774 34659 4082 221656 228598 62408 163990 -168611 -207695 232732 -101709 -414939 54581
17762 34173 222880 -105234 -133692 -59823 -418878 -55982 90796 153232 -55874 55813 -44903
17750 127431 -30390 166601 -106466 173269 23289 -15491 357546 -96445 258584 -180324
17739 -24638 -47060 -63573 34864 -245418 44298 -539460 104643 7297 -35974 297042 -69192
$$ packed form
17821I6408J38918b34949A4348J54728c41261h4607L318l38270B87541h5191E3459
17809b25023c5775C0519a15754A48276A4521J21090c55308K5375D82d3353r2030
17798a35383p2162A10969m0522j3539J1103d2271a027B52654O9255j17782b5795
17786e9250K695E0318b99126A47811a27627B6724N1289J7411a01541D26338i0780
17774C4659D082K17574O942F2408J01582a68611l9084B32732a01709l13230E4581
17762C4173J88707a05234k8458e9823l59055e5982I0796O2436e5874E5813d4903
17750A27431c0390A66601a06466A73269B3289a5491C57546i6445B58584a80324
17739b4638k2422j6513C4864b45418D4298e39460A04643G297c5974B97042f9192
$$ plain form
17727 125661 30089 140676 331429 -236884 -44422 -76263 224957 95472 114258 64226 121936
17716 121936 62249 126418 221821 -225544 -12347 242672 -311929 -11857 -130082 -203764 278898
17704 -81999 -167981 66621 102508 -235827 -5691 -56542 -35119 199658 193727 -76621 139518
17692 -3037 139907 -88618 84229 -99787 68543 -245158 -125197 181454 37249 -48894 20391
17680 149075 99308 -163499 -90534 126844 -161356 197346 348742 -76967 -450 -54827 93072
17668 274088 86017 -138353 180067 228239 288286 113446 -15051 -21961 257319 -21774 -98657
17657 -98657 265979 71368 110975 40145 -204921 -284787 130957 254507 103413 94616 -89270
17645 -45899 206206 410542 -63058 -30751 -106385 153095 150060 48763 317911 -142701 -16538
$$ packed form
17727A25661C0089J10587J90753b36884d4422l1841B24957I5472J8786n0032N7710
17716A21936n9687O4169R5403b25544a2347B42672c11929a1857j18225p3682B78898
17704h1999q5982F6621L5887b35827e691n0851K1423A99658n931g6621A39518
17692c037A39907h8618H4229i9787F8543b45158J19961A81454C7249d8894B0391
17680A49075m9767a63499P2965A26844a61356A97346J51396g6967d50n4377I3072
17668B74088H6017a38353A80067M8172O0047A13446a5051o910B57319b1774p6883
17657i8657B65979G1368L9607D0145b04921p9866A30957J23550A03413q797h9270
17645d5899B06206K04336f3058c0751p5634A53095l035D8763K69148a42701a6538
$$ plain form
17633 -83271 -7362 -6672 -221913 -89657 177789 -239147 175562 342601 17097 -199935 149581
17621 222808 58962 8976 91583 -283096 -177318 444383 -75938 60747 -49012 363540 259412
17610 259412 35454 164732 117432 23099 -365064 -171466 -98519 189789 -7931 -128750 113506
17598 203857 -84306 107747 -247777 171849 87122 -197684 46082 -136464 -95846 33888
17587 214647 -71398 76355 -156881 -74758 312771 -208663 -100424 194784 93502 -117719
17576 22458 -72752 97353 173089 -163584 27382 22797 335102 98028 408542 -249397 -10145
17564 3668 -173143 261782 113207 -227260 -293437 -81936 82308 245507 49353 -156416 -199104
17553 -199104 -158302 286778 -150100 -67026 29558 301874 273015 205576 -122065 195969
$$ packed form
17633h3271g362O90k15241h9657A77789b39147A75562J67039A7097a99935A49581
17621B22808E8962H976Q2607b83096J05778D44383g5938F0747d9012C63540j04128
17610B59412C5454J29278m7300B3099c65064a71466P2947A89789g931j20819A13506
17598B03857h4306A07747b47777A71849q4727a97684D6082a36464M0618C3888
17587B14647g1398G6355a56881g4758C12771b08663a00424A94784I3502a17719
17576B2458g2752I7353P5736a63584B7382m585L12305I8028L10514b49397a0145
17564C668a73143B61782A13207b27260o6177h1936H2308J63199D9353a56416m2688
17553a99104M0802B86778a50100f7026B9558K72316k8859o7439a22065A95969
$$ plain form
17542 195014 269430 -18642 12405 -31226 80837 -116734 -15940 320965 -171735 46772 -230930
17530 311897 -213985 177128 -78689 -21864 -289360 5636 180912 -203343 -193809 179557 -186923
17518 -89648 105561 252138 138795 74738 -266887 78880 149031 -290081 131474 -136953
17507 166338 261523 197509 153310 98298 268410 231468 364233 -120001 -104505 201746 -1828
17495 172622 11505 201480 -246635 468866 -106555 276840 -115338 243823 274919 84680
17484 356757 -102877 159733 138694 7693 295537 107322 396891 91423 1548 -47310 432707
17472 377522 130657 -64948 327321 -130260 252715 239871 125043 181769 237040 114124
17461 193428 -117457 116630 138346 -365979 12873 -129421 205320 66176 293065 231642
$$ packed form
17542A95014P4416a8642A2405c1226H0837a16734a5940C20965a71735D6772b30930
17530C11897b13985A77128g8689b1864k67496E636J75276b03343R534A79557a86923
17518h9648A05561J46577j13343o4057b66887G8880P0151b90081A31474a36953
17507A66338R5185o4014m4199n5012J70112l6942J32765a20001J5496B01746a828
17495A72622A1505J89975b46635D68866a06555B76840a15338B43823L1096H4680
17484C56757a02877A59733k1039G693K87844A07322K89569I1423A548d7310D32707
17472C77522A30657f4948C27321a30260B52715j2844j14828N6726N5271A14124
17461A93428a17457A16630K1716c65979A2873a29421B05320F6176K26889o1423
$$ plain form
17451 231642 137680 -59589 131077 414305 379305 168912 520086 150067 327525 256208
17441 256208 60898 41563 -88197 37659 38567 296965 -5670 38714 549849 462233 389439 412135
17429 412135 -39996 48369 334162 422629 463836 249739 -21386 345107 359220 135296 35796
17417 142227 408770 -18030 327578 24083 28092 210203 192654 92791 179440 113829 41228
17405 -67798 50370 293278 301652 -133472 125750 -51733 58905 -56065 35513 -142540 201967
17393 448603 580981 53265 241200 134147 288403 36477 52418 24954 308113 226590
17383 226590 -73602 393802 286696 131331 384076 -116378 158314 196897 171340 137345
17373 137345 135089 479804 90142 -10368 204489 286054 41011 202680 -96370 120456 194438
$$ packed form
17451B31642r3962e9589A31077K83228l5000A68912L51174A50067J77458p1317
17441B56208F0898j9335h8197C7659R08K58398e670C8714N11135q7616p2794K2696
17429D12135c9996D8369K85793Q8467M1207k14097b1386C45107J4113A35296C5796
17417A42227K66543a8030C27578B4083M009J82111j7549I2791Q6649o5611D1228
17405f7798E0370K42908Q374a33472A25750e1733E8905e6065C5513a42540B01967
17393D48603J32378E3265J87935j07053J54256C6477J5941B4954K83159q1523
17383B26590g3602C93802j07106A31331K52745a16378A58314L8583k5557l3995
17373A37345k256L44715I0142a0368B04489Q1565D1011J61669i6370A20456P3982
$$ plain form
17362 194438 338525 107211 241728 532552 233694 173392 -76700 160170 206754 219511
17352 219511 100836 -217172 15631 211773 278953 22289 -145106 357671 -161592 -165078
17342 -165078 141486 311716 150087 212 75283 443924 83022 110385 75171 149496 325908
17331 325908 -68526 -10974 115956 248096 -82873 -30734 197633 125572 251904 210913 174880
17320 174880 117507 209307 -127495 190558 -80475 -81236 215351 124096 318566 -63758 149217
17308 131660 415874 -25245 72006 537170 253205 289038 128056 143124 151974 138461 -20160
17296 207915 524611 -232853 166205 194958 118920 -31162 -225693 -119769 492677 -1750
17285 285374 169241 -132806 110008 130746 -19782 248827 99075 -192619 409586 234027
$$ packed form
17362A94438J44087A07211J34517K90824B33694o0302g6700A60170M6584J2757
17352B19511A00836b17172A5631J96142O7180B2289a45106C57671a61592l486
17342a65078A41486J70230A50087B12P5071L68641H3022K7363l5214P4325J76412
17331C25908f8526a0974A15956J32140h2873c0734A97633p2061J26332m0991l6033
17320A74880n7373R1800a27495A90558h0475p61B15351r1255J94470f3758A49217
17308A31660K84214b5245G2006M65164B53205L5833A28056J5068Q850j3513b0160
17296B07915L16696b32853A66205K8753p6038c1162j94531J05924D92677a750
17285B85374j16133a32806A10008K0738a9782B48827I9075a92619D09586j75559
$$ plain form
17275 234027 267903 -12636 274795 191225 334978 320772 110589 46570 26880 160560 178519
17264 178519 444873 1900 249042 184211 306785 254524 424508 223577 89022 51007 162169
17253 162169 79655 18611 115759 223037 -221904 181903 7947 -145499 221531 598792
17243 598792 237215 201146 239004 203501 68539 111420 245171 362943 87420 262726 166123
17232 166123 178224 15558 377517 -106532 99851 -32583 325214 95767 274421 110395
17221 -16241 361129 195533 111342 115799 38674 -156802 577347 319456 115804 408848
17211 408848 460799 157333 283805 304999 -61401 174544 308107 151244 190438 296411
17201 296411 353336 268976 -114084 302465 -9521 -1036 130249 490396 260723 141991 6446
$$ packed form
17275B34027L3876a2636B74795q3570J43753j4206A10589D6570j9690J33680J7959
17264A78519K66354A900K47142o4831J22574n2261J69984k00931H9022l8015J11162
17253A62169G9655A8611R7148J07278b21904A81903G947a45499B21531L77261
17243E98792B37215l6069L7858l5503F8539M2881J33751J17772H7420J75306r6603
17232A66123J2101A5558L61959a06532I9851c2583C25214I5767J78654A10395
17221a6241C61129j65596q4191M457C8674a56802E77347k57891A15804K93044
17211D08848N1951A57333J26472K1194f1401A74544J33563A51244L9194J05973
17201B96411N6925q4360a14084C02465i521a036A30249L60147k29673j18732F446
$$ plain form
17189 -30013 385720 310731 281948 391570 458439 -23278 166086 130483 295845 328121 127726
17177 454940 265675 94575 452486 220373 386633 652560 440729 131842 322201 418302
17167 418302 323283 412309 229806 245729 -236229 272694 309185 -91301 130498 156045 304865
17156 304865 480346 507433 361016 307930 208550 288282 296309 406521 247330 207730 450747
17145 450747 392952 342220 -183330 140508 116534 206448 565505 242819 173917 550056
17135 550056 459275 399677 318262 420483 238249 590060 433902 549729 175890 378071
17125 378071 315740 362191 257682 442812 122332 213368 550542 514107 537777 63635 99485
17114 99485 573732 499211 464325 300369 286337 583964 255552 385342 56549 304282
$$ packed form
17189c0013C85720p4989k8783J09622O6869b3278A66086l5603J65362L2276A27726
17177D54940j89265I4575L57911B20373J66260K65927k11831A31842J90359R6101
17167D18302r5019Q9026j82503J5923b36229B72694L6491i1301A30498K5547J48820
17156C04865J75481K7087j46417n3086r9380P9732Q027J10212j59191l9600K43017
17145D50747n7795n0732a83330A40508k3974Q9914L59057B42819o8902L76139
17135E50056r0781n9598q1415J02221j82234L51811j56158J15827A75890K02181
17125C78071o2331M6451j04509J85130A22332R1036L37174l6435K3670F3635L5850
17114I9485M74247p4521l4886j63956j4032K97627B55552J29790E6549K47733
$$ plain form
17104 304282 515515 293734 210007 331328 9581 266044 463747 654348 368976 250433
17094 250433 298758 527101 203369 434556 552073 434204 594856 588545 236804 185070
17084 185070 283630 342340 312421 614910 512648 429030 183507 337003 364094 647286
17074 647286 281949 559637 512028 587870 659190 507298 513154 622430 512436 371315
17064 371315 512643 639036 558362 377802 576944 464644 509040 655887 302329 650695
17054 650695 713969 869437 258914 366942 578202 510324 650238 358146 413801 233286
17044 233286 339320 691844 110795 637577 672881 494338 754951 392364 474120 635925
17034 635925 423861 -41076 470853 497128 493549 479281 733582 592855 690708 707796 493051
$$ packed form
17104C04282K11233k21781q3727J21321I581K56463J97703J90601k85372j18543
17094B50433M8325K28343B03369K31187J17517j17869J60652o311B36804n1734
17084A85070R8560N8710k9919L02489j02262q3618A83507J53496K7091K83192
17074F47286B81949K77688m7609P5842P1320j51892N856J09276j09994j41121
17064C71315J41328J26393q0674j80560J99142j12300M4396J46847C02329L48366
17054F50695O3274J55468B58914J08028K11260o7878J39914k92092N5655j80515
17044B33286J06034L52524A10795N26782L5304j78543K60613l62587Q1756J61805
17034F35925k12064d1076D70853K6275l579j4268K54301j40727R7853J7088k14745
$$ plain form
17023 493051 222517 244943 926160 729418 411003 725405 427927 701328 876364 377112
17012 819023 552299 547259 460961 661152 806021 359960 753965 344631 577038 1091677
17002 1091677 595355 552132 372378 973829 792266 598171 394519 612831 746090 747877
16992 747877 820237 587026 854907 646119 442647 828015 710473 874733 611222 727276
16982 727276 678613 1158330 904060 931498 724658 690031 674526 575686 655460 595905 941514
16971 941514 765715 802795 948297 870880 891882 1007889 985863 777179 1160923 1159649 769887
16960 769887 1236630 630434 980156 652417 914259 1081626 831609 1085951 1176626 1018346
16950 1018346 1079799 1022501 867989 972624 772187 1090575 775869 1235975 618112 1315979
$$ packed form
17023D93051B22517K2426O81217j96742l18415L14402k97478K73401J75036C77112
17012H19023k66724n040q6298K00191J44869C59960L94005C44631K32407N14639
17002A091677m96322m3223j79754O01451j81563j94095k03652K18312J33259J787
16992G47877P2360k33211K67881k08788k03472L85368j17542J64260k63511J16054
16982G27276m8663M79717k54270K7438k06840l4627j5505r8840P9774n9555L45609
16971I41514j75799L7080J45502p7417K1002J16007k2026k08684L83744j274l89762
16960G69887M66743o06196L49722l27739K61842J67367k50017K54342R0675j58280
16950A018346O1453n7298j54512J04635k00437L18388l14706M60106o17863O97867
$$ plain form
16940 1315979 1191451 1329760 1248018 1130320 953286 1386552 1177302 1078723 1196023 1257142
16930 1257142 1213257 1403796 1136634 1355566 1313018 1245746 1239122 1388101 1391523 1465424 1315765
16919 1315765 1430666 1314866 1611829 1419897 1447793 1103946 1584511 1230459 1503297 1425905
16909 1425905 1508166 1521826 1447206 1362209 1521337 1979238 1712220 1394447 1471367 1918930
16899 1918930 1263136 1675380 1824962 1772516 1918449 1772378 1536973 2075749 1824148 1756409
16889 1756409 1937571 2237878 1839764 2017675 2108150 1938349 2071948 2037337 2032183 2187608
16879 2187608 1982002 2386900 1816052 1942385 2428160 2117544 2697583 2470952 2133383
16870 2133383 2412276 2357292 2607354 2741595 2324140 2558915 2698290 2488785 2381093 2480302
$$ packed form
16940A315979j24528J38309q1742j17698j77034M33266k09250r8579J17300O1119
16930A257142m3885J90539k67162K18932m2548o7272o624J48979L422P3901j49659
16919A315765J14901j15800K96963j91932K7896l43847M80565l54052K72838p7392
16909A425905Q2261J3660p4620q4997J59128M57901k67018l17773P6920M47563
16899A918930o55794M12244J49582n2446J45933j46071k35405N38776k51601o7739
16889A756409J81162L00307l98114J77911R0475j69801J33599l4611n154J55425
16879B187608k05606M04898n70848J26333M85775l10616N80039k26631l37569
16870B133383K78893n4984K50062J34241m17455K34775J39375k09505j07692R9209
$$ plain form
16860 2480302 2763008 2725500 3071639 2759418 2623461 2567671 2763659 2642071 2984809 3319694
16850 3319694 3068586 3062049 3377205 3212379 2988726 2996286 3135879 3521667 3484881 3350427
16840 3350427 3244295 3368523 3637247 3973805 3603997 3922328 4353247 3634828 4424847
16831 4424847 4048334 3901658 4183321 4109458 4222239 4201488 4245129 4472512 4572880 4587667
16821 4587667 4829568 4720498 4930619 4836490 4974595 5228628 5156174 5537813 5708376 5716393
16811 5716393 5648577 5725607 5797479 6178039 6325640 6042974 6412941 6429258 6622826 6745666
16801 6745666 6965127 7333220 7030034 7352097 7618836 7949963 8093921 8174386 8528555 8634493
16791 8634493 8714842 8775998 9071427 9399784 9753617 9991125 10303083 10565436 10837782 10758446
$$ packed form
16860B480302K82706l7508L46139l12221j35957n5790J95988j21588L42738L34885
16850C319694k51108o537L15156j64826k23653P560J39593L85788l6786j34454
16840C350427j06132J24228K68724L36558l69808L18331M30919p18419P90019
16831D424847l76513j46676K81663p3863J12781k0751M3641K27383J00368J4787
16821D587667K41901j09070K10121r4129J38105K54033p2454L81639J70563Q017
16811E716393o7816P7030P1872L80560J47601k82666L69967J6317J93568J22840
16801F745666K19461L68093l03186L22063K66739L31127J43958Q0465L54169J05938
16791H634493Q0349O1156K95429L28357L53833K37508L11958K62353K72346p9336
$$ plain form
16781 10758446 10958717 11950535 11865113 12292274 12876908 12668060 13212064 13694050 13980859
16772 13980859 14601206 14874704 15818643 16353994 16555251 17260503 18287532 18352182 19271928
16763 19271928 19482452 20336982 20929594 22135372 22568760 23273631 25017864 25658630 26512634
16754 26512634 27867536 28678033 30462125 31608592 33099268 34678162 36017477 37854515
16746 37854515 39797306 41742446 43513040 45973928 48311562 50412607 53229262 56338083
16738 56338083 59894824 62939471 66850447 70343562 74727861 79428786 84018207 88905321
16730 88905321 94284755 100397425 106599287 112942201 119560553 126829556 133810174 141369669
16722 141369669 148737184 156088452 163002185 169530379 175942165 181652162 186260599 189807899
$$ packed form
16781A0758446K00271R91818q5422M27161N84634k08848N44004M81986K86809
16772A3980859O20347K73498R43939N35351K01257P05252J027029O4650R19746
16763A9271928K10524Q54530N92612J205778M33388P04871J744233O40766Q54004
16754B6512634J354902Q10497J784092J146467J490676J578894J339315J837038
16746C7854515J942791J945140J770594K460888K337634K101045K816655L108821
16738E6338083L556741L044647L910976L493115M384299M700925M589421M887114
16730H8905321N379434O112670O201862O342914O618352P269003O980618P559495
16722A41369669P367515P351268O913733O528194O411786N709997M608437L547300
$$ plain form
16714 189807899 192536366 193749693 193521832 192292999 189544502 185507417 180895445 174897079
16706 174897079 168790601 161730997 154181540 146540752 138913453 131431647 123607321 117034766
16698 117034766 110103643 103324466 97443012 91435326 86071387 80892032 76077706 71681858
16690 71681858 67519429 63802670 59959622 56515584 53563108 50739104 47869842 45527731
16682 45527731 43377683 40908969 39133802 37071514 35193804 33516469 32469313 30210686
16674 30210686 29179501 27869636 27097124 25484927 24637335 23577130 22638184 21448305
16666 21448305 20820320 20091622 19190214 18664387 17973606 17219852 16580093 16021842 15480471
16657 15480471 15121423 14519446 13978648 13453846 13188233 12407543 12324556 11526216 11680425
$$ packed form
16714A89807899K728467J213327k27861j228833k748497m037085m611972n998366
16706A74897079o106478p059604p549457p640788p627299p481806p824326o572555
16698A17034766o931123o779177n881454o007686n363939n179355m814326m395848
16690G1681858m162429l716759l843048l444038k952476k824004k869262k342111
16682D5527731k150048k468714j775167k062288j877710j677335j047156k258627
16674C0210686j031185j309865p72512j612197q47592j060205r38946j189879
16666B1448305o27985p28698r01408n25827o90781p53754o39759n58251n41371
16657A5480471l59048o01977n40798n24802k65613p80690q2987p98340J54209
$$ plain form
16648 11680425 11213996 10921867 10253662 10081072 9677293 9692720 9409125 9061966 8978306 8332479
16638 8332479 8461343 7959255 8074507 7659664 7417499 7162058 7015780 6918069 6595090 6743487
16628 6743487 6602167 6141490 6255089 5771813 5493175 5795048 5648308 5549013 4993781 4982277
16618 4982277 5326031 4985867 5093480 4734594 4741536 4673013 4797499 4458617 4163032 4296578
16608 4296578 4010167 3885675 3952845 3705395 3842085 3937829 3844943 3611922 3572410 3607335
16598 3607335 3486946 3526492 3391214 3371773 3066260 3292448 3025190 2876166 2899965 3125705
16588 3125705 2930241 3011681 2344419 2563493 2582213 2815491 2710189 2565458 2422076 2474520
16578 2474520 2139068 2309725 2296221 2606354 2313110 2190528 2166952 2189658 2124043 2097222
$$ packed form
16648A1680425m66429k92129o68205j72590m03779J5427k83595l47159q3660o45827
16638H332479J28864n02088J15252m14843k42165k55441j46278r7711l22979J48397
16628F743487j41320m60677J13599m83276k78638L01873j46740r9295n55232j1504
16618D982277L43754l40164J07613l58886O942o8523J24486l38882k95585J33546
16608D296578k86411j24492O7170k47450J36690R5744r2886k33021l9512L4925
16598C607335j20389L9546j35278j9441l05513K26188k67258j49024K3799K25740
16588C125705j95464Q1440o67262K19074J8720K33278j05302j44731j43382N2444
16578B474520l35452J70657j3504L10133k93244j22582k3576K2706o5615k6821
$$ plain form
16568 2097222 2164886 2015141 2143863 1743123 2074259 1879978 1893509 1844615 1834590 1617870
16558 1617870 1867539 1722414 1507999 1814881 1665041 1683596 1453758 1429759 1540099 1779722
16548 1779722 1553888 1453032 1286395 1332207 1380486 1427202 1658102 1218473 1363751 1505315
16538 1505315 1475157 1579042 1233298 1259683 1072425 1176997 1132945 1242009 1540413 994058
16528 994058 1061580 1370819 950987 1121226 802107 1254163 1278124 998492 1401155 1095432
16518 1095432 776072 1057669 1104615 1191405 943846 1116382 787062 996909 756426 1211926
16508 1211926 1024064 965791 932290 995790 1090806 535507 884045 1054513 888495 948412
16498 948412 1144640 825253 1006406 789092 1092190 898888 679236 816849 1069307 1108811
$$ packed form
16568B097222O7664j49745J28722m00740L31136j94281J3531m8894j0025k16720
16558A617870K49669j45125k14415L06882j49840J8555k29838k3999J10340K39623
16548A779722k25834j00856j66637M5812M8279M6716K30900m39629J45278J41564
16538A505315l0158J03885l45744K6385j87258J04572m4052J09064K98404n46355
16528I94058O7522L09239m19832J70239l19119M52056K3961k79632M02663l05723
16518A095432l19360K81597M6946Q6790k47559J72536l29320K09847k40483M55500
16508A211926j87862n8273l3501O3500R5016E35507L48538J70468j66018N9917
16498I48412J96228l19387J81153k17314L03098j93302k19652J37613K52458L9504
$$ plain form
16488 1108811 512262 873679 526594 714120 622690 536417 553437 781766 840902 812246
16478 812246 751142 741530 831824 373461 367305 607005 503136 441095 751604 577471 664286
16467 664286 474628 475975 749085 577500 555951 708966 366136 583352 828911 361199
16456 411674 323604 541506 543876 440600 507171 676692 252777 581495 351123 473433
16446 473433 344179 817156 463359 535822 123179 420919 419955 321156 256735 410069 420851
16435 420851 269909 729302 501059 257062 344624 426236 581230 758515 655756 120242
16424 215219 474840 595644 146860 280965 384756 350550 248853 551419 655273 342605
16414 342605 419545 419651 417360 186259 221078 411639 212368 351115 548719 269629 140864
$$ packed form
16488A108811E12262L61417l47085J87526r1430q6273J7020K28329N9136k8656
16478H12246o1104r612R0294C73461o156K39700j03869o2041L10509j74133Q6815
16467F64286j89658J347K73110j71585k1549J53015l42830K17216K45559C61199
16456D11674q8070K17902K370j03276O6571J69521B52777L28718k30372J22310
16446D73433j29254M72977l53797P2463A23179K97740r64r8799o4421J53334J0782
16435D20851j50942M59393k28243k43997Q7562Q1612J54994J77285j02759A20242
16424B15219K59621J20804A46860J34105J03791l4206j01697L02566J03854l12668
16414C42605P6940J06k291A86259L4819J90561j99271J38747J97604B69629j28765
$$ plain form
16403 140864 411893 311476 34458 679077 223291 306095 415150 166031 522462 313398
16393 313398 29637 150469 490646 216522 210356 497360 230076 289045 356059 432452 54683
16381 591097 163985 289433 331986 352165 320876 190994 167156 378227 282631 280769 205779
16370 205779 334230 203369 106567 188835 360420 367432 194898 124826 28902 159530 22890
16358 414590 264899 53267 404387 261094 376716 -103939 228618 311509 236833 284209
16348 284209 48491 14656 65542 -48696 70230 73372 27085 58407 276234 12932 137437
16337 137437 39159 116598 -24148 162919 732879 302907 413246 -42274 190364 192608 -51984
16325 -164489 48442 175903 138436 129911 66896 100813 88243 52318 485723 55467 176106
$$ packed form
16403A40864K71029j00417C4458O44619B23291Q2804J09055A66031L56431k09064
16393C13398B9637J20832L40177B16522o166K87004B30076N8969O7014P6393E4683
16381E91097A63985J25448M2553K0179l1289j29882k3838K11071r5596j862p4990
16370B05779J28451j30861r6802Q2268J71585P012j72534p0072B8902J30628B2890
16358D14590j49691E3267L51120j43293J15622a03939B28618Q2891p4676M7376
16348B84209D8491A4656N0886d8696G0230L142B7085L1322K17827A2932J24505
16337A37437C9159P7439b4148A62919N69960C02907J10339d2274A90364K244e1984
16325a64489D8442J27461l7467q525o3015L3917j2570l5925M33405E5467J20639
$$ plain form
16314 176106 367827 -9842 -8854 360931 343240 229834 423080 105929 242802 448736 45020
16302 259649 -63070 228678 553632 68756 153302 420487 273372 5188 221140 -7543 19274
16290 -181883 234678 176257 -8120 182445 395061 219862 265599 146493 127020 -316515
16279 182499 60747 184961 81396 463965 303998 -18099 171774 209895 -33249 -152941
16269 -152941 -26936 41108 155766 256365 165894 -89170 307441 194904 73147 83093 145171
16258 145171 -52448 542375 62594 350456 283530 -86773 82944 286890 49320 47486 -170831
16246 212822 84755 121225 306140 236677 50022 67833 581889 51999 63459 -80377 -40535
16235 -40535 174699 51107 -4246 49513 -214793 69845 -168794 40647 269672 127858 -2266
$$ packed form
16314A76106J91721i842R88C60931j7691j13406J93246A05929J36873K05934D5020
16302B59649f3070B28678L24954F8756Q4546K67185j47115E188K15952g543A9274
16290a81883B34678n8421h120A82445K12616j75199M5737j19106j9473c16515
16279A82499F0747J24214H1396L82569j59967a8099A71774L8121c3249j19692
16269a52941b6936D1108J14658J00599r0471h9170C07441j12537G3147R946O2078
16258A45171e2448E42375F2594K87862o6926h6773H2944K03946D9320j834a70831
16246B12822H4755L6470J84915o9463E0022J7811N14056E1999J1460h0377L9842
16235d0535A74699E1107d246D9513b14793F9845a68794D0647K29025A27858b266
$$ plain form
16223 -214695 67565 -101040 -81916 128346 398340 -167211 32571 311636 -48650 -30626
16213 -30626 -19610 15936 -74620 417184 364957 -39589 170296 -208710 -26558 28038 303600
16202 303600 -117019 144993 116685 266418 29177 -5444 -80991 12142 308625 -17320 155584
16190 237715 -70383 -27932 138242 85151 46007 83662 -188739 -224918 -43130 -41687 126578
16178 -211167 84775 271900 73813 -275419 207157 50951 89955 -96067 175028 -82525 -168326
16167 -168326 17782 206453 -208261 -443948 16285 -276542 139814 -8834 -163031 86779
16156 374967 -275919 114242 -28712 398210 -1907 128076 5664 91930 49646 -125007 127704
16144 -127511 51572 103010 -314193 8995 104607 10233 -166844 -75925 -65785 -81046 -139645
$$ packed form
16223b14695F7565a01040J9124A28346K69994a67211C2571K79065d8650J8024
16213c0626J1016A5936g4620D17184n2227c9589A70296b08710b6558B8038K75562
16202C03600a17019A44993k8308J49733B9177e444p5547A2142K96483a7320A55584
16190B37715g0383b7932A38242n3091l9144L7655a88739l6179d3130J443A26578
16178b11167H4775J87125G3813b75419B07157E0951L9004i6067A75028h2525q5801
16167a68326A7782J88671b08261k35687A6285b76542A39814h834j54197H6779
16156C74967b75919A14242b8712C98210a907A28076E664Q6266m2284a25007A27704
16144a27511E1572N1438c14193H995R5612A0233a66844g5925J0140j5261n8599
$$ plain form
16133 -139645 -145131 5704 105907 46693 94314 25326 8723 -22448 82037 14802 57938 260303
16121 260303 -212344 -28745 156960 -380428 28998 -138128 66840 -205479 -102136 136927
16110 207040 237042 201062 -189090 -35855 -12081 -65669 472087 197251 143847 140334 -252635
16098 -54898 25205 256141 110428 -49912 -63735 273646 -22679 -11020 -152113 106714 370166
16087 370166 -314095 74802 142939 -155177 292536 -357394 -246554 -14685 38592 -28032
16076 -139095 -30991 120718 -59188 -19905 209522 -91707 -19596 304738 -278979 152800
16065 151539 221225 -12220 -90957 279430 -231234 408925 -17308 -371254 499826 -106989
16054 233351 103695 -31308 22297 46119 -15791 211991 -335861 48996 -357337 8170 -255787
$$ packed form
16133a39645n486E704J00203D6693M7621B5326H723b2448H2037A4802M3136K02365
16121B60303b12344b8745A56960c80428B8998a38128F6840b05479a02136A36927
16110B07040L0002l5980a89090c5855a2081n3588D72087A97251n3404l513b52635
16098e4898B5205K30936A10428d9912j3823B73646b2679a1020j41093A06714K63452
16087C70166c14095G4802O8137a55177B92536c57394J10840a4685C8592b8032
16076a39095c0991A20718e9188a9905B09522i1707a9596C04738b78979A52800
16065A51539O9686a2220p8737B79430b31234D08925a7308l53946D99826a06989
16054B33351A03695c1308B2297K3822a5791B11991c35861D8996c57337H170b55787
$$ plain form
16042 166568 82507 -11283 -234665 66089 163983 70724 -591 40528 -225624 274585 -122929
16030 220652 -25580 -230041 -76220 18333 105544 143896 -66868 145825 182315 10169 19905
16019 19905 127020 -170671 -84850 295714 130193 -275074 -62321 -79809 451580 -241494
16008 -35452 -170926 -238967 -10879 160365 -49420 106407 125968 -119600 -189330 -22345 73117
15996 -34394 -23544 24253 605 -387727 -61790 73058 -132783 -15145 -310022 -146624 297283
15984 229625 525742 315405 234715 481348 226218 28162 324058 208223 32360 -65872
15973 7374 -239803 -123630 -79978 -73489 82034 -350407 -441536 26193 26496 186245 -124048
15961 -335211 4449 135611 54061 -161053 56211 130180 -85861 142101 -115201 -431048 52891
$$ packed form
16042A66568H2507a1283k23382F6089R7894G0724e91D0528b25624B74585a22929
16030B20652b5580k04461g6220A8333Q7211L8352f6868A45825L6490A0169R736
16019A9905J07115a70671h4850B95714A30193b75074f2321j7488D51580b41494
16008c5452j35474o8041a0879A60365d9420A06407J9561a19600o9730b2345G3117
15996c4394J0850B4253F05c87727f1790G3058a32783a5145k94877a46624B97283
15984B29625K96117k10337q0690K46633B26218B8162K95896j15835C2360f5872
15973G374b39803J16173M3652O489H2034c50407r1129B6193L03J59749a24048
15961c35211D449J31162E4061a61053E6211P3969h5861A42101a15201l15847E2891
$$ plain form
15949 -49732 -340025 -106808 161625 36104 -84445 195392 -11403 -442669 -225677 -550 116757
15937 435805 -438952 -54595 86927 -12181 -193209 -191524 -93047 -25997 -216202 -101784 124071
15925 63382 12295 -84803 226314 -46473 -148969 66350 48583 58763 -103195 55124 -199793
15913 -61208 -138299 97081 237088 -75166 50175 -163753 -33194 267156 -146358 -119062 194280
15901 -164386 -310838 -58262 -38034 34562 -55516 -195695 -102623 48040 137176 187893 -32115
15889 -128491 -41223 -121205 -20227 -39923 151964 -120174 -189007 -234819 -233761 -213371 -118503
15878 -118503 -51969 385408 -47059 35234 125195 -226166 -75444 187823 -57513 52566 -16920
15866 -219348 -175021 113985 -210564 69875 262504 67991 164554 144181 -171147 265773
$$ packed form
15949d9732k90293a06808A61625C6104h4445A95392a1403m31266K16992e50A16757
15937D35805d38952e4595H6927a2181j81028J685i3047b5997j90205a01784A24071
15925F3382A2295h4803B26314d6473j02496F6350j7767J0180a03195E5124a99793
15913f1208p7091I7081J40007g5166E0175a63753c3194B67156a46358K7296A94280
15901a64386j46452e8262K0228C4562e5516j40179R3072D8040Q9136N0717c2115
15889a28491d1223p9982b0227j9696A51964a20174o8833m5812J058K0390R4868
15878a18503e1969C85408d7059C5234Q9961b26166g5444A87823e7513E2566a6920
15866b19348M4327A13985b10564F9875J92629F7991R6563k0373a71147B65773
$$ plain form
15855 59989 -227283 70230 -300140 81622 68685 -269101 -269330 111406 275462 -50113 -223715
15844 -223715 114332 -136913 -245036 -180403 47333 99696 -112288 -18266 -27764 -8690 -203537
15833 -203537 122422 59529 355802 184928 136966 70656 -97278 -241050 19143 -45687 233262
15821 -246701 -177752 96549 -32741 168499 -222434 48013 -220928 -302751 -18194 351862 -342893
15809 -116670 216181 77253 484337 -358244 -381470 52998 21438 94628 -68023 -207030 155231
15797 35269 34905 14311 88041 487306 446692 -49072 17746 31942 47327 107789 -109215 -102120
15785 -102120 -27471 106707 -287187 35866 -23354 -58310 28014 127912 -251119 -190600 -307403
15774 -307403 300993 -69016 -21650 -247358 -90061 -250212 -35519 169328 -15041 -189228
$$ packed form
15855E9989b27283G0230c00140H1622j2937b69101k29A11406J64056e0113j73602
15844b23715A14332a36913j08123O4633D7333N2363a12288a8266r498h690j94847
15833b03537A22422E9529K96273j70874m7962o6310i7278j43772A9143d5687B33262
15821b46701O8949I6549c2741A68499b22434D8013b20928q1823a8194C51862c42893
15809a16670B16181G7253M07084c58244k3226E2998B1438P3190f8023j39007A55231
15797C5269l64A4311P3730L99265m0614d9072A7746J4196J5385O0462a09215P095
15785a02120b7471A06707b87187C5866b3354l4956B8014R9898b51119O0519j16803
15774c07403C00993f9016b1650k25708i0061j60151c5519A69328a5041j74187
$$ plain form
15764 -189228 -16451 700 -218624 -220787 294369 45874 74379 344398 137168 242142 -11100
15752 114438 218545 -28539 -92000 123863 96788 -111005 -21608 11878 29376 -202355 146732
15740 54502 -156400 161056 73011 -103362 -281939 23252 -99812 -87991 -167315 -154135 -160425
15729 -160425 49107 -183367 187345 83770 -223392 63774 -167439 -135988 1234 -129377 -73803
15718 -73803 259785 -79630 -153629 228771 -139105 8966 33905 -347528 -79318 154436 12883
15706 -323632 -176271 262223 -203922 -22734 -161000 269606 185462 54274 -150222 48540
15695 -46851 207662 33712 48421 24661 -34518 57803 -87794 -180666 124441 23031 36135
15684 36135 62164 73119 -73102 99223 56721 233664 91110 -49415 -173323 35512 5187
$$ packed form
15764a89228a6451G00b18624k163B94369D5874K8505K70019A37168J04974a1100
15752A14438J04107b8539o3461A23863k7075a11005b1608A1878J7498b02355A46732
15740E4502a56400A61056G3011a03362j78577B3252i9812J1821p9324J3180o290
15729a60425D9107a83367A87345H3770b23392F3774a67439L1451A234a29377N5574
15718g3803B59785g9630p3999B28771a39105H966K4939c47528g9318A54436A2883
15706c23632J47361B62223b03922b2734j38266B69606q4144E4274a50222D8540
15695d6851B07662C3712J4709k3760c4518E7803h7794r2872A24441B3031J3104
15684C6135K6029J0955g3102I9223m2502J76943I1110d9415j23908C5512E187
$$ plain form
15672 -74070 7660 286349 -236950 -250772 63970 227458 -120480 -280955 89248 -17618 -23840
15661 -23840 37129 -27452 158034 32940 28276 -239008 64713 -134536 -177668 296827 -135013
15649 81194 -239332 -79196 75653 -12384 -69415 -111407 70556 92458 131246 104121 -217586
15637 -26968 -102213 148987 -80148 24620 -76765 43945 -302043 118102 -175709 -449215 -216441
15625 98130 -46182 -194614 -63033 323953 -55091 -5226 15169 -60612 -77753 120860 111724
15614 111724 -32064 260614 107033 -211269 145293 -118771 -456954 249073 -221053 -73457
15603 66166 88914 -215296 -111077 32736 -286017 -64060 342091 78945 -153473 13394 11152
15592 11152 126073 387749 179380 51419 -42878 -126225 -29347 309041 -134884 -57657 72894
$$ packed form
15672g4070G660K78689b36950j3822F3970J63488a20480j60475H9248a7618o222
15661b3840C7129b7452A58034C2940m664b39008F4713a34536m3132B96827a35013
15649H1194b39332g9196G5653a2384n7031m1992G0556K1902L8788k7125b17586
15637b6968p5245A48987h0148B4620g6765D3945c02043A18102a75709k73506b16441
15625I8130d6182j48432f3033C23953e5091e226A5169f0612j7141A20860r136
15614A11724c2064B60614A07033b11269A45293a18771l38183B49073b21053g3457
15603F6166K2748b15296J04219C2736b86017f4060C42091G8945a53473A3394k242
15592A1152J14921K61676A79380E1419d2878q3347b9347C09041a34884e7657G2894
$$ plain form
15580 404973 17389 -379593 -44394 187430 -110112 107273 283081 34493 88872 -86057
15569 -314175 -166899 -82904 -66877 -154442 156558 -38803 -231127 387440 96305 -212883
15558 -131274 -95053 -89393 -64390 331879 246087 48548 -18137 172471 297352 51579 -208326
15546 67523 -43464 36320 382776 -300883 -65822 -86380 -7560 -160146 -46654 395821 83480
15534 163134 -173898 156417 51464 754 -70958 49344 -123389 68377 -159077 -34748 -17569
15523 -17569 1427 -65947 -112763 285552 -125080 -3720 -16207 127086 176189 -359404 -147057
15511 -108756 -39717 452564 -219941 6735 -118450 301057 164403 317713 82282 261423
15501 261423 2820 -234114 88012 72723 1784 64999 -205300 121590 -259354 -69575 -45167
$$ packed form
15580D04973A7389c79593d4394A87430a10112A07273J75808C4493N4379h6057
15569c14175J47276h2904J6027q7565A56558c8803j92324C87440I6305b12883
15558a31274L6221N660K5003C31879q5792D8548a8137A72471J24881E1579b08326
15546F7523d3464C6320L46456c00883f5822k0558g560j52586d6654C95821H3480
15534A63134a73898A56417E1464G54g0958D9344a23389F8377a59077c4748J7179
15523a7569A427f5947m6816B85552a25080c720j2487A27086M9103c59404a47057
15511a08756c9717D52564b19941F735a18450C01057j36654J53310H2282J79141
15501B61423B820b34114H8012j5289A784O3215b05300A21590b59354f9575K4408
$$ plain form
15490 -45167 -105037 1572 -136086 -59014 -433883 -51495 129651 -20156 -34148 222903 -46834
15478 -156566 27649 -100588 -227947 -167222 -309751 -119071 -51961 250435 228962 -1593 441307
15466 -115591 -225286 122696 3116 -65941 -326263 -60868 276488 93170 -153358 -242279 -153514
15455 -153514 32663 91638 287509 -38556 -2226 -99108 -99050 -121913 -76059 -137828 259399 -219708
15442 -158926 10571 -244734 114452 7803 9079 24084 -76304 -103304 8621 -28701 -138021
15431 -138021 122426 24641 -12884 248039 139849 -84244 -165294 12630 -23014 -342960 -235358
15420 -235358 -36562 36042 164640 -230864 -9141 -190836 -310296 150353 -143047 -516582
15410 -516582 293177 -52150 -38597 -103764 123268 56226 28322 45863 -84828 -437175 -162909
$$ packed form
15490d5167n9870A572a36086e9014l74869e1495A29651b0156j3992B22903d6834
15478a56566B7649a00588j27359O0725j42529a19071e1961B50435k1473a593D41307
15466a15591j09695A22696C116f5941k60322f0868B76488I3170a53358q8921Q8765
15455a53514C2663N8975J95871c8556b226r6882N8k2863M5854o1769B59399b19708
15442a58926A0571b44734A14452G803J276J5005g6304k7000H621b8701j09320
15431a38021A22426B4641a2884B48039j08190h4244q1050A2630b3014l19946J07602
15420b35358c6562C6042J28598b30864i141j81695j19460A50353a43047l73535
15410e16582B93177e2150J3553o5167A23268E6226k7904J7541h4828l52347a62909
$$ plain form
15398 -56161 96154 -322896 103177 231248 68309 38864 -89795 69015 -488478 150208 -32136
15386 -5882 -130861 87542 -198566 1381 -466191 156613 94960 -45006 -247208 -4895 -37031
15375 -37031 -89674 26119 -43705 13694 37107 -223337 168475 -534098 -132155 197138 150944
15364 150944 60623 -7907 -98908 22977 -84156 93473 108545 -199627 145689 -181780 -164620
15353 -164620 159092 277097 -194077 141067 -62519 -226321 165459 100801 12842 -95306
15342 -150267 61697 112194 208081 87000 167449 -92375 7804 46595 112384 166122 84836 -306262
15329 436481 -10762 -41983 -301203 205343 -243673 -15625 -77565 97154 34973 -129526 -231706
15318 -231706 101425 -360493 251872 15882 -181274 126408 -15641 285030 -244090 -170159
$$ packed form
15398e6161I6154c22896A03177J28071F8309k9445h9795F9015d88478A50208c2136
15386e882j24979H7542a98566A381d66191A56613o1653d5006k02202d895l2136
15375c7031n2643B6119d3705A3694K3413b23337A68475e34098a32155A97138m6194
15364A50944F0623g907r1001B2977h4156I3473J5072a99627A45689a81780J7160
15353a64620A59092J18005a94077A41067f2519j63802A65459o4658A2842i5306
15342a50267F1697N0497R5887H7000Q0449i2375G804L8791O5789N3738q1286c06262
15329D36481a0762l1221k59220B05343b43673a5625o1940I7154C4973a29526j02180
15318b31706A01425c60493B51872A5882a81274A26408a5641B85030b44090P3931
$$ plain form
15308 -170159 8906 262366 -63807 -93443 154544 206191 -166537 -33294 119315 14632 -174076
15296 -255615 225547 -52597 279415 120623 161403 102405 196381 236631 234634 334458 404613
15285 404613 144072 119685 150637 231599 454192 14056 281998 -39992 25210 66839 -25312
15273 -80843 -22145 -62902 105004 -38061 -46654 -15983 108568 351828 275066 -44141 -4998
15261 -20642 -99100 221835 -282002 189934 74282 -5328 142054 24939 286557 147356 309922
15250 309922 817508 990188 1541992 738788 973758 1135668 718782 192298 -172144 253714
15239 22161 41152 -123019 -214247 -9488 -29104 -3052 242756 28452 83896 66651 271946
15228 271946 -123648 48670 241599 -54396 84365 -180246 -166686 -23275 180528 -35909 -283729
$$ packed form
15308a70159H906K53460f3807k9636A54544N1647a66537c3294A19315A4632a74076
15296b55615B25547e2597B79415A20623M0780n8998R3976M0250j997R9824P0155
15285D04613A44072k4387L0952Q0962K22593A4056K67942c9992B5210M1629b5312
15273h0843b2145m0757A05004c8061q593a5983A08568K43260p6762d4141d998
15261b0642p8458B21835b82002A89934G4282e328A42054B4939K61618j39201J62566
15250C09922N07586J72680N51804G38788K34970J61910m16886A92298a72144B53714
15239B2161J8991a23019r1228i488j9616c052B42756B8452N5444j7245K05295
15228B71946a23648D8670J92929e4396H4365a80246J3560b3275A80528c5909k47820
$$ plain form
15217 -283729 149192 118722 -197256 108094 -160297 47076 -175949 246774 -4986 -263494
15207 -263494 -51509 -74915 -614 -251424 277572 -136885 74343 144985 -65138 -4592 140691
15195 128378 101278 262182 15831 128856 289044 -68671 -12559 -29095 289519 -283603
15184 -34913 -193578 116440 23214 187290 2145 286594 293607 116988 159680 43194 -121434
15172 95180 -2745 128638 -187420 28843 -77451 374125 -121717 6212 134253 -40688 314188
15160 165580 86702 71484 -167198 -39259 258288 227553 294934 -20499 10525 120967 -185397
15148 -23230 353257 178022 498868 145924 87008 72348 -28214 -162936 147664 -145867
15137 72790 59029 287958 31950 23218 132716 405294 127940 133946 -354822 205796 423601
$$ packed form
15217b83729A49192l0470a97256A08094a60297D7076a75949B46774d986k58508
15207b63494e1509k3406f14k50810B77572a36885G4343P0642f5138d592A40691
15195A28378k7100J60904A5831J13025J60188f8671a2559j6536B89519b83603
15184c4913j58665A16440B3214J64076B145K84449P013A16988M2692D3194a21434
15172I5180b745A28638a87420B8843g7451C74125a21717F212J28041d0688C14188
15160A65580p8878j5218a67198c9259B58288l0735O7381b0499A0525J10442a85397
15148b3230C53257j75235L20846A45924n8916j4660b8214j34722A47664a45867
15137G2790j3761K28929C1950q732J09498K72578A27940O006c54822B05796K17805
$$ plain form
15126 423601 57626 -148477 311021 220324 193354 -147095 293497 200727 522 86882 59944
15115 59944 298086 -219541 83249 211595 112591 -124387 77447 251603 194490 109632 134373
15104 134373 -145592 153585 117428 -191881 6771 265041 199793 221445 31208 -165441 33680
15092 146274 -32546 39504 -50366 87726 9677 96872 -220538 -200081 168415 679608 61863
15080 112786 127544 49601 143557 4958 66892 444615 -151316 65764 269319 159686 179103
15069 179103 124199 67984 414568 333140 365498 139336 137561 -131875 84095 94952 245781
15058 245781 89467 242766 135175 -97239 2958 30809 323144 -111588 30284 317033 -5836
15046 148648 362303 325148 175520 139634 388807 23881 125163 68913 12572 21513 41831
$$ packed form
15126D23601E7626a48477C11021r0697k6970a47095B93497r2770E22Q6360k6938
15115E9944K38142b19541H3249J28346r9004a24387G7447J74156n7113q4858K4741
15104A34373a45592A53585l6157a91881F771K58270o5248K1652C1208a65441C3680
15092A46274c2546C9504e0366H7726I677Q7195b20538K0457A68415N11193F1863
15080A12786J4758D9601R3956D958O1934L77723a51316F5764K03555j09633J9417
15069A79103n4904n6215L46584q1428L2358A39336j775a31875H4095J0857J50829
15058B45781H9467J53299j07591i7239B958K7851K92335a11588C0284K86749e836
15046A48648K13655l7155j49628l5886K49173B3881J01282n6250A2572Q941K0318
$$ plain form
15035 41831 -34637 -100085 387728 7295 -17992 -185843 118011 187924 49069 63982 110420
15024 110420 -55871 122073 407700 -54209 177849 166972 322185 221498 321421 187597
15014 187597 155197 -61790 188612 202721 274898 -184596 457096 424150 439334 361261 -156806
15002 -102047 183595 2086 363216 251372 -110112 82591 397008 349923 300916 90880 191667
14991 191667 455354 357431 -17973 466628 304781 56830 250132 1741 213802 -91924 234983
14979 456039 291332 322427 444927 344861 107545 310564 643506 233773 367418 561386
14969 561386 291587 347735 -215232 64466 158874 323650 366498 245703 80441 298690
14959 298690 432092 384323 -118811 338623 -51863 377504 280996 -244371 198573 513899
$$ packed form
15035D1831c4637o5448C87728G295a7992j67851A18011O9913D9069J4913M6438
15024A10420e5871A22073K85627e4209A77849j0877J55213j00687R9923j33824
15014A87597l2400f1790A88612J4109P2177a84596D57096l2946J5184p8073a56806
15002a02047A83595B086L61130j11844a10112H2591L14417m7085m9007I0880J00787
14991A91667K63687r7923a7973D66628j61847E6830J93302A741K12061i1924B34983
14979D56039j64707L1095J22500j00066A07545K03019L32942B33773J33645J93968
14969E61386k69799N6148b15232F4466R4408J64776M2848j20795H0441K18249
14959B98690J33402m7769a18811C38623e1863C77504r6508b44371A98573L15326
$$ plain form
14949 513899 277289 352309 334510 137834 201904 383852 218757 27704 304887 224709
14939 224709 331196 358382 268601 205738 105393 331456 224333 319233 562263 162735
14928 -51112 216968 224418 340331 425357 137492 424047 99116 376607 12124 557739 252682
14916 -95600 571806 184079 159159 332527 8347 562539 306193 293131 235553 186700 242531
14905 242531 283025 786129 215103 175820 294788 63495 437262 185298 211751 60898
14894 56538 356781 379298 246896 179962 -140241 78803 591426 446964 248418 372056
14884 372056 269789 -106652 508520 649807 318059 363598 649543 400944 360284 193715
14874 193715 376468 287323 237481 317328 583640 363112 674574 437126 333526 293622
$$ packed form
14949E13899k36610P5020j7799A37834O4070J81948j65095B7704K77183q0178
14939B24709J06487K7186q9781o2863j00345K26063j07123R4900K43030A62735
14928e1112B16968P450J15913Q5026A37492K86555I9116K77491A2124N45615B52682
14916i5600E71806A84079k4920J73368H347N54192k56346j3062n7578m8853N5831
14905B42531M0494N03104B15103l9283J18968F3495L73767A85298K6453F0898
14894E6538L00243K2517j32402o6934a40241G8803N12623j44462j98546J23638
14884C72056j02267a06652E08520J41287C18059M5539K85945k48599m0660j66569
14874A93715J82753q9145m9842P9847K66312k20528L11462k37448j03600l9904
$$ plain form
14864 293622 316894 324725 467283 250278 293915 412466 -38286 468852 374548 346612 526535
14853 526535 342150 332332 104730 211277 251367 340995 253416 527553 207723 486038
14843 486038 478537 567988 268665 391263 517639 440830 411371 603418 399711 403967 534418
14832 534418 844943 370266 290018 608025 91813 236097 476628 507351 402967 424156
14822 424156 581143 160047 780210 376613 596520 658165 439126 705669 412766 89950
14811 507236 262727 123483 370257 538492 475586 269251 449378 -175719 425030 354215
14801 354215 328926 110274 523439 283020 239300 585957 551099 395550 479838 459900
14791 459900 404198 308626 849226 522847 847643 410001 450449 431704 635035 550132
$$ packed form
14864B93622K3272P831J42558k17005M3637J18551c8286D68852r4304k7936J79923
14853E26535j84385r818A04730J06547M0090Q9628q7579K74137B07723K78315
14843D86038p501Q9451B68665J22598J26376p6809k9459J92047k03707M256J30451
14832E34418L10525C70266q0248L18007I1813J44284K40531L0723j04384K1189
14822D24156J56987A60047O20163C76613K19907O1645k19039K66543k92903H9950
14811E07236k44509A23483K46774J68235o2906k06335J80127a75719D25030p0815
14801C54215k5289A10274M13165k40419m3720L46657l4858j55549Q4288j9938
14791D59900n5702r5572N40600l26379L24796D10001M0448j8745K03331q4903
$$ plain form
14781 550132 485091 573624 659078 942783 425561 685201 603799 512856 399091 555215
14771 555215 466872 367678 605897 321190 251013 403253 776325 541710 648927 524131
14761 524131 766578 894655 652475 588721 357108 901176 816406 620941 436696 586993
14751 586993 883694 590835 406082 718249 566792 553508 947971 690783 483377 781351
14741 781351 791079 758995 655053 810335 520185 683224 748116 939848 738755 418984
14731 418984 511271 786491 1043984 440193 721322 624512 703673 623862 701425 1118827
14721 1118827 949036 457560 419166 868323 730680 619030 795883 653168 835005 1115644
14711 1115644 931474 964972 865711 476073 594659 812059 668683 830845 870874 643929
$$ packed form
14781E50132o5041Q8533Q5454K83705D25561K59640q1402r0943j13765J56124
14771E55215q8343r9194K38219k84707p0177J52240L73072k34615J07217j24796
14761E24131K42447J28077k42180o3754k31613N44068q4770j95465j84245J50297
14751E86993K96701k92859j84753L12167j51457j3284L94463k57188k07406K97974
14741G81351R728l2084j03942J55282k90150J63039O4892J91732k01093l19771
14731D18984R2287K75220K57493D40193K81129r6810P9161p9811P7563M17402
14721A118827j69791D57560l8394M49157j37643j11650J76853j42715J81837K80639
14711A115644j84170L3498r9261l89638J18586K17400j43376J62162M0029k26945
$$ plain form
14701 643929 720094 814101 893248 809154 726685 965184 1254542 766976 740697 1013767 1061041
14690 1061041 819311 987818 629275 1011511 1066161 1003015 846387 718397 722989 716720
14680 716720 763764 760218 701802 1058192 754028 861560 971630 903672 1321712 921001
14670 921001 1051686 1004858 899006 993732 1353035 1009710 901952 1160209 1030936 1066966
14660 1066966 970630 938563 1037830 1302980 858337 1068645 1094543 1098782 1229207 1160116 1279280
14649 1279280 1051833 1317430 1057494 1044350 1109273 1138603 1276525 1353675 1058966 1209428
14639 1209428 1516316 957821 1363573 1248181 1297924 1084179 1076039 1301622 1337380 1439661
14629 1439661 1160625 1345020 1276678 1547835 1428862 1502779 1544332 1362415 1188793 1327147
$$ packed form
14701F43929P6165R4007P9147q4094q2469K38499K89358m87566k6279K73070M7274
14690A061041k41730J68507l58543L82236N4650o3146j56628j27990M592o269
14680G16720M7044l546n8416L56390l04164J07532J10070o7958M18040m00711
14670I21001J30685m6828j05852R4726L59303l43325j07758K58257j29273L6030
14660A066966r6336l2067R9267K65150m44643K10308K5898M239J30425o9091J19164
14649A279280k27447K65597k59936j3144O4923K9330J37922P7150k94709J50462
14639A209428L06888n58495M05752j15392M9743k13745q140K25583L5758J02281
14629A439661k79036J84395o8342K71157j18973P3917M1553j81917j73622J38354
$$ plain form
14619 1327147 1332684 1216668 1273745 1313871 1537853 1318074 1696628 1304688 1215916 1696472
14609 1696472 1378183 1594727 1735837 1690225 1397140 1620945 1460779 1662802 1314170 1357591
14599 1357591 1504447 1866993 1548242 1498685 1707788 1885777 1436295 1522765 1700693 1972568
14589 1972568 1612357 1746213 1413427 1626229 1741246 1789131 1707637 1822465 2020213 1720369
14579 1720369 2056582 1925553 1957285 1902855 2135133 1993833 1748582 1984107 1995534 1705362
14569 1705362 1960804 2187512 2127881 2195693 2437577 2687285 2520374 2485867 2459467 2493363
14559 2493363 2934436 2732434 3211658 3100866 3398234 3533914 3725099 4429396 5430383
14550 5430383 6504774 9126145 13875321 21847044 36653661 38309899 19158800 9256918
$$ packed form
14619A327147N537j16016N7077M0126K23982k19779L78554l91940q8772M80556
14609A696472l18289K16544J41110m5612k93085K23805j60166K02023l48632M3421
14599A357591J46856L62546l18751m9557K09103J77989m49482Q6470J77928K71875
14589A972568l60211J33856l32786K12802J15017M7885q1494J14828J97748k99844
14579A720369L36213j31029L1732n4430K32278j41300k45251K35525J1427k90172
14569A705362K55442K26708n9631O7812K41884K49708j66911l4507k6400L3896
14559B493363M41073k02002M79224j10792K97368J35680J91185P04297J000987
14550E430383J074391K621371M749176P971723J4806617J656238j9151099I256918
$$ plain form
14541 5356864 3434936 2823278 2525848 2203010 1857552 1836919 1872513 1709960 2100149 2237636
14531 2237636 2192387 2460379 1991203 2492438 2265949 2002132 2375237 2437927 2324330 2407404
14521 2407404 2094278 2432109 2451226 2388795 2756680 2446241 2629006 2528387 2793579 2590126
14511 2590126 2788846 2659046 2819692 3084239 2983532 3202193 2729360 3194877 2939924
14502 2939924 2829131 3038964 3268653 2903086 3169268 3097405 3199297 3120804 3049066 3319400
14492 3319400 3458154 3551384 3506407 3744904 3461585 3373792 3460050 3715977 3588377 3819059
14482 3819059 3515454 4172826 3743864 3865873 4146106 3868912 3740302 4266461 3912647
14473 3912647 3906895 4003887 4052410 4122259 4089940 4141378 4357097 4335068 4336999 4479657 4541806
$$ packed form
14541E356864j921928o11658k97430l22838l45458k0633L5594j62553L90189J37487
14531B237636m5249K67992m69176N01235k26489k63817L73105O2690j13597Q3074
14521B407404l13126L37831J9117o2431L67885l10439J82765j00619K65192k03453
14511B590126J98720j29800J60646K64547j00707K18661m72833M65517k54953
14502B939924j10793K09833K29689l65567K66182p1863J01892p8493p1738K70334
14492C319400J38754R3230m4977K38497k83319q7793Q6258K55927j27600K30682
14482C819059l03605O57372m28962J22009K80233k77194j28610N26159l53814
14473C912647n752R6992M8523O9849l2319N1438K15719k2029J931J42658O2149
$$ plain form
14462 4541806 4855968 4755825 4958117 5120696 4972006 4940732 4780234 4819582 4928409 4877157
14452 4877157 5062587 5122091 4855044 5694633 5516504 5350925 5613186 6024177 5644205 5906236
14442 5906236 5736915 5887887 5754790 6285968 6300319 6298755 6409557 6338552 6762096 6274160
14432 6274160 6599206 6910577 6639398 6702362 6950131 7098097 7130622 7089152 7204015 7336552
14422 7336552 7576180 7421682 8022743 8085396 7971866 8106896 8061077 8081970 8600953 8647082
14412 8647082 8329838 8805379 8775908 8927258 9116783 9489129 9620929 9441894 9708932 9737293
14402 9737293 9944165 10325515 10477614 10423068 10869558 11005320 11268898 11101777 11361336 11638974
14392 11638974 11905561 11774821 12114836 12337005 12665224 12884987 12904381 12980000 13584001 13704391
$$ packed form
14462D541806L14162j00143K02292J62579j48690l1274j60498L9348J08827n1252
14452D877157J85430N9504k67047Q39589j78129j65579K62261M10991l79972K62031
14442E906236j69321J50972j33097N31178J4351j564J10802p1005M23544m87936
14432F274160L25046L11371k71179O2964K47769J47966L2525m1470J14863J32537
14422G336552K39628j54498O01061O2653j13530J35030m5819K0893N18983M6129
14412H647082l17244M75541k9471J51350J89525L72346J31800j79035K67038K8361
14402I737293K06872L81350J52099n4546M46490J35762K63578j67121K59559K77638
14392A1638974K66587j30740L40015K22169L28219K19763J9394P5619O04001J20390
$$ plain form
14382 13704391 13814972 14273564 14433534 14585490 14419268 14932338 15614524 15726342 16432028
14373 16432028 16468052 16519317 17050751 17317435 17740586 18157952 18681596 18776394 19303227 19740421
14363 19740421 20033496 20510478 20789246 21363139 21992259 22675282 22640782 23112271 24110621
14354 24110621 24505582 25017399 25267390 26366077 26846115 27303746 28118059 29312253 29613331
14345 29613331 30286338 31459356 32270757 32798669 33663389 34788362 35424396 36732877 37833039
14336 37833039 38679455 40126610 41169171 42676194 43762674 45137551 46512974 47857959
14328 47857959 49403474 51046846 52749991 54306481 56428333 58215677 60284589 62299817
14320 62299817 64389241 66915931 69159245 72337520 74765663 77718984 80551860 83990394
$$ packed form
14382A3704391J10581M58592J59970J51956j66222N13070O82186J11818P05686
14373A6432028L6024N1265N31434K66684M23151M17366N23644R4798N26833M37194
14363A9740421K93075M76982K78768N73893O29120O83023l4500M71489R98350
14354B4110621L94961N11817K49991J098687M80038M57631Q14313J194194L01078
14345B9613331O73007J173018Q11401N27912Q64720J124973O36034J308481J100162
14336C7833039Q46416J447155J042561J507023J086480J374877J375423J344985
14328D7857959J545515J643372J703145J556490K121852J787344K068912K015228
14320F2299817K089424K526690K243314L178275K428143K953321K832876L438534
$$ plain form
14312 83990394 87398682 91064742 94501497 99005830 102864248 107171988 112305638 117117651
14304 117117651 122640865 128064429 134041396 140363598 146898499 154255580 161701332 169672519
14296 169672519 178416726 187165784 196910052 206967307 217876706 229107966 241096401
14289 241096401 253576633 266642542 280085472 294304786 308769151 323960646 338465577
14282 338465577 353235111 367582637 381516301 395416573 408430493 420196274 430710952
14275 430710952 439292642 446326501 450291771 451453115 452012360 452541512 451500261 448802837
14267 448802837 442309153 434650977 426713369 417195562 406377624 394338134 380961366
14260 380961366 366525740 351211508 335331845 319600549 304071983 289779446 275597645
$$ packed form
14312H3990394L408288L666060L436755M504333L858418M307740N133650M812013
14304A17117651N523214N423564N976967O322202O534901P357081P445752P971187
14296A69672519Q744207Q749058R744268J0057255J0909399J1231260J1988435
14289B41096401J2480232J3065909J3442930J4219314J4464365J5191495J4504931
14282C38465577J4769534J4347526J3933664J3900272J3013920J1765781J0514678
14275D30710952Q581690P033859L965270J161344N59245N29152j041251k697424
14267D48802837o493684p658176p937608r517807j0817938j2039490j3376768
14260C80961366j4435626j5314232j5879663j5731296j5528566j4292537j4181801
$$ plain form
14253 275597645 261406313 248683114 236219673 224277520 213233228 202648655 192635070
14246 192635070 183048196 174503340 165673418 158265495 150849145 143861938 137153819 131026364
14238 131026364 125296876 120165672 114787599 109817930 105205526 100935128 96895255 93332833
14230 93332833 89415679 85754341 82582999 79204466 76295886 73511802 70702556 68243614
14222 68243614 65627450 63644075 61404701 59563124 57786599 55322991 54108609 52053187
14214 52053187 50578857 49326745 47460405 45889565 44647095 43249553 42196040 41348206
14206 41348206 40508953 38813974 37695601 36727485 35669978 34785018 34245092 33053146 32403110
14197 32403110 31105031 30428099 29718917 28975937 28620876 27799034 27319272 26180920 25442716
$$ packed form
14253B75597645j4191332j2723199j2463441j1942153j1044292j0584573j0013585
14246A92635070r586874q544856q829922p407923p416350o987207o708119o127455
14238A31026364n729488n131204n378073m969669m612404m270398m039873l562422
14230I3332833l917154l661338l171342l378533k908580k784084k809246k458942
14222F8243614k616164j983375k239374j841577j776525k463608j214382k055422
14214E2053187j474330j252112j866340j570840j242470j397542j053513q47834
14206D1348206q39253j694979j118373r68116j057507q84960n39926j191946o50036
14197C2403110j298079o76932p09182p42980l55061q21842m79762j138352p38204
$$ plain form
14188 25442716 24727203 24556113 23871824 23300421 22767420 22386713 21858691 21419462 20960976
14179 20960976 20296444 19945720 19697647 19282659 18840613 18110681 18309841 17380462 17306920
14170 17306920 17232756 17106422 16403042 16268858 15730708 15402666 14977175 14821424 14689944
14161 14689944 14481322 14024974 13837259 13851822 13407290 13584418 12907823 12710055 12279250
14152 12279250 12463781 12009600 11888781 12105017 11546406 11435704 10978811 10689026 10849488
14143 10849488 10582375 10586369 10394688 10081879 10452624 10033426 9730396 9589848 9570081 9174977
14133 9174977 9133908 8925645 8797313 8855247 8776942 8602715 8222999 8525254 7905497 8213223
14123 8213223 8166984 7764928 7797591 7352653 7522626 7417344 7264587 7196663 7308315 7027603
$$ packed form
14188B5442716p15513j71090o84289n71403n33001l80707n28022m39229m58486
14179B0960976o64532l50724k48073m14988m42046p29932J99160r29379p3542
14170A7306920p4164j26334p03380j34184n38150l28042m25491j55751j31480
14161A4689944k08622m56348j87715J4563m44532J77128o76595j97768m30805
14152A2279250J84531m54181j20819K16236n58611j10702m56893k89785J60462
14143A0849488k67113L994j91681l12809L70745m19198l03030j40548j9767l95104
14133I174977m1069k08263j28332N7934p8305j74227l79716L02255o19757L07726
14123H213223m6239m02056L2663m44938J69973j05282j52757o7924J11652k80712
$$ plain form
14113 7027603 7145808 6766169 6713830 6770047 6631976 6773098 6521087 6501831 6539295 6220056
14103 6220056 6076105 5792505 6126216 6092816 6117937 5840254 5532279 5867371 5732053 5223627
14093 5223627 5233378 5570820 5317072 5385355 5200004 5112169 5276732 4825754 5162723 5214597
14083 5214597 4947931 4835844 4627855 4730951 4698607 4606113 4541877 5053456 4508498 4621211
14073 4621211 4549425 4168891 4336373 4091008 4184305 4318927 3935067 4166908 4162508 4036889
14063 4036889 3963935 4088227 4041313 3796072 4013606 4087793 4016825 4163104 3726567 3775126
14053 3775126 3942722 3366938 3794295 3884584 3393401 3612869 3542008 3576242 3552766 3207533
14043 3207533 3372897 3605658 3246500 3201213 3190035 2871164 3195384 2936712 3103688 3141259
$$ packed form
14113G027603J18205l79639n2339N6217j38071J41122k52011j9256L7464l19239
14103F220056j43951k83600L33711l3400K5121k77683l07975L35092j35318n08426
14093E223627R751L37442k53748O8283j85351q7835J64563m50978L36969N1874
14083E214597k66666j12087k07989J03096l2344r2494o4236N11579n44958J12713
14073D621211p1786l80534J67482k45365R3297J34622l83860K31841m400j25619
14063D036889p2954J24292m6914k45241K17534P4187p0968J46279m36537M8559
14053C775126J67596n75784M27357R0289m91183K19468p0861L4234k3476l45233
14043C207533J65364K32761l59158m5287j1178l18871L24220k58672J66976L7571
$$ plain form
14033 3141259 3106787 2883165 2755873 3290609 2822209 2741574 3005769 2805015 2834636 3042183
14023 3042183 2724328 2692030 2649091 2871061 2722421 2394806 2828622 2378473 2600236 2447843
14013 2447843 2376349 2569061 2190018 2319365 2288179 2320413 2178226 2066240 2472501 2334260
14003 2334260 2282694 2146387 2239427 2426104 2387008 2461973 1764140 2477512 2097736 2123099
13993 2123099 2584406 2237024 2659821 3589012 5065390 8577432 16000255 30454586 39283512
13984 39283512 22736019 12864612 8656156 6383547 5269074 4340649 4032251 3356030
13976 3356030 3482931 2631925 2759332 2444320 2493077 2506567 2715699 2627412 2507201 2478811
13966 2478811 2225230 1969473 2263293 2109964 2320782 2421271 2018607 2201100 2394141
$$ packed form
14033C141259l4472k23622j27292N34736m68400q0635K64195k00754K9621K07547
14023C042183l17855l2298m2939K21970j48640l27615M33816m50149K21763j52393
14013B447843p1494J92712l79043J29347l1186L2234j42187j11986M06261j38241
14003B334260n1566j36307R3040J86677l9096P4965o97833P13372l79776K5363
13993B123099M61307l47382M22797R29191J476378L512042P422823J4454331Q828926
13984C9283512j6547493r871407m208456k272609j114473r28425l08398o76221
13976C356030J26901q51006J27407l15012M8757J3490K09132q8287j20211k8390
13966B478811k53581k55757K93820j53329K10818J00489m02664J82493J93041
$$ plain form
13957 2394141 1926992 2236372 1742096 2073237 2020640 1697021 2022564 2094037 2074602 1994682
13947 1994682 1883355 2042506 1921316 1791084 1370148 1918549 2236751 1604816 1746159
13938 1746159 1576722 1753322 1740395 1613123 1793683 1666875 1709674 1592934 1623617 1534914
13928 1534914 1607805 1748307 1569211 1675821 1267046 1655011 1843729 1816417 1674061 1676613
13918 1676613 1319014 1550432 1287496 1557443 1271377 1512914 1568509 1299137 1672109 1192763
13908 1192763 1429292 1379652 1536995 1160215 1209782 1509168 1339760 1147224 1223369 1589233
13898 1589233 1411783 1003684 1363572 1473662 1481852 1462574 1303832 1435585 1459251 1735316
13888 1735316 990959 1129939 1195094 1190393 1158563 1199419 1229790 982916 1631004 1080009
$$ packed form
13957B394141m67149L09380m94276L31141n2597l23619L25543P1473j9435p9920
13947A994682j11327J59151j21190j30232m20936N48401L18202o31935J41343
13938A746159j69437J76600j2927j27272J80560j26808M2799j16740L0683q8703
13928A534914P2891J40502j79096J06610m08775L87965J88718k7312j42356K552
13918A676613l57599K31418k62936K69947k86066K41537N5595k69372L72972m79346
13908A192763K36529m9640J57343l76780M9567K99386j69408j92536P6145L65864
13898A589233j77450m08099L59888J10090Q190j9278j58742J31753K3666K76065
13888A735316p44357J38980O5155m701l1830M0856L0371k46874O48088n50995
$$ plain form
13878 1080009 952773 1508747 852008 1332672 1170820 1313328 1248681 1083081 674517 1144504
13868 1144504 969765 1324279 1022391 1322928 943857 1179523 1038954 849954 546410
13859 546410 867387 1082699 1204834 985942 763481 1200728 1265793 1104885 1117138 1038126
13849 1038126 1038216 1108289 1253256 959178 953746 1109892 778018 773985 890667 937501 1071374
13838 1071374 1296445 1042947 963151 1059997 1189269 1342121 968190 847312 981262 1051733
13828 1051733 905698 755203 1035879 921074 918864 942995 942393 1101275 806460 936110
13818 936110 855783 732242 777854 1058215 979741 738201 1252717 923675 730374 846431
13808 846431 1038438 986315 1029363 680761 430430 826715 727023 773959 813800 928953
$$ packed form
13878A080009j27236N55974o56739M80664j61852J42508o4647j65600m08564M69987
13868A144504j74739L54514l01888L00537l79071K35666j40569j89000l03544
13859E46410L20977K15312J22135k18892k22461M37247O5065j60908J2253p9012
13849A038126R0P0073J44967k94078n432J56146l31874m033J16682M6834J33873
13838A071374K25071k53498p9796R6846J29272J52852l73931j20878J33950P0471
13828A051733j46035j50495K80676j14805k210K4131o02J58882k94815J29650
13818I36110q0327j23541M5612K80361p8474k41540N14516l29042j93301J16057
13808H46431J92007n2123M3048l48602k50331L96285r9692M6936L9841J15153
$$ plain form
13798 928953 904422 713142 998263 1042924 746656 667365 640296 770562 776548 924872 644363
13787 644363 778305 625312 901419 621473 676091 553384 769359 794071 998129 619341
13777 619341 763141 685986 486730 664946 858346 511620 681276 553356 918910 631171
13767 631171 1179152 744742 429300 532811 874397 532669 744873 442362 507094 629086
13757 629086 586605 870512 574585 539632 669084 769128 516266 488655 762208 592009
13747 592009 523501 771174 443730 383647 675064 580450 728039 671921 602208 614044 1192643
13736 1192643 609718 387481 750121 609134 590681 711163 632571 704788 485321 791203
13726 791203 759132 779906 614825 772943 657415 422754 857175 806540 356553 700170
$$ packed form
13798I28953k4531j91280K85121M4661k96268p9291k7069J30266N986J48324k80509
13787F44363J33942j52993K76107k79946N4618j22707K15975K4712K04058l78788
13777F19341J43800p7155j99256J78216J93400l46726J69656j27920L65554k87739
13767F31171N47981m34410l15442J03511L41586l41728K12204l02511O4732J21992
13757F29086m2481K83907k95927l4953J29452J00044k52862k7611K73553j70199
13747E92009o8508K47673l27444o0083K91417r4614J47589n6118o9713J1836N78599
13736A192643n82925k22237L62640j40987j8453J20482p8592P2217k19467L05882
13726G91203l2071K0774j65081J58118j15528k34661M34421n0635C56553L43617
$$ plain form
13716 700170 312423 491779 443797 368084 789182 817999 921371 938721 394961 366991
13706 366991 496609 819834 781994 235560 271553 636478 681811 918006 792756 359190
13695 384278 664181 450073 536165 486895 672693 542196 729339 467676 377068 363390
13685 363390 852762 777902 564726 779582 589440 732771 425742 457908 602602 548095
13675 548095 487623 576839 629700 276890 187409 484259 266551 929268 501813 249324
13664 665394 621294 218785 580359 190530 455763 696384 626014 380548 514305 417068
13654 417068 564951 597758 510853 446418 216646 544197 415758 668436 191570 444014
13644 444014 552690 443178 244239 364306 270130 496658 210926 381275 499952 457001
$$ packed form
13716G00170C12423J79356m7982p5713M21098K8817J03372J7350C94961k7970
13706C66991J29618L23225l7840B35560L5993L64925M5333K36195j25250C59190
13695C84278K79903k14108Q6092m9270J85798j30497J87143k61663r0608j3678
13685C63390M89372p4860k13176K14856j90142J43331l07029L2166J44694n4507
13675E48095o0472Q9216N2861B76890q9481K96850k17708O62717m27455B49324
13664F65394m4100B18785L61574A90530K65233K40621p0370k45466J33757r7237
13654D17068J47883L2807q6905o4435B16646L27551j28439K52678A91570K52444
13644D44014J08676j09512j98939J20067r4176K26528B10926J70349J18677m2951
$$ plain form
13634 457001 313566 305239 325888 336356 491522 617142 398980 497198 489004 210475 395928
13623 395928 146348 405012 462652 347651 379966 331607 758507 421476 89507 370286
13613 370286 445101 325734 593489 641950 430568 349453 568767 305141 283462 530698
13603 530698 144093 121103 599157 353770 411931 408036 454230 280155 272301 323868 -42433
13591 674067 510417 159135 415425 541771 482810 -124051 217597 621720 513018 276157
13581 276157 399212 559321 547072 258313 335207 369017 497731 75707 195144 491106
13571 491106 235914 74580 108710 506310 205055 268847 498276 208922 199105 357146
13561 357146 530991 129612 77564 188907 395351 392107 416577 489389 370622 189931
$$ packed form
13634D57001j43435q327K0649J0468J55166J25620k18162R8218q194B10475J85453
13623C95928A46348K58664N7640j15001L2315m8359M26900l37031H9507K80779
13613C70286P4815j19367K67755M8461k11382q1115K19314k63626k1679K47236
13603E30698A44093k2990M78054k45387N8161l895M6194j74075p854N1567d2433
13591F74067j63650A59135K56290J26346n8961a24051B17597M04123j08702k36861
13581B76157J23055J60109j2249B58313P6894L3810J28714G5707J19437K95962
13571D91106B35914G4580L4130L97600B05055O3792K29429B08922r817J58041
13561C57146J73845A29612n2048J11343K06444l244K4470P2812j18767j80691
$$ plain form
13551 189931 6573 572996 280067 278461 420629 167769 562649 102740 509892 144842
13540 520181 809159 423768 610165 -255208 429215 111509 235080 239099 190110 -38573
13529 371276 323330 451311 302250 199798 210014 310185 295265 265078 348051 187690
13519 187690 79386 167152 462838 499235 310268 378889 300657 311659 99041 270935 526343
13508 526343 351249 414613 302664 461352 384479 -11902 372701 417263 336087 446265
13498 446265 116974 102028 560079 404201 142203 355024 165211 39200 420154 416981
13488 416981 368934 2021 169197 149302 437860 382243 568758 266930 222246 442001 199303
13476 526799 355867 260117 136974 525957 81871 222093 71359 280639 75209 180189
$$ packed form
13551A89931F573N66423B80067j606J42168A67769L94880A02740M07152A44842
13540E20181K88978l85391J86397b55208D29215A11509J23571M019m8989c8573
13529C71276m7946J27981j49061j02452J0216J00171j4920l0187Q2973j60361
13519A87690G9386Q7766K95686L6397j88967O8621p8232J1002I9041J71894K55408
13508E26343j75094O3364j11949J58688p6873a1902C72701M4562q1176J10178
13498D46265A16974j4946M58051j55878A42203K12821A65211C9200L80954l173
13488D16981m8047B021J67176j9895K88558n5617J86515B66930m4684K19755A99303
13476E26799j70932r5750j23143L88983H1871J40222G1359K09280G5209J04980
$$ plain form
13466 180189 655560 172462 74651 61331 317716 160467 283111 26576 484375 433671
13456 433671 65264 112823 250011 76928 301666 302980 174011 224193 -73793 408344 229188
13445 229188 100358 357225 327113 124563 340221 180515 130678 2850 363912 466409
13435 466409 398698 97537 169345 359821 223986 409322 99215 322472 106536 40313
13424 293662 227901 305774 293107 432976 13555 64706 -61757 89082 233466 412621 187516
13412 484469 143124 350228 43638 -252937 300398 142538 210078 200332 -53758 55084 216204
13401 216204 199240 -97585 288347 70368 160643 25986 304418 -61125 203544 391974 136204
13389 187792 146464 181716 143310 -98187 213593 94830 -102525 28957 162138 235481 226791
$$ packed form
13466A80189M75371A72462G4651j3320K56385j57249J22644B6576M57799n0704
13456D33671F5264M7559J37188G6928K24738J314j28969N0182g3793D08344j79156
13445B29188A00358K56867l0112A24563K15658j59706m9837B850L61062J02497
13435D66409o7711I7537P1808J90476j35835J85336I9215K23257A06536D0313
13424B93662o5761P7873j2667J39869A3555N1151f1757H9082J44384J79155A87516
13412D84469A43124K07104D3638b52937C00398A42538O7540r746e3758E5084J61120
13401B16204j6964i7585B88347G0368R0275B5986K78432f1125B03544J88430A36204
13389A87792m1328L5252l8406i8187B13593I4830a02525B8957J33181P3343q690
$$ plain form
13378 226791 95561 -227 261789 -120312 353200 95231 -106515 -48681 274261 203324 300236
13367 300236 176724 102729 285481 164399 290349 261208 -54895 271302 138152 88078
13357 88078 327602 229031 594004 121339 195766 26086 313536 232839 243107 28767 145872
13346 145872 -319713 47320 563946 217787 303688 124619 217808 77033 110636 485177
13336 485177 288811 236363 185863 -71300 70374 108290 365490 493905 179547 75467 189229
13325 189229 161810 246345 335460 116429 387995 412528 117368 201603 574108 390955
13315 390955 -106671 92446 379958 350506 -76508 342108 250572 203215 147470 275393 228039
13304 228039 221241 320969 216541 223326 157826 149258 154935 9910 162746 30312 20399 371599
$$ packed form
13378B26791I5561b27B61789a20312C53200I5231a06515d8681B74261p0937R6912
13367C00236j23512p3995J82752j21082J25950k9141e4895B71302j33150n0074
13357H8078K39524r8571L64973A21339P4427B6086K87450q0697J0268B8767J17105
13346A45872c19713D7320N16626B17787Q5901A24619R3189G7033L3603L74541
13336D85177j96366n2448n0500g1300G0374L7916K57200J28415A79547G5467J13762
13325A89229k7419Q4535Q9115A16429K71566K4533A17368Q4235L72505j83153
13315C90955a06671I2446K87512k9452g6508C42108r1536m7357n5745J27923m7354
13304B28039o798R9728j04428O785o5500q568N677I910J52836C0312r913L51200
$$ plain form
13292 371599 84076 1428 142990 -158236 173696 192956 311346 -69296 -119775 -84705 197665
13280 -57672 -65977 307567 97807 368768 53759 136632 287470 261416 333653 -20068 155627
13268 -42115 333592 127600 55346 -71132 96200 74112 -127304 100339 -46897 124767 -5772
13256 -100263 58233 108093 577912 84047 113071 163260 297006 -63306 201027 254977 193932
13245 193932 310111 104427 258840 327093 201228 -227757 -262836 173180 194360 197848
13235 197848 200070 263791 439620 260488 -177110 100006 -66544 92927 254285 270071 154436
13224 154436 206825 78977 16985 -168238 150137 91805 202027 227314 128560 240616 242937
13213 242937 219509 -14839 192846 98378 107815 105142 382697 209684 113720 151217 254909
$$ packed form
13292C71599H4076A428J41562a58236A73696J9260J18390f9296n0479L5070A97665
13280e7672q305C07567I7807K70961E3759Q2873J50838k6054P2237b0068A55627
13268d2115C33592A27600E5346g1132I6200k2088a27304A00339d6897A24767e772
13256a00263E8233M9860M69819H4047K9024N0189J33746f3306B01027N3950o1045
13245A93932J16179A04427J54413O8253j25865b27757l5079A73180K1180L488
13235A97848K222O3721J75829j79132a77110A00006f6544I2927J61358J5786j15635
13224A54436N2389G8977A6985a68238A50137n8332J10222K5287r8754J12056K321
13213B42937k3428a4839A92846r4468R437k673K77555j73013r5964L7497J03692
$$ plain form
13202 254909 165869 -25419 205583 -148091 -99994 -201483 126133 89026 345297 73856
13191 36774 -140689 57344 159602 -71512 125204 -164832 301262 179493 -21576 -164496
13181 -164496 227208 27344 184833 224336 1786 229832 303471 103078 -71015 153830 216409
13170 216409 105742 -243998 280948 50536 25332 -91065 -80058 20803 356613 52403 243394
13159 243394 -111455 448946 116369 29950 116438 290032 -298573 54378 400447 42031
13148 132046 285386 -156643 225895 68771 288099 79110 248390 -239358 379996 22347
13137 231746 27439 -38797 -35979 280805 -10684 458974 211955 -225634 96834 -28792 155852
13125 72918 -15237 195235 104158 30621 -23954 -19413 -204494 280872 212871 340805 164669
$$ packed form
13202B54909q9040b5419B05583a48091M8097j01489A26133l7107K56271G3856
13191C6774a40689E7344J02258g1512A25204a64832C01262j21769b1576j42920
13181a64496B27208B7344J57489L9503A786K28046P3639A03078g1015A53830O2579
13170B16409A05742b43998B80948E0536k5204i1065J1007B0803L35810E2403J90991
13159B43394a11455D48946A16369B9950Q6488J73594b98573E4378L46069D2031
13148A32046J53340a56643B25895F8771K19328G9110J69280b39358C79996B2347
13137B31746B7439c8797K818B80805a0684D58974B11955b25634I6834b8792A55852
13125G2918a5237A95235r1077C0621b3954M541j85081B80872o8001J27934A64669
$$ plain form
13113 -59006 -228652 -275707 85644 240643 536920 197854 -27259 97384 -378974 -70037 56870
13101 -166759 -76172 457891 74998 152377 82338 521456 91495 135417 173713 41387 -81382
13089 -319689 -272986 -23449 -33910 -25538 -62176 509150 291709 4311 -23698 187933 135896
13078 135896 -70196 222620 192932 132220 167498 271733 194853 430530 24741 56060 294973
13067 294973 201069 -21743 185150 -96639 154126 -86821 127108 164272 33409 -41890 -213320
13056 -213320 -37623 175996 -80827 311051 -218193 189714 245759 -85514 -2807 156597 121273
13045 121273 194644 -29169 445228 112924 212048 -177999 55274 -157390 227743 188129
13035 188129 40213 -137885 -29474 -74964 70042 -64998 30267 361259 334745 108978 40063
$$ packed form
13113e9006j69646m7055H5644J54999K96277A97854b7259I7384c78974g0037E6870
13101a66759g6172D57891G4998P7379p0039M39118I1495M3922L8296D1387h1382
13089c19689M6703b3449j0461Q372l6638E09150k17441D311b3698A87933n2037
13078A35896g0196B22620k9688o0712L5278J04235p6880K35677B4741L1319K38913
13067B94973r3904b1743A85150i6639A54126h6821A27108L7164C3409d1890j71430
13056b13320c7623A75996h0827C11051b18193A89714N6045h5514b807A56597l5324
13045A21273P3371b9169D45228A12924R9124a77999E5274a57390B27743l9614
13035A88129D0213a37885b9474m5490G0042f4998C0267L30992k6514A08978D0063
$$ plain form
13023 -86683 169830 -189711 2029 329713 -58579 -35814 -131115 39135 -7086 315936 98837
13011 174808 25859 304510 -177058 405701 -56745 187115 -18711 275889 277125 -123299
13000 -17131 91308 -1296 120530 75182 -52358 611 246859 233071 -32833 190321 -63032 -120211
12988 -120211 372734 80733 12955 295546 157214 163875 34195 97815 38278 -143450 83691
12976 -71687 291743 242665 12851 -33293 267767 119545 23330 144307 -8168 -31601 -160173
12965 -160173 -125983 -48343 -77289 2407 309561 -87615 44761 370829 7484 -368931 113214
12953 205940 266807 200589 153846 85308 339228 -37494 176295 -65931 -67724 1823 93552
12942 93552 -36312 171711 130421 -353422 -261724 47397 172404 -319908 294124 -323201
$$ packed form
13023h6683A69830a89711B029L27684e8579K2765r5301C9135g086C15936I8837
13011A74808B5859K78651a77058D05701e6745A87115a8711B75889J236a23299
13000a7131I1308a296A20530m5348e2358F11K46248j3788c2833A90321f3032n7179
12988a20211C72734H0733A2955K82591j38332O661C4195O3620C8278a43450H3691
12976g1687B91743m9078A2851c3293B67767A19545B3330J20977h168k3433j28572
12965a60173L4190d8343k8946B407L07154h7615D4761L26068G484c68931A13214
12953B05940O0867o6218m6743o8538K53920c7494A76295f5931j793A823R1729
12942I3552c6312A71711m1290c53422R1698D7397J25007c19908B94124c23201
$$ plain form
12931 -495764 151967 -439805 259854 116341 -14186 96388 62741 187758 359055 -306115
12920 134901 394803 32352 -24337 -273593 227015 -156656 79098 111967 11729 20736 190641
12909 190641 179099 6245 -19177 -128324 -142062 -37946 -129827 142843 246731 -18126 117110
12897 -34369 153586 89675 84442 128347 -82503 10451 70925 177446 -109871 -96787 108946
12885 144403 18531 187565 50229 -60831 59443 68989 264812 238668 52918 -356559 -304377
12874 -304377 94973 82019 -156773 41859 -71304 198401 -264204 -166517 -93665 92989 303590
12863 303590 -355169 91192 241038 -70614 245370 -215806 307295 212193 196103 -81760
12852 -131699 85810 32215 -65529 101978 90940 255464 98948 30166 -238532 205731 119275
$$ packed form
12931d95764A51967d39805B59854A16341a4186I6388l3647J25017J71297c06115
12920A34901K59902C2352b4337k49256B27015a56656G9098L2869A1729R007J69905
12909A90641j1542F245a9177j09147j3738c7946r1881A42843J03888a8126A17110
12897c4369A53586o3911n233M3905h2503A0451O0474J06521a09871J3084A08946
12885A44403A8531J69034E0229f0831E9443R546J95823k6144E2918c56559N2182
12874c04377I4973j2954a56773D1859g1304A98401b64204R7687P2852I2989K10601
12863C03590c55169I1192J49846g0614B45370b15806C07295r5102j6090h1760
12852a31699H5810C2215f5529A01978j1038J64524I8948C0166b38532B05731q6456
$$ plain form
12841 119275 -106898 -157353 46450 197108 -56781 -391577 -50809 -26541 375914 14973 158041
12830 158041 -153428 121612 258511 195270 -107303 96347 -80707 49659 31736 131948
12820 131948 291108 -138877 69071 108480 17454 212220 -251266 -53577 195627 99616
12810 99616 14658 -75099 166167 -142142 -8685 -152717 147192 270705 219124 62667 -114837
12798 179869 57368 -46282 -61486 57104 -172443 -156629 -108420 67258 -71097 35867 84927
12787 84927 246884 77954 165853 129060 356641 253767 -52924 179212 -14066 -457168 -107935
12775 52502 98674 -95380 -52316 138169 -88703 341643 -30241 112717 -212248 -354535 -58523
12763 125719 -45737 548760 26400 -24995 134927 -4446 -180274 -115076 -48783 9543 85130
$$ packed form
12841A19275a06898n0455D6450J50658e6781l34796e0809K4268C75914A4973J43068
12830A58041a53428A21612J36899o3241a07303I6347h0707D9659j7923J00212
12820A31948J59160a38877F9071L9409A7454J94766b51266e3577A95627r6011
12810I9616A4658g5099A66167a42142h685j44032A47192J23513n1581F2667a14837
12798A79869E7368d6282j5204E7104a72443J5814M8209F7258g1097C5867M9060
12787H4927J61957G7954Q7899l6793K27581j02874e2924A79212a4066m43102a07935
12775E2502M6172i5380M3064A38169h8703C41643c0241A12717b12248j42287e8523
12763A25719d5737E48760B6400b4995A34927d446j75828O5198d8783I543P5587
$$ plain form
12752 85130 -94293 -223065 304820 -5591 144095 189033 -219098 -189754 88563 62692 310492
12741 310492 130265 95021 264648 182748 73797 53805 256100 69291 -24264 143791 67788
12729 306056 40856 24373 10894 78408 -137235 -97150 197010 -9509 -139594 103194 -257567
12717 166951 178387 -102752 -50950 -75561 161693 250200 14402 140605 -266404 31253 278753
12706 278753 182831 312315 -32026 -51447 196769 60106 -142954 159637 -47686 311355
12695 79235 30619 14517 113238 -113168 -84736 129048 473775 94145 -14363 103427 147491
12684 147491 -104025 -185019 37376 -45265 51743 183711 184643 456081 138462 90875 43419
12672 -199964 -59457 125936 201199 106772 -176930 383268 52838 379798 62495 279394
$$ packed form
12752H5130i4293j28772C04820e591A44095M4938b19098K9344H8563k5871K47800
12741C10492A30265l5244J69627q1900G3797j9992K02295F9291b4264A43791F7788
12729C06056D0856j6483A0894O7514a37235M0085A97010i509j30085A03194b57567
12717A66951J1436a02752e0950k4611A61693Q8507A4402J26203b66404C1253K47500
12706B78753r5922J29484c2026j9421A96769F0106a42954A59637d7686C11355
12695G9235C0619A4517R8721a13168K8432A29048L44727I4145a4363A03427M4064
12684A47491a04025q0994C7376d5265E1743J31968R32K71438A38462m7587D3419
12672a99964e9457A25936P5263r4427a76930C83268E2838L26960F2495K16899
$$ plain form
12662 279394 -10201 -137479 230909 295561 95401 263402 265504 -6003 -184711 315244 -35888
12650 -101617 119379 -85369 84402 39212 85556 24188 69204 153021 -222000 285524 126863
12638 -45484 159774 36043 179840 278581 378238 299735 215171 181636 -267647 51866 383601
12627 383601 121349 221975 244721 80955 -73428 286837 22687 83389 166941 -8826 113032
12615 -17393 17542 -14192 -138597 525039 107836 -217308 -240587 122961 -45175 -186479
12605 -186479 -197126 -187731 -180870 250827 39883 77958 102258 190617 117046 -114601 72275
12593 -22816 102241 -84267 138130 1384 -56892 -151037 -13187 -284759 -51444 105845 49758
12581 -71167 -29247 27475 13186 142274 -55140 -158387 132052 -10207 42010 232715 349911
$$ packed form
12662B79394a0201j27278B30909O4652I5401J68001K102f003j78708C15244c5888
12650a01617A19379h5369H4402C9212M6344B4188M5016Q3817b22000B85524A26863
12638d5484A59774C6043J43797R8741R9657p8503q4564l3535b67647E1866L31735
12627C83601A21349J00626K2746H0955g3428B86837B2687O0702Q3552h826A13032
12615a7393A7542a4192j24405E25039A07836b17308k3279A22961d5175j41304
12605a86479j0647R395O861B50827C9883L8075K4300Q8359p3571a14601G2275
12593b2816A02241h4267A38130A384e6892r4145a3187k71572e1444A05845D9758
12581g1167b9247B7475A3186J29088e5140j03247A32052a0207D2010J90705J17196
$$ plain form
12570 349911 71117 199826 121375 51320 179571 -64023 -277254 130429 -96838 -40920 20177
12558 330764 46223 209949 1127 70810 72000 -350016 61258 -174564 155152 -12738 664
12546 247829 -75821 147930 69157 -150120 -252876 -124048 -164114 155982 88389 178365
12536 178365 -348537 68148 42412 -144674 349813 68306 -201402 -17869 99163 71598 55915
12525 55915 318014 330507 -23497 -51025 155506 -278916 -246346 -176821 -141981 397199 -244546
12513 62534 30417 -181367 110758 -4690 -154982 56748 -74397 -112169 174197 51964 -138102
12501 -21507 19000 -145671 305964 -60490 -6042 232628 92028 104102 155245 204258 -95593
12489 -129183 -58944 -128165 -42888 -235328 97830 26836 -13274 -220277 -206426 237451 15026
$$ packed form
12570C49911G1117J28709p8451E1320J28251f4023k13231A30429i6838d0920B0177
12558C30764D6223J63726A127O9683J190c50016F1258a74564A55152a2738F64
12546B47829g5821A47930F9157a50120j02756a24048m0066A55982o7593Q9976
12536A78365c48537F8148k5736a44674C49813F8306b01402a7869I9163k7565j5683
12525E5915K62099J2493b3497k7528A55506b78916L2570O9525L4840C97199b44546
12513F2534C0417a81367A10758d690j50292E6748g4397l7772A74197E1964a38102
12501b1507A9000a45671C05964f0490f042B32628I2028J2074N1143M9013i5593
12489a29183e8944o9221d2888j92440I7830B6836a3274k07003J3851B37451A5026
$$ plain form
12477 240587 -369268 232100 -48908 74484 64405 -130237 -2734 134546 64909 -377639 28924
12465 -43023 66137 -99535 -22932 112765 -115571 36987 -50039 168123 -135974 155664 -30871
12453 -75351 -272403 -156379 -36146 -136585 -168994 -30673 -86201 100766 121999 41394 -163823
12441 87504 -342523 -54206 143803 -84904 13814 171660 135755 -183707 -25275 -32104 48544
12429 187887 142400 -2238 64470 84087 15129 -51028 -297261 39316 -7488 220698 -43219
12417 68053 114367 5390 -6146 -205061 332752 439732 -31474 -234724 283543 248617 158571
12406 158571 -300778 -96 -124270 70248 43454 80691 31933 236008 42702 -242976 -242131 -8970
12393 84633 41511 -31242 3629 11126 177141 26317 110530 -189800 37409 97280 -39726 72322
$$ packed form
12477B40587c69268B32100d8908G4484j0079a30237b734A34546F4909c77639B8924
12465d3023F6137i9535b2932A12765a15571C6987e0039A68123a35974A55664c0871
12453g5351j97052J16024c6146j00439l2409c0673n5528A00766K1233D1394a63823
12441H7504c42523e4206A43803h4904A3814J57846l5905a83707b5275o829D8544
12429A87887m5487b238F4470J9617A5129e1028k46233C9316g488B20698d3219
12417F8053M6314E390f146j98915C32752J06980c1474k03250B83543l4926r0046
12406A58571c00778i6j24174G0248k6794L7237C1933K04075D2702b42976Q45h970
12393H4633D1511c1242C629P497J66015B6317Q4213a89800C7409N9871c9726G2322
$$ plain form
12380 254529 -52265 8320 389450 -20749 -80653 32960 -50264 101915 -29255 106492 95115
12369 95115 136699 329003 212122 28226 -129178 138504 74904 97297 161324 -38518 -84505
12358 -84505 -7241 -27116 -269051 -1798 90917 83354 309584 392775 7585 168754 128341 -201709
12345 58752 237570 133865 -25061 202957 164056 82441 -100532 399924 -85970 -56455 -68478
12334 -68478 -33526 -202603 -157739 -295147 37117 188362 -9635 114170 214548 200663 -43495
12322 -181352 -284861 -261554 -66482 -137308 -347304 246535 -2770 205410 225293 -50995 -120716
12311 -120716 231392 -218252 -94317 -14297 28306 462859 -109704 -105244 237 50105 145657
12300 145657 76468 96839 12860 -55135 -358927 -55164 228120 74269 71415 45928 -28523
$$ packed form
12380B54529e2265H320L81130b0749n9904C2960e0264A01915b9255A06492j1377
12369I5115M1584J92304j16881B8226a29178A38504o3600K2393O4027c8518m5987
12358h4505g241j9875k41935a798I0917p563K26230Q3191G585J61169m0413b01709
12345E8752J78818j03705b5061B02957l8901q1615a00532C99924h5970K9515j2023
12334f8478c3526j69077M4864j37408C7117J51245i635A14170J00378j3885d3495
12322a81352j03509K3307f6482p0826k09996B46535b770B05410J9883e0995o9721
12311a20716B31392b18252i4317a4297B8306M34553a09704M460B37M9868R5552
12300A45657o9189K0371A2860e5135l03792e5164B28120G4269k854k5487b8523
$$ plain form
12288 -184455 15954 111157 -73513 106221 402152 -101053 -77390 558034 -170223 -64257
12277 99366 118587 -87505 232002 129786 114237 55340 -15836 169186 -165095 356674 -24886
12265 -203241 182607 -2764 32052 124837 -287349 350331 -201107 169511 -241804 -83689
12254 -64659 33024 137296 -44240 78916 -100082 237115 -81455 108583 -18688 68380 96249
12243 96249 -190388 333975 109811 -62865 -45182 74149 223597 1253 -68013 84185 66400
12232 66400 88037 325051 174807 36850 136384 308346 368603 204482 382748 42388 -29666
12220 143260 22257 -45759 -78793 396912 116394 186139 17112 150255 362522 15549 210495
12209 210495 143210 551410 64300 95391 40318 -19410 -103233 -133895 144627 375780 203536
$$ packed form
12288a84455A5954R5203g3513A06221K95931a01053K3663E58034a70223f4257
12277I9366J9221h7505B32002j02216j5549E5340a5836A69186a65095C56674b4886
12265b03241A82607b764C2052R2785b87349C50331b01107A69511b41804h3689
12254f4659C3024J04272d4240G8916a00082B37115h1455A08583a8688F8380K7869
12243I6249a90388C33975A09811f2865J7683G4149J49448A253f8013H4185j7785
12232F6400K1637K37014j50244C6850R9534J71962O0257j64121J78266D2388b9666
12220A43260B2257d5759l3034C96912A16394O9745A7112J33143K12267A5549J94946
12209B10495o7285M08200F4300L1091D0318a9410q3823l0662A44627K31153j72244
$$ plain form
12198 203536 -27487 204978 -6376 13304 79609 7689 100843 195218 182780 259311 167643 59266
12185 175534 65355 107961 255021 165665 92310 385796 -165939 129030 52322 96244 82
12173 128580 -20212 500659 -146516 -189692 -197401 -304952 412329 502840 437720 84662 -36710
12161 316496 48815 35402 79051 45351 -145240 41467 136843 89051 -11515 147885 228156
12150 228156 -315460 -278396 236200 135540 226928 -97532 -33824 -136413 62419 114379 -22304
12138 83847 -290199 325455 -243414 257217 148774 348786 -140788 -126885 -155284 421811
12127 82702 225610 80247 -42854 10492 25020 172396 -4214 -66686 53560 -55401 269477
12115 154488 100394 12805 6300 -59189 -238969 -100250 -113965 -11290 -112345 -125987 -99909
$$ packed form
12198B03536b7487B04978f376A3304O6305G689R3154R4375j2438P6531r1668E9266
12185A75534F5355M2606J47060q9356p3355K93486a65939A29030E2322M3922H2
12173A28580b0212E00659a46516m3176p709j07551D12329R0511o5120H4662c6710
12161C16496D8815j3413M3649l3700a45240D1467R5376m7792a1515A47885Q0271
12150B28156c15460L7064B36200j00660R1388i7532c3824j02589F2419N1960b2304
12138H3847b90199C25455b43414B57217j08443K00012a40788J3903k8399D21811
12127H2702J42908H0247d2854A0492J4528J47376d214o2472E3560e5401B69477
12115A54488n4094A2805F300e9189j79780a00250j3715a1290j01055j3642K6078
$$ plain form
12104 -99909 -107495 -354476 21802 208296 -294596 -238793 196984 827 330293 -98048 297054
12092 -264755 135729 29241 10185 -51218 269720 -70857 88049 -303606 68613 -213541 307562
12080 279799 889476 1928696 666199 257120 -18614 25225 311399 225654 -345127 30765
12069 79146 -155648 95799 -73036 149548 -27417 -46178 -20444 61890 -282100 -26958 -205496
12058 -205496 -26448 25215 130930 178778 -158257 -153717 -118538 -169862 -45860 -334741 -104331
12046 88739 172755 -245765 292195 217998 146389 -202780 -25449 -19678 45458 -29810 -111543
12035 -111543 -391883 57109 -71481 190638 324459 201952 105424 -202569 36562 -191286
12024 62130 -197630 144439 213610 130577 78484 143542 204512 -173988 117528 -92305 9662
$$ packed form
12104i9909p586k46981B1802J86494b94596N5803A96984H27L29466i8048B97054
12092b64755A35729B9241A0185e1218B69720g0857H8049c03606F8613b13541C07562
12080B79799O09677J039220F66199B57120a8614B5225K86174q5745c45127C0765
12069G9146a55648I5799g3036A49548b7417j8761b0444F1890b82100b6958j78538
12058b05496b6448B5215J05715M7848a58257M540L5179n1324d5860k88881a04331
12046H8739Q4016b45765B92195p4197p1609b02780b5449N771D5458b9810q1733
12035a11543k80340E7109g1481A90638J33821j22507r6528b02569C6562a91286
12024F2130a97630A44439O9171q3033n2093O5058O0970a73988A17528i2305I662
$$ plain form
12012 239213 -30571 94163 128829 136904 -377310 -176496 -5705 91972 -118692 -274522 42354
12000 322074 40886 40227 -28761 -15766 -86021 -236548 -81268 -46031 -102198 51422 72700 4601
11987 92691 -133907 -414715 -42377 187374 235624 -110459 135303 -191445 -92862 166371
11976 -163702 -20157 282383 -100781 -57673 123576 -32257 -104111 349257 -157363 220690
11965 139398 161939 175648 443301 -195825 -154961 -9951 60453 96932 -147982 -115465 -9720
11953 155949 341022 -55319 -5170 60682 24595 -254813 260082 -206927 -266958 -323101 -178164
11942 -178164 -221284 -32826 -109946 -359840 243050 30265 -129068 -41444 -100478 -245 111540
11930 -171594 82054 58915 2540 -102013 -64092 13759 -23029 -308716 26839 271671 174122
$$ packed form
12012B39213c0571I4163L4666Q075c77310a76496e705I1972a18692j55830D2354
12000C22074D0886o59b8761J2995p0255j50527h1268L5237n6167E1422K1278D601
11987I2691a33907k80808d2377A87374M8250a10459A35303a91445i2862A66371
11976a63702b0157B82383a00781M3108A23576c2257p1854C49257a57363B20690
11965A39398K2541J3709K67653a95825M0864i951F0453L6479a47982L2517i720
11953A55949J85073e5319e170F0682B4595b54813B60082b06927o0031n6143J44937
11942a78164m3120c2826p7120k49894B43050C0265a29068d1444n9034b45A11540
11930a71594H2054k3139B540a02013L7921A3759b3029k85687B6839K44832r7549
$$ plain form
11919 174122 182317 -285177 -100211 195964 -135765 -226998 122263 -273121 53766 -120137
11908 -27997 -193919 38366 -23137 288260 -149452 -340102 129545 -381081 -56705 364514
11897 -190138 55259 -28800 184917 -6701 -6574 -60843 -93516 55903 -214987 -181650 -297739
11886 -297739 -365857 133858 -29810 -34583 202980 1599 165389 348105 -82728 457242 -92028
11874 -36517 13205 172245 -94480 -440044 -85024 -134605 -56338 -166721 155624 293561 -135887
11862 1277 -26771 187429 -192091 -164812 117305 -218458 -232730 12143 -4679 1721 -70868
11850 -48493 -105228 250924 -149250 -245388 173596 -384547 -54056 103525 -160304 137525
11839 133220 126984 69688 91185 -203483 311808 -174893 -279587 256903 -476605 60932
$$ packed form
11919A74122Q195b85177a00211A95964a35765r1233A22263b73121E3766a20137
11908b7997j65922C8366b3137B88260a49452j90650A29545c81081e6705C64514
11897a90138E5259b8800A84917f701J27n4269l2673E5903b14987L3337j16089
11886b97739o8118A33858b9810m773B02980A599J63790J82716h2728D57242i2028
11874c6517A3205J59040i4480l45564h5024m9581e6338j10383A55624J37937a35887
11862A277b6771A87429a92091K7279A17305b18458j4272A2143d679A721g0868
11850d8493n6735B50924a49250r6138A73596c84547e4056A03525a60304A37525
11839A33220o236n7296K1497b03483C11808a74893j04694B56903d76605F0932
$$ plain form
11828 163285 -93827 -64347 114505 -59695 -272999 -150778 -116607 -246387 60290 -174885
11817 114158 -447766 -150135 11475 -61759 -19867 -95904 -45347 -223149 -249100 101069 -42537
11805 -190787 194276 18134 -344673 12493 151566 -118781 -178353 163676 172118 47087 -9475
11793 170599 -471116 -22034 135824 -155227 -77620 -169770 210238 -156184 -130654 21002
11782 76023 74765 -262736 4135 247432 -185745 -73822 88608 360209 -133026 -374325 120260
11770 -17503 193060 144546 -87877 226925 127438 -69856 188154 -56453 -166195 -204137 526195
11758 324765 -44744 -149422 -49526 132777 -225069 155893 51603 182009 74222 179959
11748 179959 -59926 -54715 61148 -311091 -352048 125170 -36517 -305532 412433 95336 -211117
$$ packed form
11828A63285i3827K9480A14505e9695k13304J22221L4171j29780F0290a74885
11817A14158d47766a50135A1475f1759a9867p6037d5347j77802k5951A01069d2537
11805a90787A94276A8134c44673A2493J39073a18781n9572A63676Q442D7087i475
11793A70599d71116b2034A35824a55227P7607r2150B10238a56184K5530B1002
11782G6023j258b62736D135K43297a85745g3822H8608K71601a33026k41299A20260
11770a7503A93060m8514h7877B26925r9487f9856A88154e6453j09742l7942E26195
11758C24765d4744j04678d9526A32777b25069A55893E1603J30406G4222J05737
11748A79959e9926N211F1148c11091m0957A25170c6517k69015D12433I5336b11117
$$ plain form
11736 -213855 -45206 64532 -366598 -215046 65527 3363 256847 -21023 -162437 -294794 143615
11724 75626 130540 -277573 -215515 53803 -14721 83716 248069 14110 87856 -140188 -34644
11712 16689 -119284 55480 178803 -203891 -93550 9348 -194974 62270 174229 -146840 -30274
11700 83838 149956 1266 113827 20107 -199807 632 156685 -226888 30788 -34926 -130046
11689 -130046 149270 -501017 -120858 -8133 456900 242 152739 66397 89727 370639 181133
11677 -130144 -10809 67636 109379 252494 12009 98369 -166729 28056 54499 102003 -88004
11665 -37040 -169003 -15294 200172 -234089 18686 215799 281800 288212 -228258 -302789 -129184
11653 224172 -309196 77759 -227363 134810 54272 311466 -83698 -246785 242399 158038
$$ packed form
11736b13855d5206F4532c66598J51552F5527C363K53484b1023j41414j32357A43615
11724G5626N4914b77573O2058E3803a4721H3716J64353A4110P3746a40188c4644
11712A6689a19284E5480J23323b03891i3550I348a94974F2270J11959a46840c0274
11700H3838O6118A266J12561B0107a99807F32J56053b26888C0788c4926r5120
11689a30046A49270e01017a20858h133D56900B42J52497F6397K3330K80912A81133
11677a30144a0809F7636M1743J43115A2009Q6360a66729B8056K6443M7504h8004
11665c7040j31963a5294B00172b34089A8686J97113O6001O412b28258p4531a29184
11653B24172c09196G7759b27363A34810E4272K57194h3698j63087B42399q4361
$$ plain form
11643 158038 -13944 77541 -231792 321587 161096 -226692 256199 87263 59673 -27356
11632 89980 448787 221185 231165 298252 91874 73743 138530 91155 48941 185005 -6987
11620 415972 287458 58368 -47092 183179 53145 -261718 -44908 -14902 38546 -85767 18837
11608 3581 224886 -149854 10525 -159705 150846 -155913 213015 12584 -370437 -29807
11597 -188689 -128806 10693 297097 55105 58918 290383 -248865 -137701 -7577 -307374 37777
11585 -296288 149731 -231946 164805 150877 2538 -145718 121673 183713 121566 246646
11575 246646 214261 88599 133360 -35233 -212018 -123904 -74976 -133588 97710 388619 -300253
11563 -41699 1008 -64909 -75628 -69690 -58320 -22476 -87433 -37951 -153225 -70286 119580 88192
$$ packed form
11643A58038a3944G7541b31792C21587j60491b26692B56199H7263k7590b7356
11632H9980L58807B21185R980O7087I1874j8131O4787m7375m2214J36064f987
11620D15972j28514E8368d7092A83179E3145b61718d4908a4902C8546h5767A8837
11608C581K21305a49854A0525a59705A50846a55913B13015A2584c70437b9807
11597a88689N9883A0693K86404E5105L813K31465b48865J11164g577k99797C7777
11585b96288A49731b31946A64805j3928B538a45718A21673O2040o2147J25080
11575B46646l2385H8599M4761c5233j76785Q8114M8928n8612I7710K90909c00253
11563d1699A008f4909j0719N938J1370b2476o4957c7951j15274g0286A19580l1388
$$ plain form
11551 88192 220101 -43136 -103325 62272 -343483 -94716 111047 139497 44384 75125 -4356
11539 -80339 -87378 75857 -83629 97556 102973 -31038 13926 -13742 -112981 83815 133673 50445
11526 83896 360380 273075 -22738 -110015 104590 108827 129870 -91198 -146018 431683 19572
11514 128182 110975 224538 -314570 -5879 -58819 126979 -29731 -263994 -42248 98028 -93813
11502 364500 -68401 131935 -13119 264820 -61535 230144 -54748 194599 366806 85193
11491 156456 -119812 48233 175597 -36799 243397 277131 218341 -60312 233244 13747 -1100
11479 223317 264395 194555 327819 193985 -195710 274147 -60360 116543 274924 22458
11468 314312 -288688 5689 417902 -61267 509667 261343 -66999 209400 95770 423504
$$ packed form
11551H8192J31909d3136o0189F2272c43483i4716A11047K8450D4384L0741d356
11539h0339p039G5857h3629I7556N417c1038A3926a3742r9239H3815M9858E0445
11526H3896K76484q7305b2738q7277A04590M237K1043i1198n4820D31683A9572
11514A28182j7207J13563c14570e879n2940A26979b9731k34263d2248I8028i3813
11502C64500f8401A31935a3119B64820f1535B30144e4748A94599J72207H5193
11491A56456a19812D8233J27364c6799B43397L3734n8790f0312B33244A3747a100
11479B23317M1078o9840J33264j33834a95710B74147f0360A16543J58381B2458
11468C14312b88688E689M12213f1267E09667k48324f6999B09400I5770L27734
$$ plain form
11458 423504 136942 147182 261396 116694 342784 118410 101117 24175 301568 120311
11447 -331816 -264594 -93536 260333 -140617 -107979 108539 82241 -40710 168544 22923 -240114
11435 30429 -250267 -85320 41651 81283 -130287 -54252 -14855 -62936 210964 221364 59773
11423 -157874 331674 -99935 59425 56522 120294 -296134 -129632 -339193 344526 10160 87728
11412 87728 -51089 -27540 96705 22702 201996 -114616 -145197 -70970 -136212 -223511 -372040
11401 -372040 152479 -60451 -195816 44065 255504 315509 -248226 236427 225874 -19338
11390 -26805 -22457 32507 178829 -117912 -145319 86910 109508 206680 -147468 151295 -41791
11378 -47354 110907 50675 -151357 182819 303318 53857 40714 69484 21232 -64919 42752
$$ packed form
11458D23504A36942J0240J14214A16694K26090A18410j7293B4175K77393A20311
11447c31816O7222i3536B60333a40617L2638A08539k6298d0710A68544B2923b40114
11435C0429b50267h5320D1651L9632a30287e4252a4855m8081B10964J0400E9773
11423a57874C31674i9935E9425k903O3772b96134a29632k09561C44526A0160P7568
11412H7728e1089K3549I6705B2702J79294a14616l0581g0970o5242q7299j48529
11401c72040A52479f0451j35365D4065K11439O0005b48226B36427j0553a9338
11390b6805M348C2507J46322a17912k7407H6910K2598R7172a47468A51295d1791
11378d7354A10907E0675a51357A82819J20499E3857j3143K8770B1232f4919D2752
$$ plain form
11366 -267973 -260778 429416 174565 10789 125447 26662 151004 278541 75237 -31465 226987
11354 -73833 -88304 -300404 -205496 -24015 276502 -23071 -11938 52277 -463496 73744 -74749
11342 -253189 -202092 72818 232446 -84372 10129 31691 -619279 -7827 -92865 182764 -136883
11330 -354828 49866 114047 47595 152781 12298 97876 -92834 270696 199530 -297868 268491
11318 162385 -65800 -57242 -48595 -127351 -109445 -85197 140866 9753 -204219 49370 -35336 77909
11305 142595 -27029 -27649 -218546 38534 323567 -225205 142468 -63408 -12586 -61273 109801
11293 207285 -175585 -7141 22386 -61777 117986 -150122 72712 412412 -15189 251607 53036
11281 279828 -117417 -21692 176293 313690 -106560 -127712 -231723 -94989 -234462 -139008
$$ packed form
11366b67973P195D29416A74565A0789J14658B6662J24342J27537G5237c1465B26987
11354g3833j4471k12100R4908b4015B76502b3071J1133E2277d63496G3744g4749
11342b53189N1097G2818J59628h4372A0129K1562f19279g827q5038A82764a36883
11330c54828D9866O4181D7595J05186A2298Q5578i2834B70696p1166b97868B68491
11318A62385f5800Q558Q647p8756J7906K4248A40866I753b04219D9370c5336G7909
11305A42595b7029o20j90897C8534K85033b25205A42468f3408a2586m8687A09801
11293B07285a75585g141B2386f1777A17986a50122G2712L39700a5189B51607E3036
11281B79828a17417b1692A76293J37397a06560k1152j04011i4989j39473R5454
$$ plain form
11271 -139008 -106087 -301557 -117218 -45454 83025 -87845 11212 -58144 134151 -345917 -139493
11259 -305924 -12348 137863 -4949 -62531 -88242 -206987 -159400 -87336 -109989 -484637 -82227
11247 -220015 -93773 -160110 -240264 82299 -212768 -294804 -223882 -35105 -248065 -375354 99634
11235 -164507 -190217 -231615 189666 -139523 38956 266633 -18330 182174 71518 30642 -165151
11223 7675 23008 -27476 -133151 90688 169835 156326 83107 61301 55545 148990 -54226 -94369
11211 -94369 37626 -4912 56167 -188584 -33527 -223937 148840 -47354 -210431 -66102 102879
11199 -119941 224017 -77005 -81719 169307 -391210 28020 -166484 -80233 79138 147108 -154295
11187 -59629 -342778 109858 194207 -340395 -265103 -289591 -187426 -32227 -3868 -292751 -54007
$$ packed form
11271a39008L2921j95470a17218d5454H3025h7845A1212e8144A34151c45917a39493
11259c05924a2348A37863d949n7582k5711j18745M7587P2064k2653l74648h2227
11247b20015i3773o6337q0154H2299b12768q2036P0922c5105k12960j27289I9634
11235a64507k5710m1398A89666a39523C8956K27677a8330A82174G1518C0642a65151
11223G675J5333b7476j05675I0688P9147j3509p3219k1806n756R3445e4226m0143
11211i4369C7626d912E6167a88584c3527j90410A48840d7354j63077f6102A02879
11199a19941B24017g7005m714A69307c91210B8020a66484h0233G9138O7970a54295
11187e9629k83149A09858Q4349c40395P5292k4488J02165c2227c868k88883e4007
$$ plain form
11175 -154685 -26796 -89993 77422 -280069 87585 78192 -314851 27146 189507 -66277 -288149
11164 -288149 12308 -306987 11100 -207987 99222 248534 138642 67629 76748 -253578 -179284
11153 -179284 18457 82284 -60314 -131955 117136 -555977 437701 306137 -39148 -147253
11143 -147253 277349 82207 -264473 -43759 359682 33956 67477 13549 102569 235317 89619
11131 203995 210208 -2424 -281123 -23365 405385 -394289 -140731 135921 150928 -14753 27759
11119 239311 -46119 27526 174927 145212 -316736 98441 16449 -164450 -104959 218607 359298
11108 359298 -232298 262991 -70283 489979 174856 26172 -148351 170091 504761 119882
11097 191808 497090 201003 -82397 352074 516347 50705 -102815 -15287 198818 203599
$$ packed form
11175a54685b6796o3197G7422b80069H7585r393c14851B7146J62361f6277k21872
11164b88149A2308c06987A1100b07987I9222J49312j09892F7629R119b53578P4294
11153a79284A8457O3827f0314p1641A17136e55977D37701j31564c9148j08105
11143a47253B77349H2207b64473d3759C59682C3956L3521A3549Q9020J32748H9619
11131B03995O213b424k78699b3365D05385c94289a40731A35921J5007a4753B7759
11119B39311d6119B7526J47401k9715c16736I8441A6449a64450N9491B18607J40691
11108C59298b32298B62991g0283D89979A74856B6172a48351A70091L34670A19882
11097A91808L05282B01003h2397C52074J64273E0705a02815a5287A98818M781
$$ plain form
11087 203599 -20028 207931 229991 39957 22327 -174434 -13061 -48108 -249445 201469 218534
11076 218534 580620 6979 -122803 -129452 178310 302532 179563 189308 34635 272621 249754
11065 249754 171660 789301 64050 534263 345040 196019 527937 449156 230616 577933
11055 577933 649097 613277 831016 651025 360405 835425 817227 592550 271145 728475
11045 728475 229587 233659 694364 998014 600605 638297 456399 421856 436782 467848 624028
11034 624028 640040 639127 601469 373981 582662 320654 415341 590062 154678 351368 611268
11023 611268 472247 320573 354226 452433 278044 390692 560021 296778 434918 100392
11012 247060 490921 657534 583335 472581 475383 427135 484341 477882 383026 573049 409930
$$ packed form
11087B03599b0028B07931K2060C9957j7630a74434a3061l5047k01337B01469J7065
11076B18534L62086F979a22803o649A78310J24222j22969R745C4635K37986k2867
11065B49754p8094O17641F4050M70213j89223j49021L31918p8781k18540L47317
11055E77933P1164l5820K17739j79991k90620M75020j8198k24677B71145M57330
11045G28475B29587M072M60705L03650l97409L7692j81898l4543J4926L1066J56180
11034F24028J6012r13l7658k27488K08681k62008R4687J74721A54678J96690K59900
11023F11268j39021j51674L3653R8207j74389J12648J69329k63243J38140A00392
11012B47060K43861J66613p4199j10754K802m8248N7206o459r4856J90023j63119
$$ plain form
11001 409930 516418 648947 532333 520209 520461 321107 386700 255642 441630 483725 603206
10990 603206 385799 393584 663484 534321 984722 793934 550635 787263 1052337 602897
10980 602897 691901 953802 932362 1401867 1197143 1590467 2031316 2124038 2034181 1854631
10970 1854631 1897211 1611336 1872639 1318618 1283506 1284495 1241080 1257291 1407431 1210178 1185690
10959 1185690 1003425 1488951 1345926 918439 1126777 1208031 894824 529684 401992 550895
10949 550895 490510 415276 638969 5522 176662 -104908 291646 22960 333576 2350 58085
10938 58085 182340 61908 144331 -287228 101420 -3346 -328792 -91734 126158 315441 101820
10926 132551 -79228 236493 133303 -357855 41499 23430 -367438 176158 21147 167736
$$ packed form
11001D09930J06488J32529j16614j2124K52j99354O5593j31058J85988M2095J19481
10990F03206k17407P785K69900j29163M50401j90788k43299K36628K65074m49440
10980F02897Q9004K61901k1440M69505k04724L93324M40849R2722q9857j79550
10970A854631M2580k85875K61303n54021l5112R89m3415J6211J50140j97253k4488
10959A185690j82265M85526j43025m27487K08338Q1254l13207l65140j27692J48903
10949E50895o0385p5234K23693E522J71140a04908B91646B2960L10616B350N5735
10938E8085J24255F1908Q2423b87228A01420c346l25446i1734A26158J89283A01820
10926A32551g9228B36493j03190c57855D1499j8069c67438A76158B1147J46589
$$ plain form
10916 167736 182018 6956 99195 138559 -146258 38236 -249496 161959 -306189 57723 -71884
10904 162228 232150 -31475 17921 -29267 -193020 324013 -23963 147888 -64626 240048 68454
10892 -84266 124894 -156185 117372 49394 -134218 -134621 -67360 -229152 396407 188517 34229
10880 83052 -31652 155262 110242 170154 40727 56533 -15085 54966 -12135 159759 115873
10869 115873 -104428 -13913 189965 153985 -49916 -288274 44482 -68478 -85972 13158 163959
10858 163959 -109262 268885 79022 -31550 -31114 -112921 -30609 -202273 -202740 121797 29405
10846 13833 33363 -190907 -74259 342186 22049 -22332 53466 81251 -153483 97407 -208598
10834 1602 -322511 -38138 100202 -111033 75878 54435 44655 80454 -226757 -46708 58831
$$ packed form
10916A67736J4282F956R2239L9364a46258C8236b49496A61959c06189E7723g1884
10904A62228O9922c1475A7921b9267j63753C24013b3963A47888f4626B40048F8454
10892h4266A24894a56185A17372D9394a34218m03O7261j61792C96407A88517C4229
10880H3052c1652A55262m5020N9912D0727J5806a5085E4966a2135A59759m3886
10869A15873a04428a3913A89965l5980d9916k38358D4482f8478j7494A3158J50801
10858A63959a09262B68885G9022c1550M36q1807c0609j71664m67A21797B9405
10846A3833J9530a90907g4259C42186B2049b2332E3466K7785a53483I7407b08598
10834A602c22511c8138A00202a11033G5878k1443r780L5799b26757d6708E8831
$$ plain form
10822 41879 307017 98101 -415526 -242182 -178917 -274097 -173702 128045 -168001 -285320
10812 -285320 -115566 66852 -138311 -71764 -259136 -115730 -150851 48063 -143462 -89393
10802 -89393 -264490 -368156 -210543 -131598 91368 82729 94623 133832 55954 -224158 -359896
10791 -359896 -159605 341463 27129 -269049 -160843 78536 -364521 -36280 268307 86738
10780 -338603 -117653 58009 -156986 136454 -25627 398595 308793 -175612 29754 -212384
10769 129645 -83005 -274836 -76490 -180895 146960 42684 -9215 -209054 -347791 -8947 95183
10757 -90435 208900 168389 -306928 89937 -112669 41153 63835 -73279 -253125 88810 117673
10746 117673 66745 -110607 46135 97822 -209713 9767 -72960 150778 403832 109712 -97085
$$ packed form
10822D1879K65138I8101d15526J73344O3265r5180J00395A28045a68001j17319
10812b85320a15566F6852a38311O6547j87372a15730l5121D8063a43462N4069
10802h9393j75097j03666J57613P8945I1368q639J1894L9209E5954b24158j35738
10791c59896a59605C41463B7129b69049J08206G8536c64521c6280B68307H6738
10780c38603a17653E8009a56986A36454b5627C98595q9802a75612B9754b12384
10769A29645h3005j91831g6490j04405A46960D2684i215j99839j38737h947I5183
10757i0435B08900m0511c06928H9937a12669D1153K2682g3279j79846H8810K8863
10746A17673n0928a10607D6135N1687b09713I767g2960A50778K53054A09712i7085
$$ plain form
10734 404151 121239 -490325 -81044 -27141 -13636 4459 -238615 -9200 -336748 270633 -43929
10722 53573 -47139 -133937 -207666 -47592 -149075 462289 237474 -156517 259498 -78525 389862
10710 11599 -192523 -138242 -55405 94504 91569 -122538 -132115 63727 -296967 -359326 -296870
10699 -296870 59929 172340 245076 104146 -60032 238254 -253950 -14525 61169 41720 167015
10688 167015 235056 212452 337918 223363 -98970 200599 -50383 90478 -13508 57011 -48170
10676 11306 171512 -193065 249186 -18629 -20877 52388 -227631 287748 -39414 -22819 209676
10664 -11527 -22498 -280901 -221582 221807 2729 -336053 -166283 -246954 92689 44100 29292
10653 29292 86494 158432 -16157 -174214 -20678 -330405 105672 225249 -289061 45786 -40866
$$ packed form
10734D04151A21239d90325h1044b7141J3505D459b38615i200l27548B70633d3929
10722E3573d7139q6798p3729d7592j01483D62289k24815a56517B59498g8525C89862
10710A1599a92523N4281e5405I4504k935a22538r577F3727b96967o2359O2456
10699b96870E9929J12411P2736A04146f0032B38254b53950a4525F1169j9449J25295
10688A67015O8041k2604J25466j14555i8970B00599e0383I0478a3508E7011d8170
10676A1306J60206a93065B49186a8629k248E2388b27631B87748c9414J6595B09676
10664a1527j0971k58403N9319B21807B729c36053a66283q0671I2689D4100j4808
10653B9292N7202P1938a6157j58057b0678l09727A05672J19577b89061D5786d0866
$$ plain form
10641 -209629 68888 -133163 254174 -319548 -25418 -161557 -257976 -63261 98667 195412 73438
10629 -74107 -162520 -117128 -125880 -194711 41828 20578 171244 -90851 114660 323704 -201765
10617 -306856 109957 12816 -516682 127658 116778 -118559 404891 -293945 -268044 -59359
10606 -133281 -308576 -362368 -77016 187363 44534 -276484 -473881 -192799 66627 -115555
10595 94746 -56647 43122 -208866 141081 66510 -218598 193949 -39578 -128214 -175995 -189850
10584 -189850 43699 237551 87450 -94586 -177276 -100790 -38913 -277095 -29241 -191079 -256945
10573 -256945 287263 343584 -27631 -97652 -118382 -509178 -140485 -29237 -16867 -19195 189259
10561 -79922 -197364 320826 177617 -288580 -139511 2993 -262432 85506 133692 -499562
$$ packed form
10641b09629F8888a33163B54174c19548b5418j36139r6419f3261I8667R6745G3438
10629g4107q8413M5392q752o8831D1828B0578J50666i0851A14660K09044b01765
10617c06856A09957A2816e16682A27658j0880a18559D04891b93945K5901e9359
10606a33281j75295n3792g7016A87363D4534b76484j97397a92799F6627a15555
10595I4746e6647D3122b08866A41081F6510b18598A93949c9578q8636m7781j3855
10584a89850D3699J93852H7450i4586q2690P6486c8913k38182b9241j61838o5866
10573b56945B87263N6321b7631p0021k0730l90796a40485b9237J2370k328A89259
10561g9922j17442C20826j43209b88580a39511B993b62432H5506M8186d99562
$$ plain form
10550 134127 -17129 103641 -86534 -206800 -10888 152887 14835 -429489 -293932 -74445
10539 -1007 27768 93804 -330588 115423 -192560 10835 295751 -200678 -68081 -286181 90349
10527 15409 -124362 32354 93541 -426586 40508 123643 94213 -114214 -61370 391748 -111647
10515 -83459 99530 61414 -9303 3661 -120028 152112 -254761 -25568 147949 -56780 -54719
10504 -54719 81936 -200053 -234906 -78247 56117 137705 -116793 -49773 -233153 23887 -351473
10492 117860 79568 -268039 160055 -249885 -241201 106908 -171801 -93005 -27467 133389
10481 234710 105819 326846 486643 103181 76986 197049 -256969 -44339 -378104 -186149
10470 -44519 306619 206066 -206192 115704 -35441 -44266 -114460 156753 -254002 -359434
$$ packed form
10550A34127a7129A03641h6534j20266a0888A52887A4835d29489J35557g4445
10539a007B7768O6036c30588A15423a92560A0835K84916b00678f8081k18100I0349
10527A5409a24362C2354O1187d26586D0508Q3135k9430a14214N2844C91748a11647
10515h3459I9530l8116i303C661a20028A52112b54761b5568A47949e6780K061
10504e4719H1936b00053l4853g8247E6117Q1588a16793d9773j83380B3887c51473
10492A17860l8292b68039A60055b49885Q684A06908a71801P8796b7467A33389
10481B34710A05819K21027J59797A03181k6195J20063b56969d4339l33765a86149
10470d4519C06619j00553b06192A15704c5441q825p0194A56753b54002j05432
$$ plain form
10460 -359434 -19477 -61661 259430 256537 161277 20620 380030 -47185 -48201 -64053 -176573
10449 -176573 -185587 -165460 183050 -96199 -36801 25716 -209622 -53545 538847 8575 -4496
10437 -48457 -108871 600133 93442 -170925 -282453 -365786 -2418 -97090 -121896 -25786 35094
10425 126098 -103463 -320806 13760 278751 -103988 -170511 -247033 179967 38282 155763
10415 155763 -173888 -207929 -145943 220062 -394802 451914 -20291 -306837 -108232 47221
10404 -242564 19823 -192262 57207 -76608 -117331 233394 213031 48827 253204 -1112 346587
10392 -244356 -242591 -50067 310885 -147739 -12656 400984 203827 202434 -202344 142170 -35382
10380 35841 -68549 275534 65224 148945 -34396 -63887 182368 17876 131778 419156 143097
$$ packed form
10460c59434a9477m2184B59430k893r5260B0620L59410d7185j016j5852j12520
10449a76573r014K0127A83050i6199c6801B5716b09622e3545E38847H575d496
10437d8457o0414F00133I3442a70925j11528q3333b418r4672k4806b5786C5094
10425A26098a03463k17343A3760K64991a03988o6523p6522A79967C8282J17481
10415A55763a73888l4041O1986B20062c94802D51914b0291k86546a08232D7221
10404b42564A9823a92262E7207g6608m0723B33394k0363D8827K04377a112C46587
10392b44356J765e0067C10885a47739a2656D00984j97157j393b02344A42170c5382
10380C5841f8549B75534F5224Q3721c4396k9491A82368A7876J13902K87378A43097
$$ plain form
10368 -7707 596095 141471 71627 555920 285570 192915 242191 10558 303772 -77089 352702
10356 -209014 -25804 178901 -362985 212055 170604 248500 272281 298921 64887 184975 252382
10345 252382 492283 361948 349763 -469045 273844 461313 544281 191862 159569 254771
10335 254771 253016 -186889 196280 149382 -290112 343528 4133 7217 77146 80348 351099
10324 351099 -225180 266070 67194 355887 67536 221562 -24056 102822 39859 454745
10314 454745 153939 63931 77496 12620 -23733 185200 236181 -165583 147386 208967 290166
10303 290166 -45087 -100959 -182100 241393 -104711 114388 -245571 -1330 132705 37054 216689
10292 216689 106871 -97845 -43636 102064 -124454 9132 407600 240842 -33660 161736
$$ packed form
10368g707E96095A41471o9844M84293k70350r2655M9276A0558K93214g7089C52702
10356b09014b5804A78901c62985B12055m1451P7896K3781K6640F4887J20088O7407
10345B52382K39901j30335j2185d69045B73844J87469Q2968A91862l2293R5202
10335B54771j755a86889A96280m6898b90112C43528D133L084O9929L202K70751
10324C51099b25180B66070F7194K88693F7536J54026b4056A02822C9859M14886
10314D54745A53939F3931J3565A2620b3733A85200N0981a65583A47386O1581Q1199
10303B90166d5087n5872q1141B41393a04711A14388b45571a330A32705C7054J79635
10292B16689A06871i7845d3636A02064a24454I132L98468j66758c3660A61736
$$ plain form
10281 -155690 -41063 -166674 -220367 -61730 2798 -250719 -19682 -94788 -268015 -57389 -94839
10270 -94839 346673 -13898 -57822 26048 -181065 -51459 -48876 270233 86575 184476 -7409
10258 28507 170727 154829 93831 147685 37776 -99652 -186161 -139483 -103294 123145 -42149
10246 190835 -35956 157794 113608 39047 -317455 -19468 278135 116022 -199481 75479
10235 -215460 91642 -303614 113028 122448 -162268 88549 36192 -77582 -172937 -166174 94856
10223 -81544 -263221 12959 -170285 131469 -279311 86084 171489 -101811 103502 -344211
10212 36077 8391 -236341 -185235 -44437 190594 83095 -104396 -360144 -162734 42703 -406950
10200 -247406 63058 100846 173119 27307 -451775 -294011 -296011 -114017 -67551 -286228 336623
$$ packed form
10281a55690d1063j25611n3693f1730B798b50719a9682p5106j73227e7389l7450
10270i4839C46673a3898m3924B6048a81065e1459K583B70233H6575R7901g409
10258B8507J42220j5898o0998N3854C7776i9652q6509M6678L6189A23145d2149
10246A90835c5956A57794m4186C9047c17455a9468B78135A16022a99481G5479
10235b15460I1642c03614A13028R420a62268H8549C6192g7582r5355O763I4856
10223h1544j81677A2959a70285A31469b79311H6084Q5405a01811A03502c44211
10212C6077H391b36341N1106d4437A90594H3095a04396k55748a62734D2703d06950
10200b47406F3058L7788P2273B7307d51775J57764k000a14017M6466k18677C36623
$$ plain form
10188 15498 -159346 80514 -135804 -150721 -87802 -138829 -206411 -242101 -70763 -362508 231877
10176 -55455 366166 179626 30727 -204518 319585 -173948 -114784 4505 198534 -200727
10165 102096 174671 -128033 -119774 -74321 -60018 -269358 -202836 -265165 -305785 2807 -113931
10153 157971 -461456 -113463 222840 99240 -104244 -25385 -92641 235268 -256021 -355946
10143 -355946 17927 289302 -136181 -63109 -230674 188410 -208485 291806 -88784 -313494
10133 -313494 111249 71134 152392 -78713 268985 -185550 63538 99487 56783 -234084 89988
10121 -63193 374016 -202738 -267425 144714 -6667 124461 -136674 132929 -189570 35683
10110 233038 -194936 -33097 -56700 -171881 -236324 -281404 -291828 -14632 298468 -197528 69103
$$ packed form
10188A5498a59346H0514a35804j4917O2919n1027o7582l5690g0763k91745B31877
10176e5455C66166A79626C0727b04518C19585a73948N9164D505J94029b00727
10165A02096P2575a28033Q259M5453J4303k09340O6522o2329m0620B807a13931
10153A57971d61456a13463B22840I9240a04244b5385o7256B35268b56021r9925
10143c55946A7927K71375a36181f3109j67565A88410b08485B91806h8784k24710
10133c13494A11249m0115Q1258g8713B68985a85550F3538L5949m2704b34084H9988
10121f3193C74016b02738o4687A44714f667A24461a36674A32929a89570C5683
10110B33038a94936c3097k3603j15181o4443m5080j0424a4632B98468a97528F9103
$$ plain form
10098 -222148 -102469 -227786 -68460 -23559 134344 111091 76014 -52023 180311 75000 -235268
10086 -5148 -17235 -139676 -203553 73684 -6122 204795 -140006 -153420 256907 -131736 -339904
10075 -339904 -200672 -366349 100426 79696 410246 -57783 69990 208000 -274374 206166
10064 -29815 -116955 48293 23924 145941 -172581 29889 26463 128725 105759 -122348 119876
10052 -199246 -359791 192534 30172 -88951 -129262 -164959 -26010 60188 -128648 51255 -102800
10040 -250954 75538 59815 -79216 -37663 -18820 -139010 -147598 123526 -67911 189315 -40008
10028 -17999 -159473 -330188 254566 -29133 44899 -477867 -96061 -153447 39808 -438389 -94258
10016 -49183 68613 157257 102933 4259 354173 274355 -192384 -150740 149983 -147239 8893
$$ packed form
10098b22148a02469j25317f8460b3559A34344k3253l5077e2023A80311G5000b35268
10086e148j2087j22441o3877G3684f122B04795a40006j3414B56907a31736k08168
10075c39904J39232j65677A00426k0730L30550e7783F9990J38010b74374B06166
10064b9815q7140D8293B3924J22017a72581B9889l426J02262k2966a22348A19876
10052a99246j60545A92534C0172h8951m0311l5697b6010F0188a28648E1255a02800
10040b50954G5538j5723g9216c7663a8820j20190q588A23526f7911A89315d0008
10028a7999j41474j70715B54566b9133D4899d77867i6061n7386C9808d38389i4258
10016d9183F8613Q8644n4324D259L49914p9818a92384M1644A49983a47239H893
$$ plain form
10004 -201173 187274 50552 -365371 -237292 -94033 61545 -46678 -67791 -38841 -36835 -89914
9993 -89914 10927 -98519 221709 -183909 -145425 362017 -385848 -127246 -63977 -108735 -21733
9981 125071 278382 -133069 -102240 -100978 73907 -213894 353975 -188187 112942 26717 -158969
9969 -249386 -86346 22556 66446 -64976 -212667 -405967 -65759 71463 -44613 189358 -81815
9957 -171748 -48212 -124597 87015 -135631 -79432 -258024 122637 -89964 85787 -107517 62834
9945 53925 22947 251325 -174765 83442 -305824 -360439 -135205 -129541 320974 278118 25039
9933 105398 -22980 -261971 -227505 -47536 185784 -9717 25506 128448 -450709 -88306 -124427
9922 -124427 -32815 -128279 -156620 -60160 130976 -55146 40767 -142986 -33264 -186402 34427
$$ packed form
10004b01173A87274E0552c65371J28079i4033F1545d6678k1113K8950K006n3079
9993h9914A0927i8519B21709a83909L8484C62017c85848a27246O3269m4758b1733
9981A25071J53311a33069L0829J262G3907b13894C53975a88187A12942B6717a58969
9969b49386h6346B2556M3890f4976j47691j93300f5759G1463d4613A89358h1815
9957a71748d8212p6385H7015a35631N6199j78592A22637h9964H5787a07517F2834
9945E3925B2947K28378a74765H3442c05824n4615a35205N664C20974m2856B5039
9933A05398b2980k38991L4466d7536A85784i717B5506J02942d50709h8306l6121
9922a24427c2815r5464k8341f0160A30976e5146D0767a42986c3264j53138C4427
$$ plain form
9910 158323 127134 -22721 -224509 -93721 -53259 -214115 125149 -212564 -352590 -180016
9900 -180016 -158446 7195 -206511 -182398 -203525 -108459 53115 138899 -206728 114159 65326
9889 65326 -315132 -120175 -228905 -96402 -273995 -104712 -48418 -28400 -59879 -210243 -138868
9878 -138868 -162897 231171 -192087 33998 -67047 241113 -144505 -187935 -269589 165973 -145534
9866 -431 -46141 -201388 21000 -138008 -308092 -108389 262259 -151869 -227094 -86719 -117211
9855 -117211 -179171 25794 76365 -38742 -148826 144153 -13597 -131717 -138199 -421946 -331493
9844 -331493 109377 31403 -202669 -275104 -5911 -94458 -76045 101405 -210871 -28266 -45247
9833 -45247 -69979 17102 -320447 -41115 129516 -276308 6605 -94617 -174225 -82560 11617
$$ packed form
9910A58323l1189b2721k01788i3721M0462j60856A25149b12564j40026J72574
9900a80016K1570G195b06511K4113k1127R5066E3115Q5784b06728A14159m8833
9889F5326c15132a20175j08730i6402j77593a04712d8418K0018l1479j50364P1375
9878a38868k4029B31171a92087C3998f7047B41113a44505m3430q1654A65973a45534
9866d31m5710j55247B1000a38008j70084a08389B62259a51869p5225h6719l0492
9855a17211o1960B5794N0571c8742j10084A44153a3597j18120o482k83747R0453
9844c31493A09377C1403b02669p2435e911q8547J8413A01405b10871b8266j6981
9833d5247k4732A7102c20447d1115A29516b76308F605i4617p9608h2560A1617
$$ plain form
9821 141805 -292051 -205670 -44484 103887 -121757 8253 -150526 -127414 -54873 80908 139505
9810 139505 -267362 -22424 47835 95350 -461166 -226120 26456 -414876 22377 -76665 -277665
9799 -277665 -167012 8369 -27703 125031 -15386 223575 6314 133242 -187062 -254423 -115310
9787 -172663 95056 -80812 3331 146310 -175774 -53286 180769 -75183 -16594 -230111 -219357
9776 -219357 585 133855 88033 -94079 -296224 -313684 -98308 -241060 -60674 -36036 222972
9764 -379666 107388 70833 -105505 99998 -199193 -177915 -17123 -374036 -87077 -15049 -253268
9753 -253268 -27154 -102934 -132147 228993 22917 -89956 -386242 -52572 -42615 417902 34396
9741 216498 -172599 2006 246379 52570 -65532 -28839 12724 203607 -161353 -44003 -97134
$$ packed form
9821A41805b92051Q6381d4484A03887a21757H253a50526K3112e4873H0908N8597
9810A39505b67362b2424D7835M7515d61166b26120B6456d14876B2377g6665k01000
9799b77665J10653H369b7703A25031a5386B23575F314J26928a87062o7361a15310
9787a72663I5056h0812C331J42979a75774e3286A80769g5183a6594k13517J0754
9776b19357E85J33270m5822i4079k02145j7460i8308j42752f0674K4638B22972
9764c79666A07388l6555a05505I9998a99193K1278a7123l56913h7077a5049k38219
9753b53268b7154p5780k9213B28993B2917h9956k96286e2572R957D17902C4396
9741B16498a72599B006K44373E2570f5532b8839A2724J90883a61353d4003n3131
$$ plain form
9730 -97134 114307 35211 29429 30648 -29453 -95496 -226762 -146964 -331010 -42335 -64479 86069
9717 -386211 203071 272752 -185135 -220002 -18110 -161717 -317225 -149571 18320 -154248
9706 -216464 -141884 19261 -225255 26250 153989 -21290 62812 -24600 -146916 -86945 69276
9694 190067 70514 16267 -167569 139007 -134095 203640 17991 -273721 -44178 263484
9683 -281846 13509 113352 97493 -248560 138289 67978 -98689 -167175 188700 94830 153738
9672 153738 -2557 -146349 -126065 -37018 -27947 -35605 -259818 -69247 -179825 -192009 -285035 21329
9659 -8046 -223391 -129058 -65521 -180087 -16598 57047 140108 -74537 139893 -20452 9586 -125024
9646 -131678 33888 54883 16466 97862 -203636 -66415 209272 -193064 -289973 -158754 359706
$$ packed form
9730i7134A14307C5211n782J219b9453o6043j31266P9798j84046d2335k2144H6069
9717c86211B03071O9681a85135l4867a8110j43607j55508a49571A8320a54248
9706b16464P4580A9261b25255B6250J27739b1290F2812b4600j22316N9971F9276
9694A90067G0514A6267a67569A39007a34095B03640A7991b73721d4178B63484
9683b81846A3509R9843j5859b48560A38289F7978i8689o8486A88700r3870N8908
9672A53738b557j43792K0284c7018R071p658k24213f9247j10578j2184r3026B1329
9659h046k15345R4333O3537j14566a6598E7047Q3061g4537A39893b0452I586a25024
9646a31678C3888K0995A6466Q1396b03636f6415B09272a93064r6909J31219C59706
$$ plain form
9634 -148507 -336499 221891 -344343 51272 273255 160298 131551 -65185 126108 -299453
9623 264404 81626 -98378 224408 -10717 -125780 -510356 15930 -220751 -167578 70399 -76255
9611 126233 -230285 235935 81153 222127 -106685 -28943 141129 73821 -165548 -223465
9601 -223465 146991 -54247 -10933 -204333 224217 167025 51023 151361 -38525 86856 54665
9590 54665 26748 -180762 110693 186517 -2836 194515 -54637 23194 -90770 172261 119535
9579 119535 -263735 -259440 5432 187179 51231 -182655 -293131 -173842 19211 74375 -18664
9567 -147039 -197974 -84355 -189787 -154917 -38246 -165162 -203827 -260025 -54292 -218176 -252673
9556 -252673 -93477 115814 49607 -165868 102667 256368 193149 -57657 -299321 -197821
$$ packed form
9634a48507j87992B21891c44343E1272K21983j12957k8747f5185A26108b99453
9623B64404H1626i8378B24408a0717j15063l84576A5930b20751N3173G0399g6255
9611A26233b30285B35935H1153J40974a06685b8943A41129o7308a65548n7917
9601b23465A46991e4247a0933j93400B24217n7192E1023J00338c8525H6856l2191
9590E4665B6748a80762A10693P5824b836A94515e4637B3194i0770A72261n2726
9579A19535b63735M295E432J81747E1231a82655j10476J19289A9211N5164a8664
9567a47039n0935h4355j05432L4870c8246j26916l8665n6198e4292j63884l4497
9556b52673i3477A15814D9607a65868A02667J53701o3219e7657k41664J01500
$$ plain form
9546 -197821 -43793 71984 107883 -138573 -239549 24893 -215445 317641 -38277 -212442 -102967
9534 19030 -294421 -221451 79218 51547 -200290 -302228 -137922 243314 -236346 -365649
9524 -365649 394567 -95642 32691 -125896 1793 -96384 185865 390714 -433362 -274218 119042
9512 -210345 -77279 16001 96658 -190942 155722 -47245 -107221 -386389 -315563 -86208 -127004
9501 -127004 -96530 -114170 111868 -97386 -114340 238776 47877 -246118 -333945 -127164 -48610
9489 -154963 -74968 20504 233473 -330203 -265626 170939 47495 -246702 24784 -278853 274667
9477 -40753 -108340 31456 184298 -139033 -185273 -7781 89991 -93483 224489 -73909 263869
9465 321706 48891 -161848 129775 57899 -358827 18298 69638 140858 -73229 -288593 271968
$$ packed form
9546a97821d3793G1984L5899a38573j00976B4893b15445C17641c8277j74165a02967
9534A9030b94421P2970G9218k7671b00290j01938a37922B43314b36346j29303
9524c65649C94567i5642C2691a25896A793i6384A85865K04849d33362J59144A19042
9512b10345g7279A6001Q0657a90942A55722d7245n9976k79168P0826h6208m0796
9501a27004L0474j7640A11868i7386j6954B38776D7877b46118q7827a27164d8610
9489a54963g4968B0504K12969c30203O4577A70939D7495b46702B4784b78853B74667
9477d0753o7587C1456J52842a39033m6240g781H9991i3483B24489g3909B63869
9465C21706D8891a61848A29775E7899c58827A8298N1340P1220g3229k15364B71968
$$ plain form
9453 -144615 44322 -310260 283893 -104309 -267494 78100 -126852 16658 -41198 -109485 -43835
9441 81926 -78273 -194023 -457225 190019 -157734 141689 -230640 8261 -289799 -355726 -342790
9430 -342790 -284981 21158 -409679 -19482 236007 43645 -162159 -21984 -121688 -30453 230502
9418 -157468 -23776 -278764 11727 -290692 -20643 -132668 -126583 -130939 -71621 -110317 -65945
9407 -65945 131800 210979 -162763 -21364 23801 206772 -14545 -52679 9279 -147666 118160
9395 -310311 -85801 -224072 -172114 -248862 -274248 -55557 93695 56847 99074 -186177 -84645
9383 -139105 -290103 -116831 -9438 -183973 97669 305415 -35268 35905 1405 -205794 -85524
9371 -174655 -190171 10718 108245 106044 -99290 -14047 -264844 100154 -155963 14729 -297337
$$ packed form
9453a44615D4322c10260B83893a04309j63185G8100a26852A6658d1198o8287d3835
9441H1926g8273j15750k63202A90019a57734A41689b30640H261b89799o5927J2936
9430c42790N7809B1158d09679a9482B36007D3645a62159b1984r9704c0453B30502
9418a57468b3776k54988A1727b90692b0643j12025O085m356N9318l8696M4372
9407f5945A31800P9179a62763b1364B3801J82971a4545l8134I279a47666A18160
9395c10311h5801j38271N1958p6748k5386e5557I3695l6848M2227a86177h4645
9383a39105j50998a16831i438j74535I7669K07746c5268C5905A405b05794h5524
9371a74655j5516A0718R7527k201i9290a4047k50797A00154a55963A4729b97337
$$ plain form
9359 -219274 302021 -502965 313637 -90143 -351863 101287 203213 103762 -119821 121731
9348 -158332 164732 -197225 -80141 410248 42027 267656 -252606 -162834 -72411 371988
9337 -181046 120032 107299 21982 -76652 -172758 -329027 45045 -112793 -9560 -157890 17093
9325 -43005 -103006 -182593 -28596 -229312 108139 85564 236458 102962 -292028 -48478 165938
9313 11240 17125 180390 23747 98388 -55668 50432 485260 222661 -282830 104383 -11986
9301 223883 56516 -256370 -8613 -280325 303314 -86332 123490 -67002 -15523 92897 337525
9290 337525 -283411 -76732 39264 -220481 81037 51073 -233810 171834 -199199 80179 -99915
9278 123468 127469 315894 -63237 -239445 -284996 -73665 137967 -249233 -143150 23916 106377
$$ packed form
9359b19274C02021e02965C13637i0143k61720A01287J01926r9451a19821A21731
9348a58332A64732a97225h0141D10248D2027K25629b52606Q9772g2411C71988
9337a81046A20032j2733B1982g6652r6106j56269D5045a12793i560j48330A7093
9325d3005o0001p9587b8596k00716A08139k2575J50894A02962b92028d8478A65938
9313A1240N885J63265B3747P4641e5668E0432M34828B22661b82830A04383a1986
9301B23883E6516b56370h613k71712C03314h6332A23490f7002a5523I2897K44628
9290C37525b83411g6732C9264b20481H1037k9964b33810A71834a99199H0179i9915
9278A23468M001J88425f3237j76208m5551g3665A37967b49233J06083B3916Q2461
$$ plain form
9267 106377 26287 -94328 -160089 236076 -32750 -76739 103323 -162230 -31652 130114 87154
9256 87154 -229244 -104830 148699 -256995 279691 36457 -9228 21549 -32557 -70649 -126649
9245 -126649 -62867 245136 183156 128303 -198361 180649 -303742 86190 -102212 42584 -102460
9233 44248 -3010 238058 -249475 -267194 -247758 -84389 -63335 80057 -61984 -283930 -442285
9222 -442285 -142296 -50143 41209 -102230 57059 172200 83935 -131518 -282068 89840 -60116
9210 125615 -111894 -153110 21784 77511 13544 115662 -77223 226741 -284913 -117866 82228
9198 -2094 -75508 -89608 -100364 -299321 -1171 60724 80440 22904 -194756 -10154 82685 80654
9186 80654 309283 87613 176321 -156181 -306832 107298 -280045 -116196 -287392 -14654
$$ packed form
9267A06377B6287i4328o5761B36076c2750m3989A03323a62230c1652A30114m2960
9256H7154b29244a04830A48699b56995B79691C6457i228B1549c2557l8092n6000
9245a26649f2867B45136o1980n4853a98361A80649c03742H6190a02212D2584a02460
9233D4248c010B38058b49475j7719J9436h4389K1054H0057f1984k21946j58355
9222d42285a42296e0143D1209a02230E7059J15141H3935a31518j50550H9840f0116
9210A25615a11894m1216B1784N5727A3544J02118g7223B26741b84913a17866H2228
9198b094p3414j4100j0756j98957a171F0724J9716B2904a94756a0154H2685k031
9186H0654K28629H7613Q8708a56181j50651A07298b80045a16196j71196a4654
$$ plain form
9175 -68053 67537 61038 121003 10925 53992 -99572 -249817 187085 -346820 10222 171046
9164 171046 -7428 150721 -104551 -138122 -40607 3112 -71447 183798 -45157 -160647 -113619
9153 -113619 108645 111703 170425 63726 -1636 17015 -123239 -263869 45769 -210985 269467
9141 -164910 118172 -147116 -78300 -103889 -180929 -340996 36974 40222 148055 -47970 97116
9129 71475 -36677 -171608 -191928 -114898 -140510 -174565 38150 -329987 -33365 74807 -81182
9117 -250475 -309438 -504624 -234360 -282642 -34464 -177724 216102 -350123 -115839 487442
9106 226212 -74552 -45089 -308939 -11986 -36917 -43312 -120875 -59313 122142 -181370 -136489
9095 -136489 -133680 -323527 -304280 -239977 -32024 23161 204555 -204807 557569 -11054 185756
$$ packed form
9175f8053F7537o499N9965A0925M3067i9572j50245A87085c46820A0222J60824
9164A71046g428A50721a04551l3571d0607C112g1447A83798d5157j15490M7028
9153a13619A08645L058N8722F3726a636A7015a23239j40630D5769b10985B69467
9141a64910A18172a47116O8816k5589p7040j60067C6974L248J07833d7970I7116
9129G1475c6677j34931k0320P7030k5612l4055C8150c29987c3365G4807h1182
9117b50475n8963j95186b34360m8282c4464j43260B16102c50123a15839D87442
9106B26212g4552K9463k63850a1986k4931o395p7563e9313A22142a81370M4881
9095a36489K809j89847J9247O4303c2024B3161J81394b04807E57569a1054A85756
$$ plain form
9083 -304937 -305551 177544 -62411 -25420 -166491 -1860 -77233 -311541 -57573 -250394 -95443
9071 -4176 -117607 -137544 -70693 -65894 47068 -105936 165921 -101633 165 -25432 -139011 33013
9058 205228 -117686 -78236 117345 -19015 -165979 161434 -169937 -124302 -181475 -261098 -152868
9047 -152868 -380698 -73389 -149031 -77048 -89461 115905 159915 86129 8355 -163360 -28446
9035 186046 142118 36547 244989 -90268 -7387 -206344 -96914 -35262 -174449 12678 -206864
9023 -198388 30458 -65651 96749 176829 125785 192234 37493 -248059 -386445 -320840 -41227
9011 -130147 106981 114872 73579 -346468 51001 -151556 53405 -148423 103878 -246403 -115405
8999 -244735 186437 33464 -236417 -115699 -88340 -144647 197680 -159529 213422 -184024
$$ packed form
9083c04937o14A77544f2411b5420j41071a860p5373k34308e7573j92821i5443
9071d176j13431j9937O6851M799D7068a05936A65921a01633A65b5432j13579C3013
9058B05228a17686L9450A17345a9015j46964A61434a69937M5635n7173p9623J08230
9047a52868k27830g3389p5642P1983j2413A15905M4010p3786H355a63360b8446
9035A86046m3928C6547K08442i0268g387j98957i6914c5262j39187A2678b06864
9023a98388C0458f5651I6749Q0080n1044O6449C7493b48059j38386O5605d1227
9011a30147A06981P891m1293c46468E1001a51556E3405a48423A03878b46403a15405
8999b44735A86437C3464b36417a15699K7359n6307A97680a59529B13422a84024
$$ plain form
8988 -110867 -71656 -111669 -22942 146496 -185331 -161145 -11640 84737 -121404 -195112 -271434
8977 -271434 -36120 299661 -131511 103187 -237699 -225452 155479 -149266 -209624 -231225
8967 -231225 -25882 390798 -211756 -93681 43678 -59020 -101273 99056 -63392 -236027 59335
8955 273914 -206435 -86149 147530 -14338 63442 81236 -74321 -106938 126986 -198916 -191775
8944 -191775 -141266 216135 -172093 -76985 -31477 -205781 314007 223383 -81932 330560 342172
8933 342172 168594 84795 98762 214308 180568 230365 456038 659873 1075472 1459560
8923 1459560 3512175 9586717 8603880 3167467 1284995 701600 182060 211567 166769
8914 166769 194902 547306 -127483 137221 207598 185396 480931 -18107 -248285 10835 -173282
$$ packed form
8988a10867L9211m0013b2942A46496a85331K4186a1640H4737a21404p3708p6322
8977b71434c6120B99661a31511A03187b37699J2247A55479a49266o0358k1601
8967b31225b5882C90798b11756i3681D3678e9020m2253I9056f3392j72635E9335
8955B73914b06435h6149A47530a4338F3442J7794g4321l2617A26986a98916P141
8944a91775N0509B16135a72093g6985c1477j74304C14007r0624h1932C30560J1612
8933C42172A68594q3799J3967J15546l3740M9797K25673K03835M15599L84088
8923A459560K052615O074542r82837C167467A284995n83395A82060K9507m4798
8914A66769K8133L52404a27483A37221P0377k2202K95535a8107k30178A0835a73282
$$ plain form
8902 -188997 -25174 -15095 -13612 -224500 -12922 -27706 -13 -142954 -115103 -76980 74766 -129882
8889 69179 102814 87109 95817 -153172 -36842 -356189 -209621 -42412 100575 93511 -130560
8877 63677 -183262 -149205 -101965 -132835 71501 134053 -329033 -92630 128533 223071 217048
8866 217048 -136638 925 -333787 76240 -230280 -119302 107190 -113824 126732 -362719
8855 -66786 -294318 86416 -98385 -309963 144984 -33157 125840 -141037 -127525 -96052 97499
$$ packed form
8902a88997b5174J0079J483k10888a2922j4784a3j42941K7851L8123G4766a29882
8889F9179L3635j5705Q708a53172c6842l19347J46568d2412A00575p064a30560
8877F3677a83262L4057M7240l0870G1501O2552c29033i2630A28533R4538o023
8866B17048a36638I25c33787G6240b30280J10978A07190a13824A26732c62719
8855f6786k27532H6416i8385k11578A44984c3157A25840a41037J3512L1473I7499
$$ [...]
##END NTUPLES=NMR SPECTRUM
##END=
