##TITLE=AC1622_CTIAH13353_8326114_Co7wGyJ9ZX
##JCAMPDX= 6.0         $$ Bruker NMR JCAMP-DX V2.0
##DATA TYPE= NMR SPECTRUM
##DATA CLASS= NTUPLES
##ORIGIN= BRUKER
##OWNER= Administrator
$$ 1.72 TOPSPIN		Version 2.1
$$ 2013-11-14 00:28:04.015 -0800  Administrator@X
$$ Compression mode = diff/dup
##.OBSERVE FREQUENCY= 400.02188249412
##.OBSERVE NUCLEUS= ^1H
##.ACQUISITION MODE= SIMULTANEOUS (DQD)
##.ACQUISITION SCHEME= undefined
##.AVERAGES= 64
##.DIGITISER RES= 22
##SPECTROMETER/DATA SYSTEM= spect
##.PULSE SEQUENCE= noesygpps1d.comp
##.SOLVENT NAME= COFFEE_meoh
##.SHIFT REFERENCE= INTERNAL, COFFEE_meoh, 1, 14.96079
##AUDIT TRAIL= $$ (NUMBER, WHEN, WHO, WHERE, PROCESS, VERSION, WHAT)
$$ ##TITLE= Audit trail, TOPSPIN		Version 2.1
$$ ##JCAMPDX= 5.01
$$ ##ORIGIN= Bruker BioSpin GmbH
$$ ##OWNER= Administrator
$$ $$ E:\/data/COFFEE/nmr/AC1622_CTIAH13353_8326114_Co7wGyJ9ZX/12/pdata/1/auditp.txt
$$ ##AUDIT TRAIL=  $$ (NUMBER, WHEN, WHO, WHERE, PROCESS, VERSION, WHAT)
(   1,<2013-11-14 00:27:58.405 -0800>,<Administrator>,<X>,<go>,<TOPSPIN 2.1>,
      <created by zg
	started at 2013-11-14 00:16:28.140 -0800,
	POWCHK enabled, PULCHK disabled,
       configuration hash MD5:
       C8 4E 4E 5D D3 5C D8 9E 9F 52 82 E0 59 8A DE 15
       data hash MD5: 64K
       78 2E 8D CB 88 54 EF 42 E4 49 78 91 27 16 05 49>)
(   2,<2013-11-14 00:28:01.655 -0800>,<Administrator>,<X>,<proc1d>,<TOPSPIN 2.1>,
      <Start of raw data processing
       efp LB = 0.3 FT_mod = 6 PKNL = 1 PHC0 = 0 PHC1 = 0 SI = 128K 
       data hash MD5: 128K
       07 35 08 FB 9D 8D B8 0C A2 C1 FB 95 7D 39 20 A2>)
(   3,<2013-11-14 00:28:02.702 -0800>,<Administrator>,<X>,<proc1d>,<TOPSPIN 2.1>,
      <pk PHC0 = -85.69336 PHC1 = 0 
       data hash MD5: 128K
       C8 0F 0D 1C 3F AA 43 F2 C0 F4 0A 01 2D 62 A4 FF>)
(   4,<2013-11-14 00:28:03.124 -0800>,<Administrator>,<X>,<proc1d>,<TOPSPIN 2.1>,
      <abs ABSG = 1 
       data hash MD5: 128K
       4C 88 76 00 BE A0 A5 D8 6C 67 85 FC 41 92 86 43>)
(   5,<2013-11-14 00:28:03.233 -0800>,<Administrator>,<X>,<proc1d>,<TOPSPIN 2.1>,
      <abs ABSG = 2 
       data hash MD5: 128K
       F2 EF 77 B2 C6 D7 9F E2 DC 2B C1 37 F3 D1 AF 31>)
(   6,<2013-11-14 00:28:03.405 -0800>,<Administrator>,<X>,<proc1d>,<TOPSPIN 2.1>,
      <abs ABSG = 3 
       data hash MD5: 128K
       08 F7 04 09 CE A4 DB 6A FE 8D 32 65 E0 1F D0 36>)
(   7,<2013-11-14 00:28:03.608 -0800>,<Administrator>,<X>,<proc1d>,<TOPSPIN 2.1>,
      <abs ABSG = 4 
       data hash MD5: 128K
       9D 70 67 99 DD 5D 1A 53 73 C7 34 46 BE B7 93 76>)
(   8,<2013-11-14 00:28:03.718 -0800>,<Administrator>,<X>,<proc1d>,<TOPSPIN 2.1>,
      <abs ABSG = 5 
       data hash MD5: 128K
       1B FC ED EE 46 49 1B 79 58 46 88 8E 2C 66 C2 CC>)
$$ ##END=
$$ 
$$ $$ hash MD5
$$ $$ 79 FB 66 BE DE 67 2B B3 37 70 71 E7 98 77 7B AD
##$RELAX= 
##$RELAX= 
##$RELAX= 
##$RELAX= 
##$RELAX= 
##$RELAX= 
##$RELAX= 
##$RELAX= 
$$ Bruker specific parameters
$$ --------------------------
##$DU= <E:\>
##$EXPNO= 12
$$ [...]
##$TP07= 0
##$TPNAME0= <>
##$TPNAME1= <>
##$TPNAME2= <>
##$TPNAME3= <>
##$TPNAME4= <>
##$TPNAME5= <>
##$TPNAME6= <>
##$TPNAME7= <>
##$TPOAL= (0..7)
0.5 0.5 0.5 0.5 0.5 0.5 0.5 0.5
##$TPOFFS= (0..7)
0 0 0 0 0 0 0 0
##$TUNHIN= 0
##$TUNHOUT= 0
##$TUNXOUT= 0
##$USERA1= <user>
##$USERA2= <user>
##$USERA3= <user>
##$USERA4= <user>
##$USERA5= <user>
##$V9= 5
##$VALIST= <valist>
##$VCLIST= <CCCCCCCCCCCCCCC>
##$VD= 0
##$VDLIST= <DDDDDDDDDDDDDDD>
##$VPLIST= <PPPPPPPPPPPPPPP>
##$VTLIST= <TTTTTTTTTTTTTTT>
##$WBST= 1024
##$WBSW= 4
##$XGAIN= (0..3)
0 0 0 0
##$XL= 0
##$YL= 0
##$YMAX_a= 5452801
##$YMIN_a= -10889732
##$ZGOPTNS= <>
##$ZL1= 120
##$ZL2= 120
##$ZL3= 120
##$ZL4= 120
##$ABSF1= 14.96079
##$ABSF2= -5.597392
##$ABSG= 5
##$ABSL= 3
##$ALPHA= 0
##$AQORDER= 0
##$ASSFAC= 0
##$ASSFACI= 0
##$ASSFACX= 0
##$ASSWID= 0
##$AUNMP= <proc_prof1d_extract.lims>
##$AXLEFT= 0
##$AXNAME= <>
##$AXNUC= <1H>
##$AXRIGHT= 0
##$AXTYPE= 0
##$AXUNIT= <>
##$AZFE= 0.1
##$AZFW= 0.1
##$BCFW= 0
##$BC_mod= 0
##$BYTORDP= 0
##$COROFFS= 0
##$CY= 15
##$DATMOD= 1
##$DC= 0
##$DFILT= <>
##$DTYPP= 0
##$F1P= 0
##$F2P= 0
##$FCOR= 0.5
##$FTSIZE= 131072
##$FT_mod= 6
##$GAMMA= 0
##$GB= 0
##$INTBC= 1
##$INTSCL= 1
##$ISEN= 128
##$LB= 0.3
##$LEV0= 0
##$LPBIN= 0
##$MAXI= 10000
##$MC2= 0
##$MEAN= 0
##$ME_mod= 0
##$MI= 0
##$NCOEF= 0
##$NC_proc= -2
##$NLEV= 6
##$NOISF1= 0
##$NOISF2= 0
##$NSP= 0
##$NTH_PI= 0
##$NZP= 0
##$OFFSET= 14.96079
##$PC= 1
##$PHC0= -85.69336
##$PHC1= 0
##$PH_mod= 1
##$PKNL= yes
##$PPARMOD= 0
##$PPDIAG= 0
##$PPIPTYP= 0
##$PPMPNUM= 2147483647
##$PPRESOL= 1
##$PSCAL= 4
##$PSIGN= 0
##$PYNMP= <proc.py>
##$REVERSE= no
##$SF= 400.020009721043
##$SI= 131072
##$SIGF1= 0
##$SIGF2= 0
##$SINO= 400
##$SIOLD= 131072
##$SPECTYP= <>
##$SREGLST= <1H.CDCl3>
##$SSB= 0
##$STSI= 131072
##$STSR= 0
##$SW_p= 8223.68421052631
##$SYMM= 0
##$S_DEV= 0
##$TDeff= 65536
##$TDoff= 0
##$TI= <>
##$TILT= no
##$TM1= 0
##$TM2= 0
##$TOPLEV= 0
##$USERP1= <user>
##$USERP2= <user>
##$USERP3= <user>
##$USERP4= <user>
##$USERP5= <user>
##$WDW= 1
##$XDIM= 131072
##$YMAX_p= 402525181
##$YMIN_p= -12803
##$CURPLOT= <Network HP LaserJet P1505>
##$CURPRIN= <$Network HP LaserJet P1505>
##$DFORMAT= <normdp>
##$LAYOUT= <+/1D_H.xwp>
##$LFORMAT= <normlp>
##$PFORMAT= <normpl>
##$SURQMSG= 1
$$ End of Bruker specific parameters
$$ ---------------------------------
##NTUPLES= NMR SPECTRUM
##VAR_NAME=  FREQUENCY,     SPECTRUM/REAL,   SPECTRUM/IMAG
##SYMBOL=    X,             R,               I
##VAR_TYPE=  INDEPENDENT,   DEPENDENT,       DEPENDENT
##VAR_FORM=  AFFN,          ASDF,            ASDF
##VAR_DIM=   131072,        131072,          131072
##UNITS=     HZ,            ARBITRARY UNITS, ARBITRARY UNITS
##FACTOR=    0.0627417313425164, 1,          1
##FIRST=     8223.62146879497, 5060,         -56165
##LAST=      0,             6006,            -55402
##MIN=       0,             -12803,          0
##MAX=       8223.62146879497, 402525181,    0
$$ Real data points
##PAGE= N=1
##DATA TABLE= (X++(R..R)), XYDATA
$$ [...]
63883F58170j7213j5605j3797j1634r109o670m735l046r22J841M648O753P986
63870E96667Q713R282R682R795R750R817R977R841R204Q357P589O630N008K925
63856G13237J188J48p62k205m103n949p573r096j0372j1118j1534j2273j3648
63843F25940j5215j6307j6787j7042j7475j8118j8677j8810j8405j7666j6929
63832D34509j6326j5686j4771j3604j2450j1577j1008j0562j0058r437q754q105
63820B92171p604p227o662n553m074l016k945l363l176j984n10L48M84L83L82
63805B47654M00J51o40j987l273l509k376q05j8j72m68m71o91j669l053l979m026
63788B21068l491k826k239j777j501j424j372j071m43K00M36J75k48n45p35q40
$$ plain form
63883 658170 640957 625352 611555 599921 590812 584142 579407 576361 575439 577280 581928 588681 596667
63870 596667 605380 614662 624344 634139 643889 653706 663683 673524 682728 691085 698674 705304 710312 713237
63856 713237 714425 714573 713811 711606 707503 701554 693981 684885 674513 663395 651861 639588 625940
63843 625940 610725 594418 577631 560589 543114 524996 506319 487509 469104 451438 434509
63832 434509 418183 402497 387726 374122 361672 350095 339087 328525 318467 309030 300276 292171
63820 292171 284567 277340 270678 265125 261051 258035 255090 251727 248551 246567 246057 246405 246889 247272 247654
63805 247654 248054 248205 247565 245578 242305 238796 236420 235615 235597 235425 234957 234486 233795 232126 229073 225094 221068
63788 221068 217577 214751 212512 210735 209234 207810 206438 205367 204924 205124 205560 205735 205487 204942 204207 203367
63772B03367o36j0O24P18L04r9k83n87j174j651j630j372j408j768j973j717j220
63755A89485q41o41m36r9K86N66O69O45N22K96Q1J67O65J217J305R93R93J764
63737A97637K800L151K595J886J752J986J854J177O51R43J780K335K324K339K938
63722B28148L789M133L813L405L287L135K531J679J140J041Q80J73r23j721j670
63707B52840r27k61l48j082j711j622q73M0P40J136J273J249J252J415J631J647
63691B56399J371J039J014J479K280L015L279K903K047J096L99M5j88n65j085
63676B74528j514j698j643j226k43J002J586R98k6l13J95M73m0p74j134j378j852
63659B66941k185j980j763k251l113l365k836k324k253k185j796j475j523j507
$$ plain form
63772 203367 202731 202721 203345 204063 204367 204268 203985 203398 202224 200573 198943 197571 196163 194395 192422 190705 189485
63755 189485 188644 188003 187567 187468 187754 188320 188989 189634 190156 190452 190533 190700 191365 192582 193887 194880 195873 197637
63737 197637 200437 203588 206183 208069 209821 211807 213661 214838 215489 216432 218212 220547 222871 225210 228148
63722 228148 231937 236070 239883 243288 246575 249710 252241 253920 255060 256101 256981 257154 256231 254510 252840
63707 252840 251913 251652 251304 250222 248511 246889 246016 246056 246796 247932 249205 250454 251706 253121 254752 256399
63691 256399 257770 258809 259823 261302 263582 266597 269876 272779 274826 275922 276321 276366 276178 275613 274528
63676 274528 273014 271316 269673 268447 268204 269206 270792 271790 271764 271451 271646 272119 272079 271305 270171 268793 266941
63659 266941 264756 262776 261013 258762 255649 252284 249448 247124 244871 242686 240890 239415 237892 236385
63645B36385r51j86O1l37q02p78k11N66J181J496J689J995K398K720K950L218
63629B51394L466L620M004N003O207O642O157N907O896Q618R856J0353J0883J1904
63615C50910J3112J4300J5775J7644J9410K0630K1505K2440K3412K4119K4390
63604E67647K4112K2989K0823J7819J4255J0056N202M36k991m576n156n916p076
63591F57624p980q330q757r989j1947j4062j6125j8262k0197k1222k1075k0231
63579D79447j9091j7400j4951j2320j0297q828p181n078k992j312J31J535K718
63566C84381L560M373N411O411O982P241P578P985Q058P726P559Q199R695J1607
63552D86766J3628J5902J8589K1297K3250K4208K4995K6663K9073L0628K9601
$$ plain form
63645 236385 235434 235248 235309 234972 234170 233392 233181 233747 234928 236424 238113 240108 242506 245226 248176 251394
63629 251394 254860 258480 262484 267487 273694 280336 286493 292400 299296 307914 317770 328123 339006 350910
63615 350910 364022 378322 394097 411741 431151 451781 473286 495726 519138 543257 567647
63604 567647 591759 614748 635571 653390 667645 677701 682903 683339 680348 675772 670616 664700 657624
63591 657624 649644 641314 632557 622568 610621 596559 580434 562172 541975 520753 499678 479447
63579 479447 460356 442956 428005 415685 405388 396560 389379 384301 381309 379997 380128 381663 384381
63566 384381 387941 392314 397725 404136 411118 418359 425937 433922 441980 449706 457265 465464 475159 486766
63552 486766 500394 516296 534885 556182 579432 603640 628635 655298 684371 714999 744600
63541G44600K5533J9284J2080M914j411o194r116j0416j0620j0132r156p982p162
63528G34222p338q807j1335j4444j7748k0982k3873k6175k7714k8212k7348k5256
63516D94990k2839k0966j9520j7693j5294j3015j1303r764q106o892o612o663
63504C36323o110n037m247l811k978j526k31K59J34k09p13j156r42J0Q20P01K6
63487C11313k98m5L38N85P75Q40O87O13R70J499J609J286J001Q93O76L85M30P18
63469C24275N46l98j544k303k687k753k163q86K89O83O93J092J756J911J419R53
63453C20883R31J135J493K408M033N799O946P196O761O137N974O583P475P958
63439C91712Q228R123J0609J1475J1100J0673J1806J4452J7035J8214J7680J5651
$$ plain form
63541 744600 770133 789417 801497 806411 805000 798806 789690 779274 768654 758522 749366 741384 734222
63528 734222 726884 718077 706742 692298 674550 653568 629695 603520 575806 547594 520246 494990
63516 494990 472151 451185 431665 413972 398678 385663 374360 364596 356490 349598 342986 336323
63504 336323 330213 325176 320929 317118 314140 312614 312383 312642 312776 312567 311854 310698 309756 309766 310586 311287 311313
63487 311313 311015 310970 311308 311893 312668 313508 314195 314808 315778 317277 318886 320172 321173 322066 322742 323127 323557 324275
63469 324275 324821 324423 322879 320576 317889 315136 312973 312087 312376 313059 313752 314844 316600 318511 319930 320883
63453 320883 321814 322949 324442 326850 330883 336682 343628 350824 357585 363722 369696 376279 383754 391712
63439 391712 399940 409063 419672 431147 442247 452920 464726 479178 496213 514427 532107 547758
63427E47758J2698J0012Q754Q931R617J0409J1842J4271J7173J9922K2514K5059
63415G18960K7196K8497K8883K8203K5943K1841J6372J0189L676k497p018r058
63403H91187r369r403r629r578r393j0246j2910j6724k0411k3341k5658k7559
63391G06966k8864k9096k7856k5392k2789k1116k0213j8799j6056j2614r651p428
63379D67092n249k542N55L569O182Q321J0144J1928J3702J4995J5219J4347J2932
63366E71195J1498J0225R228Q846R292J0275J1274J2235J3676J5997J8846K1411
63354G23998K3271K4592K5432K5171K3002J8804J3267P274J557l160o287p890
63342H69031q706r384r979j0430j1043j2146j3573j5081j7046k0026k3604k6316
$$ plain form
63427 547758 560456 570468 579222 588153 597770 608179 620021 634292 651465 671387 693901 718960
63415 718960 746156 774653 803536 831739 857682 879523 895895 906084 909760 907263 900245 891187
63403 891187 881818 872415 862786 853208 843815 833569 820659 803935 783524 760183 734525 706966
63391 706966 678102 649006 621150 595758 572969 551853 531640 512841 496785 484171 474520 467092
63379 467092 461843 459301 459856 463425 469607 477928 488072 500000 513702 528697 543916 558263 571195
63366 571195 582693 592918 602146 610992 620284 630559 641833 654068 667744 683741 702587 723998
63354 723998 747269 771861 797293 822464 845466 864270 877537 884811 886368 883208 876921 869031
63342 869031 860325 850941 840962 830532 819489 807343 793770 778689 761643 741617 718013 691697
63330F91697k7050k6081k4433k2625k0511j8043j5557j3239j0838q114n357l154
63318D96695j783j179j369k620m968p843j0365j1953j2440j1817j0144p823n550
63305D06841l791k455j178J91J585K994M443N741O497O418N442L608J019k072
63291D35283n288q291j0734j2163j2317j1576j0755j0234r577q273o585n318m860
63278C19312m899m971m837m280l094j541l88j39m14m44MN47Q85J091J311J554
63262B99697J878K403L034L502L717L821L835L706L724M367N451O019N573M945
63248C55672N381O993Q801J0090J1068J2126J3216J4188J5222J6533J8013J9455
63236E06758K0857K2273K3602K4710K5596K6263K6673K6871K6992K7005K6759
$$ plain form
63330 691697 664647 638566 614133 591508 570997 552954 537397 524158 513320 505206 499849 496695
63318 496695 494912 493733 492364 489744 484776 476933 466568 454615 442175 430358 420214 412391 406841
63305 406841 403050 400595 399417 399608 401193 404187 408630 414371 420868 427286 432728 436336 437355 435283
63291 435283 429995 421704 410970 398807 386490 374914 364159 353925 344348 336075 329490 324172 319312
63278 319312 314413 309442 304605 300325 297231 295690 295302 295163 294749 294305 294309 294856 295741 296832 298143 299697
63262 299697 301575 303978 307012 310514 314231 318052 321887 325593 329317 333684 339135 345154 350727 355672
63248 355672 361053 368046 376847 386937 398005 410131 423347 437535 452757 469290 487303 506758
63236 506758 527615 549888 573490 598200 623796 650059 676732 703603 730595 757600 784359
63225G84359K6363K6246K6634K7245K7649K7722K7579K7350K7104K6677K5459
63214A080387K2755J8577J3635Q345K386m324j0765j5630j8771k1197k3739k6236
63202A025423k8005k8435k7178k4297k0499j6819j3838j1381r029o641m375k547
63190H32379j541j571k338l090l116k132l19J903M187O528R150J1968J4385J5906
63176H82299J6655J7081J7337J7363J7235J6905J5854J3636J0584P379M022n5
63164A036295m931j0045j5031j9890k4259k7429k9358l0748l1838l2031l1111
63153G79624k9793k8470k6438k3285k0130j8314j7427j5920j3306j0607q756p691
63141E59487o956o167m889l105j809k041l173l332j805J69J483K734M843P282
$$ plain form
63225 784359 810722 836968 863602 890847 918496 946218 973797 1001147 1028251 1054928 1080387
63214 1080387 1103142 1121719 1135354 1143699 1146085 1141761 1130996 1115366 1096595 1075398 1051659 1025423
63202 1025423 997418 968983 941805 917508 897009 880190 866352 854971 845942 839301 834926 832379
63190 832379 830838 829267 826929 823839 820723 818591 818272 820175 824362 830890 840040 852008 866393 882299
63176 882299 898954 916035 933372 950735 967970 984875 1000729 1014365 1024949 1032328 1036350 1036295
63164 1036295 1031364 1021319 1006288 986398 962139 934710 905352 874604 842766 810735 779624
63153 779624 749831 721361 694923 671638 651508 633194 615767 599847 586541 575934 567178 559487
63141 559487 552531 546364 541475 538370 536561 534520 531347 528015 526210 526379 527862 530596 535439 542721
63127E42721Q885R690J0704J2172J3317J3677J3533J2966J1538R169O431L612
63115F68415L39l438o764q615r067q924q573p823o688n623m930m417l797l069
63101E87026k351j703j263j271j736k221k273j941j668j645j513q70J65J083J598
63086E69417J920K315K695K832K875L266M111M952N343N469N891O828P980Q979
63072F34873R730J0277J0616J0746J0794J0947J1488J2803J5026J7683K0042K2019
63060G97044K4339K7495L1016L4154L6895L9709M2650M5460M8420N2106N6088
63049A235376N8872N9716N9782O0676O2382O3476O3215O2408O2198O2765O3529
63038A914395O4020O4148O3947O3391O2164N9436N4224M6258L6290K5193J3006
$$ plain form
63127 542721 551606 561296 572000 584172 597489 611166 624699 637665 649203 658372 664803 668415
63115 668415 668754 665316 658552 649937 640870 631946 623373 615550 608862 603239 598309 593892 590095 587026
63101 587026 584675 582972 581709 580438 578702 576481 574208 572267 570599 568954 567441 566571 566736 567819 569417
63086 569417 571337 573652 576347 579179 582054 585320 589431 594383 599726 605195 611086 617914 625894 634873
63072 634873 644603 654880 665496 676242 687036 697983 709471 722274 737300 754983 775025 797044
63060 797044 821383 848878 879894 914048 950943 990652 1033302 1078762 1127182 1179288 1235376
63049 1235376 1294248 1353964 1413746 1474422 1536804 1600280 1663495 1725903 1788101 1850866 1914395
63038 1914395 1978415 2042563 2106510 2169901 2232065 2291501 2345725 2391983 2428273 2453466 2466472
63027B466472p64j6048l1749m6389n8971o9212p7238q3158q6797q7784q5951q1640
63015A740771p5581o8497o0867n2945m4865l6718k8717k1232j4539q442k353M138
63003A330153J0738J6581K0974K4009K6320K8381L0138L1452L2509L3477L4025
62992A618757L3699L2807L2184L1832L0436K6902K1914J7110J2890P857O29q590
62980A858427j8519k8133l6975m4787n1479n7243o2040o5190o6062o4999o2987
62969A300013o0463n7091n2786m8262m4346m1219l8561l5975l3101k9767k6356
62958H32086k3646k1926k0669j9374j8260j7667j7249j6348j5012j3933j3501
62947F34501j3413j3190j2544j1377r948r004r121r788r754q438o488m861l890
$$ plain form
63027 2466472 2465708 2449660 2417911 2371522 2312551 2243339 2166101 2082943 1996146 1908362 1822411 1740771
63015 1740771 1665190 1596693 1535826 1482881 1438016 1401298 1372581 1351349 1336810 1328368 1326015 1330153
63003 1330153 1340891 1357472 1378446 1402455 1428775 1457156 1487294 1518746 1551255 1584732 1618757
62992 1618757 1652456 1685263 1717447 1749279 1779715 1806617 1828531 1845641 1858531 1866388 1867017 1858427
62980 1858427 1839908 1811775 1774800 1730013 1678534 1621291 1559251 1494061 1427999 1363000 1300013
62969 1300013 1239550 1182459 1129673 1081411 1037065 995846 957285 921310 888209 858442 832086
62958 832086 808440 786514 765845 746471 728211 710544 693295 676947 661935 648002 634501
62947 634501 621088 607898 595354 583977 574029 565025 555904 546116 536362 527924 521436 516575 512685
62934E12685l422l186k714j516J33J146Q50q2m92j53K31Q2n64j424k145k299j818
62917D95312j385j761k710l281l126k872l063l445l609l657l750l553k746j790
62903D54564j460j714j677q91r2l62j762l151l410k581j621j214j138q20j46N30
62887D33055R18R70O64Pp07r80n51L88J419K130K276J955J567J279P42k43r73
62870D43916n51P00J352O89l48n42j7J94l31j055j385j219p81m95q45j763k351
62853D35168j881r15n86r47r64k69J88l34j162j311r71r60j177p70K07N55l33
62836D23538j395j281j61O23M26m5K9M92P13N84M60M81N76R53J933L162L669L007
62818D37764J923J561K282L612M952N923O251N925N477N580O298P043P273O995
$$ plain form
62934 512685 509263 506077 503363 501847 501980 503126 503976 503894 503402 503249 503480 503562 502998 501574 499429 497130 495312
62917 495312 493927 492166 489456 486175 483049 480177 477114 473669 470060 466403 462653 459100 456354 454564
62903 454564 453104 451390 449713 448822 448730 448368 446606 443455 440045 437464 435843 434629 433491 432671 432525 433055
62887 433055 433973 434943 435607 435614 434907 433927 433376 433764 435183 437313 439589 441544 443111 444390 445132 444889 443916
62870 443916 443365 444065 445417 446106 445758 445216 445199 445393 445062 444007 442622 441403 440622 440127 439282 437519 435168
62853 435168 433287 432372 431786 430839 429875 429606 429794 429460 428298 426987 426016 425056 423879 423109 423316 423871 423538
62836 423538 422143 420862 420701 421324 421750 421705 421734 422226 422939 423523 423983 424464 425040 425993 427926 431088 434757 437764
62818 437764 439687 441248 443530 447142 452094 458017 464268 470193 475670 481250 487548 494591 501864 508859
62804E08859O665O846P919R735J1606J3039J4301J5869J7441J8306J8615J9485
62792F68686K1534K4143K6635K9407L3207L7891M2750M7761N3599O0451O7657
62781A113721P4574Q1168Q7563R3504R8483J01994J03629J03232J00982R6820
62771B055670Q9910P9312O5331M9505L2934J5366l569k2818m0459n5508o8373
62760B197301p9561q8672r4957r8320r9354r8673r6573r3217q8875q3945p8809
62749A196345p3654o8372o2752n6868n1202m6229m1945l7935l3920l0108k6929
62738F66431k4530k2604k0683j8490j5992j3318j0708q477o856n822n083m243
62726E09625l023j494j40M98M43M41J329L227N473P250Q164Q393Q623R721J2045
$$ plain form
62804 508859 515524 522370 530289 540024 551630 564669 578970 594839 612280 630586 649201 668686
62792 668686 690220 714363 740998 770405 803612 841503 884253 932014 985613 1046064 1113721
62781 1113721 1188295 1269463 1357026 1450530 1549013 1651007 1754636 1857868 1958850 2055670
62771 2055670 2145580 2224892 2290223 2339728 2372662 2388028 2384459 2361641 2321182 2265674 2197301
62760 2197301 2117740 2029068 1934111 1835791 1736437 1637764 1541191 1447974 1359099 1275154 1196345
62749 1196345 1122691 1054319 991567 934699 883497 837268 795323 757388 723468 693360 666431
62738 666431 641901 619297 598614 580124 564132 550814 540106 531629 524773 518951 513868 509625
62726 509625 506602 505108 504968 505466 505909 506350 507679 510906 516379 523629 531793 540186 548809 558530 570575
62711E70575J5019J7757K0141K2867K6369L0187L3786L7384M1526M6164N0787
62700I12562N5253N9788O4227O7979P0844P3250P5279P6000P4235O9772O3348
62689A662537N5622M6533L5717K3142R281n141j9410l2895m5011n5185o3011o8557
62677A543622p2325p4774p5866p5295p3095o9853o6220o2361n8031n3169m8204
62666H14429m3714l9843l6261l2661k9192k6215k3756k1439j8965j6515j4514
62655E11354j3106j1988j0793r568q728q538q618q207p007n630n003n255n517
62642D03396m887l403j879r64n96l74p8K90P27J219J562J486J026N32K08j60p54
62625C97351j224j067m32o5k92n21kJ221K498L394L952M363M900N978P693R379
$$ plain form
62711 570575 585594 603351 623492 646359 672728 702915 736701 774085 815611 861775 912562
62700 912562 967815 1027603 1091830 1159809 1230653 1303903 1379182 1455182 1529417 1599189 1662537
62689 1662537 1718159 1764692 1800409 1823551 1832832 1827691 1808281 1775386 1730375 1675190 1612179 1543622
62677 1543622 1471297 1396523 1320657 1245362 1172267 1102414 1036194 973833 915802 862633 814429
62666 814429 770715 730872 694611 661950 632758 606543 582787 561348 542383 525868 511354
62655 511354 498248 486260 475467 465899 457171 448633 440015 431808 424801 419171 414168 408913 403396
62642 403396 398509 395106 393227 392263 391667 391293 391215 391505 392232 393451 395013 396499 397525 398057 398265 398105 397351
62625 397351 396127 395060 394628 394563 394271 393750 393748 394969 397467 400861 404813 409176 414076 420054 427747 437126
62609D37126J0219J0338J0708J1852J3298J4553J5905J7840K0212K2672K5475
62598F10198K9156L3502L7576M0835M3649M6578M9456N1457N1721M9811M5847
62587A089786M0441L4346K7905K0830J2629L256o678j6332k5075l2485l8102m1617
62575A068904m3437m4617m5750m6209m5039m2457l9707l7453l5147l2306k9444
62564F27338k7116k4896k2115j9071j6537j4479j2312j0194q870q274p428n941
62552D50105m561l851l252k119q16j38j52l02k54l4L49Q70J240J173P71L64J85
62535D39578L65R32J484J388O79L39J227L082N007O598Q036R512J1203J3496J6485
62520E19411J9457K1663K3494K6104K9812L3643L6584L8664M0446M2082M3190
$$ plain form
62609 437126 447345 457683 468391 480243 493541 508094 523999 541839 562051 584723 610198
62598 610198 639354 672856 710432 751267 794916 841494 890950 942407 994128 1043939 1089786
62587 1089786 1130227 1164573 1192478 1213308 1225937 1229193 1222515 1206183 1181108 1148623 1110521 1068904
62575 1068904 1025467 980850 935100 888891 843852 801395 761688 724235 689088 656782 627338
62564 627338 600222 575326 553211 534140 517603 503124 490812 480618 471748 463474 456046 450105
62552 450105 445544 441693 438441 436322 435506 435368 435216 434914 434660 434626 434975 435845 437085 438258 439029 439393 439578
62535 439578 439943 440875 442359 443747 444426 444765 445992 449074 454081 460679 468715 478227 489430 502926 519411
62520 519411 538868 560531 584025 610129 639941 673584 710168 748832 789278 831360 874550
62509H74550M3291M2049L9394L5632L1197K6136K0042J2660M416l674j0491j5445
62497A099757j8977k2216k5653k8207k8371k6166k3223k0736j8134j4224q907
62486H64943l099K474P754J2848J7727K2309K6429K9810L2402L4492L6150L6726
62474A120965L5320L1591K5790J8398J0221K435m246j0413j7211k4748l1806l7237
62462A119059m0983m3528m5045m5561m5316m4490m2810l9957l6196l2131k8022
62451F75020k3747j9419j5538j2393r658o833l967j633j59R10K354M295N984O751
62437F01967O867P042P326P030N881M528L565K573P54j795m083n463o250p009
62423F22933p704p857p243o171n242m996n594o682p666q254q679r292j0103j0734
$$ plain form
62509 874550 917841 959890 999284 1034916 1066113 1092249 1112291 1124951 1129367 1125693 1115202 1099757
62497 1099757 1080780 1058564 1032911 1004704 976333 950167 926944 906208 888074 873850 864943
62486 864943 861844 864318 872072 884920 902647 924956 951385 981195 1013597 1048089 1084239 1120965
62474 1120965 1156285 1187876 1213666 1232064 1242285 1244720 1240474 1230061 1212850 1188102 1156296 1119059
62462 1119059 1078076 1034548 989503 943942 898626 854136 811326 771369 735173 703042 675020
62451 675020 651273 631854 616316 603923 594265 587432 583465 581832 581673 582583 584937 589232 595216 601967
62437 601967 608834 615876 623202 630232 636113 640641 644206 646779 647533 645738 641655 636192 629942 622933
62423 622933 615229 607372 600129 593958 588716 583720 578126 571444 563778 555524 546845 537553 527450 516716
62409E16716j0732r882q414o945o061n771n551n002m271l709l297k652j548k40
62395D42641P57J105R54Q79J371K313L039L071K674K544L044L921M674N083N410
62380D83480O092P160P997P999P499P527Q454R424R559R237R408J0113J0619J0912
62366F05480J1958J4208J6848J9041K1112K3804K7027L0159L3175L6570M0284
62355H79666M3586M6022M7741M8709M8260M5760M1236L5072K7565J9105J0518
62344A293240K684m106j0138j5738k0928k5548k9429l2366l4166l4760l4217l2602
62332A021926l0000k6766k3612k1103j9114j6997j4544j2491j1721j2126j2740
62321H20712j3009j3434j4673j6558j8375j9756k0816k1508k1503k0641j9177
$$ plain form
62409 516716 505984 496102 487688 480743 474682 468911 463360 458358 454087 450378 447081 444429 442881 442641
62395 442641 443398 444503 445457 446336 447707 450020 453059 456130 458804 461348 464392 468313 472987 478070 483480
62380 483480 489572 496732 504729 512728 520227 527754 536208 545632 555191 564428 573836 583949 594568 605480
62366 605480 617438 631646 648494 667535 688647 712451 739478 769637 802812 839382 879666
62355 879666 923252 969274 1017015 1065724 1113984 1159744 1200980 1236052 1263617 1282722 1293240
62344 1293240 1295924 1291818 1281680 1265942 1245014 1219466 1190037 1157671 1123505 1088745 1054528 1021926
62332 1021926 991926 965160 941548 920445 901331 884334 869790 857299 845578 833452 820712
62321 820712 807703 794269 779596 763038 744663 724907 704091 682583 661080 640439 621262
62310F21262j7465j5706j3995j2284j0368q219o294n123m558l866k632j115L61
62297E19998J877L486M804N420N522N649N951O084N849N599N877O762P673P865
62283E98416P157O130N481N279N093M730M534M856N585O468P519Q819J0143J1125
62269F91335J1687J1998J2101J1889J1467J1262J1685J2817J4476J6476J8854
62258H36047K1866K5660K9942L4092L7744M0977M3700M5146M4437M1546L7259
62247A238416L2173K6185J9161J1636M422k254q840j5718k2722k9401l5370m0333
62235A177355m4015m6392m7750m8243m7469m4888m0750l6261l2533k9576k6600
62224G32878k3144j9563j6459j4039j2192j0798r698q537o988n184l688k914k632
$$ plain form
62310 621262 603797 588091 574096 561812 551444 543225 536931 531808 527250 523384 520752 519637 519998
62297 519998 521875 525361 530165 535585 541107 546756 552707 558791 564640 570239 576116 582878 590551 598416
62283 598416 605573 611703 617184 622463 627556 632286 636820 641676 647261 653729 661248 670067 680210 691335
62269 691335 703022 715020 727121 739010 750477 761739 773424 786241 800717 817193 836047
62258 836047 857913 883573 913515 947607 985351 1026328 1070028 1115174 1159611 1201157 1238416
62247 1238416 1270589 1296774 1315935 1327571 1331993 1329739 1320899 1305181 1282459 1253058 1217688 1177355
62235 1177355 1133340 1086948 1039198 990955 943486 898598 857848 821587 789054 759478 732878
62224 732878 709734 690171 673712 659673 647481 636683 626985 618448 611460 606276 602588 599674 597042
62211E97042k177j209j10N09O78J175K602M589O246P227P979R005J0244J1334
62197F55134J2056J2352J2140J1408J0304R007P642O406N515M901M201L212K177
62184G56455J469J242J492K203L146L822L947L812L930M413N024N667O553P936
62170H11111R917J2458J5337J8241K1032K3885K6900K9774L2010L3282L3344L1829
62158A099120K8553K3909J8601J3043P351J804l165p455j1430j5416j9314k2753
62146A112848k5430k7315k8648k9687l0253k9694k7525k4056k0127j6435j3321
62135H40357j0956r194p502n591l969l314l470l705l947m748n966o414n369l630
62121G62582k450k020j729j405j507k261l350m432n353n854n668m997m476m566
$$ plain form
62211 597042 594865 593656 593546 594055 594733 595908 598510 603099 609345 616572 624551 633556 643800 655134
62197 655134 667190 679542 691682 703090 713394 722401 730043 736449 741964 746865 751066 754278 756455
62184 756455 757924 759166 760658 762861 766007 769829 773776 777588 781518 785931 790955 796622 803175 811111
62170 811111 821028 833486 848823 867064 888096 911981 938881 968655 1000665 1033947 1067291 1099120
62158 1099120 1127673 1151582 1170183 1183226 1190577 1192381 1189216 1181761 1170331 1154915 1135601 1112848
62146 1112848 1087418 1060103 1031455 1001768 971515 941821 914296 890240 870113 853678 840357
62135 840357 829401 820207 812705 807114 803145 799831 796361 792656 788709 783961 777995 771581 766212 762582
62121 762582 760132 758112 756383 754978 753471 751210 747860 743428 738075 732221 726553 721556 717080 712514
62107G12514n235o247p392q465r280r787r915r391q035o163m370k864j389J66
62093F24147J463K136K224K054J899J869J882J745J454J480K404M110N681O350
62079F60898O338O528P497R024J0429J1154J1163J1003J1440J2735J4361J5605
62067G88175J6381J7269J8756K0672K2415K3508K3870K3703K3205K2226K0136
62056A020316J6208J0418L815k125o565r724j2347j4996j7867k1000k4353k7679
62044I14101l0524l2466l3352l3276l2402l0848k8697k6157k3664k1655k0190
62033F00870j8843j7117j4983j2920j1441j0711j0538j0565j0405r775q683p455
62021D57434o470n833n301m565l637k982l040l639l987l491k485j881k193l067
$$ plain form
62107 712514 707279 701032 693640 685175 675895 666108 656193 646802 638767 632604 628234 625370 623981 624147
62093 624147 625610 627746 629970 632024 633923 635792 637674 639419 640873 642353 644757 648867 654548 660898
62079 660898 667236 673764 681261 690285 700714 711868 723031 734034 745474 758209 772570 788175
62067 788175 804556 821825 840581 861253 883668 907176 931046 954749 977954 1000180 1020316
62056 1020316 1036524 1046942 1050757 1048632 1042067 1032343 1019996 1005000 987133 966133 941780 914101
62044 914101 883577 851111 817759 784483 752081 721233 692536 666379 642715 621060 600870
62033 600870 582027 564910 549927 537007 525566 514855 504317 493752 483347 473572 464889 457434
62021 457434 450964 445131 439830 435265 431628 428646 425606 421967 417980 414489 412004 410123 407930 404863
62007D04863l747l666k683j105L61J058J044J044J585K368K754K599K303K211
61993D10989K303K368K191J566M40q79j929k551l004l619m477n408o168o560o527
61978C78735o157n576m887m228l794l612l393k809j891j042o45p77j199j507j319
61963C35899n63M38J242J653J690J412R15M51L40O82J282J794J974J908K072K858
61947C56047L896M229L501K634K808M014N216N784O021O329O564O577O643O942
61933D27205P115O823O327O004N652M830L710K950K755K550J784O22l59r82j674
61918D75312k788l914m169l260j954j087l65J219L735N952O919P209P926R093
61904D99828R805R670R217Q976Q907Q799Q539P951O981O149O173P008P834Q246
$$ plain form
62007 404863 401116 397450 394767 393662 394023 395081 396125 397169 398754 401122 403876 406475 408778 410989
61993 410989 413292 415660 417851 419417 419857 418978 417049 414498 411494 407875 403398 397990 391822 385262 378735
61978 378735 372578 367002 362115 357887 354093 350481 347088 344279 342388 341346 340701 339924 338725 337218 335899
61963 335899 335336 335774 337016 338669 340359 341771 342686 343137 343477 344159 345441 347235 349209 351117 353189 356047
61947 356047 359943 364172 367673 370307 373115 377129 382345 388129 394150 400479 407043 413620 420263 427205
61933 427205 434320 441143 447470 453474 459126 463956 467666 470616 473371 475921 477705 478327 477968 476986 475312
61918 475312 472524 468610 464441 461181 459227 458140 457775 458994 462729 468681 475600 482809 490735 499828
61904 499828 509633 519303 528520 537496 546403 555202 563741 571692 578673 584822 590995 598003 605837 614083
61890F14083Q766R917J1342J2286J2550J2469J2269J1778J0562Q075L993j233
61878G26857o443j0671j3837j6282j8081j9105j9437j9150j8007j5883j3389j1474
61866E45098j0420r672q668p405o134m949l770k497j110K74J471K521L779N402
61852E03920P000Q148Q992R878J0565J0508R841R355R352R178Q216O651M875K799
61838F19278K85k098l496l777l597l530l536l245k423j163J55J118J767K664M241
61823F02643O185P747Q462Q310P396N905M311L132K454K045J946K449L455M340
61809F70780M764N176O175P511Q099P025M314P70k826o307r989j3936j7455j9498
61795F44603j9573j8146j6113j4064j2107j0173q273o560n231m323l575k609j351
$$ plain form
61890 614083 622849 632766 644108 656394 668944 681413 693682 705460 716022 724097 728090 726857
61878 726857 720414 709743 695906 679624 661543 642438 623001 603851 585844 569961 556572 545098
61866 545098 534678 525006 516338 508933 502799 497850 494080 491583 490473 490747 492218 494739 498518 503920
61852 503920 510920 519068 528060 537938 548503 559011 568852 578207 587559 596737 604953 611604 616479 619278
61838 619278 619563 617465 613969 610192 606595 603065 599529 596284 593861 592698 592853 593971 595738 598402 602643
61823 602643 608828 616575 625037 633347 640743 646648 650959 654091 656545 658590 660536 662985 666440 670780
61809 670780 675544 680720 686895 694406 702505 709530 713844 714614 711788 705481 695492 681556 664101 644603
61795 644603 625030 606884 590771 576707 564600 554427 546154 539594 534363 530040 526465 523856 522505
61782E22505j70N21O92O63P85J243K077L192M364N395O301P269Q388R534J0539
61767E83298J1448J2455J3647J4929J6316J8147K0739K3811K6548K8417K9531
61756G99286L0079K9758K8290K6068K3636K0544J5597Q528O94o384j2528j8385
61744I45183k3851k7949l0153l0991l1121l0524k9024k7021k5166k3587k1888
61733F43908j9859j7695j5529j3216j0757q639p370o814o267n259m083l401l464
61720E21555l874m084l892l484l049k535j779q12oJ72l61j179j794k133k435k770
61704D87540k961k980l050l280l479l534l626l834l860l530l300l716m496m759
61690D37135m232l617l578l854l830l472l219l110k714j901j148q87r53r35p81
$$ plain form
61782 522505 522335 522856 523548 524211 524996 526239 528316 531508 535872 541267 547568 554837 563225 572759 583298
61767 583298 594746 607201 620848 635777 652093 670240 690979 714790 741338 769755 799286
61756 799286 829365 859123 887413 913481 937117 957661 973258 981786 982480 976096 963568 945183
61744 945183 921332 893383 863230 832239 801118 770594 741570 714549 689383 665796 643908
61733 643908 624049 606354 590825 577609 566852 558213 550843 544029 537762 532503 528420 525019 521555
61720 521555 517681 513597 509705 506221 503172 500637 498858 498046 498040 498212 497851 496672 494878 492745 490310 487540
61704 487540 484579 481599 478549 475269 471790 468256 464630 460796 456936 453406 450106 446390 441894 437135
61690 437135 432903 429286 425708 421854 418024 414552 411333 408223 405509 403608 402460 401573 400620 399685 398904
61675C98904p42r46j322j795k222k212j450k33O72R14R90J560K567L407L808M137
61659D06037M870O119P707R320J0431J0506R601Q422P455O298M228J328j487l544
61645D87291m996o176o854o524n169l340j550N7J501K786M035N472P151Q745R777
61630D92206R971R266P707N422K616o21m343q374j1961j4169j4736j4272j3493
61617D45219j2533j1238r811q695p882o867n432m150l770m274m811m558l500k354
61603C55344j820j963k304k454k514k770l152l328l176k865k446j829j182r05
61589C22636r75q07j32M87N30M19Q30J389J039l53j647j940j594j260q16P9R99
61572C18884J317J371K086L415M128L473K263J872K685L944M766M806M251L658
$$ plain form
61675 398904 398162 397216 395894 394099 391877 389665 388215 387982 388654 389568 390558 392118 394685 398092 401900 406037
61659 406037 410907 417026 424733 434053 444484 454990 464591 473013 480468 486766 490994 492322 490835 487291
61645 487291 482295 476119 469265 462741 457572 454232 452682 452739 454240 457026 461061 466533 473684 482429 492206
61630 492206 502177 511443 519150 524572 527188 526567 522224 513850 501889 487720 472984 458712 445219
61617 445219 432686 421448 411637 402942 395060 388193 382761 378611 374841 370567 365756 361198 357698 355344
61603 355344 353524 351561 349257 346803 344289 341519 338367 335039 331863 328998 326552 324723 323541 322636
61589 322636 321661 320854 320722 321209 321739 322158 322988 324377 325416 325063 323416 321476 319882 318622 317806 317885 318884
61572 318884 320201 321572 323658 327073 331201 334674 336937 338809 341494 345438 350204 355010 359261 362919
61558C62919L644M312N020N027M275L247K269J425R07R06J108Q91K01l16k24J10
61542C95721J41j43n05r69j516j558n36R75J462O5k396m236m467l417k089j226
61526C75306r86j200j660k072j944r89L13R40M72l33m84J19Q89J530K100K389
61510C74390K170K047L036N048O664O904O448O596P640Q949J0030J0817J1299
61497D62038J1642J2338J3511J4335J3906J2546J1484J1262J1140J0098P854M896
61485E97050K091K72l37l41l46l6J301L467N353O295O606O592N906M312K301N13
61469F40999r94k369l399l830l904m111m721n818p390r040j0073j0318j0390j0717
61455E53925j0729r684p825n999m436k705q02O49J434K169L376M676N350N257
$$ plain form
61558 362919 366563 370875 375895 380922 385197 388444 390713 392138 393045 393951 395059 395950 396151 395835 395611 395721
61542 395721 395862 395719 395214 394245 392729 391171 390635 391610 393072 393137 390741 386505 382038 378621 376532 375306
61526 375306 374320 373120 371460 369388 367444 366455 366768 367708 368180 367847 367363 367482 368371 369901 372001 374390
61510 374390 376560 378607 381643 386691 393355 400259 406707 413303 420943 429892 439922 450739 462038
61497 462038 473680 486018 499529 513864 527770 540316 551800 563062 574202 584300 592154 597050
61485 597050 599141 599413 599076 598735 598389 598353 599654 603121 608474 614769 621375 627967 633873 638185 640486 640999
61469 640999 640005 637636 634237 630407 626503 622392 617671 611853 604463 595423 585350 575032 564642 553925
61455 553925 543196 533512 525687 519688 515252 512547 511745 512394 513828 515997 519373 524049 529399 534656
61441E34656M843M419L871K954J576j59k051l781m927n128m376l245k566k617
61427E23469k733j993l27J442K661L559M668N822O219N406L866K426J356K84j113
61412E55012k645l865m552m753m618m333m103l935l533k761k027j900k286k457
61398E07244k004j335j055j252j670k142k475k169q91Q61K031K087J560J408K118
61383E02316L479N041O509P729Q527Q731Q455Q202Q403Q930R370R704J0247J0778
61369F16421J0242P880M324J034j265l022m795o390p337p729q144q798r260r042
61355E74119q279p537p100o673n910m892l891k896j854j243j773l320m709m912
61341E09130m114l219k700k364k013j734j592j424r58J2J416K633K831J953J044
$$ plain form
61441 534656 539499 543918 547789 550743 552319 552160 550109 546328 541401 536273 531897 528652 526086 523469
61427 523469 520736 518743 518416 519858 522519 526078 530746 536568 542787 548193 552059 554485 555841 556125 555012
61412 555012 552367 548502 543950 539197 534579 530246 526143 522208 518675 515914 513887 511987 509701 507244
61398 507244 505240 503905 502850 501598 499928 497786 495311 493142 492251 493112 495143 497230 498790 500198 502316
61383 502316 505795 510836 517345 525074 533601 542332 550787 558989 567392 576322 585692 595396 605643 616421
61369 616421 626663 634543 638867 639901 638636 635614 630819 624429 617092 609363 601219 592421 583161 574119
61355 574119 565840 558303 551203 544530 538620 533728 529837 526941 525087 523844 522071 518751 514042 509130
61341 509130 505016 501797 499097 496733 494720 492986 491394 489970 489012 489024 490440 493073 495904 497857 498901
61326D98901J104J919K505K513K411K545K790L192M069N330O414P167Q052R167
61312E58079R850R791R856J1013J2879J4162J4376J4326J4811J5525J5507J4296
61300G14471J2292J0144Q026N546K392j003l638m962n604o796r043j1571j3179
61287F97075j3408j2813j2195j1807j1312j0375r103p914p027o271n295l893k167
61274E83495n07O33J049R20N76J67k96o54n44K24J357K210K331J919J693K168
61258E96741L064L610L494L155L071L123L018K957L389M300N304O322P593R001
61244F58142R961J0052R307P746N241K092q27k893m368n792p091p643p102n687
61230F61138l773j513J095L909O461Q139Q712Q687Q846R368R664R142P804N998
$$ plain form
61326 498901 500005 501924 504429 506942 509353 511898 514688 517880 521949 527279 533693 540860 548912 558079
61312 558079 567929 577720 587576 598589 611468 625630 640006 654332 669143 684668 700175 714471
61300 714471 726763 736907 744933 750479 752871 751868 748230 743268 737664 730868 721825 710254 697075
61287 697075 683667 670854 658659 646852 635540 625165 616062 608148 601121 594850 589555 585662 583495
61274 583495 582988 583621 584670 585590 586166 586333 586037 585383 584839 585063 586420 588630 590961 592880 594573 596741
61258 596741 599805 603415 606909 610064 613135 616258 619276 622233 625622 629922 635226 641548 649141 658142
61244 658142 668103 678155 687462 695208 700449 702541 701714 698821 694453 688661 681570 673927 666825 661138
61230 661138 657365 655852 656947 660856 667317 675456 684168 692855 701701 711069 720733 729875 737679 743677
61216G43677L978J998N02j48j21J2k32r02j575j611p62L73Q11K90l69j45J215
61199G46991L222N293P037Q228Q842R064R023Q645P812O457M504K023m82k409
61185H24250l779n135o580p552p805p943q535r273r611r696j0051j0681j1143
61172G16466j1127j0516r322q095p806q582r204q711p936q250r295r438q265p093
61158E92826o793o646n839m656l472j877K52J879K174J911K321L179L218K050
61144E80527L39j597l982o290p199o355n066m571m435l476j615J26J203K077L157
61129E42843M087M504M815N722P241Q760R893J0793J1639J2366J3074J4167J5723
61116F65627J7095J7598J7396J7302J7743J8388J8738J8704J8494J8281J8112
$$ plain form
61216 743677 747655 749653 750155 750007 749886 749898 749666 748764 747189 745578 744816 745189 746000 746290 745921 745776 746991
61199 746991 750213 755506 762543 770771 779613 788677 797700 806345 814157 820614 825118 827141 826659 824250
61185 824250 820471 815336 808756 801204 793399 785456 776921 767648 758037 748341 738290 727609 716466
61172 716466 705339 694823 685501 677406 669600 661018 651814 643103 635167 626917 617622 608184 599919 592826
61158 592826 586033 579387 573548 568892 565420 563543 563795 565674 567848 569759 572080 575259 578477 580527
61144 580527 580866 579269 575287 568997 561798 555443 550377 545806 541371 537895 536280 536406 537609 539686 542843
61129 542843 546930 551434 556249 561971 569212 577972 587865 598658 610297 622663 635737 649904 665627
61116 665627 682722 700320 717716 735018 752761 771149 789887 808591 827085 845366 863478
61105H63478J7936J7531J6599J4895J2300Q881N180K106J26j298l004m921o242
61092I43567o769p303q373r378r523r085q919r048q580p036n044l465k362j253
61078H47429n3P66R23Q44J159J892K521K810L172M001M948N236M612L609K940
61063H86809K904L275L513L159K377J916K178K599K426J899J847K327K576K430
61049I22235K681L742M911N500N838O453P149P586Q170R422J1017J2298J3317
61036A020319J4532J5886J7069J8379K0356K2825K5137K7136K8965L0288L0711
61025A271603L0885L2038L4560L8046M2624M8907N6602O4495P2257Q1107R2452
61014A865576J07213J27046J55020J94250K46513L12058L89149M73364N59449
$$ plain form
61105 863478 881414 898945 915544 930439 942739 951620 956800 958906 959032 957734 954730 949809 943567
61092 943567 936798 929495 921122 911744 902221 893136 884217 875169 866589 859553 854509 851044 848682 847429
61078 847429 847376 848142 849065 849909 851068 852960 855481 858291 861463 865464 870412 875648 880260 883869 886809
61063 886809 889713 892988 896501 899660 902037 903953 906131 908730 911156 913055 914902 917229 919805 922235
61049 922235 924916 928658 933569 939069 944907 951360 958509 966095 974265 983687 994704 1007002 1020319
61036 1020319 1034851 1050737 1067806 1086185 1106541 1129366 1154503 1181639 1210604 1240892 1271603
61025 1271603 1302488 1334526 1369086 1407132 1449756 1498663 1555265 1619760 1692017 1773124 1865576
61014 1865576 1972789 2099835 2254855 2449105 2695618 3007676 3396825 3870189 4429638
61005D429638O45275P32940Q26337R30910J055067J201041J342094J411068J330455
60996A3904825J072578O93924L04134j801j82496k36673j78574m4739Q5696J08513
60986A5525387m3356l49522p16307j040250j260196j363165j362561j281614j148921
60977F959495r94081q39827o98456n75118m71566l86749l17471k60878k15598
60968B199751j80260j52565j30523j13168r9415q7644p7102o8391o1644n5505
60958A173534m8849m2355l7133l2840k8502k4439k1847k0843k0338j9696j9178
60947H57514j8778j7834j6139j4408j3300j2689j2217j1855j1611j1341j1137
60936G06205j1325j1761j1789j1206j0715j0942j1455j1377j0517r365q214o920
$$ plain form
61005 4429638 5074913 5807853 6634190 7565100 8620167 9821208 11163302 12574370 13904825
60996 13904825 14977403 15671327 15975461 15973660 15791164 15554491 15375917 15331178 15416874 15525387
60986 15525387 15482031 15132509 14416202 13375952 12115756 10752591 9390030 8108416 6959495
60977 6959495 5965414 5125587 4427131 3852013 3380447 2993698 2676227 2415349 2199751
60968 2199751 2019491 1866926 1736403 1623235 1523820 1436176 1359074 1290683 1229039 1173534
60958 1173534 1124685 1082330 1045197 1012357 983855 959416 937569 916726 896388 876692 857514
60947 857514 838736 820902 804763 790355 777055 764366 752149 740294 728683 717342 706205
60936 706205 694880 683119 671330 660124 649409 638467 627012 615635 605118 595753 587539 580619
60924E80619n478m307l776l812m044m161m103l998l983l912l437k457j425r09
60910E30817r27j036r53p60m66J12Q53J170Q17M81R17J673J453n8j547j740j089
60893E29717j014j909k879l319l685m422n133n341n380n765o263o377o269o384
60879D65577o403n631m348l688l938l926k689r31j38o14j224q88K59J291J592
60864D34301J406J483K290L502M305M190L303K044O64n56j171j015n17k13p2K78
60848D54222Q31J136R90P52Q39J186J408J260P77N4q54j877k830l507l820l921
60832D46646m046m310m644m890m837m281l348k705l049m194n002m610l395k442
60818C90893k330k733l027k765j841p38m61j551l163l796l071k115j901k022j591
$$ plain form
60924 580619 575141 570834 567058 563246 559202 555041 550938 546940 542957 539045 535608 533151 531726 530817
60910 530817 529890 528854 527901 527141 526675 526787 527640 528810 529627 530108 531025 532698 534151 534093 532546 530806 529717
60893 529717 528703 526794 523915 520596 516911 512489 507356 502015 496635 490870 484607 478230 471961 465577
60879 465577 459174 453543 449195 445507 441569 437643 434954 434023 433885 433271 432047 431159 431418 432709 434301
60864 434301 435707 437190 439480 442982 447287 451477 454780 456824 457488 456932 455761 454746 454229 454016 453944 454222
60848 454222 455053 456189 457179 457931 458770 459956 461364 462624 463401 463455 462601 460724 457894 454387 450567 446646
60832 446646 442600 438290 433646 428756 423919 419638 416290 413585 410536 406342 401340 396730 393335 390893
60818 390893 388563 385830 382803 380038 378197 377459 376998 375447 372284 368488 365417 363302 361401 359379 357788
60803C57788p12k45m63p55o56l97l49m11k20L39J052J556J520Q92N4n05o68o15
60785C57205l84J09N90M93k33q82q69m54k07j15K07O95Q35M78O8k5J42M00O81
60766C58734P36K21o63j081n22N47J321J605J635J374O40k17n27j97Q3k12q00
60749C62677j068q00k44L18Q13J373K218L282L935L376J517q12k657l702m099
60734C66127l945l275k336j530j071r06q81q35o52l57p5K00N86R75J038O60J88
60717C53911k3L2K32N98J007J081P19M36O17P97K82o52r35j46R65J501J383J029
60699C62834N93J3n95j021j249j360j309j103r82j159j464j533j274r28o94n14
60683C48255k56J07N11Q77J166J386J573J700J716J669J817K429L392M078L750
$$ plain form
60803 357788 357076 356831 356368 355613 354957 354560 354211 353800 353580 353919 354971 356527 358047 358939 358993 358488 357820 357205
60785 357205 356821 356930 357520 358013 357780 356898 356029 355575 355368 355253 355460 356155 356990 357468 357536 357511 357653 358053 358734
60766 358734 359470 359691 359028 357947 357425 357972 359293 360898 362533 363907 364547 364330 363803 363606 363689 363477 362677
60749 362677 361609 360809 360565 360883 361696 363069 365287 368569 372504 375880 377397 376585 373928 370226 366127
60734 366127 362182 358907 356571 355041 353970 353064 352183 351348 350696 350339 350264 350464 351050 352025 353063 353723 353911
60717 353911 353888 353920 354152 354750 355757 356838 357557 357993 358610 359407 359689 359037 358102 357956 358921 360422 361805 362834
60699 362834 363427 363440 362845 361824 360575 359215 357906 356803 355821 354662 353198 351665 350391 349463 348769 348255
60683 348255 347999 348106 348617 349494 350660 352046 353619 355319 357035 358704 360521 362950 366342 370420 374170
60668C74170K302N22o33j041j430k325l252l371k610j720j250r91m93K15P16P97
60652C59606P27R63J715K711L451L681L592L399K982K177J235N64J03o00j676
60637C84630k698l291l571l799l922l694l017k028j033l87j83o7L30Q03Q38M24
60621C59335J12J82K64N0k13j76J71P84J725K695K990K409J704J580J781J749
60605C77142J654J937K216J692M71l80k18N44J261J754J967J709J063N97P16J204
60589C95329J610J698J369N57n30j407j777j709j302n16M88J311J773K046K207
60574D01147K156K184K995M767O622P584P691P683P939Q195Q156P728O784N187
60560D86818L117J038o76j829k354k464k624k967k922j941l73J011K275M262P164
$$ plain form
60668 374170 376472 376994 376361 375320 373890 371565 368313 364942 362332 360612 359362 358371 357878 358093 358809 359606
60652 359606 360333 361296 363011 365722 369173 372854 376446 379845 382827 385004 386239 386803 386906 386306 384630
60637 384630 381932 378641 375070 371271 367349 363655 360638 358610 357577 357190 357007 356940 357270 358073 358911 359335
60621 359335 359447 359629 359893 359943 359730 359554 359725 360509 362234 364929 367919 370328 372032 373612 375393 377142
60605 377142 378796 380733 382949 384641 385112 384732 384514 385058 386319 388073 390040 391749 392812 393409 394125 395329
60589 395329 396939 398637 400006 400563 400033 398626 396849 395140 393838 393322 393810 395121 396894 398940 401147
60574 401147 403303 405487 408482 413249 419871 427455 435146 442829 450768 458963 467119 474847 481631 486818
60560 486818 489935 490973 490297 488468 486114 483650 481026 478059 475137 473196 472823 473834 476109 480371 487535
60545D87535R941J1550J2186J2799J3899J5326J6843J8305J9471K0180K0647K1077
60533F79759K1086J9953J7419J3758R116L491k519p626j1007j3155j5076j6944
60521F98255j8013j7712j6258j4181j1782r220o761m601k632o94J051K250K934
60508F02636L709N179P347R754J2253J5268J9107K3269K6868K9602L1898L4021
60496H20911L5620L6357L6438L6033L4621L1596K7415K3443K0647J8886J7541
60485A139508J6236J4723J2525R008L594m035j3566k3746l3026m0709m6985n1777
60473I81750n4247n3892n1434m8012m4008l9347l4464l0035k5997k1823j7744
60462E60747j4754j3198j2202j0881r418q457q044p710p186o466n498m332l432
$$ plain form
60545 487535 497476 509026 521212 534011 547910 563236 580079 598384 617855 638035 658682 679759
60533 679759 700845 720798 738217 751975 761091 764582 762063 754437 743430 730275 715199 698255
60521 698255 680242 662530 646272 632091 620309 611089 604328 599727 597095 596401 597452 599702 602636
60508 602636 606345 611524 618871 628625 640878 656146 675253 698522 725390 754992 786890 820911
60496 820911 856531 892888 929326 965359 999980 1031576 1058991 1082434 1103081 1121967 1139508
60485 1139508 1155744 1170467 1182992 1192000 1195594 1191559 1177993 1154247 1121221 1080512 1033527 981750
60473 981750 927503 873611 822177 774165 730157 690810 656346 626311 600314 578491 560747
60462 560747 545993 532795 520593 509712 500294 491837 483793 476083 468897 462431 456933 452601 449169
60449D49169l253l603l845l706l446l217k760j859p35J89O21L72o14j911k530
60434D18872j753m4J195R81l21j501j730j113k80K64L62J20k31m64m54k19J57
60417D13841O11J193J983K875L389L016J913J005J082J931K657K732K304J699
60403D42231J217J336K415L970M937M916M564M401M015K980J921J797K543L307
60389D86550L748M231M813M954M410L618L012K519J977J486J114P80O16R38J622
60374E26388K064J993J835J985K187K008J497R81N67K45J80N11J062J641K433
60359E47577L695N213O411O964P052P097P367P763P858P223N833M012K006q7k026
60344F23958l490m543n597o659p138o738o054n822n933n757n183m746m776m998
$$ plain form
60449 449169 445916 442313 438468 434762 431316 428099 425339 423480 422745 422934 423555 423927 423313 421402 418872
60434 418872 417119 417075 418270 419251 418930 417429 415699 414586 414306 414570 414932 415052 414821 414357 413903 413684 413841
60417 413841 414452 415645 417628 420503 423892 426908 428821 429826 430908 432839 435496 438228 440532 442231
60403 442231 443448 444784 447199 451169 456106 461022 465586 469987 474002 476982 478903 480700 483243 486550
60389 486550 490298 494529 499342 504296 508706 512324 515336 517855 519832 521318 522432 523212 523828 524766 526388
60374 526388 528452 530445 532280 534265 536452 538460 539957 540938 541505 541750 541930 542441 543503 545144 547577
60359 547577 551272 556485 562896 569860 576912 584009 591376 599139 606997 614220 620053 624065 626071 625984 623958
60344 623958 620468 615925 610328 603669 596531 589793 583739 577917 571984 566227 561044 556298 551522 546524
60330E46524m985m636m129l692l471l410l220k744k181j816j591j204m81O22K140
60315E11726L912N418O216O548P050P900Q587Q601P986P128O309N619N098M648
60301F02746L950K611N54j808l844n278o497q074r988j1565j2215j1913j0873
60288E27806r232p272n496m086k633r33L83O20J73J40Q44J454J203L00o06j255
60272E01410j715j953j931j955k466l470m361m379l326j875j057j251j774j707
60258D68190r26k7N85J022J443J768J927J924J662J124P64J088J833K149J754
60243D86280J251J125J103Q53O33P64J030J077J007J054J166J357J972K981L615
60228E07268L384L033L594M899N912O352O910P933Q920R490R895J0280J0360J0176
$$ plain form
60330 546524 541539 536903 532774 529082 525611 522201 518981 516237 514056 512240 510649 509445 508964 509586 511726
60315 511726 515638 521056 527272 533820 540870 548770 557357 565958 573944 581072 587381 593000 598098 602746
60301 602746 606696 609307 609861 608053 604209 598931 592434 584360 574372 562807 550592 538679 527806
60288 527806 518574 511302 505806 501720 499087 498154 498537 499157 499330 499470 500314 501768 502971 503271 502665 501410
60272 501410 499695 497742 495811 493856 491390 487920 483559 479180 475854 473979 472922 471671 469897 468190
60258 468190 467264 467237 467822 468844 470287 472055 473982 475906 477568 478692 479456 480544 482377 484526 486280
60243 486280 487531 488656 489759 490612 491245 492009 493039 494116 495123 496177 497343 498700 500672 503653 507268
60228 507268 510652 513685 517279 522178 528090 534442 541352 549285 558205 567695 577590 587870 598230 608406
60214F08406J0369J1200J1993J2099J1734J1361J0880J0083R369R204R250Q837
60202G34785Q087P708P841P897P591P396P736Q313Q468P811O344M391K496J077
60188H27941L3r60j815k125j966j956k348k540j972j076q21j506k412k626j906
60173H01945p81k4p3q49k033l357m546n227n308n330n911o847p324p112o889p032
60157G33302o912n875m374l368k997k593j734n64P14J934K628K379J551R63P92
60142G15846M67k33p40n50R1O92J114J351J312J130J249J880K692L370L939M248
60126G37858L762K359Q93L73R08J979L382N243P339R085J0250J1102J1873J2461
60112H18867J2759J2863J2920J3035J3307J3602J3412J2290J0492Q761P482O428
$$ plain form
60214 608406 618775 629975 641968 654067 665801 677162 688042 698125 707494 716698 725948 734785
60202 734785 742872 750580 758421 766318 773909 781305 789041 797354 805822 813633 819977 824368 826864 827941
60188 827941 827974 827014 825199 823074 821108 819152 816804 814264 812292 811216 810395 808889 806477 803851 801945
60173 801945 801164 801140 801067 800218 798185 794828 790282 785055 779747 774417 768506 761659 754335 747223 740334 733302
60157 733302 726390 720515 716141 712773 709776 707183 705449 704885 705599 707533 710161 712540 714091 715054 715846
60142 715846 716313 716080 715340 714790 714881 715573 716687 718038 719350 720480 721729 723609 726301 729671 733610 737858
60126 737858 741620 743979 744872 745245 746153 748132 751514 756757 764096 773181 783431 794533 806406 818867
60112 818867 831626 844489 857409 870444 883751 897353 910765 923055 933547 942308 949790 956218
60100I56218N366M475L916L427K640J653Q77L46n06k230m629o846q251r096j0150
60085I37210j1787j3651j5150j5990j6135j5579j4420j2947j1497j0257r312q604
60073G81881p846o764n610n092n509o268o608o492o435o664o912o906o619o028
60059F92128n123m225l903m347n057n301m828m031l459l248l130k907k759k874
60045F36936k930k357j059L95J412J835J810J644J830K633L534L654K966K409
60031F54712K529K758K455J862J434J004L71J6L12N69q3j354k340l010l909m777
60015F52549m791m162m088m945n760n767n366n150n090n089n339n599n195m213
60001E81995l729m189m556l813k442j553j323j147o83J32J504L261M469M543M366
$$ plain form
60100 956218 961584 966059 969975 973402 976042 977695 978572 978918 978412 976182 971553 964707 956456 947360 937210
60085 937210 925423 911772 896622 880632 864497 848918 834498 821551 810054 799797 790485 781881
60073 781881 774035 767271 761661 756569 751060 744792 738184 731692 725257 718593 711681 704775 698156 692128
60059 692128 687005 682780 678877 674530 669473 664172 659344 655313 651854 648606 645476 642569 639810 636936
60045 636936 634006 631649 630590 630985 632397 634232 636042 637686 639516 642149 645683 649337 652303 654712
60031 654712 657241 659999 662454 664316 665750 666754 667125 667141 667453 668022 667939 666585 664245 661235 657326 652549
60015 652549 647758 643596 639508 634563 628803 623036 617670 612520 607430 602341 597002 591403 586208 581995
60001 581995 578266 574077 569521 565708 563266 561713 560390 559243 558560 558692 560196 563457 567926 572469 576835
59986E76835N311P337R026R374Q670P696O868O270N787N068L809K196O22q71k358
59971F51640l486l824l686l860m411m509l658k492j902j878j628o66O37J595K062
59956F19934K560L418M074L617K072O38K56M95L95l0J57J318K600K992K485J918
59940F48899J912K253K276J751J298J696K805L642L703L623M197N293O371P491
59926F97210Q948J0279J0692J0372J0241J0387R841Q296O925O908P962R110J0147
59913H17318J1419J2623J2890J1988J0577R166P506N297K770J89k761o407j0096
59900H82479j2444j2822j2203j2112j2887j3414j2587j0584q474o939n711m158
59888G58144k015M08K487L772M369M851N645O696P769Q813R758J0279J0214R942
$$ plain form
59986 576835 582146 589483 598509 607883 616553 624249 631117 637387 643174 648242 652051 654247 654869 653998 651640
59971 651640 648154 644330 640644 636784 632373 627864 624206 621714 619812 617934 616306 615640 616277 617872 619934
59956 619934 622494 625912 629986 633603 635675 636313 636569 637064 637459 637429 637586 638904 641504 644496 646981 648899
59940 648899 650811 653064 655340 657091 658389 660085 662890 666532 670235 673858 678055 683348 689719 697210
59926 697210 706158 716437 727129 737501 747742 758129 767970 776266 783191 790099 798061 807171 817318
59913 817318 828737 841360 854250 866238 876815 885981 893487 898784 901554 901743 898982 892575 882479
59900 882479 870035 857213 845010 832898 820011 806597 794010 783426 774952 768013 762302 758144
59888 758144 756129 756537 759024 762796 767165 772016 777661 784357 792126 800939 810697 820976 831190 841132
59874H41132R816R465Q301O645N524N204M686L092R07o95j304j429j476j265n93
59859H88010K69R29J425K143L291M618N790O824P873Q459P412M089n15m520p103
59844I28994r062j1208j2942j3112j1783j0305r654r538r282q913q835q903q420
59831G97037p026n098l245j684k69J137K554L998N476O830P829Q498R289J0708
59817H36034J2814J5146J7132J8483J9186J9214J8494J7092J5209J2772R374M954
59805A015904M61k743m380n550p160q624q852q095p762q470r388r792j0132j0969
59791I14448j1782j1805j1336j1192j1264j0804r976r856j0687j1229j0319q343
59779G85855o605n841n833n992n796m847l029o12J938M170N703O479O984P803
$$ plain form
59874 841132 850948 860413 868714 875359 880883 886087 890773 893865 894772 894077 892773 891344 889868 888603 888010
59859 888010 888279 889208 890633 892776 896067 900685 906475 913299 921172 929631 937043 941132 940617 936097 928994
59844 928994 919932 908724 895782 882670 870887 860582 850928 841390 832108 823195 814360 805457 797037
59831 797037 790011 784913 781668 779984 779715 780852 783406 787404 792880 799710 807539 816037 825326 836034
59817 836034 848848 863994 881126 899609 918795 938009 956503 973595 988804 1001576 1010950 1015904
59805 1015904 1016365 1013622 1009242 1003692 996532 987908 979056 970961 963199 954729 945341 935549 925417 914448
59791 914448 902666 890861 879525 868333 857069 846265 836289 826433 815746 804517 794198 785855
59779 785855 779250 773409 767576 761584 755788 750941 747912 747300 749238 753408 759111 765590 772574 780377
59765G80377Q867R559R693R779J0168J0548J0671J0921J1619J2370J2707J3011
59753I10290J3949J5319J6237J6319J5867J4887J2864R771O473L683J129j711
59741A035077m595o791q101q950r645j0140j0429j0611j0495r729q414p171o408
59728I23598n983n661n431n078m095k460r66k36K02J069K042K272J975K331L628
59713I07207M785N103N422O708Q537R993J1360J3618J6682J9358K1045K2367K3958
59700A076143K5651K7039K8051K8639K8623K8094K7345K6243K4345K1798J9258
59689A361229J6748J3500R427N805L769K887J958O69n12j584l179n548q233j0755
59675A386181j2894j4301j4531j3672j2462j1540j0870j0003q610o673m360j795
$$ plain form
59765 780377 789244 798803 808496 818275 828443 838991 849662 860583 872202 884572 897279 910290
59753 910290 924239 939558 955795 972114 987981 1002868 1015732 1025503 1031976 1035659 1036788 1035077
59741 1035077 1030482 1023691 1015590 1006640 996995 986855 976426 965815 955320 945591 937177 930006 923598
59728 923598 917615 911954 906523 901445 897350 894890 893924 893688 893890 894959 897001 899273 901248 903579 907207
59713 907207 911992 917095 922517 929225 937762 947755 959115 972733 989415 1008773 1029818 1052185 1076143
59700 1076143 1101794 1128833 1156884 1185523 1214146 1242240 1269585 1295828 1320173 1341971 1361229
59689 1361229 1377977 1391477 1400904 1406709 1410478 1413365 1415323 1415992 1415480 1413896 1410717 1405169 1396936 1386181
59675 1386181 1373287 1358986 1344455 1330783 1318321 1306781 1295911 1285908 1277298 1270625 1266265 1264470
59663A264470J218N041R585J4023J7440J9743K1583K3513K5524K7311K8572K9036
59651A487059K8514K6919K4048J9514J3281O083j189q427j6059k3882l0809l6022
59639A489030l9758m2435m3662m2737l9955l6649l3863l1494k8947k6145k3515
59628A099870k1239j9125j7293j6450j7111j8781k0358k1330k2105k3064k3794
59617H79220k3678k2864k1986k1018j9077j5681j1750q796p272o213m617k691
59605G13577j421j166j266j047o32m44l51J09Q07J018M25l79o98n37l34l09m40
59588G06912p66j238j515j392j269j683k547l320l923m820o152p345p809p604
59574F55529p097o387n404m316l471l014k844k801k754k598k366k189j980j382
$$ plain form
59663 1264470 1265688 1270729 1280314 1294337 1311777 1331520 1353103 1376616 1402140 1429451 1458023 1487059
59651 1487059 1515573 1542492 1566540 1586054 1599335 1605418 1604229 1595802 1579743 1555861 1525052 1489030
59639 1489030 1449272 1406837 1363175 1320438 1280483 1243834 1209971 1178477 1149530 1123385 1099870
59628 1099870 1078631 1059506 1042213 1025763 1008652 989871 969513 948183 926078 903014 879220
59617 879220 855542 832678 810692 789674 770597 754916 743166 734370 727098 720885 716268 713577
59605 713577 712156 710990 709724 708677 708045 707601 707250 707359 708166 709184 709609 709230 708532 707995 707661 707352 706912
59588 706912 706146 704908 703393 702001 700732 699049 696502 693182 689259 684439 678287 670942 663133 655529
59574 655529 648432 642045 636641 632325 628854 625840 622996 620195 617441 614843 612477 610288 608308 606926
59560F06926k90P80J229J176J356K173L227L805L610K969K576L079M602O578Q282
59545F52078R588J0921J2452J3794J4732J5692J7157J8971K0731K2357K3547K3021
59533H55041J9405J3018O062N90k972n139o094n802m806l947l462k979k325j782
59519H54808j679k174l340n021o746q224r659j1090j1823j1263j0086r603r999
59506G54101j0143r317q130p333o691n701m613l948l466k543j281m32j57M09K138
59491F92893M826P422R146J0229J1492J3198J4539J4535J3362J2301J2233J2748
59479H28924J2884J2252J0970R026O333L258M66j785l769n715p435q555q940q851
59465H39063q728q673q228o918n076l667l048k428q77J462L650N043N717O040
$$ plain form
59560 606926 606636 607416 608645 609821 611177 613350 616577 620382 623992 626961 629537 632616 637218 643796 652078
59545 652078 661666 672587 685039 698833 713565 729257 746414 765385 786116 808473 832020 855041
59533 855041 874446 887464 893526 894116 891144 886005 879911 874109 869303 865356 861894 858915 856590 854808
59519 854808 853129 850955 847615 842594 835848 827624 817965 806875 795052 783789 773703 764100 754101
59506 754101 743958 734641 726511 719178 712487 706786 702173 698225 694759 692216 690935 690503 690346 690755 692893
59491 692893 697719 705141 714287 724516 736008 749206 763745 778280 791642 803943 816176 828924
59479 828924 841808 854060 865030 874056 880389 883647 884113 882328 878559 872844 865409 856854 847914 839063
59465 839063 830335 821662 813434 806516 801440 797773 794725 792297 791420 792882 796532 801575 807292 813332
59451H13332O367O925P526P544O500M599K361Q1k087l923n565p622j0184j2076
59437H13778j2036j0503r201q957q928q266p478p430p787p366n706l555j838p02
59423G14025L03J630L478N756Q063R907J1189J2441J4224J6366J8151J9433K1007
59410H55973K3193K4356K1851J4834N487k949q640j1313j1010p982l373J364N794
59397I07585J0134J3373J3101Q057J9p669j3003j5952j6881j5679j2678r333p068
59384H54006n780m205j721P90K146K382K519L135L850M299M748N399N779N429
59370H82776M774M542M633M360L689L371L744M244M332M267M477M773M742M603
59356I43327N101O583Q544J0144J1001J1485J2319J3923J6115J8462K0743K2858
$$ plain form
59451 813332 819699 826624 834150 841694 848194 852793 855154 855235 853148 849225 843660 836038 825854 813778
59437 813778 801742 791239 782038 773081 764153 755887 748409 740979 733192 725826 720120 716565 714727 714025
59423 714025 714328 715958 719436 725192 733255 743162 754351 766792 781016 797382 815533 834966 855973
59410 855973 879166 903522 925373 940207 945694 942745 934105 922792 911782 903800 900427 901791 907585
59397 907585 917719 931092 944193 952250 952269 944600 931597 915645 898764 883085 870407 861074 854006
59384 854006 848226 844021 842300 843090 845236 847618 850137 853272 857122 861421 866169 871568 877347 882776
59370 882776 887550 892092 896725 901085 904774 908145 911889 916133 920465 924732 929209 933982 938724 943327
59356 943327 948428 955011 963555 973699 984700 996185 1008504 1022427 1038542 1057004 1077747 1100605
59344A100605K4606K5818K6714K7657K8589K8993K8430K6803K4202K0835J7062
59333A380314J3141Q971M463P9l527o358q964j1540j3803j5803j8038k0466k2244
59320A286225k2955k3341k4178k5071k5166k4638k4404k4567k4086k2252j9682
59309A025885j7503j6129j5224j4441j3623j2475j0607q164o137n748p429j0488
59297H87917j3797j6600j8568j9332j8502j6276j3636j1562j0103q510o254l688
59285G31089j654o27l59j96L41J310K467L612M845O506Q798J1333J3294J4293
59271G95052J5003J6483J8712K0288J9927J7968J5887J4557J3479J1755R181O226
59259I74518L392R49r97k495l739m895n933o711p178p460p771q171q412q143p377
$$ plain form
59344 1100605 1125211 1151029 1177743 1205400 1233989 1262982 1291412 1318215 1342417 1363252 1380314
59333 1380314 1393455 1402426 1406889 1406968 1403441 1397083 1388119 1376579 1362776 1346973 1328935 1308469 1286225
59320 1286225 1263270 1239929 1215751 1190680 1165514 1140876 1116472 1091905 1067819 1045567 1025885
59309 1025885 1008382 992253 977029 962588 948965 936490 925883 917719 911582 905834 898405 887917
59297 887917 874120 857520 838952 819620 801118 784842 771206 759644 749541 741031 734777 731089
59285 731089 729435 728808 728449 728253 728594 729904 732371 735983 740828 747334 756132 767465 780759 795052
59271 795052 810055 826538 845250 865538 885465 903433 919320 933877 947356 959111 968292 974518
59259 974518 977910 978859 977862 975367 971628 966733 960800 954089 946911 939451 931680 923509 915097 906954 899577
59244H99577o563o000n397m318k886j745j320j467j838k275k823l531m316m920
59230H50178n138n201n630o544p395p732p832q136q372p933o932o151n979o030
59216G55173n848n433m919m362l924l792l731l243k233j113j36Q05J706K320K691
59201G23961L302M458N890P106P860Q225Q611R542J1033J2348J3010J3675J5216
59188H44237J7224J8491J8887J9399K0180K0021J8254J5781J3402J0430O074J094
59176A023474l151o615j0167j3775j6439j7697j8032j7853j7142j6156j5465j5104
59164H55878j4469j3276j1962j0966j0156r191p977o645n372m385l830l628l524
59151G50497l219k353p35J134K225K022J138N05L02P0n37j675l481n675p371p926
$$ plain form
59244 899577 893014 887014 881617 877299 874413 872668 871348 869881 868043 865768 862945 859414 855098 850178
59230 850178 845040 839839 834209 827665 820270 812538 804706 796570 788198 780265 773333 767182 761203 755173
59216 755173 749325 743892 738973 734611 730687 726895 723164 719921 717688 716575 716439 717244 718950 721270 723961
59201 723961 727263 731721 737611 744717 752577 760802 769413 778955 789988 802336 815346 829021 844237
59188 844237 861461 879952 898839 918238 938418 958439 976693 992474 1005876 1016306 1022380 1023474
59176 1023474 1020323 1013708 1003541 989766 973327 955630 937598 919745 902603 886447 870982 855878
59164 855878 841409 828133 816171 805205 795049 785858 777881 771236 765864 761479 757649 754021 750497
59151 750497 747278 744925 744190 745324 747549 749571 750709 751214 751516 751586 751049 749374 745893 740218 732847 724921
59135G24921p738p517p191o286m992l924k958j403P58K753M242N673P241Q423
59121G12002Q929R267R976J0992J2098J3288J4171J3878J2155J0038Q631P637
59109H43062N857K941j89k582m221n541o642p366p790q215q764r337r870j0343
59095G71000j0509r984q744p304o150n249m376l616l132k618j644n06q0o11j271
59080G05206j232o92l55m17n34m69k68N8N20R52J098Q48K67m32r08r89j033j486
59062G00134k106k288k307l237n199o712o594n680n509o102o204n318m094k906
59048F35878j456J32J102J297J495K141K685K591K156J807J376O03k03o24p56
59033F50224r03j043j009r39j122j537j808j484k94J623L718N524P121Q689R856
$$ plain form
59135 724921 717183 709666 702475 696189 691197 687273 684315 682912 683670 686423 690665 696338 703579 712002
59121 712002 720931 730198 740174 751166 763264 776552 790723 804601 816756 826794 835425 843062
59109 843062 848919 851860 851671 849089 844868 839327 832685 825319 817529 809314 800550 791213 781343 771000
59095 771000 760491 750507 741763 734459 728309 723060 718684 715068 711936 709318 707674 707168 707088 706477 705206
59080 705206 703974 703282 702927 702510 701976 701507 701239 701297 701817 702769 703867 704715 704982 704550 703642 702653 701620 700134
59062 700134 698028 695740 693433 690196 684997 678285 671691 666011 660502 654400 648196 642878 638784 635878
59048 635878 634422 634554 635656 636953 638448 640589 643274 645865 648021 649828 651204 651807 651604 650980 650224
59033 650224 649321 648278 647269 646330 645208 643671 641863 640379 640085 641708 645426 650950 658071 666760 676616
59018F76616R989R125P915O652N025K976J037m94j983l684n157n919o132o140
59004F89826n777m666k939j127M65J820K851L345L285K942K686K726K944K961
58990G01342K598K213K265K558K462K007K124L440N365O809P499Q111R365J1373
58976G69531J3729J5865J7455J8736K0371K2681K5093K6600K6661K5467K3494
58965A005683K1066J8276J5087J1436P392L254n84l880o712r430j2373j5487j8247
58952A015481k0137k1137k1615k1776k1468k0483j8889j7049j5518j4731j4486
58941H08192j3859j2040r232o462m480l249k415j758j103k59O97J381J603J636
58927G58652J842K243K602K660K232J328L61m9K87Q84J181J241J643K727M151
$$ plain form
59018 676616 686605 695730 703645 710297 715322 718298 719335 718841 716858 713174 708017 702098 695966 689826
59004 689826 684049 679383 676444 675317 675782 677602 680453 683798 687083 690025 692711 695437 698381 701342
58990 701342 703940 706153 708418 710976 713438 715445 717569 721009 726374 733183 740682 748793 758158 769531
58976 769531 783260 799125 816580 835316 855687 878368 903461 930061 956722 982189 1005683
58965 1005683 1026749 1045025 1060112 1071548 1078940 1082194 1081610 1077730 1071018 1061588 1049215 1033728 1015481
58952 1015481 995344 974207 952592 930816 909348 888865 869976 852927 837409 822678 808192
58941 808192 794333 782293 773061 766599 762119 758870 756455 754697 753594 753335 754032 755413 757016 758652
58927 758652 760494 762737 765339 767999 770231 771559 771920 771871 772158 773042 774223 775464 777107 779834 783985
58912G83985N285N929O453P258Q285R313J0480J2106J4040J5687J6747J7424J7807
58899I30799J7630J6854J5800J4435J2381J0106R108J0135J1993J3139J3787J5227
58887A091394J7630J9948K1660K3128K4234K4132K2728K1123K0085J9249J8205
58876A323516J7329J6889J6320J5005J3058J0776P971M457N93l229p086j1077
58864A404522j4868j8066k0554k2211k2881k2970k3290k4040k4487k4124k3425
58853A163606k3049k2912k2572k1917k1003j9754j8330j7216j6541j5823j4886
58842I49603j4385j4928j6159j7203j7557j7109j5880j4252j2945j2242j1646
58831G85297j0684r502q341p022n441l909k539r61Q03J933J991J805K466L924
$$ plain form
58912 783985 789270 795199 801652 808910 817195 826508 836988 849094 863134 878821 895568 912992 930799
58899 930799 948429 965283 981083 995518 1007899 1018005 1027113 1037248 1049241 1062380 1076167 1091394
58887 1091394 1109024 1128972 1150632 1173760 1197994 1222126 1244854 1265977 1286062 1305311 1323516
58876 1323516 1340845 1357734 1374054 1389059 1402117 1412893 1420864 1425321 1425914 1422685 1415599 1404522
58864 1404522 1389654 1371588 1351034 1328823 1305942 1282972 1259682 1235642 1211155 1187031 1163606
58853 1163606 1140557 1117645 1095073 1073156 1052153 1032399 1014069 996853 980312 964489 949603
58842 949603 935218 920290 904131 886928 869371 852262 836382 822130 809185 796943 785297
58831 785297 774613 765111 756770 749748 744307 740398 737859 736898 737701 739634 741625 743430 745896 749820
58817G49820N363O359O909O835O058N125M663M557M339L991L668L016J593l10
58803H11986k020l402m732n892o476o442n997n093l696k333j535r75Q7J657L078
58788G68215M131N334P082R187J1281J3188J4899J6614J8673K1012K2947K3951
58776I36514K4280K4207K3177K0496J6551J2347Q037K996k708q001j2158j5482
58764A030256j8298k0198k0833k0732k0666k0630k0058j8758j7148j5662j4338
58753H22935j3009j1616j0308r281q566p983p293o392n311m189l220k432j483
58740G31852j5J758L147L924M647N744O688O656N719M789M441M318L720K436Q32
58725G90656n69j468j846j749j153j83P79J547K558M314O421P844Q258Q418Q865
$$ plain form
58817 749820 755183 761542 768451 775286 781344 786469 791132 795689 800028 804019 807687 810703 812296 811986
58803 811986 809966 806564 801832 795940 789464 783022 777025 771932 768236 765903 764368 763393 763480 765137 768215
58788 768215 772346 777680 784762 793949 805230 818418 833317 849931 868604 889616 912563 936514
58776 936514 960794 985001 1008178 1028674 1045225 1057572 1065609 1068605 1065897 1057896 1045738 1030256
58764 1030256 1011958 991760 970927 950195 929529 908899 888841 870083 852935 837273 822935
58753 822935 809926 798310 788002 778721 770155 762172 754879 748487 743176 738987 735767 733335 731852
58740 731852 731837 733595 736742 740666 745313 751057 757745 764401 770120 774909 779350 783668 787388 789824 790656
58725 790656 790087 788619 786773 785024 783871 783688 784467 786014 788572 792886 799307 807151 815409 823827 832692
58710H32692R047Q169O355M276K113n00l764p462j1187j4519j7225j9538k1836
58697G66621k3840k4702k4138k2822k1314j9406j6988j4704j2984j1277r094p179
58685E58173o568o918o839n631l794k026o03M04J086J864L007M023M158L273J818
58670E45427K23j067j343k32J687L485M864N958O601O511N827M741K898j4l397
58655E82169o264q340r813j0451r995r134q908r198q846p443n933n262n280n264
58641D72038m821l924k626j116K61J179J451J081N07M16R59J502J560J496J741
58626D71704J890J353M84J26L21L57m6m87o79p03n09J21J111K178L195M080M549
58609D89045M532M388M268L760K841K451L222M281M358L616L201L410L493L058
$$ plain form
58710 832692 841739 849908 856263 860539 862652 862152 858388 850926 839739 825220 807995 788457 766621
58697 766621 742781 718079 693941 671119 649805 630399 613411 598707 585723 574446 565352 558173
58685 558173 551605 544687 537848 532217 528423 526397 525794 526198 527284 529148 532155 536178 540336 543609 545427
58670 545427 545650 544583 543240 543008 544695 548180 553044 559002 565603 572114 577941 582682 585580 585566 582169
58655 582169 575905 567565 557752 547301 537306 528172 519264 510066 501220 493777 487844 482582 477302 472038
58641 472038 467217 463293 460667 459551 459812 460991 462442 463523 464030 464446 465405 466907 468467 469963 471704
58626 471704 473594 474947 475431 475557 475878 476235 476189 475702 475023 474320 473811 473932 475043 477221 480416 484496 489045
58609 489045 493577 497965 502233 505993 508834 511285 514507 518788 523146 526762 529963 533373 536866 539924
58595E39924K569K463K766L438M275M650M280L999M895O959R339J1525J3306J4154
58581F28542J3814J3068J2827J2790J2134J0951R799Q426O406M493L740L724L333
58568G44047K994M215P056R990J2265J4501J6847J8468J9293K0290K1404K1039
58556I12409J8344J4447J0648O854K700j205m034n812o940p553p877q278q565
58543I15138q224p707q347j0557j3228j5318j6999j8737k0389k1594k2165k1719
58531G30154k0009j7785j6226j5277j3842j1757j0138r451q805p678o821o733
58519E85632o611n682m424l619l233k871k483k040j411r09j014j370j141n23n13
58504E47788r43m41J266K550K175Q71m6k57J06J199K761L857M118M174M417M488
$$ plain form
58595 539924 542493 544956 547722 551160 555435 560085 564365 568364 573259 580218 589557 601082 614388 628542
58581 628542 642356 655424 668251 681041 693175 704126 713925 722351 728757 733250 736990 740714 744047
58568 744047 747041 751256 758312 768302 780567 795068 811915 830383 849676 869966 891370 912409
58556 912409 930753 945200 955848 962702 965402 964197 960163 954351 947411 939858 931981 923703 915138
58543 915138 906914 899207 890860 880303 867075 851757 834758 816021 795632 774038 751873 730154
58531 730154 710145 692360 676134 660857 647015 635258 625120 615669 606864 599186 592365 585632
58519 585632 579021 573339 568915 565296 562063 559192 556709 554669 553258 552349 551335 549965 548824 548301 547788
58504 547788 546845 546404 547670 550220 552395 553266 553220 552963 553069 554268 557029 560886 565004 569178 573595 578083
58488E78083M501N277O834Q057Q492Q997J0058J1043J1797J3200J5309J6688J6551
58475G14887J5857J5214J3498R861N467J781j403m768p713r365j0144j0806j0927
58462G21439r732p497m892j918J331L961N544P048R255J1353J2263J2238J1826
58449G72219J0388P192L026p51m066p636j1285j3997j5151j4766j3188j1260j0010
58436F90715r320p953n582l545k759k278j004N10J338J934L289N300P217Q706
58422F86568R348Q297N694L245K146J436l14k745m479n123n256n309n495n977
58408F82036o261n523m209l875m649m647k922j020l31J04J512L027L310K879K887
58393F62318L059K774K729L625M452M074L173K886K830K298J991K622L180K647
$$ plain form
58488 578083 582584 587861 594695 602752 611244 620241 630299 641342 653139 666339 681648 698336 714887
58475 714887 730744 745958 759456 769317 774784 776565 775162 770394 762681 753316 743172 732366 721439
58462 721439 711707 704210 699318 697400 698731 702692 708236 715284 724539 735892 748155 760393 772219
58449 772219 782607 789799 792825 792074 788008 780372 769087 755090 739939 725173 711985 700725 690715
58436 690715 681395 673442 667860 664315 661556 659278 658274 658784 660122 662056 665345 670645 677862 686568
58422 686568 695916 704213 709907 713152 715298 716734 716420 713675 709196 704073 698817 693508 688013 682036
58408 682036 675775 670252 666043 662168 657519 652872 649950 648930 648599 648703 650215 653242 656552 659431 662318
58393 662318 665377 668151 670880 674505 678957 683031 686204 689090 691920 694218 696209 698831 702011 704658
58379G04658K006K581L706M084M068M553N001M770M922O417P960Q038P692Q766
58365G79222J0619J1311J0889J0889J1426J1433J0945J0689J0211Q767P285P044
58353I00730P237O190M121K441J319K44q7J080K550K815K726L997O169P603Q415
58338I57550R711J0901J0631R562R589J0941J2564J4305J6241J7014J5586J3496
58326A108091J2665J2246J0407P871O529N922M494L042L395M776N114M964O388
58313A195904Q794R729R222R598J1401J3078J4165J5353J6009J5174J4320J5442
58301A348189J7213J6822J4806J4118J5061J5406J4956J5674J7560J8633J8794
58290A527232J9644K0777K0451J9631K0912K3715K4879K4037K3918K5360K6467
$$ plain form
58379 704658 706664 709245 712951 717035 721103 725656 730657 735427 740349 746766 754726 762764 770456 779222
58365 779222 789841 801152 812041 822930 834356 845789 856734 867423 877634 886401 893686 900730
58353 900730 907967 914157 918278 920719 922038 922282 922195 923275 925825 928640 931366 935363 941532 949135 957550
58338 957550 967261 978162 988793 998355 1007944 1018885 1031449 1045754 1061995 1079009 1094595 1108091
58326 1108091 1120756 1133002 1143409 1151280 1157809 1163731 1168225 1171267 1174662 1179438 1184552 1189516 1195904
58313 1195904 1204698 1214427 1223649 1233247 1244648 1257726 1271891 1287244 1303253 1318427 1332747 1348189
58301 1348189 1365402 1382224 1397030 1411148 1426209 1441615 1456571 1472245 1489805 1508438 1527232
58290 1527232 1546876 1567653 1588104 1607735 1628647 1652362 1677241 1701278 1725196 1750556 1777023
58279A777023K6717K7570K8833K8845K8295K9651L2754L5192L6721L9052M1681
58268B132334M2684M3140M5829N0006N2562N3884N7099O1862O4593O4780O5230
58257B734003O6187O5147O2700O2343O4230O5062O4580O6061P0032P3676P6727
58246C470748Q1699Q8141R3186R7750J05341J14770J21407J25661J32440J42049
58236D573192J49901J55684J64184J76134J86999J95945K07200K21407K34717
58227F265363K47560K64903K86667L07689L28273L54395L86315M18015M49286
58218I308466M86832N31869N78982O28916O89445P61588Q38875R22451J022095
58209A5769519J139906J268839J410425J577493J777023K009093K286263K634313
$$ plain form
58279 1777023 1803740 1831310 1860143 1888988 1917283 1946934 1979688 2014880 2051601 2090653 2132334
58268 2132334 2175018 2218158 2263987 2313993 2366555 2420439 2477538 2539400 2603993 2668773 2734003
58257 2734003 2800190 2865337 2928037 2990380 3054610 3119672 3184252 3250313 3320345 3394021 3470748
58246 3470748 3552447 3640588 3733774 3831524 3936865 4051635 4173042 4298703 4431143 4573192
58236 4573192 4723093 4878777 5042961 5219095 5406094 5602039 5809239 6030646 6265363
58227 6265363 6512923 6777826 7064493 7372182 7700455 8054850 8441165 8859180 9308466
58218 9308466 9795298 10327167 10906149 11535065 12224510 12986098 13824973 14747424 15769519
58209 15769519 16909425 18178264 19588689 21166182 22943205 24952298 27238561 29872874
58201B9872874L071337L609702M283988N154402O281015P722672R559378J1871394
58193H1426762J4679078J7929747K1532863K5346302K9127820L2581278L5431549
58186B58055399L7246110L7042271L3299684K4843925J2037792k916812j7007892
58179C82600477k7891748l4638952l7493315l7261888l4892526l1280022k7152713
58172A51989313k3020623j9204401j5881746j3105386j0832599q987282p501827
58165E3455449o311257n345856m550826l896882l361006k913421k531575k209196
58157B2335430j941297j713878j515688j345997j203004j077094r62264q62244
58149A1713964p78838p05169o36218n75323n24606m79185m36265m00249l73328
$$ plain form
58201 29872874 32944211 36553913 40837901 45992303 52273318 59995990 69555368 81426762
58193 81426762 96105840 114035587 135568450 160914752 190042572 222623850 258055399
58186 258055399 295301509 332343780 365643464 390487389 402525181 399608369 382600477
58179 382600477 354708729 320069777 282576462 245314574 210422048 179142026 151989313
58172 151989313 128968690 109764289 93882543 80777157 69944558 60957276 53455449
58165 53455449 47144192 41798336 37247510 33350628 29989622 27076201 24544626 22335430
58157 22335430 20394133 18680255 17164567 15818570 14615566 13538472 12576208 11713964
58149 11713964 10935126 10229957 9593739 9018416 8493810 8014625 7578360 7178111 6804783
58140F804783l50000l25991l04050k86177k68512k48766k30752k16778k03073
58131D370684j87277j73072j62950j53395j41743j31147j24255j18231j10438
58122C068176j03132r8343r3731q7581q2558q0537p8814p5105p1414o9356o6640
58111B160965o1711n7215n5242n3589n0107m6519m4661m3152m0853l9570m0207
58100A628139m0195l7735l4887l3697l2961l1386l0224l0181k9433k7157k5401
58089A274882k5129k4247k1721j9741j9499j8961j7182j6617j8344j9328j7410
58078A056703j5106j5129j6017j5516j4746j5427j6174j5124j3448j2975j2863
58067H94178j1832j1111j2109j3423j3129j1843j0939j0034q724q342r445j0086
$$ plain form
58140 6804783 6454783 6128792 5824742 5538565 5270053 5021287 4790535 4573757 4370684
58131 4370684 4183407 4010335 3847385 3693990 3552247 3421100 3296845 3178614 3068176
58122 3068176 2965044 2866701 2772970 2685389 2602831 2522294 2443480 2368375 2296961 2227605 2160965
58111 2160965 2099254 2042039 1986797 1933208 1883101 1836582 1791921 1748769 1707916 1668346 1628139
58100 1628139 1587944 1550209 1515322 1481625 1448664 1417278 1387054 1356873 1327440 1300283 1274882
58089 1274882 1249753 1225506 1203785 1184044 1164545 1145584 1128402 1111785 1093441 1074113 1056703
58078 1056703 1041597 1026468 1010451 994935 980189 964762 948588 933464 920016 907041 894178
58067 894178 882346 871235 859126 845703 832574 820731 809792 799758 791034 782692 773247 763161
58055G63161r070q407r903j1947j2398j2008j2217j2114j0653r407r850j0253
58043F34934q530o123n628o424o134m915m767n810o511o641p008p106o031m930
58029E48376n691p767r016r054r235r749r404q067o977o578o066n101m344m221
58015D47106m564n204n862n776m591l104k278k087k061k070j860q85N14J045M04
58000D08727l2O54J619K083K737M054M864M081K523J491Q82P7n42m02O7L11N46
57983D33740P87L48o15n93J072K989L908M388N241O113O957Q877J1915J3997J3773
57968E12897J2664J2228J1484Q919N324K269o28m510q689j1605j3293j4596j5101
57955D97363j4109j2736j2667j3542j3679j2707j1550j0471r020p397o133m996
$$ plain form
58055 763161 754091 745684 735781 723834 711436 699428 687211 675097 664444 655037 645187 634934
58043 634934 626404 620281 614653 608229 602095 597180 592413 586603 580092 573451 566443 559337 553306 548376
58029 548376 542685 534918 525902 516848 507613 497864 488460 480393 473416 466838 460772 455671 451327 447106
58015 447106 442542 437338 431476 425700 421109 418005 415727 413640 411579 409509 407649 406764 407278 408323 408727
58000 408727 408695 409349 410968 413051 415788 419842 424706 428787 431310 432801 433683 433760 433218 432816 432883 433194 433740
57983 433740 434527 434875 434260 433667 434739 437728 441636 446024 451265 457378 464335 473212 485127 499124 512897
57968 512897 525561 537789 549273 558192 563516 565785 565157 560647 551958 540353 527060 512464 497363
57955 497363 483254 470518 457851 444309 430630 417923 406373 395902 386882 379485 373352 368356
57943C68356l595k250j018R09L512N118M892M489N361O224N475M355M896O161
57929D12885N550K936N35q36k382m562o460p781r062r869r163p409o124n451m308
57914C48499k623j336l55J205K986L885M379N910Q005Q527O992N127L814J949
57900C96964j010l697m975n502o194o811o872o574o017m860l351k441k386k346
57886C33928j765r85k67N72J254J109K99k13j76k41n79o22l28l11n12j02Q83J297
57868C33241O83K3J72P13Q95O98M87M84R27J875K677K567J926J942K825L457L032
57851C58624K027J244Q29N43J23p95k305l635l815l053k572k930l434l343k798
57836C34710k314k122k172k200j756o59O90J943L321M816N536M824L533K953K955
$$ plain form
57943 368356 364761 362511 361493 362402 365914 371032 375924 380413 385774 391998 397473 401828 406724 412885
57929 412885 418435 421371 421906 421070 418688 414126 407666 399885 390823 380954 371791 364382 358258 352807 348499
57914 348499 345876 344540 344185 345390 348376 352261 356640 362550 370555 379082 386074 391201 395015 396964
57900 396964 395954 392257 387282 381780 375586 368775 361903 355329 349312 344452 341101 338660 336274 333928
57886 333928 332163 331178 330911 331483 332737 333846 334145 333932 333756 333515 332936 332314 331986 331675 331163 331061 331944 333241
57868 333241 333924 333947 334119 334832 335727 336425 336912 337396 338323 340198 342875 345442 347368 349310 352135 355592 358624
57851 358624 360651 361895 362724 363267 363390 362595 360290 356655 352840 349787 347215 344285 340851 337508 334710
57836 334710 332396 330274 328102 325902 324146 323487 324177 326120 329441 334257 339793 344617 348150 351103 354058
57821C54058K444J288L87M4k93q17j260j973l612n742p129p502p696q002p829
57806C06366p126o623o314n170k867m97R65J717K226K387K240K433L355M509N260
57791C02861N581N665N464M908M018K665Q04j060k218k512k216j463m56J54K5
57776C22220j73K04M63m11j896k501k057j853k517l297l659m093m899n426n116
57761B84989m310l588l104k784k468j821q28j86l45m63N23K206L240L350L339
57746B77750L408L014K329K229K675K659J868J018M31k57r06q89m17l28n17j47
57730B93920N72N71j0J24J084J437O62j1K90R32J394K031K579J848j95j810j937
57713C03481j525j567j662j470j712k483k468j258n47j502k553j737K66J365J187
$$ plain form
57821 354058 356502 357790 358177 358221 357928 357111 355851 353878 350266 344524 337395 329893 322197 314195 306366
57806 306366 299240 292617 286303 281133 278266 277769 278734 280451 282677 285064 287304 289737 293092 297601 302861
57791 302861 308442 314107 319571 324479 328497 331162 331966 330906 328688 326176 323960 322497 322041 322195 322220
57776 322220 322047 322251 322714 322303 320407 317906 315849 313996 311479 308182 304523 300430 295531 290105 284989
57761 284989 280679 277091 273987 271203 268735 266914 266086 265900 265555 265092 265615 267821 271061 274411 277750
57746 277750 281158 284172 286501 288730 291405 294064 295932 296950 297381 297124 296218 295329 294912 294584 294067 293920
57730 293920 294492 295063 295053 295177 296261 297698 298360 298349 298639 299571 300965 302996 305575 307423 307228 305418 303481
57713 303481 301956 300389 298727 297257 295545 293062 290594 289336 288789 287287 284734 282997 283263 284628 285815
57698B85815R32J040R51P06R59J555J605Q40k09j108j707j801j446j124q57J15
57682B86266K058M034N408P042R870J3296J6422K0017K5683L3517M2135N0696
57670E16444N9378O8017P5719Q1797Q5626Q4984P5814N4869K3024j4013m8297
57659A063362p3620q7861r2227q9011q0492o9206n7595m6902l7256k8986k2752
57648C77454j8265j4246j0132o583l892j388R84K065J441M35J25j84j345k703
57634C23766l406m004n164o040n644m760m722n222n120m631m730n143m824m058
57620B56298m007m537m391l435k831k960k969k537k421k864l064k593j973j493
57606B14223p42K58P58N10K45M30N91K51l33q12j273j736j838j378n99K37J029
$$ plain form
57698 285815 286747 287787 288738 289444 290403 291958 293563 294403 294194 293086 291379 289578 288132 287008 286151 286266
57682 286266 288324 292358 297766 304808 314678 327974 344396 364413 390096 423613 465748 516444
57670 516444 575822 643839 719558 801355 886981 971965 1047779 1102648 1125672 1111659 1063362
57659 1063362 989742 901881 809654 720643 640151 570945 513350 466448 429192 400206 377454
57648 377454 359189 344943 334811 328228 324336 322948 323932 325997 327438 327873 327998 327814 326469 323766
57634 323766 320360 316356 311192 305152 299508 294748 290026 284804 279684 275053 270323 265180 260356 256298
57620 256298 252291 247754 243363 239928 237097 234137 231168 228631 226210 223346 220282 217689 215716 214223
57606 214223 213481 213739 214497 215007 215252 215682 216273 216524 216191 215379 214106 212370 210532 209154 208555 208792 209821
57589B09821J501J420J158J351J937K224K053K041K555L032K689J409k22j451
57575B31518j932k061k603l697m561m557m087l875l892l783l834m582n696o207
57561A76151n719m617l314k062j303j268j399r95k79qk02j93K34O01N77K73j99
57544A56278o59o01K26J128J319J141J457K117K115J231L08j92p72j809k831l206
57528A57250k863k064j143m58o9M46J279J781J346N17K60M86M48K32N68J238J240
57511A60494N68L82J117J796J701J333J215R34J67m77l93K1M6l18o02n31k8Q46
57493A68271J551J464R25J005J893K415J795Q60P15J053P42l99j467j844j833
57478A77146k001k535l269l879m065l813l440l227l125k966k761k655k677k637
$$ plain form
57589 209821 211322 212742 213900 215251 217188 219412 221465 223506 226061 229093 231782 233191 232969 231518
57575 231518 229586 227525 224922 221225 216664 212107 208020 204145 200253 196470 192636 188054 182358 176151
57561 176151 170432 165815 162501 160439 159136 157868 156469 155474 155195 155187 154985 154792 155026 155627 156204 156477 156278
57544 156278 155619 155018 155244 156372 157691 158832 160289 162406 164521 165752 166060 165868 165096 163287 160456 157250
57528 157250 154387 152323 151180 150722 150653 151099 152378 154159 155505 156022 156282 156768 157216 157448 158016 159254 160494
57511 160494 161062 161444 162561 164357 166058 167391 168606 169540 169707 169230 168837 168858 168904 168586 167984 167453 167425 168271
57493 168271 169822 171286 172211 173216 175109 177524 179319 180179 180894 181947 182689 182290 180823 178979 177146
57478 177146 175145 172610 169341 165462 161397 157584 154144 150917 147792 144826 142065 139410 136733 134096
57464A34096k167j083R3L10p75k026k054j023l40o05r50o22j59m10j157j503j078
57447A18547l07L02N37M54L30N40J196K044K738L060K871K247J643J496J670J797
57431A41165K047K951M353N249M939L775K567J760J404J405J475J208M83m61j402
57416A72918k219k723k782k674k737k777k375j667j142p30K5Q12N49j147l275
57401A48056m606m891m515l720k692j874j588j611j488j032l70K70O60Q19J078
57386A22496J600J947J707J298J424J867J717Q46J50J52L47K77K45N61Q07M85
57370A37926k72j037j650k054k198k266k468k441j625l47M17N27Q64J705K114
57355A27195J504O99O18R01P60L10J25J84J91L04N94M17o61j773j679m79N58O47
$$ plain form
57464 134096 131929 130846 130939 131249 130474 128448 126394 125371 125031 124426 123476 122854 122695 122285 121128 119625 118547
57447 118547 118240 118542 119079 119533 119863 120403 121599 123643 126381 129441 132312 134559 136202 137698 139368 141165
57431 141165 143212 146163 150516 155765 160704 164479 167046 168806 170210 171615 173090 174298 174781 174320 172918
57416 172918 170699 167976 165194 162520 159783 157006 154631 152964 151822 151092 151117 151929 152478 151331 148056
57401 148056 143450 138559 134044 130324 127632 125758 124170 122559 121071 120039 119669 119939 120599 121418 122496
57386 122496 124096 126043 127750 129048 130472 132339 134056 134902 135052 135204 135551 135828 136073 136634 137441 137926
57370 137926 137654 136617 134967 132913 130715 128449 125981 123540 121915 121568 121985 122512 123376 125081 127195
57355 127195 128699 129398 130016 130917 131677 131987 132112 132296 132487 132791 133385 133802 133141 131368 129689 129210 129768 130415
57337A30415O2o49j156j139m69L50O03J97l93q71j222j290q80k01L60Q37J434
57320A25988J871J608P36J5p2J87K84J43M6K58Q25J568K177K414K277J978J846
57303A44149K192K980L626L533K912K673L325M322M759M395L732L405L659M201
57289A93863M461M245M089M547N333N705N666N915O588O917O435N709N445N639
57275B70557N983O363O542O175N616N875P229Q618R082Q964R074R476R876J0378
57261C79808J0986J1098J0445R875J0206J0938J1192J1323J2421J4587J6947J9148
57249E28974K1520K3929K5666K6633K7550K8708K9519K9561K9270K9219K9326
57238H29875K8973K7572K4860K1262J7884J5566J3877J1712Q991P055P099Q744
$$ plain form
57337 130415 130477 129828 128672 127533 127064 127414 128017 128214 127821 126950 125728 124438 123558 123357 123717 124554 125988
57320 125988 127859 129467 130203 130218 130146 130333 130617 130760 130806 131064 131889 133457 135634 138048 140325 142303 144149
57303 144149 146341 149321 152947 156480 159392 162065 165390 169712 174471 178866 182598 186003 189662 193863
57289 193863 198324 202569 206658 211205 216538 222243 227909 233824 240412 247329 253764 259473 264918 270557
57275 270557 276540 282903 289445 295620 301236 307111 314340 322958 332040 341004 350078 359554 369430 379808
57261 379808 390794 401892 412337 422212 432418 443356 454548 465871 478292 492879 509826 528974
57249 528974 550494 574423 600089 626722 654272 682980 712499 742060 771330 800549 829875
57238 829875 858848 886420 911280 932542 950426 965992 979869 991581 1000572 1007627 1014726 1023470
57226A023470J0586J1798J2822J4611J7465K0694K3346K5155K6480K7454K7658
57215A241539K6725K4789K2170J9162J6494J5193J5497J6361J6674J6535J6688
57204A447827J7300J8003J8761J9804K0967K1841K2424K2907K3103K2745K2248
57193A677930K2380K3326K4654K6039K7319K8044K7752K6668K5501K4598K3858
57182A958069K3239K2753K2132K1193K0329J9969J9750J8946J7620J6581J6266
57171B176847J6317J6240J5852J5125J4216J3528J3275J3141J2882J2858J3304
57160B333585J3619J3279J2973J3718J5060J5479J4568J3595J3645J4311J4562
57149B488394J3958J2619J0871R358Q794R184R814J0267J0841J1772J2681J3055
$$ plain form
57226 1023470 1034056 1045854 1058676 1073287 1090752 1111446 1134792 1159947 1186427 1213881 1241539
57215 1241539 1268264 1293053 1315223 1334385 1350879 1366072 1381569 1397930 1414604 1431139 1447827
57204 1447827 1465127 1483130 1501891 1521695 1542662 1564503 1586927 1609834 1632937 1655682 1677930
57193 1677930 1700310 1723636 1748290 1774329 1801648 1829692 1857444 1884112 1909613 1934211 1958069
57182 1958069 1981308 2004061 2026193 2047386 2067715 2087684 2107434 2126380 2144000 2160581 2176847
57171 2176847 2193164 2209404 2225256 2240381 2254597 2268125 2281400 2294541 2307423 2320281 2333585
57160 2333585 2347204 2360483 2373456 2387174 2402234 2417713 2432281 2445876 2459521 2473832 2488394
57149 2488394 2502352 2514971 2525842 2535200 2543994 2553178 2562992 2573259 2584100 2595872 2608553 2621608
57137B621608J2754J1909J0742R585Q520P122N198L587L382M372N346O063P849
57124B718037J1854J7576K3554K8724L2656L5224L6616L7199L7037L6055L4875
57113C049407L4864L7035M1525M8319N7667O9419Q2764R7341J14140J34823J60620
57102C927924J92300K30746K77154L33203M01569M85977N90277P17357Q68594
57093H025101J043325J238080J446514J660339J870390K067480K243797K394670
57085B1989696K519270K619421K696644K746949K754483K689534K516901K211812
57077D2744710J771595J214781N72158j20048q21716j490076k084241k570851
57069C9216312k927529l144045l222447l176138l027476k804343k536385k251179
$$ plain form
57137 2621608 2634362 2646271 2657013 2666598 2675118 2682240 2687438 2691025 2694407 2698779 2704125 2710188 2718037
57124 2718037 2729891 2747467 2771021 2799745 2832401 2867625 2904241 2941440 2978477 3014532 3049407
57113 3049407 3084271 3121306 3162831 3211150 3268817 3338236 3421000 3518341 3632481 3767304 3927924
57102 3927924 4120224 4350970 4628124 4961327 5362896 5848873 6439150 7156507 8025101
57093 8025101 9068426 10306506 11753020 13413359 15283749 17351229 19595026 21989696
57085 21989696 24508966 27128387 29825031 32571980 35326463 38015997 40532898 42744710
57077 42744710 44516305 45731086 46303244 46183196 45361480 43871404 41787163 39216312
57069 39216312 36288783 33144738 29922291 26746153 23718677 20914334 18377949 16126770
57061A6126770j970843j710100j476370j271328j093294r39632q08223o97283
57053F159697o04318n25748m57946l98630l47188l03691k67591k37335k10978
57044B806272j87105j65115j44916j26515j09809r4631q0902o8699n7977m8303
57034A722300l9048k9796k0124r314K634J3122J7215J1186m005k3277m1188n4584
57022A545121o2453o4934o3045n8353n2173m5325l8708l3332k9522k6654k4049
57011A046573k1669j9760j8360j7401j6875j6647j6410j5936j5191j4223j3241
57000H60860j2621j2398j2107j1530j1228j1578j1825j1000r491q500q199p640
56988G32743o457n286m402l297j941j153j291j858k907n495r958j4921j8813k1347
$$ plain form
57061 16126770 14155927 12445827 10969457 9698129 8604835 7665203 6856980 6159697
57053 6159697 5555379 5029631 4571685 4173055 3825867 3522176 3254585 3017250 2806272
57044 2806272 2619167 2454052 2309136 2182621 2072812 1978181 1897279 1828580 1770603 1722300
57034 1722300 1683252 1653456 1633332 1624018 1626652 1639774 1656989 1668175 1664170 1640893 1599705 1545121
57022 1545121 1482668 1417734 1354689 1296336 1244163 1198838 1160130 1126798 1097276 1070622 1046573
57011 1046573 1024904 1005144 986784 969383 952508 935861 919451 903515 888324 874101 860860
57000 860860 848239 835841 823734 812204 800976 789398 777573 766573 757082 748582 740383 732743
56988 732743 726286 721000 716598 713301 711360 710207 708916 707058 704151 698656 688698 673777 654964 633617
56974F33617k2783k2818k1327j9204j7428j5889j4004j1869r846p752n295k755
56962D62647l90K246N518Q779J1194J2918J4471J5265J3758R042J686o680j4148
56949E36306j9311k1966k2899k2663k1104j8327j5246j2523r790o634l539r79
56937C61325J592M910Q643J2006J5069J8325K1464K3488K3659K1383J5824O913
56925E34601l530j2831j9608k4098k6732k7518k6599k4433k1411j8066j5358j3841
56913C00576j2799j1097q731o665n421m733m294l954l406k633k308k772l075k112
56899B26576l77P53J168K024L684N209O094P114Q938J1124J3017J4605J6014J6984
56885C32927J7327J7090J5972J3292Q849L243k816q724j3524j6150j6405j4993
$$ plain form
56974 633617 610834 588016 566689 547485 530057 514168 500164 488295 478449 470697 465402 462647
56962 462647 462257 464503 470021 478800 489994 502912 517383 532648 546406 555448 557134 550454 536306
56949 536306 516995 495029 472130 449467 428363 410036 394790 382267 372477 365843 362304 361325
56937 361325 362917 367827 376470 388476 403545 421870 443334 466822 490481 511864 527688 534601
56925 534601 531071 518240 498632 474534 447802 420284 393685 369252 347841 329775 314417 300576
56913 300576 287777 276680 267949 261284 255863 251130 246836 242882 239476 236843 234535 231763 228688 226576
56899 226576 226199 226952 228120 230144 233828 239037 245131 252245 261183 272307 285324 299929 315943 332927
56885 332927 350254 367344 383316 396608 405457 408700 405884 397160 383636 367486 351081 336088
56873C36088j2520r263n845k968k34L606Q791J4002J8167K1748K5715L0172L4679
56860D62138L9013M2681M4243M2015L5199K4054R614o152k0482l0993l6752l8057
56848E66521l5720l0922k5115j9269j3360o936R2P545J5477K4113L3405M2870
56836E58701N1769N9366O5320O9693P1949O9911O0545M2455J7506j0028l5499
56825A021688n5277o7433p2060p0751o5272n6913m6984l7104k8270k0184j2082
56814D89358l856M184J2238K0848K9870L8261M5024M9790N2229N1277M5248L2948
56802H67419J4810o661k7561m4118n4315n8517n8513n5800n0710m3319l4720k6705
56790D21290k0109j4240q255k336L018Q078J3389J8591K2734K5483K7105K7280
$$ plain form
56873 336088 323568 314305 308460 305492 305258 308864 317655 331657 349824 371572 397287 427459 462138
56860 462138 501151 543832 588075 630090 665289 689343 698957 692805 672323 641330 604578 566521
56848 566521 530801 499879 474764 455495 442135 435199 435291 442836 458313 482426 515831 558701
56836 558701 610470 669836 735156 804849 876798 946709 1007254 1049709 1067215 1057187 1021688
56825 1021688 966411 898978 826918 756167 690895 633982 586998 549894 521624 501440 489358
56814 489358 485502 489686 501924 522772 552642 590903 635927 685717 737946 789223 834471 867419
56802 867419 882229 875568 848007 803889 749574 691057 632544 576744 526034 482715 447995 421290
56790 421290 401181 386941 378686 376350 379368 387446 400835 419426 442160 467643 494748 522028
56778E22028K4847J8858R414k401j4692k5104l1954l5208l5870l4639l1843k8290
56766C35146k4983k2009j8722j5186j2415j0979j0277r420q036o185m300l241
56754A89393l457m068l813k889k622l222l378k405j351j209j490j401j265j702
56740A55121k335k415j966j384o33K87P45K98m67p55o80q06j106j209j129r68
56724A40598m65L98Q81M59j99n4Q61J655J835J564J047M09o6k44m33p91q98l84
56706A46173M90J337K128K648K332J401J137K085K893K170O54M3L62K39n13n11
56690A65068Q33K185K166J065O2k56k3M76R05J024J042J432K124K507K273J685
56674A84568R32j8q09p19K88J237J235L91n42r30m39Q49K152K424J522N02L28
$$ plain form
56778 522028 546875 565733 575147 572746 558054 532950 500996 465788 429918 395279 363436 335146
56766 335146 310163 288154 269432 254246 241831 230852 220575 211155 203119 196934 192634 189393
56754 189393 185936 181868 178055 175166 172544 169322 165944 163539 162188 160979 159489 158088 156823 155121
56740 155121 152786 150371 148405 147021 146388 146675 147420 147718 147251 146496 145816 145010 143904 142695 141566 140598
56724 140598 140133 140531 141412 141871 141672 141618 142479 144134 145969 147533 148580 148989 148923 148679 148246 147455 146557 146173
56706 146173 146663 148000 150128 152776 155108 156509 157646 159731 162624 164794 165448 165491 165853 166092 165579 165068
56690 165068 165901 168086 170252 171317 171379 171123 171100 171576 172481 173505 174547 175979 178103 180610 182883 184568
56674 184568 185500 185482 184673 183954 184242 185479 186714 187105 186563 185633 185194 186043 188195 190619 192141 192643 192971
56657A92971P07O48j33r35j051n12J44N25O41O56N99L63m6l90l50K24J183K081
56639A97325K326J661N10m10q38j017j020o23j6L2q04j766j914j315q17r56j566
56622A88792k146k141j284j20K17o54j714j895j519j565j968j803q90j17k2j43
56606A71028K9L54N90Q49J181J288J037O75L32j41o34o56r7M72N67M27N07P51
56588A78559Q08O10L48M7m21r72j217q91j60N15Q04O86L40l0j11M64J589K464
56570A83432K488K242K800M061M727M286L923M725O018O487O177O163O747P249
56556B51525P251O799N529K921m58l103m224m282l834k892j681r36r58j187j141
56541B49329j061j257j484j438j248j165j220j433j853k219k133j722j519j594
$$ plain form
56657 192971 193678 194326 194193 193258 192207 191695 191839 192364 193005 193661 194260 194623 194577 194187 193837 194061 195244 197325
56639 197325 199651 201312 201822 201412 200574 199557 198537 197914 197898 197930 197126 195360 193446 192131 191314 190358 188792
56622 188792 186646 184505 183221 183101 183318 182664 180950 179055 177536 175971 174003 172200 171310 171193 171171 171028
56606 171028 171057 171411 172001 172850 174031 175319 176356 177031 177363 177222 176588 175932 175835 176307 176874 177301 177808 178559
56588 178559 179367 179977 180325 180372 179951 178979 177762 176871 176711 177226 178030 178716 179056 179026 178915 179379 180968 183432
56570 183432 185920 188162 190962 195023 199750 204036 207959 212684 218702 225189 231366 237529 244276 251525
56556 251525 258776 265575 271104 274025 273567 270464 266240 261958 258124 255232 253551 252615 251657 250470 249329
56541 249329 248268 247011 245527 244089 242841 241676 240456 239023 237170 234951 232818 231096 229577 227983
56527B27983j449r07m13k36j89k58p39j432j625j288j366k293l099k785j889j730
56511B06285k480k959k271r08n4k63j004j333q87j93N9j87n17q08j221j570j398
56494A88291p56k27J9L84Q67P52k11j127j100m79k09l58j44P41J593J602P48l04
56476A90082r22r37n60k4N26Q02L48q36j898j881r24l2L19O36J248J518Q04l85
56458A87884r43n35J66N14N38N47N80M91L86O55J448K225K180J255L59K51N68
56441A98569M70q4m09k04J87N54R74J160N54o59j453j237m88J22N31Q00P00K38
56423B00325p8pPk97l92J97J008J295J055P30L72j98p10p35l44M2L10O04Q30Q21
56403B04835P43Q26Q72O10L25M99R24Q78K06l61j73N60J175J317J045N09o2k18
$$ plain form
56527 227983 226534 225627 225214 224978 224789 224531 223792 222360 220735 219447 218081 215788 212689 209904 208015 206285
56511 206285 203805 200846 198575 197667 197613 197350 196346 195013 194126 193933 193992 193805 193288 192480 191259 189689 188291
56494 188291 187535 187308 187327 187711 188578 189330 189119 187992 186892 186413 186204 185846 185702 186443 188036 189638 190386 190082
56476 190082 189160 188223 187663 187639 188165 188967 189315 188479 186581 184700 183776 183744 184063 184699 185947 187465 188269 187884
56458 187884 186941 186406 186572 187086 187624 188171 188751 189242 189628 190283 191731 193956 196136 197391 197750 198001 198569
56441 198569 199039 198955 198546 198342 198529 199083 200057 201217 201771 201112 199659 198422 197934 198056 198587 199387 200087 200325
56423 200325 200247 200240 200247 199950 199558 199755 200763 202058 203113 203843 204215 204017 203307 202572 202228 202270 202580 203184 204014 204835
56403 204835 205578 206404 207276 207886 208211 208710 209634 210512 210718 210357 210184 210744 211919 213236 214281 214790 214728 214510
56385B14510M24J595K454K468K015J739J583J014J70j47K23L37l20q01j27J016
56369B28153J234O37N67J341J770J167L77K69N40O36P33J131J502J514J417J443
56353B44431J368J155J200J414J026j02r27p52k71k93l74J74R23J110J103J721
56337B52906K691L063K838K845L237L417L342L580L983L613K317J295J549K577
56323B93253L135K697J713Q83N54O44Q08Q32R28J404K062K284J778J005P36J293
56307C16009K355L393M190M881N500N771N624N565O076O685O407N095L710L115
56293C84376L194L411L550L568L457L528M295N674O930P708Q489R599J0600J1072
56279D69451J1283J1516J1484J1016J0683J1052J1929J2952J4269J6036J7855
$$ plain form
56385 214510 214934 216529 218983 221451 223466 225205 226788 227802 227972 227825 228048 228385 228065 227264 227137 228153
56369 228153 229387 230024 230591 231932 233702 234869 235246 235515 236055 236691 237424 238555 240057 241571 242988 244431
56353 244431 245799 246954 248154 249568 250594 250492 249565 248813 248542 248249 247875 248049 248972 250082 251185 252906
56337 252906 255597 258660 261498 264343 267580 270997 274339 277919 281902 285515 287832 289127 290676 293253
56323 293253 296388 299085 300798 301681 302235 302879 303687 304519 305447 306851 308913 311197 312975 313980 314716 316009
56307 316009 318364 321757 325947 330828 336328 342099 347723 353288 359364 366049 372456 377551 381261 384376
56293 384376 387570 390981 394531 398099 401556 405084 409379 415053 421983 429691 438180 447779 458379 469451
56279 469451 480734 492250 503734 514750 525433 536485 548414 561366 575635 591671 609526
56268F09526J9419K1069K3081K5024K6546K8185L0667L4021L8094M3196M9392
56257I48220N5819O1760O7938P5694Q5249R5695J06318J16995J27550J37678J47305
56246B026221J56232J63624J68516J70639J70074J66493J59304J48222J32998
56237C462323J13172Q8852O1436L2783M056k4113n0845p5191r6634j14795j29136
56226C271908j39577j46768j51113j52273j50376j46748j42472j37115j30020
56217A975446j21950j14173j06594r8372q9848q2323p6181p0630o5116n9753n4521
56206A035985m9268m4454m0748l7974l5443l2996l0756k8248k4892k1138j8028
56195F72040j5822j4085j2658j1536j0277q647p402p165p166o361n190m696m523
$$ plain form
56268 609526 628945 650014 673095 698119 724665 752850 783517 817538 855632 898828 948220
56257 948220 1004039 1065799 1133737 1209431 1294680 1390375 1496693 1613688 1741238 1878916 2026221
56246 2026221 2182453 2346077 2514593 2685232 2855306 3021799 3181103 3329325 3462323
56237 3462323 3575495 3664347 3725783 3758566 3762622 3738509 3687664 3612473 3515839 3401044 3271908
56226 3271908 3132331 2985563 2834450 2682177 2531801 2385053 2242581 2105466 1975446
56217 1975446 1853496 1739323 1632729 1534357 1444509 1362186 1286005 1215375 1150259 1090506 1035985
56206 1035985 986717 942263 901515 863541 828098 795102 764346 736098 711206 690068 672040
56195 672040 656218 642133 629475 617939 607662 599015 591613 584448 577282 570921 565731 561035 556512
56182E56512l541k087j615k262k568j781p26j74J25M99Q35J197J776K173J976
56167E50339J909L016M807N765N682N802O658P466P876Q604R912J1029J1634J2427
56153F52926J3849J5549J7564K0667K5056K9933L4763L9818M5203N0628N6393
56142A002349O3254P0956P8111Q3789Q7849Q9480Q6997P9775O9369N8183M8027
56131A818139M0122L5132L2482L0563K7951K3834J7513Q805r40r510j5860k0602
56119A987629k4763k9315l5623m4669n5580o6214p5208q2194q6314q6321q2343
56108A319085p5913o8170n9417n0407m2256l4978k7825k1164j6316j3364j0941
56097H98334q358o189m620l034j454n87j66Q77K519L658M163M933N863N852N031
$$ plain form
56182 556512 552971 550884 549269 547007 544439 542658 541932 541758 541883 542382 543217 544414 546190 548363 550339
56167 550339 552248 555264 560071 565836 571518 577320 583978 591444 599320 607924 617836 628865 640499 652926
56153 652926 666775 682324 699888 720555 745611 775544 810307 850125 895328 945956 1002349
56142 1002349 1065603 1136559 1214670 1298459 1386308 1475788 1562785 1642560 1711929 1770112 1818139
56131 1818139 1858261 1893393 1925875 1956438 1984389 2008223 2025736 2034541 2033601 2024091 2008231 1987629
56119 1987629 1962866 1933551 1897928 1853259 1797679 1731465 1656257 1574063 1487749 1401428 1319085
56108 1319085 1243172 1175002 1115585 1065178 1022922 987944 960119 938955 922639 909275 898334
56097 898334 889976 883787 879167 876133 874679 874092 873926 874803 877322 880980 885143 890076 895939 901791 906822
56082I06822M842N678O510P083Q255R903J0801J0878J1373J2386J2667J2141J2216
56069A031555J3219J4026J4541J5883J7737J8356J7744J7903J9273J9944J9227
56058A219408J8906J9760J9935J8169J5851J4464J3630J2977J3299J4495J4968
56047A395862J4308J4156J5264J6362J6926J8207K0396K1752K1782K2340K4289
56036A601644K6057K6722K7529K9087L0322L1298L3730L7409L9685L9842M0261
56025A963586M1836M2379M1255M1300M3997M6894M8191M9781N3206N6548N8090
56014B487063N9305O1615O3889O5615O8653P3449P7536Q0088Q3689Q9225R3788
56003C303915R6270J00019J07019J14508J20411J26833J34870J41593J45890J51687
$$ plain form
56082 906822 911664 917342 923852 930935 939190 949093 959894 970772 982145 994531 1007198 1019339 1031555
56069 1031555 1044774 1058800 1073341 1089224 1106961 1125317 1143061 1160964 1180237 1200181 1219408
56058 1219408 1238314 1258074 1278009 1296178 1312029 1326493 1340123 1353100 1366399 1380894 1395862
56047 1395862 1410170 1424326 1439590 1455952 1472878 1491085 1511481 1533233 1555015 1577355 1601644
56036 1601644 1627701 1654423 1681952 1711039 1741361 1772659 1806389 1843798 1883483 1923325 1963586
56025 1963586 2005422 2047801 2089056 2130356 2174353 2221247 2269438 2319219 2372425 2428973 2487063
56014 2487063 2546368 2607983 2671872 2737487 2806140 2879589 2957125 3037213 3120902 3210127 3303915
56003 3303915 3400185 3500204 3607223 3721731 3842142 3968975 4103845 4245438 4391328 4543015
55993D543015J61326J71488J79687J88919K01603K15081K27691K42823K62078
55984F393711K81247K98374L18742L46078L76056M04712M35820M73365N14504
55975I842609N57199O06899O68003P36830Q10802Q95957R97303J111379J237344
55966A7464325J385379J564771J775243K020839K320611K694815L155230L723305
55958C6104518M444676N374120O564761Q085115J0017649J2409909J5237974J8424390
55950A16663112K1846830K5300728K8508875L1200356L3050117L3369607L0943195
55943C20882820K4558488J4065662R85017j2068226k2707834k9731223l3134823
55936B62849881l3573292l1888408k8896911k5293215k1585846j8098533j5015886
$$ plain form
55993 4543015 4704341 4875829 5055516 5244435 5446038 5661119 5888810 6131633 6393711
55984 6393711 6674958 6973332 7292074 7638152 8014208 8418920 8854740 9328105 9842609
55975 9842609 10399808 11006707 11674710 12411540 13222342 14118299 15115602 16226981 17464325
55966 17464325 18849704 20414475 22189718 24210557 26531168 29225983 32381213 36104518
55958 36104518 40549194 45923314 52488075 60573190 70590839 83000748 98238722 116663112
55950 116663112 138509942 163810670 192319545 223519901 256570018 289939625 320882820
55943 320882820 345441308 359506970 360491987 348423761 325715927 295984704 262849881
55936 262849881 229276589 197388181 168491270 143198055 121612209 103513676 88497790
55929H8497790j2412592j0271585q528375p118627n986315n071656m319931l698069
55921C1090640l186417k761052k398358k088462j828610j608821j416591j249226
55913A4553103j108775r89961q84362p91229p13393o47239n86803n33043m89330
55904G808968m52206m15836l81459l53390l29614l05132k80960k61204k44461
55895D784706k26390k07973j93235j81263j68111j54309j43227j34141j23941
55886C252116j13833j07594j04734j01667r8052r5970r4450r0735q5556q1610
55876B277915p8234p3019o7137o3673o2062n9458n6230n4844n4499n2223m8287
55865A608249m5447m3649m0472l6205l3620l3094l2391l1006l0439l0567k9739
$$ plain form
55929 88497790 76085198 65813613 57285238 50166611 44180296 39108640 34788709 31090640
55921 31090640 27904223 25143171 22744813 20656351 18827741 17218920 15802329 14553103
55913 14553103 13444328 12454367 11570005 10778776 10065383 9418144 8831341 8298298 7808968
55904 7808968 7356762 6940926 6559467 6206077 5876463 5571331 5290371 5029167 4784706
55895 4784706 4558316 4350343 4157108 3975845 3807734 3653425 3510198 3376057 3252116
55886 3252116 3138283 3030689 2925955 2824288 2726236 2630266 2535816 2445081 2359525 2277915
55876 2277915 2199681 2126662 2059525 1995852 1933790 1874332 1818102 1763258 1708759 1656536 1608249
55865 1608249 1562802 1519153 1478681 1442476 1408856 1375762 1343371 1312365 1281926 1251359 1221620
55854A221620k8172k7508k7451k6410k4865k4570k5117k4775k3980k4366k5199
55843I39207k4417k2442k1385k1104j9782j7717j6852j7056j6462j5107j4656
55832G32227j4881j3944j1883j0477r857q566o758o094o648p067p484r070j1027
55819F08471j1322j0255r971j0669j0547r453r100r507q646o138m086l643l557
55806E01577k805j907j011P37L222N028N659O033O502O343N430M314K755K62k177
55791E39962l071k965l602m880n253m857n316o430o144m225l031l860n159n288
55777D75881m540l464j448J925N952J0106J4599J8933K1434K0758J6573Q846j661
55764E83894j2143j9184k1969k2425k2061k0659j8213j5801j3936j1996r914q638
$$ plain form
55854 1221620 1193448 1165940 1138489 1112079 1087214 1062644 1037527 1012752 988772 964406 939207
55843 939207 914790 892348 870963 849859 830077 812360 795508 778452 761990 746883 732227
55832 732227 717346 703402 691519 681042 671185 662619 655861 649767 643119 636052 628568 619498 608471
55819 608471 597149 586894 576923 566254 555707 546254 537154 527647 519001 512863 508777 505134 501577
55806 501577 498772 496865 495854 496591 499813 504841 510500 516533 523035 529378 534808 539122 541877 542139 539962
55791 539962 536891 533926 530324 525444 520191 515334 510018 503588 497444 493219 490188 486328 481169 475881
55777 475881 471341 467877 466429 468354 474306 484412 499011 517944 539378 560136 576709 585555 583894
55764 583894 571751 552567 530598 508173 486112 465453 447240 431439 417503 405507 395593 386955
55752C86955q351q014p158o486o279n821m746l409j808K44J864J864Q52N39R28
55737C41174L37j708l869n508p337r114r300p793o625o937p506p241o939p279
55723B54355p209n814m010k943k200j022J67P32J123J978L038L981N144O488O964
55708B60772N894L898J725o40k964m237m196m147n231o916q065q454q289p370
55694B11780n838m730m732n065m550l159j730q63o64r44j002k5J793L162L250
55679A86683K611K222K367K786L121K852J615j00j385k092k717l110k547j228
55665A91078l71m99q16o29j83K54R07J703K172K393K835L098K280Q48N20J764
55649B07354L057L145K483J783P98n44j392j370j420k306l489m356n259o344o739
$$ plain form
55752 386955 378604 370590 363432 356946 350667 344846 340100 336691 334883 335127 336991 338855 339707 340246 341174
55737 341174 341511 339803 335934 330426 323089 313975 304675 296882 290257 283320 275814 268573 261634 254355
55723 254355 247146 241332 237322 234379 232179 231157 231324 232056 233179 235157 238195 242176 247320 253808 260772
55708 260772 266666 270564 272289 271649 268685 264448 260252 256105 250874 243958 235893 227439 219150 211780
55694 211780 205942 201212 196480 191415 186865 183706 181976 181113 180449 179505 178503 178478 180271 183433 186683
55679 186683 189294 191516 193883 196669 199790 202642 204257 204157 202772 200680 197963 194853 192306 191078
55665 191078 190707 190208 189392 188763 188580 188834 189741 191444 193616 196009 198844 201942 204222 205070 205590 207354
55649 207354 210411 213556 216039 217822 218620 218076 216684 215314 213894 211588 208099 203743 198484 192140 185401
55634A85401n935m840m388m145l373k385j775j186RJ573K808L482L681L487L285
55619A75699L488L630K773J179J79l4q10k566l722l168k061j847k042j542o73
55604A68483k88k5P37J232M23r82j462j037j021j781k452k650k899l365l539l302
55588A46072l181l419l631l450k931k269j729j591j755j675j077l35K82J082K157
55573A22550K872K737K232K100K422K874L251L200K228N26r46j735k428l362l867
55558A34654l468k852k760k904k786k652k759k657k064j564j569j520j032o79
55544A03388p45l69Q38J611R02k15k2J281K123J949J398P35k60j154j204o57m36
55527A09163p59j174j535j821j507l85N06P8j159j913k028k193k286j698r14j054
$$ plain form
55634 185401 179466 174626 170238 166093 162720 160335 158560 157374 157383 158956 161764 165246 168927 172414 175699
55619 175699 179187 182817 185590 186769 186948 186914 186104 183538 179816 176648 174587 172740 170698 169156 168483
55604 168483 168195 168170 168907 170139 170562 169580 168118 167081 166060 164279 161827 159177 156278 152913 149374 146072
55588 146072 142891 139472 135841 132391 129460 127191 125462 123871 122116 120441 119364 119029 119311 120393 122550
55573 122550 125422 128159 130391 132491 134913 137787 141038 144238 146466 146992 146046 144311 141883 138521 134654
55558 134654 131186 128334 125574 122670 119884 117232 114473 111816 109752 108188 106619 105099 104067 103388
55544 103388 102643 102274 103112 104723 105625 105410 105388 106669 108792 110741 112139 112874 112614 111460 110256 109599 109163
55527 109163 108404 107230 105695 103874 102367 101982 102488 102566 101407 99494 97466 95273 92987 91289 90375 89321
55511H9321j953k260j514o32k43NL09K66j68l95j92l5j85k62M7N99J136J393J063
55492H6300L64K07J017J842J595P10M22R78J730K498L450L996L433K434K347L056
55476A16379L131K134J174R10O59j45j031j597k245l216l943l932l441k890k427
55461I9520k270k559k729k063j017q63j762k348j640k71O36P95M47k77j107j502
55445H0990j290q15k50M95J054P81q1m10J63O36K01n86q00m96k40l4M58J034J064
55426H1874L80m48o82j01P31R03J39p70r31n22l32m06m5Q43J437J185M54k63r30
55407H2516j461j479j001o44q10j263j737k225k418j731k51J021J369J132R43
55392G1961Q62O49L29L2k52l76j11L00K52k37l31M02J190J019r9j239j636j196
$$ plain form
55511 89321 87368 85108 83594 82962 82719 82724 83033 83299 83131 82736 82544 82509 82324 82062 82109 82708 83844 85237 86300
55492 86300 86664 86871 87888 89730 91325 92035 92457 93435 95165 97663 101113 105109 108542 110976 113323 116379
55476 116379 119510 121644 122818 123728 124387 124242 123211 121614 119369 116153 112210 108278 104837 101947 99520
55461 99520 97250 94691 91962 89899 88882 88019 86257 83909 82269 81998 82634 83429 83876 83599 82492 80990
55445 80990 79700 78885 78635 79130 80184 80965 80884 80474 80637 81273 81474 80888 80088 79592 79352 79318 79776 80810 81874
55426 81874 82254 81806 81124 81023 81754 82657 82796 82026 81095 80573 80241 79835 79790 80633 82070 83255 83709 83446 82516
55407 82516 81055 79576 78575 77931 77121 75858 74121 71896 69478 67747 67496 68517 69886 71018 71961
55392 71961 72823 73472 73801 73833 73581 73205 73094 73394 73646 73409 73078 73480 74670 75689 75590 74351 72715 71519
55374G1519l47L09M41L21M50P84Q06L92L8K0m2n15j156j493j339p08K59J064J059
55355G1862K60m69l87K57O07K14n53r60o55j06p4n67o39K91J400J463N64j15j3
55336G2380K55R1l71q90j508k007j866j100m09k31k91l28m73o60m56J92P10P80
55318F3818P36Q23P71M34J57J75K48K49L52M05j10j064j465p40M04R31O63N7n63
55299F6281r72p79J78J421K275K436J963J110L26k8j84o85j503k050k054j752
55283F5983j146RJ298J769J276P62P55O19j38q84r38o90p58q34l49L67O04M43
55265F8148M63O53N68K91L00N26L72l04r36r85m82J85N43K47n59j195j091m18
55247F6326J82L79L81N39R64J385J299M59o64j259j068n05N6N90R16N71m72j460
$$ plain form
55374 71519 71172 71481 71922 72243 72693 73477 74283 74675 74713 74733 74691 74176 73020 71527 70188 69480 69739 70803 71862
55355 71862 72122 71653 71266 71523 72130 72344 71791 70831 70176 70070 69996 69429 68790 69081 70481 71944 72508 72393 72380
55336 72380 72635 72726 72355 71465 69957 67950 66084 64984 64575 64344 64053 63725 63252 62592 62136 62328 63038 63818
55318 63818 64554 65377 66148 66582 66739 66914 67162 67411 67763 68168 68058 66994 65529 64789 65193 66124 66787 66844 66281
55299 66281 65309 64530 64708 66129 68404 70840 72803 73913 74239 74211 74027 73342 71839 69789 67735 65983
55283 65983 64837 64846 66144 67913 69189 69951 70706 71325 71187 70303 69365 68675 67917 67083 66734 67101 67705 68148
55265 68148 68611 69264 69832 70123 70423 70949 71321 71017 70081 69096 68614 68799 69342 69589 69030 67835 66744 66326
55247 66326 66508 66887 67268 67807 68771 70156 71455 71914 71250 69991 68923 68418 68474 69064 69980 70551 70079 68619
55229F8619j662j089k85K74L60J07nL15O11K85k99k08N61R98P46O23J085J324
55211G2360O56k77n51l05j03J89Q60J337Q53k06p18l43K66N91P14P99P88O20L06
55192G7836j51n36m51N3L39M1l96m60l55m66o13m48j12J15L67P82R82O31J8m43
55172G6733q04j075p61K66J030N36p82j593j323m25O21J563J953J438M99J9J20
55155G8015J56j89n12m41m9M33P77O86P2o12q09n45k47j03n2k02o23r57q63o65
55135G3270r68j664j971j394k64P36J121Q04J05m70o81o79n94l10J70N53P20Q56
55117F9340R64P90N08P44J521K005J696J139Q82O46J39j13L18Q31P31L83M98Q52
55099H3874P17N3o63j258j629j321l09M45K18k59Q1R88J553J799K289K685K221
$$ plain form
55229 68619 66957 65868 65583 65857 66217 66324 66319 66634 67245 67530 67231 67023 67584 68582 69328 69951 71036 72360
55211 72360 73016 72739 72188 71883 71780 71969 72829 74166 75019 74813 74095 73752 74018 74609 75323 76122 76910 77530 77836
55192 77836 77685 77149 76698 76751 77090 77131 76735 76275 75920 75454 74841 74393 74281 74396 74763 75545 76527 77158 77176 76733
55172 76733 75929 74854 74093 74359 75389 75925 75143 73550 72227 71802 72423 73986 75939 77377 77876 77895 78015
55155 78015 78171 77982 77470 77029 76980 77413 78190 78876 78948 78336 77527 76982 76735 76632 76580 76378 75755 74798 73935 73270
55135 73270 72302 70638 68667 67273 67009 67745 68866 69670 69775 69305 68624 67945 67351 67041 67211 67764 68484 69340
55117 69340 70304 71094 71602 72346 73867 75872 77568 78707 79589 80235 80374 80261 80579 81410 82141 82524 83022 83874
55099 83874 84591 84644 83981 82723 81094 79773 79464 79909 80127 79868 79949 80937 82490 84289 86578 89263 91484
55082I1484J229P60Q64P19J88j04q5k50m94l09K7j02k50M56J400J032n98j643
55064I4324j168l43m23j096j504j502j225n96P3J02m40p21n96q02j332j053L86
55047H2084J645J493L90n75j124j381j136m75j87o18r67n85k0Oj50J26M85K51
55029G9262l39n24j61L33P42R84Q28L39P7K70L54j8k79RK03m13j320j453p28M7
55009G8213L96M17K33O2M58J558K413K015O83m15q79j206j514j278l76N11Q66
54992H2157R19J051J201J145Q88N09m7p85j462j717j339m49M32P56M97J95K53
54975H4204M72N09N24R25J666K208K082J300K81m17m86j55K4j85m77n13l70l10
54957I1282l96m64l23P3N25O89N55O03J069J311O14n62j008m32J97J59j82l18
$$ plain form
55082 91484 92713 93473 94337 95056 95244 95140 95055 94805 94311 94002 94029 93927 93677 94133 95533 96565 95967 94324
55064 94324 93156 92813 92390 91294 89790 88288 87063 86467 86540 86642 86202 85481 84885 84083 82751 81698 82084
55047 82084 83729 85222 85612 85037 83913 82532 81396 80921 80734 80116 79149 78564 78544 78550 78400 78526 79011 79262
55029 79262 78923 78399 78238 78571 79313 80297 81125 81464 81541 81811 82165 82147 81868 81877 82080 81667 80347 78894 78166 78213
55009 78213 78609 79026 79259 79321 79779 81337 83750 85765 86448 86033 85154 83948 82434 81156 80780 81291 82157
54992 82157 83076 84127 85328 86473 87361 87870 87823 87038 85576 83859 82520 82071 82503 83259 83756 83951 84204
54975 84204 84676 85185 85709 86634 88300 90508 92590 93890 94171 93754 93268 93113 93137 92952 92475 91962 91592 91282
54957 91282 90886 90422 90099 90172 90697 91386 91941 92544 93613 94924 95538 94976 93968 93536 93733 93892 93710 93392
54939I3392l56l83j0Q16J397J365J354J925K553K500J996J731J784J930K440L605
54923A18039M921N651N866O143O588O950P327P861Q077P372N932M309K432p7k876
54908A94515n125o624p797q687q882q441p878p152n681l578k010j847k551k830
54894A15432k047p77j38o16j411j179K71J522J281J57r6J188L034M319M845M893
54878A30678M758M972O024P570Q585Q635Q281P915O966M789J792r08k679l827
54864A93551n042o651q314r298r252q647q146p627o429m510k769j951j832j842
54850A11241j984k591l474l803k936j228J65L04n88j435j596j463j514j334l89
54835H7375P47R00M0n89k30N64J088J437J695J304P9r79q79j18J07l13m50N6O02
$$ plain form
54939 93392 93036 92653 92643 93459 94856 96221 97575 99500 102053 104553 106549 108280 110064 111994 114434 118039
54923 118039 122960 128611 134477 140620 147208 154158 161485 169346 177423 184795 190727 195036 197468 197391 194515
54908 194515 189390 182766 174969 166282 157400 148959 141081 133929 128248 124670 122660 120813 118262 115432
54894 115432 113385 112608 112470 111854 110443 109264 109535 111057 112338 112495 112399 113587 116621 120940 125785 130678
54878 130678 135436 140408 146432 154002 162587 171222 179503 187418 194384 199173 200965 200057 197378 193551
54864 193551 188509 181858 173544 164246 154994 146347 138201 130574 124145 119635 116866 114915 113083 111241
54850 111241 109257 106666 103192 99389 96453 95225 95390 95694 95106 93671 92075 90612 89098 87764 87375
54835 87375 88122 89022 89062 88473 88243 88807 89895 91332 93027 94331 94410 93431 92552 92434 92541 92228 91778 91834 92436
54816I2436P86Q47Q06K30p23j029j93Q41R02J81k12J05M70M04K75N48J035J235
54798I8944J026O12J11m71r78j168r55m65J34O70R72R69P35L87k4m20o09l81L32
54779I9421J300K005J980J350R10J261J972K174J920K168L273M413N001N744P420
54764A42312R337J0137R682Q963Q381P349N673L933K261p5l285o341q217r014
54750A81096r266q992q097o981n926m640l078k040k118k637k589k065j784j702
54736A19181j170k41L53M31N07P22O55L90P16J912L179L797M098M753N615N984
54720A50882N754N635O191P080P366O449M514K189j18k368m555o472p869q604
54706A66074q597p972p217o761o316n134l190j472p65p84r85j527k589l418l082
$$ plain form
54816 92436 93222 94069 94875 95105 94382 93353 93160 94001 94903 95084 94872 94977 95447 95851 96126 96674 97709 98944
54798 98944 99970 100582 100693 100222 99244 98076 97121 96656 96790 97460 98432 99401 100136 100523 100499 100079 99470 99089 99421
54779 99421 100721 102726 104706 106056 106966 108227 110199 112373 114293 116461 119734 124147 129148 134892 142312
54764 142312 151649 161786 171468 180431 188812 196161 201834 205767 208028 207953 204668 198327 190110 181096
54750 181096 171830 162838 154741 147760 141834 137194 134116 132076 129958 127321 124732 122667 120883 119181
54736 119181 118011 117770 118123 118554 119061 119783 120438 120828 121544 123456 126635 130432 134530 139283 144898 150882
54720 150882 156636 162271 168462 175542 182908 189357 193871 196060 195942 193574 189019 182547 174678 166074
54706 166074 157477 149505 142288 135527 129211 124077 120887 119415 118650 117866 116881 115354 112765 109347 106265
54691A06265j907j090j028j041p84p49j178j454j121o39n62o10k17M14N06k20
54675I4585j144j347m70R88K006J891Q78k21r43j476k018k334k176j739j353j000
54659H4127m43L44J189J977K578K656J891N44n28o98k89k13p90j252p34M45J038
54642I1842M37n61q34k58M73R42J323J750K025J977J699J281O52k49j255j973
54626I9271j973j175j99Lq32j880k136j519p08k07nP9K39P22J530K170K139J484
54608I7003O08k71j004j211p29r9N5l0L55J156J544J216Q39R26J022M44o46j391
54590I9787j245m91J41K03q8j62J75N65P07P94R53P48j96j393j942j661j030l46
54572I5519M32J057J095O91M91O78P54M03j06m27n20l87k9L12M33O37J292K032
$$ plain form
54691 106265 104358 103268 102240 101199 100415 99666 98488 97034 95913 95274 94712 94102 93885 94299 94805 94585
54675 94585 93441 92094 91624 92612 94618 96509 97387 97166 96223 94747 92729 90395 88219 86480 85127 84127
54659 84127 83684 84028 85217 87194 89772 92428 94319 94863 94335 93637 93348 93135 92345 91093 90359 90804 91842
54642 91842 92279 91718 90884 90626 91099 92041 93364 95114 97139 99116 100815 102096 102748 102499 101244 99271
54626 99271 97298 96123 95924 95927 95095 93215 91079 89560 88852 88645 88640 88719 88958 89680 91210 93380 95519 97003
54608 97003 97611 97340 96336 95125 94396 94297 94352 94322 94677 95833 97377 98593 99432 100358 101380 101824 101178 99787
54590 99787 98542 98051 98192 98395 98307 98145 98320 98885 99592 100386 101339 102087 101891 100498 98556 96895 95865 95519
54572 95519 95951 97008 98103 98794 99285 99963 100717 101120 101014 100587 100067 99680 99651 99963 100396 101033 102325 104357
54554A04357K150J662J136N45o30k055k506j556k76K64K49L26M99M89M39N64O66
54537A06323N92N96P46N72j52q82j087r58q09n37j65j93o89q55k59K79l9n93l07
54518A01583N63R10O03N22R00R79M88J51L58M02l32j262j373n97J99L67L7l27
54500A04171m94n18m94m03k10M6L13O16R23R74O14K30L86Q92Q73K0q42r28o04
54481A05565o32p99k10J191K321K310J399L98j80k20J44M85M02J14M22J704L274
54464A17688M005L448K099P11l15r56j274j328j314j516j918k003j337l15R5m64
54448A15306j236j373j016q64j014r15l64J25J17j19j15Q4J17n1p5K27N67N86
54430A09987L35J93L29N13N01L61L04L14K53J62J58J61N2kJ62K12k82r48q33K55
$$ plain form
54554 104357 106507 108169 109305 109850 109220 107165 104659 103103 102827 103091 103340 103666 104165 104654 105093 105657 106323
54537 106323 106915 107511 108257 108829 108677 107795 106708 105750 104941 104404 104239 104046 103357 102502 102243 102522 102483 101890 101583
54518 101583 102146 103056 103659 104181 105081 106060 106548 106699 107057 107459 107127 105865 104492 103895 104094 104461 104498 104171
54500 104171 103677 103159 102665 102262 102052 102098 102411 103027 103950 104924 105538 105768 106154 107046 107919 107939 107097 106169 105565
54481 105565 104933 104134 103924 105115 107436 109746 111145 111543 111363 111143 111287 111772 112174 112288 112710 114414 117688
54464 117688 121693 125141 127240 127951 127636 126680 125406 124078 122764 121248 119330 117327 115990 115675 115770 115306
54448 115306 114070 112697 111681 110817 109803 108888 108524 108649 108766 108647 108532 108616 108733 108682 108607 108834 109401 109987
54430 109987 110322 110515 110844 111357 111858 112219 112523 112837 113090 113252 113410 113571 113623 113621 113783 113995 113713 112765 111932 112187
54410A12187J314J474J079R21R80O90J05j35J38L76K23K5J79N35P14O92P34Q90
54392A23121R00O03K69L52Q57J124N37o15j395j332q89o12l86Q4N59O02L82M98
54374A24659J026J393J242R86J258K067K769K741K046J351J225J507J565J146
54360A46981O99O83R02P58Qr90j635j581j034o08p30j123j199r27q11j000j054
54343A37339r07j249k404l460l295k092j062r19j352j803j949j503l16J158K113
54328A18299K210J724R01k42j429k074j903j249m64M61J468K096J839P92l69r65
54312A21095q68n39n00o78n34O5M21j30j217j801j407m86L62R16J093Q09L30K34
54294A17165O84J103Q70J28m38m68k06r0k48n21p37p93n41J38J013J513J370J079
$$ plain form
54410 112187 113501 114975 116054 116975 117955 118645 118750 118615 118753 119129 119352 119377 119556 120091 120805 121497 122231 123121
54392 123121 124021 124624 124893 125245 126102 127226 127763 127148 125753 124421 123532 122920 122534 122618 123177 123779 124161 124659
54374 124659 125685 127078 128320 129306 130564 132631 135400 138141 140187 141538 142763 144270 145835 146981
54360 146981 147680 148363 149265 150023 150031 149041 147406 145825 144791 144183 143453 142330 141131 140204 139393 138393 137339
54343 137339 136432 135183 132779 129319 126024 123932 122870 121951 120599 118796 116847 115344 115028 116186 118299
54328 118299 120509 122233 123134 122892 121463 119389 117486 116237 115773 116234 117702 119798 121637 122429 122060 121095
54312 121095 120227 119688 119188 118510 117976 118041 118462 118332 117115 115314 113907 113421 113783 114699 115792 116601 116931 117165
54294 117165 117849 118952 119822 119950 119512 119044 118838 118748 118500 117979 117242 116449 115908 116046 117059 118572 119942 121021
54276A21021J275J764J710R08J38KO6l08r08j100q57o27m48k3N48Q38Q90J147
54258A26036J624J781J353P02K18k9J3M46R86R91K24q11j463j516j115m83Q5L55
54240A29397M09N00N84L77n8k22P3K97j26r48j304p43K62Q70P66L50O6j62n82
54221A29806r56p40K4N73L95j87o60r40j011n69L03P24K9j150j631j182n04l3
54203A22291L47N65L49n6m0L98O56N53N59Q14Q21L40j32j04L35Q40J177J099N08
54184A31320q9m1M74O49L78N17J510K629L045K835K461J940J147L16l38j008j834
54167A45911k443k486k143j741j270p56n90r90j556j810j786j646j201l34M86
54152A25645O91L60Lj77l77p94j406j931j857q90M24J025N69j86n14n57o27m35
$$ plain form
54276 121021 122296 124060 125770 126678 126816 126818 126884 126576 125668 124568 123711 123084 122636 122613 123161 123999 124889 126036
54258 126036 127660 129441 130794 131496 131714 131685 131698 132144 133130 134121 134345 133534 132071 130555 129440 128957 129042 129397
54240 129397 129806 130306 130890 131267 131209 130987 131060 131357 131231 130283 128979 128236 128498 129368 130134 130484 130550 130388 129806
54221 129806 128850 128110 128134 128707 129102 128915 128255 127315 126304 125735 126038 126762 126791 125641 124010 122828 122324 122291
54203 122291 122638 123203 123552 123496 123456 123854 124510 125063 125622 126436 127257 127597 127465 127361 127696 128536 129713 130812 131320
54184 131320 131231 131190 131664 132313 132691 133208 134718 137347 140392 143227 145688 147628 148775 149091 148753 147745 145911
54167 145911 143468 140982 138839 137098 135828 135072 134482 133492 131936 130126 128340 126694 125493 125159 125645
54152 125645 126336 126696 126699 126522 126145 125351 123945 122014 120157 119267 119691 120716 121285 121099 120585 120028 119401 118966
54134A18966L03J078J212Q41N74N55N69O93J056J277R58M98O07J145J282P66K04
54117A32584J01L26O25R42J133J018Q89J323K285L014L043K750K615K477J977
54102A57102J252P35M79J35m70j072j355j354j315j290j004k96M46N49j22r28
54086A51492j180r39p78r87j366j665j816j746j296m24P23J944K976L415K980
54071A51333J950J085R78J521K060J992J257K98m12p83r36q27l15L70O39K64k50
54054A60224k82J67O42R00J097J423J850K157K113J784J733K509L811M590M394
54039A89112M060M540N460N661M932M319M581N221N307M657L763L057K703K730
54025B50103K916K662J546m6j176j394j202j342j881k325k501k873l765m651m753
$$ plain form
54134 118966 119269 120347 121559 122400 122974 123529 124098 124791 125847 127124 128082 128580 129187 130332 131614 132380 132584
54117 132584 132685 133011 133636 134578 135711 136729 137618 138941 141226 144240 147283 150033 152648 155125 157102
54102 157102 158354 159089 159568 159703 159233 158161 156806 155452 154137 152847 151843 151547 151993 152542 152420 151492
54086 151492 150312 149373 148595 147608 146242 144577 142761 141015 139719 139295 140018 141962 144938 148353 151333
54071 151333 153283 154368 155346 156867 158927 160919 162176 162474 162062 161279 160343 159516 159201 159571 160210 160474 160224
54054 160224 159942 160109 160751 161651 162748 164171 166021 168178 170291 172075 173808 176317 180128 184718 189112
54039 189112 193172 197712 203172 208833 213765 218084 222665 227886 233193 237850 241613 244670 247373 250103
54025 250103 253019 255681 257227 257181 256005 254611 253409 252067 250186 247861 245360 242487 238722 234071 229318
54010B29318m158l803m225m888m980m474l962l806l849l809l511k856j916j018
53996A78063m78l45n89j285k315l154l362l126k851k442j511k05P99J171J242
53981A59612J416J676J906K145K361K346K137K119K460K812K855K830L133L679
53967A93487M014L874L192J809k98k410l390k850j687j095j308j656j607j299
53953A88776j013o75j40M26P96J133J850K995M098M663M626M347M282M618N089
53938B25871N204M804M250L928L735L376K926K661K499K118J625J553K070K762
53924B69382L258L652M042M277M367M666N221N507N193M811N076N850O374O257
53910C37933N672M667L000P69j242k253k339k356k967l842m034l253k434k682
$$ plain form
54010 229318 225160 221357 217132 212244 207264 202790 198828 195022 191173 187364 183853 180997 179081 178063
53996 178063 177585 177240 176651 175366 173051 169897 166535 163409 160558 158116 156605 156400 157199 158370 159612
53981 159612 161028 162704 164610 166755 169116 171462 173599 175718 178178 180990 183845 186675 189808 193487
53967 193487 197501 201375 204567 206376 206078 203668 200278 197428 195741 194646 193338 191682 190075 188776
53953 188776 187763 187088 186948 187374 188170 189303 191153 194148 198246 202909 207535 211882 216164 220782 225871
53938 225871 231075 235879 240129 244057 247792 251168 254094 256755 259254 261372 262997 264550 266620 269382
53924 269382 272640 276292 280334 284611 288978 293644 298865 304372 309565 314376 319452 325302 331676 337933
53910 337933 343605 348272 351272 352041 350799 348546 346207 343851 340884 337042 333008 329755 327321 324639
53896C24639l892m998n547o169p257q115p999p316o966p028o901o391n798n098
53882B35164m037k952k633l150l626l460l055k991l118k965k532k173j982j800
53868A94690j678j848k309k769l022l084k944k470j715j068q24p70m98o9K7k68
53852A69381k76M75J391J465O17k86o82q06q66n74P2L62j50p90n71M26J204J133
53834A71525M70k36o48o01j15M34N35M7o71j048o42N20J777K307J993J479J188
53817A78314Q66L73K77J031K105K708K933L331L770L693L315L512M432N194N132
53802B20986M634M407M571M763M678M215L464K729K228J782J153N89N56R74J220
53787B62949R51L77k29q18j362j837k487l442m279m438m162m217m738n023m687
$$ plain form
53896 324639 320747 315749 310202 304033 296776 288661 280662 273346 266380 259352 252451 246060 240262 235164
53882 235164 231127 228175 225542 222392 218766 215306 212251 209260 206142 203177 200645 198472 196490 194690
53868 194690 193012 191164 188855 186086 183064 179980 177036 174566 172851 171783 170959 170189 169691 169622 169649 169381
53852 169381 169105 169580 170971 172436 173053 172767 172085 171279 170413 169839 169911 170273 170123 169333 168762 169188 170392 171525
53834 171525 171995 171759 171111 170510 170395 170829 171364 171411 170740 169692 169050 169570 171347 173654 175647 177126 178314
53817 178314 179180 179553 179830 180861 182966 185674 188607 191938 195708 199401 202716 206228 210660 215854 220986
53802 220986 225620 230027 234598 239361 244039 248254 251718 254447 256675 258457 259610 260199 260755 261729 262949
53787 262949 263900 264277 264048 263230 261868 260031 257544 254102 249823 245385 241223 237006 232268 227245 222558
53772B22558m201m020l912l534l089k955l072l134l038k859k619k352k106j751
53758A79916j101l72j84q16j785k313k020j143k80M4j73m03k09K49O09Q86J207
53741A72112J353J116Q70R73R72K87n58m84M20R40O54M47Q75J240R23M89O66J193
53723A84488J527J780K144K181J655J308J781K369J986Q48J29K75P59J249J910
53708B06389K526K512J886J393J442J699J892K194K572K497J810J271J702K950
53694B34735M077M461M278L960L526K658J354J90l36n12j005j763j931j128j58
53679B52406Rn71j215j675k038j997j131J73R43Q78N98N87N95L48J42K82M95L16
53661B49145k17o73p44m00J73N88M66n2l21lM62N29L93O33J144J128K95m38M5
$$ plain form
53772 222558 218357 214337 210425 206891 203802 200847 197775 194641 191603 188744 186125 183773 181667 179916
53758 179916 178815 178443 178259 177443 175658 173345 171325 170182 169902 169946 169773 169370 169161 169410 170019 170905 172112
53741 172112 173465 174581 175451 176424 177396 177683 177125 176641 177061 178001 178655 179102 179977 181217 182140 182629 183295 184488
53723 184488 186015 187795 189939 192120 193775 195083 196864 199233 201219 202067 202196 202471 203230 204479 206389
53708 206389 208915 211427 213313 214706 216148 217847 219739 221933 224505 227002 228812 230083 231785 234735
53694 234735 238812 243273 247551 251511 255037 257695 259049 259239 258903 258391 257386 255623 253692 252564 252406
53679 252406 252415 251844 250629 248954 246916 244919 243788 243961 244904 245782 246380 246967 247562 247910 248052 248334 248829 249145
53661 249145 248928 248255 247511 247111 247284 247872 248338 248286 247965 247962 248424 248953 249346 249979 251123 252251 252546 252108 252153
53642B52153J594K819K683J715J332K140L220L278K203J154J139J865K254J794
53628B81343J001N43M45L64L23O18J153J374R96M71N09J347K620L695M073L722
53612C04597L227L305L940M313L840K927K405K495K764K887K902K847K601K118
53598C47168J504Q32J95k12l16l97p59j255j521j506j437j433j519j857k478k940
53582C32069k669j632l64N25O21j29j123j435r72p85j579k538k557k015k027k356
53566C11034j677J37J551J539P89K57q9m76n63k53j53m35k39Q64J859J683P86
53549C16614K35Q3k03l53L75J801K870L066K901L046L607M211M289L577K736K941
53533C51796M360N670N820N557O324Q145R734J0268J0076R712R404R354R695J0150
$$ plain form
53642 252153 253747 256566 259249 260964 262296 264436 267656 270934 273137 274291 275430 277295 279549 281343
53628 281343 282344 282887 283332 283696 284019 284637 285790 287164 288160 288631 289140 290487 293107 296802 300875 304597
53612 304597 307824 311129 315069 319382 323222 326149 328554 331049 333813 336700 339602 342449 345050 347168
53598 347168 348672 349504 349699 349487 349171 348774 348015 346760 345239 343733 342296 340863 339344 337487 335009 332069
53582 332069 329400 327768 327404 327929 328550 328421 327298 325863 324891 324106 322527 319989 317432 315417 313390 311034
53566 311034 309357 309494 311045 312584 313373 313630 313541 313065 312502 312249 312096 311661 311422 312286 314145 315828 316614
53549 316614 316849 316932 316729 316376 316751 318552 321422 324488 327389 330435 334042 338253 342542 346119 348855 351796
53533 351796 356156 361826 367646 373203 379527 387672 397406 407674 417750 427462 436866 446220 455915 466065
53519D66065J0417J0764J1631J2848J3910J4790J5707J6436J6727J7120J8340
53508F24755J9995K0917K0790K0469K0535K0535J9983J9188J8662J8238J7350
53497H41417J5809J4108J3004J2818J3047J2865J2237J2071J2891J3953J4303
53486I88523J4150J4317J4729J4598J3843J3252J3208J3242J2930J2256J1028
53475A136076Q921O345M300L046J712m05k883m909o305p422q512r569j0428j0859
53461A099108j0818j0682j0814j1039j1039j1120j1950j3527j5111j6142j6584
53450I60282j6369j5385j4044j3110j2758j2434j1752j0814r667q221o759n721
53438H23248m882l623k077j061p39l76L72R85J273J890L117M211M661N115O202
$$ plain form
53519 466065 476482 487246 498877 511725 525635 540425 556132 572568 589295 606415 624755
53508 624755 644750 665667 686457 706926 727461 747996 767979 787167 805829 824067 841417
53497 841417 857226 871334 884338 897156 910203 923068 935305 947376 960267 974220 988523
53486 988523 1002673 1016990 1031719 1046317 1060160 1073412 1086620 1099862 1112792 1125048 1136076
53475 1136076 1144997 1151342 1155642 1158688 1160400 1159995 1157112 1152203 1145898 1138476 1129964 1120395 1109967 1099108
53461 1099108 1088290 1077608 1066794 1055755 1044716 1033596 1021646 1008119 993008 976866 960282
53450 960282 943913 928528 914484 901374 888616 876182 864430 853616 843949 835728 828969 823248
53438 823248 818366 814743 812666 811605 810866 810490 810862 811847 813120 815010 818127 822338 826999 832114 838316
53423H38316P351P754P881Q915J1002J3051J4210J4720J5362J6549J8088J9525
53411I92724K0733K2169K4235K6376K7466K7284K6983K7692K9230L0722L1916
53400A287530L3253L5028L7095L9127M0740M1546M1578M1457M1767M2488M3194
53389A724803M3545M3306M2310M0752L9138L7643L5872L3586L1191K9165K7318
53378B128629K5058K2101J8538J4503J0108N566J134k927o382r398j2822j7378
53366B176730k2562k7053l0431l3550l6888l9492m0286l9617l8705l8169l7870
53355A792107l7675l7450l6656l4793l2233k9912k8413k7762k7832k8367k8813
53344A442201k8770k8422k8074k7511k6329k4571k2594k0558j8504j6652j5114
$$ plain form
53423 838316 845667 853421 861302 870217 881219 894270 908480 923200 938562 955111 973199 992724
53411 992724 1013457 1035626 1059861 1086237 1113703 1140987 1167970 1195662 1224892 1255614 1287530
53400 1287530 1320783 1355811 1392906 1432033 1472773 1514319 1555897 1597354 1639121 1681609 1724803
53389 1724803 1768348 1811654 1853964 1894716 1933854 1971497 2007369 2040955 2072146 2101311 2128629
53378 2128629 2153687 2175788 2194326 2208829 2218937 2224503 2225637 2222710 2216328 2206930 2194108 2176730
53366 2176730 2154168 2127115 2096684 2063134 2026246 1986754 1946468 1906851 1868146 1829977 1792107
53355 1792107 1754432 1716982 1680326 1645533 1613300 1583388 1554975 1527213 1499381 1471014 1442201
53344 1442201 1413431 1385009 1356935 1329424 1303095 1278524 1255930 1235372 1216868 1200216 1185102
53333A185102j3652j2153j0953j0296r908r648r978j1135j2458j3277j3938j4909
53321A042797j5472j4467j2171j0170r387r257r000q578q085p147n451l292j277
53308I29043J71Q89J077J366K268L546M701N899P712R991J1890J3147J4311J5569
53294A021580J6314J6369J6627J7758J9085J9557J9267J9031J8905J8154J6566
53283A219213J4856J3465J1850R406O525M100K207J0k968n987p931q703r311j0640
53269A236092j2610j4644j6404j7783j8593j8803j8821j9046j9260j8983j8357
53258A042788j8191j9055k0675k2271k3130k2843k1476j9684j8354j7811j7670
53247H21628j7470j7260j7296j7458j7287j6554j5535j4708j4262j4027j3745
$$ plain form
53333 1185102 1171450 1159297 1148344 1138048 1128140 1118492 1108514 1097379 1084921 1071644 1057706 1042797
53321 1042797 1027325 1012858 1000687 990517 981130 971873 962873 954295 946210 939063 933612 930320 929043
53308 929043 929214 930103 931180 932546 934814 938360 943061 948960 956672 966663 978553 991700 1006011 1021580
53294 1021580 1037894 1054263 1070890 1088648 1107733 1127290 1146557 1165588 1184493 1202647 1219213
53283 1219213 1234069 1247534 1259384 1268790 1275315 1279415 1281622 1281632 1278664 1272677 1264746 1256043 1246732 1236092
53269 1236092 1223482 1208838 1192434 1174651 1156058 1137255 1118434 1099388 1080128 1061145 1042788
53258 1042788 1024597 1005542 984867 962596 939466 916623 895147 875463 857109 839298 821628
53247 821628 804158 786898 769602 752144 734857 718303 702768 688060 673798 659771 646026
53236F46026j3273j2510j1327r790q353p484p137o852o375n912n762o092p049
53223E38110q564j0012j0655j0673j1036j2081j2887j2605j1722j1235j1152j0748
53211D04740r901r155q646p936p016o485o543o623o285n870n893o344o825p052
53197C04166o944o598o302o302o484o573o545o470o057m963l493k426k070k121
53183B30818k393k921l310k876j805j233j664k074j329J02O54l61k015k915k533
53168B04145j419n77o09j153j176j02J537K690K845K144Q74o31j722j768q82O2
53152B04258M11L02J78O6k58p29r89r58r76j197j168l35J118K269K406J692Q26
53135B06916L09J76K38K69J00k06l61j78J82M81P37J059J323J370J393J754K456
$$ plain form
53236 646026 632753 620243 608916 599126 590773 583289 576152 569300 562925 557013 551251 545159 538110
53223 538110 529546 519534 508879 498206 487170 475089 462202 449597 437875 426640 415488 404740
53211 404740 394839 385684 377038 369102 362086 355601 349058 342435 336150 330280 324387 318043 311218 304166
53197 304166 297222 290624 284322 278020 271536 264963 258418 251948 245891 240928 237435 235009 232939 230818
53183 230818 228425 225504 222194 219318 217513 216280 214616 212542 211213 211315 211969 211608 209593 206678 204145
53168 204145 202726 202149 201540 200387 199211 199109 200646 203336 206181 208325 209199 208568 206846 205078 204196 204258
53152 204258 204669 204971 205149 205215 204957 204228 203239 202281 201305 200108 198940 198605 199723 201992 204398 206090 206916
53135 206916 207225 207401 207639 207908 208008 207802 207441 207263 207445 207926 208663 209722 211045 212415 213808 215562 218018
53118B18018L127L501L562L307K679J799R59L50K7JQ8j56r71j990k738l301l976
53101B24286m400l830k404j272j195j689j898j700j430j163q72r33j617k339k170
53086A95374j131l17n53j372j667j018n2M06K28m7N6M02N38K84p7k37k13j91j56
53067A90257J05O10R52N98m50j448j586r05k12lJ09O18J215J198N20j46l66l46
53049A90720l60l72l11k42q4L51Q30P99J54m86n60k06J46L32L37L4m91p46l65
53030A89480L50P92P49M30P5j05J31P75J342J323P74J46k97n49n24j29L60M72
53012A95595J98R0N24J106J135N11r0j3N57P94K58n68q97n92j76p0k38m98o59
52993A96967l28P84K177K691J820M56j30L19J035J355J237R22O71Q42J646K680
$$ plain form
53118 218018 221145 224646 228208 231515 234194 235993 236952 237302 237329 237330 237418 237262 236291 234301 231563 228262 224286
53101 224286 219886 216056 213652 212380 211185 209496 207598 205898 204468 203305 202433 201500 199883 197544 195374
53086 195374 194243 193926 193373 192001 190334 189316 189264 189670 189898 189851 189907 190309 190847 191131 191054 190817 190604 190413 190257
53067 190257 190362 190972 191924 192522 192072 190624 189038 188133 187921 187918 188027 188645 189860 191058 191578 191432 191066 190720
53049 190720 190360 189988 189677 189435 189351 189702 190532 191331 191485 190999 190439 190233 190379 190711 191048 191082 190591 189845 189480
53030 189480 189830 190622 191371 191801 191876 191771 191902 192677 194019 195342 196116 196262 195965 195416 194892 194763 195123 195595
53012 195595 195793 195883 196407 197513 198648 199159 199069 199056 199613 200407 200665 200097 199200 198608 198432 198362 198124 197626 196967
52993 196967 196639 197423 199600 202291 204111 204567 204437 204756 205791 207146 208383 209305 209976 210818 212464 215144
52977B15144L144K660J624O58Q2q3O8K69J73j92l32O1N32L53m70j066p57L3L28
52958B22229k05r55j260j108q14n06k49k94p37j201j292j228j401j555j036Q0
52942B08468Q58P64L40L19O24P25N08K10p1l25k66L18J021J153O39R7j4O6r2m33
52922B14909n41k78p6m14j125j441q72J57P80O49M4p28j465j698j026L5L12m40
52904B06782j005l76P48R93K85j94K07R16J194R61L97l92j026r22p7P09P71L01
52886B10272j24k83k95k93m09p12r38o21K20R47J201J429K133K976L206K653J790
52869B23152R95L27p7k3L28N80P14J050J511J496P41k24q65j419k317l200l194
52852B19575k203j227j204j965k667k878k801k645k229j414n55k70p59j491j685
$$ plain form
52977 215144 218288 220948 222572 223230 223312 223229 223297 223566 223739 223547 223215 223276 223808 224161 223691 222625 221868 221901 222229
52958 222229 222024 221069 219809 218701 217887 217381 217132 216838 216101 214900 213608 212380 210979 209424 208388 208468
52942 208468 209326 210090 210430 210749 211373 212098 212606 212816 212745 212420 212154 212472 213493 214646 215285 215382 215368 215434 215342 214909
52922 214909 214368 214090 214014 213600 212475 211034 210162 210319 211099 211748 211792 211064 209599 207901 206875 206910 207222 206782
52904 206782 205777 205401 206149 207142 207427 207233 207440 208356 209550 210511 210908 210516 209490 208568 208491 209200 209971 210272
52886 210272 210148 209865 209570 209277 208868 208156 207218 206597 206817 207764 208965 210394 212527 215503 218709 221362 223152
52869 223152 224147 224474 224397 224374 224702 225282 225996 227046 228557 230053 230794 230570 229705 228286 225969 222769 219575
52852 219575 217372 216145 214941 212976 210309 207431 204630 201985 199756 198342 197787 197517 196758 195267 193582
52837A93582j128l81j36m64q47q91o49l39o3L4k33o99q29l88J16P6l56n32k40
52818A85633J63M57P96J156J191Q19M82N66Q70R78P56K96k66o55n12L9K70l17
52800A92722j259j626j156m75k18l27k81J83P42Q19K28n26p84n57n01r72j497
52783A84515j431q03j11M32R36J275J098M55r2j83j11l48r14j452j697j589j109
52766A78871l29L84N86L17J54M74Q59N99k64q16l55P36J506J570J285J053Q85
52749A87515P28P39J057J525J853J840J447Q29K97Q5J80N23J198K064K438J800
52733B06118O76J91O18J123J036O00J60n10j405j674p47M57N06n70j299q38k7
52716B04415J3n18m87N59J818K166J313o7j123j569j643j568j244n81J52N51N30
$$ plain form
52837 193582 192454 192073 191937 191473 190626 189735 189086 188747 188684 188718 188485 187786 186957 186569 186685 186761 186405 185873 185633
52818 185633 185796 186253 187049 188205 189396 190215 190697 191263 192133 193111 193867 194163 193897 193242 192730 192769 193039 192722
52800 192722 191463 189837 188681 188206 187988 187661 187380 187563 188305 189124 189352 188826 188042 187485 186984 186012 184515
52783 184515 183084 182281 182170 182602 183538 184813 185911 186366 186274 186091 185980 185632 184718 183266 181569 179980 178871
52766 178871 178542 178926 179512 179829 179983 180457 181316 181915 181651 180835 180480 181216 182722 184292 185577 186630 187515
52749 187515 188243 188982 190039 191564 193417 195257 196704 197533 197830 197915 198095 198618 199816 201880 204318 206118
52733 206118 206794 206985 207603 208726 209762 210362 210522 210012 208607 206933 206186 206643 207149 206579 205280 204442 204415
52716 204415 204428 203910 203423 203982 205800 207966 209279 209212 208089 206520 204877 203309 202065 201484 201636 202187 202717
52699B02717L58K49J26j64n04n03L2P03Q03K03l91l26Q6Q7l83p44q58j174j628
52680A98689j429l34P22R11O39O42O72J1j069j430n56Q92J898J948J178K53k7
52663B03610M57R06P37N06J012J875K027J445J282K085K922K623J191m23j346
52648B20909j344q01m80r03j789k393k405k056j522q14k12o6j32J69Q47J312J425
52631B09745J684K197K349J869J478J943L052L905L764K430L95j129j138j84J8
52616B32378j195k483k382j286n91o49p27n61o10q32m67O37J462J144J41m47k60
52599B23272J62L31L51N04P11O04K4p20j116r01k21N20Q57M79m24j115r14M3R44
52580B23391J261J252J361J505J264N21l55q48o69L4P01P80K34n25j178j718k042
$$ plain form
52699 202717 203075 203324 203450 203286 202782 202279 202311 203014 203817 204020 203629 203303 203389 203476 203093 202349 201491 200317 198689
52680 198689 197260 196926 197648 198559 199198 199840 200512 200523 199454 198024 197468 198360 200258 202206 203384 203637 203610
52663 203610 204067 204973 205710 206216 207228 209103 211130 212575 213857 215942 218864 221487 222678 222255 220909
52648 220909 219565 218764 218284 217381 215592 213199 210794 208738 207216 206402 206190 206124 205992 206161 207008 208320 209745
52631 209745 211429 213626 215975 217844 219322 221265 224317 228222 231986 234416 234811 233682 232544 232360 232378
52616 232378 231183 228700 226318 225032 224441 223792 223065 222504 221894 221062 220595 221232 222694 223838 223979 223532 223272
52599 223272 223434 223765 224116 224620 225331 225935 225959 225239 224123 223222 223001 223521 224378 224857 224433 223318 222404 222447 223391
52580 223391 224652 225904 227265 228770 230034 230555 230200 229352 228683 228717 229418 230198 230432 229907 228729 227011 224969
52563B24969j858j156m32q2K7J02m6o46j383j682j376p65j54L38O56Q32J016J195
52545B19555J101O78L48M16N43K71j41o0M89P74M39o0k40k57m35o13m33R3O92
52526B23160J323K029K479K203J374Q34J075J558J476Q74N20O79P22J53n33n08
52510B39418K76J138J631J870J992J884J544J050J81j396l290m367l934k625j651
52495B33721j559j964k255k129j629j025n53j35M68J141J370Q79rq45j486j857
52479B22133j692r33l0N76R07J140J180R91R05J140J376J329J298J577J773J456
52463B35126J150J664K683L070K575K127K155J763K06j757k799k720k355k220
52449B40668k090j791j597j690j836j717j223m71J63R8p97j670j428j80P08L16
$$ plain form
52563 224969 223111 221955 221523 221441 221468 221570 221524 220878 219495 217813 216437 215672 215518 215856 216512 217344 218360 219555
52545 219555 220656 221334 221682 222098 222641 222912 222771 222711 223200 223974 224413 224353 224113 223856 223421 222808 222375 222468 223160
52526 223160 224483 226512 228991 231194 232568 233402 234477 236035 237511 238385 238905 239584 240306 240459 239926 239418
52510 239418 239694 240832 242463 244333 246325 248209 249753 250803 250984 249588 246298 241931 237997 235372 233721
52495 233721 232162 230198 227943 225814 224185 223160 222607 222472 222940 224081 225451 226330 226321 225476 223990 222133
52479 222133 220441 219508 219478 220054 220961 222101 223281 224272 225177 226317 227693 229022 230320 231897 233670 235126
52463 235126 236276 237940 240623 243693 246268 248395 250550 252313 252519 250762 247963 245243 242888 240668
52449 240668 238578 236787 235190 233500 231664 229947 228724 228253 228416 228514 227717 226047 224619 224439 225147 225463
52433B25463o36q53j58N94R72J330J744J612Q06L12R45J988K051J049L26P41J549
52416B39835J531N72m03n82J17J288K396L029L207L360L821M420M688M268L050
52401B74597J221o61j896k279k235k164j993j629j474j927k627k742j986r51l82
52386B50872m56p08n10L85J510K015J575Q71Q86J810K916L434L334L230L690M607
52370B79461N213M887L965L399L520L592K838J454K41l85n26l29N2L04K88L33
52354C08307O84R92Q98P64J080J539J551J485K264L775M851N071N431O655P954
52339C53301Q236P769P682Q315R101R814J0885J2437J3888J4774J5481J6763J8759
52326E07205K0765K1939K2131K2054K2528K3566K4335K4105K3014K1705K0533
$$ plain form
52433 225463 224827 223974 223816 224410 225382 226712 228456 230068 230874 231186 232131 234119 236170 237219 237545 238286 239835
52416 239835 241366 241938 241535 240953 241070 242358 244754 247783 250990 254350 258171 262591 267279 271547 274597
52401 274597 275818 275157 273261 270982 268747 266583 264590 262961 261487 259560 256933 254191 252205 251254 250872
52386 250872 250416 249708 249198 249583 251093 253108 254683 255554 256440 258250 261166 264600 267934 271164 274854 279461
52370 279461 284674 289561 293526 296925 300445 304037 306875 308329 308570 308185 307659 307330 307382 307686 307974 308307
52354 308307 308991 309983 310881 311645 312725 314264 315815 317300 319564 323339 328190 333261 338692 345347 353301
52339 353301 361537 369306 376988 385303 394404 404218 415103 427540 441428 456202 471683 488446 507205
52326 507205 527970 549909 572040 594094 616622 640188 664523 688628 711642 733347 753880
52315G53880J9450J8435J7640J7044J6337J5319J4193J3283J2510J1364R511P361
52303I26327N770N098M776M031K819J689Q87K9j305l179n542q303j0926j2482
52289I09689j2542j1656j0620r523p975n998m110k569j079O98K689M605O308P840
52275H65757R323J0904J2676J4514J6092J7053J7237J6780J6061J5445J4944J4233
52263A041019J3082J1662J0339R279Q400P603O837O026N058L871K463R38n05j766
52249A124306l082m807o875q869j0713j2839j5319j7333j8081j7821j7376j6847
52237I74344j5707j4095j2999j2804j2530j1144r005p312o499n943n115m234l720
52224H53237l541l320k727j602n7J415K195K205K027K241K774L158L274L544M327
$$ plain form
52315 753880 773330 791765 809405 826449 842786 858105 872298 885581 898091 909455 918966 926327
52303 926327 932097 937195 941971 946002 948821 950510 951397 951426 950121 946942 941400 933097 922171 909689
52289 909689 897147 885491 874871 865348 857373 851375 847265 844696 843617 844315 847004 851609 857917 865757
52275 865757 875080 885984 898660 913174 929266 946319 963556 980336 996397 1011842 1026786 1041019
52263 1041019 1054101 1065763 1076102 1085381 1093781 1101384 1108221 1114247 1119305 1123176 1125639 1126577 1126072 1124306
52249 1124306 1121224 1116417 1109542 1100673 1089960 1077121 1061802 1044469 1026388 1008567 991191 974344
52237 974344 958637 944542 931543 918739 906209 895065 886060 878748 872249 866306 861191 856957 853237
52224 853237 849696 846376 843649 842047 841990 843405 845600 847805 849832 852073 854847 858005 861279 864823 869150
52209H69150N409O201O363O020N417M623L731L101L036L285L296L005K954L427
52195I29018L878L633K792K073J967K463L319M097M134L187J900R98J50j576m152
52180I57881o456p790q585r156r005p923o823o483o302n369m064l347k961j896
52166H71721l69K36l65o54N54K515L863M402M748M963M598L630K514J546P88M03
52150I05093M84P76J016J275J617J858K081K830M196N198M958M108M193N707P613
52135I53003Q827R432J0237J1733J3794J5949J7791J9331K0988K3015K5043K6496
52123A155639K7267K7583K7473K6932K6440K6533K6773K5932K3493K0329J7543
52112A431937J5206J2741J0012P395M946K236r00l896o102p607r064j0668j1737
$$ plain form
52209 869150 874559 880760 887123 893143 898560 903183 906914 910015 913051 916336 919632 922637 925591 929018
52195 929018 932896 936529 939321 941394 943361 945824 949143 953240 957374 960561 962461 963459 963609 962033 957881
52180 957881 951425 943635 935050 925894 916889 908966 902143 895660 889358 883989 879925 876578 873617 871721
52166 871721 871352 871588 871223 870569 871123 873638 877501 881903 886651 891614 896212 899842 902356 903902 904690 905093
52150 905093 905577 906353 907369 908644 910261 912119 914200 917030 921226 926424 931382 935490 939683 945390 953003
52135 953003 961830 971262 981499 993232 1007026 1022975 1040766 1060097 1081085 1104100 1129143 1155639
52123 1155639 1182906 1210489 1237962 1264894 1291334 1317867 1344640 1370572 1394065 1414394 1431937
52112 1431937 1447143 1459884 1469896 1477291 1482237 1484473 1483573 1479677 1473575 1465968 1456904 1446236 1434499
52099A434499j1569j0526r770r987j0835j1820j3095j4920j6784j7728j7479j6659
52087A273327j5868j5026j3719j1775r322o520l382R4L634O604Q494R598J0771
52074A236910J2325J3628J4175J4586J5813J7731J9194J9426J8643J7395J5961
52063A415787J4460J2915J1110Q873O508M488K750Q45j275l256n085p108r241
52050A451771j0964j2303j4051j6696j9757k2472k4583k6112k7010k7427k7792
52039A222604k8189k8100k7091k5376k3336k1009j8412j5952j4004j2428j0921
52028I97786r562q621q077p695p418p430p908q838r856j0326r982r457r657j0527
$$ plain form
52099 1434499 1422930 1412404 1402634 1392647 1381812 1369992 1356897 1341977 1325193 1307465 1289986 1273327
52087 1273327 1257459 1242433 1228714 1216939 1207617 1201097 1197715 1197809 1201443 1208047 1216541 1226139 1236910
52074 1236910 1249235 1262863 1277038 1291624 1307437 1325168 1344362 1363788 1382431 1399826 1415787
52063 1415787 1430247 1443162 1454272 1463145 1469653 1474141 1476891 1477736 1476461 1473205 1468120 1461012 1451771
52050 1451771 1440807 1428504 1414453 1397757 1378000 1355528 1330945 1304833 1277823 1250396 1222604
52039 1222604 1194415 1166315 1139224 1113848 1090512 1069503 1051091 1035139 1021135 1008707 997786
52028 997786 988224 979603 971526 963831 956413 948983 941075 932237 922381 912055 902073 892616 882959 872432
$$ [...]
##END NTUPLES=NMR SPECTRUM
##END=
