##TITLE=AC1623_CTIAN13354_8326158_Or4ZAyMkGR
##JCAMPDX= 6.0         $$ Bruker NMR JCAMP-DX V2.0
##DATA TYPE= NMR SPECTRUM
##DATA CLASS= NTUPLES
##ORIGIN= BRUKER
##OWNER= Administrator
$$ 1.72 TOPSPIN		Version 2.1
$$ 2013-11-13 23:14:38.822 -0800  Administrator@X
$$ Compression mode = diff/dup
##.OBSERVE FREQUENCY= 400.02188249412
##.OBSERVE NUCLEUS= ^1H
##.ACQUISITION MODE= SIMULTANEOUS (DQD)
##.ACQUISITION SCHEME= undefined
##.AVERAGES= 64
##.DIGITISER RES= 22
##SPECTROMETER/DATA SYSTEM= spect
##.PULSE SEQUENCE= noesygpps1d.comp
##.SOLVENT NAME= COFFEE_meoh
##.SHIFT REFERENCE= INTERNAL, COFFEE_meoh, 1, 14.96096
##AUDIT TRAIL= $$ (NUMBER, WHEN, WHO, WHERE, PROCESS, VERSION, WHAT)
$$ ##TITLE= Audit trail, TOPSPIN		Version 2.1
$$ ##JCAMPDX= 5.01
$$ ##ORIGIN= Bruker BioSpin GmbH
$$ ##OWNER= Administrator
$$ $$ E:\/data/COFFEE/nmr/AC1623_CTIAN13354_8326158_Or4ZAyMkGR/12/pdata/1/auditp.txt
$$ ##AUDIT TRAIL=  $$ (NUMBER, WHEN, WHO, WHERE, PROCESS, VERSION, WHAT)
(   1,<2013-11-13 23:14:33.087 -0800>,<Administrator>,<X>,<go>,<TOPSPIN 2.1>,
      <created by zg
	started at 2013-11-13 23:03:03.275 -0800,
	POWCHK enabled, PULCHK disabled,
       configuration hash MD5:
       C8 4E 4E 5D D3 5C D8 9E 9F 52 82 E0 59 8A DE 15
       data hash MD5: 64K
       5A 3B D5 4B 3E A8 68 ED BF F4 33 75 25 59 A9 E5>)
(   2,<2013-11-13 23:14:36.400 -0800>,<Administrator>,<X>,<proc1d>,<TOPSPIN 2.1>,
      <Start of raw data processing
       efp LB = 0.3 FT_mod = 6 PKNL = 1 PHC0 = 0 PHC1 = 0 SI = 128K 
       data hash MD5: 128K
       B8 CC 71 41 8B 19 0C 14 95 81 26 1F 4C E9 E8 62>)
(   3,<2013-11-13 23:14:37.478 -0800>,<Administrator>,<X>,<proc1d>,<TOPSPIN 2.1>,
      <pk PHC0 = -84.41345 PHC1 = 0 
       data hash MD5: 128K
       97 CE 0C 1A 4D BA 22 DB 35 5C 89 FF DF 83 96 EA>)
(   4,<2013-11-13 23:14:38.228 -0800>,<Administrator>,<X>,<proc1d>,<TOPSPIN 2.1>,
      <abs ABSG = 1 
       data hash MD5: 128K
       B8 7F F9 52 40 59 7A 55 5A 76 F5 20 35 4A 03 55>)
(   5,<2013-11-13 23:14:38.369 -0800>,<Administrator>,<X>,<proc1d>,<TOPSPIN 2.1>,
      <abs ABSG = 2 
       data hash MD5: 128K
       5C 1D E8 B3 03 84 D9 9E 31 83 92 E3 2F 1F CB 71>)
(   6,<2013-11-13 23:14:38.447 -0800>,<Administrator>,<X>,<proc1d>,<TOPSPIN 2.1>,
      <abs ABSG = 3 
       data hash MD5: 128K
       5C 39 65 88 00 46 D2 94 B9 C4 6F CF B0 EB 8E 08>)
(   7,<2013-11-13 23:14:38.541 -0800>,<Administrator>,<X>,<proc1d>,<TOPSPIN 2.1>,
      <abs ABSG = 4 
       data hash MD5: 128K
       E4 B8 8C 5F CD 1B A9 33 4B D5 85 32 AF 0E 24 EA>)
(   8,<2013-11-13 23:14:38.650 -0800>,<Administrator>,<X>,<proc1d>,<TOPSPIN 2.1>,
      <abs ABSG = 5 
       data hash MD5: 128K
       1C 46 FE BF FB CB D5 3F A6 38 B5 DE E0 78 A3 78>)
$$ ##END=
$$ 
$$ $$ hash MD5
$$ $$ 30 B0 5F 26 69 CE 2B C0 43 90 9F 8E 73 0A 94 D6
##$RELAX= 
##$RELAX= 
##$RELAX= 
##$RELAX= 
##$RELAX= 
##$RELAX= 
##$RELAX= 
##$RELAX= 
$$ Bruker specific parameters
$$ --------------------------
##$DU= <E:\>
##$EXPNO= 12
$$ [...]
##$TP07= 0
##$TPNAME0= <>
##$TPNAME1= <>
##$TPNAME2= <>
##$TPNAME3= <>
##$TPNAME4= <>
##$TPNAME5= <>
##$TPNAME6= <>
##$TPNAME7= <>
##$TPOAL= (0..7)
0.5 0.5 0.5 0.5 0.5 0.5 0.5 0.5
##$TPOFFS= (0..7)
0 0 0 0 0 0 0 0
##$TUNHIN= 0
##$TUNHOUT= 0
##$TUNXOUT= 0
##$USERA1= <user>
##$USERA2= <user>
##$USERA3= <user>
##$USERA4= <user>
##$USERA5= <user>
##$V9= 5
##$VALIST= <valist>
##$VCLIST= <CCCCCCCCCCCCCCC>
##$VD= 0
##$VDLIST= <DDDDDDDDDDDDDDD>
##$VPLIST= <PPPPPPPPPPPPPPP>
##$VTLIST= <TTTTTTTTTTTTTTT>
##$WBST= 1024
##$WBSW= 4
##$XGAIN= (0..3)
0 0 0 0
##$XL= 0
##$YL= 0
##$YMAX_a= 6011017
##$YMIN_a= -13406637
##$ZGOPTNS= <>
##$ZL1= 120
##$ZL2= 120
##$ZL3= 120
##$ZL4= 120
##$ABSF1= 14.96096
##$ABSF2= -5.597221
##$ABSG= 5
##$ABSL= 3
##$ALPHA= 0
##$AQORDER= 0
##$ASSFAC= 0
##$ASSFACI= 0
##$ASSFACX= 0
##$ASSWID= 0
##$AUNMP= <proc_prof1d_extract.lims>
##$AXLEFT= 0
##$AXNAME= <>
##$AXNUC= <1H>
##$AXRIGHT= 0
##$AXTYPE= 0
##$AXUNIT= <>
##$AZFE= 0.1
##$AZFW= 0.1
##$BCFW= 0
##$BC_mod= 0
##$BYTORDP= 0
##$COROFFS= 0
##$CY= 15
##$DATMOD= 1
##$DC= 0
##$DFILT= <>
##$DTYPP= 0
##$F1P= 0
##$F2P= 0
##$FCOR= 0.5
##$FTSIZE= 131072
##$FT_mod= 6
##$GAMMA= 0
##$GB= 0
##$INTBC= 1
##$INTSCL= 1
##$ISEN= 128
##$LB= 0.3
##$LEV0= 0
##$LPBIN= 0
##$MAXI= 10000
##$MC2= 0
##$MEAN= 0
##$ME_mod= 0
##$MI= 0
##$NCOEF= 0
##$NC_proc= -2
##$NLEV= 6
##$NOISF1= 0
##$NOISF2= 0
##$NSP= 0
##$NTH_PI= 0
##$NZP= 0
##$OFFSET= 14.96096
##$PC= 1
##$PHC0= -84.41345
##$PHC1= 0
##$PH_mod= 1
##$PKNL= yes
##$PPARMOD= 0
##$PPDIAG= 0
##$PPIPTYP= 0
##$PPMPNUM= 2147483647
##$PPRESOL= 1
##$PSCAL= 4
##$PSIGN= 0
##$PYNMP= <proc.py>
##$REVERSE= no
##$SF= 400.020009651929
##$SI= 131072
##$SIGF1= 0
##$SIGF2= 0
##$SINO= 400
##$SIOLD= 131072
##$SPECTYP= <>
##$SREGLST= <1H.CDCl3>
##$SSB= 0
##$STSI= 131072
##$STSR= 0
##$SW_p= 8223.68421052631
##$SYMM= 0
##$S_DEV= 0
##$TDeff= 65536
##$TDoff= 0
##$TI= <>
##$TILT= no
##$TM1= 0
##$TM2= 0
##$TOPLEV= 0
##$USERP1= <user>
##$USERP2= <user>
##$USERP3= <user>
##$USERP4= <user>
##$USERP5= <user>
##$WDW= 1
##$XDIM= 131072
##$YMAX_p= 426453048
##$YMIN_p= -12657
##$CURPLOT= <Network HP LaserJet P1505>
##$CURPRIN= <$Network HP LaserJet P1505>
##$DFORMAT= <normdp>
##$LAYOUT= <+/1D_H.xwp>
##$LFORMAT= <normlp>
##$PFORMAT= <normpl>
##$SURQMSG= 1
$$ End of Bruker specific parameters
$$ ---------------------------------
##NTUPLES= NMR SPECTRUM
##VAR_NAME=  FREQUENCY,     SPECTRUM/REAL,   SPECTRUM/IMAG
##SYMBOL=    X,             R,               I
##VAR_TYPE=  INDEPENDENT,   DEPENDENT,       DEPENDENT
##VAR_FORM=  AFFN,          ASDF,            ASDF
##VAR_DIM=   131072,        131072,          131072
##UNITS=     HZ,            ARBITRARY UNITS, ARBITRARY UNITS
##FACTOR=    0.0627417313425164, 1,          1
##FIRST=     8223.62146879497, 3944,         -63824
##LAST=      0,             6624,            -63540
##MIN=       0,             -12657,          0
##MAX=       8223.62146879497, 426453048,    0
$$ Real data points
##PAGE= N=1
##DATA TABLE= (X++(R..R)), XYDATA
$$ [...]
63733B91230J500R20J020J409J698J834J818J711J986L014M292M928M860M776
63719C26996M796M300L222K405K275K181J568Q34M13q6j077k083k461k384k308
63704C38591k008r91M60J570K102K348K338J872J354J738L328N115N686M647K922
63689C71072J729J398J283P80N9m52q93j676k598k944k554k035j783j472q57l18
63673C58739j94j68J43N16N14J91o8j16j04k47p48j596k259k164j721k104l618
63656C44996n014n074m227l801m144m436m068l274k417j523o77k19l23o95r01
63641C04203p15j55N76J211J656K069K500K747K781L046L889M949N513N408N155
63626C44833N288N848O503O895O957P141Q069R705J1117J1516J1338J1797J3445
$$ y = [291230, 292730, 293650, 294670, 296079, 297777, 299611, 301429, 303140, 305126, 308140, 312432, 317360, 322220, 326996, 331792, 336092, 339314, 341719, 343994, 346175, 347743, 348577, 348990, 348904, 347827, 345744, 343283, 340899, 338591, 336583, 335592, 336052, 337622, 339724, 342072, 344410, 346282, 347636, 349374, 352702, 357817, 363503, 368150, 371072, 372801, 374199, 375482, 376262, 376321, 375869, 374976, 373300, 370702, 367758, 365204, 363169, 361386, 359914, 359057, 358739, 358545, 358377, 358520, 359036, 359550, 359741, 359673, 359557, 359453, 359206, 358458, 356862, 354603, 352439, 350718, 348614, 344996, 339982, 334908, 330681, 326880, 322736, 318300, 314232, 310958, 308541, 307018, 306341, 306122, 305799, 305104, 304203, 303488, 303333, 303909, 305120, 306776, 308845, 311345, 314092, 316873, 319919, 323808, 328757, 334270, 339678, 344833, 350121, 355969, 362472, 369367, 376324, 383465, 391534, 401239, 412356, 423872, 435210, 447007, 460452]
63613D60452J5698J7765J9500K1169K2878K4444K5589K5965K5258K3431K0749
63602G02898J7402J3234Q142K677k018m977o114o114n732n374n213n442o248p698
63588F89423r756j2236j4682j6559j7730j8472j8837j8378j6855j4783j2812j0841
63576E07482q445n843l743k232p11J061K612L622M379N117N536N400N019M790
63562E24044M722M690M708M738M743N089O316Q282J0191J1798J3863J6972K0563
63549F40719K3686K6157K8377L0462L2092L2700L1379K7106J9783J0781J978n412
63537H99808j0826j3901j4683j3831j1990r412o743n421o388q875j1424j3737
63525G72577j6564j9995k3042k4911k5744k5933k5466k4231k2336k0003j7584
$$ y = [460452, 476150, 493915, 513415, 534584, 557462, 581906, 607495, 633460, 658718, 682149, 702898, 720300, 733534, 741676, 744353, 742335, 737358, 731244, 725130, 719398, 714024, 708811, 703369, 697121, 689423, 679667, 667431, 652749, 636190, 618460, 599988, 581151, 562773, 545918, 531135, 518323, 507482, 499037, 493194, 489451, 487219, 486508, 487569, 490181, 493803, 498182, 503299, 508835, 514235, 519254, 524044, 528766, 533456, 538164, 542902, 547645, 552734, 559050, 567332, 577523, 589321, 603184, 620156, 640719, 664405, 690562, 718939, 749401, 781493, 814193, 845572, 872678, 892461, 903242, 905220, 899808, 888982, 875081, 860398, 846567, 834577, 825165, 818422, 813001, 806613, 797738, 786314, 772577, 756013, 736018, 712976, 688065, 662321, 636388, 610922, 586691, 564355, 544352, 526768]
63514E26768j5625j4347j3145j1278q970p160o129n220m028l019k672k718k701
63501D29756k674k852k988k632j820j070p32p08p24p28q54j086j136q10m44n74
63485D07924j091j205n74J11J78J29R28K393L252K834J811J104P80M67P5k84o96
63468D18136j273j904k455k910l070k562j444l90J55O15J560K685L145K890K888
63453D16066L872N341O235O267O176O712P769Q627Q795Q434Q065Q021Q171Q135
63439E16686P757P499Q171J0225J3393J7010K0449K3042K3946K2633J9476J5483
63427G05770J1467P931N523M900N903P550R130J0900J3409J6612K0008K3149K5554
63414H67806K6505K5445K2421J7814J1995N578l88m987p964r458r627q991q573
$$ y = [526768, 511143, 496796, 483651, 472373, 463403, 456243, 450114, 444894, 440866, 437847, 435175, 432457, 429756, 427082, 424230, 421242, 418610, 416790, 415720, 414988, 414280, 413556, 412828, 411974, 410888, 409752, 408942, 408498, 407924, 406833, 405628, 405054, 405165, 405343, 405472, 406400, 408793, 412045, 414879, 416690, 417794, 418574, 419041, 419116, 418832, 418136, 416863, 414959, 412504, 409594, 406524, 403962, 402518, 402128, 402283, 402898, 404458, 407143, 410288, 413178, 416066, 419938, 425279, 431514, 437781, 443957, 450669, 458438, 467065, 475860, 484294, 492359, 500380, 508551, 516686, 524443, 531942, 540113, 550338, 563731, 580741, 601190, 624232, 648178, 670811, 690287, 705770, 717237, 725168, 730691, 735591, 741494, 749044, 758174, 769074, 782483, 799095, 819103, 842252, 867806, 894311, 919756, 942177, 959991, 971986, 977564, 977176, 972189, 964225, 954767, 945140, 936149, 927576]
63401I27576r006r847j0472j1387j3730j7572k1618k4676k6668k7915k8168k6972
63389F99545k4619k2137k0305j8949j7291j4902j2113r519p209m747j860J290
63377E47184M473P646J0606J2926J4508J5718J6634J6619J5149J2641R983P619
63365F91706N655M464M524N752P618R748J1978J4178J6450J9175K2215K4456K4840
63352H62759K3501K1112J7555J2350O190Q04k924n599p831r148r059q300q233
63339H93177r339j1001j2588j4183j6220j8733k1091k2464k2534k1648k0247j8416
63327F84713j6166j3767j1394q801n794k790l72J385K585K734J087k311o548j0689
63313F13872j4082j6087j6318j5180j3422j1238q484n577l150r62J780M888P176
$$ y = [927576, 918570, 908723, 898251, 886864, 873134, 855562, 833944, 809268, 782600, 754685, 726517, 699545, 674926, 652789, 632484, 613535, 596244, 581342, 569229, 559710, 552501, 547754, 545894, 547184, 551657, 559303, 569909, 582835, 597343, 613061, 629695, 646314, 661463, 674104, 684087, 691706, 697361, 701825, 706349, 712101, 719719, 729467, 741445, 755623, 772073, 791248, 813463, 837919, 862759, 886260, 907372, 924927, 937277, 943467, 944271, 941347, 935748, 927917, 918769, 909710, 901410, 893177, 883838, 872837, 860249, 846066, 829846, 811113, 790022, 767558, 745024, 723376, 703129, 684713, 668547, 654780, 643386, 634585, 628791, 626001, 625629, 627014, 629599, 632333, 633420, 631109, 624561, 613872, 599790, 583703, 567385, 552205, 538783, 527545, 519061, 513484, 510334, 509372, 511152, 516040, 523216]
63300E23216Q189Q774R413R124O775K677j890o021r308j1368j2188j2577j3441
63287E01375j4692j5339j4598j2513r827p482o025n128m069k760j861j708j842
63274D03531j906k186k660k397p77J194J842R22j94l03M71J418K245K986L482
63259D07668L550L481L875M880N922O414O609P260Q375R000Q652Q401R563J1684
63245E05334J2960J2695J2197J2917J4794J6989J9184K1413K3435K5179K7127
63234G04224K9481L1561L2834L3894L5435L6856L7055L6193L5487L5409L5331
63223A083760L4886L4442L4179L3801L3555L4307L6097L7582L7544L6128L3956
63212A470237L0788K5994J9799J3099O265r85q607j5984k2763k9114l4803l8701
$$ y = [523216, 531405, 540179, 549592, 558716, 565491, 568168, 566278, 560257, 550949, 539581, 527393, 514816, 501375, 486683, 471344, 456746, 444233, 434406, 426924, 420899, 415771, 411702, 408942, 407081, 405373, 403531, 401625, 399439, 396779, 394382, 393605, 394799, 396641, 397563, 397369, 397066, 397537, 398955, 401200, 404186, 407668, 411218, 414699, 418574, 423454, 429376, 435790, 442399, 449659, 458034, 467034, 475686, 484087, 493650, 505334, 518294, 530989, 543186, 556103, 570897, 587886, 607070, 628483, 651918, 677097, 704224, 733705, 765266, 798100, 831994, 867429, 904285, 941340, 977533, 1013020, 1048429, 1083760, 1118646, 1153088, 1187267, 1221068, 1254623, 1288930, 1325027, 1362609, 1400153, 1436281, 1470237, 1501025, 1527019, 1546818, 1559917, 1566182, 1565197, 1556590, 1540606, 1517843, 1488729, 1453926, 1415225]
63200A415225l9816l8571l6426l4269l1689k8035k3773k0327j8598j8047j7403
63189A108271j6022j4213j2268r717n877r70L870P797J1067J4309J7333J9282
63177A122862J9852J9766J9864K0301K0901K1674K2463K2471K0922J8003J4635
63166A343714J1349P857L670j397p249j3531j9607k4964k9680l3987l7564l9767
63154A158844m0562m0537l9982l8625l6423l3876l1303k8497k5357k2243j9347
63143H02092j6385j3327j0797r225q105o649m837l209j959p25Q47K758M760O467
63129G41706P594Q346R383J1190J3604J6032J7811J8360J7415J5291J2418Q635
63117H97785L596k062o866j0101j2365j4124j4751j3787j2133j0921r875q088
$$ y = [1415225, 1375409, 1336838, 1300412, 1266143, 1234454, 1206419, 1182646, 1162319, 1143721, 1125674, 1108271, 1092249, 1078036, 1065768, 1056051, 1050174, 1049204, 1053074, 1060871, 1071938, 1086247, 1103580, 1122862, 1142714, 1162480, 1182344, 1202645, 1223546, 1245220, 1267683, 1290154, 1311076, 1329079, 1343714, 1355063, 1362920, 1366590, 1365193, 1357944, 1344413, 1324806, 1299842, 1270162, 1236175, 1198611, 1158844, 1118282, 1077745, 1037763, 999138, 962715, 928839, 897536, 869039, 843682, 821439, 802092, 785707, 772380, 761583, 752358, 744253, 737604, 732767, 729558, 727599, 726874, 727721, 730479, 735239, 741706, 749300, 757646, 767029, 778219, 791823, 807855, 825666, 844026, 861441, 876732, 889150, 897785, 901381, 899319, 892453, 882352, 869987, 855863, 841112, 827325, 815192, 804271, 794396, 786308]
63105G86308n885m674n022o052o715o694n972m563k921j797j417j331j161q70
63091G31234l43O06J634K040J748J553K159L446M835N852O234O026N701N769O163
63076G84657O510O895P749Q975R911J0322J0703J1458J2452J3665J5486J8002
63064I16785K0616K2847K4948K7368L0171L3321L6930M0790M4386M7847N2185
63053A298194N7782O3377O7482P0356P3440P7078Q0076Q1636Q2471Q3464Q4176
63042B119532Q3474Q1191P8373P6212P5215P5285P5993P6658P6607P5473P3075
63031B967088O9029O2713N3602M1466K6386Q944r622k7941m5437o2368p8596r2660
63019B912604j02636j07881j09541j09129j07091j02915r6272q7614p7730o7228
$$ y = [786308, 780423, 775749, 770727, 764675, 757960, 751266, 745294, 740731, 737810, 736013, 734596, 733265, 732104, 731234, 730891, 731497, 733131, 735171, 736919, 738472, 740631, 744077, 748912, 754764, 760998, 767024, 772725, 778494, 784657, 791167, 798062, 805811, 814786, 824697, 835019, 845722, 857180, 869632, 883297, 898783, 916785, 937401, 960248, 985196, 1012564, 1042735, 1076056, 1112986, 1153776, 1198162, 1246009, 1298194, 1355976, 1419353, 1486835, 1557191, 1630631, 1707709, 1787785, 1869421, 1951892, 2035356, 2119532, 2203006, 2284197, 2362570, 2438782, 2513997, 2589282, 2665275, 2741933, 2818540, 2894013, 2967088, 3036117, 3098830, 3152432, 3193898, 3220284, 3229228, 3219606, 3191665, 3146228, 3083860, 3005264, 2912604, 2809968, 2702087, 2592546, 2483417, 2376326, 2273411, 2177139, 2089525, 2011795, 1944567]
63009A944567n6552m6183l6501k7440j8549r524o55P409J4315K0303K5769L0676
62997A847635L4611L7335L9045M0059M0523M0536M0378M0368M0540M0494L9593
62986B281117L7313L3499K8374K2191J4878O157m000j5060k6193l6760m6541n5531
62974B239444o3603p0401p5609p9203q1269q1649q0095p6888p2901o8788o4499
62963A424539n9919n5517n1732m8075m3692l8818l4773l2356l0970k9671k8342
62952I70674k7375k6684k5664k3945k1784j9845j8699j8322j7953j6802j4969
62941G38632j3260j2029j0821r281p687o224m564k747j697j956k518j921k78Q07
62927F64456L66p90j315r58n80r33j887k776l292l837m882o131o727o378n731
$$ y = [1944567, 1888015, 1841832, 1805331, 1777891, 1759342, 1749818, 1749163, 1756572, 1770887, 1791190, 1816959, 1847635, 1882246, 1919581, 1958626, 1998685, 2039208, 2079744, 2120122, 2160490, 2201030, 2241524, 2281117, 2318430, 2351929, 2380303, 2402494, 2417372, 2423529, 2419529, 2404469, 2378276, 2341516, 2294975, 2239444, 2175841, 2105440, 2029831, 1950628, 1869359, 1787710, 1707615, 1630727, 1557826, 1489038, 1424539, 1364620, 1309103, 1257371, 1209296, 1165604, 1126786, 1092013, 1059657, 1028687, 999016, 970674, 943299, 916615, 890951, 867006, 845222, 825377, 806678, 788356, 770403, 753601, 738632, 725372, 713343, 702522, 693241, 685554, 679330, 674766, 672019, 670322, 668366, 665848, 663927, 663649, 664456, 664822, 664032, 662717, 661759, 661179, 660246, 658359, 655583, 652291, 648454, 643572, 637441, 630714, 624336, 618605]
62912F18605n350m974m277l738l995m693m874m332l714l347k835j950j144q82
62898E68500r90j063r99q87p35n09k62o3o6n64j599k501k348j061L77J043R88
62881E57261Q57R67J139J133Q65K43p79j888k407j848n87K36l04j944l441l821
62865E45682l188k299j613j060m26L72J189J658J442P07J05LJ05P1J47O60J315
62848E44870J529J263R30O12Q5n45q69q93j079j524j735j410r13o88o49m50j6
62831E38518M91R44J225J188Q99P86J249K137K838K917K627K641L316M268M848
62816E70892M918M896N139N592O096O623P100P406P668Q116Q544Q453P954P883
62802F67280Q711R957J1102J2314J3764J4996J5774J6860J9019K1800K4307K6691
$$ y = [618605, 613255, 608281, 604004, 600266, 596271, 591578, 586704, 582372, 578658, 575311, 572476, 570526, 569382, 568500, 567510, 566447, 565448, 564561, 563826, 563317, 563055, 562992, 562926, 562362, 560763, 558262, 555914, 554853, 555230, 556273, 557261, 558118, 559085, 560224, 561357, 562222, 562465, 561686, 559798, 557391, 555543, 554956, 555192, 554888, 552944, 549503, 545682, 542494, 540195, 538582, 537522, 537096, 537468, 538657, 540315, 541757, 542464, 542569, 542572, 542677, 542748, 542895, 543555, 544870, 546399, 547662, 548592, 549204, 549289, 548744, 547875, 546982, 545903, 544379, 542644, 541234, 540321, 539633, 538984, 538534, 538518, 539009, 539953, 541178, 542366, 543265, 544051, 545300, 547437, 550275, 553192, 555819, 558460, 561776, 566044, 570892, 575810, 580706, 585845, 591437, 597533, 604156, 611256, 618662, 626330, 634446, 642990, 651443, 659397, 667280, 675991, 685948, 697050, 709364, 723128, 738124, 753898, 770758, 789777, 811577, 835884, 862575]
62790H62575K9861L4061L8827M4115N0213N6797O3253O9925P7736Q6468R4764
62779A508595J02085J09357J17211J24699J30434J33931J35188J33822J29427
62770B624749J22117J11978R8491Q1203O0592L7776J3841j0170l3095n4180p3339
62759B979963r0525j05110j16328j23978j28369j29920j29085j26323j21834j15708
62749A792783j08497j01180r4258q7397q0255p3143o6539o0457n4664m9130m3923
62738I73340l9059l4703l1078k7924k4616k1113j8141j6113j4502j2745j1078
62727G22268r883q791p204n278l704k682j680j48J938M094N642O317O794Q191
62713G15874J0772J3664J6150J8631K1772K5364K8770L2020L5710M0101M4994
$$ y = [862575, 892436, 926497, 965324, 1009439, 1059652, 1116449, 1179702, 1249627, 1327363, 1413831, 1508595, 1610680, 1720037, 1837248, 1961947, 2092381, 2226312, 2361500, 2495322, 2624749, 2746866, 2858844, 2957335, 3038538, 3099130, 3136906, 3150747, 3140577, 3107482, 3053302, 2979963, 2889438, 2784328, 2668000, 2544022, 2415653, 2285733, 2156648, 2030325, 1908491, 1792783, 1684286, 1583106, 1488848, 1401451, 1321196, 1248053, 1181514, 1121057, 1066393, 1017263, 973340, 934281, 899578, 868500, 840576, 815960, 794847, 776706, 760593, 746091, 733346, 722268, 712385, 703594, 696390, 691112, 687408, 684726, 683046, 682898, 684836, 688930, 694572, 700889, 707683, 715874, 726646, 740310, 756460, 775091, 796863, 822227, 850997, 883017, 918727, 958828, 1003822]
62702A003822N0254N5759O1070O5898P0740P6330Q2445Q7903R1832R4339R5768
62691A836160R5748R3240Q7369P8094O6134N2279L6780J9660J552j6263l2847
62680B317906m8112o2059p4076q3507r0396r4968r6834r5574r1953q7718q3954
62669A408755q0258p5728p0238o4520n9270n4503m9707m4577l9512l5218l1798
62658H03426k8632k5295k2213k0014j8583j7247j5704j4271j3278j2675j2200
62647F03314j1612j0789r826q990q325p433n908l847j770j25Q69J136Q08K10m39
62632E37273j135j776k043j866j682j862k164k085j491o07L91J350K047K471L001
62617E29822L890M855N527O032O722P561Q229Q624Q784Q688Q622R437J1723J4862
$$ y = [1003822, 1054076, 1109835, 1170905, 1236803, 1307543, 1383873, 1466318, 1554221, 1646053, 1740392, 1836160, 1931908, 2025148, 2112517, 2190611, 2256745, 2309024, 2345804, 2365464, 2367016, 2350753, 2317906, 2269794, 2207735, 2133659, 2050152, 1959756, 1864788, 1767954, 1672380, 1580427, 1492709, 1408755, 1328497, 1252769, 1182531, 1118011, 1058741, 1004238, 954531, 909954, 870442, 835224, 803426, 774794, 749499, 727286, 707272, 688689, 671442, 655738, 641467, 628189, 615514, 603314, 591702, 580913, 571087, 562097, 553772, 546339, 540431, 536584, 534814, 534689, 535558, 536694, 537502, 537712, 537273, 536138, 534362, 532319, 530453, 528771, 526909, 524745, 522660, 521169, 520562, 520953, 522303, 524350, 526821, 529822, 533712, 538567, 544094, 550126, 556848, 564409, 572638, 581262, 590046, 598734, 607356, 616793, 628516, 643378]
62603F43378J7602J9530K1369K3918K7357L1639L6825M2612M8155N2762N6554
62592A021701O0049O3349O5982O7421O7396O5598O1456N4534M5212L4661K3821
62581A631180J2743J148j0625k1862l2314m2032n0360n6127n9119o0455o0990
62570A251187o0311n7929n4601n1468m8519m4957m0764l6797l3510l0464k7190
62559G64677k3723k0295j7138j4551j2587j0783q806p157o529o623o407n456m265
62546F20357l238k278j446j149j422j700j582j228q24k75K94M44R2j18M73J816
62530F08216L273M264M692N093O288Q547J1180J3378J5262J7526K0287K3060K5783
62517G66849K8983L2821L6777M0579M4585M8841N2530N4853N5895N6168N5742
$$ y = [643378, 660980, 680510, 701879, 725797, 753154, 784793, 821618, 864230, 912385, 965147, 1021701, 1081750, 1145099, 1211081, 1278502, 1345898, 1411496, 1472952, 1527486, 1572698, 1607359, 1631180, 1643923, 1645071, 1634446, 1612584, 1580270, 1538238, 1487878, 1431751, 1372632, 1312177, 1251187, 1190876, 1132947, 1078346, 1026878, 978359, 933402, 892638, 855841, 822331, 791867, 764677, 740954, 720659, 703521, 688970, 676383, 665600, 656794, 649637, 643108, 636485, 630078, 624622, 620357, 617119, 614841, 613395, 612246, 610824, 609124, 607542, 606314, 605490, 605215, 605509, 605953, 606045, 605927, 606400, 608216, 611489, 615753, 620445, 625538, 631826, 640373, 651553, 664931, 680193, 697719, 718006, 741066, 766849, 795832, 828653, 865430, 906009, 950594, 999435, 1051965, 1106818, 1162713, 1218881, 1274623]
62506A274623N4315N1667M7564M1603L3751K4778J5754P135j276r521j6861k2032
62494A501500k4114k3225k0284j6068j0733m487J884P782J3665K0264K7088L2792
62482A506064L7118M1265M5799M9065M8469M2891L3458K2523J2256L568m365j3327
62470A824784k4390l7027m9742o0912o9010p3129p3883p3046p1676o9261o5211
62459A157497o0201n5161m9820m3465l6622l0634k5871k1520j7119j3119r869
62448G94096p127m740k747p27J988N045P092P547P439P952Q908R426R327R066
62434H52545Q678P638N671L088M47j773l325m449n723p362q921j0001j0857j1822
62420H13834j2628j2937j3166j3913j4813j4873j3932j2902j2437j2200j1699
$$ y = [1274623, 1328938, 1380605, 1428169, 1469772, 1503523, 1528301, 1544055, 1551190, 1549914, 1540393, 1523532, 1501500, 1477386, 1454161, 1433877, 1417809, 1407076, 1402589, 1404473, 1412255, 1425920, 1446184, 1473272, 1506064, 1543182, 1584447, 1630246, 1679311, 1727780, 1770671, 1804129, 1826652, 1838908, 1842476, 1838111, 1824784, 1800394, 1763367, 1713625, 1652713, 1583703, 1510574, 1436691, 1363645, 1291969, 1222708, 1157497, 1097296, 1042135, 992315, 948850, 912228, 881594, 855723, 834203, 817084, 803965, 794096, 786969, 782229, 779482, 778755, 780743, 785788, 792880, 800427, 807866, 815818, 824726, 834152, 843479, 852545, 861223, 868861, 874532, 877620, 878067, 876294, 872969, 868520, 862797, 855435, 846514, 836513, 825656, 813834, 801206, 788269, 775103, 761190, 746377, 731504, 717572, 704670, 692233, 680033, 668334]
62409F68334j0989j0180r014p448o018n120m465l709l069k729k206j048L42J295
62395F03976J867K441K754K316J526J302J646J710J384J688L150M840N576N393
62381F41569N138N255N594N981O344O511O422O296O347O565P053Q082R558J0885
62367G37600J1791J2853J4750J7427K0437K3704K7456L1680L6128M0565M4644
62356A019035M7867N0147N1992N3550N3877N1666M6606L9502L1433K3215J5425
62345A484315Q300J644m735j0649j5885k0496k4417k7186k8635k9417l0183l0659
62333A271997l0186k8808k7097k5263k3241k1379k0093j9111j7966j7167j7773
62322A023913j9778k1885k3127k3798k4509k5136k5197k4570k3414k1839j9947
$$ y = [668334, 657345, 647165, 638151, 630703, 624685, 619565, 615100, 611391, 608322, 605593, 603387, 602339, 602681, 603976, 605843, 608284, 611038, 613354, 614880, 616182, 617828, 619538, 620922, 622610, 625760, 630600, 636176, 641569, 646707, 651962, 657556, 663537, 669881, 676392, 682814, 689110, 695457, 702022, 709075, 717157, 726715, 737600, 749391, 762244, 776994, 794421, 814858, 838562, 866018, 897698, 933826, 974391, 1019035, 1066902, 1117049, 1169041, 1222591, 1276468, 1328134, 1374740, 1414242, 1445675, 1468890, 1484315, 1492615, 1494259, 1489524, 1478875, 1462990, 1442494, 1418077, 1390891, 1362256, 1332839, 1302656, 1271997, 1241811, 1213003, 1185906, 1160643, 1137402, 1116023, 1095930, 1076819, 1058853, 1041686, 1023913, 1004135, 982250, 959123, 935325, 910816, 885680, 860483, 835913, 812499, 790660, 770713]
62311G70713j7879j5636j3182j0827r016p735o588n479m663m078l318k350j642
62298F68320j353r67l0J292K572L582M154M155L871L961M742N799O571O980P289
62283G20938P660Q038Q347Q615R043R880J1099J2353J3460J4546J5426J5335J3952
62270H68692J2200J1222J0812R845Q117O752O770Q168J0542J3627J7099K0720
62258A004566K4940L0373L6507M1826M5451M7728M8942M8560M6239M2499L7786
62247A455417L1776K4360J6463R105K277m537j1359j7929k4335l0625l6252m0618
62235A373743m3732m5732m6262m5000m2431l9411l6239l2715k8811k4792k0995
62224I67623j7908j6014j5040j3883j1824r381p448o130n011m027l234k227o61
$$ y = [770713, 752834, 737198, 724016, 713189, 704173, 696438, 689850, 684371, 679708, 675630, 672312, 669962, 668320, 666967, 666000, 665970, 667262, 669834, 673416, 677570, 681725, 685596, 689557, 694299, 700098, 706669, 713649, 720938, 728598, 736636, 744983, 753598, 762641, 772521, 783620, 795973, 809433, 823979, 839405, 854740, 868692, 880892, 892114, 902926, 912771, 920888, 927640, 934410, 942578, 953120, 966747, 983846, 1004566, 1029506, 1059879, 1096386, 1138212, 1183663, 1231391, 1280333, 1328893, 1375132, 1417631, 1455417, 1487193, 1511553, 1528016, 1537121, 1539398, 1534861, 1523502, 1505573, 1481238, 1450613, 1414361, 1373743, 1330011, 1284279, 1238017, 1193017, 1150586, 1111175, 1074936, 1042221, 1013410, 988618, 967623, 949715, 933701, 918661, 904778, 892954, 883573, 876125, 869995, 864984, 860957, 857723, 855496, 854835]
62211H54835R93K032K652L679N325P038Q497R917J1341J2374J2800J2835J2598
62198I56916J1809J0247Q126N866L778J949K29j625l540m933n181m340l080k022
62184I74199j239m39N94J623K038J429J37j027j620j773j558o51J147L541O163
62169I82564Q997J2166J5646J9392K3287K6768K9048K9960L0050K9582K7968K4556
62157A259984J9455J3379P208J962j656m126o873j0648j4755j8253k1068k3392
62145A201217k4945k5649k6195k6954k7018k5371k2416j9341j6597j4021j1873
62134I60837j0523r498q168p097p481r322j1359j2730j3542j3828j3261j2016
62122H32012j0769r529p599m981k675j215O4J749L212L455K413P90r19k660m342
$$ y = [854835, 855828, 857860, 860512, 864191, 869516, 876554, 885051, 894968, 906309, 918683, 931483, 944318, 956916, 968725, 978972, 987098, 992964, 996742, 998691, 998920, 997295, 993755, 988822, 983641, 979301, 976221, 974199, 972960, 972521, 973115, 974738, 976776, 978205, 978342, 977315, 975695, 973922, 972364, 971713, 972860, 976401, 982564, 991561, 1003727, 1019373, 1038765, 1062052, 1088820, 1117868, 1147828, 1177878, 1207460, 1235428, 1259984, 1279439, 1292818, 1300026, 1301988, 1300332, 1296206, 1289333, 1278685, 1263930, 1245677, 1224609, 1201217, 1176272, 1150623, 1124428, 1097474, 1070456, 1045085, 1022669, 1003328, 986731, 972710, 960837, 950314, 940816, 932648, 925551, 918070, 908748, 897389, 884659, 871117, 857289, 844028, 832012, 821243, 811714, 804115, 799134, 796459, 795244, 795308, 797057, 800269, 803724, 806137, 806927, 806008, 803348, 799006]
62107G99006n669o268n850m499k912k054k421l746n396o705p189o896o363n850
62093G27188m914l248j559p02l55M23J587K257K458L245M749N550M765L615L914
62078G48973N781P850R165R917J0589J1310J2012J2607J2993J3227J3620J4406
62066H82450J5515J6874J8576K0477K1944K2396K1746K0054J7214J3382R303N593
62054A085524K029j910o029r571j2331j4978j8135k1637k4870k7521k9668l1359
62042H89544l2399l2618l2064l0893k9179k7019k4744k2744k1029j9248j7267
62031F00340j5383j3756j2050j0054q246p178o554n614m308l341l080l134l115
62018E04527l056k906k373j591j198j385j466q81o6K16j3j30J38N75J060J749
$$ y = [799006, 793337, 787069, 781219, 776720, 773808, 771754, 769333, 765587, 760191, 753486, 746297, 739401, 733038, 727188, 722274, 719026, 717467, 716765, 716410, 716833, 718420, 720677, 723135, 726380, 731129, 736679, 741444, 745059, 748973, 754754, 762604, 771769, 781686, 792275, 803585, 815597, 828204, 841197, 854424, 868044, 882450, 897965, 914839, 933415, 953892, 975836, 998232, 1019978, 1040032, 1057246, 1070628, 1079931, 1085524, 1087553, 1085643, 1079614, 1070043, 1057712, 1042734, 1024599, 1002962, 978092, 950571, 920903, 889544, 857145, 824527, 792463, 761570, 732391, 705372, 680628, 657884, 636855, 617607, 600340, 584957, 571201, 559151, 549097, 540851, 533673, 527119, 521505, 517197, 513856, 510776, 507642, 504527, 501471, 498565, 496192, 494601, 493403, 492018, 490552, 489671, 489605, 489821, 489808, 489678, 489816, 490391, 491451, 493200]
62002D93200K682L635M345M638M483M109L908L957L862L307K416J301l50k718
61988E32775n202o916p693q091q473q614q283p620o862o065n332m857m571m036
61974D40160l041j989j458j513j733j808j793j841j933j924j667j099l79P0r0
61959D17962o58j037r19n94m03k23K41R17J491J888K234K534K794L391M618N928
61943D40164O336N764N328N908P174Q352R295J0170J0686J0464R845R465R294
61930E48245Q774P787O700N579M121K392Q69k59j184j811j794j348j229j610j740
61915E73492r58N57K374M383O368P800Q592R464J0881J2187J2565J2346J2451
61902F72502J2874J2734J1859J1230J1582J2472J3187J3866J5069J6779J8568
$$ y = [493200, 495882, 499517, 503862, 508500, 512983, 517092, 521000, 524957, 528819, 532126, 534542, 535843, 535493, 532775, 527573, 520657, 512964, 504873, 496400, 487786, 479503, 471883, 465021, 458956, 453624, 448767, 444196, 440160, 437119, 435130, 433672, 432159, 430426, 428618, 426825, 424984, 423051, 421127, 419460, 418361, 417982, 418052, 417962, 417304, 416267, 415348, 414754, 414351, 414128, 414369, 415286, 416777, 418665, 420899, 423433, 426227, 429618, 434236, 440164, 446500, 452264, 457592, 463500, 470674, 479026, 488321, 498491, 509177, 519641, 529486, 538951, 548245, 557019, 564806, 571506, 577085, 581206, 583598, 584467, 584208, 583024, 581213, 579419, 578071, 576842, 575232, 573492, 572534, 573091, 575465, 579848, 586216, 594016, 602608, 612072, 622953, 635140, 647705, 660051, 672502, 685376, 698110, 709969, 721199, 732781, 745253, 758440, 772306, 787375, 804154, 822722]
61891H22722K0375K2350K4021K4485K3488K1571J8856J4565Q233P99o301j2641
61879I82523j8617k4020k7863k9730l0291l0135k8931k6266k2679j9226j6439
61868G08326j4278j2630j1293r742p583n156l227k133j582j088k55J129K887M518
61854F47893N816P189Q953J0627J1440J1374J1137J1267J1655J1852J1415J0122
61842G70740Q290O612N332L785J344j518l665m625m826m656l990k744j204L49
61828G69224J956L750N683P458Q609Q823Q422Q197Q487Q754Q447P749P044O247
61814H68850N342N014N837P344Q724R968J1162J1174Q457L175k852q382j3671
61801I20142j8907k3048k4877k4355k2369j9884j7628j5898j4236j1960r226o916
$$ y = [822722, 843097, 865447, 889468, 913953, 937441, 959012, 977868, 992433, 1000666, 1001465, 995164, 982523, 963906, 939886, 912023, 882293, 852002, 821867, 792936, 766670, 743991, 724765, 708326, 694048, 681418, 670125, 660383, 652800, 647644, 644417, 642284, 640702, 639614, 639359, 640488, 643375, 647893, 653709, 660898, 669851, 680478, 691918, 703292, 714429, 725696, 737351, 749203, 760618, 770740, 779030, 785642, 790974, 794759, 796103, 794585, 790920, 786295, 781469, 776813, 772823, 770079, 768875, 769224, 771180, 774930, 780613, 788071, 796680, 805503, 813925, 822122, 830609, 839363, 847810, 855559, 862603, 868850, 874192, 879206, 885043, 892387, 901111, 911079, 922241, 933415, 941872, 945047, 942195, 933813, 920142, 901235, 878187, 853310, 828955, 806586, 786702, 769074, 753176, 738940, 726980, 717754, 710838]
61789G10838n370m060k756j997k029k159j665n97P15K163L497M277M609N235O425
61774G17126P595Q452R644J1667J3988J5984J7951K0517K3591K6737L0030L3770
61762I37052L7763M1542M4922M7704M9262M9027M7027M3325L7348K8453J6923
61751A380348L913r336k1742l2248m0132m5352m8240m9021m7968m5685m2829l9767
61739I61941l6715l3844l0990k7750k4199k1069j8886j7307j5669j3720j1535
61728G10257r301p559p021p591q097p540o221n100m513m058l379k520j707j208
61714F34442j148j256j182j219k024l383m149l851l465l871m437m094l103k656
61700E94604l138l879m397m811n068m774l967l390l683m662n470n323m211l079
$$ y = [710838, 705468, 701408, 698652, 696655, 694626, 692467, 690802, 690205, 690920, 693083, 696580, 700857, 705466, 710701, 717126, 724721, 733173, 742817, 754484, 768472, 784456, 802407, 822924, 846515, 873252, 903282, 937052, 974815, 1016357, 1061279, 1108983, 1158245, 1207272, 1254299, 1297624, 1334972, 1363425, 1380348, 1384261, 1374925, 1353183, 1320935, 1280803, 1235451, 1187211, 1138190, 1090222, 1044537, 1001708, 961941, 925226, 891382, 860392, 832642, 808443, 787374, 768488, 751181, 735512, 721792, 710257, 700956, 693397, 686376, 678785, 670688, 663148, 656927, 651827, 647314, 643256, 639877, 637357, 635650, 634442, 633294, 632038, 630856, 629637, 627613, 624230, 620081, 616230, 612765, 608894, 604457, 600363, 597260, 594604, 591466, 587587, 583190, 578379, 573311, 568537, 564570, 561180, 557497, 552835, 547365, 542042, 537831, 534752]
61686E34752k919l525l735l143k762l341l955l304j822j199j935k625j936l35
61672D98216O82M38l25m46M33J650K401K733L370M674O267P762R297J0994J2491
61657E60637J3392J3706J3394J1981R168N377J363k322n169o705p103p156p100
61644E93463o243m274k105o23N84K289M203N602O733Q389J0490J2194J3051J2896
61630F56649J0992O703Q95m575q805j2209j5001j6583j6637j5721j4442j2918
61618E58348j1297r981r020p985o682n464m669m340m419m690m601l836k927k650
61604D75787k979l373l714m086l970k844j452j125j827k217j824j707k450k950
61590D39269k095n09L63J61l38n53n54m86l24q2K11N88R25R26O35N87J100J738
$$ y = [534752, 531833, 528308, 524573, 521430, 518668, 515327, 511372, 508068, 506246, 505047, 503112, 500487, 498551, 498216, 498898, 499336, 499011, 498565, 498998, 500648, 503049, 505782, 509152, 513826, 520093, 527855, 537152, 548146, 560637, 574029, 587735, 601129, 613110, 622278, 627655, 629018, 626696, 621527, 614822, 607719, 600563, 593463, 587220, 582946, 580841, 580218, 580802, 583091, 587294, 592896, 599629, 608018, 618508, 630702, 643753, 656649, 667641, 674344, 675239, 670664, 661859, 649650, 634649, 618066, 601429, 585708, 571266, 558348, 547051, 537070, 528050, 520065, 513383, 507919, 503250, 498910, 494491, 489801, 485200, 481364, 478437, 475787, 472808, 469435, 465721, 461635, 457665, 454821, 453369, 452244, 450417, 448200, 446376, 444669, 442219, 439269, 437174, 436665, 437028, 437189, 436851, 436298, 435744, 435258, 434934, 434852, 435063, 435651, 436576, 437502, 438137, 438724, 439824, 441562]
61572D41562J889J628J607K211L122L727L785L739M284N531O720O985O309N373
61558D98472M698M304M009L558K641J319L34L17Q07O78m13j680k261k019j239
61543E13525k42N18O78M34K94K53j04o09l97Q71K350K932K437J548R47P49N58
61526E26742o2j021j679j724j708k185k684k359j338m42L23J724L634M735M430
61511E26386L823M082M825N098N078N715P159Q643R734J0777J2068J3389J4447
61498F31224J5182J5557J5487J5113J4782J4556J3985J2515J0083P243M721K822
61486G73270J286j92j418j807j024O60K570M017M578M264L426K403J310K28o65
61471G92906j333j918k346k321k057k473m116o342q129r310j0222j0697j0307
$$ y = [441562, 443451, 445079, 446686, 448897, 452019, 455746, 459531, 463270, 467554, 473085, 479805, 486790, 493099, 498472, 503170, 507474, 511483, 515041, 517682, 519001, 519335, 519652, 520459, 521137, 520724, 519044, 516783, 514764, 513525, 513283, 513801, 514479, 514913, 515207, 515460, 515356, 514747, 514350, 515221, 517571, 520503, 522940, 524488, 525435, 526184, 526742, 526680, 525659, 523980, 522256, 520548, 518363, 515679, 513320, 511982, 511540, 511863, 513587, 517221, 521956, 526386, 530209, 534291, 539116, 544214, 549292, 555007, 562166, 570809, 580543, 591320, 603388, 616777, 631224, 646406, 661963, 677450, 692563, 707345, 721901, 735886, 748401, 758484, 765727, 770448, 773270, 774556, 774364, 772946, 771139, 770115, 770775, 773345, 777362, 781940, 786204, 789630, 792033, 793343, 793571, 792906, 791573, 789655, 787309, 784988, 782931, 780458, 776342, 770000, 761871, 752561, 742339, 731642, 721335]
61458G21335r335q411p344n425k860q14J22M82P99J023J272K084L436M508M957
61443G05829N498O616P575P460O480N454M541L224J334o50k173l066l567m119
61429G40436m864n268m567k758o60J100K603M045N195N844O214O539O612O045
61415G66516M620K297o02l208m724n377o090o966p050n885m501m198m967n799
61401G14066o053n942n870n907n771n145m108l266l074l129k683j833j314j179
61387F58792o36N74J772K712M246O827R399J0753J1230J1992J3163J3819J3562
61374G58205J2985J2531J1776J0131P686N106K924J058r89l402n613o932p567
61361G97899q356r386r610q293o227m857m633m692l980k317m81M20k6j071j688
$$ y = [721335, 712000, 703589, 696245, 690820, 687960, 687146, 687268, 687750, 688549, 689572, 690844, 692928, 696364, 700872, 705829, 711327, 717943, 725518, 732978, 739458, 744912, 749453, 752677, 754011, 753361, 751188, 748122, 744555, 740436, 735572, 730304, 725737, 722979, 722319, 723419, 726022, 730067, 735262, 741106, 747320, 753859, 760471, 766516, 771136, 773433, 772831, 769623, 764899, 759522, 753432, 746466, 739416, 733531, 729030, 724832, 719865, 714066, 708013, 702071, 696201, 690294, 684523, 679378, 675270, 672004, 668930, 665801, 663118, 661285, 659971, 658792, 658156, 658730, 660502, 663214, 667460, 674287, 683686, 694439, 705669, 717661, 730824, 744643, 758205, 771190, 783721, 795497, 805628, 813314, 818420, 821344, 822402, 821413, 818011, 812398, 805466, 797899, 789543, 780157, 770547, 762254, 756027, 751170, 746537, 741845, 737865, 735548, 735067, 735487, 735461, 734390, 732702]
61346G32702j877k496l760m745m728m174l835l590k833j539l19K68N7o93j329
61331F97109j263p02m11n15k98N45J351J655K043L098M252M648M568N087O574
61316G27741Q349R682J0507J1235J2312J3782J5119J5747J5903J6434J7546J8374
61304H92731J8079J6626J4210J0829O908L368M25k778o616j0002j1862j2710j3729
61291I05479j4977j5644j5492j4932j4128j3073j2220j1947j1704j0641q758o650
61279G55313m553k604j400j258j260l07J245K148K119J920J810J351P36Q97K081
61264G58238L504M722O130P828Q986Q897P822O358M783L380K675K799L196L392
61250H32710L693M751O753R269J1548J2905J3140J2667J1895J0544P986M250J96
$$ y = [732702, 730825, 728329, 724569, 719824, 715096, 710922, 707087, 703497, 700664, 699125, 698806, 699074, 699131, 698438, 697109, 695846, 695144, 694733, 694218, 693920, 694465, 695816, 697471, 699514, 702612, 706864, 711512, 716080, 721167, 727741, 736090, 745772, 756279, 767514, 779826, 793608, 808727, 824474, 840377, 856811, 874357, 892731, 910810, 927436, 941646, 952475, 959383, 962751, 963176, 960398, 953782, 943780, 931918, 919208, 905479, 890502, 874858, 859366, 844434, 830306, 817233, 805013, 793066, 781362, 770721, 761963, 755313, 750760, 748156, 746756, 745498, 744238, 743931, 745176, 747324, 749443, 751363, 753173, 754524, 755260, 756157, 758238, 761742, 766464, 772594, 780422, 789408, 798305, 806127, 812485, 817268, 820648, 823323, 826122, 829318, 832710, 836403, 841154, 847907, 857176, 868724, 881629, 894769, 907436, 919331, 929875, 937861, 942111, 942307]
61237I42307l341o083q001q895q541o999m709k338l43J476L629O017P867Q901
61223I20947R852J1244J2326J2017J0402Q422O545M716L184K249J482K92q31q49
61209A001998P0N46r4r93j121l65J032L111N684Q023R729J1321J3395J5588J6881
61194A084805J6680J5267J3390J1499R257N966J799j769l465l889m734o408p600
61181A130798p406o804p257q773j0132j0576j0434j0310j0344j0260r798q943
61169A019761q012p407p223p140o697n599l873j956m94L19J050K324L948N247
61155I84248O176P486R602J2018J3933J5016J5221J4344J2224R150N748K548j25
61142A107589k014k991l236l146k996k694k023j050j68L95Q68J502K042K120K018
$$ y = [942307, 938966, 932883, 924882, 915987, 907446, 900447, 895738, 893400, 893057, 894533, 898162, 904179, 912046, 920947, 930799, 942043, 954369, 966386, 976788, 985210, 991755, 996471, 999655, 1001904, 1003386, 1003678, 1002847, 1001998, 1002068, 1002614, 1002520, 1001527, 1000406, 1000041, 1001073, 1004184, 1009868, 1017891, 1027620, 1038941, 1052336, 1067924, 1084805, 1101485, 1116752, 1130142, 1141641, 1150898, 1156864, 1158663, 1156894, 1153429, 1149540, 1144806, 1138398, 1130798, 1123392, 1116588, 1109331, 1100558, 1090426, 1079850, 1069416, 1059106, 1048762, 1038502, 1028704, 1019761, 1011749, 1004342, 997119, 989979, 983282, 977683, 973810, 971854, 971360, 971679, 972729, 975053, 979001, 984248, 990424, 997910, 1007512, 1019530, 1033463, 1048479, 1063700, 1078044, 1090268, 1099418, 1105166, 1107714, 1107589, 1105575, 1102584, 1099348, 1096202, 1093206, 1090512, 1088489, 1087439, 1087271, 1087666, 1088534, 1090036, 1092078, 1094198, 1096216]
61127A096216K465L598M816N833P098Q737R889R726Q697Q074Q545R745J0921J1543
61113A205903J1513J1125J0686J0017Q820P470O709O343N214K865K09k121m954
61100A279799r103j3761j7491k0088k2230k3954k4841k5178k5599k5858k5240
61089A046456k3941k2797k1873k0588j9027j7851j6995j5823j4461j3664j3273
61078H46163j2233j0360q799q312q190p433o046m701l789l275k960k662k399k363
61064G62641k376j791m98N36O01M48J169K387K977L176M378O850R191J0295J0513
61049H10497J0622J0903J1553J2777J4116J4745J4731J5011J5939J6809J7153
61038I64856J7396J7973J8703J9304J9752J9985K0045K0443K1588K3036K4196
$$ y = [1096216, 1098681, 1102279, 1107095, 1112928, 1120026, 1128763, 1138652, 1148378, 1157075, 1165149, 1173694, 1183439, 1194360, 1205903, 1217416, 1228541, 1239227, 1249244, 1258064, 1265534, 1272243, 1278586, 1283800, 1286665, 1286874, 1284753, 1279799, 1270696, 1256935, 1239444, 1219356, 1197126, 1173172, 1148331, 1123153, 1097554, 1071696, 1046456, 1022515, 999718, 977845, 957257, 938230, 920379, 903384, 887561, 873100, 859436, 846163, 833930, 823570, 814771, 806459, 798269, 790836, 784790, 780089, 776300, 773025, 770065, 767403, 765004, 762641, 760265, 758474, 757976, 758512, 759113, 759561, 760730, 763117, 766094, 769270, 773648, 780498, 789689, 799984, 810497, 821119, 832022, 843575, 856352, 870468, 885213, 899944, 914955, 930894, 947703, 964856, 982252, 1000225, 1018928, 1038232, 1057984, 1077969, 1098014, 1118457, 1140045, 1163081, 1187277]
61027A187277K5515K7822L0802L3362L5156L6493L7214L7240L7916M1025M6638
61016A576460N3562O1585P1300Q2007R2099J01615J12390J25843J42967J66261
61006B586089J98764K41192K93121L56811M35981N30507O37340P58164R01113
60997F939082J072760J273418J499573J735262J926732J976395J793725J375283
60989A9592230Q32468L27644k2377j85287j80699m4723J57973L11257K81386L084
60979B1072956m65474r80220j405332j676518j794824j787783j686354j523152
60971I753299j331033j135694r52407p89579o51473n37571m43924l67030l05080
60962C239508k55998k16987j86222j62745j44529j28738j14080j01067q9909q0013
$$ y = [1187277, 1212792, 1240614, 1271416, 1304778, 1339934, 1376427, 1413641, 1450881, 1488797, 1529822, 1576460, 1630022, 1691607, 1762907, 1844914, 1937013, 2038628, 2151018, 2276861, 2419828, 2586089, 2784853, 3026045, 3319166, 3675977, 4111958, 4642465, 5279805, 6037969, 6939082, 8011842, 9285260, 10784833, 12520095, 14446827, 16423222, 18216947, 19592230, 20424698, 20752342, 20729965, 20544678, 20363979, 20319256, 20477229, 20788486, 21069872, 21072956, 20607482, 19627262, 18221930, 16545412, 14750588, 12962805, 11276451, 9753299, 8422266, 7286572, 6334165, 5544586, 4893113, 4355542, 3911618, 3544588, 3239508, 2983510, 2766523, 2580301, 2417556, 2273027, 2144289, 2030209, 1929142, 1839233, 1759220]
60952A759220p1362o4411n8491n2280m6050m1537l9362l8339l7593l7456l7903
60941A234436l7959l7220l6336l5477l3888l1540k9589k8495k7213k5013k2613
60930H89093k0699j8709j6176j3985j3062j2715j1629r894q808q902r244q780
60918G36490p517o206n282m469l400k344k028k578l105k720j564m04L89Q23O79
60903F96764k54j574k669l495m218m498m061l627m157n331n972n814n661n791
60889F39642n573m858m345m161l390j680k40l26j574k626k863k715k737l022l450
60874E96082l887m199m285m005l152j744l21M79N52K64j17m58m95p2M89Q04J054
60857E76989J527J828J345L20l91n14m91m87k44R6M1l22m13k75n97j518k405l069
$$ y = [1759220, 1687858, 1623447, 1564956, 1512676, 1466626, 1425089, 1385727, 1347388, 1309795, 1272339, 1234436, 1196477, 1159257, 1122921, 1087444, 1053556, 1022016, 992427, 963932, 936719, 911706, 889093, 868394, 849685, 833509, 819524, 806462, 793747, 782118, 772224, 763416, 754514, 745270, 736490, 728973, 722767, 717485, 713016, 709616, 707272, 705244, 702666, 699561, 696841, 695277, 694873, 695262, 696085, 696764, 696510, 694936, 692267, 688772, 684554, 680056, 675995, 672368, 668211, 662880, 656908, 651094, 645433, 639642, 634069, 629211, 624866, 620705, 617315, 615635, 615395, 615069, 613495, 610869, 608006, 605291, 602554, 599532, 596082, 592195, 587996, 583711, 579706, 576554, 574810, 574489, 574968, 575520, 575784, 575667, 575209, 574714, 574642, 575131, 575935, 576989, 578516, 580344, 581689, 582009, 581618, 581104, 580613, 580126, 579882, 579978, 580019, 579697, 579284, 579009, 578412, 576894, 574489, 571420]
60839E71420m085n537o546o552o110n874n655n112m529m243l999l583l423l876
60825E02296m379m105l027j737n84M15J033R18J33p82j292j221q15n68p46j044
60809D84495r79o50n94q73r32n30j75k84n58n60m53o52j156j596j710j453r82
60792D70358p36j081j693j745j002j97K9o5RP3k69p97j028j115j588k348k710
60775D54095k441k043j846j507p64n5J09jL47J229J980K181K193K407K566K317
60759D60767K058K490L433L825L058J716P07K63J61L62Q97J498J846K047K398
60744D87526K869L108K793J761J30j473k224j992j484j260j089p57p38j418k166
60729D83586k031j066j69J41M5k12n83r29j202j666k389k795k475k068k457l340
$$ y = [571420, 567335, 561798, 555252, 548700, 542590, 536716, 531061, 525949, 521420, 517177, 513178, 509595, 506172, 502296, 497917, 493812, 490785, 489048, 488464, 488879, 489912, 490830, 490963, 490181, 488889, 487668, 486853, 486285, 485539, 484495, 483516, 482866, 482272, 481399, 480467, 479937, 479762, 479478, 478920, 478360, 477907, 477255, 476099, 474503, 472793, 471340, 470358, 469622, 468541, 466848, 465103, 464101, 463904, 463933, 463868, 463877, 463950, 463681, 462884, 461856, 460741, 459153, 456805, 454095, 451654, 449611, 447765, 446258, 445494, 445439, 445548, 445547, 445894, 447123, 449103, 451284, 453477, 455884, 458450, 460767, 462825, 465315, 468748, 472573, 475631, 477347, 478054, 478317, 478478, 478840, 479737, 481235, 483081, 485128, 487526, 490395, 493503, 496296, 498057, 498187, 496714, 494490, 492498, 491014, 489754, 488665, 487908, 487170, 485752, 483586, 481555, 480489, 480320, 480461, 480506, 480294, 479711, 478782, 477580, 475914, 473525, 470730, 468255, 466187, 463730, 460390]
60713D60390l515k529j191m23m57j099j941k287j707p27l01n55p99o95o17q04
60697D40743r35p36l15J40M57L45k29o78m81k2N8L3O47J730K378K460K731L393
60679D51719L691L238K657K599L038L808M847N670N514M306K743J244k10j231
60665D93633j194n23n32j591k555k487j802j150l74P08J521J607J406J414J370
60650D89451R70O38Q41J354J853K492L146K977J559k15j274j779k602l880m937
60635D90594n227m602l089j174R9J35m42o15k34K03M95Q04J064J126J145J178
60619D81460P80k58j084o08J033K531K978K610K084J731J640J861K198K237J781
60604E02974J095O20N71Q20J000Q00K78j46j56J20K90J44j56k19K73J299K489
$$ y = [460390, 456875, 454346, 453155, 452732, 452275, 451176, 449235, 446948, 445241, 444514, 444213, 443658, 442859, 442164, 441547, 440743, 439808, 439072, 438757, 438897, 439354, 439699, 439470, 438792, 438311, 438289, 438347, 438380, 439027, 440757, 443135, 445595, 448326, 451719, 455410, 458648, 461305, 463904, 466942, 470750, 475597, 481267, 486781, 491087, 493830, 495074, 494864, 493633, 492439, 491916, 491384, 489793, 487238, 484751, 482949, 481799, 481425, 482133, 483654, 485261, 486667, 488081, 489451, 490421, 491059, 491900, 493254, 495107, 497599, 500745, 503722, 505281, 505066, 503792, 502013, 499411, 495531, 490594, 485367, 480765, 477676, 476502, 476601, 476736, 476294, 475679, 475445, 475648, 476143, 476947, 478011, 479137, 480282, 481460, 482240, 481982, 480898, 480290, 481323, 483854, 486832, 489442, 491526, 493257, 494897, 496758, 498956, 501193, 502974, 504069, 504689, 505260, 506080, 507080, 507880, 508158, 508012, 507856, 507976, 508266, 508410, 508254, 508035, 508308, 509607, 512096]
60587E12096L465M045M109L584K799K445K701K849K319J659J732K278K321J782
60573E50184J613K288L211L903M663N775O930P819Q548R110R179Q667P843O688
60559F36421N009L232K103J415J70j683k815k360j006L29J691L196M147M104L922
60544F57875M613N919O960P710Q753J0116J1432J2844J4829J7306J9767K2048
60532H00172K4277K6219K7303K7102K5325K1641J6055R185J876n158j1114j5177
60520I47706j7230j8029j8305j8229j7906j7525j6678j4517j1093p632m957k634
60508G82971k86J494K454L752O495J0101J3364J6384K0079K4397K8395L1730L4801
60495I76131L7636L9748M0895M0932L9333L5901L1703K8135K5342K2630K0197
$$ y = [512096, 515561, 519606, 523715, 527299, 530098, 532543, 535244, 538093, 540412, 542071, 543803, 546081, 548402, 550184, 551797, 554085, 557296, 561199, 565862, 571637, 578567, 586386, 594934, 604044, 613223, 621890, 629733, 636421, 641430, 644662, 646765, 648180, 648350, 646667, 643852, 641492, 640486, 640815, 642506, 645702, 649849, 653953, 657875, 662488, 668407, 675367, 683077, 691830, 701946, 713378, 726222, 741051, 758357, 778124, 800172, 824449, 850668, 877971, 905073, 930398, 952039, 968094, 977279, 979155, 973997, 962883, 947706, 930476, 912447, 894142, 875913, 858007, 840482, 823804, 809287, 798194, 790562, 785605, 782971, 782685, 784179, 786633, 790385, 796880, 806981, 820345, 836729, 856808, 881205, 909600, 941330, 976131, 1013767, 1053515, 1094410, 1135342, 1174675, 1210576, 1242279, 1270414, 1295756, 1318386, 1338583]
60484A338583J9088J9515K0429K0786J9994J7045J0555L40j1856k3843l4612m4257
60472A351767n2764n9367o2935o2897n9875n5314n0322m5167l9994l5400l1774
60461G95958k8610k5227k1747j8836j6740j5268j4294j3588j2528j0709q567o819
60449F03025n573m607l984l701l232k297j536j619k087k044j535j246j275j284
60435E67005j491k260k947k489j159m75j134k098k017p28Q77J751J380K35l98
60420E54052K83J584K209K000J907K488L382M134M512M071K550Q33M31J647L183
60405E89266L806L533K966K419K100K315K953L388L344L315L793M599N247N556
60391F38600N565N364N146N132N228N100M645M007L211K265J557J514J897J984
$$ y = [1338583, 1357671, 1377186, 1397615, 1418401, 1438395, 1455440, 1465995, 1466335, 1454479, 1430636, 1396024, 1351767, 1299003, 1239636, 1176701, 1113804, 1053929, 998615, 948293, 903126, 863132, 827732, 795958, 767348, 742121, 720374, 701538, 684798, 669530, 655236, 641648, 629120, 618411, 609844, 603025, 597452, 592845, 588861, 585160, 581928, 579631, 578095, 576476, 574389, 572345, 570810, 569564, 568289, 567005, 565514, 563254, 560307, 557818, 556659, 556184, 555050, 552952, 550935, 550207, 551084, 552835, 554215, 554450, 554052, 554335, 555919, 558128, 560128, 562035, 564523, 567905, 572039, 576551, 580622, 583172, 584005, 584436, 586083, 589266, 593072, 596605, 599571, 601990, 604090, 606405, 609358, 612746, 616090, 619405, 623198, 627797, 633044, 638600, 644165, 649529, 654675, 659807, 665035, 670135, 674780, 678787, 681998, 684263, 685820, 687334, 689231, 691215]
60377F91215J606J331J503J733J564J115P69N51K32j99l90M1J061K106K588K584
60361G09410K787L683N077O522P720Q377Q301Q015Q477R729J0511R869Q387P120
60347H13985O022M395K251J11k036m474o751q051q403q508q527q018o960n897
60333G59139n144m601m238m006l636l188l367m477n576n668n044m400l371j379
60319G01044O92J507J611K874N617Q116R172R449R810J0048R916R875J0027R509
60305G99267P795N642M156L681M037M816N148M092J830n38k606n084q269j1274
60291H12693j3243j4271j4576j3832j1994r907q404p465o641n672m500l428l355
60278F95405m847o858p574o725n774n621n572n071m693m773m525l574k948l289
$$ y = [691215, 692821, 694152, 695655, 697388, 698952, 700067, 700836, 701387, 701619, 701420, 701030, 701071, 702132, 704238, 706826, 709410, 712197, 715880, 720957, 727479, 735199, 743576, 751877, 759892, 768369, 778098, 788609, 798478, 806865, 813985, 820007, 824402, 826653, 826764, 824728, 820254, 813503, 805452, 797049, 788541, 780014, 771996, 765036, 759139, 753995, 749394, 745156, 741150, 737514, 734326, 730959, 726482, 720906, 715238, 710194, 705794, 702423, 701044, 701736, 703243, 704854, 707728, 713345, 721461, 730633, 740082, 749892, 759940, 769856, 779731, 789758, 799267, 807062, 812704, 816860, 820541, 824578, 829394, 834542, 838634, 840464, 839926, 837320, 832236, 823967, 812693, 799450, 785179, 770603, 756771, 744777, 734870, 726466, 719001, 712360, 706688, 702188, 698760, 695405, 690558, 683700, 676126, 669401, 663627, 658006, 652434, 647363, 642670, 637897, 633372, 629798, 626850, 623561]
60264F23561l416k002K56J601J600J204J012Q24O53R30J675K366K579K274J624
60249F36741J058J060J537J773J442J057J023R43M85J47M73J076J254J043J010
60234F52122J421K228L386M625N483O058P107Q863J0433J1140J1638J2839J4379
60221G51722J5156J4960J4553J4476J4669J5056J5664J6210J6207J5480J4195
60210I18348J2675J1527J1428J2256J2892J2474J1405J0575J0136R750R412R247
60198A052125Q833P701O219N164M524L461J472j065l355m778n143m900m862n275
60184A060121n372m419k888j990k174k712k777k377k086k181k273j771p30j9m00
60169A025952j632k991m445o477q792j0265j0508j0417j0664j0590r383p483n901
$$ y = [623561, 620145, 618143, 618399, 620000, 621600, 622804, 623816, 624640, 625293, 626223, 627898, 630264, 632843, 635117, 636741, 637799, 638859, 640396, 642169, 643611, 644668, 645691, 646634, 647119, 647266, 647739, 648815, 650069, 651112, 652122, 653543, 655771, 659157, 663782, 669265, 675323, 682430, 691293, 701726, 712866, 724504, 737343, 751722, 766878, 781838, 796391, 810867, 825536, 840592, 856256, 872466, 888673, 904153, 918348, 931023, 942550, 953978, 966234, 979126, 991600, 1003005, 1013580, 1023716, 1033466, 1042878, 1052125, 1060958, 1068659, 1074878, 1080042, 1084566, 1088027, 1089499, 1088434, 1085079, 1080301, 1075158, 1070258, 1065396, 1060121, 1054749, 1050330, 1047442, 1045452, 1043278, 1040566, 1037789, 1035412, 1033326, 1031145, 1028872, 1027101, 1026371, 1026352, 1025952, 1024320, 1021329, 1016884, 1010407, 1001615, 991350, 980842, 970425, 959761, 949171, 939788, 932305, 926404]
60156I26404m745l415j804l82O63J567K411L031L313L113K221R26J71N28J356
60141I35358J611J175Q06J018J679K479L233L892M638N714O837P165O330N094
60127I87029M461M557M842N059N384N946O746P788Q965J0102J1304J2812J4256
60114A089251J4796J4362J3971J4311J4803J4667J4056J3355J2258J0587R195
60103A235612Q899R034Q341O894N856N605N325M448L274K018K60k336n453q506
60089A279271j1127j3257j5166j7338j9751k1537k1913k1208k0318j9417j8024
60078A080215j6108j4232j2605j0865r002p660p278p488p582p174o359n539n162
60065I63161n313n622n780n928o256o556o597o559o605o477o050n828o174o450
$$ y = [926404, 921659, 918244, 916440, 916058, 916721, 918288, 920699, 923730, 927043, 930156, 932377, 933303, 933474, 934002, 935358, 936969, 938144, 938950, 939968, 941647, 944126, 947359, 951251, 955889, 961603, 968440, 975605, 981935, 987029, 991490, 996047, 1000889, 1005948, 1011332, 1017278, 1024024, 1031812, 1040777, 1050879, 1062183, 1074995, 1089251, 1104047, 1118409, 1132380, 1146691, 1161494, 1176161, 1190217, 1203572, 1215830, 1226417, 1235612, 1244511, 1253545, 1261886, 1268780, 1274636, 1280241, 1285566, 1290014, 1293288, 1295306, 1295566, 1293230, 1287777, 1279271, 1268144, 1254887, 1239721, 1222383, 1202632, 1181095, 1159182, 1137974, 1117656, 1098239, 1080215, 1064107, 1049875, 1037270, 1026405, 1017403, 1009743, 1002465, 994977, 987395, 980221, 973862, 968323, 963161, 957848, 952226, 946446, 940518, 934262, 927706, 921109, 914550, 907945, 901468, 895418, 889590, 883416, 876966]
60051H76966n775m329l047k184j161K27J410K034K485L229M180N008N486N411
60037H89940M687L661K911K554K170J542R80P71O56J66p91j849k651l264m113
60022H97370n416o766p551p727p764p806p470o667o008n959o202o310o450o864
60008H02410p133o738n935n422n312n131m625l958l236k415j531o46L85J641K887
59993G55241L944N049O476Q062R484J0705J1735J2361J2443J2143J1450J0000
59981H69093P735N245L001Q61j242k738l294l620m660o356p888q695q683p890
59967H30869o592n352m339l103j468L9J164K500M278N502N306M410M076M223L785
59952H45298K489J100K85K52J132K641L772L819L328L084K827K080J463J804K528
$$ y = [876966, 871191, 866862, 863815, 861631, 860470, 860697, 862107, 864141, 866626, 869855, 874035, 879043, 884529, 889940, 894627, 898288, 901199, 903753, 905923, 907465, 908445, 909216, 909872, 910038, 909247, 907398, 904747, 901483, 897370, 891954, 885188, 877637, 869910, 862146, 854340, 846870, 840203, 834195, 828236, 822034, 815724, 809274, 802410, 795277, 788539, 782604, 777182, 771870, 766739, 762114, 758156, 754920, 752505, 750974, 750328, 750713, 752354, 755241, 759185, 764234, 770710, 778772, 788256, 798961, 810696, 823057, 835500, 847643, 859093, 869093, 876828, 882073, 885074, 885935, 884693, 881955, 878661, 875041, 870381, 864025, 856137, 847442, 838759, 830869, 824277, 818925, 814586, 811483, 810015, 810054, 811218, 813718, 817996, 823498, 828804, 833214, 837290, 841513, 845298, 847787, 848887, 849172, 849424, 850556, 853197, 856969, 860788, 864116, 867200, 870027, 872107, 873570, 875374, 877902]
59937H77902K581K431L438N506P152P845Q443R236R312Q306P130O536O283O202
59923I68303O673P631Q348Q779R860J1954J4198J5863J7277J8782J9880J9997
59911A127545J9107J7139J3763R317M851P34l762q921j3654j6854j8650j9647
59899A110968j9842j9105j7901j6643j4983j2584r984p917o314m654k897j277
59887I76867K84J924L338M251N104O605Q696J0551J1590J2079J2637J3372J3649
59874A080947J2788J1012R294Q030O353L403j47k813m255n388o643p356p201o874
59860A091150o808o263m537k266p17l59q31j813l171m564n565o051o048n435m038
59845A032684j848J002M058O305O706N220K891P77n94p61P64L581O257P687Q086
$$ y = [877902, 880483, 882914, 886352, 891858, 899010, 906855, 915298, 924534, 933846, 942152, 949282, 955818, 962101, 968303, 974976, 982607, 990955, 999734, 1009594, 1021548, 1035746, 1051609, 1068886, 1087668, 1107548, 1127545, 1146652, 1163791, 1177554, 1186871, 1191722, 1192456, 1188694, 1179773, 1166119, 1149265, 1130615, 1110968, 1091126, 1072021, 1054120, 1037477, 1022494, 1009910, 999926, 992009, 985695, 981041, 978144, 976867, 977151, 979075, 982413, 986664, 991768, 998373, 1007069, 1017620, 1029210, 1041289, 1053926, 1067298, 1080947, 1093735, 1104747, 1114041, 1122071, 1128424, 1131827, 1131680, 1128867, 1124612, 1119224, 1112581, 1105225, 1098024, 1091150, 1084342, 1078079, 1073542, 1071276, 1070559, 1070200, 1069369, 1067556, 1064385, 1059821, 1054256, 1048205, 1042157, 1036722, 1032684, 1030836, 1031838, 1035896, 1042201, 1048907, 1054127, 1057018, 1057795, 1057201, 1056440, 1057204, 1060785, 1067042, 1074729, 1082815]
59830A082815Q083P485N734L173J031J49L78J165K249L710N648Q011J0513J2757
59816A152901J4422J5274J4973J3126R724N417J181k235m654o287p329p719p412
59803A191382o787o508o880p648q454r123r427r183q802r016r721r854q939p934
59789A073106p826q190q071p574p421p501p155o528o288o208n269l238r93P54
59775I91598K020K841L114L221L847M957N858O273O560O959P484Q404R917J1549
59761A074602J2842J4299J6470J8568J9399J9378J9936K1017K0954J8935J5859
59750A272259J2453Q381L838J51k027l607n324o531o726o826p809r149r727r417
59736A229939q769p932o793n574m497l476k638k356k329j574Q8J493J789J591
$$ y = [1082815, 1090898, 1098383, 1104117, 1107290, 1108321, 1108470, 1108848, 1110013, 1112262, 1115972, 1121620, 1129631, 1140144, 1152901, 1167323, 1182597, 1197570, 1210696, 1220420, 1225837, 1227018, 1224783, 1220129, 1213842, 1206513, 1198794, 1191382, 1184595, 1178087, 1171207, 1163559, 1155105, 1145982, 1136555, 1127372, 1118570, 1109554, 1099833, 1089979, 1081040, 1073106, 1065280, 1057090, 1049019, 1041445, 1034024, 1026523, 1019368, 1012840, 1006552, 1000344, 995075, 991837, 990844, 991598, 993618, 996459, 999573, 1002794, 1006641, 1011598, 1017456, 1023729, 1030289, 1037248, 1044732, 1053136, 1063053, 1074602, 1087444, 1101743, 1118213, 1136781, 1156180, 1175558, 1195494, 1216511, 1237465, 1256400, 1272259, 1284712, 1293093, 1296931, 1297082, 1295055, 1291448, 1286124, 1279593, 1272867, 1266041, 1258232, 1249083, 1239356, 1229939, 1221170, 1213238, 1206445, 1200871, 1196374, 1192898, 1190260, 1187904, 1185575, 1184001, 1184089, 1185582, 1187371, 1188962]
59722A188962J806K261K369K219K187K264K580L819O241Q979J1085J2718J4664
59709A262154J7313K0675K4670K8739L1892L3793L5173L6614L7674L7768L7093
59698A603558L6135L5016L3914L3312L3157L2578L1020K8832K6291K2996J8915
59687A935724J4997J1993R474O730L743O23k944o842j0102j2203j3877j5748j7163
59674A904405j7317j6616j5825j4677j2455r267n699j837K399O604J0495J4621
59662A844831J9400K4091K7658L0174L2410L4526L6009L6476L5717L3364K9228
59651B183884K3487J6118O830l963j4932k5201l4952m4037n1176n5505n7737n8781
59639A884035n8265n5691n1919m8113m4068l9123l3980l0083k7719k6241k5726
$$ y = [1188962, 1190768, 1193029, 1195398, 1197617, 1199804, 1202068, 1204648, 1208467, 1214708, 1223687, 1234772, 1247490, 1262154, 1279467, 1300142, 1324812, 1353551, 1385443, 1419236, 1454409, 1491023, 1528697, 1566465, 1603558, 1639693, 1674709, 1708623, 1741935, 1775092, 1807670, 1838690, 1867522, 1893813, 1916809, 1935724, 1950721, 1962714, 1972188, 1978918, 1982661, 1983284, 1980340, 1973498, 1963396, 1951193, 1937316, 1921568, 1904405, 1887088, 1870472, 1854647, 1839970, 1827515, 1818248, 1812549, 1810712, 1813111, 1819715, 1830210, 1844831, 1864231, 1888322, 1915980, 1946154, 1978564, 2013090, 2049099, 2085575, 2121292, 2154656, 2183884, 2207371, 2223489, 2230319, 2226356, 2211424, 2186223, 2151271, 2107234, 2056058, 2000553, 1942816, 1884035, 1825770, 1770079, 1718160, 1670047, 1625979, 1586856, 1552876, 1522793, 1495074, 1468833, 1443107]
59628A443107k6867k9414l2122l4187l5656l6538l6551l5578l3640l0687k7164
59617A084703k4145k2048j9911j6935j3885j1779j0014p416m512k979l105l445
59605I44529l019k289j840j445q63l68k02k50m57p66p71j86M11J53q96j880k303
59588I27558k333k163j984k310l474m961o045o860p961r085r393q748p865p201
59574H47175o587n861n195m779m698m911m910l915j979k88K56J59L14O64P70Q87
59558H07102J384J792J611J489K334L842N054N911P000Q260R235J0216J1751J3417
59544H90398J4401J5029J6343J8424K0437K2157K4134K6457K8445K9326K8149
59533A133700K3663J5838P220J084j792l187m476n265m980m092l277k696k567
$$ y = [1443107, 1416240, 1386826, 1354704, 1320517, 1284861, 1248323, 1211772, 1176194, 1142554, 1111867, 1084703, 1060558, 1038510, 1018599, 1001664, 987779, 976000, 965986, 958570, 954058, 951079, 947974, 944529, 941510, 939221, 937381, 935936, 935073, 934705, 934503, 934253, 933796, 933030, 932259, 932073, 932484, 932637, 931741, 929861, 927558, 925225, 923062, 921078, 918768, 915294, 910333, 904288, 897428, 889467, 880382, 870989, 862241, 854376, 847175, 840588, 834727, 829532, 824753, 820055, 815144, 810234, 806319, 804340, 804052, 804308, 804467, 804781, 805445, 806215, 807102, 808486, 810278, 811889, 813378, 815712, 819554, 824608, 830519, 837519, 845779, 855014, 865230, 876981, 890398, 904799, 919828, 936171, 954595, 975032, 997189, 1021323, 1047780, 1076225, 1105551, 1133700, 1157363, 1173201, 1180421, 1181505, 1179713, 1176526, 1172050, 1166785, 1161805, 1157713, 1154436, 1151740, 1149173]
59520A149173l351n026p033r132j1468j3776j5445j6324j6593j6065j4649j3224
59508A007087j2737j2675j1717r797q025o679m794k006O50K271L210M296N901
59495I54985Q041J0492J2625J4008J5177J6880J8706J9516J9053J7956J6331J3719
59483A137489J0434P486N078K494l50k641m169n651p286q298q385q328q724r213
59469A099936r375r331r017p943o111m275k917j795o52N24K047M338P021R177
59455A071627J0565J1616J2276J1997J0890R612Q129N806K866L34j601l790o491
59442A143836q911j0682j2324j3796j4026j2542j0333q505p170o206n954o426
59430A026961o759o254n155l946k569p49J526M138O889R358J1370J3437J5936
$$ y = [1149173, 1145822, 1140796, 1133763, 1124631, 1113163, 1099387, 1083942, 1067618, 1051025, 1034960, 1020311, 1007087, 994350, 981675, 969958, 960161, 952136, 945457, 940663, 938657, 939307, 941578, 944788, 949084, 954985, 963026, 973518, 986143, 1000151, 1015328, 1032208, 1050914, 1070430, 1089483, 1107439, 1123770, 1137489, 1147923, 1155409, 1160487, 1162981, 1162631, 1159990, 1155821, 1150170, 1142884, 1134586, 1126201, 1117873, 1109149, 1099936, 1090561, 1081230, 1072213, 1064270, 1058159, 1053884, 1050967, 1049172, 1048520, 1049044, 1051091, 1055429, 1062450, 1071627, 1082192, 1093808, 1106084, 1118081, 1128971, 1138583, 1146712, 1152518, 1155384, 1155718, 1154117, 1150327, 1143836, 1134925, 1124243, 1111919, 1098123, 1084097, 1071555, 1061222, 1052717, 1045547, 1039341, 1033387, 1026961, 1020202, 1013948, 1008793, 1004847, 1002278, 1001529, 1003055, 1007193, 1014082, 1023440, 1034810, 1048247, 1064183]
59417A064183J8155J9126J9286K0113K2335K5453K8475K9782K6965J8885P924
59406A300682j634p583j0602j1547j0230o944k779K086P917J2607J2040M778n636
59393A283155j4468k0171k3664k5371k4938k2767j9888j6798j3609j0523p360
59382A083598l544N91L562M673N061N911O918P414P758Q389Q726Q222P528P431
59368A162238P628P640P934Q986J0168J0693J0749J0727J0320R530R513J1092
59356A277218J3362J5018J6260J8037K0255K2165K3939K6328K9182L1495L2747
59345A526006L3128L2791L1792L0483K8964K6573K2732J7989J3406R303N276J051
59333A779494l376q004j2549j6346j9155k1586k4221k6869k9151l1147l2956l4256
$$ y = [1064183, 1082338, 1101464, 1120750, 1140863, 1163198, 1188651, 1217126, 1246908, 1273873, 1292758, 1300682, 1299048, 1291465, 1280863, 1269316, 1259086, 1252142, 1249363, 1251449, 1259366, 1271973, 1284013, 1288791, 1283155, 1268687, 1248516, 1224852, 1199481, 1174543, 1151776, 1131888, 1115090, 1101481, 1090958, 1083598, 1080054, 1080645, 1084207, 1088880, 1093941, 1099852, 1106770, 1114184, 1121942, 1130331, 1139057, 1147279, 1154807, 1162238, 1169866, 1177506, 1185440, 1194426, 1204594, 1215287, 1226036, 1236763, 1247083, 1256613, 1266126, 1277218, 1290580, 1305598, 1321858, 1339895, 1360150, 1382315, 1406254, 1432582, 1461764, 1493259, 1526006, 1559134, 1591925, 1623717, 1654200, 1683164, 1709737, 1732469, 1750458, 1763864, 1773167, 1778443, 1779494, 1776118, 1768114, 1755565, 1739219, 1720064, 1698478, 1674257, 1647388, 1618237, 1587090, 1554134, 1519878]
59321A519878l4863l5031l4730l3402l0971k8323k6239k4721k3668k3269k3174
59310A201487k2368k0580j8713j7358j5946j4028j2137j0556q500n503k416J2
59298A053394K395N399Q272R799R745Q239M867j92n124q026q911q947q506p162
59284A055242m961k290R14M611P900J0031J1645J3830J6416J8371J9372J9828
59272A170909J9843J9334J8769J8659J8586J7724J6121J4553J3378J2310J0945
59261A351131Q951O198L210Q17j137l852p686j1247j3262j4271j5430j6707j7457
59248A269258j7901j8637j9356j9290j8453j7329j5932j4207j2739j1993j1465
59237A091956j0571r727r551r681r441q938q498p805o719o062o502p304p369o713
$$ y = [1519878, 1485015, 1449984, 1415254, 1381852, 1350881, 1322558, 1296319, 1271598, 1247930, 1224661, 1201487, 1179119, 1158539, 1139826, 1122468, 1106522, 1092494, 1080357, 1069801, 1061301, 1055798, 1053382, 1053394, 1055789, 1061188, 1069460, 1079259, 1089004, 1097243, 1102110, 1101918, 1096794, 1088768, 1079857, 1070910, 1062404, 1055242, 1050281, 1047991, 1048905, 1053516, 1061416, 1071447, 1083092, 1096922, 1113338, 1131709, 1151081, 1170909, 1190752, 1210086, 1228855, 1247514, 1266100, 1283824, 1299945, 1314498, 1327876, 1340186, 1351131, 1360082, 1366280, 1369490, 1370307, 1369170, 1365318, 1357632, 1346385, 1333123, 1318852, 1303422, 1286715, 1269258, 1251357, 1232720, 1213364, 1194074, 1175621, 1158292, 1142360, 1128153, 1115414, 1103421, 1091956, 1081385, 1071658, 1062107, 1052426, 1042985, 1034047, 1025549, 1017744, 1011025, 1004963, 998461, 991157, 983788, 977075]
59223I77075n862m699l113j906j680j635q22J74J92n67r47n37L20J512K891L715
59207I64111L611L387L721L955L437L039L832N272O297P183Q691J0384J1605J3080
59193A051605J5557J7829J8352J7880J8215J8991J8278J5855J3243J0664O741
59182A223210J403l507p017j0211j3914j7334j9646k1108k1912k1605k0311j9019
59170A049029j8026j6561j4375j2317j0886r620q346p622p481p047n836m361l090
59157I23461j998j280j277j532j174l08K64O35J528K454J898l21k634m086n389
59142I10241p112q531r053r224r469r144p726n831m252k936j563j66J324L155
59128H39713M960N967O448P689J0019J2099J2843J2878J3295J4039J4426J4364
$$ y = [977075, 971213, 966514, 963401, 961495, 959815, 958180, 957358, 957532, 957724, 957157, 956210, 955673, 955993, 957505, 960396, 964111, 967722, 971109, 974830, 978785, 982222, 985261, 989093, 994365, 1000662, 1007845, 1016536, 1026920, 1038525, 1051605, 1067162, 1084991, 1103343, 1121223, 1139438, 1158429, 1176707, 1192562, 1205805, 1216469, 1223210, 1224613, 1221106, 1214089, 1203878, 1189964, 1172630, 1152984, 1131876, 1109964, 1088359, 1068048, 1049029, 1031003, 1014442, 1000067, 987750, 976864, 967244, 958898, 951276, 943795, 936748, 930912, 926551, 923461, 921463, 920183, 918906, 917374, 916200, 915892, 916156, 916791, 918319, 920773, 922671, 922350, 919716, 915630, 910241, 903129, 894598, 885545, 876321, 866852, 857708, 849982, 844151, 839899, 836963, 835400, 835234, 836558, 839713, 844673, 850640, 857088, 864777, 874796, 886895, 899738, 912616, 925911, 939950, 954376, 968740]
59116I68740J4177J3862J3212J2213J0753Q514N539K392n11l072n013o050o702
59103A028054p878r379r827q610o918o271o811p568p776p311o397n397m572l811
59089I29528k896j978j283n48N59J612J877J499J269J356J275J085J457K401L050
59074I40263K954K509J997J196K41l41p40j888l923n711o424o632p279q447r642
59059H98133j0549j0956j0624r707q779q020o949n264l359j743m59O48J583K324
59045H26279K866L089K980K808K629J916L82j144j586j080o76p21o07n4M62P32
59029H38275J242K426M155O040P637Q520Q839R430J0547J0968R535P029N171M045
59015I33859K147j041m156n942o649p032p191o913o191m959l224j602q37n91L26
$$ y = [968740, 982917, 996779, 1009991, 1022204, 1032957, 1041471, 1047010, 1049402, 1048891, 1045819, 1040806, 1034756, 1028054, 1020176, 1010797, 1000970, 992360, 985442, 979171, 972360, 964792, 957016, 949705, 943308, 937911, 933339, 929528, 926632, 924654, 923371, 922823, 923382, 924994, 926871, 928370, 929639, 930995, 932270, 933355, 934812, 937213, 940263, 943217, 945726, 947723, 948919, 949160, 948819, 948079, 946191, 942268, 936557, 930133, 923501, 916222, 907775, 898133, 887584, 876628, 866004, 856297, 847518, 839498, 832549, 827285, 823926, 822183, 821724, 822372, 823955, 826279, 829145, 832234, 835214, 838022, 840651, 842567, 842949, 841805, 840219, 839139, 838463, 837742, 837135, 837081, 837543, 838275, 839517, 841943, 846098, 852138, 859775, 868295, 877134, 886564, 897111, 908079, 917614, 924643, 929814, 933859, 936006, 934965, 930809, 924867, 918218, 911186, 903995, 897082, 890891, 885932, 882708, 881106, 880269, 879678, 880004]
59000H80004K390M855O771P600P006N165L291K652L013L162K846K958L819M731
58986I40263N312O004O992P955R047J0934J3528J5921J7754J9588K1705K3718
58974A098721K5478K7239K8680K8918K7657K5291K1937J7487J2612Q441N136J934
58962A329531j437m581p475j0426j3089j4928j6462j8623k1006k2290k2247k1717
58950A155250k0915j9509j8153j7871j7968j6689j4086j2017j1054r688p186m860
58938I85254l660k659r42Q67K018K852L612L709L077K733L015K822J494l9q57
58923A003296j293j669j386j80J039J651K291L566N000O062O982P896Q479Q990
58909A050724J0301J2372J4183J5579J7423J9431J9850J8285J6783J7056J8347
$$ y = [880004, 882394, 887249, 894020, 901620, 908626, 913791, 917082, 919734, 922747, 925909, 928755, 931713, 935532, 940263, 945575, 951579, 958571, 966526, 975573, 986507, 1000035, 1015956, 1033710, 1053298, 1075003, 1098721, 1124199, 1151438, 1180118, 1209036, 1236693, 1261984, 1283921, 1301408, 1314020, 1322461, 1327597, 1329531, 1328094, 1323513, 1316038, 1305612, 1292523, 1277595, 1261133, 1242510, 1221504, 1199214, 1176967, 1155250, 1134335, 1114826, 1096673, 1078802, 1060834, 1044145, 1030059, 1018042, 1006988, 997300, 990114, 985254, 981594, 978935, 977993, 978860, 980878, 983730, 987342, 991051, 994128, 996861, 999876, 1002698, 1004192, 1004153, 1003296, 1002003, 1000334, 998948, 998768, 999807, 1001458, 1003749, 1007315, 1012315, 1018377, 1025359, 1033255, 1041734, 1050724, 1061025, 1073397, 1087580, 1103159, 1120582, 1140013, 1159863, 1178148, 1194931, 1211987, 1230334]
58898A230334J9201J9623K0191K0638K0707K1095K2250K3515K4549K6224K9003
58887A477330L1814L3680L5087L6521L7050L5755L3458L1632L0531K9470K7974
58876A840302K5696K2094J7151J1542N523j179p972j3372j7049k0360k4092k7301
58864A810983k9231l0623l2056l2706l2064l1345l1745l2579l2510l1467l0149
58853A464508k8721k7063k5431k3975k2626k1981k2924k4852k5842k5294k4595
58842A191204k4503k3837k1785j9487j8052j6908j5384j4149j3640j2786j0783
58831I99890q502o819n167l100j558j116o30Q77K601L629M525N848O815O947P225
58816A011465Q035P875N864L734L369M039M008L257K645J846J88j773l285m728
$$ y = [1230334, 1249535, 1269158, 1289349, 1309987, 1330694, 1351789, 1374039, 1397554, 1422103, 1448327, 1477330, 1509144, 1542824, 1577911, 1614432, 1651482, 1687237, 1720695, 1752327, 1782858, 1812328, 1840302, 1865998, 1888092, 1905243, 1916785, 1922308, 1921129, 1913157, 1899785, 1882736, 1862376, 1838284, 1810983, 1781752, 1751129, 1719073, 1686367, 1654303, 1622958, 1591213, 1558634, 1526124, 1494657, 1464508, 1435787, 1408724, 1383293, 1359318, 1336692, 1314711, 1291787, 1266935, 1241093, 1215799, 1191204, 1166701, 1142864, 1121079, 1101592, 1083540, 1066632, 1051248, 1037099, 1023459, 1010673, 999890, 991388, 984569, 979402, 976302, 974744, 973628, 972998, 973875, 976476, 980105, 984630, 990478, 997293, 1004240, 1011465, 1019500, 1027375, 1033239, 1036973, 1040342, 1044381, 1048389, 1051646, 1054291, 1056137, 1056325, 1054552, 1051267, 1046539]
58802A046539o284o823n833m779m722m329k258K54J433J933L449N811P849R873
58788A042113J2817J6138J8824K1431K4875K8327L0474L1776L3306L4462L4050
58777A328593L2483L0650K7840K3015J6988J1027M464l825j2676j9853k5119k9570
58765A384017l2923l4023l3326l2389l1510l0076k8463k7280k5588k2332j8778
58754A067329j7065j7040j6817j5812j4753j3411j0969q094o216n094l411j204
58742I37443N21K030M168O096O165M774L886M043M138L845L912M215L823K860
58728I91919K258J953J249O53J272K794L979M795O162Q076R833J1513J3394J4611
58714A074461J4267J3012J1700R562N757J439k046n674j0956j6856k1257k4288
$$ y = [1046539, 1040255, 1033432, 1027599, 1022820, 1018098, 1013769, 1011511, 1011765, 1013198, 1015131, 1018580, 1024391, 1032240, 1042113, 1054930, 1071068, 1089892, 1111323, 1136198, 1164525, 1194999, 1226775, 1260081, 1294543, 1328593, 1361076, 1391726, 1419566, 1442581, 1459569, 1470596, 1475060, 1471235, 1458559, 1438706, 1413587, 1384017, 1351094, 1317071, 1283745, 1251356, 1219846, 1189770, 1161307, 1134027, 1108439, 1086107, 1067329, 1050264, 1033224, 1016407, 1000595, 985842, 972431, 961462, 953368, 947152, 942058, 938647, 937443, 937964, 939994, 944162, 950258, 956423, 961197, 965083, 969126, 973264, 977109, 981021, 985236, 989059, 991919, 994177, 996130, 997379, 998032, 999304, 1002098, 1006077, 1010872, 1017034, 1025110, 1034943, 1046456, 1059850, 1074461, 1088728, 1101740, 1113440, 1123002, 1128759, 1130198, 1128152, 1122478, 1111522, 1094666, 1073409, 1049121]
58702A049121k7285k9630k9854k8919k8946k9394k7925k4597k1684j9636j6814
58691G64437j3268j1068j0553r653p568n923n587n284m121k806j653M2J951K520
58677F91466J537N63K97k32j358j960j511q15j54J288L727O319Q624J0788J2229
58662G30808J1943J0069P401L737j324o485r869j1582j3001j4094j3895j2968
58650F80740j2718j2751j1625r768q821q476o995m537k905k236j071M41O74j77
58636E99775j67Q97J207M07R9O50P12K34O71J779J530k44j288o32J57J40K61Q06
58618F06994O56l8N39K695M397M449L923L784L755M013N306O825O766N478N210
58603F64752O388P021O304N589N340M330K605K081L245M323M538N272P170R059
$$ y = [1049121, 1021836, 992206, 962352, 933433, 904487, 875093, 847168, 822571, 800887, 781251, 764437, 751169, 740101, 729548, 719895, 712327, 706404, 700817, 695533, 691412, 688606, 686953, 686995, 688946, 691466, 693003, 693566, 693863, 693631, 692273, 690313, 688802, 687987, 687833, 689121, 692848, 699167, 707791, 718579, 730808, 742751, 752820, 760221, 763958, 762634, 756149, 746280, 734698, 721697, 707603, 693708, 680740, 668022, 655271, 643646, 633878, 625057, 616581, 609586, 605049, 602144, 599908, 598837, 599278, 599952, 599775, 599608, 600505, 601712, 602119, 602218, 602868, 603580, 603814, 604485, 606264, 607794, 607550, 606262, 605630, 605787, 605927, 606188, 606994, 607650, 607612, 608151, 610846, 615243, 619692, 623615, 627399, 631154, 635167, 640473, 647298, 654064, 659542, 664752, 671140, 678161, 684465, 690054, 695394, 699724, 702329, 704410, 707655, 711978, 716516, 721788, 728958, 738017]
58589G38017J0468J2312J4388J5204J5003J5834J7878J8834J7739J6282J5471
58578I07430J4163J1789R494P749N825M277M771O871Q335R118J1524J5878J9806
58565A037030K2555K5882K9754L1432L0138K8395K7115K3628J6596Q850L039j737
58553A282677o636j0086j0733j0176j0158r839q204o522o255p011q518j1981j7558
58540A159000k2959k6373k8487l0204l0957l0564l0048k9435k7500k4584k2607
58529H55282k1378j8470j3810j0646j0487j0939j0029q900q501p534n587m551
58517G24450m964m637k733j486j963k105r25m75j574j805j13Q92j98p16J197L043
58501G05888K354P82O11R54O02R92L179N247N769O409Q283R452Q915R145J1556
$$ y = [738017, 748485, 760797, 775185, 790389, 805392, 821226, 839104, 857938, 875677, 891959, 907430, 921593, 933382, 942876, 950625, 956450, 960727, 965498, 972369, 980704, 989822, 1001346, 1017224, 1037030, 1059585, 1085467, 1115221, 1146653, 1176791, 1205186, 1232301, 1255929, 1272525, 1281375, 1284414, 1282677, 1276041, 1265955, 1255222, 1245046, 1234888, 1225049, 1216845, 1210323, 1204068, 1197057, 1188539, 1176558, 1159000, 1136041, 1109668, 1081181, 1050977, 1020020, 989456, 959408, 929973, 902473, 877889, 855282, 833904, 815434, 801624, 790978, 780491, 769552, 759523, 750623, 742122, 734588, 729001, 724450, 719486, 714849, 712116, 710630, 708667, 706562, 705637, 705162, 703588, 701783, 701670, 702562, 702364, 701648, 702845, 705888, 708242, 709024, 709635, 710589, 711191, 712183, 715362, 720609, 726378, 732787, 741070, 750522, 759437, 768582, 780138]
58486G80138J3486J3016J2767J5196J8180J9186J9926K2616K5126K4274K0804
58475I84715J6943J2056N018k004o441r401j2938j5846j6054j4612j3434j1645
58463I16357p912l840j311Q83M292P479R034J0935J4967J8720J9067J6909J4518
58450A020098J1067M872k496q407j3088j7654k0839k1387k0983k1124k0000j6123
58438H73936j1966j0001q415m920j492r00j544m11J748K754L592O063Q529Q700
58424H65673P931Q299Q172N269J339r09k662o067r423j0207j0032j1457j2737
58411H33189j1024q134p634q636p880n766m871m613k754k80L78J01J134K446J928
58396G77584R94K098L945M041L558M763O176N365L908M351N043L397J434K393
$$ y = [780138, 793624, 806640, 819407, 834603, 852783, 871969, 891895, 914511, 939637, 963911, 984715, 1001658, 1013714, 1018732, 1016728, 1010287, 1000886, 987948, 972102, 956048, 941436, 928002, 916357, 908445, 904605, 903294, 904177, 908469, 915948, 924982, 935917, 950884, 969604, 988671, 1005580, 1020098, 1031165, 1036037, 1033541, 1025134, 1012046, 994392, 973553, 952166, 931183, 910059, 890059, 873936, 861970, 851969, 843554, 838634, 837142, 836242, 834698, 834287, 836035, 838789, 842381, 848444, 856973, 865673, 873604, 881903, 890075, 895344, 896683, 895774, 893112, 887045, 877622, 867415, 857383, 845926, 833189, 822165, 814031, 806397, 797761, 789881, 784115, 779244, 774631, 771877, 771597, 771975, 772076, 773210, 775656, 777584, 778578, 780676, 784621, 788662, 792220, 796983, 803159, 808524, 812432, 816783, 821826, 825223, 826657, 829050]
58382H29050M610M593L454M296N885N132L426M132O147O147N134O411R157J0214
58368I07788J0229J1828J3874J3746J3044J4789J7225J6694J4279J3204J2226
58357A058926Q363L655K162K559P76k203k427o11m19j205K08K548K328J027K674
58342A078361O207P586P499R528J2729J3639J3484J5688J8517J8099J6293J7335
58330A234965J9176J6770J1632R146Q556N036k65j774L58J098J07J221L702L564
58316A313292K285M664R229J0355Q672R626J2977J3690J2103J3004J5686J5176
58304A440759J2406J2785J5707J5841J3719J4385J6822J5780J2838J4168J8439
58293A603649J8752J5620J5847J9379J9829J7498J8798K3104K3354J9866K0185
$$ y = [829050, 833660, 838253, 841707, 846003, 851888, 857020, 860446, 864578, 870725, 876872, 882006, 888417, 897574, 907788, 918017, 929845, 943719, 957465, 970509, 985298, 1002523, 1019217, 1033496, 1046700, 1058926, 1067289, 1070944, 1073106, 1075665, 1076441, 1074238, 1071811, 1071200, 1070781, 1069576, 1069784, 1072332, 1074660, 1075687, 1078361, 1084568, 1092154, 1099653, 1109181, 1121910, 1135549, 1149033, 1164721, 1183238, 1201337, 1217630, 1234965, 1254141, 1270911, 1282543, 1291689, 1300245, 1305281, 1305016, 1303242, 1303600, 1304698, 1304805, 1306026, 1309728, 1313292, 1315577, 1320241, 1329470, 1339825, 1348497, 1358123, 1371100, 1384790, 1396893, 1409897, 1425583, 1440759, 1453165, 1465950, 1481657, 1497498, 1511217, 1525602, 1542424, 1558204, 1571042, 1585210, 1603649, 1622401, 1638021, 1653868, 1673247, 1693076, 1710574, 1729372, 1752476, 1775830, 1795696, 1815881]
58282A815881K4740K6197K3651K3915K7831K8996K7124K8810L4037L5803L4220
58271B131205L6775M3449M6138M4127M5276N0521N2454N0758N3254N9799O1231
58260B674987N6509N4736N7846N7744N3109N2120N5952N6596N3778N6471O4975
58249C294823O9462O8991P3400Q3624Q9577R0454R6794J09210J16187J16647J22741
58238D331910J36149J44453J45723J53030J69176J81255J86235J96841K15752
58229E860524K29886K37149K52017K77206K97680L10657L32426L66995L98435
58220H562975M23398M59090N09256N56082N96552O51155P24958P97919Q66616
58211A4148001R55222J071234J193584J320173J480960J686927J916663K173021
$$ y = [1815881, 1840621, 1866818, 1890469, 1914384, 1942215, 1971211, 1998335, 2027145, 2061182, 2096985, 2131205, 2167980, 2211429, 2257567, 2301694, 2346970, 2397491, 2449945, 2500703, 2553957, 2613756, 2674987, 2731496, 2786232, 2844078, 2901822, 2954931, 3007051, 3063003, 3119599, 3173377, 3229848, 3294823, 3364285, 3433276, 3506676, 3590300, 3679877, 3770331, 3867125, 3976335, 4092522, 4209169, 4331910, 4468059, 4612512, 4758235, 4911265, 5080441, 5261696, 5447931, 5644772, 5860524, 6090410, 6327559, 6579576, 6856782, 7154462, 7465119, 7797545, 8164540, 8562975, 8986373, 9445463, 9954719, 10510801, 11107353, 11758508, 12483466, 13281385, 14148001, 15103223, 16174457, 17368041, 18688214, 20169174, 21856101, 23772764, 25945785]
58203B5945785K498914K916040L409174L996724M751243N723620O923379Q403645
58195F4568524J0270083J2558310J5206686J8210199K1682928K5694530L0173301
58188A98364561L4987082L9739525M3114603M2699683L6253518K3672900P621176
58181D26453048q026426k0429694k8730649l3425621l5366113l5284272l3742257
58174B31448016l1165590k7915673k4380197k0935754j7806290j5035850j2615915
58167H1592747j0563725q869593p465563o291257n332466m568816l942697l408917
58159C1149713k964829k606054k298893k020262j781724j590242j423506j265372
58151A5198831j129061j023929r32477q40396p58434o95222o37302n74484n18117
$$ y = [25945785, 28444699, 31360739, 34769913, 38766637, 43517880, 49241500, 56164879, 64568524, 74838607, 87396917, 102603603, 120813802, 142496730, 168191260, 198364561, 233351643, 273091168, 316205771, 358905454, 395158972, 418831872, 426453048, 418426622, 397996928, 369266279, 335840658, 300474545, 265190273, 231448016, 200282426, 172366753, 147986556, 127050802, 109244512, 94208662, 81592747, 71029022, 62159429, 54693866, 48402609, 43070143, 38501327, 34558630, 31149713, 28184884, 25578830, 23279937, 21259675, 19477951, 17887709, 16464203, 15198831, 14069770, 13045841, 12113364, 11272968, 10514534, 9819312, 9182010, 8607526, 8089409]
58142H089409m76553m37686l92316l51189l23045k98358k69887k47570k38139
58133E054666k30522k15630k01239j93836j84788j67951j52698j46340j40730
58124C420932j28852j18048j14542j10980j01338r2820r1218q9343q1323p4019
58114B418449p3089p1831o4722n8462n8713n9021n3606m8353m8728m9158m4732
58103A788034m1331m3805m5763m1365l5990l5259l4472k8956k4152k5355k7578
58092A404008k5416k3171k5455k7423k4058j9960k0389k1360j8153j4986j6837
58081A166800j9774j8684j6831j8692k0804j8706j5800j6700j8505j7026j5001
58070I70277j6054j7088j4524j1676j2382j3630j1829r922j1076j1897r183o815
$$ y = [8089409, 7612856, 7175170, 6782854, 6431665, 6108620, 5810262, 5540375, 5292805, 5054666, 4824144, 4608514, 4407275, 4213439, 4028651, 3860700, 3708002, 3561662, 3420932, 3292080, 3174032, 3059490, 2948510, 2847172, 2754352, 2663134, 2573791, 2492468, 2418449, 2345360, 2273529, 2208807, 2150345, 2091632, 2032611, 1979005, 1930652, 1881924, 1832766, 1788034, 1746703, 1702898, 1657135, 1615770, 1579780, 1544521, 1510049, 1481093, 1456941, 1431586, 1404008, 1378592, 1355421, 1329966, 1302543, 1278485, 1258525, 1238136, 1216776, 1198623, 1183637, 1166800, 1147026, 1128342, 1111511, 1092819, 1072015, 1053309, 1037509, 1020809, 1002304, 985278, 970277, 954223, 937135, 922611, 910935, 898553, 884923, 873094, 863172, 852096, 840199, 831016, 824201]
58058H24201q582j0805r432p902j0331j3320j2357j0256j1347j3106j1421q679
58046F96663q829r609p389m714n484p398o588n104o530q642p659n434n463o056
58032F01764m354k774m554p078o514n015o463r027q796o974o820p065n021k638
58018E18671l069m527l856k583l448m570l227j658k845m329k596R4j88j746p45
58003D79378J480J348J15J236L503L500K259K935M338L248Q44N44J559P84j083
57988E05988j198j88l65o10J294L563L431K748M764P811Q208P100Q241J1191J2825
57973E74803J3565J5808J8054J6906J3293J0613Q297L344l230p680j0053j3289
57961F40431j6977j8012j6627j5869j5933j4563j2259j1548j1825j0495q382q442
$$ y = [824201, 815619, 804814, 795382, 787480, 777149, 763829, 751472, 741216, 729869, 716763, 705342, 696663, 687834, 678225, 670836, 666122, 660638, 653240, 646652, 641548, 635018, 626376, 618717, 613283, 607820, 601764, 597410, 594636, 590082, 583004, 576490, 571475, 565012, 555985, 547189, 540215, 533395, 526330, 521309, 518671, 515602, 511075, 507219, 504636, 501188, 496618, 493391, 491733, 488888, 484559, 481963, 482057, 481869, 480123, 479378, 480858, 482206, 482321, 483557, 487060, 490560, 492819, 495754, 500092, 503340, 504184, 504728, 506287, 507071, 505988, 504790, 504602, 504237, 503627, 504921, 508484, 511915, 514663, 519427, 527238, 535446, 542546, 550787, 561978, 574803, 588368, 604176, 622230, 639136, 652429, 663042, 671339, 674683, 671453, 663773, 653720, 640431, 623454, 605442, 588815, 572946, 557013, 542450, 530191, 518643, 506818, 496323, 487941, 479499]
57949D79499r780q640m878k020j095K04K431L676L891N100P291Q571R094J0417
57935E03761J1635J0667Q646Q315Q814O935K890j77j880m654q441j0476j0389
57922E25646j0640j1686j1377r359p668o715m897k261n31M57K313M424M766L906
57908D76378M052M652L278L54j491k315m446p620r191r021r405j0289r341o778
57894D18817n301n113l774j242j13n32J76K205K515L28j412j180j001k135k933
57879C99305k393j977k443k498j702j372j671j153P7K59m31K64K620M315M483
57864C95683M782N896O604O902Q267J0240J0520R115Q588R487R439P571N889N263
57850E04246M038J746L53N31K77j440l089l741m435n322n001l746l836n497o103
$$ y = [479499, 469719, 461079, 456201, 454181, 453086, 453290, 455721, 459397, 463288, 468388, 475679, 484250, 493344, 503761, 515396, 526063, 534709, 543024, 551838, 558773, 561663, 561486, 559606, 554952, 546511, 536035, 525646, 515006, 503320, 491943, 482584, 474916, 468201, 463304, 461043, 460512, 460969, 463282, 467706, 472472, 476378, 480430, 485082, 488360, 488714, 487223, 484908, 480462, 472842, 463651, 454630, 445225, 434936, 425595, 418817, 413516, 408403, 404629, 403387, 403274, 402742, 402918, 405123, 407638, 407966, 406554, 405374, 404373, 402238, 399305, 396912, 394935, 392492, 389994, 388292, 386920, 385249, 384096, 384173, 384432, 384001, 384265, 386885, 391200, 395683, 400465, 406361, 412965, 419867, 428134, 438374, 448894, 458009, 466597, 476084, 485523, 493094, 498983, 504246, 508284, 510030, 510383, 510914, 511191, 509751, 506662, 502921, 498486, 493164, 488163, 484417, 480581, 475084, 468981]
57835D68981m542k867k373j687j69N03k78n80M94J105J93n40J23Q43N72L84Q19
57818D60981M97r56j599n52K70m25j112n25n5j048k352k565k399k838l190k739
57802D39393k254k219j600J44J788K489L170M540N754O133O243O277N476L902
57788D79236K650J645l19k765l569k511j900k730l181k089q11m89l80k22j254
57773D61311l442m694m305m302n853p303p328p040p297o961n634n133o277p061
57759C78681o036m762m808n055m104k772j994q00J438L203L385L310M144M738
57745C68568M080L413L727L705K392J399K085L043K797K466L186L460K048R76
57731D07345K477M946N336L922L343M234M989M965M836M457L050J116q2m49o43
$$ y = [468981, 464439, 461572, 459199, 457512, 457343, 457846, 457568, 456988, 457482, 458587, 458780, 458240, 458363, 459206, 459778, 460162, 460981, 461478, 460522, 458923, 458371, 458641, 458216, 457104, 456579, 456524, 455476, 453124, 450559, 448160, 445322, 442132, 439393, 437139, 434920, 433320, 433464, 435252, 437741, 440911, 445451, 451205, 457338, 463581, 469858, 475334, 479236, 481886, 483531, 483212, 480447, 476878, 474367, 472467, 469737, 466556, 464467, 463656, 463167, 462787, 462565, 461311, 457869, 453175, 448870, 444568, 438715, 431412, 424084, 417044, 409747, 402786, 397152, 392019, 385742, 378681, 372645, 367883, 363075, 358020, 353916, 351144, 349150, 348350, 349788, 352991, 356376, 359686, 363830, 368568, 372648, 376061, 379788, 383493, 385885, 387284, 389369, 392412, 395209, 397675, 400861, 404321, 406369, 407345, 409822, 414768, 420104, 424026, 427369, 431603, 436592, 441557, 446393, 450850, 453900, 455016, 454934, 454485, 453842]
57716D53842n87j17j31j277k579k986l134l903m633m495m211m561m671l670k565
57701D10322k478k588j781q87j040j360n11P68R77M55M21O50L11JO89J684J910
57684D07543K064L402N355O646P740J0013J3366J6841K0660K5526L0894L6068
57672E86118M2118N0527O0837P1729Q3164R4675J02172R9343Q2639N3607J7198
57661A344127k0143n1776p3249q4273q7259q4365p7124o7646n7907m8256l8395
57650F53734k9267k2257j7189j2904r296p036n952n404n585o762p942q091p927
57637E08122q709r955j0185r324q487q012p464o998o966o780n819m825m709m866
57623D05023m352l868m565n762n854m860m010l438k399j204q79j267j314r20p34
$$ y = [453842, 453255, 453138, 453007, 451730, 449151, 446165, 443031, 439128, 434495, 430000, 425789, 421228, 416557, 412887, 410322, 407844, 405256, 403475, 402588, 401548, 400188, 399677, 400445, 401422, 401877, 402298, 402948, 403259, 403260, 403949, 405633, 407543, 409607, 413009, 418364, 425010, 432750, 442763, 456129, 472970, 493630, 519156, 550050, 586118, 628236, 678763, 739600, 811329, 894493, 989168, 1091340, 1190683, 1273322, 1326929, 1344127, 1323984, 1272208, 1198959, 1114686, 1027427, 943062, 865938, 798292, 740385, 692129, 653734, 624467, 602210, 585021, 572117, 562821, 555785, 549833, 544429, 538844, 532082, 524140, 516049, 508122, 499413, 489458, 479273, 469949, 461462, 453450, 445986, 438988, 432022, 425242, 419423, 414598, 409889, 405023, 400671, 396803, 392238, 386476, 380622, 375762, 371752, 368314, 365915, 364711, 363832, 362565, 361251, 360331, 359597]
57608C59597o58k52m1o11j132n86K63J02m38K93K115L242L022K472K350K606L338
57591C75682M511N132M501L723M200N280N330M328L309K064k67k951m474n173
57577D05195o579q540r471r177q939q917q028o451n691n953n792m709l934m219
57563C08795m897n393n741n478l984k118j495k076k311j711j176q15L03K041L079
57548B77023L160L337L682K958J022n94r99q87o62K00J456J718N96o20j079j475
57532B88836k394l162l067k321j262M2J044J022L49J73O81J174J690K770L717
57517B89292L126J389O04J607K969L381L083K575J790J100J334K232K556K109
57503C19147J981K529K927K945L210L524K934J790J572K324K516J849J766K573
$$ y = [359597, 358939, 358687, 358646, 358035, 356903, 356317, 356580, 356682, 356244, 356537, 358652, 361894, 364916, 367388, 369738, 372344, 375682, 380193, 385325, 389826, 393549, 397749, 403029, 408359, 412687, 415996, 418060, 417793, 414842, 410368, 405195, 398616, 390076, 380605, 371428, 362489, 353572, 345544, 339093, 333402, 327449, 321657, 316948, 313014, 308795, 303898, 298505, 292764, 287286, 283302, 281184, 279689, 277613, 275302, 273591, 272415, 271600, 271903, 273944, 277023, 280183, 283520, 287202, 290160, 291182, 290588, 289589, 288702, 288040, 288240, 289696, 291414, 292010, 291390, 290311, 288836, 286442, 283280, 280213, 277892, 276630, 276672, 277716, 278738, 279087, 279260, 279941, 281115, 282805, 285575, 289292, 292418, 293807, 294411, 296018, 298987, 302368, 305451, 308026, 309816, 310916, 312250, 314482, 317038, 319147, 321128, 323657, 326584, 329529, 332739, 336263, 339197, 340987, 342559, 344883, 347399, 349248, 351014, 353587]
57489C53587K645J362K69J52n19k791n156n935n722n803n935n383m659m506m541
57474C07065m325m426n092n265m350l552l955m653m345l514l323l458k779j338
57460B52690j52M23O88N58j14o73l14O79J340J343J141J161J477J931K166J997
57444B66341J887K378L038K980K456K657L770M670M860N173O059O730O656O373
57430C26028O129N300L884K873K336Q98j829m033m297l734m103n200n723n479
57416C13050n088m500l330k004j102k89R54K230K901L071K887J824k67k298l289
57401C04750l666m194m547m130l350k798k064o93N39O71K18L74J155J620J524
57386B85409J450J665J953K239K478K301J662J341J893K618K499J617P62K21j88
$$ y = [353587, 356232, 357594, 357863, 358015, 357496, 354705, 349549, 343614, 337892, 332089, 326154, 320771, 316112, 311606, 307065, 302740, 298314, 293222, 287957, 283607, 280055, 276100, 271447, 267102, 263588, 260265, 256807, 254028, 252690, 252538, 252961, 253649, 254207, 254093, 253420, 253106, 253785, 255125, 256468, 257609, 258770, 260247, 262178, 264344, 266341, 268228, 270606, 273644, 276624, 279080, 281737, 285507, 290177, 295037, 300210, 306269, 312999, 319655, 326028, 332157, 337457, 341341, 344214, 346550, 347448, 345619, 341586, 337289, 333555, 329452, 324252, 318529, 313050, 307962, 303462, 300132, 298128, 297026, 296737, 297691, 299921, 302822, 305893, 308780, 310604, 310337, 308039, 304750, 301084, 296890, 292343, 288213, 284863, 282065, 280001, 279308, 279847, 280518, 280736, 281110, 282265, 283885, 285409, 286859, 288524, 290477, 292716, 295194, 297495, 299157, 300498, 302391, 305009, 307508, 309125, 309887, 310108, 309920]
57371C09920l86l02l74r23j452j431j227j454j838j614p44R4M56M27K85L09O48
57354C00394J041J047P55O59P80O73M27O16J062Q74Mn44m34n18j078j068J11J491
57336C06292K023J891J507O54m98r05k55L36K73N87J899K855K061K91q33j083
57320C17095j053n87N21J314R17R4p3j32j125k394k352r38M86J195J452J286N93
57303C16299J10O61J710J990J383Q69R37J297J767K299K502K223K116K547K685
57288C41395J817Q16R02J704K009J733J627J702J559J696K725L794L629K764K898
57273C72770M152M882M307L535L607M071M017L341K549K128K316K776K564J193
57259D18208m37j030n37J3N7l7K11R39K079L183L523K969K245J770J155M67P12
$$ y = [309920, 309534, 309232, 308858, 307935, 306483, 305052, 303825, 302371, 300533, 298919, 298175, 298269, 298725, 299152, 299437, 299746, 300394, 301435, 302482, 303237, 303896, 304676, 305349, 305776, 306392, 307454, 308328, 308332, 307788, 307354, 306836, 305758, 304690, 304801, 306292, 308315, 310206, 311713, 312367, 311869, 310964, 310709, 311045, 311318, 311905, 313804, 316659, 318720, 319011, 318178, 317095, 316042, 315455, 315976, 317290, 318207, 318301, 318228, 318096, 316971, 314577, 312225, 311287, 311773, 312968, 314420, 315706, 316299, 316409, 317070, 318780, 320770, 322153, 323022, 323959, 325256, 327023, 329322, 331824, 334047, 336163, 338710, 341395, 343212, 344028, 344930, 346634, 348643, 350376, 352003, 353705, 355264, 356960, 359685, 363479, 367108, 369872, 372770, 376922, 381804, 386111, 389646, 393253, 397324, 401341, 404682, 407231, 409359, 411675, 414451, 417015, 418208, 417771, 416741, 416204, 416217, 416274, 416237, 416448, 417387, 419466, 422649, 426172, 429141, 431386, 433156, 434311, 434778, 435490]
57242D35490K038K754J673K21N10K209L268L004K541K618K920L313M005M561M419
57227D75544M075M364M854M563L861L949M727M988M564M508N214O036O693P488
57213E45428Q076P670O499N665N545N685O011O714P197O818O372P111Q565R184
57199F42540Q914R096R845R757Q531P713Q273R329R902J0260J0699J0646R827
57186G65332R048Q957R183R325R793J1039J2799J4476J5625J5860J5151J4260
57174I10848J4049J4385J4626J4903J5907J7584J9215K0535K1664K2305K2281
57163A108302K2445K3705K5433K6330K6432K6769K7400K7583K7545K8248K9558
57152A399750L0468L1104L2586L5062L7633M0240M3672M7513N0037N0408M9361
$$ y = [435490, 437528, 440282, 441955, 442176, 442686, 444895, 448163, 451167, 453708, 456326, 459246, 462559, 466564, 471125, 475544, 479619, 483983, 488837, 493400, 497261, 501210, 505937, 510925, 515489, 519997, 525211, 531247, 537940, 545428, 553504, 561174, 567673, 573338, 578883, 584568, 590579, 597293, 604490, 611308, 617680, 624791, 633356, 642540, 651454, 660550, 670395, 680152, 688683, 696396, 704669, 713998, 723900, 734160, 744859, 755505, 765332, 774380, 783337, 792520, 801845, 811638, 822677, 835476, 849952, 865577, 881437, 896588, 910848, 924897, 939282, 953908, 968811, 984718, 1002302, 1021517, 1042052, 1063716, 1086021, 1108302, 1130747, 1154452, 1179885, 1206215, 1232647, 1259416, 1286816, 1314399, 1341944, 1370192, 1399750, 1430218, 1461322, 1493908, 1528970, 1566603, 1606843, 1650515, 1698028, 1748065, 1798473, 1847834]
57141A847834M7678M5776M4829M6237M9559N2753N4735N6143N7552N8775O0088
57130B421959O2306O5421O8813P2856P8514Q5373R1957R8016J04592J11983J19657
57119C381447J28026J38039J49072J59553J69789J81867J96727K13636K32553
57110D950709K54595K80119L08824L41665L80216M24417M73751N30485N98875
57101H543656O81675P80744R00665J048086J227835J443501J701000K006353K359423
57092B0692938K753988L183099L638583M106134M568620N014890N437370N820409
57084E5216031O140598O377408O503399O450858O104759N358257M188721K679833
57076I9019864R77581p64930k413049l858869n032577n907662o487804o789216
$$ y = [1847834, 1895512, 1941288, 1986117, 2032354, 2081913, 2134666, 2189401, 2245544, 2303096, 2361871, 2421959, 2484265, 2549686, 2618499, 2691355, 2769869, 2855242, 2947199, 3045215, 3149807, 3261790, 3381447, 3509473, 3647512, 3796584, 3956137, 4125926, 4307793, 4504520, 4718156, 4950709, 5205304, 5485423, 5794247, 6135912, 6516128, 6940545, 7414296, 7944781, 8543656, 9225331, 10006075, 10906740, 11954826, 13182661, 14626162, 16327162, 18333515, 20692938, 23446926, 26630025, 30268608, 34374742, 38943362, 43958252, 49395622, 55216031, 61356629, 67734037, 74237436, 80688294, 86793053, 92151310, 96340031, 99019864, 99997445, 99232515, 96819466, 92960597, 87928020, 82020358, 75532554, 68743338]
57068F8743338o836737o668079o330752n872882n338769m769227m199269l654114
57060B5073509l149662k696021k298471j956715j667008j425419j227709j067228
57052I585276r35768q26576p35106o57352n89405n28774m74609m26378l83131
57043D028177l44021l08675k76959k48720k23691k01298j80870j62203j45444
57034A936296j30286j15895j01904q8751p6632o4760n2091l8281k3365p158R929
57023A247102K5046L2541K6756O680k1895m9709p0372q3239r0442r2860r0107
57012H39501q3036p4036o5040n6602m8920m2359l6889l2174k8251k5315k2879
57001C24000k0175j7247j4751j2826j1131r763q994q332o950m955l164j674K02
$$ y = [68743338, 61906601, 55238522, 48907770, 43034888, 37696119, 32926892, 28727623, 25073509, 21923847, 19227826, 16929355, 14972640, 13305632, 11880213, 10652504, 9585276, 8649508, 7822932, 7087826, 6430474, 5841069, 5312295, 4837686, 4411308, 4028177, 3684156, 3375481, 3098522, 2849802, 2626111, 2424813, 2243943, 2081740, 1936296, 1806010, 1690115, 1588211, 1499460, 1422828, 1358068, 1305977, 1267696, 1244331, 1237173, 1247102, 1272148, 1304689, 1331445, 1338125, 1316230, 1266521, 1196149, 1112910, 1022468, 929608, 839501, 756465, 682429, 617389, 560787, 511867, 469508, 432619, 400445, 372194, 346879, 324000, 303825, 286578, 271827, 259001, 247870, 238107, 229113, 220781, 213831, 208876, 205712, 204038, 204240]
56988B04240K612M955O991R099J1301J2894J3126J1480P506J311n828j2280j7344
56975B50063k1017k2916k2536k0320j7344j4100j0596p326m900k909l91K638N337
56962A13683P549R969J2850J5807J8777K1855K4032K3408J8951J1274J770p923
56950B72002j5866k0658k2610k3009k2286k0076j6825j3778j1141p802l269J438
56938I6120N312Q567J1769J5002J8382K2518K7630L2734L6057L5756L0440K0016
56926C60303O464p049j8149k6042l0683l2283l1639k9868k7428k4126k0156j6278
56914A03066j2975j0258q363p633p600p200o053m778l934l410l023k818k666k227
56900B0128j458n39N61J873L049L936N110P104R478J1619J3819J6548J9304K1474
$$ y = [204240, 206852, 211807, 218798, 227897, 239198, 252092, 265218, 276698, 284204, 285515, 279687, 267407, 250063, 229046, 206130, 183594, 163274, 145930, 131830, 121234, 113908, 109008, 106099, 105708, 108346, 113683, 121232, 131201, 144051, 159858, 178635, 200490, 224522, 247930, 266881, 278155, 279925, 272002, 256136, 235478, 212868, 189859, 167573, 147497, 130672, 116894, 105753, 97951, 94682, 96120, 101432, 109999, 121768, 136770, 155152, 177670, 205300, 238034, 274091, 309847, 340287, 360303, 366767, 359718, 341569, 315527, 284844, 252561, 220922, 191054, 163626, 139500, 119344, 103066, 90091, 79833, 71470, 63837, 56237, 49037, 42984, 38206, 34272, 30862, 27839, 25021, 22355, 20128, 18670, 18131, 18692, 20565, 23614, 27550, 32660, 39764, 49242, 60861, 74680, 91228, 110532, 132006]
56886A32006K3674K6562K8696K7443K2048J4263N988j962q771j3242j5069j5011
56874B26625j3540j0637p082m139j605K150P618J3334J8262K3325K9550L6251
56862C20112M2400M8466N5361O1894O4533N9745M6383K6407L918j6869l3245m4012
56850F35093m8760m7993m3496l7243k9920k1409j2394m064L652J2028K1595L1630
56838D58719M1761N2533O4159P6148Q8228R9514J05957J00870Q0015M5914O400
56827A220218l0372n9306p8656q8970r1818q8657q0704o9594n7329m5219l3497
56816D96096k2156j1468j512Q092J7710K7550L7873M8645N9003O7549P2592P1362
56804H71336O0237L7910Q374k1002m4618o0875p0088p2685o9899o4001n6725m8480
$$ y = [132006, 155680, 182242, 210938, 238381, 260429, 274692, 280680, 278718, 269947, 256705, 241636, 226625, 213085, 202448, 195366, 191227, 189622, 191772, 199390, 212724, 230986, 254311, 283861, 320112, 362512, 410978, 466339, 528233, 592766, 652511, 698894, 725301, 729219, 712350, 679105, 635093, 586333, 538340, 494844, 457601, 427681, 406272, 393878, 389814, 393466, 405494, 427089, 458719, 500480, 553013, 617172, 693320, 781548, 881062, 987019, 1087889, 1167904, 1213818, 1220218, 1189846, 1130540, 1051884, 962914, 871096, 782439, 701735, 632141, 574812, 529593, 496096, 473940, 462472, 460960, 469052, 486762, 514312, 552185, 600830, 659833, 727382, 799974, 871336, 931573, 969483, 977857, 956855, 912237, 851362, 781274, 708589, 638690, 574689, 517964, 469484]
56792D69484l9623l1057k3216j5790q772k441L791J0887J8344K4601K9443L3970
56780D69621L7627L7396L0975J9079M065j1814k6022l5908m0850m2790m3457m2466
56768C55456l9143l4501l0040k5961k1869j8108j5191j2897j0954r544q424o801
56756A22023m787l612l634l682l147k978l648l957l135k347k725l419l173k362
56742G5417j942j726j257j073j579j812r66k2k83j283j681j266o37J06R63J271
56726F2230P98O05J433K269J988J334J581K255J972R00N24J394K605L268L227
56711H8383K683K121K195K798K889K041J186J045R11J49m05J72J162J360R18P08
56695A10316P22N28M41Q34J126P50K78L41M35M0j55M55J090J064J307K696M064
$$ y = [469484, 429861, 398804, 375588, 359798, 351026, 348585, 352376, 363263, 381607, 406208, 435651, 469621, 507248, 544644, 575619, 594698, 598763, 586949, 560927, 525019, 484169, 441379, 397922, 355456, 316313, 281812, 251772, 225811, 203942, 185834, 170643, 157746, 146792, 137248, 128824, 122023, 117236, 113624, 109990, 106308, 103161, 100183, 96535, 92578, 89443, 87096, 84371, 80952, 77779, 75417, 73475, 71749, 70492, 69419, 67840, 66028, 65062, 65040, 64757, 63474, 61793, 60527, 59890, 59996, 60959, 62230, 63028, 63633, 65066, 67335, 69323, 70657, 72238, 74493, 76465, 77365, 77889, 79283, 81888, 85156, 88383, 91066, 93187, 95382, 98180, 101069, 103110, 104296, 105341, 106252, 106401, 105996, 106168, 107330, 108690, 109608, 110316, 111038, 111566, 112007, 112841, 113967, 114717, 114995, 115336, 115771, 115811, 115656, 116111, 117201, 118265, 119572, 122268, 126332]
56678A26332L863K716K320K606K163Q61p1k47m60j002j342j355j334j090m03P7
56662A33634k61p09l24L73L85K00R56K155K213J023J97O90J795K508K557K051
56646A49443J306Q88Q82N62l40p39K00J451J469M25l98p17j120j586j749k084
56630A47893l135m063l683k441j751j767j521q58n68q96j355j691j735q81Q90
56615A22438K148J761P18N84R96N82m19n22M88J410J589J193P9j656k585j513
56599A27291L99J083O76R24J951K159J183M20M21J45p94j310p79kK96K43l2n44
56581A33730o01M98J954K269J540J231J831K429K603K798K970K608K180K676L747
56566A64463M139L899M272N511O723P795R443J1281J1888J0985R511P599M571
$$ y = [126332, 130195, 132911, 135231, 137837, 140000, 140861, 140790, 140543, 140083, 139081, 137739, 136384, 135050, 133960, 133557, 133634, 133373, 132664, 132340, 132713, 133098, 133298, 134254, 136409, 138622, 139645, 139842, 140532, 142327, 144835, 147392, 149443, 150749, 151637, 152519, 153081, 152741, 152002, 152202, 153653, 155122, 155547, 155149, 154432, 153312, 151726, 149977, 147893, 144758, 140695, 137012, 134571, 132820, 131053, 129532, 128674, 128106, 127210, 125855, 124164, 122429, 121548, 122438, 124586, 126347, 127065, 127649, 128645, 129227, 128808, 128286, 128774, 130184, 131773, 132966, 133045, 131389, 128804, 127291, 127690, 128773, 129449, 130373, 132324, 134483, 135666, 136086, 136507, 136652, 135858, 134548, 133769, 133767, 134063, 134306, 134274, 133730, 133129, 133627, 135581, 137850, 139390, 140621, 142452, 144881, 147484, 150282, 153252, 155860, 158040, 160716, 164463, 168602, 172501, 176773, 182284, 189007, 196802, 206245, 217526, 229414, 240399, 249910, 257509, 262080]
56553B62080J010j353k184k840l855m237l604k976k902k752k326k292k639k530
56539B26600k006k057k676k818k454k703l601l788k846j939j719j532j151j308
56525A94002j997k182j630j247j240q79l11n88j552j830j253j179j969k418k101
56510A71626k011k361k067j060p71j606k215j978j896k300k112j143o98r49l00
56495A48159J501K271Q76o79l28J092J748J653J709J613P19l60p18o50p53o45
56479A57208Q6P33N24j83p05j090j453j426r63o56o09k35M45O05K05J77O99R38
56461A54300Q60J413K343K013J66j184o42P14J316J137P35J27l69J25J372J863
56445A66289J150N88Q98J004K85j46M17P89l0j118j297q89o15k55L74O60M00L07
$$ y = [262080, 263090, 261737, 259553, 256713, 252858, 248621, 245017, 242041, 239139, 236387, 234061, 231769, 229130, 226600, 224594, 222537, 219861, 217043, 214589, 211886, 208285, 204497, 201651, 199712, 197993, 196461, 195310, 194002, 192005, 189823, 188193, 186946, 185706, 184827, 184516, 183928, 182376, 180546, 179293, 178114, 176145, 173727, 171626, 169615, 167254, 165187, 164127, 163356, 161750, 159535, 157557, 155661, 153361, 151249, 150106, 149408, 148459, 148159, 149660, 151931, 152807, 152128, 151800, 152892, 154640, 156293, 158002, 159615, 160334, 159974, 159256, 158606, 157853, 157208, 157294, 158027, 158551, 158368, 157663, 156573, 155120, 153694, 152731, 152075, 151466, 151231, 151676, 152281, 152486, 152663, 153362, 154300, 155160, 156573, 158916, 160929, 161095, 159911, 159269, 159983, 161299, 162436, 163171, 163298, 162929, 163054, 164426, 166289, 167439, 168027, 168925, 169929, 170214, 170068, 170485, 171274, 171244, 170126, 168829, 167940, 167325, 167070, 167444, 168104, 168504, 168811]
56427A68811M97J28p77j012m35m09j206j214J97J399J319J186K057K818K297J307
56411A76963R69Q70M19K04N10L86m51o75K46Q24J77l19M28J152N82k29J20R55
56393A83131J018O70O90N71j44m83K41R07N47J58Q21J632J311L41j95m14o53l24
56375A89825O88J142M75N3Q99J921J965J694J876J726P25N3N01R04M03J77J146
56358B06173K007J587J007J492K097J716J265J722K008J103K28O12J136N72J13
56343B24838J139K442K371J862K588L802L785K941K756L042K880K853L777M568
56329B65644L887K673K524K982K704K042K006K110J577J248J967K497J470n0k71
56314B95010M90J003J511K641L470L123K751L671N071N758O294P250P478O528
$$ y = [168811, 169308, 169436, 168659, 167647, 167212, 166803, 165597, 164383, 164580, 165979, 167298, 168484, 170541, 173359, 175656, 176963, 177932, 178802, 179221, 179425, 179935, 180321, 179870, 179195, 179441, 180265, 180442, 180123, 180551, 181703, 182285, 182056, 182176, 183131, 184149, 184819, 185509, 186080, 185936, 185453, 185694, 186601, 187148, 187306, 188127, 189759, 191070, 191411, 191216, 190802, 190149, 189825, 190513, 191655, 192130, 192183, 193082, 195003, 196968, 198662, 200538, 202264, 202989, 203042, 203543, 204447, 204850, 205027, 206173, 208180, 209767, 210774, 212266, 214363, 216079, 217344, 219066, 221074, 222177, 222405, 223017, 224153, 224725, 224838, 225977, 228419, 230790, 232652, 235240, 239042, 242827, 245768, 248524, 251566, 254446, 257299, 261076, 265644, 269531, 272204, 274728, 277710, 280414, 282456, 284462, 286572, 288149, 289397, 291364, 293861, 295331, 295281, 295010, 295500, 296503, 298014, 300655, 304125, 307248, 309999, 313670, 318741, 324499, 330793, 338043, 345521, 352049]
56300C52049O481Q586J0383R173O273M683M639M723N307P345R507J0017R758J0327
56286D59251J0780R723Q675R697J1386J1110R625R551J0749J1221J1331J2992
56274E86091J5621J6924J6982J7786J9563K1100K2905K6264L0088L2398L4201
56263H39923L8206M4379N0401N5822O2225O9954P8146Q7290R8426J10620J22473
56252A657865J34931J49226J63497J75143J85116J95784K05960K12370K14824
56243C294716K15244K12481K03015J86410J65437J40957J11336P7009M1262O133
56233D654000k8559o1994r2006j18030j40752j59133j71391j78649j83741j86815
56223C332930j85916j81483j76084j70109j61924j52061j43083j35329j26893
$$ y = [352049, 358530, 367116, 377499, 386672, 392945, 397628, 402267, 406990, 412297, 419642, 429149, 439166, 448924, 459251, 470031, 479754, 488429, 498126, 509512, 520622, 530247, 539798, 550547, 561768, 573099, 586091, 601712, 618636, 635618, 653404, 672967, 694067, 716972, 743236, 773324, 805722, 839923, 878129, 922508, 972909, 1028731, 1090956, 1160910, 1239056, 1326346, 1424772, 1535392, 1657865, 1792796, 1942022, 2105519, 2280662, 2465778, 2661562, 2867522, 3079892, 3294716, 3509960, 3722441, 3925456, 4111866, 4277303, 4418260, 4529596, 4606605, 4647867, 4654000, 4625441, 4563447, 4471441, 4353411, 4212659, 4053526, 3882135, 3703486, 3519745, 3332930, 3147014, 2965531, 2789447, 2619338, 2457414, 2305353, 2162270, 2026941, 1900048]
56214A900048j17671j09377j01837r3341q4549p7890p3163o7811o1367n5605n0653
56203A006784m5135l9797l6680l5008l2177k8360k5727k3711j9949j5506j3887
56192F90847j4932j4776j2216r995r383q510o669n542n407m636l457l766m926
56179E86632m297k105j136j545p81J217J836J024J509L475M181L373L814N897
56165F03094O916O336O545P784P677O392O962R698J1557J1846J3144J5896J7655
56152G31502J8556K1776K7657L2883L6639M1930M9817N8005O6204P7135R0858
56141A252962J03814J14594J24863J33448J35585J29680J19094J06114R0236P3574
56131B383964O1355N4973N0330M4663L8953L2434K1618O899o274j5075k2158k9292
$$ y = [1900048, 1782377, 1673000, 1571163, 1477822, 1393273, 1315383, 1242220, 1174409, 1113042, 1057437, 1006784, 961649, 921852, 885172, 850164, 817987, 789627, 763900, 740189, 720240, 704734, 690847, 675915, 661139, 648923, 638928, 629545, 621035, 614366, 608824, 603417, 598781, 595324, 591558, 586632, 582335, 580230, 579094, 577549, 576768, 577985, 579821, 580845, 582354, 585829, 590010, 593383, 597197, 603094, 610010, 616346, 622891, 630675, 638352, 644744, 651706, 661404, 672961, 684807, 697951, 713847, 731502, 750058, 771834, 799491, 832374, 869013, 910943, 960760, 1018765, 1084969, 1162104, 1252962, 1356776, 1471370, 1596233, 1729681, 1865266, 1994946, 2114040, 2220154, 2310390, 2383964, 2445319, 2500292, 2550622, 2595285, 2634238, 2666672, 2688290, 2695189, 2688915, 2673840, 2651682, 2622390]
56119B622390l4861l9726m8712o3519q0281r6214j12184j26639j34102j32608
56109A753544j26294j18091j06455r1654p8169o7873n7580m6235l7676l3253k8705
56098I61559k1676j5563j2686j0372p048n342n912n015j551L57r78j547O99K204
56084H77129J124R82L474N025M052M369P594R725Q908R049J1863J3198J1233J0466
56070I78191J3413J6103J5958J6216J8446J8819J6000J4410J5580J4837J0719
56059A148692Q576J0431J0777P228N540Q751J1305R696Q907J2177J4413J2337
56047A268830J1204J4567J7285J5647J4635J7916K0528J8796J7598K0416K2292
56036A459714K0248K0264K6024L1293L1609L2738L9022M4218M2942M0404M1680
$$ y = [2622390, 2587529, 2547803, 2499091, 2435572, 2355291, 2259077, 2146893, 2020254, 1886152, 1753544, 1627250, 1509159, 1402704, 1311050, 1232881, 1165008, 1107428, 1061193, 1023517, 990264, 961559, 939883, 924320, 911634, 901262, 894214, 888872, 882960, 877945, 876394, 876751, 875773, 874226, 874925, 877129, 878253, 879235, 882709, 887734, 891786, 896155, 903749, 913474, 922382, 931431, 943294, 956492, 967725, 978191, 991604, 1007707, 1023665, 1039881, 1058327, 1077146, 1093146, 1107556, 1123136, 1137973, 1148692, 1157268, 1167699, 1178476, 1185704, 1191244, 1199995, 1211300, 1220996, 1229903, 1242080, 1256493, 1268830, 1280034, 1294601, 1311886, 1327533, 1342168, 1360084, 1380612, 1399408, 1417006, 1437422, 1459714, 1479962, 1500226, 1526250, 1557543, 1589152, 1621890, 1660912, 1705130, 1748072, 1788476, 1830156]
56025A830156M2202L8239L5662L8743M1473L9583L9559M5846N1212N0231M9872
56014B302778N5799O0966N9396N8352O4537P1210P1582P2024P8976Q5978Q6996
56003C068594Q9160R8562J07339J08879J11546J22709J34002J37633J41834J54282
55993D274540J66320J70320J75944J91621K07288K14044K22777K43551K65460
55984F131865K77910K92447L21072L52986L76603M03712M46644M93082N30364
55975I626685N72289O33538P01301P62440Q33682R32501J044953J157403J291425
55966A7556217J469504J677589J903614K179822K541731K983175L504000M162054
55958C7977706N021584O097673P416165R068371J1120437J3530205J6257131J9388302
$$ y = [1830156, 1872358, 1910597, 1946259, 1985002, 2026475, 2066058, 2105617, 2151463, 2202675, 2252906, 2302778, 2358577, 2419543, 2478939, 2537291, 2601828, 2673038, 2744620, 2816644, 2895620, 2981598, 3068594, 3157754, 3256316, 3363655, 3472534, 3584080, 3706789, 3840791, 3978424, 4120258, 4274540, 4440860, 4611180, 4787124, 4978745, 5186033, 5400077, 5622854, 5866405, 6131865, 6409775, 6702222, 7023294, 7376280, 7752883, 8156595, 8603239, 9096321, 9626685, 10198974, 10832512, 11533813, 12296253, 13129935, 14062436, 15107389, 16264792, 17556217, 19025721, 20703310, 22606924, 24786746, 27328477, 30311652, 33815652, 37977706, 42999290, 49096963, 56513128, 65581499, 76701936, 90232141, 106489272, 125877574]
55950A25877574K3033416K7167162L1678812L6321410M0158533M1095453L6662668
55943C61995028K5941878J0776573n184620j8713979k8355434l4103523l6480307
55936B75875616l6121797l3794608l0309011k6320447k2291662j8567120j5357626
55929I3113345j2693626j0501714q722589p312628o189969n263507m495252l877970
55921C4056090l376897k945653k574665k273175k022858j793494j585459j414716
55913A6069173j272351j137088j011893r11826q29821p48174o70642o11425n64689
55904H311264n14848m65289m28610l99501l64497l28119l03297k85629k61969
55895D959505k35475k18125k07044j91099j72894j62265j55653j43056j28021
$$ y = [125877574, 148910990, 176078152, 207756964, 244078374, 284236907, 325332360, 361995028, 387936906, 398713479, 393528859, 374814880, 346459446, 312355923, 275875616, 239753819, 205959211, 175650200, 149329753, 127038091, 108470971, 93113345, 80419719, 69918005, 61195416, 53882788, 47692819, 42429312, 37934060, 34056090, 30679193, 27733540, 25158875, 22885700, 20862842, 19069348, 17483889, 16069173, 14796822, 13659734, 12647841, 11736015, 10906194, 10158020, 9487378, 8875953, 8311264, 7796416, 7331127, 6902517, 6503016, 6138519, 5810400, 5507103, 5221474, 4959505, 4724030, 4505905, 4298861, 4107762, 3934868, 3772603, 3616950, 3473894, 3345873]
55886C345873j20457j16780j06904r3902q7416q4470p5825o5140o2955o7314o8255
55875B396455o6232o8589p3001p1687o7308o7957p0741o6712n7949n3813n3916
55864A678550n0352m3456m0252m0290l7472l3047l2949l5110l2891k8197k8047
55853A276487l1035l0281k6776k6983k9890k9244k6091k6523k9359k8331k4315
55842I67659k3402k4923k3233j9344j9079k1440k0303j6040j4394j5336j3957
55831G56208j0835j0741j2547j0975o971o002p563o713m379n656r250r155n808
55818F49613n237p939q705o844o521p498n356p35J197K39J032L784M290K825L874
55803F18019P171P953N986N525O448M333o11l484l834o201j1132j4144j4072j4391
$$ y = [3345873, 3225416, 3108636, 3001732, 2907830, 2820414, 2735944, 2660119, 2594979, 2532024, 2464710, 2396455, 2330223, 2261634, 2188633, 2116946, 2049638, 1981681, 1910940, 1844228, 1786279, 1732466, 1678550, 1628198, 1584742, 1544490, 1504200, 1466728, 1433681, 1400732, 1365622, 1332731, 1304534, 1276487, 1245452, 1215171, 1188395, 1161412, 1131522, 1102278, 1076187, 1049664, 1020305, 991974, 967659, 944257, 919334, 896101, 876757, 857678, 836238, 815935, 799895, 785501, 770165, 756208, 745373, 734632, 722085, 711110, 704139, 698137, 690574, 683861, 679482, 673826, 664576, 655421, 649613, 644376, 636437, 627732, 620888, 614367, 606869, 601513, 600778, 601975, 602214, 603246, 607030, 611320, 614145, 618019, 625190, 633143, 639129, 644654, 651102, 655435, 654824, 651340, 647506, 641305, 630173, 616029, 601957, 587566]
55789E87566j5621j4452j0966q926q352n529q62R70o91j522j37M98Q1K009O584
55774E30650J0311J2796J7366K4096K8862K9778K8064K2513J0451n336j7814k4616
55762F67121k9159l2724l2650k9008k5665k3559j9726j4074j0347r314p675m782
55750D28438l789n070n188l598l779o370p714o560n801o191m824j412K10j383
55736C66969l111l396m356o529p279o137o010p513p744o047n402o675p082n797
55722B83891n317n973m898j892m19j182o31K481M940N253O054Q375R303P561N767
55707C13313M997K665j843n028n180n153o799p977p496p770r791j0555q331n781
55693B39271n057m466k597j260j562j487qO78m24p41J213L048K888K425L103L413
$$ y = [587566, 571945, 557493, 546527, 537601, 529249, 523720, 522858, 523828, 523137, 521615, 521478, 521976, 522057, 524066, 530650, 540961, 553757, 571123, 595219, 624081, 653859, 681923, 704436, 714887, 709551, 691737, 667121, 637962, 605238, 572588, 543580, 517915, 494356, 474630, 460556, 450209, 440895, 433220, 428438, 424649, 419579, 414391, 410793, 407014, 400644, 392930, 386370, 380569, 374378, 369554, 368142, 368352, 366969, 363858, 360462, 356106, 349577, 342298, 336161, 330151, 322638, 314894, 308847, 303445, 296770, 289688, 283891, 278574, 272601, 267703, 265811, 265392, 264210, 263579, 266060, 271000, 276253, 282307, 290682, 299985, 307546, 313313, 318310, 320975, 319132, 314104, 308924, 303771, 296972, 288995, 281499, 273729, 263938, 253383, 245052, 239271, 234214, 229748, 227151, 225891, 224329, 222842, 222834, 223512, 223088, 222347, 223560, 226608, 229496, 231921, 235024, 238437]
55677B38437K437K045L041L122J119o51o60p77k230l007j851q20j328j501n3J102
55661B38425O79O34K259L468K734K061L156M208L338J933J714J569J41j466k105
55646B62748k864m523n655n460n427o155n710l340j527k014l078k904k471k770
55632B08850k516r83J36j5M38K484L986L332K093J765J263j48r73p70j710m395
55616B12837n902m639l296m007m549k616j77K09p0J307L044K726J257Q78J043
55601A98045p1j911k905l564m994o162n786n014n306n584m402k978l057l666l004
55586A39641j718j394j504p81R8o8n07KP83Q97J244K561L338K313J172K019L978
55569A52074M961M951M942M489L018J725J581J235n23k200k167j750k873m627
$$ y = [238437, 240874, 242919, 245960, 249082, 250201, 249550, 248890, 248113, 245883, 242876, 241025, 240205, 238877, 237376, 237323, 238425, 239104, 239738, 241997, 245465, 248199, 250260, 253416, 257624, 260962, 262895, 264609, 266178, 266319, 264853, 262748, 259884, 255361, 249706, 244246, 238819, 232664, 226954, 223614, 222087, 220073, 216995, 214091, 211620, 208850, 206334, 205351, 205487, 205472, 205910, 208394, 212380, 215712, 217805, 219570, 220833, 220685, 219712, 218942, 217232, 212837, 206935, 202296, 199000, 194993, 190444, 187828, 187651, 187860, 187790, 189097, 192141, 194867, 196124, 197002, 198045, 197974, 196063, 193158, 189594, 184600, 178438, 172652, 167638, 162332, 156748, 152346, 149368, 146311, 142645, 139641, 137923, 136529, 135025, 134244, 134342, 134274, 133767, 133769, 134552, 135449, 136693, 139254, 142592, 144905, 146077, 148096, 152074, 157035, 161986, 166928, 171417, 174435, 176160, 177741, 178976, 178453, 176253, 174086, 172336, 169463, 164836]
55555A64836n100m771m993m898l082q19l47j182j193k46J71j31k11j37l63j22
55539A37412J141J957R54n98q18l69q87j767j370k05J1o18q78j101k285l546l260
55522A23773j967j445j710j536j160j745k777k653j471p36p38m21M44J022J023
55507A07903Q04L60k56l09M05P17q9q71n97j65n92j020m21L92N04Q74K385L708
55489A13732L485K907L559M402L684K276K207L194L549L286L370L142J399q72
55475A53320j866k081l200m758m962m025l655l875l341k369k571l797m206l296
55461A05318k258j550o06K77K19l15j55L47k0q73q05j4K0q76j495j454j303r90
55443I3467k56L0q38j531m74J263J447L15QQ65J195M95J52P61J263J008M54j45
$$ y = [164836, 159736, 154965, 149972, 145074, 141992, 141173, 140826, 139644, 138451, 138205, 138376, 138245, 138034, 137897, 137534, 137412, 138553, 140510, 141464, 140866, 140048, 139679, 138792, 137025, 135655, 135450, 135461, 134843, 133965, 132864, 130579, 127033, 123773, 121806, 120361, 118651, 117115, 115955, 114210, 111433, 108780, 107309, 106573, 105835, 105414, 105858, 106880, 107903, 108707, 109067, 108811, 108502, 108907, 109624, 109535, 108664, 108067, 107902, 107310, 106290, 105869, 106261, 106765, 107639, 110024, 113732, 117217, 120124, 123683, 128085, 131769, 134045, 136252, 139446, 142995, 146281, 149651, 152793, 154192, 153320, 151454, 149373, 146173, 141415, 136453, 132428, 128773, 124898, 121557, 119188, 116617, 112820, 108614, 105318, 103060, 101510, 100904, 101181, 101400, 101085, 100930, 101277, 101257, 100384, 99579, 99565, 99585, 98709, 97214, 95760, 94457, 93467, 93211, 93241, 92403, 90872, 90398, 91661, 93108, 93423, 93431, 94296, 95491, 95986, 96138, 96899, 98162, 99170, 99624, 99479]
55425I9479q32r42L1R76N91k42J94J438J599O35J55L81Q0o57l63R39J485O68k32
55406A05383n23r30j596j567p45k66n15o33l37m02j005j307r40l74K23J012J520
55389I6998J163M98M25N65L6p17o67j53k16n72k72K78k5q34j024q44j230j668
55371I1741j114l35q13j855j499Q8Q52K70j75J28K54k2O4K72n06j961k627k342
55353H0420k108j723j75J739J994N93l97j86P5l8L16R16N04n20l45R94J460N94
55335H4113K39J105J584R11N31J221J594P40j18L2L02j91p96q91r86j219p34M50
55317H7887Q39j04q74k78Q23J182Q90M82j31r13j251r95p37o81m99l57o12o12
55299H4059M03J451R98k90l92O48Q50p4k50Q65J531R86O70J253J351L38l66l7
$$ y = [99479, 98647, 97705, 97736, 98712, 99303, 99061, 99255, 100693, 102292, 102927, 103082, 103463, 103543, 102886, 102523, 103462, 104947, 105615, 105383, 104860, 103930, 102334, 100767, 100022, 99756, 99241, 98608, 98271, 97869, 96864, 95557, 94617, 94243, 94466, 95478, 96998, 98161, 98659, 99084, 99649, 99685, 98968, 98301, 98148, 97932, 97360, 97088, 97366, 97341, 96507, 95483, 94639, 93409, 91741, 90627, 90292, 89479, 87624, 86125, 86213, 87065, 87335, 87160, 87288, 87542, 87520, 87584, 87856, 87350, 85389, 82762, 80420, 78312, 76589, 76414, 78153, 80147, 80740, 80343, 80157, 80232, 80194, 80510, 81426, 81930, 81410, 81065, 82059, 83519, 84113, 84352, 85457, 87041, 87952, 88483, 89704, 91298, 92038, 91920, 91952, 92254, 92063, 91267, 90376, 89390, 88171, 87437, 87887, 88726, 88622, 87748, 87470, 88293, 89475, 90365, 90847, 90716, 89803, 88552, 87557, 86820, 86139, 85640, 85283, 84671, 84059, 84462, 85913, 86911, 86621, 86229, 86877, 87727, 87653, 87403, 88268, 89799, 90785, 91455, 92708, 94059, 94397, 94031, 93994]
55281I3994O1o49p65K41O64m18j271m50P61P01m0k53l06q52j177o21kk8O4P84
55261I0438J095L38l50o4K38k68n11M83J555J301M10K85O95N82j1m31p13r38n17
55242I3617N14R01R0o70m18l4l54m81L40R35J20j110j213n94m96p04l38J62j96
55223I0071r84j033l49K67P40J352J682J331Q86Q23M00q96j873j221L22R60L35
55206I2813n06r00q97m81J98L94k03o95l01L57L40j15l50m95p96o99R9P18M83
55187H8964J27L74M98k22q29k13P74O12k72k08R22J563R76J44M3M29N74K58j30
55168I4384%Q27J551J096k90j065n25K68K83oR6J61k44m28J53O30J75m17q1O13
55148I7181M00o11j378j646j742j376k16R61J149O69N27P68P43M55L54L27R7M7
$$ y = [93994, 94055, 93406, 92641, 92882, 93546, 93128, 91857, 91407, 92168, 92869, 92829, 92576, 92270, 91418, 90241, 89620, 89618, 89590, 89654, 90438, 91533, 91871, 91521, 91457, 91695, 91427, 90916, 91399, 92954, 94255, 94665, 94950, 95645, 96227, 96216, 95785, 95072, 94134, 93617, 94131, 95032, 95122, 94452, 94034, 94000, 93646, 93165, 93505, 94440, 94560, 93450, 92237, 91643, 91147, 90443, 90105, 90267, 90071, 89087, 88054, 87705, 87972, 88712, 90064, 91746, 93077, 93963, 94786, 95186, 94290, 92417, 91196, 91518, 92478, 92813, 92307, 91407, 90510, 90029, 90227, 90621, 90418, 89723, 89422, 89779, 90119, 90004, 89654, 89159, 88363, 87664, 87763, 88481, 88964, 89091, 89465, 89963, 89741, 88912, 88699, 89473, 90085, 89813, 89605, 90527, 92090, 93066, 93210, 93253, 93682, 94256, 94514, 94384, 94384, 95211, 96762, 97858, 97568, 96503, 95978, 96246, 96529, 96523, 96619, 96780, 96536, 96108, 96261, 96891, 97066, 96649, 96568, 97181, 97581, 96970, 95592, 93946, 92204, 90828, 90612, 91573, 92722, 93391, 93918, 94686, 95429, 95884, 96238, 96565, 96662, 96709]
55130I6709M83P19P6q49j049o08j69K87R31J120L32o03n74J42N00L53K32J29j67
55111I7994j82N12J267J319J092J298J458P35m11r13q33q92q85r1J138J677J362
55094A05645R87Q63O87N56Q78J405J488J175J019J119J184J193J100N24m71r20
55078A18432l13M88O01M86P76Q41J1q11m13N53M97n60j195r42p07r28j023p12
55060A15081m76n83p65q70r19p40m04n80j507k236j897j048o63n40m7L42k10j193
55042A00745j310l55Q08J639J981J369k29j533j370m49k41o67n62J29M90N47J151
55025A02143K003J731J00j441j699r05R7O59L96m20p08J32J098R63J72O4O43P71
55007A05799K05j43J78P45J286J780J792J043K84K83M92L5o12n50k85q32j635
$$ y = [96709, 97192, 97911, 97987, 97138, 96089, 95481, 95312, 95599, 96530, 97650, 97982, 97379, 96805, 96947, 97447, 97800, 98032, 98161, 97994, 97812, 98324, 99591, 100910, 102002, 103300, 104758, 105493, 105082, 104169, 103336, 102444, 101559, 101468, 102606, 104283, 105645, 106632, 107495, 108182, 108738, 109616, 111021, 112509, 113684, 114703, 115822, 117006, 118199, 119299, 119823, 119352, 118432, 118119, 118607, 119208, 119694, 120470, 121311, 121322, 120511, 120098, 120651, 121148, 120588, 119393, 118451, 117744, 116816, 115793, 115081, 114605, 114022, 113257, 112387, 111468, 110728, 110324, 109744, 108237, 106001, 104104, 103056, 102393, 101853, 101806, 102148, 101938, 100745, 99435, 99080, 99888, 101527, 103508, 104877, 104648, 103115, 101745, 101296, 101055, 100388, 99826, 99955, 100445, 100992, 102143, 104146, 105877, 105977, 104536, 102837, 101932, 102029, 102688, 103084, 102664, 101956, 102088, 103186, 104149, 104321, 104385, 105028, 105799, 106004, 105861, 106039, 106784, 108070, 109850, 111642, 112685, 112969, 113252, 113744, 113779, 113167, 112617, 112332, 111500, 109865]
54990A09865j392m42j71n41l99P3l47j296j050M31J182L98m57l08M6q6J0P69J238
54971A07523P35M3j0K88N61J157K077K461J924J238J022R01N53L09K09k57r97
54954A19737j078k66M91N44L54L76L51J66J29O6n64j355j104K60J327J267Q08
54937A21509P38Q81J077J617K178J896J141J567L561N289N344M856N700P816R629
54922A74799J0215R793Q810P575O312M851K763K07k127m165o548r103j0489j0022
54908A82871q687p615o696n454m250l627l314k840k361k109j754j067m83l10n4
54893A32250P59J781K412K586K511K297K200K529L043L265L599M997P192Q592
54879A80013Q508Q168Q650R084P959N316K458J59j838l992o448q924j0591j0585
$$ y = [109865, 108473, 108031, 107860, 107319, 106920, 106993, 106646, 105350, 104300, 104731, 105913, 106311, 105854, 105546, 105592, 105506, 105516, 106285, 107523, 108258, 108301, 108291, 108579, 109140, 110297, 112374, 114835, 116759, 117997, 119019, 119920, 120473, 120782, 120991, 120734, 119737, 118659, 118393, 118884, 119428, 119782, 120158, 120509, 120675, 120804, 120870, 120306, 118951, 117847, 118107, 119434, 120701, 121509, 122247, 123128, 124205, 125822, 128000, 129896, 131037, 132604, 136165, 141454, 146798, 151654, 157354, 165170, 174799, 185014, 194807, 203617, 211192, 217504, 222355, 225118, 225325, 223198, 219033, 212485, 203382, 192893, 182871, 174184, 166569, 159873, 154419, 150169, 146542, 143228, 140388, 138027, 135918, 134164, 133097, 132614, 132304, 132250, 133009, 134790, 137202, 139788, 142299, 144596, 146796, 149325, 152368, 155633, 159232, 164229, 171421, 180013, 188521, 196689, 205339, 214423, 222382, 227698, 230156, 230315, 228477, 224485, 218037, 209113, 198522, 187937]
54865A87937r123p495o576o025n316m678m392m054l287k444j983j765j524j403
54851A27872j510j580j506j584j841j825j431j113r49m33M25P61J54o23p27k88
54835A13802J51M00L34k04p64m57P45J781J967J714J354N13p49j447j131p15r69
54818A16325j261p44J78O25N74M83L83K64N08J063J014l0j007q39j2L62L10O27
54800A18823J358J858J952J974J913J501Q93M22m4p46j354j367q63k78K28O21
54784A26891O83M35M19R56J666K217K878L752M192L797L352L843N115O326P320
54769A73842Q544R917J0735J0596R709Q269O191L451L70k502m644n959o889p828
54755B13802q467q245p387o689o321n779n053m744m812m352l094j892j329r16
$$ y = [187937, 178814, 171319, 164743, 158718, 153402, 148724, 144332, 140278, 136991, 134547, 132564, 130799, 129275, 127872, 126362, 124782, 123276, 121692, 119851, 118026, 116595, 115482, 114533, 114100, 114525, 115286, 115440, 114817, 114090, 113802, 113953, 114353, 114687, 114483, 113719, 113262, 114007, 115788, 117755, 119469, 120823, 121336, 120587, 119140, 118009, 117294, 116325, 115064, 114320, 114498, 115123, 115697, 116180, 116563, 116827, 117335, 118398, 119412, 119382, 118375, 117536, 117524, 117886, 118196, 118823, 120181, 122039, 123991, 125965, 127878, 129379, 130272, 130694, 130650, 129904, 128550, 127183, 126320, 126042, 126270, 126891, 127574, 128009, 128428, 129384, 131050, 133267, 136145, 139897, 144089, 147886, 151238, 155081, 160196, 166522, 173842, 182386, 192303, 203038, 213634, 223343, 231612, 237803, 241254, 241624, 239122, 234478, 228519, 221630, 213802, 205335, 197090, 189703, 183014, 176693, 170914, 165861, 161117, 156305, 151953, 148859, 146967, 145638, 144722]
54741A44722k66J76J70K70O52O26J01K10J512K827L049K938L763N214O123O369
54725A78456O658P032P028O825O764O179M043O18k722n074o469p088p100p074
54711A88076p426p657o988n590m358l697l321k964k515j748o97k5l16j209j842
54696A37723j867j542j227j233j662j940j227K46J115P37R4J54L88o8q35j107
54680A27749j089j378j643j214m16nP8K53J77n69j287j080l86k23m18m0P91J042
54662A20342N04j13n87j226j668j176j19L10p0k40K14N16J73k63l19l14n17o35
54644A14812n41o28j026j183o52L09J177J707J841J590J116N65j06q03j084p06
54628A16388r2L29P50J373J719J306N55J51m9n53j086r76l25J92L64M13K48k35
$$ y = [144722, 144456, 144632, 144802, 145072, 145724, 146350, 146451, 146661, 148173, 151000, 154049, 156987, 160750, 165964, 172087, 178456, 185114, 192146, 199174, 205999, 212763, 218942, 222985, 223603, 220881, 215807, 209338, 202250, 195150, 188076, 180650, 172993, 166005, 160415, 156057, 152360, 149039, 146075, 143560, 141812, 141115, 141090, 140774, 139565, 137723, 135856, 134314, 133087, 131854, 130192, 128252, 127025, 127271, 128386, 129123, 129217, 129371, 129759, 129691, 128856, 127749, 126660, 125282, 123639, 122425, 122009, 122004, 122082, 122335, 122512, 121943, 120656, 119576, 119190, 118967, 118549, 118509, 119300, 120342, 120846, 120733, 120146, 118920, 117252, 116076, 115957, 116267, 116197, 115957, 116171, 116687, 116860, 116597, 116278, 115964, 115447, 114812, 114271, 113643, 112617, 111434, 110782, 111091, 112268, 113975, 115816, 117406, 118522, 119087, 118981, 118178, 117094, 116388, 116296, 116625, 117375, 118748, 120467, 121773, 122328, 122479, 122430, 121877, 120791, 119815, 119490, 119682, 120046, 120459, 120707, 120472]
54610A20472m44J76J054J222P85N77O23K66m39p21m82m00o78q12o30m72l42N7
54592A19812N16N80M92P53R81M25n17o60R2O34M99L56N62N71J72m5J58K67J21
54573A25769K59P17P17J8m81j54M19M58P1k74n31p62p39l43J28M17N70N32J24
54554A26915n19r73j049o69M40K093L025K129K16p60k42M81M92L39N75P15L42
54537A33550j9N6P6l61p68o82n01o52p69m34j5o7m98q66r34n26M41J404J468P55
54517A30658N01J289K130J954J101N04K54j31n90p34o70q13j130j249j058o57
54501A31359m5N93P68L02k18j50M26J026J399J423Q68j89j088j312j112r27o60
54484A32463l6O75R69Q55P65Q67R46Q64P56Q18J104J490J681J514J243J289J670
$$ y = [120472, 120028, 120204, 121258, 122480, 123265, 123842, 124465, 124731, 124292, 123571, 123089, 122689, 122011, 121199, 120569, 120097, 119755, 119812, 120328, 120908, 121400, 122153, 123134, 123559, 123042, 122382, 122474, 123108, 123607, 123963, 124525, 125096, 125268, 125223, 125381, 125648, 125769, 126028, 126745, 127462, 127480, 126999, 126845, 127264, 127722, 127793, 127519, 126988, 126226, 125487, 125144, 125272, 125689, 126259, 126791, 126915, 126396, 125423, 124374, 123705, 124145, 126238, 129263, 131392, 131608, 130848, 130606, 131087, 131579, 131918, 132493, 133208, 133550, 133531, 133587, 133663, 133302, 132534, 131852, 131351, 130699, 129930, 129496, 129481, 129414, 128916, 128050, 127116, 126590, 127031, 128435, 129903, 130658, 131159, 132448, 134578, 136532, 137633, 138137, 138391, 138260, 137670, 136936, 136266, 135453, 134323, 133074, 132016, 131359, 131314, 131907, 132675, 132977, 132759, 132609, 133035, 134061, 135460, 136883, 137751, 137562, 136474, 135162, 134050, 133123, 132463, 132427, 133102, 134071, 134926, 135691, 136558, 137504, 138368, 139124, 139942, 141046, 142536, 144217, 145731, 146974, 148263, 149933]
54467A49933K045K343K746L096K864J975J025M22j05q91j767k399k652k361j368
54452A54906j62J86p54k110k759k582k154j669r09k9L64n1q60j321j006q4Q26
54435A39832J170R34N39L32L40M73O85Q34P19L19j78n68o46j92O78J313J085J45
54417A47814p67j144r27k09P65J354J048J80l80k21L54R07J129P80R2r4N94J126
54399A52401K66j440k066q62Q22J493J238R95J105J310J431J380R70K86k22l38
54383A58769l93o42q83q93o87j81P89J881K383K197K042K332K569K264J791J767
54367A75105K046J952J253M35P5J78J87k44n80J6J292J826R53j12o4M04l04k031
54349A82387l060k728k087j855j527r37q92j481j514m58M38K6j027j491j360j249
$$ y = [149933, 151978, 154321, 157067, 160163, 163027, 165002, 166027, 166449, 166344, 165453, 163686, 161287, 158635, 156274, 154906, 154744, 154930, 154176, 152066, 149307, 146725, 144571, 142902, 141993, 141964, 142328, 142277, 141417, 140096, 139090, 139006, 139832, 141002, 141936, 142475, 142807, 143147, 143620, 144305, 145139, 145858, 146177, 145999, 145431, 144785, 144593, 145271, 146584, 147669, 147814, 147047, 145903, 144976, 144767, 145532, 146886, 147934, 148114, 147734, 147513, 147867, 148774, 149903, 150683, 150775, 150681, 151275, 152401, 152667, 151227, 149161, 148299, 149121, 150614, 151852, 152847, 153952, 155262, 156693, 158073, 159043, 159329, 159107, 158769, 158376, 157734, 156851, 155958, 155271, 155090, 155879, 157760, 160143, 162340, 164382, 166714, 169283, 171547, 173338, 175105, 177151, 179103, 180356, 180791, 180866, 181044, 181231, 180987, 180407, 180423, 181715, 183541, 184494, 184382, 184318, 184722, 184418, 182387, 179327, 176599, 174512, 172657, 171130, 170193, 169301, 167820, 166306, 165848, 166286, 166312, 165285, 163794, 162434, 161185]
54333A61185j052m10K32K09k69n52n63n95n95m16k75l22k89q3j02m29m56R0N91
54314A55899N19J73j47p46j648k052j505p21m34k49M15J158J321J085R36P30K60
54297A54994J5L78P83N89J37M3J51J12K81R46J453J130M51J63P1l32p20o52o03
54278A59390j005j038J90J846K320J556Q57P22N05M8Q3P90J417J482J259R24L72
54261A71718o2J71P77Q44K67r8J69M66K30l03o33m97J54J006J245L41j056j765
54243A72974j561j201j173j304j496j799j815j068j8L09j47m04j2K64k37r77r15
54226A59420J88J542K026J114n07j394q98qK7n28m47M55J045N89l96j193j671
54209A59364j761j136J29J266J659J416R22L86j9k02l99q38j168r35m66m88q49
$$ y = [161185, 160133, 159723, 159955, 160164, 159895, 159343, 158780, 158185, 157590, 157174, 156899, 156577, 156288, 156205, 156103, 155674, 155218, 155308, 155899, 156418, 156591, 156444, 155698, 154050, 151998, 150493, 149772, 149338, 149089, 149504, 150662, 151983, 153068, 154004, 154734, 154994, 155009, 155387, 156170, 156759, 156896, 156939, 157090, 157202, 157483, 158429, 159882, 161012, 161463, 161626, 161697, 161365, 160645, 159993, 159390, 158385, 157347, 157537, 159383, 161703, 163259, 164116, 164838, 165343, 165391, 165474, 166264, 167681, 169163, 170422, 171346, 171718, 171656, 171827, 172604, 173448, 173715, 173617, 173786, 174252, 174482, 174179, 173546, 173049, 173203, 174209, 175454, 175795, 174739, 172974, 171413, 170212, 169039, 167735, 166239, 164440, 162625, 161557, 161539, 161848, 161701, 161297, 161285, 161549, 161312, 160335, 159420, 159608, 161150, 163176, 164290, 163783, 162389, 161491, 161483, 161510, 160982, 160535, 160990, 162035, 162624, 162228, 161035, 159364, 157603, 156467, 156596, 157862, 159521, 160937, 161859, 162245, 162226, 162024, 161625, 160787, 159619, 158684, 158218, 157730, 156881]
54192A56881n93N70J805K386K448K260J720J000Q62J675K730L047K456J530R23
54177A81700J000J638K109J602J31j474k543l021k985k351j299l90J0l8m75j302
54161A72312k130k349j926j429j140q13m44m91r60j113n26J87L14O0N3L10L68
54144A60283J51P6L56P02P76O39O59J011J396J284O34Q1J74O08O99L79J74K19
54126A70301P1m01n82P1J214J951J761Q48j18n14k61J29J68m9j57j64l34o18o88
54107A72628n22l09L5O46J079O50l92q84k03Q91J253O43k66p92p15k30K77M90
54089A74279M00J82q8l36k76L15J105J491J378J198J213J290J435J946K782L352
54073A91666L237K774K620K903L140K903K332J912J764J347J69j316k055j782
$$ y = [156881, 156288, 156858, 158663, 161049, 163497, 165757, 167477, 168477, 169339, 171014, 173744, 176791, 179247, 180777, 181700, 182700, 184338, 186447, 188049, 188180, 186706, 184163, 181142, 178157, 175806, 174507, 174117, 174127, 174089, 173614, 172312, 170182, 167833, 165907, 164478, 163338, 162525, 162081, 161590, 160630, 159517, 158991, 159178, 159492, 159552, 159605, 159915, 160283, 160434, 160510, 160866, 161568, 162344, 162983, 163642, 164653, 166049, 167333, 167967, 168048, 168222, 168830, 169529, 169908, 170082, 170301, 170372, 169971, 169389, 169460, 170674, 172625, 174386, 175234, 175116, 174602, 174341, 174470, 174638, 174589, 174432, 174268, 173934, 173316, 172628, 172106, 171797, 171832, 172478, 173557, 174207, 173815, 172931, 172728, 173619, 174872, 175515, 175249, 174457, 173742, 173512, 173789, 174279, 174679, 174861, 174773, 174437, 174161, 174476, 175581, 177072, 178450, 179648, 180861, 182151, 183586, 185532, 188314, 191666, 194903, 197677, 200297, 203200, 206340, 209243, 211575, 213487, 215251, 216598, 216767, 215451, 213396, 211614]
54059B11614j351j430j610j321r17r48j024m07O85J412J692K183K992L492L460
54044B18522L420L748M275M804N290N467N168M881N164N672N719N610O263P567
54030B91570Q300P772O394M645K775J579J938L193L511K343J079O75K67r71k172
54015C32898k233j758j987k806l260l347l853m754n252n247n500o267o799o381
54001B73454n135l659k500j969k022k242k281k143j806j009J75J001R62O21R39
53986B52386J993L016L366K914J659k21k104l348l957m378m731m744m327l679
53972B33845k862j876j079r78j499j942j780j145m09K77R67J609K011K011J656
53957B28806J282J278J697K159K281K122K025K189K502K750K856K963L271L813
$$ y = [211614, 210263, 208833, 207223, 205902, 204985, 204037, 203013, 202606, 203291, 204703, 206395, 208578, 211570, 215062, 218522, 221942, 225690, 229965, 234769, 240059, 245526, 250694, 255575, 260739, 266411, 272130, 277740, 284003, 291570, 299870, 307642, 314036, 318681, 321456, 323035, 324973, 328166, 331677, 334020, 335099, 335774, 336041, 335070, 332898, 330665, 328907, 326920, 324114, 320854, 317507, 313654, 308900, 303648, 298401, 292901, 286634, 279835, 273454, 268319, 264660, 262160, 260191, 258169, 255927, 253646, 251503, 249697, 248688, 248863, 249864, 250826, 251447, 252386, 254379, 257395, 260761, 263675, 265334, 265113, 263009, 259661, 255704, 251326, 246595, 241851, 237524, 233845, 230983, 229107, 228028, 227050, 225551, 223609, 221829, 220684, 220275, 220552, 221519, 223128, 225139, 227150, 228806, 230088, 231366, 233063, 235222, 237503, 239625, 241650, 243839, 246341, 249091, 251947, 254910, 258181, 261994]
53943B61994M368M740M940N020M882M525M275M356M419L987L249K856K947K951
53929C19509K533K127K344L270M549N727O348O118N270M529M584N612P223Q594
53915C88337R019Q684Q608R286R832R189P709O521N672M203K022K92l93q69j921
53900D66191l127l782l981m110m167m230m744n704o457o864p689r175j0293j0272
53886C81596r851r943j0016r069p476o500o378o233n633m948m313l444k583k499
53872B92710l313m150m242l760l361l380l648l763l428k789k348k369k583k685
53858B46891k724k737k506k039j835k147k478k314j807j269n59L58Q79N42j25
53843B26130l67k85l69m21J0N54M19l12p92o67l08P8N85R29O38m4l23k9K18J11
$$ y = [261994, 266362, 271102, 276042, 281062, 285944, 290469, 294744, 299100, 303519, 307506, 310755, 313611, 316558, 319509, 322042, 324169, 326513, 329783, 334332, 340059, 346407, 352525, 357795, 362324, 366908, 372520, 379743, 388337, 397356, 406040, 414648, 423934, 433766, 442955, 450664, 457185, 462857, 467060, 469082, 469374, 468981, 468112, 466191, 463064, 459282, 455301, 451191, 447024, 442794, 438050, 432346, 425889, 419025, 411336, 402161, 391868, 381596, 371745, 361802, 351786, 342717, 335241, 328741, 322363, 316130, 310497, 305549, 301236, 297792, 295209, 292710, 289397, 285247, 281005, 277245, 273884, 270504, 266856, 263093, 259665, 256876, 254528, 252159, 249576, 246891, 244167, 241430, 238924, 236885, 235050, 232903, 230425, 228111, 226304, 225035, 224476, 224834, 225713, 226255, 226130, 225763, 225478, 225109, 224688, 224698, 225252, 225671, 225359, 224567, 223900, 223592, 223670, 224255, 225184, 225822, 225778, 225455, 225426, 225644, 225755]
53823B25755O1L78P98J068J358J792K214K490K567K239J455Q42J139K105K749
53808B49010K787L054M122N386N929N747N586N928O594P122P208O870O375N913
53794C27631N428M861M406M156L814L170K639K684K870K247O84r66k119l109m312
53779C54084n335n608n305n135n491o109o433o094n207m330l995m175m377m265
53765B82225l919l557l285l204l335l456l267k767k289k078k110k296k532k627
53751B41503k433k058j668j237p66o06j034j635j608p10N10J409J773J679J288
53736B34407Q83N77P8r00j932k149j288J0J054J758K250K362J893J058L33j4k9
53719B40351J20K99M92P82J114J142O35K8J25J090K096K282J801J573K099K888
$$ y = [225755, 225816, 226194, 226992, 228060, 229418, 231210, 233424, 235914, 238481, 240720, 242175, 243017, 244156, 246261, 249010, 251797, 254851, 258973, 264359, 270288, 276035, 281621, 287549, 294143, 301265, 308473, 315343, 321718, 327631, 333059, 337920, 342326, 346482, 350296, 353466, 356105, 358789, 361659, 363906, 364590, 363624, 361505, 358396, 354084, 348749, 343141, 337836, 332701, 327210, 321101, 314668, 308574, 303367, 299037, 295042, 290867, 286490, 282225, 278306, 274749, 271464, 268260, 264925, 261469, 258202, 255435, 253146, 251068, 248958, 246662, 244130, 241503, 239070, 237012, 235344, 234107, 233341, 232735, 231701, 230066, 228458, 227748, 228258, 229667, 231440, 233119, 234407, 235290, 235867, 235945, 235045, 233113, 230964, 229676, 229686, 230740, 232498, 234748, 237110, 239003, 240061, 240394, 240380, 240351, 240471, 240770, 241262, 242044, 243158, 244300, 244935, 244963, 245088, 246178, 248274, 250556, 252357, 253930, 256029, 258917]
53703B58917L176K944K888L394L967L985L714L959M766N223M757L908L342K790
53689C11730J694L93k13j3J59k70r83j456j586j476j120o24l15l82o61q89r37
53672C03051p54l37J19L41L06L23P04J400J937J709O30n45q81m08j27n82j062
53655C05824o90K63Q49Q49P91Q48O78L13L43R81J668J814J399P21Q2j62K12R50
53637C17733J524J792J922J796J090M1o08n79l59k54J67J270K555L183K984K488
53621C36745K166K015J819J525J307J353J620J886K076K362K784L002K739K252
53607C65651K024K144K358K498K470K072J351R18J264J933J997J280M73M7j21
53592C88359r0K84P01M26o25j547j578r59l22J17L66J82m86j058r76n45n64j177
$$ y = [258917, 262093, 265037, 267925, 271319, 275286, 279271, 282985, 286944, 291710, 296933, 301690, 305598, 308940, 311730, 313424, 313817, 313604, 313591, 313750, 313480, 312497, 311041, 309455, 307979, 306859, 306235, 305920, 305538, 304877, 303988, 303051, 302297, 301960, 302079, 302420, 302726, 303049, 303753, 305153, 307090, 308799, 309429, 308884, 308003, 307595, 307468, 306886, 305824, 305134, 305397, 306246, 307095, 307886, 308734, 309412, 309725, 310068, 311049, 312717, 314531, 315930, 316651, 316733, 316571, 316783, 317733, 319257, 321049, 322971, 324767, 325857, 325898, 325290, 324711, 324352, 324098, 324265, 325535, 328090, 331273, 334257, 336745, 338911, 340926, 342745, 344270, 345577, 346930, 348550, 350436, 352512, 354874, 357658, 360660, 363399, 365651, 367675, 369819, 372177, 374675, 377145, 379217, 380568, 381486, 382750, 384683, 386680, 387960, 388433, 388480, 388359, 388269, 388553, 389254, 389680, 389055, 387508, 385930, 384971, 384649, 384766, 385132, 385314, 384828, 383770, 382794, 382249, 381685, 380508]
53574C80508j660j410o66j19m0n4L18J007J452J211M93j02k16l1M3k09n80n86
53556C79359J3P62Q41J07n36j71R72J830J824J343R48O78K81j99l64P8R14J590
53538C90270J867K190L063M137M538M163L966M592N496N947O215O971Q082Q882
53524D60379R282R673J0029J0002R719R685R966J0257J0637J1512J2949J4697
53512E88787J6651J8561J9674J9573J9143J9713K1325K2796K3342K3161K2543
53501H15269K1536K0459J9679J8835J7327J5583J4753J5066J5607J5821J6081
53490A006016J6571J6824J6734J6810J7145J7205J6936J6919J7120J6726J5707
53479A190713J5265J6019J7006J7119J6488J5636J4435J2717J0999R643Q106N893
$$ y = [380508, 378848, 377438, 376772, 376653, 376613, 376559, 376877, 377884, 379336, 380547, 381040, 380938, 380722, 380691, 380734, 380525, 379945, 379359, 379372, 380134, 380975, 381082, 380546, 380375, 381347, 383177, 385001, 386344, 387292, 387970, 388251, 388052, 387688, 387766, 388680, 390270, 392137, 394327, 397390, 401527, 406065, 410228, 414194, 418786, 424282, 430229, 436444, 443415, 451497, 460379, 469661, 479334, 489363, 499365, 509084, 518769, 528735, 538992, 549629, 561141, 574090, 588787, 605438, 623999, 643673, 663246, 682389, 702102, 723427, 746223, 769565, 792726, 815269, 836805, 857264, 876943, 895778, 913105, 928688, 943441, 958507, 974114, 989935, 1006016, 1022587, 1039411, 1056145, 1072955, 1090100, 1107305, 1124241, 1141160, 1158280, 1175006, 1190713, 1205978, 1221997, 1239003, 1256122, 1272610, 1288246, 1302681, 1315398, 1326397, 1336040, 1344146, 1350039]
53467A350039L462J377o23k952n260p006q198q886q698p750p215p990r497j0643
53453A270160j1295j1908j2369j2376j2431j3293j4727j5752j5955j5751j5538
53442A118765j5285j4774j3690j1801r488p646o528n296l281j091K71O93O23J56
53428A031628o34j055n03O41J685K668L869M891N372O096Q090J0884J2888J3455
53414A099975J3492J4078J5415J7163J8835J9838J9934J9731K0126K1286K2825
53403A302698K4562K6419K7943K8856K9828L1673L4043L5969L7478L9431M1867
53392A660767M3698M4380M4691M5491M6622M7463M7810M7744M7199M6082M4452
53381B166399M2483M0492L8890L7631L5951L3268L0099K7343K4871K1797J7932
$$ y = [1350039, 1353501, 1354878, 1354255, 1351303, 1346043, 1339037, 1330839, 1321953, 1313255, 1305505, 1298290, 1290300, 1280803, 1270160, 1258865, 1246957, 1234588, 1222212, 1209781, 1196488, 1181761, 1166009, 1150054, 1134303, 1118765, 1103480, 1088706, 1075016, 1063215, 1053727, 1046081, 1039553, 1034257, 1030976, 1029885, 1030156, 1030849, 1031472, 1031628, 1030994, 1029939, 1029436, 1030077, 1031762, 1034430, 1038299, 1043190, 1048562, 1054658, 1062748, 1073632, 1086520, 1099975, 1113467, 1127545, 1142960, 1160123, 1178958, 1198796, 1218730, 1238461, 1258587, 1279873, 1302698, 1327260, 1353679, 1381622, 1410478, 1440306, 1471979, 1506022, 1541991, 1579469, 1618900, 1660767, 1704465, 1748845, 1793536, 1839027, 1885649, 1933112, 1980922, 2028666, 2075865, 2121947, 2166399, 2208882, 2249374, 2288264, 2325895, 2361846, 2395114, 2425213, 2452556, 2477427, 2499224, 2517156]
53370B517156J3968J0182O069J422l263p834j2896j8697k4379k8842l1837l3774
53358B387275l5085l6071l6898l7330l6955l5923l4975l4519l4196l3471l2136
53347A999716l0194k7929k6315k6439k8160k9989l0738l0676l0634l0673l0240
53336A677729k9044k7182k4768k2094j9803j8325j7235j5793j3906j2199j1263
53325A466117j1262j2198j3982j6190j8121j9283j9798k0196k0788k1239k0768
53314A272292j9009j6580j4594j3560j2976j2039j0501q717p093n754m656l788
53302A143025l200k747j953l82J861M174O212Q205J0324J2183J3377J4185J5208
53289A220472J6519J7735J8698J9490J9878J9491J8559J7797J7374J6650J5174
$$ y = [2517156, 2531124, 2541306, 2547375, 2548797, 2545534, 2537700, 2524804, 2506107, 2481728, 2452886, 2421049, 2387275, 2352190, 2316119, 2279221, 2241891, 2204936, 2169013, 2134038, 2099519, 2065323, 2031852, 1999716, 1969522, 1941593, 1915278, 1888839, 1860679, 1830690, 1799952, 1769276, 1738642, 1707969, 1677729, 1648685, 1621503, 1596735, 1574641, 1554838, 1536513, 1519278, 1503485, 1489579, 1477380, 1466117, 1454855, 1442657, 1428675, 1412485, 1394364, 1375081, 1355283, 1335087, 1314299, 1293060, 1272292, 1253283, 1236703, 1222109, 1208549, 1195573, 1183534, 1173033, 1164316, 1157223, 1151469, 1146813, 1143025, 1139825, 1137078, 1135125, 1134743, 1136604, 1140778, 1146990, 1155195, 1165519, 1177702, 1191079, 1205264, 1220472, 1236991, 1254726, 1273424, 1292914, 1312792, 1332283, 1350842, 1368639, 1386013, 1402663, 1417837]
53278A417837J3335J1637R916P716N130K769R69o09k604n262q132j0430j1856
53265A430416j2921j4323j6107j7713j8728j9239j9531j9803k0193k0678k0920
53254A230260k0613j9951j9468j9371j9391j9240j8799j7978j6824j5853j5734
53243A027038j6480j7431j8109j8606j9027j8999j8179j6856j5697j5075j4828
53232H37751j4493j3576j1835r600p679o768o912p613q326q757q856q732q694
53219G15910r270j0880j3312j5630j6979j7431j7638j7750j7273j6122j5019j4427
53207E34179j3831j2696j1521j1044j0960j0339r146q315q358q855r329r793j0214
53194C99778j0302j0082r961r967r529q363p024o263o207o384o202n284l783k443
$$ y = [1417837, 1431172, 1442809, 1452725, 1460441, 1465571, 1468340, 1469309, 1468700, 1466096, 1460834, 1452702, 1442272, 1430416, 1417495, 1403172, 1387065, 1369352, 1350624, 1331385, 1311854, 1292051, 1271858, 1251180, 1230260, 1209647, 1189696, 1170228, 1150857, 1131466, 1112226, 1093427, 1075449, 1058625, 1042772, 1027038, 1010558, 993127, 975018, 956412, 937385, 918386, 900207, 883351, 867654, 852579, 837751, 823258, 809682, 797847, 788247, 780568, 773800, 766888, 759275, 750949, 742192, 733336, 724604, 715910, 706640, 695760, 682448, 666818, 649839, 632408, 614770, 597020, 579747, 563625, 548606, 534179, 520348, 507652, 496131, 485087, 474127, 463788, 454642, 446327, 437969, 429114, 419785, 409992, 399778, 389476, 379394, 369433, 359466, 349937, 341574, 334550, 328287, 322080, 315696, 309494, 304210, 300427, 297984]
53180B97984j942k114k239k116k212k717l110k899k238j556j076r37j255j813
53166B69760k057j747j271j112j272j314q39J06Q71O53n28j576j569r55p49r01
53150B55500n18M09P53J0q49q71m22l40n78n04J7O10J073J373J350J015Q62J325
53132B60215K066K362J974J298Q37Q90J498K388L116L516L765L845L418K476J694
53117B95358J695K333L014L383L319K641J343n9r33j201j356j903k947m147m945
53102B95595n050m744m475m200l547k647k159k272k328j812j130r48j225j415
53088B57643j299j082r40q72q09n98j48K79K07l61q17p49m83n48r87j481j754
53071B45201j612j021l49j07k16r2L56N57L37K98O71P20n2r50j143r40r96j034
$$ y = [297984, 296042, 293928, 291689, 289573, 287361, 284644, 281534, 278635, 276397, 274841, 273765, 272828, 271573, 269760, 267703, 265956, 264685, 263573, 262301, 260987, 260148, 260254, 261125, 261778, 261250, 259674, 258105, 257150, 256401, 255500, 254982, 255391, 256144, 256154, 255305, 254434, 254012, 253672, 253094, 252590, 252607, 253217, 254290, 255663, 257013, 258028, 258890, 260215, 262281, 264643, 266617, 267915, 268752, 269642, 271140, 273528, 276644, 280160, 283925, 287770, 291188, 293664, 295358, 297053, 299386, 302400, 305783, 309102, 311743, 313086, 313027, 312094, 310893, 309537, 307634, 304687, 300540, 295595, 290545, 285801, 281326, 277126, 273579, 270932, 268773, 266501, 264173, 262361, 261231, 260283, 259058, 257643, 256344, 255262, 254322, 253450, 252641, 252043, 251895, 252174, 252381, 252020, 251203, 250454, 249971, 249423, 248436, 246955, 245201, 243589, 242568, 242219, 242112, 241896, 241804, 242160, 242717, 243054, 243352, 244023, 244743, 244691, 243741, 242598, 241658, 240662, 239628]
53053B39628m28M60P23M46M98J004J222R37P44Q36O38k4m97m66n30j085j471r67
53035B41668M6O77P67Q53J181J443J330Q37O7p75j295j198o72j88O2K78O19R64
53017B46664J130J123J074J088J195J329J316J026O26M62O71J010J185J204J158
53002B62261Q54Q2p48p86J93J238J212J08j011j232n49N02J443K054K326K438
52986B70385K505K389J972J511J332J258Q14q8j055j815k340k425j764n54N32
52971B72657J164J575J849J721J227R48J150J353J144Q28P75P22L05j80j66L39
52955B87411P80O84p8j327k436k630j884j128j081j359j247q63p77q99n85K53
52939B72834R62J069P56L98J65R4J28N3j42p4M45Q30L31q23j587j392o83j05K32
$$ y = [239628, 239200, 239660, 240383, 240829, 241327, 242331, 243553, 244490, 245234, 246070, 246708, 246684, 246187, 245721, 245191, 244106, 242635, 241668, 241714, 242391, 243158, 244011, 245192, 246635, 247965, 248802, 248869, 248094, 246799, 245601, 244929, 244741, 244803, 245081, 245700, 246664, 247794, 248917, 249991, 251079, 252274, 253603, 254919, 255945, 256571, 257033, 257704, 258714, 259899, 261103, 262261, 263115, 263197, 262449, 261663, 261856, 263094, 264306, 264414, 263403, 262171, 261622, 262124, 263567, 265621, 267947, 270385, 272890, 275279, 277251, 278762, 280094, 281352, 282166, 282078, 281023, 279208, 276868, 274443, 272679, 272125, 272657, 273821, 275396, 277245, 278966, 280193, 281141, 282291, 283644, 284788, 285616, 286391, 287113, 287418, 287238, 287072, 287411, 288191, 288875, 288797, 287470, 285034, 282404, 280520, 279392, 278311, 276952, 275705, 274842, 274065, 273166, 272581, 272834, 273796, 274865, 275621, 276019, 276184, 276278, 276406, 276459, 276317, 276243, 276688, 277518, 277849, 277026, 275439, 274047, 273364, 273259, 273491]
52920B73491M48M75K28n9p3K15N83Q40R34Q48N69J16m06q14r78r00o46k36J62
52901B74797J51m54j148j227o88j53J96P97J681K024J330K91j40MP2k1J35N11
52883B78158N62Q9m73o33k20O99J805K630L003L291L778M093L729K834K004J467
52867C06816J027M90k24j163j997k031j120k19k89j090j728k020k387k782k725
52852B88558k323k190k386k423k315k642l379l685l103k198j620j313r87o43l59
52837B56992j19j12o09j330j626j411j195j061n02N01J117R56P69J202J563P84
52821B55919r11k178k205j416n84O5O74J239J496J262P57N14P83J086P03l78j342
52804B55484j573j350j304j622k030k287k268j867j174o14n58q68j110j065q35
$$ y = [273491, 273939, 274414, 274642, 274583, 274510, 274725, 275308, 276148, 277082, 277930, 278499, 278615, 278209, 277395, 276417, 275517, 274871, 274635, 274797, 274948, 274494, 273346, 272119, 271431, 271278, 271474, 272271, 273952, 275976, 277306, 277597, 277457, 277461, 277533, 277512, 277647, 278158, 278720, 278809, 278336, 277703, 277483, 278182, 279987, 282617, 285620, 288911, 292689, 296782, 300511, 303345, 305349, 306816, 307843, 308333, 308109, 306946, 304949, 302918, 301798, 301579, 301290, 300200, 298472, 296452, 294065, 291283, 288558, 286235, 284045, 281659, 279236, 276921, 274279, 270900, 267215, 264112, 261914, 260294, 258981, 257994, 257351, 256992, 256873, 256761, 256152, 254822, 253196, 251785, 250590, 249529, 249027, 249528, 250645, 251601, 252370, 253572, 255135, 255919, 255008, 252830, 250625, 249209, 248625, 248690, 249364, 250603, 252099, 253361, 254118, 254632, 255415, 256501, 257204, 256826, 255484, 253911, 252561, 251257, 249635, 247605, 245318, 243050, 241183, 240009, 239395, 238837, 237969, 236859, 235794, 234959]
52789B34959n35j99P3J36pj56n6L56Q77J140R10K79m57j025j281j206r46p08m84
52770B31670q3M38O59L81O1K52Q36J227J200J019R06Q60R44J229J460J248O50
52753B44957J62Q9L10N75O74M71J94M78J532K485K286J181M63P33J293J408J238
52736B60529J258J454J538J370Q36Om62J41J315J577M35p84q56l84o49j473j575
52719B64276o80J09R0j39J10N48O31N55Q43J362J445Q16j13q23j118r62k93P59
52701B67416J652J747Q83m08j345j527j190q40p37o77l83J3M7l78o52j77P03J017
52683B65164M60k22l74l26o78j205j192n38J63N12N76L93o5m49k06O06J295J446
52665B65360J320J177Q34K09k24L6Q60J663K090K269K545L101L672L625K582R75
$$ y = [234959, 234424, 234225, 234298, 234434, 234427, 234271, 234215, 234571, 235448, 236588, 237498, 237777, 237320, 236295, 235014, 233808, 232862, 232154, 231670, 231587, 232025, 232684, 233065, 233126, 233378, 234214, 235441, 236641, 237660, 238566, 239426, 240370, 241599, 243059, 244307, 244957, 245119, 245208, 245518, 246093, 246767, 247238, 247432, 247910, 249442, 251927, 254213, 255394, 255857, 256590, 257883, 259291, 260529, 261787, 263241, 264779, 266149, 266985, 266991, 266529, 266670, 267985, 269562, 269997, 269213, 268357, 267973, 267324, 265851, 264276, 263596, 263705, 263795, 263656, 263766, 264314, 264945, 265500, 266343, 267705, 269150, 269966, 269853, 269030, 267912, 266950, 266657, 267416, 269068, 270815, 271698, 271290, 269945, 268418, 267228, 266388, 265651, 264974, 264591, 264604, 264651, 264273, 263621, 263444, 264147, 265164, 265624, 265402, 265028, 264702, 264024, 262819, 261627, 261089, 261252, 261764, 262340, 262733, 262668, 262219, 262013, 262619, 263914, 265360, 266680, 267857, 268691, 268900, 268676, 268712, 269572, 271235, 273325, 275594, 278139, 281240, 284912, 288537, 291119, 292094]
52649B92094l04q12q35r07j312k037k721k739j734k03R34J240R22K71m68p59j03
52632B80527J201K232K604K832L408M076M252L649K337O98n89j097j266j752k224
52617C00888j696k51O58J46q72j105o63m96p63q70p21p80r50m43R66K336K629
52600B98013J951J297J237J256N36q40j779j446k62O70Q75P27N58L16R2K30O71
52583C04102R01P79P77J108J338J208J131J375J381N41p59j521j285m40K83L58
52567C11277k15q22q66o25r00j660j860j032j60k75r86j260r88q31r43q90n13
52550B96451m2M89J066J129J40j409k321k104j340o19N8P34J097R84P61Q40J157
52533B97071J374J404J479J732J900J570Q37M66J000J862J886Q36k83o00k79K47
$$ y = [292094, 291790, 290978, 290143, 289236, 287924, 285887, 283166, 280427, 278693, 278490, 279424, 280664, 281586, 281857, 281389, 280630, 280527, 281728, 283960, 286564, 289396, 292804, 296880, 301132, 304781, 307118, 307816, 307227, 306130, 304864, 303112, 300888, 299192, 298941, 299599, 299745, 298873, 297768, 297105, 296609, 295846, 294976, 294255, 293475, 292525, 292082, 293048, 295384, 298013, 299964, 301261, 302498, 303754, 304290, 303450, 301671, 300225, 299963, 300633, 301508, 302235, 302793, 303109, 303201, 303431, 304102, 305003, 305782, 306559, 307667, 309005, 310213, 311344, 312719, 314100, 314641, 313882, 312361, 311076, 310636, 310919, 311277, 311062, 310240, 309374, 308749, 307849, 306189, 304329, 303297, 303137, 302862, 301876, 300616, 299628, 298797, 297854, 296964, 296451, 296409, 296898, 297964, 299093, 299233, 297824, 295503, 293399, 292059, 291440, 291498, 292232, 293329, 294313, 295074, 295914, 297071, 298445, 299849, 301328, 303060, 304960, 306530, 307367, 307833, 308833, 310695, 312581, 313417, 313134, 312534, 312255, 312502]
52517C12502J031J990K388J867J316J790K989L804L940L921L783K938J416O8p20
52502C45023j583l078m719n554n269m379l623l337l223k727j734p26j03K46L93
52487C05607K5p82j048j22J053R76k41r84m62L50M41K49P06J657K111J676R82
52470C12194P95J234J833K115K101K301L055L934M103L330K234J507J222R78L59
52455C43295q80k628m261n013m753m117l746l589l196k418j572j013p52n19k02
52440C04636q3m54j062j234o77J28N77N81L26j32o06o00N1O93O59K85L91R70J274
52421C05723J135J277K053K710K386J297M36M10R72J533J813K037K672L900N331
52406C35685O335O626O451O232O139N922N015L028K74k356m161n081n311m958
$$ y = [312502, 313533, 315523, 317911, 319778, 321094, 322884, 325873, 329677, 333617, 337538, 341321, 344259, 345675, 345743, 345023, 343440, 340362, 335643, 330089, 324820, 320441, 316818, 313481, 310258, 307531, 305797, 305071, 304968, 305214, 305607, 305632, 304850, 303802, 303680, 304733, 305709, 305468, 304484, 304022, 304372, 304813, 305062, 305768, 307425, 309536, 311212, 312194, 312989, 314223, 316056, 318171, 320272, 322573, 325628, 329562, 333665, 336995, 339229, 340736, 341958, 342936, 343295, 342415, 339787, 335526, 330513, 325760, 321643, 317897, 314308, 311112, 308694, 307122, 306109, 305357, 304838, 304636, 304553, 304099, 303037, 301803, 301126, 301254, 301831, 302412, 302738, 302606, 302000, 301400, 301451, 302144, 302803, 303088, 303479, 304449, 305723, 306858, 308135, 310188, 312898, 315284, 316581, 317017, 317427, 318399, 319932, 321745, 323782, 326454, 330354, 335685, 342020, 348646, 355097, 361329, 367468, 373390, 378405, 381433, 381707, 379351, 375190, 370109, 364798, 359840]
52392C59840m283l757l528l225k672k273k253k068j177P8R98J480J752J655J055
52377C41622N55Q99J932L027M196N762P226P589O842N963N351M293K324P2j516
52362C96137k094j759q01J41L88ll39l35l49n16l93K53J038J607K114K719L273
52345D01081L683M093M447M442M055L681L658M103N120O553P696P988P904Q372
52331D76876R511J0784J2151J3947J5722J6610J6968J8197K0530K2455K2826K2279
52319F78856K1802K1302K0513K0195K1233K3221K4945K5795K5939K5764K5831
52308I35396K6720K8171K9017K8612K7679K7067K6477K5269K3719K2455K1211
52297A221793J9200J6344J3199R993O570L060j93l133n740p685q812r656j0754
$$ y = [359840, 355557, 351800, 348272, 345047, 342375, 340102, 337849, 335781, 334604, 334682, 335680, 337160, 338912, 340567, 341622, 342177, 343076, 345008, 348035, 352231, 357993, 365219, 372808, 379650, 385613, 390964, 395257, 397581, 397653, 396137, 394043, 392284, 391483, 391624, 392012, 392009, 391670, 391335, 390986, 390470, 390077, 390330, 391368, 392975, 395089, 397808, 401081, 404764, 408857, 413304, 417746, 421801, 425482, 429140, 433243, 438363, 444916, 452612, 460600, 468504, 476876, 486387, 497171, 509322, 523269, 538991, 555601, 572569, 590766, 611296, 633751, 656577, 678856, 700658, 721960, 742473, 762668, 783901, 807122, 832067, 857862, 883801, 909565, 935396, 962116, 990287, 1019304, 1047916, 1075595, 1102662, 1129139, 1154408, 1178127, 1200582, 1221793, 1240993, 1257337, 1270536, 1280529, 1287099, 1290159, 1289966, 1286833, 1281093, 1273408, 1264596, 1254940, 1244186]
52284A244186j1794j2146j1815j1195j0246q683o715m913l546k473j397J82K608
52271A162053N263O845P146P682R698J2400J4233J5132J6145J7476J8432J9027
52259A311532J9988K1225K1762K1426K1243K1768K2243K1832K0578J8662J5705
52248A537964J1555P005L007k84l218n830p860r323j0596j2124j4154j6520j8589
52235A461033j9713j9907j9774j9695j9480j8871j8058j7491j7348j7235j6461
52224A257000j4671j2398j0680r942r638r169q627q152p187n209k807j156n14
52211A156850p0Q22K073L393M624N428N470N026M752M780M652M247M050M423N281
52196A215801O546Q227R863J0586J0038Q680P080N391L642J928J99j643l425m984
$$ y = [1244186, 1232392, 1220246, 1208431, 1197236, 1186990, 1178307, 1171592, 1166679, 1163133, 1160660, 1159263, 1159445, 1162053, 1167316, 1174161, 1181307, 1188989, 1198687, 1211087, 1225320, 1240452, 1256597, 1274073, 1292505, 1311532, 1331520, 1352745, 1374507, 1395933, 1417176, 1438944, 1461187, 1483019, 1503597, 1522259, 1537964, 1549519, 1556524, 1559531, 1559247, 1556029, 1550199, 1542339, 1533016, 1522420, 1510296, 1496142, 1479622, 1461033, 1441320, 1421413, 1401639, 1381944, 1362464, 1343593, 1325535, 1308044, 1290696, 1273461, 1257000, 1242329, 1229931, 1219251, 1209309, 1199671, 1190502, 1181875, 1173723, 1166536, 1161327, 1158520, 1157364, 1156850, 1156780, 1157602, 1159675, 1163068, 1167692, 1173120, 1178590, 1183616, 1188368, 1193148, 1197800, 1202047, 1206097, 1210520, 1215801, 1222347, 1230574, 1240437, 1251023, 1261061, 1269741, 1276821, 1282212, 1285854, 1287782, 1287981, 1286338, 1282913, 1277929]
52182A277929o650q679j0371j0700r832r004q706q144o909n921n970o333n794
52169A174916m356k958k005j105k5J013J850K486K767K565K185K080K195K065
52155A183673J442M54o77j644j995j593r57o78n61J21J526K960L725L764L387
52140A192947K751J919J135P36Q60J390K205L396N196P626J0233J2404J4074J5869
52126A272741J8339K1166K3480K4941K6180K8035L0538L2791L3852L3574L2566
52115A578203L1443L0353K9222K8199K7430K6573K5026K2831K0933K0166K0158
52104A860537J9712J8158J5926J3666J1302Q347M830J339j923n450r545j3573
$$ y = [1277929, 1271279, 1262600, 1252229, 1241529, 1231697, 1222693, 1213987, 1205843, 1198934, 1193013, 1187043, 1180710, 1174916, 1170560, 1167602, 1165597, 1164492, 1164467, 1165480, 1167330, 1169816, 1172583, 1175148, 1177333, 1179413, 1181608, 1183673, 1185115, 1185569, 1184892, 1183248, 1181253, 1179660, 1178703, 1178025, 1177464, 1177585, 1179111, 1182071, 1185796, 1189560, 1192947, 1195698, 1197617, 1198752, 1199488, 1200348, 1201738, 1203943, 1207339, 1212535, 1220161, 1230394, 1242798, 1256872, 1272741, 1291080, 1312246, 1335726, 1360667, 1386847, 1414882, 1445420, 1478211, 1512063, 1545637, 1578203, 1609646, 1639999, 1669221, 1697420, 1724850, 1751423, 1776449, 1799280, 1820213, 1840379, 1860537, 1880249, 1898407, 1914333, 1927999, 1939301, 1947648, 1952478, 1953817, 1951894, 1946444, 1936899, 1923326]
$$ [...]
##END NTUPLES=NMR SPECTRUM
##END=
