##TITLE=AC1624_HONAH13355_8326384_r6l0tTHAce
##JCAMPDX= 6.0         $$ Bruker NMR JCAMP-DX V2.0
##DATA TYPE= NMR SPECTRUM
##DATA CLASS= NTUPLES
##ORIGIN= BRUKER
##OWNER= Administrator
$$ 1.72 TOPSPIN		Version 2.1
$$ 2013-11-13 16:14:42.016 -0800  Administrator@X
$$ Compression mode = diff/dup
##.OBSERVE FREQUENCY= 400.02188249412
##.OBSERVE NUCLEUS= ^1H
##.ACQUISITION MODE= SIMULTANEOUS (DQD)
##.ACQUISITION SCHEME= undefined
##.AVERAGES= 8
##.DIGITISER RES= 22
##SPECTROMETER/DATA SYSTEM= spect
##.PULSE SEQUENCE= zg30
##.SOLVENT NAME= COFFEE_meoh
##.SHIFT REFERENCE= INTERNAL, COFFEE_meoh, 1, 14.98509
##AUDIT TRAIL= $$ (NUMBER, WHEN, WHO, WHERE, PROCESS, VERSION, WHAT)
$$ ##TITLE= Audit trail, TOPSPIN		Version 2.1
$$ ##JCAMPDX= 5.01
$$ ##ORIGIN= Bruker BioSpin GmbH
$$ ##OWNER= Administrator
$$ $$ E:\/data/COFFEE/nmr/AC1624_HONAH13355_8326384_r6l0tTHAce/20/pdata/1/auditp.txt
$$ ##AUDIT TRAIL=  $$ (NUMBER, WHEN, WHO, WHERE, PROCESS, VERSION, WHAT)
(   1,<2013-11-13 16:14:34.735 -0800>,<Administrator>,<X>,<go>,<TOPSPIN 2.1>,
      <created by zg
	started at 2013-11-13 16:13:29.016 -0800,
	POWCHK enabled, PULCHK disabled,
       configuration hash MD5:
       C8 4E 4E 5D D3 5C D8 9E 9F 52 82 E0 59 8A DE 15
       data hash MD5: 64K
       D7 BC C3 08 0E D5 A8 AF 3B B1 14 60 54 5E 15 DF>)
(   2,<2013-11-13 16:14:37.813 -0800>,<Administrator>,<X>,<proc1d>,<TOPSPIN 2.1>,
      <Start of raw data processing
       efp LB = 0 FT_mod = 6 PKNL = 1 PHC0 = 0 PHC1 = 0 SI = 32K 
       data hash MD5: 32K
       4A BA AD 71 FF 4E AA 71 9F 2D E1 8F D6 2F CF 23>)
(   3,<2013-11-13 16:14:38.126 -0800>,<Administrator>,<X>,<proc1d>,<TOPSPIN 2.1>,
      <pk PHC0 = 94.92737 PHC1 = 0 
       data hash MD5: 32K
       66 F2 AF 6A 43 3F D4 51 D8 13 05 4C 4B D4 AD 3E>)
(   4,<2013-11-13 16:14:38.235 -0800>,<Administrator>,<X>,<proc1d>,<TOPSPIN 2.1>,
      <abs ABSG = 1 
       data hash MD5: 32K
       41 4B 8B 59 B3 B8 DD 12 C3 59 85 4C 56 BB B3 B6>)
(   5,<2013-11-13 16:14:38.360 -0800>,<Administrator>,<X>,<proc1d>,<TOPSPIN 2.1>,
      <abs ABSG = 2 
       data hash MD5: 32K
       6F 79 D3 C8 BD CE 07 BB C8 58 24 BC A3 4B 76 C5>)
(   6,<2013-11-13 16:14:38.438 -0800>,<Administrator>,<X>,<proc1d>,<TOPSPIN 2.1>,
      <abs ABSG = 3 
       data hash MD5: 32K
       AB 81 27 DC DF 69 23 65 20 53 DF 61 FF 5B 2F A5>)
(   7,<2013-11-13 16:14:38.516 -0800>,<Administrator>,<X>,<proc1d>,<TOPSPIN 2.1>,
      <abs ABSG = 4 
       data hash MD5: 32K
       BF 31 AA 71 62 7C D6 FD 69 45 9B F3 FB 0C E0 65>)
(   8,<2013-11-13 16:14:38.595 -0800>,<Administrator>,<X>,<proc1d>,<TOPSPIN 2.1>,
      <abs ABSG = 5 
       data hash MD5: 32K
       00 92 9F A7 AB E6 6A A6 DA 72 AC 71 AC B5 F5 F5>)
$$ ##END=
$$ 
$$ $$ hash MD5
$$ $$ 6A A9 B2 42 35 E5 EE 7B 55 C2 68 5D 52 3B 86 8C
##$RELAX= 
##$RELAX= 
##$RELAX= 
##$RELAX= 
##$RELAX= 
##$RELAX= 
##$RELAX= 
$$ Bruker specific parameters
$$ --------------------------
##$DU= <E:\>
##$EXPNO= 20
##$NAME= <AC1624_HONAH13355_8326384_r6l0tTHAce>
$$ [...]
150 150 150 150 150 150 150 150
##$TP07= 0
##$TPNAME0= <>
##$TPNAME1= <>
##$TPNAME2= <>
##$TPNAME3= <>
##$TPNAME4= <>
##$TPNAME5= <>
##$TPNAME6= <>
##$TPNAME7= <>
##$TPOAL= (0..7)
0.5 0.5 0.5 0.5 0.5 0.5 0.5 0.5
##$TPOFFS= (0..7)
0 0 0 0 0 0 0 0
##$TUNHIN= 0
##$TUNHOUT= 0
##$TUNXOUT= 0
##$USERA1= <user>
##$USERA2= <user>
##$USERA3= <user>
##$USERA4= <user>
##$USERA5= <user>
##$V9= 5
##$VALIST= <valist>
##$VCLIST= <CCCCCCCCCCCCCCC>
##$VD= 0
##$VDLIST= <DDDDDDDDDDDDDDD>
##$VPLIST= <PPPPPPPPPPPPPPP>
##$VTLIST= <TTTTTTTTTTTTTTT>
##$WBST= 1024
##$WBSW= 4
##$XGAIN= (0..3)
0 0 0 0
##$XL= 0
##$YL= 0
##$YMAX_a= 648328
##$YMIN_a= -550453
##$ZGOPTNS= <>
##$ZL1= 120
##$ZL2= 120
##$ZL3= 120
##$ZL4= 120
##$ABSF1= 14.98509
##$ABSF2= -5.573092
##$ABSG= 5
##$ABSL= 3
##$ALPHA= 0
##$AQORDER= 0
##$ASSFAC= 0
##$ASSFACI= 0
##$ASSFACX= 0
##$ASSWID= 0
##$AUNMP= <proc_prof1d_extract_pilot.lims>
##$AXLEFT= 0
##$AXNAME= <>
##$AXNUC= <1H>
##$AXRIGHT= 0
##$AXTYPE= 0
##$AXUNIT= <>
##$AZFE= 0.1
##$AZFW= 0.1
##$BCFW= 0
##$BC_mod= 0
##$BYTORDP= 0
##$COROFFS= 0
##$CY= 15
##$DATMOD= 1
##$DC= 0
##$DFILT= <>
##$DTYPP= 0
##$F1P= 0
##$F2P= 0
##$FCOR= 0.5
##$FTSIZE= 32768
##$FT_mod= 6
##$GAMMA= 0
##$GB= 0
##$INTBC= 1
##$INTSCL= 1
##$ISEN= 128
##$LB= 0
##$LEV0= 0
##$LPBIN= 0
##$MAXI= 10000
##$MC2= 0
##$MEAN= 0
##$ME_mod= 0
##$MI= 0
##$NCOEF= 0
##$NC_proc= -8
##$NLEV= 6
##$NOISF1= 0
##$NOISF2= 0
##$NSP= 0
##$NTH_PI= 0
##$NZP= 0
##$OFFSET= 14.98509
##$PC= 1
##$PHC0= 94.92737
##$PHC1= 0
##$PH_mod= 1
##$PKNL= yes
##$PPARMOD= 0
##$PPDIAG= 0
##$PPIPTYP= 0
##$PPMPNUM= 2147483647
##$PPRESOL= 1
##$PSCAL= 4
##$PSIGN= 0
##$PYNMP= <proc.py>
##$REVERSE= no
##$SF= 400.02
##$SI= 32768
##$SIGF1= 0
##$SIGF2= 0
##$SINO= 400
##$SIOLD= 32768
##$SPECTYP= <>
##$SREGLST= <1H.CDCl3>
##$SSB= 0
##$STSI= 32768
##$STSR= 0
##$SW_p= 8223.68421052631
##$SYMM= 0
##$S_DEV= 0
##$TDeff= 65536
##$TDoff= 0
##$TI= <>
##$TILT= no
##$TM1= 0
##$TM2= 0
##$TOPLEV= 0
##$USERP1= <user>
##$USERP2= <user>
##$USERP3= <user>
##$USERP4= <user>
##$USERP5= <user>
##$WDW= 1
##$XDIM= 32768
##$YMAX_p= 463194135
##$YMIN_p= -767951
##$CURPLOT= <Network HP LaserJet P1505>
##$CURPRIN= <$Network HP LaserJet P1505>
##$DFORMAT= <normdp>
##$LAYOUT= <+/1D_H.xwp>
##$LFORMAT= <normlp>
##$PFORMAT= <normpl>
##$SURQMSG= 1
$$ End of Bruker specific parameters
$$ ---------------------------------
##NTUPLES= NMR SPECTRUM
##VAR_NAME=  FREQUENCY,     SPECTRUM/REAL,   SPECTRUM/IMAG
##SYMBOL=    X,             R,               I
##VAR_TYPE=  INDEPENDENT,   DEPENDENT,       DEPENDENT
##VAR_FORM=  AFFN,          ASDF,            ASDF
##VAR_DIM=   32768,         32768,           32768
##UNITS=     HZ,            ARBITRARY UNITS, ARBITRARY UNITS
##FACTOR=    0.250966925370066, 1,           1
##FIRST=     8223.43324360094, 12282,        -236464
##LAST=      0,             -237929,         -194279
##MIN=       0,             -767951,         0
##MAX=       8223.43324360094, 463194135,    0
$$ Real data points
##PAGE= N=1
##DATA TABLE= (X++(R..R)), XYDATA
$$ [...]
19543a97007A3857a27122D3732e145A47851R3309a20997a1877k1451A7665a18804
19531c4533j26100J6243j33526a9477l239A6722a45159o5143I5974a83441M8786
19520a34655A00733k9105P6742b45363l110q0953A13989b64189A02895c5925B3373
19508h8809B01655L6003E1673b77379j07343J68356c7554A09650B7158J25617
19498A52775b41322a4248j20703R041L013N5852A23218d07892i3394b3231j02664
19487a25895D33K54633a04704o2287h0718B6295P848c96307J50853K676a13724
19475f5414j01891j03560g1714p4310g0011K5788p9314A7842K83289j30476c2669
19463b14395D5653N9196i33A08688d5940a2973j83133M156K2138b6448I320c85605
$$ y = [-197007, 13857, -127122, 43732, -5145, 147851, 241160, -120997, -11877, -33328, 17665, -118804, -34533, -160633, -144390, -277916, -19477, -22716, 16722, -145159, -210302, 95974, -183441, -134655, 100733, 71628, 148370, -245363, -248473, -329426, 113989, -264189, 102895, -35925, 23373, -88809, 201655, 237658, 51673, -277379, -384722, -216366, -37554, 109650, 27158, 152775, -241322, -14248, -134951, -125910, -122897, -67045, 123218, -407892, -93394, -23231, -125895, 433, 255066, -104704, -166991, -80718, 26295, 34143, -396307, -245454, -242778, -113724, -65414, -167305, -270865, -71714, -146024, -70011, -44223, -123537, 17842, 301131, 170655, -32669, -214395, 45653, 104849, -933, 108688, -45940, -12973, -196106, -191950, -169812, -26448, 9320, -385605]
19450B13139E0233b44779c2643J3906r5537A69709D8804b33459M5173n8034B29672
19438a5371l25012A74603h3421H7051l3633B3392b313D7197J31454i5253j83330
19427b78583J32640a2159C510M7565f1749B02289a48129A36874d13388K05270
19417b08118A08299a85823F8611d9741l11091n0665a37421c2965m6983b1039C8091
19405C0936J62707b6339B3423K45032d1517H3611h1814I7305a61415I9220a19815
19393B97956f8312m9458d3902D6267J31891e0728n32129e3613L773E2058j7703
19382C4355b48187J14294d9016j67906R1718m1624k3812A48116b48119d5514B14824
19370g2419j90183A33920O1853a7323j93961I9097b33987p4752a09015D0440a85798
$$ y = [213139, 50233, -244779, -32643, -18737, -114274, 169709, 48804, -233459, -188286, -246320, 229672, -15371, -340383, 174603, -83421, 87051, 53418, 23392, -2313, 47197, 178651, -95253, -278583, -145943, -12159, 3510, 51075, -61749, 202289, -148129, 136874, -413388, -208118, 108299, -185823, 68611, -49741, -360832, -411497, -137421, -32965, -79948, -21039, 38091, 30936, 193643, -26339, 23423, 268455, -41517, 83611, -81814, 97305, -161415, 99220, -119815, 297956, -68312, -117770, -43902, 46267, 178158, -50728, -582857, -53613, -49840, 52058, 34355, -248187, -133893, -49016, -216922, -125204, -166828, -190640, 148116, -248119, -45514, 214824, -72419, -262602, 133920, 195773, -17323, -211284, 99097, -233987, -308739, -109015, 40440, -185798]
19358a18695A28587g0977o2791H1870J64995b2289k16059K7463A11728b896j77731
19347a80627E4920a12568A08392e6270a8409j69063N1438f1013n5019j17408R6399
19336a37041q4954P0126b364k91939a5421j62166G4863J10943E8784K5769b79268
19324F1041c05874B3604i9802k10290a877A35364L9714b85816E3494k814a31536
19312a87878O2958A81028a20147J0092B28808B2007K7592i4091A8295g5054l53464
19301d28518f9139q2186L5139K7733k2655J2690j23990a9838j09996k7688D314
19289a20396B15170E5225J50460d4294j58464A10843d2945E9284B3155J17878
19279A41033g3560k45857a1817l36721g3357L0731C73054b7682l4636k54109a4171
$$ y = [-118695, 128587, -70977, -133768, 81870, 246865, -22289, -238348, -210885, 111728, -2896, -180627, 54920, -112568, 108392, -56270, -18409, -187472, -136034, -61013, -116032, -233440, -137041, -221995, -151869, -2364, -294303, -15421, -177587, 74863, 185806, 58784, 84553, -279268, 61041, -305874, 23604, -99802, -310092, -1877, 135364, 175078, -285816, 53494, 50680, -131536, -187878, -124920, 181028, -120147, -110055, 228808, 22007, 49599, -94091, 18295, -75054, -428518, -69139, -151325, -116186, -88453, -111108, -98418, -222408, -19838, -129834, -157522, 4314, -120396, 215170, 55225, 205685, -44294, -202758, 110843, -42945, 59284, 23155, 141033, -73560, -319417, -11817, -348538, -73357, -42626, 373054, -27682, -62318, -316427, -14171]
19267D2088a52110a8354C5810O7371a01720B67830h6487j32209J1896j2620B41516
19255a02732A03921a22788C469a13993k27999O6969A04272g1664i877k72520R8923
19244a83474P4512l4468j34928J23099p4738A79675c95623B3536a42985A33848
19233B00731d05843f6401B78614F1891m631a56107M4654A78539f3045A60398k2213
19222A38185k326h9294A56722d33116f9995K0060B30244A08242J28235A0302h2862
19210b08716o6442g8936C4984K32276c65847G0372c01676d4792j74787m8768F4662
19198g4824N069A08068c8878J1098D68227C0713h5930E6829e4714o5845l11185
19187d31744J39990Q1645C0029i9777C07853a77740j39176b8836H0874a04132
$$ y = [42088, -152110, -18354, 35810, 103181, -101720, 267830, -86487, -218696, -206800, -219420, 241516, -102732, 103921, -122788, 3469, -113993, -341992, -275023, 104272, -71664, -9877, -282397, -183474, -108962, -143430, -278358, -155259, -229997, 179675, -395623, 23536, -142985, 133848, 200731, -405843, -66401, 278614, 61891, 57260, -156107, -111453, 178539, -63045, 160398, 138185, 135859, -89294, 156722, -433116, -69995, -49935, 230244, 108242, 236477, 10302, -82862, -208716, -275158, -78936, 34984, 267260, -365847, 70372, -301676, -44792, -219579, -268347, 64662, -74824, -69755, 108068, -38878, -27780, 468227, 30713, -85930, 56829, -54714, -120559, -431744, -291754, -210109, 30029, -99777, 307853, -177740, -316916, -28836, 80874, -104132]
19176b03323g4671j473C1496J0586A4073a95058O0602K3406l7677B20516p0669
19165A49847i3481l0339j61666d0451j24174A6451c0668j45344B59314A19899
19154a96464B17883d81220D2566f7762r1654a73j34492d9134B3877b1459A71692
19142b35022e2889A06570R6098f2226C3788J85975f908B2569b5547J2106l74258
19131c87699a37560A50691a89249E5871b42871I399a35755D371a93687k14085
19121d07772a28436B43801D0413a60270C4652c45102e6249A55510a38823A32504
19110F0040f6852B21908b51762a10893M2591j85687c8669B37049A5709e1205A67545
19098I5585J448c6945j49194B83704b44984C6004J18862d6636B10834G3283M7948
$$ y = [-203323, -74671, -76144, 31496, 42082, 14073, -195058, -134456, -111050, -148727, 220516, 149847, -93481, -123820, -285486, -40451, -164625, 16451, -30668, -176012, 259314, 119899, -196464, 217883, -481220, 42566, -67762, -159416, -173, -134665, -49134, 23877, -21459, 171692, -235022, -52889, 106570, 202668, -62226, 33788, 219763, -6908, 22569, -25547, -13441, -387699, -137560, 150691, -189249, 55871, -242871, 9399, -135755, 4371, -193687, -407772, -128436, 243801, 40413, -160270, 34652, -345102, -56249, 155510, -138823, 132504, 60040, -66852, 221908, -251762, -110893, -68302, -253989, -38669, 237049, 15709, -51205, 167545, 95585, 97033, -36945, -186139, 283704, -244984, 36004, 154866, -46636, 210834, 73283, 121231]
19087A21231a59414H9185C7526O4975e40962a2679j85154j38459J58966G7213
19076b20842E8403J55286b98543J14897C3449F86K33398j14433H246a67328l2028
19065a99356j52137C03638a08742k96H8297N5094a9834j91231A08160b24803A20040
19053b65633D9805c08868a33356j08037d1672C3285f2482F9335k7831d2371J124
19042d1247B79085c47709i570L194C18345b01968C39560o5603b03341A63841d0924
19030a93083B35981b47268Q7851B2422a59974B01016O9198a7213j9446B38264
19019C26495A28670B6255N2475k8864P2593a0426j91264o862j6089j6933H6569
19007c47463B2928a83747A1635d4181A54824f8981r7102L1773j26369A23479a49821
$$ y = [121231, -159414, 89185, 37526, 102501, -540962, -12679, -197833, -336292, -177326, 77213, -220842, 58403, 213689, -298543, -183646, 33449, 686, 234084, 119651, 8246, -167328, -199356, -351493, 303638, -108742, -109038, 88297, 143391, -19834, -211065, 108160, -224803, 120040, -265633, 49805, -308868, -133356, -241393, -41672, 33285, -62482, 69335, 41504, -42371, -41247, 279085, -347709, -9570, -6376, 318345, -201968, 339560, 273957, -203341, 163841, -40924, -193083, 235981, -247268, -159417, 22422, -159974, 201016, 270214, -17213, -36659, 238264, 326495, 128670, 26255, 78730, 49866, 122459, -10426, -201690, -208552, -224641, -241574, 86569, -347463, 22928, -183747, 11635, -44181, 154824, -68981, -166083, -134310, -260679, 123479, -149821]
18995C45557a46951l7169A8434a01175J9429d0821j57159B93960b55233a08586
18984a24347c3926C7645a95273f9275j32610O3351A03562C368d79010f8942l4197
18973a03139B5055a97611l3202C7083J72654I4948N5120f0055A35107c02648A07605
18961i9530d7831B1893a40173B53170d37899f8956l1330m6254f9890I8189b22209
18949b44413A87248M2471A04435h1662b4924B47120h6650j47524A31896a65200
18938b23869m2118J0447r5055D0430J43709K5770d9193l076l5718A7167N9220
18927G6387b08501d9129H0280O3989a766n3204b2660G6938e2771A54520b6151
18915b8113F1641r72b52411g1257j24188b0231A91705H3632a66185p3547i4493
$$ y = [345557, -146951, -184120, 18434, -101175, -81746, -40821, -197980, 293960, -255233, -108586, -124347, -33926, 37645, -195273, -69275, -201885, -138534, 103562, 3368, -479010, -68942, -103139, 25055, -197611, -230813, 37083, 209737, 94948, 150068, -60055, 135107, -302648, 107605, -99530, -47831, 21893, -140173, 253170, -437899, -68956, -100286, -146540, -69890, 98189, -222209, -244413, 187248, 229719, 104435, -81662, -24924, 247120, -86650, -234174, 131896, -165200, -223869, -265987, -255540, -350595, 40430, 184139, 209909, -49193, -52269, -87987, 17167, 76387, -208501, -49129, 80280, 144269, -1766, -54970, -22660, 76938, -52771, 154520, -26151, -28113, 61641, 60669, -252411, -71257, -195445, -20231, 191705, 83632, -166185, -239732, -94493]
18903C18176H5338b16238A5895a35118k52010a91799B96132a96983P3614E070
18892B03039D4892c2925j71338A67045c04405A94257c04557H2875f7153K4833
18882d2320l11398a43416c5007k73683e2718A10858b00729a4792n5287D8589B372
18870F383b10993C56793e4675b1124j49831P8563B91269a7592A59508h6253q9093
18859a75346c7505q8704F3692J73130c1062B44831N9905l6900F0996j4383a34964
18847d9057j62768f2125j34478q4337O9912j43596R7971D7439b84011B2496b91348
18835d6133g959k87475a20331D080P6716f3503a6653B35661b0157k41464C5324
18823a33114B77108f8996a3032j7109n15419B69150G4738J34285B7022K62050
$$ y = [318176, 85338, -216238, 15895, -135118, -387128, -191799, 296132, -196983, -123369, 5070, 203039, 44892, -32925, -204263, 167045, -304405, 194257, -304557, 82875, -67153, -42320, -353718, -143416, -35007, -308690, -52718, 110858, -200729, -14792, -70079, 48589, 2372, 6383, -210993, 356793, -54675, -21124, -170955, -92392, 291269, -17592, 159508, -86253, -175346, -37505, -126209, 63692, 236822, -31062, 244831, 304736, 267836, 60996, 46613, -134964, -49057, -211825, -62125, -196603, -280940, -211028, -354624, -256653, 47439, -284011, 22496, -291348, -46133, -7959, -295434, -120331, 4080, 80796, -63503, -16653, 235661, -20157, -261621, 35324, -133114, 277108, -68996, -13032, -30141, -545560, 269150, 74738, 209023, 27022, 289072]
18813B89072O2840b92231a7002p62H8063g9156B69710g2805F2141L986M1892a81237
18800A77214a42503K7577o0616K1907A21228a43930B01887D0271J5277c44482
18789c15410A69378q0306m1299b13280e9083B1898a73472j47477H5485b56474
18778D30756a06749c9407F1101b39555F8946J44401F352O8769J61766i1058j70301
18767b61359j4329R9943A74191O7939H0037B4764a38630b2245G8843i5733a4852
18755b29270A56936f7840A60573J34456E1906a65819l651B9150d0629l2267j7040
18744h9936j51514B10082a61906j3366H1903i7007c1129p0225I4591c6997j53555
18733a90552B35210j04885b80127b3829A96818c10947a3432H2159b23608P1966
$$ y = [289072, 351912, -292231, -17002, -17764, 88063, -79156, 269710, -72805, 62141, 66127, 108019, -181237, 177214, -142503, -114926, -175542, -153635, 121228, -143930, 201887, 40271, 55548, -344482, -315410, 169378, 89072, 47773, -213280, -59083, 21898, -173472, -320949, 85485, -256474, 430756, -106749, -39407, 61101, -239555, 68946, 213347, 6352, 75121, 236887, -91058, -261359, -275688, -175745, 174191, 242130, 80037, 24764, -138630, -22245, 78843, -95733, -14852, -229270, 156936, -67840, 160573, 295029, 51906, -165819, -169470, 29150, -40629, -72896, -89936, -241450, 210082, -161906, -175272, 81903, -97007, -31129, -101354, 94591, -36997, -190552, 235210, 130325, -280127, -23829, 196818, -310947, -13432, 82159, -223608, -151642]
18723a51642p9675B11493a25106k50364i4835l7245l6498a4148D7356l874a48903
18711b28839Q5090A26163E8372h6010c2899A9286q27R1968C6686K57013j09435
18700A84264b84789p204H7318K4288B9313d5281C2001d6662j45536i575j60309
18689a69884C74545b2336A188Q6707a21670j62092A49465f927j38753L6000C63566
18677a96300N3421C3495J338c79591a63839k8073A12457c44534B3375b27614o657
18666b34271O0585N1786I7505h1536k06400g6362B4425c46376a37035D29696f5595
18654A10901b77322Q9157k13870G4077e7935H0373L5117b7331n281j3862j19703
18643a66177A49638a58693A554b24888b9052F4257b18510A86886H7225f1580A77113
$$ y = [-151642, -231317, 211493, -125106, -375470, -94835, -132080, -168578, -14148, 47356, 43482, -148903, -228839, -143749, 126163, 58372, -86010, -32899, 19286, 18459, 110427, 36686, 293699, 184264, -284789, -291993, 87318, 111606, 29313, -45281, 32001, -46662, -192198, -9575, -169884, 374545, -22336, 1188, 87895, -121670, -283762, 149465, -6927, -145680, -109680, 363566, -196300, -142879, 33495, 34833, -379591, -163839, -191912, 112457, -344534, 23375, -227614, -234271, -173686, -121900, 97505, -81536, -287936, -76362, 24425, -346376, -137035, 429696, -65595, 110901, -277322, -188165, -402035, 74077, -57935, 80373, 115490, -27331, -32612, -46474, -166177, 149638, -158693, 1554, -224888, -29052, 64257, -218510, 186886, 87225, -61580, 177113]
18631H0927l3286i5895B08406c20294A1247a22031d6648A36727c15561h8031o8322
18620a56353j00139A15834c98502c3133k5685k70552f186A4742J39504b39564
18609B6439Q5981a88136D504M483a96017A86160M2835m1451b07213B27020b39581
18597B26118b78314P9505O8268o8430b1421m891p1160l21756A25959A062R6241
18586I7303b12751Q8517a4794l2034D6562Q3464a37225E0151f9283C0978Q9792
18575A20770a20008e6151k8786A2815h4334k9686q340J856j48189f7424j38344
18564b05768b1951j00460G1784c2116j40876g476A54679c04021a0791j71741P7681
18553a04851D27690F1170a27903B12537K7273a0776n2389A4334K11475J7885a21622
$$ y = [80927, 47641, -95895, 208406, -320294, 11247, -122031, -46648, 136727, -315561, -88031, -156353, -256492, 115834, -398502, -33133, -58818, -329370, -6186, 14742, 154246, -239564, 26439, 112420, -188136, 4504, 8987, -196017, 186160, 228995, 187544, -207213, 227020, -239581, 226118, -278314, -198809, -130541, -198971, -21421, -26312, -97472, -419228, 125959, 1062, 97303, -212751, -124234, -14794, -46828, 46562, 130026, -137225, 50151, -69283, 30978, 120770, -120008, -56151, -84937, 12815, -84334, -114020, -122360, -120504, -268693, -67424, -205768, -21951, -122411, 71784, -32116, -172992, -7476, 154679, -304021, -10791, -182532, -104851, 427690, 61170, -127903, 212537, 239810, -10776, -63165, 14334, 225809, 243694, -121622]
18541A0939i0350j5613J3254B64728j14416a7005o5415A83741q2062a40712j05942
18530b46654B2523a00596M0066k05128A60373b33082J01470f1657A06617B0202
18519B13016A5286b10341g2018b0848q0561A96828K4429B8697E838J11849i5598
18507f5749n5146J816A52450a55602D4588A2001k609a33870K8419j91559k2999
18496c20009G7305M9057a88845k15427a21724L0354p1014d7904b3026k9922p9424
18485a32372H019d2025B0681J80481b54762h7228n6222j23839A68887k6856D6934
18473A35466h9589j14297e076q0146B23710a25056o0417J8747K2610B2574b07438
18461i0493k8722K3770M6057j42310F3086b55323A27571m4913J1941k5598M7559
$$ y = [10939, -90350, -105963, -92709, 264728, 150312, -17005, -82420, 183741, 101679, -140712, -246654, 22523, -100596, -60530, -265658, 160373, -233082, -131612, -61657, 106617, 20202, 213016, 15286, -210341, -72018, -20848, -101409, 196828, 221257, 28697, 5838, 117687, -95598, -65749, -120895, -119079, 152450, -155602, 44588, 12001, 9392, -133870, -105451, -297010, -320009, 77305, 126362, -188845, -404272, -121724, -91370, -162384, -47904, -23026, -52948, -132372, 8019, -42025, 20681, 201162, -254762, -87228, -143450, -267289, 168887, 142031, 46934, 135466, -89589, -203886, -5076, -85222, 223710, -125056, -185473, -166726, -144116, 22574, -207438, -90493, -119215, -95445, -49388, -191698, 63086, -255323, 127571, 82658, 94599, 69001, 116560]
18450A16560g770k4275j81054h0033k37226Q6400j5504J06542n8076k01947b1645
18438D1819f4801l92699E7042d13562a34714H7647j4213i0195B87336B0731r047
18427A1684J64203G0394C267K0657d2735I7601j7020b76011j5868J33419C3094
18415A77687b67544J03381A1272M02831a05599o2525A46054p0701b6659A0003
18404I0494J14321r3009D7444J10507J89314b06855h8292q2367o319m9424A3459
18392A25461b63834Q5437r5641H9195j3207c40032H136L29834A17515d05864J49007
18381b56857Q4840K6209C4839a61888A20012l6046R8570a97141A91154n3689a37638
18369a56389A48356o4508c11105D32314G9317J93825b59715N2940d4257E9256
$$ y = [116560, -7770, -32045, -213099, -80033, -317259, -230859, -246363, -139821, -197897, -399844, -21645, 41819, -64801, -457500, 57042, -413562, -134714, 87647, 73434, -90195, 287336, 20731, 11684, 175887, 70394, 3267, 23924, -42735, 97601, 80581, -276011, -291879, -158460, 33094, 177687, -267544, -164163, 11272, 414103, -105599, -168124, 146054, 75353, -26659, 10003, 90494, 204815, 111806, 47444, 157951, 347265, -206855, -88292, -170659, -176978, -226402, 13459, 125461, -263834, -178397, -274038, 89195, 75988, -340032, 8136, 337970, 117515, -405864, -256857, -172017, -145808, 34839, -161888, 120012, 83966, 182536, -197141, 191154, 137465, -137638, -156389, 148356, 83848, -311105, 432314, 79317, 273142, -259715, -206775, -44257, 59256]
18358C86501F4665e5024m046A24798c80205H4100J10315i1250j46950j7345g6829
18346d39319c1668j7965o2962L7206o0467H8766b67158G9060J03481b11895j08228
18335c20123J34052D8407a13434A30258L1513F0818c38255f3465B66719A2381
18324c0438A42529G866a6553B71962g6134D2038f7887L907l61920E2654h1876
18312f6922H4390l6135J56435a27816N4200F2478A0504c4987j51771l0862A06456
18300H2348L1294B3111J24680b2620E3327a65567c8647I2241k6729a31582C479
18288b14959D3334b69110A14272c31239N6406q05g7909B20659a01244d2965k62153
18277c05118e2870B70738A3499b87344D00278c00679f7887j37382B99340A34559
$$ y = [386501, 64665, -55024, -59070, 124798, -380205, 84100, 194415, -91250, -238200, -255545, -76829, -439319, -31668, -49633, -112595, -75389, -135856, 88766, -267158, 79060, 182541, -211895, -320123, -186071, 48407, -113434, 130258, 161771, 60818, -338255, -63465, 266719, 12381, -30438, 142529, 7866, -16553, 271962, -76134, 42038, -67887, -63980, -425900, 52654, -81876, -66922, 84390, 48255, 204690, -127816, -73616, 62478, 10504, -34987, -186758, -217620, 106456, 82348, 113642, 23111, 147791, -22620, 53327, -165567, -38647, 92241, 65512, -131582, 3479, -214959, 43334, -269110, 114272, -331239, -274833, -275638, -77909, 220659, -101244, -42965, -305118, -52870, 270738, 13499, -287344, 400278, -300679, -67887, -205269, 299340, 134559]
18266b0734o4587j18383b9868l1824A50172a84239O4992A4568c61415J45896c6525
18254h7671B97095a4843A3134a43215f3829B97583E0888j5783e8727j20641B6061
18242a11347k24144f0790q0751A40416b12144f9436F4508b21803J3872A1090a95758
18230B37616D2208J3523d36710B8266e3076k51414J27072F0393J77079H5068g0233
18218A95076l6123g1311A60622B7423c2230A86072a47088C0341a87609A11997
18207a44844c6973q9681j21608A84115C5963K0285O5481e8777j40727O945B15454
18195a44005j81252j4004c9860A15511c63073A92641F9473h5099j20934A24046
18184a88550O7670o17149A797f6576o75915a78077j42061a11476j04687h1915
$$ y = [-20734, -85321, -203704, -29868, -61692, 150172, -184239, -119247, 14568, -361415, -215519, -36525, -87671, 297095, -14843, 13134, -143215, -63829, 297583, 50888, 35105, -58727, -179368, 26061, -111347, -335491, -60790, -141541, 140416, -212144, -69436, 64508, -221803, -207931, 11090, -195758, 237616, 42208, 55731, -436710, 28266, -53076, -304490, -177418, 60393, 237472, 85068, -70233, 195076, 158953, -71311, 160622, 27423, -32230, 186072, -147088, 30341, -187609, 111997, -144844, -36973, -126654, -248262, 184115, 35963, 56248, 121729, -58777, -199504, -192559, 215454, -144005, -325257, -339261, -39860, 115511, -363073, 192641, 69473, -85099, -206033, 124046, -188550, -120880, -738029, 1797, -66576, -742491, -178077, -320138, -111476, -216163, -81915]
18173B0186J40714h8553C56610a89220m0794b4760j05073m72413a00649L5570
18163f5079r0925F8166a22131C0722a07037q4947A47673a51948I826O477J57235
18152A73538b01367L7490F822c33304A29842e6178k95577B20727d47111a4412
18141c9206C4844b01492F4868c13192f700k3947B66173e94452F006a64875G4849
18129B22520g1679A16720a29652j6352q9710l6271Q1615j81488I5476c7421j84214
18118b21635k87862B23733q6071b0083A000a68749A0f4854a7365k11478A40098
18106A2222J39016N5895b09422A25304g2128j17540B28420e0313j38491B37579
18095A19679k3806A2556b3660r4404L4476C34387g266A09167C3138M449h3961
$$ y = [20186, 160900, -88553, 356610, -189220, -230014, -24760, -129833, -602246, -100649, -65079, -156004, 68166, -122131, 30722, -107037, -191984, 147673, -151948, 9826, 16303, 173538, -201367, -163877, 6822, -333304, 129842, -56178, -351755, 220727, -447111, -14412, -39206, 34844, -201492, 64868, -313192, -6700, -30647, 266173, -594452, 6006, -164875, 74849, 222520, -71679, 116720, -129652, -146004, -235714, -271985, -190370, -371858, 95476, -37421, -221635, -509497, 223733, 137662, -20083, 1000, -168749, 10, -64854, -17365, -228843, 140098, 12222, 151238, 207133, -209422, 125304, -72128, -189668, 228420, -50313, -188804, 237579, 119679, 95873, 12556, -23660, -118064, -83588, 334387, -7266, 109167, 33138, 37587, -83961]
18083a98140Q6460A91994o9996a85811A10305D7202a53319A31560a02654a381
18072c2793D1672J47392b2659A23310g9681A93266P1339q8319a19272d993B14577
18060A15324e6714l49466h5096o6615k16132i3827l65193b15953E8636d6433C6308
18048b63655g8499A17124k9563K67636A14053l8381C4656b11727A7395J80354
18038A97749B9082J86079K1253C7962c4567j70842d6924B0877M1338f3180C7589
18026b18767c4476j73626l1508R7389B635a31440A36905n5203a95265e9659b8356
18014b05987B49907g4784o0986D0678f090j51232C8267a86112K3237m2051j18536
18003c23462i5850j14429a04003H9768b04836B02346p9504e972A04673b7529D5417
$$ y = [-198140, -111680, 191994, 121998, -185811, 110305, 47202, -153319, 131560, -102654, -1381, -32793, 41672, 189064, -22659, 123310, -79681, 193266, 264605, 176286, -119272, -4993, 214577, 115324, -56714, -406180, -85096, -151711, -367843, -93827, -459020, -215953, 58636, -46433, 36308, -263655, -78499, 117124, 87561, 355197, 114053, 75672, 34656, -211727, 17395, 197749, 29082, 215161, 236414, 37962, -34567, -205409, -46924, 20877, 62215, -63180, 37589, -218767, -34476, -208102, -239610, -142221, 2635, -131440, 136905, 81702, -195265, -59659, -28356, -205987, 249907, -74784, -135770, 40678, -6090, -157322, 38267, -186112, -162875, -204926, -323462, -95850, -210279, -104003, 89768, -204836, 202346, 122842, -5972, 104673, -27529, 45417]
17991B34530j04935d6473q264g504j93782Q7530j66512B37557D6774b3773B78563
17979a05518A23709C1136b68844B49092a01126B58169C734f5694C23035c07822
17968d6289A91437j5302a19815k51280B7045N3698b07259j55269C5546L4552N5410
17957A25508b36612A1885R1588c7520p0858A64503h760k46392c4923o7444B16560
17945b64658H8298f0746p2713H6723a40237j7952C2050f437C20323b7630k61210
17934b88840g7293m2743G5547j7896J04593d4482C0388O9066J11807I2388N2212
17923A44600b4343k3582a678D7715B3150b63426D0813a89482j614Q7560j91021
17912b94557I2708b01469J8374A85J54348j4769K4218i1259k8840e8932m5971
$$ y = [234530, 129595, -46473, -54737, -7504, -201286, -113756, -280268, 237557, 46774, -23773, 278563, -105518, 123709, 31136, -268844, 249092, -101126, 258169, 3734, -65694, 323035, -307822, -46289, 191437, 176135, -119815, -371095, 27045, 80743, -207259, -362528, 35546, 70098, 125508, -236612, 11885, 103473, -37520, -108378, 164503, -8760, -255152, -34923, -102367, 216560, -264658, 88298, -60746, -133459, 86723, -140237, -158189, 32050, -6437, 320323, -27630, -288840, -77293, -120036, 75547, 57651, 162244, -44482, 30388, 99454, 211261, 92388, 144600, -24343, -47925, -1678, 47715, 23150, -263426, 40813, -189482, -191096, -103536, -294557, 92708, -201469, -183095, 185, 154533, 139764, 163982, -91259, -120099, -58932, -104903]
17901a04903j31653P534d8697j44068A49059D5746d05265B42072b5513r8665e4986
17889b7698A64282a50677p6773J11371A20669l8738J81513G9613e48347a61896
17878a15380b0977p9618D8912a73771E8927P3597a35240N2969j99524B4069Q7143
17867A11212d1128A40849b57261B9593N442E770N6302g1438j16038A7005J88989
17856B05994Q2868a61062D4431c7492j4246a8365G7641J26232f4620e07G9216
17844F1974M0663a13172H1837P3586K5210F523a32414c5369F8371a04663A03908
17832b24938R246h0989m0016L7146C6917i2250j2780l20289F6778K01967b70797
17820a5742j14726A40713N512E9235J87540c7857p7079j7365K1952L5362G9892
$$ y = [-104903, -236556, -229022, -48697, -192765, 149059, 45746, -405265, 242072, -25513, -124178, -54986, -27698, 164282, -150677, -227450, -116079, 120669, 81931, 263444, 79613, -548347, -161896, -115380, -20977, -100595, 48912, -173771, 58927, 132524, -135240, -82271, -281795, 24069, 111212, -41128, 140849, -257261, 29593, 35035, 5770, 62072, -71438, -187476, 17005, 205994, 288862, -161062, 44431, -37492, -51738, -18365, 77641, 203873, -64620, -507, 79216, 61974, 102637, -113172, 81837, 155423, 180633, 6523, -132414, -35369, 68371, -104663, 103908, -224938, -215692, -80989, -121005, -83859, 36917, -92250, -105030, -425319, 66778, 268745, -270797, -15742, -130468, 140713, 146225, 59235, 246775, -37857, -114936, -132301, -110349, -74987, 79892]
17808i8143c899B08002G6890a17939A57669F560M9818L1158K98294A21462b28800
17796i6827F9179J89437b3136B53303p2627b3399k23285R2161D8573K02902N223
17785B56698k2146m4100J79163C0669i1454b9687A71147r175a40650A4996K0782
17774C5778a98380D1101b05842c2932B48037K9308A2661b12861B07241A7387J74950
17763A92337N5496K6902A6130a03129A22712a26529j16312G7992b05301G3987
17752F46i7179g10C93962F779a29537A04345a81515d3658l87729a00511B08711
17740b92208b7463H4790C287b45108D4648Q7296a63659l3899B78923A23549L8586
17729A62135D9670c73349N1429A97198F9549e854G4522a29236m3939D0097M3548
$$ y = [-98143, -3899, 208002, 76890, -117939, 157669, 6560, 56378, 87536, 385830, 121462, -228800, -96827, 69179, 258616, -23136, 253303, 180676, -23399, -246684, -154523, 48573, 251475, 256698, 234552, 190452, 369615, 30669, -91454, -29687, 171147, 161972, -140650, 14996, 35778, -198380, 41101, -205842, -32932, 248037, 277345, 12661, -212861, 207241, 17387, 192337, 247833, 274735, 16130, -103129, 122712, -126529, -242841, 77992, -205301, 73987, 646, -97179, -710, 393962, 6779, -129537, 104345, -181515, -43658, -431387, -100511, 208711, -292208, -27463, 84790, 3287, -245108, 44648, 131944, -163659, -197558, 278923, 123549, 162135, 49670, -373349, -321920, 197198, 69549, -5854, 74522, -129236, -173175, 40097, 83645]
17718H3645d3103j46433A72192e1732b2030B32343j13917L6992K65560n9488a31429
17706a9287k48950G364Q2766e7745F7777g3952A08843i3514A60838p4352l1435
17695E5051K02405a24665b8344G2630i4596H2708K7719g6547B07278c3586A98240
17683a37271B32541a5503p6982J8980j12957B49966p172D9807L03669G841a9732
17671c85913a6962o4928I0642a47397q5826f2062c75I0378J32262a3394p7584
17660i0978B40605k6548a37581p310I9189N4598J4726a25279A60016e1613A18580
17648B5516c8773l08283E046L19046a45882r5183E69056g6896l30880a98428c4047
17636e1491j24078M3774A17329p188J03014F945a48480A82852m4374f2653r9454
$$ y = [83645, -43103, -189536, 172192, -51732, -22030, 232343, 118426, 155418, 420978, 361490, -131429, -19287, -268237, 7364, 90130, -57745, 67777, -73952, 108843, -93514, 160838, 86486, 55051, 257456, -124665, -28344, 72630, -94596, 82708, 110427, -76547, 207278, -33586, 198240, -137271, 232541, -15503, -92485, -73505, -186462, 249966, 242794, 49807, 353476, 7841, -19732, -385913, -16962, -81890, 90642, -147397, -233223, -62062, -375, 90378, 222640, -13394, -90978, 240605, 214057, -137581, -144891, 99189, 153787, 168513, -125279, 160016, -51613, 118580, 25516, -38773, -347056, 5046, 324092, -145882, -241065, 569056, -76896, -407776, -198428, -34047, -51491, -175569, -131795, 117329, 110141, 213155, 6945, -148480, 182852, 138478, -62653, -162107]
17625a62107H7937B5458J1374L7492R860K09238p6822h1159G5860J92292H6331
17613B51526b39995e2562H6770J79075a30557A87341F9153a93407C94333A12777
17602d0658J2034j35972D26708q3404d7074B4848i2963l5080d6400B4329R3268
17591A17597J2249a15790A49004l9692a10774L0278L8632D347K4841J90388E6230
17579C69312a79045H124J78525K33001A45514f4162j93023B68872G4729c3662
17568d25581B22837O3821C3683M02125E4165L7531J015a04393A73234d2787D57372
17556E6029J92760e9676A28694c5254G5758O7625k6681b14484i7189A27007a33514
17544A46496O2450M9099d03218D2091O6511n1120N0365h0545B9097P8416a85249
$$ y = [-162107, 87937, 25458, 36832, 74324, 84184, 293422, 216600, -81159, 75860, 268152, 86331, 251526, -239995, -52562, 86770, 265845, -130557, 187341, 69153, -193407, 394333, 112777, -40658, -28624, -164596, 426708, 343304, -47074, 24848, -92963, -128043, -46400, 24329, 117597, 129846, -115790, 149004, 109312, -110774, -80496, -41864, 4347, 29188, 219576, 56230, 369312, -179045, 8124, 186649, 419650, 145514, -64162, -257185, 268872, 74729, -33662, -425581, 222837, 286658, 33683, 435808, 54165, 91696, 92711, -104393, 173234, -42787, 457372, 56029, 248789, -59676, 128694, -35254, 75758, 143383, 116702, -214484, -97189, 127007, -133514, 146496, 208946, 258045, -403218, 42091, 108602, 57482, 107847, -80545, 29097, 107513, -185249]
17532b9311B9365J59336G7096O4793a84265B891d40097c2751C2788M5004a99479
17520b43211A48255c7146C01408A07091N4418e7657C52249p1808j23581a6390
17509B99737a3243p9143j319g268A40300b00583C04292g4182A33765n5407N9322
17498A37680J96261j53566J74799o6920a01325B64565j21155i3852A66798J35034
17488C01832A08841K8924a09366L4936B07353E5871i386C65270j17875f9036K6828
17477d2208C82874e6100B38728A8869J35908c782B87764j19883K13305g670l5881
17466d3551B90453q2827d1887h893j85794A80309n2786d6516B47539J30821I374
17454B58243a23456D07751a24629A34880K81557I711K67079K38917I1950j1604
$$ y = [-29311, 29365, 188701, 77096, 141889, -184265, 2891, -440097, -32751, 32788, 77792, -199479, -243211, 148255, -37146, 301408, 107091, 161509, -57657, 352249, 280441, 156860, -16390, 299737, -13243, -92386, -93705, -7268, 140300, -200583, 304292, -74182, 133765, 78358, 137680, 333941, 180375, 355174, 288254, -101325, 264565, 143410, -93852, 166798, 301832, 108841, 137765, -109366, -74430, 207353, 55871, -9386, 365270, 247395, -69036, -42208, 382874, -56100, 238728, 18869, 154777, -3782, 287764, 167881, 381186, -7670, -43551, 290453, 207626, -41887, -8893, -194687, 180309, 127523, -46516, 247539, 378360, 9374, 258243, -123456, 407751, -124629, 134880, 416437, 9711, 276790, 515707, 91950, 80346]
17444H0346L29238A69762R782K7603L3580J38624e573D76042C5597J62625C9573
17432E06102A81762c75444A27809n4477K91881k8110M5234q8948l6206a66693
17421B31012k7542o0712L68719B52209L4293d7965C05178m5536G4186k4730M92802
17410E42258A71689K69351j53062C5652j668L7331J11146h7091A72393L233J34901
17399C10527r5754j3186M0592A00856K4749J39025a8827j24706B49390r7000D5343
17387a26138F5995d7119B46368O2437a3081A37590b22170A43968d4976A27230
17376A69495N8667J63802q1999j43772J4961k6110n1764c10472A47064J93152
17366C40216j51649k427J19118a30747E4450a45423e6209A41623A3275P2380d2617
$$ y = [80346, 409584, 169762, 179544, 207147, 240727, 379351, -5573, 476042, 35597, 198222, 39573, 506102, 181762, -375444, 127809, 73332, 365213, 337103, 382337, 293389, 257183, -166693, 231012, 203470, 142758, 511477, 252209, 286502, -47965, 305178, 259642, 74186, 49456, 542258, 171689, 441040, 287978, 35652, 33984, 71315, 182461, -87091, 172393, 175626, 310527, 214773, 201587, 242179, 100856, 125605, 264630, -18827, -143533, 249390, 152390, 45343, -126138, 65995, -47119, 246368, 308805, -13081, 137590, -222170, 143968, -44976, 127230, 169495, 228162, 391964, 309965, 166193, 181154, 155044, 103280, -310472, 147064, 340216, 188567, 186140, 305258, -130747, 54450, -145423, -56209, 141623, 13275, 85655, -42617]
17354b60018A73253q5018K08702h6532n2243A10277K17903j41798R7981A30505
17343C25842A22460Q8322R5905n2263M8718B7780J58126e6403B20110r3066d1192
17331B34214q092e2689B5836J21752i3451C57532J92168A89745q8729M20527h2490
17319A11111M2673a29623C93605A03995L92743D5134K79131A50394J11238n8448
17309B03184L0765j11357a50331A77253K33655C9349J23075C2163J05499J29719
17299B67381b55889C51899A48099J82461j40650i7146a2464C23831A7692d052
17288H6482R0742K44924r4959C4898K08500a30798A96900J40121a44048B92285
17277A45779d8382B5052J00092J66100q8254K6962j06442L69440k10662j07281
$$ y = [-260018, 173253, 88235, 296937, -86532, -138775, 110277, 328180, 186382, 284363, 130505, 325842, 122460, 210782, 306687, 254424, 303142, 27780, 185906, -56403, 220110, 127044, -41192, 234214, 226122, -52689, 25836, 147588, -93451, 357532, 549700, 189745, 101016, 521543, -82490, 111111, 153784, -129623, 393605, 103995, 496738, 45134, 324265, 150394, 261632, 203184, 233949, 122592, -150331, 177253, 410908, 39349, 162424, 32163, 137662, 267381, -255889, 351899, 148099, 330560, 189910, -97146, -12464, 323831, 17692, -4052, 86482, 177224, 422148, 327189, 34898, 243398, -130798, 196900, 337021, -144048, 292285, 145779, -48382, 25052, 125144, 291244, 202990, 229952, 123510, 492950, 282288, 175007]
17267A75007J31604b02042A06023l003O704K02945H3682j1413a05714C33271J28353
17256D61624r3872O9637G6739R7797J61634D2406n438N02040j62369P922E9522
17244a56792B8197J69027L1775m5200J4060q1074L23668Q5422a5754B31496a10268
17232C43397I9536J70229K92886B03702J84611J7474A00500J00251R8522B0590
17221E5933R9734j3192R9217b1846l7140A44078J56818A12838L64816A29333K57789
17210C87122K4188a82504G9427J99128A31548a2544D31472A6864K88552j2933
17200B92483l8435I9233J03492i0699B8458J49154J92695D331K49607G9517J21281
17189B00798J30150K19243A58549n4981A2209J44461K20142J22540A07242L62685
$$ y = [175007, 306611, -202042, 106023, 103020, 109724, 312669, 83682, 72269, -105714, 333271, 461624, 367752, 437389, 76739, 174536, 336170, 42406, 36968, 539008, 376639, 384561, 59522, -156792, 28197, 197224, 228999, 183799, 197859, 116785, 440453, 525875, -15754, 231496, -110268, 343397, 99536, 269765, 562651, 203702, 388313, 405787, 100500, 200751, 299273, 20590, 55933, 155667, 142475, 241692, -21846, -58986, 144078, 300896, 112838, 477654, 129333, 387122, 411310, -182504, 79427, 278555, 131548, -12544, 431472, 16864, 305416, 292483, 254048, 99233, 202725, -90699, 28458, 177612, 370307, 4331, 253938, 79517, 200798, 330948, 550191, 158549, 103568, 12209, 156670, 376812, 499352, 107242, 469927]
17179D69927A12674Q2687J21437J05383m1225E4360J40588n218E8239L57533r3866
17168C21906a79504D03924F7344O98968B06729J08620j56351K78104k10221P3362
17158C00243J85564j42025N5567I5564e6356m822E2588N38670j63180A73788J47302
17147C21090J77551k21038K00785A50235K91821j36688P5568A911M07636q7278
17137C22269j46066J10325L2102J3186q3661N6489N08498B96372L76648A3250
17126G4608J85730k484K02350H1078K77185J18204j4178j87719N0251K00279q845
17115E16255p6366k11623K21015I8864L08176j2241L7740j57655c4366D67654
17104C80459A65570j8443J80624j31724M69598B44202J50163J17923K3103j07324
$$ y = [469927, 112674, 195361, 316798, 422181, 380956, 54360, 194948, 189730, 58239, 415772, 321906, -179504, 403924, 67344, 766312, 206729, 315349, 158998, 437102, 226881, 300243, 485807, 343782, 399349, 95564, -56356, -61178, 52588, 591258, 428078, 173788, 321090, 498641, 277603, 478388, 150235, 442056, 305368, 380936, 1911, 409547, 322269, 176203, 286528, 318630, 331816, 248155, 304644, 813142, 296372, 673020, 13250, 74608, 260338, 257854, 460204, 81078, 358263, 476467, 462289, 274570, 324821, 525100, 516255, 439889, 228266, 449281, 98864, 407040, 394799, 432539, 274884, -34366, 467654, 380459, 165570, 147127, 327751, 196027, 665625, 244202, 394365, 512288, 535391, 428067]
17094D28067L9701J91089j89289J16131B20553Q5074L3095L460j12462M47567
17084F77287l8126F5308M35125j3630A88913L23714K1845r0288P716k16152K93504
17073E29252j86631A17798L78103M5830J45440P2716j42112k75179L8186J28808
17063E09590k37890r1146K82426L7018A47069L14041j78343K59247B63513L31542
17053E95055B62809M13351k45316p07K74607k43042k07532K49766m4749k3305
17043D35882P7750j47346N44821l95729o9732j1004J86873k61677J05515j58352
17033C07001K61768M501Q0328K19857j99294L5461m3849J1920k3318j201j24613
17022E28561J86163K2011B69761M48222o7938J36232j61821j78066K86762k29986
$$ y = [428067, 467768, 658857, 469568, 585699, 220553, 305627, 338722, 342182, 229720, 677287, 639161, 65308, 500433, 486803, 188913, 512627, 534472, 444184, 451900, 235748, 529252, 342621, 117798, 495901, 541731, 687171, 759887, 617775, 342596, 380782, 509590, 271700, 180554, 462980, 499998, 147069, 461110, 282767, 542014, 263513, 595055, 262809, 676160, 430844, 430137, 704744, 461702, 254170, 503936, 459187, 435882, 513632, 366286, 911107, 515378, 445646, 434642, 621515, 359838, 465353, 307001, 568769, 573270, 653598, 873455, 674161, 709622, 665773, 677693, 654375, 653174, 528561, 714724, 736735, 269761, 717983, 650045, 786277, 624456, 446390, 733152, 503166]
17012E03166J06037j88270J82678k07847J48732J08224p9815O2697J25207N6315
17002H17124P2161m2117k67435k0467k5397n4504O62411B80844J19431L28423
16992G28698K47092q8017q2695J55221j66462l84231L23545J37570R8972k73507
16982F96186R1028L47220l68221K9614O2240L03078E66832K95236J16559m82308
16972D96319K18959r8585J74113j60096K12199j12757J87169J14941k73399O1922
16962H20785R4880o6635j47845J46393J51097j00124p0501Q0218J57951j38901
16952I27318m06108M53581J62709p2940J34144j49368K27115m62423J49339K38035
16942A201402l24023K72157j46197J61262J368M9079l18952L11873q0107O6719
$$ y = [503166, 609203, 420933, 603611, 395764, 544496, 652720, 572905, 635602, 760809, 817124, 889285, 847168, 579733, 559266, 533869, 479365, 1141776, 280844, 400275, 728698, 975790, 887773, 805078, 960299, 793837, 409606, 733151, 870721, 969693, 696186, 787214, 1134434, 766213, 795827, 858067, 1161145, 566832, 862068, 978627, 496319, 715278, 616693, 790806, 630710, 842909, 730152, 917321, 1032262, 758863, 820785, 915665, 849030, 701185, 847578, 998675, 898551, 828050, 908268, 1066219, 927318, 521210, 974791, 1137500, 1064560, 1198704, 1049336, 1276451, 814028, 963367, 1201402, 877379, 1149536, 1003339, 1164601, 1165969, 1215048, 896096, 1207969, 1127862, 1194581]
16932A194581J32198r9090j27934l3985K58489k28218m3364L73090l15365J66699
16922A277101j88008K64994q1569J96528l92878K30780L61992k30379J30802l68350
16912A201013L3055L59034j65141k2529o3494K24426l52587l9918N45655j44708
16902A574806J23110k57j38178l42746L67694K16272k28830J44917L1228J39612
16892A887628k19407j43810M67319m2107j1879k56582o2030Q919L91144l82058
16882A637137K34286K97963k52477M82586l26386P0647j03098J41432l93121M08106
16872B197075N0128K2526l06075K18922K78848k11766j55753K82325r1821K05801
16862B490210j71955N64288k04462j64296L02233o0764J29562k47023Q9243j3591
$$ y = [1194581, 1326779, 1227689, 1099755, 1065770, 1324259, 1096041, 1052677, 1425767, 1110402, 1277101, 1089093, 1354087, 1272518, 1469046, 1076168, 1306948, 1668940, 1438561, 1569363, 1201013, 1234068, 1593102, 1427961, 1405432, 1341938, 1566364, 1213777, 1173859, 1719514, 1574806, 1697916, 1697659, 1559481, 1216735, 1584429, 1800701, 1571871, 1716788, 1748016, 1887628, 1668221, 1524411, 1991730, 1949623, 1937744, 1681162, 1619132, 1628051, 2019195, 1637137, 1871423, 2169386, 1916909, 2399495, 2073109, 2143756, 2040658, 2182090, 1788969, 2197075, 2247203, 2269729, 1963654, 2182576, 2461424, 2249658, 2093905, 2376230, 2284409, 2490210, 2318255, 2882543, 2678081, 2513785, 2816018, 2755254, 2884816, 2637793, 2727036, 2713445]
16852B713445J0680J62492p0048N73319j29668k55953J84095J02670j60790K35080
16842C365322k56124K53157P2585J42917p6222j28006r8090L53989J1239J90414
16832C831181L6392K34126m02152L26999J6990J67353j25945L00312K51494l75872
16822D260878L33138n5003N54375k18242J41016J80471j24473J08878J68034m54487
16812D894585M53965P63305m52304Q7776M61459k27157L91733L31103k37669L3877
16802F500673Q710Q16996j35389K95581q3452K269K72149Q3160R7987O54200n0070
16791H462814K96430q6029J31368O06429M29037k84990O69591o1605N30563R2775
16781A0786383M40756L83518L56550O69474j0088R3289O77040N18504M33872L93963
$$ y = [2713445, 2724125, 2886617, 2816569, 3389888, 3260220, 3004267, 3188362, 3291032, 3130242, 3365322, 3109198, 3362355, 3434940, 3577857, 3501635, 3373629, 3275539, 3629528, 3640767, 3831181, 3867573, 4101699, 3699547, 4026546, 4043536, 4210889, 4084944, 4385256, 4636750, 4260878, 4594016, 4539013, 5093388, 4875146, 5016162, 5196633, 5072160, 5181038, 5349072, 4894585, 5348550, 6111855, 5659551, 5747327, 6208786, 5981629, 6373362, 6704465, 6466796, 6500673, 6509383, 7326379, 7190990, 7486571, 7403119, 7405388, 7677537, 7760697, 7858684, 8512884, 8462814, 8759244, 8673215, 8804583, 9411012, 9840049, 9555059, 10224650, 10163045, 10693608, 10786383, 11227139, 11610657, 11967207, 12636681, 12626593, 12719882, 13396922, 13915426, 14349298, 14743261]
16771A4743261L59461M26234P14195L62826Q94259O40425M75345M24834R68830
16762B0009670R09557O46457O13014J147804P79541J089331Q84223Q12960J318002
16753B8210559J727147J122305R08518K153384J076712J697669K063428J932875
16745D0892597J705491K776003J966587K493427K853991L115157K950071L506887
16737F2260211L849117L539698M267309M813993M915381N103441N704055O072542
16729A00525747O153235O869826P145350P602951P505186Q409243P892423Q255987
16721A60359948Q052433P598431P712095O510243N643476M123827L133786J694689
16713B04828928N30386j493712l085387m013973n511935o605100p044196p886660
$$ y = [14743261, 15102722, 15528956, 16243151, 16605977, 17500236, 18140661, 18616006, 19040840, 20009670, 20919227, 21565684, 22178698, 23326502, 24106043, 25195374, 26079597, 26892557, 28210559, 29937706, 31060011, 31968529, 34121913, 35198625, 36896294, 38959722, 40892597, 42598088, 45374091, 47340678, 49834105, 52688096, 55803253, 58753324, 62260211, 66109328, 69649026, 73916335, 78730328, 83645709, 88749150, 94453205, 100525747, 106678982, 113548808, 120694158, 128297109, 135802295, 144211538, 152103961, 160359948, 168412381, 176010812, 183722907, 190233150, 195876626, 200000453, 203134239, 204828928, 205359314, 203865602, 200780215, 196766242, 191254307, 184649207, 177605011, 169718351]
16705A69718351p921467q527657q430123q126713q346160p700451p019306p330577
16697A06315897o274496o411814n640204n316000n221282m616000m335567l775030
16689F4725504l673739l822426l178471k774275k532129k686643k384963k506381
16681D1166477j801895k177282j927967j450855j720931j468889j326011r67946
16673B8324701j311356j430293q94387j424539m18167j336343r61909m82436p22642
16664A9342629r53377n28815o97590m71926n07544q52724o00947k52637o06778
16655A3870291l41281o22524m71784k3749l53525p37186m78818k93459k94421
16646A0253544j63035k73791l70906j57314k30699j7293o34869k19840o2815j94023
$$ y = [169718351, 161796884, 153269227, 144839104, 136712391, 128366231, 120665780, 113646474, 106315897, 100041401, 93629587, 87989383, 82673383, 77452101, 72836101, 68500534, 64725504, 61051765, 57229339, 54050868, 51276593, 48744464, 46057821, 43672858, 41166477, 39364582, 37187300, 35259333, 33808478, 32087547, 30618658, 29292647, 28324701, 27013345, 25583052, 24688665, 23264126, 22845959, 21509616, 20547707, 20065271, 19342629, 18389252, 17860437, 17162847, 16690921, 16183377, 15330653, 14729706, 14477069, 13870291, 13529010, 12906486, 12434702, 12410953, 12057428, 11320242, 10841424, 10547965, 10253544, 10090509, 9816718, 9445812, 9288498, 9057799, 9040506, 8405637, 8185797, 8122982, 7928959]
16636G928959m1048m1522k71006k03915j09132p45254J63882l83020J74755j08068
16626F364631k34475k91861j0348k45634j73089M9995p5394J34252m24679l73058
16616D720340O9697J60475k22724j53999L6k53576J26671j80620k617j76168j76762
16605C910753J69374k8970l66556j85667K75646J16310m70594l27865L27048l52459
16595C067020K79125j08813l730M8573k52505O5087j75632k90370Q0543j21299
16585B587999M03455j44086k76072M8376O8175l07652P6128k05382j76743J7556
16575B091754o6236L51410j56667k93917L07007p9466q749R3312n36956Q2305
16565A783797L6415O6082j25166J70644P2224l51104p2839J23841K00054l12188
$$ y = [7928959, 7887911, 7846389, 7575383, 7371468, 7262336, 6517082, 6680964, 6297944, 6472699, 6364631, 6130156, 5838295, 5827947, 5582313, 5409224, 5459219, 5383825, 5518077, 5093398, 4720340, 4790037, 4950512, 4727788, 4573789, 4573825, 4320249, 4446920, 4266300, 4263683, 4087515, 3910753, 4080127, 4051157, 3684601, 3498934, 3774580, 3890890, 3420296, 3092431, 3419479, 3067020, 3346145, 3237332, 3233602, 3282175, 3029670, 3094757, 2919125, 2628755, 2709298, 2587999, 2991454, 2847368, 2571296, 2619672, 2687847, 2380195, 2456323, 2250941, 2074198, 2091754, 2025518, 2376928, 2220261, 1926344, 2233351, 2153885, 2145136, 2238448, 1701492, 1783797, 1820212, 1886294, 1761128, 1931772, 2003996, 1652892, 1580053, 1703894, 1903948, 1591760]
16555A591760o7771K38558k82127L29213o1345j61546r0942L46533l04604k2672
16545A515057o0243J71362J50796l47908m5787k17786L06036k1296j38537J50301
16535A461995K04960m61912K7449O4089R8731m61238L15066J86459k74730M5139
16525A206008j27063j17573K89021k55148J14670j89827K14485j62794P4503j9502
16515A026780j30683j09365J19846k93005N13796p7071R9348j73426r6256p4641
16505H05323M4961j7352n636L27630m83944K46454J66793m42311K15372J15417
16495I72707m15267O00927E55502L84529j60188L7490J86668k69108K16804K1134
16485I72831j63165k27588j12884L21509R0339L9912l79639J13201J47536o566
$$ y = [1591760, 1523989, 1762547, 1480420, 1809633, 1748288, 1586742, 1495800, 1842333, 1537729, 1515057, 1454814, 1626176, 1776972, 1429064, 1383277, 1165491, 1471527, 1450231, 1311694, 1461995, 1666955, 1205043, 1232492, 1296581, 1395312, 934074, 1249140, 1435599, 1160869, 1206008, 1078945, 961372, 1250393, 995245, 1109915, 920088, 1134573, 971779, 1046282, 1026780, 896097, 786732, 906578, 613573, 1127369, 1050298, 1149646, 976220, 879964, 805323, 850284, 832932, 827296, 1154926, 670982, 917436, 1084229, 641918, 857290, 972707, 557440, 1158367, 555502, 940031, 779843, 817333, 1004001, 734893, 951697, 972831, 809666, 582078, 469194, 790703, 881042, 920954, 541315, 654516, 802052, 795486]
16475G95486l76393L07276k45349O1696J3916M03448j23487k63568N4114L8295
16465F65434K92112k73895k47846K64572P5626j83735j88576M9508n6985M50953
16455H47168k13895k979r2990j70283L10009k8409j4430j39107K03402l01259
16445C97227P6124L43779A45372L8844K35784L05692C50435J79824n2008N2348
16435E30599L5734B52962L65797j96971A27476K32888K36280J0178c0610C12352
16424F3463L27553J15559o0791L27359B02544Q8261N05696j16777j51632j35311
16414C92781R0763j13274J21076K5246K39179B71297K98557J62524A23L14817
16404C14940j37730P205L95225B40991q048L42566j74353J55012A48357J94525
$$ y = [795486, 419093, 726369, 481020, 542716, 556632, 960080, 836593, 573025, 627139, 665434, 957546, 683651, 435805, 700377, 776003, 592268, 403692, 453200, 396215, 847168, 633273, 630294, 537304, 367021, 677030, 648621, 634191, 495084, 698486, 397227, 473351, 817130, 145372, 184216, 420000, 725692, 350435, 530259, 478251, 530599, 566333, 252962, 618759, 421788, 127476, 360364, 596644, 606822, -30610, 312352, 63463, 391016, 506575, 445784, 773143, 202544, 290805, 796501, 679724, 528092, 392781, 483544, 370270, 491346, 516592, 755771, 271297, 569854, 732378, 123, 314940, 177210, 184415, 579640, 240991, 232943, 575509, 401156, 556168, 148357, 342882]
16394C42882J91526n0520A60001M81862k89697A35416N06366k60040L00373B40811
16383A02573K67252n414o7304M7726K23677k77133J33026c503D14347j71684L0849
16372B73512p1953K5327p627k2908K26646J08104k03030J44471m7820A41017B6475
16360B03800J92861k9762m7955A57499L33141B15958o6273i6106B24944J02585
16350C27529A08346J03910K53622B17571D2001M9629J15418K6753B8797B378J91763
16339A94141Q3541K32338E5333a12373A66072J41345o1941k8177a1397A59539
16328C62879B1050L99690o8599j16338l3653a47835H8421J70202C3306R9503K61823
16317C94632A92263C8591P8486K20294j40749A0488K09858J22300c7333C03358
$$ y = [342882, 534408, 483888, 160001, 641863, 352166, 135416, 641782, 381742, 682115, 240811, 102573, 369825, 364411, 297107, 344833, 568510, 291377, 424403, -3503, 414347, 242663, 273512, 201559, 226886, 219259, 196351, 422997, 531101, 328071, 472542, 424722, 141017, 26475, 203800, 396661, 366899, 318944, 157499, 490640, 215958, 149685, -96106, 224944, 327529, 108346, 212256, 465878, 217571, 42001, 91630, 207048, 233801, 28797, 2378, 194141, 277682, 510020, 55333, -112373, 166072, 307417, 245476, 217299, -11397, 159539, 362879, 21050, 420740, 352141, 235803, 202150, -147835, 88421, 258623, 33306, 132809, 394632, 192263, 38591, 117077, 337371, 196622, 10488, 220346, 342646, -37333, 303358]
16306d4708B90402I7942L33794H0046a33862q1368B66007L634r2881B9376Q9854
16295A19230Q2927K94096j56752o3104M4114K1959f6765A4328K68574G0947L6538
16284A07485a78227E4767k1537R4828k3009K96161B3588a81758a7412C0802K44015
16273B74817j34877O3173J50788j21293B9239J78290b19618p0024A48477J04914
16263B53391C3889J5925L49877b9922k92845G5657K8941a65080q6883D93362A28778
16251C51897j14227B0351J75839b18085A86501m9129a52587P1896A2723a72770
16240A68936F2816J47218c29660f582B5506K82502A04413N8419A2061J52976o2018
16229A03019K09357a7592j61531J8448k3460A73238f3483A3720d3594B37693a73169
$$ y = [-44708, 290402, 97942, 431736, 80046, -133862, -215230, 266007, 269641, 176760, 29376, 119230, 202157, 496253, 339501, 276397, 320511, 342470, -66765, 14328, 282902, 70947, 107485, -178227, 54767, 33230, 128058, 105049, 401210, 23588, -181758, -17412, 30802, 274817, 139940, 203113, 353901, 232608, 29239, 207529, -219618, -289642, 148477, 253391, 33889, 49814, 399691, -29922, -322767, 75657, 104598, -165080, -251963, 493362, 128778, 351897, 237670, 20351, 196190, -218085, 186501, 137372, -152587, -80691, 12723, -172770, 168936, 62816, 210034, -329660, -6582, 25506, 308008, 104413, 162832, 12061, 165037, 103019, 312376, -17592, -179123, -160675, -184135, 173238, -63483, 13720, -43594, 237693, -173169]
16217D83912j19681A79745K16324j85359i7494C66761A18737L494a20081b8392
16206f8769B21355a7I894P2501j097e2426A90682a92318g367A69134C7396b3387
16193I1527d166A93241I748J72767J00135a12040B5409a13324A22749J67612i3201
16181A40068k8033C154L61157A7025L80039b78348i7399h727C20330A24896D7844
16169B80002d9259a8739A0994J9707K54286f519n7603A72379E8971Q2613m2653
16158I8931d3418a4871B28170b36762B28949a80554A27344a52797A06256B0089
16147C8122K77927E0986M9095L04607b3842l2277H9803J06841c31915a56863P1591
16136h5272h843F1087O7419a41124G8146b36773I1236e0156b519r4369d469k82053
$$ y = [483912, 364231, 179745, 396069, 210710, -97494, 366761, 118737, 122231, -120081, -28392, -68769, 221355, -17, 9894, 82395, 81298, -52426, 190682, -192318, -7367, 169134, 37396, -23387, 91527, -4166, 193241, 9748, 182515, 282650, -112040, 25409, -113324, 122749, 290361, -93201, 140068, 112035, 3154, 364311, 17025, 397064, -278348, -97399, -8727, 320330, 124896, 47844, 280002, -49259, -18739, 10994, 30701, 284987, -6519, -64122, 172379, 58971, 141584, 98931, -43418, -14871, 228170, -236762, 228949, -180554, 127344, -152797, 106256, 20089, 38122, 316049, 50986, 100081, 404688, -23842, -56119, 89803, 196644, -331915, -156863, -85272, -8843, 61087, 128506, -141124, 78146, -236773, 91236, -50156, -2519, -96888, -4469, -286522]
16124b86522J42554j10853E8952K19205b01634D7560a74342A24110b03216G687
16113a58515f4218A12751i5551j20406o6206B9286h6074G9310Q7652C7090K7049
16102F4139J12440i1843A03702f720B8349g821I4552c25654a42666j5392A45666
16090B94355i9105B13880e6582a7807C03678G2297O4850O1487c97225a77012f7121
16078d5293C8863b35236B22155c25043J52727B24380i3839c5336l6941A48887
16067A17800a04736A50864e9616j00728e4479D4727K30877c75142A8125a10774
16056B60040b92469A12656B1669i8472B0958J39041I073M2058J13238n3129f1521
16044g6433A24428J78779j06620r4560a35819J2440E5903a13956p4358n2796C8103
$$ y = [-286522, -143968, -254821, 58952, 278157, -201634, 47560, -174342, 124110, -203216, 7687, -158515, -64218, 112751, -95551, -215957, -282163, 29286, -86074, 79310, 166962, 37090, 64139, 176579, -91843, 103702, -6720, 28349, -7821, 94552, -325654, -142666, -158058, 145666, 294355, -99105, 213880, -56582, -17807, 303678, 72297, 137147, 198634, -397225, -177012, -67121, -45293, 38863, -235236, 222155, -325043, -172316, 224380, -93839, -35336, -72277, 148887, 117800, -104736, 150864, -59616, -160344, -54479, 44727, 275604, -375142, 18125, -110774, 260040, -292469, 112656, 21669, -98472, 20958, 159999, 9073, 51131, 164369, 111240, -61521, -76433, 124428, 303207, 196587, 102027, -135819, -123379, 55903, -113956, -188314, -241110, 38103]
16032f4406p4194A13839K2334c13078c3296j54216f5575M373B9375d6627j5275
16021f1902j9166E3115A5446R454E195J8539M41018i8527r4102i2530J4264L2462
16009d5804k12011A07302a6157j23380I5468J39378a88381e9633B11890a09896
15998D3478N1686a10241C65206E0410a58637C81093a64630e9958H2008a08458
15987e0111l45548G3544N3713m6502K14468J83613k17984J71506A64617c0234
15976a59194B33706c99231B45571Q296d9523D17388a71458C6294K08938b40303
15965A01350b02566B45276L5496r1201l0650a54189K6967n5086A9635K44327B5717
15953b55711C4604a57578o4077p712i5437b2419C9551g0900a6064k2696A37544
$$ y = [-64406, -138600, 113839, 136173, -313078, -33296, -187512, -65575, -61202, 29375, -46627, -61902, -81068, 53115, 15446, 24900, 5195, 23734, 464752, -98527, -192629, -92530, -78266, -45804, -257815, 107302, -16157, -139537, 95468, 234846, -188381, -59633, 211890, -109896, 43478, 95164, -110241, 365206, 50410, -158637, 381093, -164630, -59958, 82008, -108458, -50111, -395659, 73544, 127257, 80755, 295223, 478836, 260852, 432358, 164617, -30234, -159194, 233706, -399231, 245571, 253867, -49523, 417388, -171458, 36294, 245232, -240303, 101350, -202566, 245276, 280772, 189571, 158921, -154189, -127222, -182308, 19635, 263962, 25717, -255711, 34604, -157578, -221655, -229367, -95437, -22419, 39551, -70900, -16064, -38760, 137544]
15941a43442j56076h5396j94520A76353h6336F935K091i0480A21188k9927a32049
15929b3149J0077n1129q1587o6368h6439J3944B56939a17888e8385j72520A62241
15917b51879B24074c13533h9366k7406J6056B30358c2089H2579a7792j28843d9309
15905c12848d0182K947p0796B3066a75954Q4963l06611R5462N5966B02815p2133
15894A30682c20939c5689K53l28583A25409g9159j93800h7531A9755N1546k1459
15883D9842a66107f086n4928m38076F9045J21670p3951b11866i7040n1966e5039
15871E477b86494H0120a74624D3805a75511N8052d3043B18345a55104P3166k16607
15860b98545C059b0087B35123a32447a9505q4348M7576a8843j95764f8874k00702
$$ y = [-143442, -299518, -85396, -279916, 176353, -86336, 6935, 9026, -90480, 121188, 91261, -132049, -23149, -13072, -64201, -145788, -212156, -86439, -72495, 256939, -117888, -58385, -230905, 162241, -251879, 224074, -313533, -89366, -116772, -100716, 230358, -32089, 82579, -17792, -146635, -49309, -312848, -40182, -37235, -108031, 23066, -175954, -90991, -397602, -302140, -246174, 202815, 130682, -320939, -35689, -35436, -364019, 125409, -79159, -272959, -87531, 19755, 71301, 49842, -166107, -6086, -61014, -499090, 69045, 190715, 116764, -211866, -97040, -149006, -55039, 5477, -286494, 80120, -174624, 43805, -175511, -117459, -43043, 218345, -155104, -81938, -298545, 3059, -20087, 235123, -132447, -19505, -103853, -56277, -18843, -214607, -68874, -269576]
15849b69576a04368m1385l269A28365a53663k1202c6733D7391a44891A09322J99892
15838C09214A16373b5015A69252K8005b1862F8598Q1144N62676b6709A4941h1381
15826H9133j6752A1427e0158B05173c2192j17178B98168G7603d38921h7335a0486
15814C2979a10327j27440D8054J21022a27512l707o2545o5709A58925d25452J49530
15803b75922A62851a5289l5916A3521K14538g2949D4570A439J9870O7556d59191
15791C2082b76214P6757C0175R406i6534A47254N036B3618b99733A47817a31484
15779b79135a14513B5680a03672J1997c2788B1990J08381e2723n6185c1581A47526
15767a21114E22088G9301a11016B0381f9621j25578P1732A58289a144I226L3939
$$ y = [-269576, -104368, -145753, -149022, 128365, -153663, -174865, -36733, 47391, -144891, 109322, 309214, 116373, -25015, 169252, 197257, -21862, 68598, 149742, 712418, -26709, 14941, -81381, 89133, 72381, 11427, -50158, 205173, -32192, -149370, 298168, 77603, -438921, -87335, -10486, 32979, -110327, -237767, 48054, 169076, -127512, -131219, -193764, -259473, 158925, -425452, -275922, 162851, -15289, -51205, 13521, 228059, -72949, 44570, 1439, 21309, 88865, -459191, 32082, -276214, -199457, 30175, 39581, -96534, 147254, 152290, 23618, -299733, 147817, -131484, -279135, -114513, 25680, -103672, -91675, -32788, 21990, 130371, -52723, -108908, -31581, 147526, -121114, 522088, 79301, -111016, 20381, -69621, -195199, -123467, 158289, -1144, 9226, 43165]
15756D3165K11198a7452B26242I8222a5072F8485a82170L6889N9550B84880F5109
15744B62638J2310a31151a8383j00670D6925a28017A3576g5800j20149j0782f4257
15732a39401E779J28319A015M6068b9865A06411J44867a61375g0248A0546K67163
15721B77709a99329m9658J05552O1696A24027J7097l1709a57131A47910K5421
15711A73331a07727E7294i7631q4437l07659O979A05065N6165c53620E4546a86580
15699a25028N0390b1195A017a89726O0915D6224c59211J51610C30394j14230I4440
15687a82514A63196p5862b11848d3570l07606A68635d8010E8171G26a97793J0425
15676a87368m9303L4602R4689k6751f0287A3192O1389d0697m5653k7259K6785
$$ y = [43165, 254363, -17452, 226242, 98222, -15072, 68485, -182170, -145281, -85731, 284880, 65109, 262638, 274948, -131151, -18383, -119053, 46925, -128017, 13576, -75800, -195949, -206731, -64257, -139401, 5779, 134098, 1015, 47083, -29865, 106411, 251278, -161375, -70248, 10546, 277709, -199329, -248987, -143435, -81739, 124027, 141124, 109415, -157131, 147910, 173331, -107727, 57294, -97631, -182068, -489727, -482748, 105065, 161230, -353620, 54546, -186580, -125028, -74638, -21195, 1017, -189726, -128811, 46224, -359211, -207601, 330394, 216164, 94440, -182514, 163196, 87334, -211848, -43570, -351176, 168635, -48010, 58171, 726, -197793, -187368, -236671, -202069, -107380, -134131, -60287, 13192, 74581, -40697, -86350, -113609, -86824]
15665h6824A51792F297P4045P6200a37893p035M7373D001a77775A96113d91583
15653A33469d35005a7094A88981b08369Q1128j4939N9832j58745b3899A83524
15642d3241j55670A95689C1292e2445J4443l77472C9540g7122k97117h1770a5953
15630a90352C46006e6133F6025b39438A11939b84093A79499e3001A76821e426
15619c256l2551A64470J06186k7124F616a50697B85337a06162P823r4320h4508
15607f0506C9412K26M7389f2950A21382e7451j77649o9680A2142a4367j03906
15596a18273C34537a27781A12599b76005A71976A7330b13741e6093b46q7924A71327
15584b56768M2069m8070B24088b69531d6402m10241A08197L5310b14773c3678
$$ y = [-86824, 151792, 6297, 80342, 156542, -137893, -144928, -97555, 4001, -177775, 196113, -491583, 133469, -435005, -17094, 188981, -208369, -127241, -142180, -82348, -241093, -23899, 183524, -43241, -198911, 195689, 31292, -52445, -38002, -415474, 39540, -77122, -374239, -81770, -15953, -190352, 346006, -56133, 66025, -239438, 111939, -284093, 179499, -53001, 176821, -5426, -3256, -35807, 164470, 270656, 243532, 6616, -150697, 285337, -106162, -98339, -192659, -84508, -60506, 39412, 39638, 87027, -62950, 121382, -57451, -235100, -304780, 12142, -14367, -118273, 334537, -127781, 112599, -276005, 171976, 17330, -213741, -56093, -246, -88170, 171327, -256768, -214699, -262769, 224088, -269531, -46402, -456643, 108197, 143507, -214773, -33678]
15573a59032a1470j09088o4100A50743f2402C8223a88957Q12l6978b4452n1812
15562g6264A53997m5838b98569e7820j93912A90007A8848c5859j6120n8484E4850
15550A8395i0098K0941L0996A13177i543A33703A3444g2895j2536A33262a38293
15538b57618d8267B01736a01922K9949A22820e7490G3754O5026K19071A42122
15527b24941r9188B89840a29654B75991b87842j64586f3073F359b2603B12438
15516F7634k6559a19092B32454i2047B28837M1006G0776c22486a09214A30176
15505A4131a63878J0190A97911a80334l1821A88878M988a620G2708j3082d1518
15493d90729J40442J71402K5380B08420o0824Q815D3827J30907a03942E3683H689
$$ y = [-159032, -11470, -120558, -184658, 150743, -62402, 38223, -188957, -188145, -225123, -24452, -76264, 153997, 108159, -298569, -57820, -251732, 190007, 18848, -35859, -51979, -110463, 54850, 18395, -90098, -69157, -38161, 113177, -9543, 133703, 13444, -72895, -85431, 133262, -138293, -257618, -48267, 201736, -101922, -71973, 122820, -57490, 73754, 138780, 357851, 142122, -224941, -324129, 289840, -129654, 275991, -287842, -452428, -63073, 6359, -22603, 212438, 67634, 41075, -119092, 232454, -92047, 228837, 269843, 70776, -322486, -109214, 130176, 14131, -163878, -153688, 197911, -180334, -212155, 188878, 193866, -1620, 72708, 59626, -41518, -490729, -350287, -178885, -153505, 208420, 147596, 156411, 43827, 174734, -103942, 53683, 8689]
15481A62519c14527J40867C05677H3574c29676F5538R8881P8689b77420J06492
15471a70928G0415e9601B42851A18322K0987a79709B5719J00932K78277A28990
15460B62385F0642J5844C7982K44469C2618J39194F4312d9647k41957P4990A14260
15448g5480l3147A967J81721L0083b88144a23366D1642b01279Q2397B0791M71469
15437D92260g5945C03941I0977J4983J72710i3779q5088j11763A38975g3296K1100
15426e2196a2089l15401B3964L1889c33529C189d3093J3689p5980j70885A53903
15414a15592q3777Q0221q8388k10940H57K38595H6243e729j49050J8335p6861
15403b13305O1672p8549E7761J27587b1489m3177m1567Q734G1290a90821C59695
$$ y = [162519, -314527, -173660, 305677, 83574, -329676, 65538, 164419, 243108, -277420, -170928, 70415, -59601, 242851, 118322, 139309, -179709, 25719, 126651, 404928, 128990, 262385, 60642, 76486, 37982, 282451, 32618, 171812, 64312, -49647, -291604, -216614, 114260, -75480, -108627, 1967, 183688, 213771, -288144, -123366, 41642, -201279, -118882, 20791, 492260, -75945, 303941, 90977, 105960, 278670, -93779, -178867, -290630, 138975, -73296, -52196, -12089, -327490, 23964, 55853, -333529, 3189, -43093, -29404, -105384, -276269, 153903, -115592, -199369, -119148, -207536, -418476, 857, 239452, 86243, -5729, -154779, -136444, -213305, -151633, -230182, 57761, 185348, -21489, -64666, -106233, -97499, 71290, -190821, 359695]
15391b59980B64034b4368j57696g3906O087r2141p3030k52736A42846M4876K0252
15380B07974a48279n6218c8499B462a75096B80964K7166L7420D3374a44313B15897
15368A97289A3051N9751b4536A10083J46323a99651I3735a19570A2603f8835q1271
15357a50106A56558b21145A32273K21728d2059J7847k50848C62168A760K34074
15347B35834C4072R1272O3368a64521A45605D3042a64525C04159E2056a97623
15336b9406j88000c3050n3410B24007m278f135j39953E12930a51506B20295q0433
15325A39862a43517C7305a33993C21350a6992B15441g7438G8478b13341A78176
15314e0063J9544j47639C68978H8675h3633p5772G288K64098B3002L47174G5059
$$ y = [-259980, 264034, -24368, -182064, -73906, -67819, -159960, -232990, -485726, 142846, 187722, 207974, -148279, -204497, -38499, 2462, -175096, 280964, 308130, 345550, 43374, -144313, 215897, 197289, 13051, 72802, -24536, 110083, 256406, -199651, 93735, -119570, 12603, -68835, -150106, 156558, -221145, 132273, 354001, -42059, -24212, -275060, 362168, 1760, 235834, 34072, 125344, 188712, -164521, 145605, 43042, -164525, 304159, 52056, -197623, -29406, -217406, -33050, -86460, 224007, 219729, -6135, -146088, 512930, -151506, 220295, 139862, -143517, 37305, -133993, 321350, -16992, 215441, -77438, 78478, -213341, 178176, -50063, -30519, -178158, 368978, 88675, -83633, -159405, 7288, 271386, 23002, 370176, 75059]
15302C8279c39166c3407r6886q0149f4661j10893J2774E4268J69499C7205J71240
15291B08445n7443N3353E5272O7389R8069p7582B3797d9044B69123j11634A2953
15279H3250J2080a68205A24815a71521B31858C3922a9510A96133P4983J55618
15269D26734i6656H4210a59251B15223E4928j6264h970A56055k6635M4467J44115
15258C18002A08478J02574q8315C0108L45266D9669J58624N36677A21563M90652
15248F12215P94370Q444r1367N0248o04903A10534J16642R6267C1210C437J02653
15237A06090b0179B43528Q89C8260J34799b30754E5039K88606F6806e0102G3686
15225f4578G4768a24550C3630a71936B73631b5248B03731m1516n8630k8909J84255
$$ y = [38279, -339166, -33407, -130293, -210442, -64661, -175554, -162780, 54268, 223767, 37205, 208445, 151002, 204355, 55272, 122661, 220730, 143148, 23797, -49044, 269123, 157489, 12953, 83250, 95330, -168205, 124815, -171521, 231858, 33922, -19510, 196133, 271116, 426734, -96656, 84210, -159251, 215223, 54928, 38664, -8970, 156055, 129420, 173887, 318002, 108478, 211052, 122737, 30108, 375374, 49669, 208293, 744970, 121563, 612215, 1406585, 1415029, 1323662, 1373910, 769007, 110534, 227176, 323443, 31210, 3437, 106090, -20179, 243528, 244417, 38260, 173059, -230754, 55039, 343645, 66806, -50102, 73686, -64578, 74768, -124550, 33630, -171936, 273631, -25248, 203731, 162215, 103585, 74676, 258931]
15214B58931A18523O0206g5884I2985K7399J61074G4783b30906C23509j42944
15204A80565A4873J52031a6141F5385a11274A59883f0639C63499P6271c7919B61725
15192E1833K22444a55228C34900l2738F2833f5821J0672E3265K83534a79214B368
15180B54618c3295I9528m3899c0750I7833a9686B41792l9835K1240D956K96961
15169C01917A25574F308h4504a5295B08967g9280J6470B8414J54262G2184a55598
15157A54852j9638J49520H9022b17080A37974J04460b56271G6522K1519J0946
15147A08987O8628N3894h3971C95029L2151a13569A5981J56142D6238a3129B13882
15135H3558Q5772J60322a23938D28844j92243M4207D9394P5798c6876A21627m6110
$$ y = [258931, 118523, 178729, -75884, 92985, 120384, 281458, 74783, -230906, 323509, 180565, 14873, 166904, -16141, 65385, -111274, 159883, -60639, 363499, 439770, -37919, 261725, 51833, 274277, -155228, 334900, 302162, 62833, -65821, -55149, 53265, 336799, -179214, 2368, 254618, -33295, 99528, 55629, -30750, 97833, -19686, 241792, 201957, 223197, 4956, 301917, 125574, 6308, -84504, -15295, 208967, -79280, -62810, 28414, 182676, 72184, -155598, 154852, 135214, 284734, 89022, -217080, 137974, 242434, -256271, 76522, 98041, 108987, 177615, 231509, -83971, 395029, 427180, -113569, 15981, 172123, 46238, -13129, 213882, 83558, 169330, 329652, -123938, 428844, 236601, 280808, 49394, 125192, -36876, 121627, 75517]
15124G5517c21302C68946J82168A00248P3242o6438L7610L09503A17638m1754
15114G5884b11017b3914B10007H4859L63924a77537A21760n9308d7522j92953
15104b40475B64976A17291b6380A11684a8833A36917h4030A64783N1259e7018
15093a21805B93766K6971j56833a11861B1605J07030l1270a7515A68385J86184
15083C54569A09304k1840J83219m5030R6214j60379C7270L02404j49553m5743
15073A44378F2593N8691L73159A41434B1808J40089E4582J71077E906N2370L20158
15062C78434a6085A5966c647B49497a01393B41831o7525n8567K69776A01780L91109
15051D92889k28918a22832B01496E6782K14763J68259j81776C699P5742Q6315
$$ y = [75517, -321302, 368946, 551114, 100248, 173490, 107052, 144662, 454165, 117638, 75884, -211017, -23914, 210007, 84859, 448783, -177537, 121760, 62452, -47522, -240475, 264976, 117291, -26380, 111684, -18833, 136917, -84030, 164783, 216042, -57018, -121805, 293766, 320737, 163904, -111861, 21605, 128635, 97365, -17515, 168385, 354569, 109304, 87464, 270683, 225653, 321867, 161488, 37270, 339674, 190121, 144378, 62593, 121284, 494443, 141434, 21808, 161897, 54582, 225659, 5906, 58276, 378434, -16085, 15966, -3647, 249497, -101393, 241831, 174306, 115739, 385515, 101780, 492889, 263971, -122832, 201496, 56782, 271545, 439804, 258028, 3699, 79441, 165756]
15041A65756J3542L8142R3021A45502L71245a91306j4752H5081i1679j70592C09615
15029C62119r7821q0414H7039N809J90413b6308R847l414C32477a99552G932L38042
15017C45974k6524r7185l4775P587N5222a89613C18005r9419q8136K61454p8962
15006C12942m0554k1358A07649C6450L95923j56602l3091K6704a0944B88988i3439
14994b5652C1494K09621a26270A82636J98617g4134D08689j10939j13868O2543
14984B46425N1014J30342g1272A33666b13073C35047n4010o8813l3398J58894
14974C37720A44672e440E16612g1912B99833l2724R1382I3384K99970g565C32559
14962A17071L56773j08799j41485I6578l3023L32287L0822O931b3444D16873J44792
$$ y = [165756, 179298, 217440, 310461, 145502, 516747, -191306, -206058, 85081, -91679, -262271, 309615, 362119, 264298, 183884, 87039, 92848, 283261, -26308, -16461, -19875, 332477, -199552, 7932, 345974, 319450, 222265, 187490, 195077, 250299, -189613, 318005, 218586, 130450, 391904, 312942, 272388, 251030, 107649, 36450, 432373, 275771, 242680, 269384, -10944, 288988, -93439, -25652, 31494, 241115, -126270, 182636, 381253, -74134, 408689, 297750, 183882, 246425, 297439, 427781, -71272, 133666, -213073, 335047, 281037, 212224, 178826, 337720, 144672, -5440, 516612, -71912, 299833, 267109, 358491, 93384, 393354, -7565, 332559, 117071, 473844, 365045, 223560, 96578, 63555, 395842, 426664, 433595, -23444, 416873, 561665]
14951E61665k12410m5083C1697R0103L57601A24000J79010R7996J72761B60503
14940C14032q1733f5595A24789L29775k24631A14620l72L44330j31366J03717
14930D30929j09122P4232I3754K68978j78424K33383j81565N9126L3998O0602
14920C89852A09054K79798j5844A66393J72680A22173J19401J36344J31834n6527
14910D53225R9876B63566l1750m3432R1102O1542R4747J95295k87516J25058j70633
14899B97979k7806J27775m7145A30548K5144N92575A31035N97319l44948A41690
14888D73912j88841J33455R4390B03265o7806N74301l21726P7733A96878K8796
14878B25674R0046q121J54342B17428n3690K45420r4694j25405K81519F9911K53684
$$ y = [561665, 349255, 304172, 31697, 121800, 479401, 124000, 303010, 401006, 573767, 260503, 314032, 232299, -65595, 124789, 454564, 229933, 114620, 114248, 458578, 327212, 430929, 321807, 396039, 93754, 362732, 184308, 417691, 236126, 295252, 329250, 389852, 109054, 388852, 373008, 166393, 339073, 122173, 241574, 377918, 509752, 453225, 553101, 263566, 231816, 188384, 279486, 341028, 435775, 631070, 343554, 468612, 297979, 270173, 397948, 350803, 130548, 155692, 748267, 131035, 728354, 383406, 141690, 473912, 285071, 418526, 512916, 203265, 135459, 709760, 388034, 465767, 196878, 225674, 315720, 307599, 461941, 217428, 163738, 409158, 314464, 189059, 470578, 69911, 323595]
14867C23595P6664q7506J79787A62083J25729P4050r5357L34538k37756Q7717
14857D51004n2931L04283M7019A73829K39463P210O6707r9025o8139K34378A32262
14845A86316L4785J50713K02909j3183j02888k7116j21769o0751J54893K07383
14835F11292L7430B37131L71525j32507N2380l4652B42888J97694J86628B93547
14824G03068C38815K17390k41407J32508K29362k17101n8506J78930p2086K87068
14814G94973B6004N25088j70744M3785n7542N8601P6002N3467r0872J09653L8159
14803F11601j73971q709l4127K5809L36587j16616p5005K51220k99555J38465
14793F55699A49315L21250j62989L73085j25130k23472K26481K75560l79274m710
$$ y = [323595, 400259, 312753, 492540, 162083, 287812, 361862, 266505, 601043, 363287, 451004, 398073, 702356, 749375, 173829, 413292, 420502, 487209, 388184, 320045, 554423, 132262, 186316, 221101, 371814, 574723, 561540, 458652, 431536, 309767, 249016, 403909, 611292, 648722, 237131, 608656, 476149, 528529, 493877, 242888, 440582, 627210, 293547, 703068, 338815, 556205, 314798, 447306, 676668, 459567, 401061, 579991, 507905, 794973, 26004, 551092, 380348, 424133, 366591, 425192, 501194, 554661, 463789, 573442, 611601, 437630, 428921, 394794, 420603, 757190, 640574, 565569, 816789, 517234, 655699, 149315, 470565, 307576, 680661, 555531, 332059, 558540, 834100, 454826, 450116]
14783D50116J19587p0605O1539R9315r7400k44911M05291k3065j91336K99393
14773H07924j70140o5413J38118N2391j20897j56402K43947J68255l97913k10432
14763B89438Q7561M79915l90069J18531j59360J64696K08801B98360M07657j95798
14753E10219k742M29041C33479N36617k13909J89649j07684j73670L56550P3362
14743I94394j54255j53570J68010J7290J25524k88848J2932J14987k23677L36476
14733I49263J44670k56191r3117O3787r8828n9508L19816m40995M21615p3518
14723H76994K65232l09387l50267J25862L04305j70052Q0634N9576J3649k97513
14713E99033O9080L61866j23999k78819K32093P6890k04060O5716n0082K20592
$$ y = [450116, 569703, 499098, 560637, 659952, 562552, 317641, 722932, 699867, 508531, 807924, 637784, 572371, 710489, 762880, 641983, 485581, 729528, 897783, 499870, 289438, 376999, 856914, 466845, 585376, 426016, 590712, 799513, 298360, 706017, 510219, 507477, 936518, 333479, 870096, 656187, 845836, 738152, 564482, 921032, 994394, 840139, 686569, 854579, 871869, 997393, 708545, 721477, 836464, 612787, 949263, 1093933, 837742, 744625, 808412, 709584, 650076, 969892, 528897, 950512, 876994, 1142226, 832839, 482572, 608434, 912739, 742687, 823321, 882897, 896546, 599033, 668113, 1029979, 905980, 627161, 859254, 936144, 732084, 797800, 747718, 968310]
14703I68310k41091K05667J79426n2338k77563K46832k72127J58709P5893K7698
14693A019416k06845K84968n1364k60736J69114Q5480j15828J60228j43085l1038
14683I10310K11776j96061j87875K38092j50982L12051k9075J54507l16699L64258
14673A310302k96990K09159k29904N1534J73164j20179J6495N3251J47008j93487
14663A120353k32598J91051J0364J6271O5002m34791N65562k3080k39280J86031
14653A224885l724m66336M80150K64122j81056q9653O627J41554l11450J89220
14643A254339j49805J42727P6883J82798r1296N8835m93081J11149M37263p0425
14633A459387m36882L32056k7021p902r7644j9547K79780Q7906J97376j85001
$$ y = [968310, 727219, 932886, 1112312, 1059974, 782411, 1029243, 757116, 915825, 991718, 1019416, 812571, 1097539, 1046175, 785439, 954553, 1040033, 924205, 1084433, 941348, 910310, 1122086, 926025, 738150, 976242, 825260, 1137311, 1108236, 1262743, 946044, 1310302, 1013312, 1222471, 992567, 1044101, 1217265, 1097086, 1113581, 1166832, 1313840, 1120353, 887755, 1078806, 1089170, 1105441, 1170443, 735652, 1301214, 1278134, 1038854, 1224885, 1221161, 754825, 1234975, 1499097, 1318041, 1228388, 1235015, 1376569, 1065119, 1254339, 1104534, 1247261, 1324144, 1506942, 1415646, 1474481, 981400, 1092549, 1529812, 1459387, 1022505, 1354561, 1327540, 1319638, 1221994, 1202447, 1482227, 1570133, 1767509, 1582508]
14623A582508k16800J51809l42062N55954k68418R627o0795j26923M30703J05015
14613A820618r1928l24199K45296k4484l3756j10511N1677L16932k11298K00813
14603A839160n24783K83080L3250j6728K50211p4240k23427J77319K0489L77028
14593B141359j45108P500k06350k72956O67542j43653k98048l78128O74605J68900
14583B215663k90500m1087j07812K58386M1311K2726k69785n9229M36643J13965
14573B320281j69716K18531j69158o0784J92386P813J0768O2002o2859J57857
14563B507121j89170L15233k2059J40741K90028j42746K56737k7249K30839L02057
14553C661532L42249L15981O28201R02686K012740M438416J1414969J5792831
$$ y = [1582508, 1365708, 1517517, 1175455, 1731409, 1462991, 1472618, 1411823, 1284900, 1715603, 1820618, 1728690, 1404491, 1649787, 1625303, 1591547, 1481036, 1532713, 1849645, 1638347, 1839160, 1314377, 1597457, 1630707, 1613979, 1864190, 1789950, 1566523, 1743842, 1764331, 2141359, 1996251, 2003751, 1797401, 1524445, 2191987, 2048334, 1750286, 1372158, 2046763, 2215663, 1925163, 1884076, 1776264, 2034650, 2075961, 2098687, 1828902, 1769673, 2206316, 2320281, 2150565, 2369096, 2199938, 2139154, 2331540, 2339353, 2350121, 2412123, 2349264, 2507121, 2317951, 2633184, 2611125, 2751866, 3041894, 2899148, 3155885, 3128636, 3359475, 3661532, 4003781, 4319762, 4947963, 5850649, 7863389, 12301805, 23716774, 39509605]
14545C9509605J730128j7845585I901862m846774j693684r86954J20099m30635
14537B063914L1816k19278K16628j55238L61381j07990J08425M069k49290K40305
14527B294742L19440k53544j29819J65978L308j07959k58417N31317K32035k93583
14517B503498J24309j6644R9508l0876j4573L07370l01838L84456m5418l75876
14507B633916O63710k96057J44855k9104l0249j61904J68815J7753k09223K11635
14497C114147M56553k17704k10444M3210J54628L62427j21397q5308J79894j4861
14487C661145L79145m1369l10201L1740j39899l8669N25528l85041L35924J81518
14477D199821N0986j35601k0641K24570k58835J26915K64611j50996k255J60908
$$ y = [39509605, 41239733, 23394148, 9901862, 5055088, 3361404, 2374450, 2494549, 2063914, 2095730, 1876452, 2093080, 1937842, 2299223, 2191233, 2299658, 2303727, 2054437, 2294742, 2614182, 2360638, 2230819, 2396797, 2400105, 2292146, 2033729, 2565046, 2797081, 2503498, 2627807, 2611163, 2710671, 2679795, 2665222, 2972592, 2670754, 3055210, 3009792, 2633916, 3297626, 3001569, 3146424, 3117320, 3087071, 2925167, 3093982, 3111735, 2902512, 3114147, 3570700, 3352996, 3142552, 3185762, 3340390, 3702817, 3581420, 3496112, 3676006, 3661145, 4040290, 3998921, 3688720, 3720460, 3580561, 3541892, 4067420, 3682379, 4018303, 4199821, 4250807, 4115206, 4094565, 4319135, 4060300, 4187215, 4451826, 4300830, 4298575, 4459483]
14467D459483J37003n4019J48487M20915J10268l64315N4832j11411L74768j94968
14457D981043J42727j73049L74490k60612K04317M07236j50875K380o1969L01331
14447E767019o0226m0545L96963Q7847l17227N58303l86265K4064K82116k59673
14437F052376J58036J10459K86366k10331J44573L92024K88967l43431L12319
14428G191358j997J83739k22470N81841j72554j1261L77087N2504j71952K35402
14418H041697N21237M1458O8166n4934L13862r210L85235J35685j94021J01413
14408I350588L27079q7771N0310L00826J05554j7249M45309L26514j72270K62512
14398A0891402J89446L21185j08856K62200O8916K64476J58798K59217K63149
$$ y = [4459483, 4596486, 4542467, 4690954, 5111869, 5222137, 4857822, 4912654, 4801243, 5176011, 4981043, 5123770, 4950721, 5325211, 5064599, 5268916, 5676152, 5525277, 5527657, 5465688, 5767019, 5706793, 5666248, 6063211, 6151058, 5833831, 6392134, 6005869, 6029933, 6312049, 6052376, 6210412, 6320871, 6607237, 6396906, 6541479, 6933503, 7222470, 6879039, 7191358, 7189361, 7373100, 7150630, 7732471, 7559917, 7548656, 7925743, 7978247, 7806295, 8041697, 8562934, 8604392, 8672558, 8617624, 8931486, 8922276, 9307511, 9443196, 9249175, 9350588, 9677667, 9589896, 9640206, 9941032, 10046586, 10029337, 10474646, 10801160, 10628890, 10891402, 11080848, 11402033, 11293177, 11555377, 11624293, 11888769, 12047567, 12306784, 12569933]
14389A2569933j317M42467K02291M78918J1030J91783M70689J65356L71457l8824
14379A4863783P77157q9700M58827L86136K18307M52862j28194N38963L62626
14370A7840767K01815O47391j01839R88334M6255L08044P28570L89407M72549
14361B1521293L85704O93977M99903J88836M12879Q69521K24480M39297R16384
14352B6152274O61398O23760N76733O79647J037100M39131N28577J033737J021501
14343C2753858O47941J021112R89568J063156J155233R19144Q80531J022827J469875
14334D1923245J238154J273101Q65989J605804J615422J665017J603935J645329
14326E3435996J534258J653469J872454K204264J876753K155675K489078K580389
$$ y = [12569933, 12568616, 13011083, 13213374, 13692292, 13703322, 13895105, 14365794, 14531150, 14902607, 14863783, 15640940, 15551240, 16010067, 16396203, 16614510, 17067372, 16939178, 17478141, 17840767, 18042582, 18689973, 18588134, 19576468, 19622723, 19930767, 20659337, 21048744, 21521293, 21906997, 22600974, 23100877, 23289713, 23702592, 24572113, 24796593, 25235890, 26152274, 26813672, 27437432, 28014165, 28693812, 29730912, 30170043, 30698620, 31732357, 32753858, 33401799, 34422911, 35412479, 36475635, 37630868, 38550012, 39430543, 40453370, 41923245, 43161399, 44434500, 45300489, 46906293, 48521715, 50186732, 51790667, 53435996, 54970254, 56623723, 58496177, 60700441, 62577194, 64732869, 67221947, 69802336]
14318F9802336J916793L023700K776986K716141L117716L157766L470911L663258
14310I3645607M108720M219123M163073M556531N160676M683650N445162N438332
14302A31420874O700127O107638O791040P339877P677536Q147924Q800761R098699
14294A92084476R852826R808927J0813594J1521636J1627147J2312277J3113028
14287B71133911J3402891J3807465J4539267J4892426J4884045J5124525J5050582
14280C72835112J4679926J4006579J2970070J2211402J1242192R460432P824336
14273D55230049N730870K233216j738254l626953l759094m15643k630297o841837
14265D44182057r195125j0414397j1636815j3094895j4551001j4938621j5146069
$$ y = [69802336, 71719129, 74742829, 77519815, 80235956, 83353672, 86511438, 89982349, 93645607, 97754327, 101973450, 106136523, 110693054, 115853730, 120537380, 125982542, 131420874, 138121001, 144228639, 151019679, 158359556, 166037092, 174185016, 182985777, 192084476, 201937302, 211746229, 222559823, 234081459, 245708606, 258020883, 271133911, 284536802, 298344267, 312883534, 327775960, 342660005, 357784530, 372835112, 387515038, 401521617, 414491687, 426703089, 437945281, 447405713, 455230049, 460960919, 463194135, 461455881, 457828928, 454069834, 453654191, 451023894, 444182057, 434986932, 424572535, 412935720, 399840825, 385289824, 370351203, 355205134]
14258C55205134j5884728j5397049j5233850j3893469j3945362j3753606j2981603
14251B54115467j2527392j1881837j1285504j0537117j0189330r492979q888509
14244A79312799q624531p788109p596744p397749o484315o287563n762024n390509
14236A23981255n798559n103883m879281m179796l718790l916337m044054l814595
14228H8525960l404602k925852l400359k957714k991958k432859k450353k230596
14220F5731667k188003j939016k479925k058889j524380j714338j271171j509848
14212E1046097k018832j621822r84947j506753j168298q39524j149804j417992
14204D0338125j441946r68968q35869j010741o32307j293895p23903q72794j221267
$$ y = [355205134, 339320406, 323923357, 308689507, 294796038, 280850676, 267097070, 254115467, 241588075, 229706238, 218420734, 207883617, 197694287, 188201308, 179312799, 170688268, 162900159, 155303415, 147905666, 141421351, 135133788, 129371764, 123981255, 118182696, 113078813, 108199532, 104019736, 100300946, 96384609, 92340555, 88525960, 85121358, 82195506, 78795147, 75837433, 72845475, 70412616, 67962263, 65731667, 63543664, 61604648, 59124723, 57065834, 55541454, 53827116, 52555945, 51046097, 49027265, 47405443, 46420496, 44913743, 43745445, 42905921, 41756117, 40338125, 38896179, 37927211, 37091342, 36080601, 35448294, 34154399, 33430496, 32557702, 31336435]
14195C1336435m30929o74630p00415q59897q28112m33159q71557n47938n61016
14186B5428782n75717l33861q04766p16730j56219n80613o26094n27037k09880
14177B0897865m06584l31386o05682l50967l10942m88229l06307P7400o40092
14168A7535076l37609j64778n66314r5870k23243n41298m7766n22717l78403k56469
14158A4400609k12077k4327l14045l6312m54000k17159p4657r9626p80401L12457
14148A2500462m48692J2945k78318j40257k69297j73249j45615l22529r71Q0444
14138A0814923l62363k12999l27410k36515J51448j01023k85082o1129M544m68225
14128H916169j43543K32251l06590j42971m10818P8195j8064m14447J57723j6246
$$ y = [31336435, 30905506, 30230876, 29530461, 28670564, 27842452, 27409293, 26537736, 25989798, 25428782, 24853065, 24519204, 23714438, 22997708, 22841489, 22260876, 21634782, 21107745, 20897865, 20491281, 20159895, 19554213, 19203246, 18892304, 18404075, 18097768, 18175168, 17535076, 17197467, 17032689, 16466375, 16370505, 16147262, 15605964, 15558198, 15035481, 14657078, 14400609, 14188532, 14164205, 13850160, 13813848, 13359848, 13142689, 13068032, 12968406, 12188005, 12500462, 12051770, 12064715, 11786397, 11646140, 11376843, 11203594, 11057979, 10735450, 10734479, 10814923, 10452560, 10239561, 9912151, 9675636, 9827084, 9726061, 9440979, 9379850, 9384394, 8916169, 8772626, 9004877, 8698287, 8555316, 8144498, 8222693, 8204629, 7790182, 7947905, 7931659]
14118G931659K22006m32522j46901l23215O0866R4572j28873k89629l13517J80115
14108F854561j93342K71590k73823O4582m7532m97860K18253l0812J80404m88434
14098F057587l66450K12774K44369n24519N04697n69550L1676J66672m68510K44450
14088E533196l25830j523j28835M2064q1080K20965j7954p3534P4571n94711M34666
14077E081995l30466J717l20046M16639k48546J6736j94814j92386j05228M34098
14067D559699k13358L4160j16447j91867O1550j16523L9550K54444l37617J27943
14057D101534k14221M1756p737J28033O7422l33154K10269q2055l80946J66883
14047C697784k32618L66229m91383K06557j43190l12028M25805m07435J03180
$$ y = [7931659, 8153665, 7721143, 7574242, 7251027, 7311893, 7406465, 7277592, 6987963, 6674446, 6854561, 6661219, 6932809, 6658986, 6723568, 6676036, 6178176, 6396429, 6365617, 6546021, 6057587, 5691137, 5903911, 6148280, 5623761, 6128458, 5558908, 5590584, 5757256, 5288746, 5533196, 5207366, 5205843, 5077008, 5119072, 5037992, 5258957, 5241003, 5167469, 5242040, 4647329, 5081995, 4751529, 4753246, 4433200, 4849839, 4601293, 4618029, 4423215, 4230829, 4125601, 4559699, 4346341, 4380501, 4264054, 4072187, 4133737, 4017214, 4056764, 4311208, 3973591, 4101534, 3887313, 3929069, 3921332, 4049365, 4116787, 3783633, 3993902, 3911847, 3530901, 3697784, 3465166, 3831395, 3340012, 3546569, 3403379, 3091351, 3517156, 3109721, 3212901]
14038C212901K01083k04288j56534K16237l95565K55317k8954J65033j94881o2262
14028C008087J10453m13889K42096Q7236l17838K82969m64971J78338N4027r5741
14018B670767O6869j22943K95980j85489j03566Q5102P9253j74901q2172p7483
14008B451417j31363K3942j69532l2662L35448n08525L36822j5606O8990j94672
13998B164259J41497j59739K0055Q6145j9975J1403J56820l9512N11334P29511
13988C601798L648549R423735J7374395P451707j4515775j3120005n084074k792865
13980E987465r59348r33559j03917n22759l93250j01101l8884J55474l22152k28007
13970B539962j64042K69869j78786P1717j07933k39074L05747q2770j91775k3140
$$ y = [3212901, 3413984, 3209696, 3053162, 3269399, 2873834, 3129151, 3100197, 3265230, 3070349, 3008087, 3118540, 2704651, 2946747, 3033983, 2716145, 2999114, 2534143, 2712481, 2766508, 2670767, 2737636, 2614693, 2910673, 2725184, 2621618, 2706720, 2785973, 2611072, 2528900, 2451417, 2320054, 2343996, 2174464, 2141802, 2477250, 1968725, 2305547, 2289941, 2358931, 2164259, 2305756, 2146017, 2166072, 2252217, 2232242, 2243645, 2400465, 2360953, 2872287, 3601798, 7250347, 16674082, 34048477, 41500184, 26984409, 13864404, 8780330, 5987465, 5028117, 4094558, 3990641, 3467882, 3074632, 2973531, 2934647, 3090121, 2767969, 2539962, 2375920, 2645789, 2467003, 2538720, 2430787, 2191713, 2497460, 2414690, 2222915, 2199775]
13960B199775J01972m4822m7090J94069l74145J35796l09740J01319R7037k16224
13950A837947K90677J28771j12317k64678Q2061J7084j69618J47265J55357l81683
13940A730866p3313Q8090J27917l88260J63418R2173R1685K01728k05708j39580
13930A689016N5085n7097r8127M25869p35863M13502j23008J86071m6532j5543
13920A693373l29889K61902m32663M83718l6993m4971J84813k06317k666q3003
13910A487304k62161M16407R0551l77146M0349J18861K0028j98230J53575j55431
13900A334107N0253N1907P588j63708M2461Q8872l40903L66324J19805J34386
13890A691092k85109j893l93644J80378j62840L46308r0186k24481R604M3709
$$ y = [2199775, 2301747, 2256925, 2209835, 2403904, 2029759, 2165555, 1855815, 1957134, 2054171, 1837947, 2128624, 2257395, 2145078, 1880400, 1962461, 1979545, 1809927, 1957192, 2112549, 1730866, 1657553, 1745643, 1873560, 1485300, 1648718, 1740891, 1832576, 2034304, 1828596, 1689016, 1744101, 1687004, 1588877, 2014746, 1278883, 1692385, 1569377, 1755448, 1708916, 1693373, 1363484, 1625386, 1192723, 1676441, 1639448, 1594477, 1779290, 1572973, 1570307, 1487304, 1225143, 1641550, 1732101, 1354955, 1395304, 1514165, 1534193, 1335963, 1489538, 1334107, 1384360, 1436267, 1443855, 1280147, 1322608, 1411480, 1070577, 1436901, 1556706, 1691092, 1405983, 1404090, 1010446, 1190824, 1027984, 1374292, 1284106, 1059625, 1069229, 1112938]
13880A112938j08529l5877r3145J57347J06374n9695l21071K01506K87668j84005
13870A063511j19203J12349J70749K41191l65409J66149k37851P1519k04126L37052
13860A235931k20801Q2995k89858L39377L0654l4845J94144j1962k29066r4419
13850A002150M5391j05668J92092l43866K79263j57722M41736m55869J04848L8327
13840A040682p6277L15498F16708L09697k4053j12016L26062k79660k41020P84585
13830A380303j07605k99182J62116j0735E35319M47274j22366K38134m30812K3722
13820F91271K41674J22479l23565M3145J00200k35694K48321N7317J1997k7390
13810I29755K83794n02195L14361k5124D64460N46538j17970k07694L67736k5106
$$ y = [1112938, 1004409, 968532, 875387, 1032734, 1139108, 1079413, 758342, 959848, 1247516, 1063511, 944308, 1056657, 1227406, 1468597, 1103188, 1269337, 1031486, 1103005, 898879, 1235931, 1015130, 1098125, 808267, 1147644, 1178298, 1143453, 1337597, 1325635, 1096569, 1002150, 1047541, 941873, 1133965, 790099, 1069362, 911640, 1353376, 897507, 1002355, 1040682, 964405, 1279903, 616708, 926405, 902352, 790336, 1116398, 836738, 595718, 1380303, 1272698, 973516, 1135632, 1124897, 535319, 982593, 860227, 1098361, 667549, 691271, 932945, 1055424, 731859, 775004, 875204, 639510, 887831, 945148, 957145, 929755, 1213549, 711354, 1025715, 1000591, 464460, 1010998, 893028, 685334, 1053070, 1027964]
13800A027964j60395j49343k40806J60800J99433L008J0205K83151E13736L24968
13790H38704j15146k05746M21819k83594j21620L58368C89619L12122L06949j22422
13780H86268j36978K95941l17681B89045M89544o8439J34377k60915j49412J31737
13770E65937M28467C38960J53435p8643J17326B58393M66686J11501R3566k46547
13760F83599q6199N31679l90412k0563M5193r6049r2717k9889j45740K01395P994
13749F08291J254k62695J42053M17948m31879K43780j24831L4925K06679j62391
13739F73134n9289j84600p7112J55876N8395K5357k28885J6961J96342j23358
13729D52821M90389C78199l1655M21034l11205J59540q8269J8487j3949L2222
$$ y = [1027964, 867569, 718226, 477420, 638220, 837653, 840661, 850866, 1134017, 513736, 838704, 723558, 517812, 939631, 656037, 534417, 892785, 389619, 701741, 1008690, 886268, 749290, 1045231, 727550, 289045, 778589, 710150, 844527, 583612, 434200, 565937, 994404, 338960, 492395, 413752, 531078, 258393, 725079, 836580, 930146, 683599, 597400, 1129079, 738667, 718104, 763297, 667248, 574531, 544642, 398902, 600297, 608291, 609545, 346850, 488903, 906851, 474972, 718752, 593921, 628846, 835525, 673134, 613845, 429245, 352133, 508009, 566404, 591761, 362876, 379837, 576179, 452821, 943210, 378199, 346544, 767578, 456373, 615913, 527644, 546131, 532182, 564404]
13719E64404K08553j01681Q8624o0138J35638C96902R26O2423K51200k60790A01647
13707H60710k03620J88398l26812J82550k61324L09478B91610K60920r7120J30704
13697E86114B32922K45302J13736n7416j65166K94471l27548j22868L3768L6989
13687B84190L48607J06910Q3309k69783l2963j44994n9389M86863l40639q1266
13677C80845J14371P4638k18258P3270N4484p0937L08381l26761j37345N7892
13667C10580O29152j94460k9856p3270B63783J20167l1057p1498M51196j87339
13657E45252k22735K28170R6501A66230M04870I4376R0821K54722j7564r658q2275
13646C30422K82405k78050J87254r0113K94279l56839J30239J18742B99367J12350
$$ y = [564404, 772957, 671276, 759900, 699762, 835400, 396902, 397828, 460251, 711451, 450661, 101647, 860710, 657090, 845488, 518676, 701226, 439902, 749380, 291610, 552530, 455410, 586114, 232922, 478224, 591960, 534544, 369378, 663849, 336301, 213433, 247201, 284190, 632797, 739707, 823016, 553233, 520270, 375276, 315887, 802750, 462111, 380845, 495216, 569854, 351596, 424866, 479350, 408413, 716794, 390033, 252688, 310580, 939732, 745272, 715416, 642146, 263783, 383950, 352893, 281395, 732591, 545252, 322517, 550687, 647188, 166230, 571100, 94376, 185197, 439919, 422355, 412697, 330422, 612827, 334777, 522031, 431918, 726197, 369358, 499597, 618339, 299367, 411717]
13636D11717K9343J4419J21986j79992K89155l16955L7505J17876k32821J21065
13626D13298J90184A6026M00873j71427J77008j5501J04344B12889K51888j38381
13616C26396J00266J07469p2532r6428k5749r2529J07680J49363q9707A75820
13605F81737l04023M9199J39544B24689J65681J32150F6091L57507K92766k65211
13595D51153L53354B28524K13453B18189R604J70742O8524J54593j56823o0819
13585D04010o801l1336m4993O2237n3212j01304M05963A48791K23837J11004k34717
13574B48915J60979L4612n3547A49415K25291Q919J58850q2159A98277K09941
13564D08218J55161j01291j65763h0433B13318O5560L34943B29395l3660J65922
$$ y = [411717, 441060, 455479, 577465, 397473, 686628, 369673, 407178, 525054, 292233, 413298, 603482, 16026, 416899, 245472, 422480, 406979, 511323, 212889, 464777, 326396, 426662, 534131, 461599, 365171, 339422, 246893, 354573, 503936, 414229, 175820, 681737, 377714, 426913, 566457, 224689, 390370, 522520, 66091, 423598, 716364, 451153, 804507, 228524, 441977, 218189, 227793, 398535, 467059, 621652, 464829, 404010, 397209, 365873, 320880, 383117, 329905, 228601, 634564, 148791, 372628, 483632, 248915, 409894, 444506, 390959, 149415, 374706, 383625, 542475, 460316, 198277, 408218, 563379, 462088, 296325, -80433, 213318, 278878, 613821, 229395, 195735, 361657]
13554C61657J25332C2302L91084A86182N01729O9914a31835F68782l19173j52836
13544A96773L49391k54887p4995K50987a50928b5005B47944q0987J60552N5970
13534C83479c288C57589J52123j67983A38887J47002M5777p2062J33863A66143
13523E25070I8324J62262I2545L14831J4774G7374K53867j23595K85554M753A58910
13511B64877J12094j17520j11473l7735J85942N4301O3603J84793k68540A44657
13500E25989A56042J29750p3406K80302j51723j26524N613q5948L4044J4933m5442
13489A37641P4653F2268K30800J07824m9156L17785C04506j05136q7522J18342
13479B30190J05076A0664J09596J74614O0057A04425J11985J14613O1680J42653
$$ y = [361657, 486989, 32302, 423386, 186182, 687911, 757825, -131835, 668782, 349609, 196773, 546164, 291277, 216282, 467269, -150928, -25005, 247944, 166957, 327509, 383479, -3288, 357589, 509712, 341729, 138887, 285889, 331666, 259604, 393467, 166143, 525070, 98324, 260586, 92545, 407376, 422150, 77374, 331241, 207646, 493200, 497953, 158910, 264877, 376971, 259451, 147978, 110243, 296185, 350486, 414089, 598882, 330342, 144657, 525989, 156042, 285792, 212386, 492688, 340965, 214441, 220054, 134106, 168150, 183083, 137641, 212294, 62268, 293068, 400892, 351736, 669521, 304506, 199370, 111848, 230190, 335266, 10664, 120260, 294874, 354931, 104425, 216410, 331023, 392703, 535356]
13469E35356D3840M05310K94945I8648a9976A3217O7710K99908j36127M2929m2211
13458B45426K6366A01967L31656A51030J28861D4506L172L7569K18218q0683l2956
13447A89826k3897m8800Q932L18661A37865K26250F0477h6079A63838J44485c8657
13435G9941L21403N9215A22848K38827j20195p1783a92171D06543L8611j31486
13425C13668j34786J64545q8065J36239j09360R7383j54360q1197J94298K51741
13415E90106k45349r2801R0327c56804A94685M5315K394i6095b0091d262A27428
13403C96848j28161J25268d9045C5082O6794J52493J52823i4061D87518p4213
13393D13305G0799K17697h0588D01111j73972J03952r6708J13402K6309j14164
$$ y = [535356, 43840, 449150, 744095, 98648, -19976, 13217, 80927, 380835, 244708, 287637, 245426, 271792, 101967, 433623, 151030, 279891, 44506, 47678, 85247, 303465, 222782, 189826, 165929, 117129, 126061, 444722, 137865, 364115, 60477, -86079, 163838, 308323, -38657, 79941, 401344, 460559, 122848, 361675, 241480, 169697, -192171, 406543, 445154, 313668, 178882, 343427, 255362, 391601, 282241, 379624, 225264, 144067, 338365, 590106, 344757, 251956, 342283, -356804, 194685, 240000, 242394, -96095, -20091, -4262, 127428, 396848, 268687, 393955, -49045, 35082, 101876, 254369, 407192, -94061, 487518, 413305, 70799, 288496, -80588, 401111, 227139, 331091, 234383, 347785, 374094, 259930]
13383B59930b52818G3694b49138A00378j7061M19928I1287C4386L50562j84457
13373B00491M0569J46423k5655B8146L53355j09133o2263M2602b04B80671a7390
13361B68052R6492A16051l9629N3463J54741j15486O8576a8210A04047k8765J02558
13350A77840J2614J26620k7175o7489J11734r0133L46417j88386j22921A34431
13339A66787b1085E9916l096J25690L54559C4748K78521q6142L07653B57579k8586
13328B28993J25737q5959J24142G4435g3473H8785N8038E9433K28604o3233k6232
13317A98572K30204i71m1084C24789A25175K08358n4300k1489L68672H4729K28938
13306C13667q5448A8246K5862h683D47900A56918L5185a57358B94621C923J177
$$ y = [259930, -252818, 73694, -249138, 100378, 83317, 503245, 91287, 34386, 384948, 200491, 241060, 387483, 361828, 28146, 381501, 272368, 210105, 252707, -204, 280671, -17390, 268052, 364544, 116051, 76422, 129885, 284626, 169140, 237716, -18210, 104047, 75282, 177840, 190454, 317074, 289899, 222410, 334144, 244011, 590428, 402042, 279121, 134431, 166787, -21085, 59916, 56820, 182510, 537069, 34748, 313269, 227127, 534780, 257579, 228993, 354730, 268771, 392913, 74435, -73473, 88785, 146823, 59433, 288037, 224804, 198572, 428776, -971, -42055, 324789, 125175, 333533, 279233, 257744, 626416, 84729, 313667, 228219, 18246, 44108, -8683, 447900, 156918, 192103, -157358, 294621, 3923, 5100]
13295E100J28493E8435D925K68331A31785b0591H7867K0453N1206J86737F4148
13283B29674q6755J40520j21030H1157J67745G4462b33844G7591K9117K90502
13273C97210b5814A08803i0315b7604A82313l4633h1459A11621m6557C1495L2579
13262F4074Q8555D5354M66369H7636a85338C36173j56892c1542A60141N1680l6799
13251A75022d9381A65002K02468d9843D3203K57511K0877q9527R6457f4066A28582
13239C32493a931m7140A53953C7096g6068B3968K32983M7023o2180m8018F4800
13227A51128N6585C075J7758a9055B18005C6586P9633n509d0354A4122K61975
13216B76097c05167A19663j5301c120H1221h2265A02694i9869C04022d7383I9691
$$ y = [5100, 133593, 58435, 4925, 273256, 131785, -20591, 87867, 108320, 159526, 346263, 64148, 229674, 142919, 283439, 162409, 81157, 248902, 74462, -233844, 77591, 106708, 397210, -25814, 108803, -90315, -27604, 182313, 147680, -81459, 111621, 65064, 31495, 64074, 152629, 45354, 511723, 87636, -185338, 336173, 179281, -31542, 160141, 211821, 175022, -49381, 165002, 367470, -49843, 43203, 300714, 321591, 232064, 328521, -64066, 128582, 332493, -1931, -49071, 153953, 37096, -76068, 23968, 256951, 303974, 241794, 193776, 64800, 151128, 207713, 3075, 20833, -19055, 218005, 36586, 116219, 110710, -40354, 14122, 276097, -305167, 119663, 104362, -3120, 81221, -82265, 102694, -99869, 304022, -47383, 99691]
13204b78693C40947L33495b9775B70609f5385F08476C0703J95505J39220a07926
13193B0352K65429D2390L8699a11318D15672A49929c38302A55933b39944b0108
13182b92979e6337A69708m675J37998b28002A55720F5750J2533i5579M6087A7712
13170C23048C2258d9372F5911L16522G0533a12048I0837l4937g5954G3345k741
13159G0604J12014a1921r8087A45819f9650o8306G612a21298j05804Q5825p5910
13148b17187A69297e0468q1642B10962r4404m1753J67476G8598l8931K90530D3072
13136A24224M3406K4074k2244G7817Q0579B2279L38646a97716A03009c602H9984
13124C34035p7428A22890n1157e0337D16791A20986K77311r1887M2064b21231
$$ y = [-278693, 340947, 674442, -29775, 270609, -65385, 608476, 30703, 226208, 365428, -107926, 20352, 285781, 42390, 81089, -111318, 415672, 149929, -338302, 155933, -239944, -20108, -292979, -56337, 169708, 165033, 303031, -228002, 155720, 65750, 78283, -95579, -49492, 17712, 323048, 32258, -49372, 65911, 382433, 70533, -112048, 90837, 55900, -75954, 73345, 70604, 182618, -11921, -110008, 145819, -69650, -137956, 7612, -121298, -227102, -141277, -217187, 169297, -50468, -132110, 210962, 116558, 74805, 242281, 78598, 39667, 330197, 43072, 124224, 167630, 191704, 169460, 77817, 158396, 22279, 360925, -197716, 103009, -3602, 89984, 334035, 256607, 122890, 71733, -50337, 416791, 120986, 398297, 306410, 348474, -221231]
13113I947K00433r2478J90600I662a2355D428a98944B82191E0570O8632e8676
13101A39373r272K65571a14347C66889A40564c7446j47759A07781J56588C1654
13090I371J10068b2694B44009l7416L9686l626k2387i6125a1859B34828e9017
13078A66608q21J84389A36413K0741b7364B2263J00396K64029j49696j9274j05551
13067A12167b29334E3730a44139c8527B6461L9937J49336f1724E0801J61949b5426
13055a47174e1825A2878M06199A98003b132A01555J69217j22862L4935K72030
13045D54875D7608O108J81659B2987f1159B04749f8482K6729r1545A00716c3489
13033g0635A64211a40606B78344g1802C75517a37474A64511a82378D56894D1942
$$ y = [9947, 210380, 117902, 308502, 9662, -12355, 4428, -198944, 282191, 50570, 119202, -58676, 139373, 130101, 395672, -114347, 366889, 140564, -37446, -185205, 107781, 264369, 31654, 9371, 119439, -22694, 244009, 206593, 246279, 242653, 220266, -96125, -11859, 234828, -59017, 166608, 165787, 350176, 136413, 157154, -27364, 22263, 122659, 386688, 236992, 217718, 112167, -229334, 53730, -144139, -38527, 26461, 66398, 215734, -61724, 50801, 212750, -25426, -147174, -51825, 12878, 419077, 198003, -2132, 101555, 270772, 147910, 182845, 454875, 47608, 53716, 235375, 22987, -61159, 204749, -68482, -41753, -133298, 100716, -33489, -70635, 164211, -140606, 278344, -71802, 375517, -137474, 164511, -182378, 456894, 41942]
13022A60724N204Q9397E7016F313K53810b13102H6538M6742A9836J35595G4579
13010A88043j3212a04723k07924A66216A4157K46686Q0815F9197h6820E6655K79081
12999C35736b03140G6866J58717a45056n618D09166I2551a33545B45352l8948
12989B06404a22971k33720B54413o5007d91291e6879j2857R852B39965b23163
12978a60573G1023J44012G5152i9941H0133A5845L30857h4198e716j1662r3989
12967a11367m780A14885h0846p8454A70712b17227M2697B7645R6412J45639d8278
12955b7978B55238f4199A52768h6287F182a3134A52761c3984I8836M9703i4343
12943h2608B51637A02044O6252J15880j15294k9873L92117G001J30474b7647A27108
$$ y = [160724, 165928, 255325, 57016, 6313, 260123, -213102, 86538, 133280, 19836, 155431, 74579, 188043, 174831, -104723, -312647, 166216, 14157, 260843, 341658, 69197, -86820, 56655, 335736, -203140, 76866, 235583, -145056, -150674, 409166, 92551, -133545, 245352, 206404, -122971, -356691, 254413, 189406, -491291, -56879, -69736, -59884, 239965, -223163, -160573, 71023, 215035, 75152, -99941, 80133, 15845, 346702, -84198, -5716, -17378, -111367, -116147, 114885, -80846, -159300, 170712, -217227, -174530, 27645, 124057, 269696, -48278, -27978, 255238, -64199, 152768, -86287, 6182, -13134, 152761, -33984, 98836, 148539, -94343, -82608, 251637, 102044, 168296, 284176, 168882, 139009, 531126, 7001, 137475, -27647, 127108]
12931c6126F4411a10663C9305R0412a82661A61873E8816d0171N648B5365a60914
12919D199L32766m0696b22253g3775A90729a6965B07913R8235b91948a26290h833
12907a21778A40417h4018B28487a35485A8332M4219J74067A3365a39343B2298
12896D5529a6658m6877A29672Q041J47782I3208c7919D24017I59a03520A83780
12884D4276h8839B50520E9562P7324i3208j46722G304i4175n3462l3442b9223
12872A89102J31348e6784A1976K20460a54385B28904f2676n0112B413J73243f1539
12860a09077a3267A16165c2429m651O226C37265p0214p5996a53395o1433h9765
12848A11726N4732E8251B1981h3750A98493c093F133P4596J97647I51d0183H2070
$$ y = [-36126, 64411, -110663, 39305, 129717, -182661, 161873, 58816, -40171, -34523, 25365, -160914, 4199, 336965, 296269, -222253, -73775, 190729, -16965, 207913, 306148, -291948, -126290, -8833, -121778, 140417, -84018, 228487, -135485, 18332, 62551, 236618, 13365, -139343, 22298, 45529, -16658, -63535, 129672, 137713, 285495, 93208, -37919, 424017, 959, -103520, 183780, 44276, -88839, 250520, 59562, 136886, -93208, -239930, 7304, -94175, -147637, -181079, -29223, 189102, 320450, -56784, 11976, 232436, -154385, 228904, -62676, -112788, 2413, 175656, -61539, -109077, -13267, 116165, -32429, -37080, -30854, 337265, 267051, 191055, -153395, -214828, -89765, 111726, 166458, 58251, 21981, -83750, 198493, -3093, 6133, 80729, 278376, 951, -40183, 82070]
12835F4537b85513H3383J14767B9871P9784a75630O0340P311B28492C444K15529
12824B18973H5310a81414F7854a03054q0981A44065n4068b4704B23853J54352
12814C78205b19862J0287B02681G2831a44675r5937L3538A95955c20544i9387
12803d7404C82912A05726L11649a20465H9755P2372a50156A35035b18053D7689
12792D7418K9491a6058A53356b99373G321R8758c7264h06A13085C0521a8473C75701
12779B7995b78079B90098b1116A56849a09836j44320A92454L22444A47522a9455
12768E3899N4100K64074a39722B37O1223b5109A21880R5043g8627F3688f3975
12756b2381A42172a2095r8813a3383D2718b28202c3722J1822n8636A53404Q694
$$ y = [64537, -285513, 83383, 198150, 29871, 109655, -175630, -115290, -107979, 228492, 3444, 218973, 85310, -181414, 67854, -103054, -184035, 144065, 89997, -24704, 223853, 378205, -219862, -209575, 202681, 72831, -144675, -240612, -207074, 195955, -320544, -99387, -47404, 382912, 105726, 417375, -120465, 89755, 162127, -150156, 135035, -218053, 47689, 47418, 76909, -16058, 153356, -299373, 7321, 106079, -37264, -806, 113085, 30521, -18473, 375701, 27995, -278079, 290098, -21116, 156849, -109836, -254156, 192454, 514898, 147522, -19455, 53899, 107999, 372073, -139722, 237, 61460, -25109, 121880, 216923, -78627, 63688, -63975, -22381, 142172, -12095, -110908, -13383, 42718, -228202, -33722, -21900, -80536, 153404, 162098]
12745A62098K03805j68506E1721g5192l875I8981L68811b1948m4192B99308A03025
12733A96903O5397i5395J5037j20895A63110l682G0312a01014B9600M1465a76916
12721b54771g2534C60524j36028l2168d5361j415j69762e898C22168j24525l1957
12710A65686N1612J04579j29860A7373L20514G5793J5765R5725J85172o7695a01308
12698B5026q099h5979o3576M8772b7799q068R754H2313B4816K05384L9831j05624
12686A64407b8569A47722A3806L46084j67024J2242a42291K7860A04535Q0162
12676A84697m6743K95164C2761e7683o0258K3596B08187e2289I9545g2989B70539
12664H1757M9087J42730E3864L25344f2898A77403f4805A51465o0456J41504A2811
$$ y = [162098, 365903, 197397, 51721, -75192, -79067, 98981, 467792, -21948, -66140, 299308, 103025, 196903, 262300, -95395, -80358, -201253, 163110, 159428, 70312, -101014, 29600, 71065, -176916, -254771, -72534, 360524, 224496, 192328, -45361, -46776, -216538, -5898, 322168, 197643, 165686, 217298, 321877, 192017, 17373, 337887, 75793, 91558, 187283, 372455, 304760, -101308, 25026, 16927, -85979, -149555, -100783, -27799, -35867, -26113, 82313, 24816, 230200, 270031, 164407, -28569, 147722, 13806, 359890, 192866, 205108, -142291, -114431, 104535, 184697, 137954, 433118, 32761, -57683, -117941, -94345, 208187, -52289, 99545, -72989, 270539, 81757, 130844, 273574, 53864, 379208, -62898, 177403, -64805, 151465, 91009, 232513, 12811]
12652A83858E3487K74499G701i78j07276J7663C53229A21709M222b76072B31339
12640f1311a5851k84233a10387B69278c6321H9190f8757b9836A34854K39348D6328
12628B72920H2326J30186J97148A36577a12007a1422B94398G1814L3186a06667
12617B68563e9166B65244C5431a00668E9858B7826J03117a26552q8480D4254f8768
12605g4609k41056B40362O1782b26921A22524L9679g6820M325o1668A17747K02047
12594C19794e8901q4159B54831j15870J2093a09121r3480A9929b9964B33048E3856
12582A13059i2066D02610k4285a04607C02540E1878O7968a02597C62249F4419
12571e9481B30549I5186C8593N2876R6221G8169B7496N1544k1208g2758A37147
$$ y = [183858, 53487, 327986, 7701, -978, -108254, -90591, 353229, 121709, 125931, -276072, 231339, -61311, -15851, -300084, -110387, 269278, -36321, 89190, -68757, -29836, 134854, 374202, 46328, 272920, 82326, 212512, 409660, 136577, -112007, -11422, 294398, 71814, 105000, -106667, 268563, -59166, 265244, 35431, -100668, 59858, 27826, 130943, -126552, -215032, 44254, -68768, -74609, -315665, 240362, 302144, -226921, 122524, 162203, -76820, -72495, -134163, 117747, 319794, -58901, -143060, 254831, 138961, 151054, -109121, -202601, 19929, -29964, 233048, 53856, 113059, -92066, 402610, 378325, -104607, 302540, 51878, 119846, -102597, 362249, 64419, -59481, 230549, 95186, 38593, 91469, 187690, 78169, 27496, 79040, 57832, -72758, 137147]
12559b19525H500L18291G93J06264e1196A14175L3299a16066J2117k25838A38189
12547A2191h0041j57341E7158i0482f877k69923G0223J95809g2941D2805a42000
12535B23473F7048l2176c1283q1590C0941j2009Q4662M9343J84743E9895L5230
12524I5125C7933b60908C2896P5385L9651c65845J77599B12588p1466B6451e9082
12512f863A71578a77042A118N2029d737q7216K3146A47633P836R306g5612G5834
12499a21556B27184b57125C2418a09262j65915A5128d27728I7723a93131F4637
12488C62872Q5652k07092J7833d05801C1680R8984L2911b42520b9925E7110k1292
12477C5818b40360A73633a57162m2655I9130D2205O1918O2186d2068q683A19522
$$ y = [-219525, 8500, 326791, 793, 107057, -51196, 114175, 147474, -116066, -103949, -329787, 138189, 12191, -80041, -237382, 57158, -90482, -6877, -276800, 70223, 266032, -72941, 42805, -142000, 223473, 67048, 34872, -31283, -112873, 30941, 18932, 103594, 152937, 337680, 59895, 95125, 37933, -260908, 32896, 108281, 147932, -365845, -188246, 212588, 141122, 26451, -59082, -6863, 171578, -177042, 1118, 53147, -4737, -91953, -68807, 147633, 155469, 164775, -75612, 75834, -121556, 227184, -257125, 32418, -109262, -275177, 15128, -427728, 97723, -193131, 64637, 362872, 448524, 241432, 259265, -405801, 31680, 130664, 163575, -242520, -29925, 57110, 35818, -240360, 173633, -157162, -199817, 99130, 42205, 104123, 166309, -42068, -50751, 119522]
12465a39493A50324a66817D7117J70689e2764G5868B9466a6934k48723A23527
12454a46166p5335C00725f358j27158j76716A67975D9034I525a06080A64062a34357
12442A98477n628f7065A1721h9592A73331e6598j6837E1789a32749D7880J10152
12431A58032a22601N2031B49900F8250g7200r8511a847A84070d9974A62861J9207
12420A82068L380K40922A60182F2649J66730h2141H6565a97306B00253l2788H0129
12408E9669j8309a13210j30163Q6228j9537d8746E7002a9841B73234a93884E4592
12396A51654b30789G6552L72111b0587o1046A19572a60886c8967A21823E51K14882
12385B15433C9914b18219b8251A76195a43669A64471b11796h0439j77449A28462
$$ y = [-139493, 150324, -166817, 47117, 217806, -52764, 75868, 29466, -16934, -265657, 123527, -146166, -221501, 300725, -6358, -133516, -310232, 167975, 49034, 9525, -106080, 164062, -134357, 198477, 192849, -67065, 11721, -89592, 173331, -56598, -73435, 51789, -132749, 47880, 158032, -122601, -70570, 249900, 68250, -77200, -175711, -1847, 184070, -49974, 162861, 182068, 185448, 426370, 160182, 62649, 229379, -82141, 86565, -197306, 200253, 167465, 80129, 59669, 41360, -113210, -243373, -157145, -176682, -48746, 57002, -19841, 273234, -193884, 54592, 151654, -230789, 76552, 448663, -20587, -81633, 119572, -160886, -38967, 121823, 551, 215433, 39914, -218219, -28251, 176195, -143669, 164471, -211796, -80439, -257888, 128462]
12374d1720j13802R936H6651h7154p8534k4999D10164a88412d3300B54262a7968
12362A53145d02221b6163j0703j99144A46425a98509B88475a83466a2951B49595
12351D54652F7830A9381f3208j7157C479J41405n0759a74067K2182B28479C8138
12339C22695a38390A51498a16089j93892a24227n5029A13619H895J19343Q7120
12329B15358g0937B6915L61831b5437A11717C8552J18448h7232d447A67254b7532
12317B20374c1939F9749b61762g1729c5749j01331D1696H078a61776E9476c8192
12305a25431A11085J57850r7424G1362g1419E9388d0811A34819a34309j7812C5630
12293A42025i283B58582q0196E5039K73301a06045l4815A34363d6036A5074J01672
$$ y = [-41720, -155522, -145586, 86651, -87154, -165688, -190687, 410164, -188412, -43300, 254262, -17968, 153145, -402221, -26163, -36866, -236010, 146425, -198509, 288475, -183466, -12951, 249595, 454652, 67830, 19381, -63208, -80365, 3479, 144884, 94125, -174067, -151885, 228479, 38138, 322695, -138390, 151498, -116089, -309981, -124227, -179256, 113619, 8895, 128238, 215358, -70937, 26915, 388746, -25437, 111717, 38552, 157000, -87232, -4447, 167254, -27532, 220374, -31939, 69749, -261762, -71729, -35749, -137080, 41696, 8078, -161776, 59476, -38192, -125431, 111085, 268935, 171511, 71362, -71419, 59388, -40811, 134819, -134309, -152121, 35630, 142025, -9283, 258582, 178386, 55039, 328340, -106045, -140860, 134363, -46036, 15074, 116746]
12282A16746i7800I1464c618C13378j325a37783B58669a13094C26689D6840J85682
12271B32522J7872e8053o2884I2880a12813K9582K6967B57907q0718b0878B06503
12259F5079J37847a98232A68903Q4130a00357j53176H2750O6499D1951b43925
12248B11844b24360A81340a97467I4945J51491B2046h5594C5975L0389h2754k0882
12237a03636M085A10552h8990a2842B39994r6383a637B22094l7684O4277o7642
12226A81045L40059g4638B49696j02148R1791m7645A4459M7028d9256B92140p4637
12215B17503A00160r834a01393B16013a06413A11816R4071L2577B8266a513G8101
12203A79056L1673r4170O8983o8452M068b9376B50854c906H8351J57227r5807
$$ y = [116746, -97800, 91464, -3618, 313378, 312053, -137783, 258669, -113094, 326689, 46840, 232522, 250394, -58053, -120937, 92880, -112813, -83231, -56264, 257907, 177189, -20878, 206503, 65079, 202926, -198232, 168903, 253033, -100357, -253533, 82750, 149249, 41951, -243925, 211844, -224360, 181340, -197467, 94945, 246436, 22046, -85594, 35975, 66364, -82754, -103636, -99551, 110552, -88990, -12842, 239994, 143611, -1637, 222094, 184410, 248687, 181045, 521104, -74638, 249696, 147548, 239339, 191694, 14459, 61487, -49256, 292140, 217503, 100160, 90326, -101393, 216013, -106413, 111816, 205887, 238464, 28266, -1513, 78101, 179056, 210729, 116559, 185542, 117090, 121158, -29376, 250854, -3906, 88351, 245578, 149771]
12192A49771J65340l4373e8392A55844o2070c6299F2992a08631B54541R8344I8253
12180d1247G4094J20883B7946J83806m128p9993l4962c8434A45563Q775R3906
12169B48244k2303J56187B9323L9395c9028G8831R8932J70816b9232o1001A83696
12157A071J2414a3138C49265j72823l7682o1403d43665B58647n9285h5450a7862
12145A21938L78562j52711a12300A18003J43669L3299A24440h0967A27523D0965
12134B1953J12598M8179H8321k5680b99851B3610b44980h4173c2779A00411J46740
12123B47151a12621j11282a3663r2932j5531B67182a5658B80698B8952J58974
12113A87926J92410h6084B15985A498h3786l5480B92724c8093d5o736n720A80535
$$ y = [149771, 315111, 280738, -58392, 155844, 93774, -36299, 62992, -108631, 254541, 352885, 98253, -41247, 74094, 194977, 27946, 211752, 207624, 127631, 92669, -38434, 145563, 154338, 248244, 225941, 382128, 29323, 68718, -39028, 78831, 177763, 348579, -29232, -90233, 183696, 1071, 13485, -13138, 349265, 176442, 138760, 77357, -443665, 258647, 199362, -85450, -17862, 121938, 500500, 347789, -112300, 118003, 261672, 294971, 124440, -80967, 127523, 40965, 21953, 134551, 182730, 88321, 62641, -299851, 23610, -244980, -84173, -32779, 100411, 247151, -112621, -223903, -13663, -106595, -122126, 267182, -15658, 280698, 28952, 187926, 380336, -86084, 215985, 1498, -83786, -119266, 292724, -38093, -45, -6781, -12501, 180535]
12100C20239f1572G7527C1233b07596A95495b45702j18472b2460l01737C53185
12089i1658q4176C40285b32343d0558B74331B6028M4993O5856c55893a2519N176
12078g343k00116f4510j35053g5404A90862c2443g477F45311P94035k46218g029
12066A83775K01010a27493Q354G1184a56797E1251a05477l38669A62217m5848
12056A16369Q5040a7429A46472F1289h2142G0415a6156B28556Q3915e6900A67439
12044a16400b1255k94328c4869j57976B6645J30130i0329j4418L9552p5854L9742
12033a01307m17717f6545B36993b18363E2313Q9612E9758a84615f9093A1883Q7530
12022I9413a17157D08910j92688c20131C4863d5156I1296b26833C30482a04833
$$ y = [320239, -61572, 77527, 31233, -207596, 195495, -245702, -364174, -22460, -324197, 353185, -91658, -175834, 340285, -232343, -40558, 274331, 26028, 71021, 136877, -355893, -12519, -7343, -207459, -64510, -199563, -75404, 190862, -32443, -7477, 645311, 1439346, 1193128, -7029, 183775, 384785, -127493, -119139, 71184, -156797, 51251, -105477, -444146, 162217, 116369, 201409, -17429, 146472, 61289, -82142, 70415, -16156, 228556, 312471, -56900, 167439, -116400, -21255, -315583, -34869, -192845, 26645, 156775, -90329, -104747, -65195, -141049, -101307, -519024, -66545, 236993, -218363, 52313, 141925, 59758, -184615, -69093, 11883, 99413, -117157, 408910, 216222, -320131, 34863, -45156, 91296, -226833, 330482, -104833]
12011H5383f2090J1550J5504c235A49596m3941R5813a04243A46897i1615a6800
11999h1205k09433b8780I7945c9355A451J22531f3588A11344H247L50409a02395
11987f0215p8007d619n9319k30223d0208B87530h3109p1918a3604E640O674J02818
11975A15132b72750J23979a8912A04080K23847H0952J15701b28901c0336A27723
11964A82802E7991a2867j82682A33119c06647G4795d9056G700a24765b8669H9666
11952a3024k64500Q1964l0985q8106h104o4228A11505a78962B32321n7313f0080
11940A58953g9791q1820F1411h5577j60968F8352a70789C8673J3821J59458B7501
11928E8696I35b31861j39584A87627p8934h0469A93348K1563c52571F2183b26285
$$ y = [85383, -62090, -50540, -35036, -3235, 149596, 105655, 201468, -104243, 146897, -91615, -16800, -81205, -290638, -28780, 97945, -39355, 1451, 123982, -63588, 111344, 8247, 358656, -102395, -60215, -138222, -4619, -63938, -294161, -40208, 287530, -83109, -155027, -13604, 5640, 12314, 115132, -272750, -148771, -18912, 104080, 327927, 80952, 196653, -228901, -30336, 127723, 182802, 57991, -12867, -195549, 133119, -306647, 74795, -49056, 7700, -124765, -28669, 89666, -13024, -277524, -195560, -226545, -314651, -8104, -72332, 111505, -178962, 232321, 175008, -60080, 158953, -79791, -161611, 61411, -85577, -246545, 68352, -170789, 38673, 52494, 211952, 27501, 58696, 935, -231861, -371445, 187627, 108693, -80469, 193348, 214911, -352571, 62183, -226285]
11916b97058f3345A27603m5419l8571P9400a94840b9953C16544q7261c01125Q8230
11905b12895l0675a8136j10882B55305H6767K52964G706h5137B1524a22257L6214
11894h6043A26626F945J7400a67425a0153k24698n3237h358B0141a08307A065
11882h1230j55350O4848C4072g4775k90656F8388d9164j80716A69149a2908A5747
11870f5785B34099a96353f2619N66B8688a24145l911C7497i4428j7899A13107
11858D55361b10022f0507j59118I1872m3309c07166a51646D4066K82229b30767
11847a53667a2372l12597I1656J27291b9164k7323j89867A80290e7156A4701b27602
11835i1398p156l73528A55349L4255b65011P9418o4449a292j64351b0462k9977
$$ y = [-297058, -63345, 127603, 82184, 43613, 123013, -194840, -29953, 316544, 229283, -301125, -212895, -243570, -18136, -129018, 255305, 86767, 339731, 7706, -85137, 21524, -122257, -86043, 126626, 6945, 24345, -167425, -10153, -234851, -288088, -8358, 20141, -108307, 1065, -81230, -236580, -171732, 34072, -74775, -365431, 68388, -49164, -229880, 169149, -12908, 15747, -65785, 234099, -196353, -62619, -62053, 28688, -124145, -128056, 37497, -94428, -112327, 113107, 455361, -210022, -60507, -219625, 91872, 48563, -307166, -151646, 44066, 326295, -230767, -153667, -12372, -324969, 91656, 218947, -29164, -56487, -246354, 180290, -57156, 14701, -227602, -91398, -98554, -472082, 155349, 189604, -265011, -185593, -250042, -1292, -165643, -20462, -50439]
11824e0439B32143F8339b8875j42345C21330a54801I0286a32108F350a08585M1352
11813f7233o3081j87M4819B01229r5128A5751a68532q7987b1269E8312h8094J7624
11801g0470A74755a89389o2273I8828D1667O9074L36283c9601H0369g1469k06354
11790b77823A19954b70836G2736k7321J44099r615j4937a02039A08717b12439
11779A27435L5498a51213a1245j4354j73573B80041B6236c6483A18539B9754b92852
11767e9108A73553a87499D0976a15499f809k16938A5042a25077A22329P4821H4811
11755b10963J02071k9443A6409d56209i5717A9040c59447a49455e8612j9212K9890
11744d7934j39744B57930b18447H1553J2969b2791H0256J0696L3676J33684j00584
$$ y = [-50439, 232143, 68339, -28875, -171220, 321330, -154801, 90286, -132108, 6350, -108585, -67233, -130314, -130501, -85682, 201229, 106101, 15751, -168532, -256519, -21269, 58312, -88094, -70470, 174755, -189389, -251662, 98828, 41667, 110741, 447024, -39601, 80369, -71469, -277823, 119954, -270836, 72736, 45415, 189514, 179899, 164962, -102039, 108717, -212439, 127435, 162933, -151213, -11245, -25599, -199172, 280041, 26236, -36483, 118539, 29754, -292852, -59108, 173553, -187499, 40976, -115499, -6809, -223747, 15042, -125077, 122329, 197150, 84811, -210963, -108892, -138335, 16409, -456209, -95717, 19040, -359447, -149455, -58612, -77824, -47934, -187678, 257930, -218447, 81553, 94522, -22791, 80256, 90952, 124628, 258312, 157728]
11733A57728J03704E1761j4542K6058J4717O8524D4343N9897J2401g918A30184
11721C1733L9512d4152k23783A27296E173a69818A23203o812J56621j27748g9878
11709H3648P8317G5395P9477f9474B94909A29512J65081c19713D9457J76605e7081
11697g3123E3356J24370c18842A29219a40857E3097J41039C4398C283b02324B0128
11685A14414A506b41954d6828B63627j28069o6034P9138a81014b2562D2007b41849
11673d5709n6487q8308B1259K0847e647J370C0657L5863c70761A25652c03799
11661f3921H7731J08230F5971J32487e2656I2490J60199a15210B24718F4105R0469
11650A54574C9648c2339a040H3150J2099L27119i8159J4557B21156C4620R8189
$$ y = [157728, 261432, 51761, 37219, 63277, 77994, 146518, 44343, 104240, 116641, -7918, 130184, 31733, 71245, -44152, -267935, 127296, 5173, -169818, 123203, 116391, 273012, 145264, -79878, 83648, 161965, 75395, 154872, -69474, 294909, 129512, 294593, -319713, 49457, 226062, -57081, -73123, 53356, 177726, -318842, 129219, -140857, 53097, 194136, 34398, 3283, -202324, 20128, 114414, 1506, -241954, -46828, 263627, 135558, 69524, 148662, -181014, -22562, 42007, -241849, -45709, -102196, -190504, 21259, 42106, -5647, -4277, 30657, 66520, -370761, 125652, -303799, -63921, 87731, 195961, 65971, 198458, -52656, 92490, 252689, -115210, 224718, 64105, 154574, 39648, -32339, -1040, 83150, 95249, 422368, -98159, -83602, 221156, 34620, 132809]
11639A32809P2371Q2754a84574E8867b33885e6508j1216p8084j34920A42794C7411
11627G9036a63156A42919a03622K2225A68642J77599c9622A8139J46603n3320
11617A11422l5907a70756a6043F9750c6787p7189A87726q9427b85917E3892a9037
11605A43379f8793p5364H2201O2630K47392h7482j50619A24373J23535G8633h7828
11593A0432R8503a4062B67303J46002E9738L6924J826J30368f9567B1302K36615
11582B57917K2712Q1087i8050A7119M8761M1543b03397C06422f3430r41F80652
11570A50617j6094a91144A01853m5404L04835r670a71341r7762A70211a29692
11559B24432a39618A28804J63244l7496f6270A05868N2849f389k59514L5010f6451
$$ y = [132809, 205180, 287934, -184574, 58867, -233885, -56508, -67724, -145808, -280728, 142794, 37411, 79036, -163156, 142919, -103622, -81397, 168642, 346241, -39622, 18139, 164742, 111422, 75515, -170756, -16043, 69750, -36787, -113976, 187726, 98299, -285917, 53892, -19037, 143379, -68793, -144157, 82201, 144831, 392223, -87482, -238101, 124373, 247908, 78633, -87828, 10432, 108935, -14062, 267303, 413305, 59738, 96662, 98488, 228856, -69567, 21302, 257917, 280629, 361716, -98050, 17119, 65880, 107423, -203397, 306422, -63430, -64371, 680652, 150617, 134523, -191144, 101853, 56449, 361284, 351614, -171341, -269103, 170211, -129692, 224432, -139618, 128804, 292048, 254552, -66270, 105868, 158717, -6389, -265903, -230893, -66451]
11547e188E0711M9779g4561m5548a7058G6899b27232E4753L65200A3057P9039
11536I2096a63796E1912L5281K19548b8959E7434K21361C5163J38596B0944K11400
11525B32344g4440A40085p830J73703D4295O3821D0540g9073a8932A20737C6647
11513b8497B38793P5661l9113j03892c45660C32883C0908L48507P270H2934Q5456
11502A68390R1275a23773E07591j83161A45577P1033m8497H0910g8000D1142a0382
11490G4556a82454P2011C41999A02474Q8263L4425c50439e0810B49572A01655
11479C79258j40422H1501a06576F9592M7233C2699j364O4617J552f3895A12191
11467A76148p2133J01246J07648j14165n2485p1771b5546m0254m4746l751B70575
$$ y = [-5188, 50711, 100490, -74561, -120109, -17058, 76899, -227232, 54753, 419953, 13057, 92096, -163796, 51912, 87193, 306741, -28959, 57434, 278795, 35163, 173759, 20944, 232344, -74440, 140085, 132255, 305958, 44295, 108116, 40540, -79073, -18932, 120737, 36647, -28497, 238793, 314454, 275341, 171449, -345660, 332883, 30908, 379415, 386685, 82934, 168390, 259665, -123773, 507591, 324430, 145577, 216610, 168113, 80910, -78000, 41142, -10382, 74556, -182454, -110443, 341999, 102474, 190737, 225162, -350439, -50810, 249572, 101655, 379258, 238836, 81501, -106576, 69592, 116825, 32699, 31335, 95952, 97504, -63895, 112191, 176148, 104015, 205261, 312909, 198744, 146259, 74488, -25546, -65800, -110546, -114297, 270575]
11455a36000e6894H1341a79221o6334A14261l9276L95521a22050N3366A10701
11444C2844a18883A63350L01947e8795p7897B03822b81722J27474B26924M67267
11434F94191E2902J54757h7876b8642j79558e1470g974j57701k05846a08544A97732
11422a30990A79688l4373l9987K1913b68099H6212a34185D1038B0407b75821R4232
11411a81589A05386l6152c38767c2031A81105L1844j7728n8306J24879h1900E43163
11399F5706J60368A2819h7279A94309H7357J46869d7516G3153a17897m8456M5853
11388a20500L7246C02208a30876D4627R0842d6588j49106i7312M5245C74840M253
11377C79093a36055k6767A30283A4215a57605M0469b1821p5135n4632P2530F5123
$$ y = [-136000, -56894, 81341, -179221, -245555, 114261, 74985, 470506, -122050, -68684, 110701, 32844, -118883, 163350, 465297, -58795, -136692, 203822, -281722, -154248, 226924, 694191, 52902, 207659, -87876, -28642, -208200, -51470, -7974, -165675, -371521, -108544, 197732, -130990, 179688, 145315, 105328, 127241, -268099, 86212, -134185, 41038, 20407, -275821, -181589, 105386, 69234, -338767, -32031, 181105, 212949, 195221, 136915, 261794, -81900, 543163, 65706, 226074, 12819, -87279, 194309, 87357, 234226, -47516, 73153, -117897, -166353, -120500, -83254, 302208, -130876, 44627, 135469, -46588, -195694, -97312, -52067, 374840, 379093, -136055, -162822, 130283, 14215, -157605, -117136, -21821, -96956, -151588, -79058, 65123]
11365H1406f3611E969b60863B2705o150i0485M1073F116O2650a03626B17183e2054
11352h1733r5541G1279O779b60823p8905k1847a18347a1874l6987A04675K27911
11341C32586B2007c0645A05069D0304P6573F518J21179c82428O3805j68265C23766
11329a71432g5301j20235A12305e5486b3788B20304J42379i4520M1894b1216A3754
11317E0342j3898J15565b50793A25130a41381C8645a31164k23299B39428d671
11306C03236a74519A83130A8415d905m30797B3362a26647j2421A08617K4169O1650
11295A94436a12969B38539a06672j3269o043A37737b94690A51244A6188b12266
11284F4969R6124d6460B22067j04356e6757j4323j64569J06564H7313f7037j69833
$$ y = [81406, -63611, 5969, -260863, 22705, 16555, -90485, -49412, 6116, 68766, -103626, 217183, -52054, -81733, -177274, 71279, 78058, -260823, -339728, -361575, -118347, -11874, -48861, 104675, 332586, 22007, -30645, 105069, 40304, 116877, 6518, 127697, -382428, -318623, -486888, 323766, -171432, -75301, -195536, 112305, -55486, -23788, 220304, 362683, -94520, -52626, -21216, 13754, 50342, 36444, 152009, -250793, 125130, -141381, 38645, -131164, -354463, 239428, -4671, 303236, -174519, 183130, 18415, -4905, -435702, 23362, -126647, -139068, 108617, 132786, 194436, -112969, 238539, -106672, -119941, -125984, 137737, -294690, 151244, 16188, -212266, 64969, 161093, -46460, 222067, 117711, -56757, -71080, -235649, -129085, 87313, -67037, -236870]
11273b36870A06916b35986e1455j74393B6454a85681h3415j61541g37A18137B9835
11261d06866a08675m2547K7477A35727C6844L15407j40095d49466G5873i1390
11250f1283l7227A49739D7516b24968C45575I9857a6657k9124k08169O2808A11965
11238b00659A2511a09289c4577j35135l6651c443j27751k18L1453F4207j9366
11227D4841b63127I754O0542d8738j31177j26237a0744B18216e41741A8824a14148
11215c16544f3968r4673D06136d5482H9577j8601J34087d4733n7152j67502J17645
11204a51742A4278R5475a4120j82959P5025A47017Q6838c7101m3433G5398h3520
11192D5219C473e4274j16789A46554e7802J8812A31558c2530A32724F0140g2505
$$ y = [-236870, 106916, -235986, -51455, -225848, 26454, -185681, -83415, -244956, -737, 118137, 29835, -406866, -108675, -151222, -123745, 135727, 36844, 352251, 212156, -449466, 75873, -91390, -61283, -98510, 149739, 47516, -224968, 345575, 99857, -16657, -45781, -253950, -191142, 111965, -200659, 12511, -109289, -34577, -169712, -206363, -3443, -131194, -131412, -99959, 64207, 44841, -263127, 9754, 70296, -48738, -179915, -306152, -10744, 218216, -541741, 18824, -114148, -316544, -63968, -158641, 406136, -45482, 89577, 70976, 205063, -44733, -101885, -269387, -151742, 14278, 109753, -14120, -197079, -122054, 147017, 233855, -37101, -80534, 75398, -83520, 45219, 3473, -54274, -171063, 146554, -57802, -38990, 131558, -32530, 132724, 60140, -72505]
11180c0834o0343c9766j1773n6129E8080L03851j58127a36215g25n1984B4947
11168b68863B74128C7950d2496k24155O0235B33976a24306e4161k00452E76408
11157D8274K6571k9885i0586C61478d5587J2954E5114K45432e0343j09564p3777
11146b33684J07505k621J0615k9713g0138d513A3425a65949I2516e5894H239J92625
11134B00864d41790K17284A90012n7639J45214j24626c2005B46005a58232A67308
11123e0094l0338i35j1772B32258H0192k4465K26446J6301J31145A91143e1370
11111b84816C75825l2341Q4659A50194L8815J48164f1641b4124j7621A58796K09747
11100C68543e1270p70B03457B1538K44597P8895M1955j49777b71595A12800a98420
$$ y = [-30834, -91177, -39766, -51539, -107668, 58080, 361931, 203804, -136215, -725, -52709, 24947, -268863, 274128, 37950, -42496, -266651, -206416, 233976, -124306, -54161, -254613, 576408, 48274, 74845, 44960, -90586, 361478, -45587, -32633, 55114, 300546, -50343, -159907, -233684, -126179, -128800, -118185, -147898, -70138, -4513, 13425, -165949, 92516, -55894, 8239, 200864, -441790, -224506, 190012, 132373, 277587, 152961, -32005, 246005, -158232, 167308, -50094, -80432, -935, -12707, 232258, 80192, 55727, 282173, 298474, 429619, 191143, -51370, -284816, 375825, 343484, 428143, 150194, 189009, 337173, -61641, -24124, -41745, 158796, 368543, -51270, -52040, 203457, 21538, 266135, 345030, 386985, 237208, -271595, 112800, -198420]
11088B89117A21645a51099g2377D8254J13594N4285a6465B88034d3078B49628
11077c072k15693C01775n7702P1722P9326m3746j21620I3411o321L64590J67075
11066F18755j75655M1554j88602k8535o8791K52835j35163l2854L25728B68369
11055F59732k60371K7244J37183L20626K5054l22496J86409k4925j57771N3530
11045F44215k38417L45073j60434J85591j19115P3047j54942O1020j03010n8171
11035D74857K10709j97378j52381K65538k17286L60890K01059j99488j72281j31686
11025D42553O4046R6003J19988k06214j89116J34249L71261k87235j16903J31095
11015E59727R279J447B59213K43699J62969m8105j88782M8581K86099k5645n8194
$$ y = [289117, 121645, -151099, -72377, 48254, 161848, 216133, -16465, 288034, -43078, 249628, -3072, -218765, 301775, 244073, 315795, 395121, 351375, 229755, 93411, 87090, 451680, 618755, 443100, 484654, 296052, 267517, 198726, 451561, 316398, 283544, 609272, 268369, 659732, 399361, 426605, 563788, 884414, 909468, 586972, 773381, 748456, 590685, 644215, 405798, 750871, 590437, 776028, 656913, 729960, 575018, 636038, 533028, 474857, 685566, 488188, 335807, 601345, 384059, 744949, 946008, 746520, 574239, 442553, 506599, 602602, 722590, 516376, 327260, 461509, 832770, 545535, 428632, 559727, 569006, 570453, 259213, 502912, 665881, 617776, 428994, 477575, 763674, 738029, 679835]
11004F79835k42148J42295K7346r2491p8842J20735K5306k67627O53438j6076
10994I51771D11832J1193L11830L41054D15716K57964J95543k23200M59958k25683
10984H80298N5256K81847E59581M84692j18763L10389L37797q3477p0700O85999
10974B105518N1050J32037M68726L9956k03594l14232K16543N6945m46688l39594
10964A766667j20343L75537l69352j8922k31920K40431R7882P6429l9449j53111
10954A623849k35976l9012k09108j82169j82118C69786K64779q5918k44369J13906
10944D18184C0515K77696K95473A54978K44285a09034n0289B49285o3975a10255
10933F2381f2643B30041H8177b32399B73889a10778B13382O5639d0998C8972f7891
$$ y = [679835, 437687, 579982, 607328, 514837, 435995, 556730, 582036, 314409, 967847, 951771, 411832, 423025, 734855, 1075909, 415716, 673680, 869223, 646023, 1105981, 880298, 935554, 1217401, 559581, 1044273, 925510, 1235899, 1573696, 1490219, 1419519, 2105518, 2156568, 2288605, 2757331, 2797287, 2593693, 2279461, 2496004, 2552949, 2106261, 1766667, 1646324, 2021861, 1652509, 1633587, 1401667, 1642098, 1739980, 1816409, 1776960, 1623849, 1387873, 1348861, 1139753, 957584, 775466, 369786, 634565, 548647, 304278, 418184, 30515, 308211, 603684, 154978, 399263, -109034, -159323, 249285, 185310, -110255, 62381, -62643, 230041, 88177, -232399, 273889, -110778, 213382, 279021, -40998, 38972, -67891]
10921C8643L7534b53047c8130j15969e8014r9582r4471B92723k4506o4076d6951
10909A69493L7221I6827J36048I208d1930B59827b107B25595b74869f0860j82080
10898b42940B72069C543b45738q504a23121A0493a55957B60287F4877a23633e9821
10886a71790j1756C3541J805N3079J9434a819k61580N4909N2580i732B48602j09089
10874A39513b80618D2929P8019a70767C67132C0434a30759I1936h4474c0682a0113
10862f3673C18695a97468i5565G7736b40811j8401a09452M8493A99755a00416
10851a44796D91018b1526j45875J9016j89961J03480Q1112k49238c7586j87918
10841b25504G3763a11750l6090d2085A90403a19546e0843A07833i4310O106o696
$$ y = [38643, 76177, -253047, -38130, -154099, -58014, -157596, -252067, 292723, 268217, 204141, -46951, 169493, 206714, 96827, 232875, 9208, -41930, 259827, -2107, 225595, -274869, -60860, -242940, 272069, 3543, -245738, -254242, -123121, 10493, -155957, 260287, 64877, -123633, -59821, -171790, -183546, 33541, 35346, 88425, 107859, -1819, -263399, -208490, -155910, -9732, 248602, 139513, -280618, 42929, 120948, -170767, 367132, 30434, -130759, 91936, -84474, -30682, -10113, -63673, 318695, -197468, -95565, 77736, -240811, -259212, -109452, -60959, 199755, -100416, -144796, 491018, -21526, -167401, -148385, -338346, -234866, -153754, -402992, -37586, -225504, 73763, -111750, -147840, -42085, 190403, -119546, -50843, 107833, -94310, -88204, -94900]
10830i4900A60429h3044D6652a91934H1504Q5151b8560B79839A17118E278c64694
10818B32627b69678H3442G502L3306j3438c85380a64367c765j65527e1748l10477
10807c62225J59683N5678k02788a0550j41203B86999c12539a36188A1793J3112
10797B4905a74636k31987B2379a08606f142n0329A96347d6864l84o4915J6562
10786i5601A46085K11306c11561A2642a69881c5883m0261k1l7242M3552o2698
10775a32553L8153j4640j90475C37923C6161g1709k280A31589a78548P2313k81617
10764c87852a02283l4302a8721A35981A3847K19667B8208K6461j4670b69154g1505
10752A34768b85731G3815P1973b07980H2739a19347d2981k854k2852A68568c6201
$$ y = [-94900, 160429, -83044, 46652, -191934, 81504, 166655, -28560, 279839, 117118, 5278, -364694, 232627, -269678, 83442, 7502, 40808, 27370, -385380, -164367, -3765, -169292, -51748, -362225, -202542, -146864, -349652, -10550, -151753, 286999, -312539, -136188, 11793, 24905, -174636, -406623, 22379, -108606, -6142, -56471, 196347, -46864, -47248, -112163, -95601, 146085, 357391, -311561, 12642, -169881, -35883, -76144, -76165, -113407, -69855, -132553, -94400, -109040, -299515, 337923, 36161, -71709, -73989, 131589, -178548, -106235, -387852, -102283, -136585, -18721, 135981, 13847, 233514, 28208, 54669, 39999, -269154, -71505, 134768, -285731, 73815, 145788, -207980, 82739, -119347, -42981, -45835, -68687, 168568, -36201]
10740A21309R673b82643a3717A34269m4630a54825C44096j25485n1898d2469k11977
10729b54446e9098F010d3520F9756Q5320a00144a3176j88578q1595C6930a91466
10717b81494C60562d69615a11690c0569E1020i3981c1767A80638a45783d5581
10706B8926O4641J64253i6446j03539f5116B03609b50848c3940j24084O410f7242
10694g1014r8594m1881d9158A1866b03368G6102a66271f2197j9276k69399J49277
10683b01595B8914M6476q194J79477a61580N8390B509N3180c2868I7030c04965
10671c9152A52854N9398G6591c42654K3531J07005b8242O824k73146a14396j68011
10660b82407i0795j51204h6777j79907d2627k6913e342m1629A6275b18024a0793
$$ y = [121309, 130982, -282643, -13717, 134269, 89639, -154825, 344096, 218611, 166713, -42469, -254446, -59098, 6010, -43520, 69756, 155076, -100144, -13176, -201754, -283349, 36930, -191466, -281494, 360562, -469615, -111690, -30569, 51020, -93981, -31767, 180638, -145783, -45581, 28926, 93567, 257820, -96446, -199985, -65116, 203609, -250848, -33940, -158024, -151614, -67242, -71014, -169608, -211489, -49158, 11866, -203368, 76102, -166271, -62197, -81473, -350872, -201595, 28914, 75390, 67196, 246673, -161580, -103190, 2509, 55689, -32868, 97030, -304965, -39152, 152854, 212252, 76591, -342654, -319123, -212118, -28242, -21418, -294564, -114396, -282407, -90795, -241999, -86777, -266684, -42627, -69540, -5342, -46971, 16275, -218024, -10793]
10648A26434a70225d850B64211I3969M2962c1578B94077j37322b23967h6848k74589
10637c61437A24589M8947h4598k18906J12194j3602f625B062R2185i0000Q473
10626h1527l127R573b440j75132G191b75517D8564a84331O4023k2107o4055d9761
10613G7029J61658f5561p5723I6561M2530J50411e916j10731I0931C6273b4497
10601a48519F8667P890b97083a6986k14923e7098b4760o4100j55773f6383D1509
10589c2857C6227a77242P5722j19144c5438H1588b15286I3142a16167j79259j40400
10578d35826H5860b4567D2058b9906j96594A06871M6286K4769a18276k02942d9090
10566h999m23134J13005c1134q9873B02995b18392g3669j54699l2019Q7318Q4724
$$ y = [126434, -170225, -4850, 264211, 93969, 136931, -31578, 294077, 156755, -223967, -86848, -361437, 124589, 173536, -84598, -303504, -191310, -204912, -6625, 2062, 94247, -90000, -81527, -84654, -75081, -2440, -177572, 7191, -275517, 48564, -184331, -120308, -142415, -206470, -49761, 77029, 238687, -65561, -141284, 96561, 139091, 289502, -5916, -116647, 90931, 36273, -24497, -148519, 68667, 76557, -297083, -16986, -231909, -57098, -24760, -88860, -244633, -66383, 41509, -32857, 36227, -177242, -101520, -220664, -35438, 81588, -215286, 93142, -116167, -295426, -435826, 85860, -24567, 42058, -29906, -226500, 106871, 153157, 177926, -118276, -321218, -49090, -8999, -432133, -319128, -31134, -121007, 202995, -218392, -73669, -228368, -260387, -173069, -88345]
10555h8345J7179C135O2768f2216a5576d764I0418a47720B25502i9760C86861
10543F5821b38583B26484b5260B84587b23327A61432b9931n3965B2540K1568b77352
10531a68754L5700k07717A54836J81167a37588a2534E8811a02009d0032C31390
10520A47439B7911J69542D931c50081c8200j41722D4600c8273l44661d995A06888
10508I8112K20705A41468c38536A20662l3374b30676L9212A78331B2933a24797
10497a01380a0012j45994c1546o8054M5643a4754f393D6706a72806G1904k0905
10486E0999a08713c6401A59899A1975M80639k04718l4619K32319A52864B1600
10475b30543B7159M5415R7596L0474a11950B85338F2635K19117C0668b96611A49148
$$ y = [-88345, -71166, 3135, 65903, -62216, -15576, -4764, 90418, -147720, 225502, -99760, 386861, 65821, -238583, 226484, -25260, 284587, -223327, 161432, -29931, -83896, 22540, 44108, -277352, -168754, -133054, -340771, 154836, 336003, -137588, -12534, 58811, -102009, -40032, 331390, 147439, 27911, 197453, 4931, -350081, -38200, -179922, 44600, -38273, -382934, -4995, 106888, 98112, 318817, 141468, -338536, 120662, 87288, -230676, -191464, 178331, 22933, -124797, -101380, -10012, -156006, -31546, -99600, -53957, -14754, -6393, 46706, -172806, 71904, 50999, -108713, -36401, 159899, 11975, 492614, 287896, 253277, 485596, 152864, 21600, -230543, 27159, 72574, 170170, 200644, -111950, 285338, 62635, 281752, 30668, -296611, 149148]
10463f7974j75752b1586m3312j14732j60555i4107l9017A55939C1722f0704a0432
10451f3534d60A23538K13446I9301a22217A94346a17931j5108A80027h5152e557
10439B61782a33048N1977j0665A0445c8623D7567j0531b00669G3378b833l07827
10428c10660n0065B5421a94912I5650O6770a62284C51666a47128d2593H3400I274
10416B98457B9570a67697g6635A8209J77839i633A02238k0537b8481j22871p2277
10405b23629B88199A26317c9567j23645C2448R3682e1362j32029g2628D1409b841
10393I7964k6805g9842i484C26625F5121g0006k19323A11788K13323B0855J76096
10382A96951l6198j3324g7053h21A08629J6361K03536L4760c5803o6590B02591
$$ y = [-67974, -243726, -21586, -64898, -179630, -340185, -94107, -133124, 155939, 31722, -60704, -10432, -63534, -460, 123538, 336984, 99301, -122217, 194346, -117931, -133039, 180027, -85152, -5557, 261782, -133048, -81071, -91736, 10445, -38623, 47567, 37036, -200669, 73378, -2833, -310660, -360725, 25421, -194912, 95650, 162420, -162284, 351666, -147128, -42593, 83400, 9274, 298457, 29570, -167697, -76635, 18209, 196048, -9633, 102238, 81701, -28481, -151352, -223629, 288199, 126317, -39567, -163212, 32448, 126130, -51362, -183391, -72628, 41409, -2841, 97964, 71159, -79842, -9484, 326625, 65121, -70006, -289329, 111788, 325111, 20855, 196951, 160753, 147429, -77053, -821, 108629, 124990, 328526, 363286, -35803, -102393, 202591]
10370E49025B16373K92142q5711q1464K87922j83610j44433Q8102A30041M19687
10360E49728k03299I7121Q8883A8108b08525A55661K01726M6297j16993J10679
10350C97370K44776Q4176A86521e6762D24143j54125J2696K1193A30720K142o1643
10339G1219K42677A50622c5329j43506j6803A27701a54804A18060J34379e5507
10328a63317C50226D1031J9917J08353J82755i2844C54560D6478R0375c9226A43273
10316B95387K09900h6608E61156a49879l33832C88252a41070L4899l2273m5224
10306a83668A09902b87871b2403A06706a85402j3509c9519G4056L15699f4817
10295C58276c0838C24263a35366E5527J99598O4891F6102k7378j5406a24422q5224
$$ y = [549025, 216373, 508515, 422804, 341340, 629262, 445652, 301219, 389321, 130041, 549728, 346429, 97121, 186004, 18108, -208525, 155661, 357387, 403684, 286691, 397370, 642146, 726322, 186521, -56762, 424143, 270018, 282714, 303907, 130720, 132862, 71219, 313896, 150622, -35329, -178835, -195638, 127701, -154804, 118060, 252439, -55507, -163317, 350226, 41031, 60948, 169301, 352056, -92844, 354560, 46478, 136853, -39226, 143273, 295387, 505287, -86608, 561156, -149879, -483711, 388252, -141070, -106171, -138444, -183668, 109902, -287871, -22403, 106706, -185402, -198911, -39519, 74056, 389755, -64817, 358276, -30838, 324263, -135366, 55527, 255125, 320016, 66102, 38724, 23318, -124422, -209646]
10284b09646A47839D2080J31322c786k03972A93440d0967n054j68190C37221j19748
10273B17473d15183E9089e9376A77484E7482i6332j97333a2656D24966A49790
10262B34930A04413O6203J05659J3574R7293p3941J7973p1255A11368N2495b230
10250a9356A93450c4162A16855B7833M19186A1588a70341j53566A12809a55379
10239A26833Q3287B3297f1954o9307q4278A64753C6475a20766C63680b81288A16155
10227b80140Q6942R4148c8741A42761P352F4722f8013c2476A96208a97566j04321
10216c01887h9781a4206n2547a5385k98678G325h7719A24009M2261a35288G4768
10204A17234f176A65981b55319q8370N1698F6866b49C5061J08534A8018c45661
$$ y = [-209646, 147839, 42080, 173402, -3786, -207758, 193440, -40967, -46021, -214211, 337221, 217473, -415183, 59089, -59376, 177484, 57482, -96332, -293665, -12656, 424966, 149790, 234930, 104413, 170616, 276275, 289849, 387142, 313201, 331174, 259919, 111368, 163863, -2230, -19356, 193450, -34162, 116855, 27833, 447019, 11588, -170341, -323907, 112809, -155379, 126833, 210120, 23297, -61954, -131261, -215539, 164753, 36475, -120766, 363680, -281288, 116155, -280140, -193198, -99050, -38741, 142761, 150113, 64722, -68013, -32476, 196208, -197566, -301887, -89781, -14206, -66753, -15385, -314063, 7325, -87719, 124009, 166270, -135288, 74768, 117234, -6176, 165981, -255319, -343689, -291991, 66866, -249, 35061, 143595, 18018, -345661]
10192B92942a80174Q3584L0773l51414a9618B5171a9617r8517j14511Q5249H4204
10180a63320k2109B7655b90718C4362b50924m0994i9197Q433J2597k83212b8011
10168d24684h8183b4823k65663B23830a28202B95123d1243B01569O4523F8762
10157H0149B7536R1884c64126E489f5965j60908R4990A95453l3809f8891j07212
10146a76103m5203O8093J6022F82K479J41975A2727h5975A43000M927J44274a35679
10133b3380H6835b31025a12217J0254B2003a18151c1729F7251O0075l3877K29836
10122C23285c20826C14864a56456G0464l2502j0902J5291j4256J0302e6456j96762
10111b53218J25082A53586p3227c01326J45516B0780b78585B87183f6294p7720
$$ y = [292942, -180174, -96590, -65817, -417231, -19618, 25171, -19617, -118134, -232645, -147396, 84204, -163320, -185429, 27655, -290718, 34362, -250924, -291918, -99197, -90764, -78167, -361379, -28011, -424684, -88183, -24823, -290486, 223830, -128202, 295123, -41243, 201569, 266092, 68762, 80149, 27536, 119420, -364126, 5489, -65965, -226873, -131883, 195453, 161644, -68891, -176103, -221306, -153213, -137191, 682, 3161, 145136, 12727, -85975, 143000, 147927, 292201, -135679, -23380, 86835, -231025, -112217, -101963, 22003, -118151, -31729, 67251, 127326, 93449, 323285, -320826, 314864, -156456, 70464, 37962, 27060, 42351, 28095, 38397, -56456, -253218, -128136, 153586, 80359, -301326, -155810, 20780, -278585, 287183, -66294, -144014]
10101a44014j66252e3294l04766B1559b99570a9707A54608h0041A30614f7163
10090a58685c0192m1714E2135a51665E4856J03805G4265g843A55561c88392F7682
10078a65132B45152A853d29792e6902I3158d0229j15579H7232a5294C96161b23266
10066B10171H8381J18832B0466J984e18580h8339H7046k9738b90972b5837B07448
10054b12608A62790a83773k9205D8367b00521j2526k14454f9237j33468p8021
10044b80726A93643c352E3321a75061A24337a34482k7949j66447a43023L1952
10034a11071k6868N1868k02439J08818N1784d2899C09482j50061o8118c52882
10023a22706f0021k10596p0181F689b46814k9032a01133k21234N1198a2689E594
$$ y = [-144014, -310266, -53294, -358060, 21559, -299570, -19707, 154608, -80041, 130614, -67163, -158685, -30192, -71906, 52135, -151665, 54856, 158661, 74265, -7843, 155561, -388392, 67682, -165132, 245152, 1853, -429792, -56902, 93158, -40229, -155808, 87232, -15294, 396161, -223266, 210171, 88381, 207213, 20466, 22450, -518580, -88339, 87046, 57308, -290972, -25837, 207448, -212608, 162790, -183773, -212978, 48367, -200521, -213047, -427501, -69237, -202705, -280726, 193643, -3352, 53321, -175061, 124337, -134482, -162431, -328878, -143023, -111071, -137939, -86071, -288510, -179692, -127908, -42899, 309482, 159421, 91303, -352882, -122706, -60021, -270617, -340798, 6689, -246814, -275846, -101133, -322367, -271169, -12689, 5594]
10011E3459a05467o4260A85955b07598h1519A07123a92536A1964K34269f6591
10000b6081P099A06618B5621b62643A4383a59300d9775A41048m4104b32914C06365
9988b26825B36099g5538G4367h011F6612P5933b42009A12034j4840c10729J44185
9977a66544J6623A07716c42376B7478i909C74508c40501C25206a16877e932j55841
9966a61773A6343b99259a42915A56602b90929j46598a11994k8751K425L2827b6989
9954A5153d6918j14472J1501j26595f4186o2528I6887b31572j31578c1333k34342
9943b65675b3944A03779J7110D9069K6909f5337C46835H968a08003N3023q3702
9932a38682E821d5628A31973c12890g6419B00539a29260m7050B37073b514k91084
$$ y = [53459, -105467, -169727, 185955, -207598, -81519, 107123, -192536, 11964, 246233, -66591, -26081, -18982, 106618, 25621, -262643, 14383, -159300, -49775, 141048, 96944, -232914, 306365, -226825, 236099, -75538, 74367, -8011, 66612, 142545, -242009, 112034, 97194, -310729, -166544, -149921, 107716, -342376, 27478, -9909, 374508, -340501, 325206, -116877, -5932, -161773, 16343, -299259, -142915, 156602, -290929, -437527, -111994, -140745, -138320, -105493, -26989, 15153, -46918, -161390, -149889, -276484, -64186, -126714, 96887, -231572, -363150, -31333, -265675, -23944, 103779, 120889, 49069, 75978, -65337, 346835, 8968, -108003, -54980, -138682, 5821, -45628, 131973, -312890, -76419, 200539, -129260, -176310, 237073, -2514, -293598]
9921b93598P1140N3599H8385h0149G8145h358n4900a2022k0923l36774R5174G7183
9908e7628l20A50485d2261H6811i5250M361F9781i5986K8573k4345D1908J09896
9896A51804h7780b6150l81023f0116l7624C6482a14008j1876j31505F6904a36526
9884a18274d2536A89936a90054a4263j29579G0017h0062H0934a28961H6549J2811
9873I9360b32221B0273O6818l8974e4345j56643A8415c39517f6886o1377B2217
9861a5901k36911A15158a53918l87283b32765A10737R2972a05401B87586a12117
9850a84320A6029a01261A66789a33362G9618O0078c1575r5470j62968R5428D679
9838a69385A23293A9142c35723i5202j88157N3529A91578a70955A12833a47204
$$ y = [-293598, -222458, -168859, 88385, -80149, 78145, -8358, -63258, -12022, -32945, -369719, -274545, 77183, -57628, -57948, 150485, -42261, 86811, -95250, -90889, 69781, -95986, -67413, -91758, 41908, 151804, -87780, -26150, -407173, -60116, -97740, 36482, -114008, -125884, -257389, 66904, -136526, -118274, -42536, 189936, -190054, -14263, -143842, 70017, -80062, 80934, -128961, 86549, 99360, -232221, 20273, 87091, 48117, -54345, -210988, 18415, -339517, -66886, -128263, 22217, -15901, -252812, 115158, -153918, -541201, -232765, 110737, 203709, -105401, 287586, -112117, -184320, 16029, -101261, 166789, -133362, 79618, 139696, -31575, -127045, -290013, -194585, 4679, -169385, 123293, 19142, -335723, -95202, -283359, -229830, 191578, -170955, 112833, -147204]
9827b92400F4852b46807C30796b56825Q5217O3612J3774j87297Q3089C65612A20794
9815b85041G6379b59042C57057i3761j1371M9575l23852a47367d3764C1586g5445
9803A86590b7787k35047p2917B15049i8542K9420G152a53184I6592b87935o3855
9792c51790A62287B4574j742a85223D8726K71368g0472A48042E5178M6119P6704
9781A78001e1389k79424D4267c38897A47248I091a04818B30076r2376a01671A46381
9769A9414M8984b71131P6700j8023j7078G8799E377g4396M028c2907A26458m6627
9757G9831a19022L7479B00586b01255l0975I2926a13976p7547N3374j67527N2086
9746b53590i4148D74742B11853a6313B37446f7042J7349J2278q9742B71381a70257
$$ y = [-292400, 64852, -246807, 330796, -256825, -171608, -107996, -94222, -281519, -198430, 365612, 120794, -285041, 76379, -259042, 357057, -93761, -105132, -55557, -379409, -147367, -43764, 31586, -75445, 186590, -27787, -262834, -335751, 215049, -98542, -69122, 7152, -153184, 96592, -287935, -351790, 162287, 24574, 22832, -185223, 48726, 320094, -70472, 148042, 55178, 101297, 178001, -51389, -330813, 44267, -338897, 147248, 9091, -104818, 230076, 137700, -101671, 146381, 19414, 68398, -271131, -194431, -212454, -229532, 78799, 5377, -74396, -70368, -32907, 126458, 79831, -119022, -81543, 200586, -201255, -232230, 92926, -113976, -191523, -138149, -305676, -253590, -94148, 474742, 211853, -16313, 237446, -67042, -49693, -37415, -127157, 271381, -170257]
9734A46989m3195c55631J26416B05423b72278J02047f7188E6435a66863g1015
9723a78156L2733l8012A85095f7879n3660n8079N8744o5878o2896a15675k7145
9712a42820k32608a33107j24135G4510g0474A85096a25045o7821d1675r8736n9205
9701a99616A12748g1714c940k04201C8060c45681B56449F8617d01033a02570c7703
9689d0139j47351K1131B1899K1050J86073D5277c13526e3587h792q2679B8384
9677d503A99441B2579K17642a80978j64348a18856E2171a72602A05149a36062
9666c3811B19499b2727n5775H6119k2637b07010k7971Q3376j30066j61043F2867
9654A00472d15866A37502a50558o8747D6068R0911a6387C434a37995e5039i998
$$ y = [146989, 103794, -355631, -229215, 205423, -272278, -170231, -67188, 56435, -166863, -71015, -178156, -145423, -183435, 185095, -67879, -121539, -179618, -120874, -186752, -249648, -115675, -142820, -375428, -133107, -257242, 74510, -70474, 185096, -125045, -192866, -41675, -140411, -199616, 112748, -71714, -3940, -208141, 38060, -345681, 256449, 68617, -401033, -102570, -37703, -40139, -187490, -166359, 21899, 42949, 229022, 45277, -313526, -53587, -8792, -91471, 28384, -4503, 199441, 22579, 240221, -180978, -345326, -118856, 52171, -172602, 105149, -136062, -33811, 219499, -22727, -78502, 86119, 63482, -207010, -234981, -151605, -281671, -442714, 62867, 100472, -415866, 137502, -150558, -219305, 46068, 136979, -16387, 3434, -137995, -55039, -9998]
9642A54559b51375A57698a93797i732G9350b28370b9489j30308N5604p2397B40220
9630b18387A55300a53085c8341l6837n0026k61745i8978k37131A6323a24935k58425
9619c83360a9957l9281A61829E8008b94848a38488j46782B75518a6075j15797
9609a31872A751J87958p0016a393C2198a9981k00164D4922R4575a9419r7555E369
9596g19j75744B1913K6623M0070a52688j79660G2230B5965n963J92295b05269
9584c4537p3474l5364k19347a3898B10619A0470a72986A02747Q948a2593k65800
9573b78393B7688f8208q4599f4034C7145f2767j78971C4443J72843E1642j4013
9562C7629a41233C69902a65221A86444d94182C8739a08374M8612K7636M836r1314
$$ y = [154559, -251375, 157698, -193797, -9732, 79350, -228370, -29489, -159797, -104193, -176590, 240220, -218387, 155300, -153085, -38341, -75178, -125204, -386949, -98978, -336109, 16323, -124935, -383360, -19957, -59238, 161829, 58008, -294848, -138488, -285270, 275518, -16075, -131872, 1751, 189709, 119693, -1393, 32198, -19981, -220145, 44922, 139497, -19419, -116974, 5369, -719, -176463, 21913, 48536, 88606, -152688, -332348, 72230, 25965, 20002, 212297, -205269, -34537, -108011, -143375, -362722, -13898, 210619, 10470, -172986, 102747, 111695, -12593, -278393, 27688, -68208, -152807, -64034, 37145, -62767, -241738, 34443, 207286, 51642, 37629, -141233, 369902, -165221, 186444, -494182, 38739, -108374, -59762, -32126, -27290, -118604]
9551a18604L3695m26281A62599B3585J518f399A0563b59942A93284a85501Q5661
9540i9840B9176b65055a25250m9807h093n0772l26194a1720m3882d385m73359
9529d77744R0168A57574a12707P667A60965f2477j11864O8817k67039A22718c5245
9517b62625b5556j92479q7055i6852B91240a22872G1054b5989I6682c96394E1812
9505C4501K81078a58612g0235G9500a08125n1236J3772m1508L5158j32752a06759
9493c50581J10109F200g1094a2371j2655l1491A63036b93085J3374a3181G9521
9481H6272J97186b08106C6209b13026A67839c36318d8022o2128j2404m4720F1519
9469a58526E4500c7755B50020c5213E9273p449A6236c29066J27095B07073e4190
$$ y = [-118604, -84909, -511190, 162599, 23585, 25103, -6399, 10563, -259942, 193284, -185501, -99840, 29176, -265055, -125250, -175057, -8093, -58865, -385059, -11720, -55602, -4385, -477744, -387576, 157574, -112707, -105040, 160965, -62477, -174341, -105524, -372563, 122718, -35245, -262625, -25556, -218035, -305090, -96852, 291240, -122872, 71054, -25989, 96682, -396394, 51812, 34501, 315579, -158612, -70235, 79500, -108125, -159361, -145589, -187097, -151939, -284691, -106759, -350581, -240472, 6200, -71094, -12371, -25026, -56517, 163036, -293085, -279711, -13181, 79521, 86272, 283458, -208106, 36209, -213026, 167839, -336318, -48022, -110150, -122554, -167274, 61519, -158526, 54500, -37755, 250020, -35213, 59273, 51824, 16236, -329066, -201971, 207073, -54190]
9457D7553J7595a61251M5441c5003l1016A32894h466m3467n6316L3902k43197
9446c17544Q6964G6912f06388b01931C30890a21191M5367B08348p4272j8732b98041
9434b39013Q2162j60336b7253A1147i1627j34261h7604H4123a88785a1315B0515
9422h1566r712k24031e7915k42365B5198r627b46716p6178e4412C34075c6947
9410i6786C54755h0187a6266j54149H355a61095d2880F6374a37041E0663a19768
9398b4565A41085C6859j8396J05528c86587H153K03863F3647K80250H7391c2910
9386a36281D4637a53726l3082a5198o77518c7722A48553g1114j70700L7725e5136
9374a99184I4700a63914B35744a40907f8741j38914B11128b55750B61484D8594
$$ y = [47553, 65148, -161251, -115810, -35003, -66019, 132894, -8466, -51933, -108249, -74347, -317544, -230580, 76912, -606388, -201931, 330890, -121191, -75824, 208348, 134076, 115344, -298041, -239013, -156851, -317187, -27253, 11147, -91627, -225888, -87604, 84123, -188785, -11315, 20515, -81566, -91278, -315309, -57915, -300280, 25198, 15571, -246716, -322894, -54412, 334075, -36947, -96786, 354755, -80187, -16266, -170415, 8355, -161095, -42880, 66374, -137041, 50663, -119768, -24565, 141085, 36859, 18463, 123991, -386587, 8153, 212016, 63647, 343897, 87391, -32910, -136281, 44637, -153726, -186808, -15198, -692716, -37722, 148553, -71114, -241814, -204089, -55136, -199184, 94700, -163914, 235744, -140907, -68741, -207655, 211128, -255750, 261484, 48594]
9363b63703B36786a42294C487J56549e356B19920B5432f4810m76602g7342j05160
9352a82502n215B228b53541g7864j69485A43144J14424d13303H6691e8244j6154
9341g4398B99900A35905d81856h5017A57773d8028F4954e1477A57681c24493g7620
9329C64740A40547b82966F4019K01009a06518b3492j77256K6250G3858d0363J5917
9318b4446M988o6797k6974E8335b75840B71055j14745E6129c6850B49765F6761
9306e4360j55843D9608c06114g828j64858A54922a20278j94656C06671C8336a09694
9294f58k79439R1612B85282A21535b02420b0011E8053g6991B73050F2789f0917
9282a8503j380j05929o9221A63255b20282B11895a63687A05098k585N735c9830
$$ y = [-263703, 236786, -142294, 3487, 160036, -5356, 219920, 25432, -64810, -541412, -77342, -182502, -187717, 2228, -253541, -77864, -247349, 143144, 257568, -413303, 86691, -58244, -74398, 299900, 135905, -481856, -85017, 157773, -48028, 64954, -51477, 157681, -324493, -77620, 364740, 140547, -282966, 64019, 265028, -106518, -23492, -200748, -174498, 73858, -40363, -24446, -19458, -86255, -113229, 58335, -275840, 271055, 156310, 56129, -36850, 249765, 66761, -54360, -210203, 49608, -306114, -7828, -172686, 154922, -120278, -314934, 306671, 38336, -109694, -658, -280097, -188485, 285282, 121535, -202420, -20011, 58053, -76991, 273050, 62789, -60917, -18503, -19883, -125812, -195033, 163255, -220282, 211895, -163687, 105098, 102513, 108248, -39830]
9270b41514b2638A67905b85172B282c10162q7080G399J74677i3583G738b22403
9258i1983l8692B2836c6516A0585K44752i5433G8788c8649k43108Q9489f250j81262
9246a87512g3768B54783d1134k91718P7576l4823Q6718j0468a5957j482A55067
9234D6679a7092k43432e2409k1538A493J83231e2945A14120b35423a4335j37029
9223a51364j63402O9284c5262j4254j80337h8304I9653h6259c5948r6305j95397
9212c27650a62803k90674b09325A34554b90021J18772H6519b01175A91456R1684
9202B83140H3963k2780J35614e6357j12388l84042h0698E8247i2500Q469L637
9191h0394j65305R2920n3623L7270C6078j1354a230k4335k51032Q4317b07o5088
$$ y = [-241514, -22638, 167905, -285172, 2282, -310162, -397242, 7399, 182076, -93583, 7738, -222403, -91983, -130675, 22836, -36516, 10585, 255337, -95433, 78788, -38649, -281757, -192268, -6250, -187512, -73768, 254783, -41134, -332852, -255276, -290099, -203381, -213849, -15957, -17439, 155067, 46679, -17092, -260524, -52409, -73947, 1493, 184724, -52945, 114120, -235423, -14335, -151364, -314766, -245482, -35262, -49516, -229853, -88304, 99653, -86259, -35948, -132253, -327650, -162803, -453477, -209325, 134554, -290021, -171249, 86519, -201175, 191456, 283140, 83963, 61183, 196797, -56357, -168745, -552787, -80698, 58247, -92500, -84031, -80394, -245699, -152779, -206402, -169132, 36078, 24724, -1230, -25565, -276597, -192280, -207, -65295]
9179f5295K3221k46085J5628P0542b1897B02949j7751k4372b77652a8964k41379
9168b60343R3842j64274B11106j02537a5820O954j12676c9326D2232a51216e993
9156E7837B7194a3541j09038K7829a0699C9151a89629A20138b8073k83390J17925
9145a93538r2541O321G5123B921a14837A44871o7717J53148H0116i2192A77388
9133g3055B0769b12365j02699J11946A1034a04094B30058A000a37885A89837b99035
9121b70286i6033k66550l7618A77425f9743j0150J6170k13544C98262A60039b79181
9109f6606B50744r7184a31038B79526a87304m4505g8046j39923j05115J57900
9099a65184j46092P478B11863C8931a68461O001L976j58737M4298e5869I9091
$$ y = [-65295, -42074, -288159, -272531, -201989, -21897, 202949, 185198, 160826, -277652, -18964, -260343, -166501, -330775, 211106, 108569, -15820, -8866, -121542, -39326, 42232, -151216, -5993, 57837, 27194, -13541, -122579, -94750, -10699, 39151, -189629, 120138, -28073, -311463, -193538, -286079, -279758, 75123, 2921, -114837, 144871, 77154, 230302, 80116, -92192, 177388, -73055, 20769, -212365, -315064, -203118, 11034, -104094, 230058, 1000, -137885, 189837, -299035, -270286, -96033, -362583, -400201, 177425, -69743, -79893, -63723, -277267, 398262, 160039, -279181, -66606, 250744, 153560, -131038, 279526, -187304, -231809, -78046, -217969, -323084, -165184, -311276, -303798, 211863, 38931, -168461, -162460, -158484, -317221, -272923, -55869, 99091]
9087a91942C3125b23405q2097J35534j22638A92464b34703n8596G2988a22434
9076a42021c2612j02178l7911C7419K73900a55874F8727E760j327a04479E5996
9064B2152K84164a41327l8887b2260A19660m4011C6366J75207e5997Q535k39230
9053b86692J0877g6138B5578e2015k85395B96801b4369A4013N0686a76181l9757
9042b15938j63598J39361J398G5306a94917i5589N367A68586C0108m970a82421
9030E282K8372K1815b68429J20703J7429D510J10889b46500G8240l122N3896d0797
9017f8178k313l4339A44172a27762c504A24226b9576I7027a05560L2110j29035
9006b02485D6446P4093c04977d7615l65343a34492k85275J29813B43277c00861
$$ y = [-191942, 33125, -223405, -305502, -169968, -292606, 192464, -234703, -293299, 72988, -122434, -142021, -32612, -134790, -172701, 37419, 311319, -155874, 68727, 5760, 4433, -104479, 55996, 22152, 306316, -141327, -180214, -22260, 119660, 75649, 36366, 211573, -55997, -47462, -286692, -275815, -76138, 25578, -52015, -337410, 296801, -24369, 14013, 64699, -176181, -215938, -379536, -240175, -238777, 75306, -194917, -95589, -90222, 168586, 30108, 25138, -182421, 5282, 33654, 55469, -268429, -147726, -130297, 4510, 115399, -246500, 78240, 75118, 129014, -40797, -68178, -70491, -104830, 144172, -127762, -3504, 124226, -29576, 97027, -105560, -73450, -202485, 46446, 120539, -304977, -47615, -412958, -134492, -419767, -289954, 243277, -300861]
8995a7998F4147l0401J5802b21339Q0469D03174A5845b03500N7102a5644A139
8983b3267j28602H4995e5095k46663b2102j64938A02982j8175a67385P7575B2384
8971b41876B8486a91237f9163A69758a29492J1297e0018B14118b2142r7072N2850
8960f6364A77357n9303b14320h7671k81985O9997A23032O7755D1999K83619A23797
8948E1895a32000d8083F901J03390a97722k58040a30697j76132a09158a8417A71993
8936D0579J93307o783m8447b1621q2936C8797h5922B74638g2582l9360C9888P1098
8924A10986Q14758L352010N217733n89433C024708I13845m41684J61247l00825
8915C32583E2144J10831a7772j91855G1298a55402C73356J00921A17780a53350
$$ y = [-17998, 64147, 33746, 49548, -221339, -140870, 403174, 15845, -203500, -146398, -15644, 1139, -23267, -151869, 84995, -55095, -301758, -22102, -187040, 102982, 84807, -167385, -89810, 22384, -241876, 28486, -191237, -69163, 169758, -129492, -118195, -50018, 214118, -22142, -119214, -66364, 177357, 118054, -214320, -87671, -369656, -299659, 123032, 190787, 41999, 325618, 123797, 51895, -132000, -48083, 6901, 110291, -197722, -455762, -130697, -306829, -109158, -18417, 171993, 40579, 233886, 227103, 178656, -21621, -104557, 38797, -85922, 274638, -72582, -111942, 39888, 110986, 925744, 4277754, 9495487, 8906054, 3024708, 913845, 472161, 633408, 332583, 52144, 162975, -17772, -209627, 71298, -155402, 373356, 474277, 117780, -153350]
8904f7407I5153h601l11355f2453B12100N2117j11078E3382g4654a9055r1848
8893a10903m776A16183L3235i5433B00648C1568a21068B27048E305L3235M3935
8882H2475r381B5028R5334i9260O989C8366J92217c409H2195J88377a067j1988
8870a3055A14883O9496a30861G7419a06702C930c6B38964a49048r5633B37156
8858A82155a50473b2133D55904j11088c11661g3343j02145B04190c59736C82312
$$ y = [-67407, 95153, -8601, -319956, -62453, 212100, 264217, 153139, 53382, -74654, -19055, -110903, -115679, 116183, 149418, -95433, 200648, 31568, -121068, 227048, 5305, 38540, 82475, 73094, 25028, 120362, -99260, -92271, 38366, 230583, -3409, 82195, 270572, -1067, -13055, 114883, 184379, -130861, 77419, -106702, 3930, -36, 238964, -149048, -244681, 237156, 182155, -150473, -22133, 455904, 344816, -311661, -73343, -175488, 204190, -359736, 382312]
$$ [...]
##END NTUPLES=NMR SPECTRUM
##END=
