##TITLE=AC1624_HONAH13355_8326384_r6l0tTHAce
##JCAMPDX= 6.0         $$ Bruker NMR JCAMP-DX V2.0
##DATA TYPE= NMR SPECTRUM
##DATA CLASS= NTUPLES
##ORIGIN= BRUKER
##OWNER= Administrator
$$ 1.72 TOPSPIN		Version 2.1
$$ 2013-11-13 16:27:43.407 -0800  Administrator@X
$$ Compression mode = diff/dup
##.OBSERVE FREQUENCY= 400.02188249412
##.OBSERVE NUCLEUS= ^1H
##.ACQUISITION MODE= SIMULTANEOUS (DQD)
##.ACQUISITION SCHEME= undefined
##.AVERAGES= 64
##.DIGITISER RES= 22
##SPECTROMETER/DATA SYSTEM= spect
##.PULSE SEQUENCE= noesygpps1d.comp
##.SOLVENT NAME= COFFEE_meoh
##.SHIFT REFERENCE= INTERNAL, COFFEE_meoh, 1, 14.96085
##AUDIT TRAIL= $$ (NUMBER, WHEN, WHO, WHERE, PROCESS, VERSION, WHAT)
$$ ##TITLE= Audit trail, TOPSPIN		Version 2.1
$$ ##JCAMPDX= 5.01
$$ ##ORIGIN= Bruker BioSpin GmbH
$$ ##OWNER= Administrator
$$ $$ E:\/data/COFFEE/nmr/AC1624_HONAH13355_8326384_r6l0tTHAce/22/pdata/1/auditp.txt
$$ ##AUDIT TRAIL=  $$ (NUMBER, WHEN, WHO, WHERE, PROCESS, VERSION, WHAT)
(   1,<2013-11-13 16:27:37.563 -0800>,<Administrator>,<X>,<go>,<TOPSPIN 2.1>,
      <created by zg
	started at 2013-11-13 16:16:07.141 -0800,
	POWCHK enabled, PULCHK disabled,
       configuration hash MD5:
       C8 4E 4E 5D D3 5C D8 9E 9F 52 82 E0 59 8A DE 15
       data hash MD5: 64K
       E3 B6 83 08 D4 8E D3 DD 85 B0 1D C2 F0 67 E9 C8>)
(   2,<2013-11-13 16:27:40.813 -0800>,<Administrator>,<X>,<proc1d>,<TOPSPIN 2.1>,
      <Start of raw data processing
       efp LB = 0.3 FT_mod = 6 PKNL = 1 PHC0 = 0 PHC1 = 0 SI = 128K 
       data hash MD5: 128K
       E0 0E 50 90 78 52 9E B3 00 3F 54 94 86 CB 9D 2F>)
(   3,<2013-11-13 16:27:41.876 -0800>,<Administrator>,<X>,<proc1d>,<TOPSPIN 2.1>,
      <pk PHC0 = -83.13904 PHC1 = 0 
       data hash MD5: 128K
       C5 9B 6D C6 1E 43 31 D2 2F BF 7D 85 B5 F9 61 70>)
(   4,<2013-11-13 16:27:42.579 -0800>,<Administrator>,<X>,<proc1d>,<TOPSPIN 2.1>,
      <abs ABSG = 1 
       data hash MD5: 128K
       8A BD 87 20 D6 EC 2D 79 75 31 18 B4 9A E8 DD 05>)
(   5,<2013-11-13 16:27:42.766 -0800>,<Administrator>,<X>,<proc1d>,<TOPSPIN 2.1>,
      <abs ABSG = 2 
       data hash MD5: 128K
       65 46 EC 6B 51 A1 55 AA CA 61 65 57 1A D0 C3 E5>)
(   6,<2013-11-13 16:27:43.048 -0800>,<Administrator>,<X>,<proc1d>,<TOPSPIN 2.1>,
      <abs ABSG = 3 
       data hash MD5: 128K
       23 CA 39 CF 79 9A 4B 43 90 A3 C8 47 50 F0 C9 6D>)
(   7,<2013-11-13 16:27:43.126 -0800>,<Administrator>,<X>,<proc1d>,<TOPSPIN 2.1>,
      <abs ABSG = 4 
       data hash MD5: 128K
       22 75 48 85 CF B3 19 51 9E CF 09 14 70 6E 64 A7>)
(   8,<2013-11-13 16:27:43.235 -0800>,<Administrator>,<X>,<proc1d>,<TOPSPIN 2.1>,
      <abs ABSG = 5 
       data hash MD5: 128K
       2F EA 74 00 44 FC 49 A9 06 EB DE 84 E9 EF F7 B1>)
$$ ##END=
$$ 
$$ $$ hash MD5
$$ $$ DD 5F 2C 0D 53 48 21 AA B4 D4 C7 F8 2E 48 7E 46
##$RELAX= 
##$RELAX= 
##$RELAX= 
##$RELAX= 
##$RELAX= 
##$RELAX= 
##$RELAX= 
##$RELAX= 
$$ Bruker specific parameters
$$ --------------------------
##$DU= <E:\>
##$EXPNO= 22
$$ [...]
##$TP07= 0
##$TPNAME0= <>
##$TPNAME1= <>
##$TPNAME2= <>
##$TPNAME3= <>
##$TPNAME4= <>
##$TPNAME5= <>
##$TPNAME6= <>
##$TPNAME7= <>
##$TPOAL= (0..7)
0.5 0.5 0.5 0.5 0.5 0.5 0.5 0.5
##$TPOFFS= (0..7)
0 0 0 0 0 0 0 0
##$TUNHIN= 0
##$TUNHOUT= 0
##$TUNXOUT= 0
##$USERA1= <user>
##$USERA2= <user>
##$USERA3= <user>
##$USERA4= <user>
##$USERA5= <user>
##$V9= 5
##$VALIST= <valist>
##$VCLIST= <CCCCCCCCCCCCCCC>
##$VD= 0
##$VDLIST= <DDDDDDDDDDDDDDD>
##$VPLIST= <PPPPPPPPPPPPPPP>
##$VTLIST= <TTTTTTTTTTTTTTT>
##$WBST= 1024
##$WBSW= 4
##$XGAIN= (0..3)
0 0 0 0
##$XL= 0
##$YL= 0
##$YMAX_a= 6052560
##$YMIN_a= -12280728
##$ZGOPTNS= <>
##$ZL1= 120
##$ZL2= 120
##$ZL3= 120
##$ZL4= 120
##$ABSF1= 14.96085
##$ABSF2= -5.597332
##$ABSG= 5
##$ABSL= 3
##$ALPHA= 0
##$AQORDER= 0
##$ASSFAC= 0
##$ASSFACI= 0
##$ASSFACX= 0
##$ASSWID= 0
##$AUNMP= <proc_prof1d_extract.lims>
##$AXLEFT= 0
##$AXNAME= <>
##$AXNUC= <1H>
##$AXRIGHT= 0
##$AXTYPE= 0
##$AXUNIT= <>
##$AZFE= 0.1
##$AZFW= 0.1
##$BCFW= 0
##$BC_mod= 0
##$BYTORDP= 0
##$COROFFS= 0
##$CY= 15
##$DATMOD= 1
##$DC= 0
##$DFILT= <>
##$DTYPP= 0
##$F1P= 0
##$F2P= 0
##$FCOR= 0.5
##$FTSIZE= 131072
##$FT_mod= 6
##$GAMMA= 0
##$GB= 0
##$INTBC= 1
##$INTSCL= 1
##$ISEN= 128
##$LB= 0.3
##$LEV0= 0
##$LPBIN= 0
##$MAXI= 10000
##$MC2= 0
##$MEAN= 0
##$ME_mod= 0
##$MI= 0
##$NCOEF= 0
##$NC_proc= -2
##$NLEV= 6
##$NOISF1= 0
##$NOISF2= 0
##$NSP= 0
##$NTH_PI= 0
##$NZP= 0
##$OFFSET= 14.96085
##$PC= 1
##$PHC0= -83.13904
##$PHC1= 0
##$PH_mod= 1
##$PKNL= yes
##$PPARMOD= 0
##$PPDIAG= 0
##$PPIPTYP= 0
##$PPMPNUM= 2147483647
##$PPRESOL= 1
##$PSCAL= 4
##$PSIGN= 0
##$PYNMP= <proc.py>
##$REVERSE= no
##$SF= 400.020009698495
##$SI= 131072
##$SIGF1= 0
##$SIGF2= 0
##$SINO= 400
##$SIOLD= 131072
##$SPECTYP= <>
##$SREGLST= <1H.CDCl3>
##$SSB= 0
##$STSI= 131072
##$STSR= 0
##$SW_p= 8223.68421052631
##$SYMM= 0
##$S_DEV= 0
##$TDeff= 65536
##$TDoff= 0
##$TI= <>
##$TILT= no
##$TM1= 0
##$TM2= 0
##$TOPLEV= 0
##$USERP1= <user>
##$USERP2= <user>
##$USERP3= <user>
##$USERP4= <user>
##$USERP5= <user>
##$WDW= 1
##$XDIM= 131072
##$YMAX_p= 399295660
##$YMIN_p= -12492
##$CURPLOT= <Network HP LaserJet P1505>
##$CURPRIN= <$Network HP LaserJet P1505>
##$DFORMAT= <normdp>
##$LAYOUT= <+/1D_H.xwp>
##$LFORMAT= <normlp>
##$PFORMAT= <normpl>
##$SURQMSG= 1
$$ End of Bruker specific parameters
$$ ---------------------------------
##NTUPLES= NMR SPECTRUM
##VAR_NAME=  FREQUENCY,     SPECTRUM/REAL,   SPECTRUM/IMAG
##SYMBOL=    X,             R,               I
##VAR_TYPE=  INDEPENDENT,   DEPENDENT,       DEPENDENT
##VAR_FORM=  AFFN,          ASDF,            ASDF
##VAR_DIM=   131072,        131072,          131072
##UNITS=     HZ,            ARBITRARY UNITS, ARBITRARY UNITS
##FACTOR=    0.0627417313425164, 1,          1
##FIRST=     8223.62146879497, 5368,         -64440
##LAST=      0,             8015,            -63839
##MIN=       0,             -12492,          0
##MAX=       8223.62146879497, 399295660,    0
$$ Real data points
##PAGE= N=1
##DATA TABLE= (X++(R..R)), XYDATA
$$ [...]
$$ plain form
63942 1448532 1592315 1751386 1925956 2115048 2316652 2528576 2748656 2974045 3200826
63933 3200826 3424495 3640544 3844492 4031872 4198538 4340792 4455030 4537740 4586344 4599974
63923 4599974 4579164 4524976 4438673 4322080 4177847 4009445 3821165 3618004 3405127 3187300
63913 3187300 2968894 2754150 2546946 2350157 2165481 1993914 1836158 1692554 1562936
63904 1562936 1446751 1343307 1251946 1172100 1103174 1044264 994009 950793 913006 879134 847938
63893 847938 818870 792119 767888 745720 724783 704636 685313 666825 649165 632800 618536
63882 618536 606635 596480 587368 579357 573129 569326 568230 569844 573973 580344 588838 599540 612550
63869 612550 627890 645548 665300 686514 708559 731515 755934 781610 807046 830596 851801
$$ packed form
63942A448532J43783J59071J74570J89092K01604K11924K20080K25389K26781
63933C200826K23669K16049K03948J87380J66666J42254J14238Q2710M8604J3630
63923D599974k0810n4188q6303j16593j44233j68402j88280k03161k12877k17827
63913C187300k18406k14744k07204j96789j84676j71567j57756j43604j29618
63904A562936j16185j03444r1361p9846o8926n8910n0255m3216l7787l3872l1196
63893H47938k9068k6751k4231k2168k0937k0147j9323j8488j7660j6365j4264
63882F18536j1901j0155r112q011o228l803j096J614M129O371Q494J0702J3010
63869F12550J5340J7658J9752K1214K2045K2956K4419K5676K5436K3550K1205
$$ plain form
63858 851801 871135 888700 903851 916103 925773 933499 939427 943113 943998 941734 936208 927499 915810
63845 915810 901316 884076 864224 842259 818951 794753 769358 742112 713028 683143 653675
63834 653675 625022 596919 569355 542861 517862 494262 471863 450838 431526 414083 398521
63823 398521 384810 372660 361421 350497 339739 329295 319309 309926 301366 293756 287061 281313 276597
63810 276597 272663 268962 265361 262382 260247 258100 254876 250755 247091 244842 243732 243016 242441 242150 242091
63795 242091 241930 241343 240165 238442 236486 234678 233046 231224 228974 226512 224123 221635 218642 215219 212121
63780 212121 210089 209078 208363 207490 206875 207224 208398 209286 208973 207749 206691 206461 206846 207331 207701 208100 208782
63763 208782 209867 211143 212140 212573 212625 212574 212321 211581 210360 208862 207127 205227 203746 203456 204418 205814 206782
$$ packed form
63858H51801J9334J7565J5151J2252R670P726N928L686Q85k264n526q709j1689
63845I15810j4494j7240j9852k1965k3308k4198k5395k7246k9084k9885k9468
63834F53675k8653k8103k7564k6494k4999k3600k2399k1025j9312j7443j5562
63823C98521j3711j2150j1239j0924j0758j0444r986r383q560p610o695n748m716
63810B76597l934l701l601k979k135k147l224m121l664k249j110p16n75k91n9
63795B42091j61n87j178j723j956j808j632j822k250k462k389k488k993l423l098
63780B12121k032j011p15q73o15L49J174Q88l13j224j058k30L85M85L70L99O82
63763B08782J085J276R97M33N2n1k53p40j221j498j735j900j481k90R62J396R68
$$ plain form
63746 206782 207060 206868 206707 207227 208656 210209 210786 210547 211034 213277 216463 219131 221063 223201 226037 229069
63730 229069 231777 234302 237010 239981 243191 246650 250222 253638 256915 260416 264370 268645 273142 278024
63716 278024 283271 288206 291851 293758 294396 294657 295037 295275 294789 293396 291380 288902 285741 281953 278398
63701 278398 276013 274628 273086 270671 267920 265868 264955 264978 265672 266906 268482 270174 271947 273884 275949
63686 275949 278030 280184 282591 285318 288259 291273 294160 296559 298137 298982 299592 300303 300838 300658 299837 299380
63670 299380 300417 303049 306223 308827 310699 312358 313969 315006 314944 313925 312548 311256 310061 308690 306794
63655 306794 304141 300736 296746 292314 287593 282949 278825 275294 271926 268308 264551 261249 259087 258458
63641 258458 259106 260049 260287 259914 260194 262201 265645 269409 272903 276359 280018 283695 287219 290728 294354
$$ packed form
63746B06782K78j92j61N20J429J553N77k39M87K243L186K668J932K138K836L032
63730B29069K708K525K708K971L210L459L572L416L277L501L954M275M497M882
63716B78024N247M935L645J907O38K61L80K38m86j393k016k478l161l788l555
63701B78398k385j385j542k415k751k052r13K3O94J234J576J692J773J937K065
63686B75949K081K154K407K727K941L014K887K399J578Q45O10P11N35j80q21m57
63670B99380J037K632L174K604J872J659J611J037o2j019j377j292j195j371j896
63655C06794k653l405l990m432m721m644m124l531l368l618l757l302k162o29
63641B58458O48R43K38l73K80K007L444L764L494L456L659L677L524L509L626
$$ plain form
63626 294354 298064 301968 306402 311530 317154 323122 329597 336733 344380 352326 360587 369289 378527 388638
63612 388638 400417 414721 431816 451223 472188 494290 517704 542904 569939 597996 625814
63601 625814 652458 677381 699870 718963 734118 745460 753096 756693 756132 752268 746518 739914 732821
63588 732821 725248 716891 707125 695480 682075 667179 650594 632024 611930 591370 570923 550377
63576 550377 529606 509219 490196 473315 459059 447594 438541 431211 425341 421237 419075 418494 419159
63563 419159 421202 424688 429051 433588 438267 443555 449660 456461 464059 472777 482573 492996 503996 516401
63549 516401 531277 549043 569500 592606 618834 648626 681688 716999 753382 789714 824405
63538 824405 855101 879431 896146 905347 907750 904249 896258 885774 874525 863260 852198 841803
$$ packed form
63626B94354L710L904M434N128N624N968O475P136P647P946Q261Q702R238J0111
63612C88638J1779J4304J7095J9407K0965K2102K3414K5200K7035K8057K7818
63601F25814K6644K4923K2489J9093J5155J1342P636L597n61l864n750o604p093
63588G32821p573q357r766j1645j3405j4896j6585j8570k0094k0560k0447k0546
63576E50377k0771k0387j9023j6881j4256j1465r053p330n870m104k162n81O65
63563D19159K043L486M363M537M679N288O105O801P598Q718R796J0423J1000J2405
63549E16401J4876J7766K0457K3106K6228K9792L3062L5311L6383L6332L4691
63538H24405L0696K4330J6715R201K403l501p991j0484j1249j1265j1062j0395
$$ plain form
63526 841803 832471 823564 813422 800600 784760 766206 744961 720665 693264 663406 632223 600926
63514 600926 570619 542149 515847 491515 468919 448359 430508 415573 402798 391046 379781
63503 379781 369329 360311 353052 347386 342640 337816 332269 326375 321261 317741 315683 314391 313222 311822
63489 311822 310254 309088 308953 309771 310778 311486 312137 313031 314067 315340 317577 321243 325648 329714 333345
63474 333345 337261 341612 345612 348612 350822 352754 354479 355630 355705 354273 351279 347226 342665 337574 331779
63459 331779 325931 321301 318384 316365 314343 312562 312003 313114 315355 317705 319367 320284 321297 323509 327186
63444 327186 331512 335652 339750 344569 350478 357269 364907 374030 385641 400414 418289 438649 460926
63431 460926 485015 510882 537834 564408 589022 610448 627738 640282 648281 652843 655358 657037
$$ packed form
63526H41803r332q907j0142j2822j5840j8554k1245k4296k7401k9858l1183l1297
63514F00926l0307k8470k6302k4332k2596k0560j7851j4935j2775j1752j1265
63503C79781j0452r018p259n666m746m824n547n894n114l520k058j292j169j400
63489C11822j568j166j35Q18J007P08O51Q94J036J273K237L666M405M066L631
63474C33345L916M351M000L000K210J932J725J151P5j432k994m053m561n091n795
63459C31779n848m630k917k019k022j781n59J111K241K350J662R17J013K212L677
63444C27186M326M140M098M819N909O791P638R123J1611J4773J7875K0360K2277
63431D60926K4089K5867K6952K6574K4614K1426J7290J2544P999M562K515J679
$$ plain form
63419 657037 659187 663425 671171 683076 699200 719492 743810 771653 802074 833716 864825 893618
63407 893618 918856 939873 956054 966746 971890 972204 968499 961289 951344 939910 927785 914669 899907
63394 899907 883343 864874 843799 819588 792921 765019 736138 705725 674047 642645 613018
63383 613018 585669 560685 538417 519139 502569 488143 475450 464276 454616 446743 440877 436750
63371 436750 434047 433166 434846 438925 444295 450373 457866 467633 479510 492800 507319 523367 541159
63358 541159 560886 582920 607385 633892 662283 693146 726888 762522 798136 832319 864336
63347 864336 893072 916872 934728 946883 953981 956312 954285 949003 941647 932563 921553 908920 895598
63334 895598 882089 867710 851186 831826 809937 786219 761111 734784 707591 680307 653929
$$ packed form
63419F57037K150M238P746J1905J6124K0292K4318K7843L0421L1642L1109K8793
63407H93618K5238K1017J6181J0692N144L14l705p210r945j1434j2125j3116j4762
63394H99907j6564j8469k1075k4211k6667k7902k8881l0413l1678l1402k9627
63383F13018k7349k4984k2268j9278j6570j4426j2693j1174r660p873n866m127
63371D36750k703q81J680M079N370O078P493R767J1877J3290J4519J6048J7792
63358E41159J9727K2034K4465K6507K8391L0863L3742L5634L5614L4183L2017
63347H64336K8736K3800J7856J2155P098K331k027n282p356r084j1010j2633j3322
63334H95598j3509j4379j6524j9360k1889k3718k5108k6327k7193k7284k6378
$$ plain form
63323 653929 629331 607121 587690 571347 558391 548991 542839 538978 536106 533074 528985 522898 513785
63310 513785 501021 484889 466530 447450 428970 411880 396463 382849 371292 361921 354359 347941
63298 347941 342313 337481 333265 329252 325427 322293 319979 317717 314762 311425 308555 306258 303873 301186
63284 301186 298806 297116 295625 293854 292362 292191 293406 294740 294785 293251 290979 289059 288112 288163 288810 289456
63268 289456 289667 289559 289690 290401 291381 292249 293426 295875 299792 304062 307468 310080 312921 316539 320558 324593
63252 324593 328861 333607 338522 343164 347700 352790 358895 365997 373971 382895 392945 404113 416117
63239 416117 428600 441450 454902 469296 484766 501294 518987 538049 558375 579372 600394
63228 600394 621302 642497 664387 686925 709696 732441 755353 778685 802147 825018 846960
$$ packed form
63323F53929k4598k2210j9431j6343j2956r400o152l861k872l032m089o087r113
63310E13785j2764j6132j8359j9080j8480j7090j5417j3614j1557r371p562o418
63298C47941n628m832m216m013l825l134k314k262k955l337k870k297k385k687
63284C01186k380j690j491j771j492j71J215J334M5j534k272j920r47N1O47O46
63268B89456K11j08J31P11R80Q68J177K449L917M270L406K612K841L618M019M035
63252C24593M268M746M915M642M536N090O105P102P974Q924J0050J1168J2004
63239D16117J2483J2850J3452J4394J5470J6528J7693J9062K0326K0997K1022
63228F00394K0908K1195K1890K2538K2771K2745K2912K3332K3462K2871K1942
$$ plain form
63217 846960 868404 889888 911336 932295 952466 971395 987851 1000296 1008035 1011272 1009928 1003190
63205 1003190 990617 973075 952060 928501 902718 875158 846641 818082 790472 764983 742603
63194 742603 723731 708392 696610 688192 682446 678718 677170 678612 683604 692152 704095 719220 736982
63181 736982 756639 777744 800118 823362 847007 871161 896369 922491 948201 972007 993471
63170 993471 1013176 1031776 1049285 1064990 1077731 1086497 1090994 1091472 1087894 1079653 1066336 1048285 1025955
63157 1025955 999116 967393 931589 893800 856023 818984 782519 746708 712261 679944 650076
63146 650076 622747 598250 576941 558666 542647 528197 515339 504438 495390 487642 480962 475692
63134 475692 472009 469348 466814 463886 460559 457159 454326 452755 452517 452864 453151 453663 455051 457128 458923
$$ packed form
63217H46960K1444K1484K1448K0959K0171J8929J6456J2445P739L237j344o738
63205A003190j2573j7542k1015k3559k5783k7560k8517k8559k7610k5489k2380
63194G42603j8872j5339j1782q418n746l728j548J442M992Q548J1943J5125J7762
63181G36982J9657K1105K2374K3244K3645K4154K5208K6122K5710K3806K1464
63170I93471J9705J8600J7509J5705J2741Q766M497M78l578q241j3317j8051k2330
63157A025955k6839l1723l5804l7789l7777l7039l6465l5811l4447l2317k9868
63146F50076k7329k4497k1309j8275j6019j4450j2858j0901r048p748o680n270
63134D75692l683k661k534k928l327l400k833j571k38L47K87N12J388K077J795
$$ plain form
63119 458923 460043 461420 464382 469245 475037 480372 484489 487608 490508 493792 497483 501303 505114 508932
63105 508932 512668 516151 519354 522358 525179 527822 530357 532660 534207 534570 534074 533583 533681 534397 535647 537368
63089 537368 539147 540333 540781 541031 541470 541745 541359 540483 539811 539868 540816 542610 544985 547486 549927 552672 556164
63072 556164 560419 565359 571355 578903 587858 597571 607789 618894 631202 644576 658977 674925 693047
63059 693047 713453 735883 760317 787125 816749 849497 885586 925095 967830 1013375 1061356
63048 1061356 1111548 1163773 1217760 1273118 1329317 1385703 1441654 1496881 1551572 1606191 1661049
63037 1661049 1716104 1771217 1826539 1882408 1938654 1994012 2046412 2093979 2135662 2170837 2198466
63026 2198466 2216942 2224785 2221277 2206279 2179716 2141698 2093191 2036197 1973057 1905791 1836273 1766716
$$ packed form
63119D58923J120J377K962M863N792N335M117L119K900L284L691L820L811L818
63105E08932L736L483L203L004K821K643K535K303J547L63m96m91R8P16J250J721
63089E37368J779J186M48K50M39K75l86q76o72N7R48J794K375K501K441K745L492
63072E56164M255M940N996P548Q955R713J0218J1105J2308J3374J4401J5948J8122
63059F93047K0406K2430K4434K6808K9624L2748L6089L9509M2735M5545M7981
63048A061356N0192N2225N3987N5358N6199N6386N5951N5227N4691N4619N4858
63037A661049N5055N5113N5322N5869N6246N5358N2400M7567M1683L5175K7629
63026B198466J8476P843l508j4998k6563l8018m8507n6994o3140o7266o9518o9557
$$ plain form
63014 1766716 1699438 1636108 1577523 1524198 1476910 1436615 1404034 1379404 1362501 1352933 1350558 1355525
63002 1355525 1367627 1385810 1408758 1435908 1467278 1502281 1539442 1577599 1616689 1656873 1697547
62991 1697547 1737926 1778078 1818393 1858246 1896079 1930850 1962514 1990869 2014659 2032166 2042115
62980 2042115 2043712 2036399 2020047 1994931 1961096 1918150 1866201 1806702 1741863 1673381 1602232 1529560
62968 1529560 1457180 1386987 1320128 1256869 1197112 1141061 1089485 1043257 1002495 966224 933114
62957 933114 902397 873937 847630 823131 800116 778413 757733 737650 718083 699540 682618
62946 682618 667272 652770 638407 624125 610342 597224 584323 571159 558123 546427 536904 529072
62934 529072 521726 514395 507746 502460 498156 493790 488915 484149 480430 478065 476559 475099 473117 470585
$$ packed form
63014A766716o7278o3330n8585n3325m7288m0295l2581k4630j6903r568k375M967
63002A355525J2102J8183K2948K7150L1370L5003L7161L8157L9090M0184M0674
62991A697547M0379M0152M0315L9853L7833L4771L1664K8355K3790J7507R949
62980B042115J597p313j6352k5116l3835m2946n1949n9499o4839o8482p1149p2672
62968A529560p2380p0193o6859o3259n9757n6051n1576m6228m0762l6271l3110
62957I33114l0717k8460k6307k4499k3015k1703k0680k0083j9567j8543j6922
62946F82618j5346j4502j4363j4282j3783j3118j2901j3164j3036j1696r523p832
62934E29072p346p331o649n286m304m366m875m766l719k365j506j460j982k532
$$ plain form
62920 470585 467922 465605 463778 462245 460801 459412 458063 456648 455154 453791 452739 451894 451069 450300 449619
62905 449619 448540 446251 442528 438189 434309 431195 428455 425885 423825 422626 422206 422286 422697 423205 423355 422912
62889 422912 422369 422597 423834 425321 426066 425805 424976 423957 422734 421393 420535 420814 422139 423689 424797 425528
62873 425528 426290 427170 427918 428368 428554 428465 428006 427230 426393 425694 425120 424599 424158 423932 424123 424933 426348 428032
62855 428032 429594 430975 432338 433625 434563 435172 435987 437528 439727 442025 443843 444858 445054 444746 444457 444533
62839 444533 444899 445301 445633 445859 445806 445327 444627 444103 443802 443317 442363 441275 440765 441229 442448 443907 445269 446535
62821 446535 447966 449986 453002 456984 461184 464639 467178 469721 473248 477576 481548 484339 486175 487734
62807 487734 489413 491419 494100 497712 502086 506981 512578 519200 526654 534330 542054 550472 560499 572574
$$ packed form
62920D70585k663k317j827j533j444j389j349j415j494j363j052q45q25p69o81
62905D49619j079k289l723m339l880l114k740k570k060j199m20Q0M11N08J50m43
62889D22912n43K28J237J487P45k61q29j019j223j341q58K79J325J550J108P31
62873D25528P62Q80P48M50J86q9m59p76q37o99n74n21m41k26J91Q10J415J684
62855D28032J562J381J363J287R38O09Q15J541K199K298J818J015J96l08k89P6
62839D44533L66M02L32K26n3m79p00n24l01m85r54j088n10M64J219J459J362J266
62821D46535J431K020L016L982M200L455K539K543L527M328L972K791J836J559
62807D87734J679K006K681L612M374M895N597O622P454P676P724Q418J0027J2075
$$ plain form
62793 572574 586476 601627 617560 634418 653045 674288 698213 724354 752808 784652 821029
62782 821029 862323 908624 960610 1019277 1084860 1156544 1233326 1314675 1400181 1488943 1579490
62771 1579490 1669930 1757868 1840624 1915970 1982511 2038934 2083123 2112688 2126488 2125133 2109782
62760 2109782 2080949 2038800 1984311 1919586 1847149 1769270 1687880 1604655 1520990 1438091 1357156
62749 1357156 1279272 1205116 1134973 1069123 1007978 951770 900294 853165 810215 771465 736750
62738 736750 705576 677455 652305 630338 611520 595305 581087 568764 558475 549864 542157 535181
62726 535181 529693 526200 523960 521904 520246 520233 522292 525424 528717 532576 537888 544708 552570 561634 572661
62711 572661 585928 600927 617200 634989 655008 678076 705044 736598 772823 813189 857175
$$ packed form
62793E72574J3902J5151J5933J6858J8627K1243K3925K6141K8454L1844L6377
62782H21029M1294M6301N1986N8667O5583P1684P6782Q1349Q5506Q8762R0547
62771A579490R0440Q7938Q2756P5346O6541N6423M4189K9565J3800j355j5351
62760B109782k8833m2149n4489o4725p2437p7879q1390q3225q3665q2899q0935
62749A357156p7884p4156p0143o5850o1145n6208n1476m7129m2950l8750l4715
62738G36750l1174k8121k5150k1967j8818j6215j4218j2323j0289q611p707o976
62726E35181n488l493k240k056j658j3K059L132L293L859N312O820P862R064J1027
62711E72661J3267J4999J6273J7789K0019K3068K6968L1554L6225M0366M3986
$$ plain form
62700 857175 904857 956893 1014121 1077170 1146284 1221327 1301802 1386624 1473859 1561069 1646318
62689 1646318 1728625 1807086 1879744 1943756 1996628 2036816 2063197 2074586 2070119 2049805 2014482
62678 2014482 1965451 1904375 1833372 1754888 1671487 1585669 1499579 1414625 1331464 1250577 1172858
62667 1172858 1099564 1031660 969304 912056 859631 812377 770811 734609 702333 672445 644512
62656 644512 619155 596909 577480 560143 544500 530571 518315 507275 496717 486133 475619
62645 475619 465762 457094 449702 443377 437938 433241 429115 425577 423012 421715 421318 421052 420574 420185 420120 420066
62629 420066 419576 418665 417716 416985 416419 415839 415096 414104 412885 411566 410382 409748 410249 412254 415478 419141 422692
62612 422692 426233 430255 435214 441369 448698 456822 465293 474129 483844 494796 506815 519673 533711
$$ packed form
62700H57175M7682N2036N7228O3049O9114P5043Q0475Q4822Q7235Q7210Q5249
62689A646318Q2307P8461P2658O4012N2872M0188K6381J1389m467k0314l5323
62678B014482m9031o1076p1003p8484q3401q5818q6090q4954q3161q0887p7719
62667A172858p3294o7904o2356n7248n2425m7254m1566l6202l2276k9888k7933
62656F44512k5357k2246j9429j7337j5643j3929j2256j1040j0558j0584j0514
62645D75619r857q668p392o325n439m697m126l538k565j297l97k66m78l89o5n4
62629D20066m90r11r49p31n66n80p43r92j219j319j184o34N01K005L224L663L551
62612D22692L541M022M959O155P329Q124Q471Q836R715J0952J2019J2858J4038
$$ plain form
62599 533711 549704 568263 589526 613307 639360 667657 698553 732503 769485 808897 850129
62588 850129 892863 936493 979495 1019764 1055503 1085586 1109308 1126254 1136322 1139433 1135166 1123067
62576 1123067 1103367 1077108 1045527 1009669 970697 930093 889183 848588 808492 769367 732162
62565 732162 697705 666155 637162 610471 586173 564417 545129 528135 513373 500721 489660
62554 489660 479423 469651 460731 453348 447751 443512 439858 436121 432037 427786 423758 420251 417517 416000
62540 416000 416194 418069 420857 423668 426159 428428 430473 432097 433270 434273 435505 437314 439930 443328
62526 443328 447294 451915 457927 466222 477011 489823 504388 521174 540909 563846 589673 617994
62514 617994 648751 682402 719762 761420 807049 855343 904768 954278 1003226 1050806 1095811
$$ packed form
62599E33711J5993J8559K1263K3781K6053K8297L0896L3950L6982L9412M1232
62588H50129M2734M3630M3002M0269L5739L0083K3722J6946J0068L111m267j2099
62576A123067j9700k6259l1581l5858l8972m0604m0910m0595m0096l9125l7205
62565G32162l4457l1550k8993k6691k4298k1756j9288j6994j4762j2652j1061
62554D89660j0237r772q920p383n597m239l654l737m084m251m028l507k734j517
62540D16000J94J875K788K811K491K269K045J624J173J003J232J809K616L398
62526D43328L966M621O012Q295J0789J2812J4565J6786J9735K2937K5827K8321
62514F17994L0757L3651L7360M1658M5629M8294M9425M9510M8948M7580M5005
$$ plain form
62503 1095811 1136860 1172648 1202009 1223954 1237770 1243100 1240073 1229452 1212536 1190694 1164915 1135903
62491 1135903 1104633 1072659 1041763 1013376 988428 967722 952178 942489 938645 940116 946626 958502
62479 958502 976046 998742 1025377 1054857 1086541 1119791 1153580 1186735 1218159 1246520 1269913
62468 1269913 1286284 1294298 1293697 1284841 1268105 1243713 1211985 1173642 1129843 1081901 1030978 978178
62456 978178 924897 872779 823102 776392 732810 692721 656585 624516 596388 572272 552260
62445 552260 535858 522130 510650 501786 495790 492098 489973 489402 490696 493469 496667 499554 502041 504068
62431 504068 505362 505982 506446 506922 506738 505027 501489 496155 488993 480313 471283 463259 456559 450454 444351
62416 444351 438446 433111 428274 423708 419445 415456 411337 406835 402537 399354 397253 395079 391966 388488
$$ packed form
62503A095811M1049L5788K9361K1945J3816N330l027j0621j6916k1842k5779k9012
62491A135903l1270l1974l0896k8387k4948k0706j5544r689l844J471O510J1876
62479I58502J7544K2696K6635K9480L1684L3250L3789L3155L1424K8361K3393
62468A269913J6371Q014o01q856j6736k4392l1728l8343m3799m7942n0923n2800
62456I78178n3281n2118m9677m6710m3582m0089l6136l2069k8128k4116k0012
62445E52260j6402j3728j1480q864n996l692k125n71J294K773L198K887K487K027
62431E04068J294O20M64M76j84j711l538n334p162q680r030q024o700o105o103
62416D44351n905n335m837m566m263l989m119m502m298l183k101k174l113l478
$$ plain form
62402 388488 385906 384475 383182 381245 379214 378179 378292 378694 378710 378471 378316 378253 378245 378528 379237 380117 380943 381922
62384 381922 383345 385223 387589 390739 394648 398524 401689 404709 408836 414340 420156 425429 430650 436869
62370 436869 444330 452431 460721 469413 478991 489747 501742 515046 529986 547157 567154 590248
62358 590248 616430 645690 678104 713737 752725 795348 841602 890628 940826 990526 1038204
62347 1038204 1082171 1120712 1152801 1178250 1196921 1208225 1211664 1207514 1196618 1179777 1157651 1131005
62335 1131005 1100768 1067927 1033491 998331 962968 927816 893683 861653 832338 805613 781191
62324 781191 758977 738776 720251 703424 688598 675434 662768 649744 636505 623224 609201
62313 609201 593675 577040 560425 544501 529453 515699 503628 492818 482477 472621 463994 456884
$$ packed form
62402C88488k582j431j293j937k031j035J13M02J6k39j55o3qK83P09Q80Q26R79
62384C81922J423J878K366L150L909L876L165L020M127N504N816N273N221O219
62370D36869P461Q101Q290Q692R578J0756J1995J3304J4940J7171J9997K3094
62358E90248K6182K9260L2414L5633L8988M2623M6254M9026N0198M9700M7678
62347A038204M3967L8541L2089K5449J8671J1304L439m150j0896j6841k2126k6646
62335A131005l0237l2841l4436l5160l5363l5152l4133l2030k9315k6725k4422
62324G81191k2214k0201j8525j6827j4826j3164j2666j3024j3239j3281j4023
62313F09201j5526j6635j6615j5924j5048j3754j2071j0810j0341r856q627p110
$$ plain form
62301 456884 450864 445699 441665 438824 436779 435274 434328 433631 432583 431123 429852 429168 428993 429498 431276
62286 431276 434391 437967 441127 443787 446212 448481 450788 453622 457104 460648 463755 466686 469887 473217
62272 473217 476279 479112 482043 485209 488779 493345 499543 507448 516724 527188 538937 552297 568039
62259 568039 587307 610836 638481 669887 705215 744727 788074 834628 884158 936441 990277
62248 990277 1043580 1094365 1141095 1182177 1215918 1241222 1257862 1265984 1265851 1258126 1243783 1223328
62236 1223328 1196483 1162944 1123340 1079252 1032433 984166 935302 886758 839851 795970 755850
62225 755850 719424 686447 656976 631091 608630 589579 574240 562412 552793 543986 535979 529915
62213 529915 526457 525172 525450 527110 529855 533039 536438 540492 545281 549976 553920 557664 562123 567119
$$ packed form
62301D56884o020n165m034k841k045j505r46o97j048j460j271o84j75N05J778
62286D31276L115L576L160K660K425K269K307K834L482L544L107K931L201L330
62272D73217L062K833K931L166L570M566O198P905R276J0464J1749J3360J5742
62259E68039J9268K3529K7645L1406L5328L9512M3347M6554M9530N2283N3836
62248I90277N3303N0785M6730M1082L3741K5304J6640Q122j33p725j4343k0455
62236A223328k6845l3539l9604m4088m6819m8267m8864m8544m6907m3881m0120
62225G55850l6426l2977k9471k5885k2461j9051j5339j1828r619q807q007o064
62213E29915l458j285K78J660K745L184L399M054M789M695L944L744M459M996
$$ plain form
62199 567119 571597 575025 577758 580030 581434 581629 580972 580159 579618 579504 579929 580929 582380 584157 586287 588885
62183 588885 592056 595888 600377 605398 610883 616875 623082 628530 632194 634111 635478 637524 640698 645086
62169 645086 651025 658885 668714 680773 696180 716275 741249 770008 801507 835607 872232 910173
62157 910173 947281 981698 1012464 1039006 1060561 1076351 1086051 1089819 1087844 1080073 1066496 1047724
62145 1047724 1025083 999968 973129 944781 915320 885583 856317 827866 800685 775800 754225
62134 754225 736044 720612 707654 697660 690998 687080 684698 682973 681753 681323 682007 683952 687083 691292
62120 691292 696716 703652 712052 721209 730108 737966 744364 749129 752375 754540 756030 756777 756329 754374 751040
62105 751040 746708 741732 736356 730749 724984 718986 712529 705424 697949 691098 686148 683743 683565 685054
$$ packed form
62199E67119M478L428K733K272J404J95o57q13n41j14M25J000J451J777K130K598
62183E88885L171L832M489N021N485N992O207N448L664J917J367K046L174M388
62169F45086N939P860R829J2059J5407K0095K4974K8759L1499L4100L6625L7941
62157I10173L7108L4417L0766K6542K1555J5790R700L768j975p771j3577j8772
62145A047724k2641k5115k6839k8348k9461k9737k9266k8451k7181k4885k1575
62134G54225j8181j5432j2958r994o662l918k382j725j220m30O84J945L131M209
62120F91292N424O936Q400R157Q899P858O398M765L246K165J490P47m48j955l334
62105G51040m332m976n376n607n765n998o457p105p475o851m950k405j78J489
$$ plain form
62091 685054 688090 692610 697882 702929 707827 713910 722240 732207 742166 751230 759993 769581 780566 792956
62077 792956 806717 821925 838580 856587 875815 895951 916478 937033 957643 978316 998563
62066 998563 1017751 1035943 1053864 1071939 1089907 1107658 1125966 1145821 1167207 1188987 1209800
62055 1209800 1228562 1244244 1255863 1262973 1265777 1264561 1259270 1249752 1236110 1218650 1197678 1173421
62043 1173421 1145855 1114567 1079226 1040406 999599 958182 916687 875340 834873 796379 760560
62032 760560 727595 697579 670618 646461 624511 604403 586336 570681 557359 545713 534951
62021 534951 524725 515312 507166 500229 493743 486815 479098 470930 462988 455895 449945 444965 440510 436342
62007 436342 432728 430250 429415 430374 432766 435858 439216 443341 449177 456737 464695 471717 477736 483391 488645
$$ packed form
62091F85054L036M520N272N047M898O083Q330R967R959R064Q763R588J0985J2390
62077G92956J3761J5208J6655J8007J9228K0136K0527K0555K0610K0673K0247
62066I98563J9188J8192J7921J8075J7968J7751J8308J9855K1386K1780K0813
62055A209800J8762J5682J1619P110K804j216n291r518j3642j7460k0972k4257
62043A173421k7566l1288l5341l8820m0807m1417m1495m1347m0467l8494l5819
62032G60560l2965l0016k6961k4157k1950k0108j8067j5655j3322j1646j0762
62021E34951j0226r413q146o937o486o928p717q168p942p093n950m980m455m168
62007D36342l614k478q35R59K392L092L358M125N836P560P958P022O019N655N254
$$ plain form
61992 488645 492805 495781 498398 501166 503395 503972 502545 499557 495460 490448 484793 478904 472904 466470
61978 466470 459260 451405 443506 436265 430286 426024 423530 422050 420175 416934 412778 409158 406965 405661
61964 405661 404102 401820 399233 396905 395034 393579 392448 391560 390899 390529 390455 390579 390915 391624 392746 394154
61948 394154 395994 398742 402519 406797 411294 416784 424297 433736 444073 454925 467148 481665 498333
61935 498333 516181 534247 551903 568900 585453 601968 618414 634172 648625 661509 672577
61924 672577 681352 687496 691136 692554 691812 688848 683752 676810 668561 659857 651538 643942 637085 631355
61910 631355 627559 626161 627015 630030 635571 643836 654378 666575 680104 694430 708296 720287 729717
61897 729717 736452 740180 740397 737066 730765 722157 711650 699541 686215 672234 658343 645211 632975
$$ packed form
61992D88645M160K976K617K768K229N77j427k988m097n012n655n889o000o434
61978D66470p210p855p899p241n979m262k494j480j875l241m156l620k193j304
61964D05661j559k282k587k328j871j455j131q88o61l70p4J24L36P09J122J408
61948C94154J840K748L777M278M497N490P513R439J0337J0852J2223J4517J6668
61935D98333J7848J8066J7656J6997J6553J6515J6446J5758J4453J2884J1068
61924F72577Q775O144L640J418p42k964n096o942q249q704q319p596o857n730
61910F31355l796j398Q54L015N541Q265J0542J2197J3529J4326J3866J1991R430
61897G29717O735L728K17l331o301q608j0507j2109j3326j3981j3891j3132j2236
$$ plain form
61884 632975 621198 609452 597665 585865 574080 562791 552819 544239 535904 526735 517106 508164 500145
61871 500145 492322 484501 477517 472015 467655 463954 461196 460028 460653 462911 466764 472228 479040 486892
61857 486892 495856 506325 518588 532719 548729 566622 586312 607665 630623 655226 681549 709524
61845 709524 738648 767950 796441 823533 848810 871556 890923 906483 918156 925561 928067 925754
61833 925754 919843 911800 902347 891660 880224 869064 859326 851997 847867 847326 850175 855831 863644 872867
61819 872867 882514 891568 899292 905120 908259 907600 902105 891276 875412 855452 832431 806976 779510
61806 779510 750901 722468 695154 669053 644045 620519 599064 579832 562748 548028 535786
61795 535786 525220 515013 504683 494918 486406 478929 471980 465653 460419 456436 453582 451840 451003 450191
$$ packed form
61884F32975j1777j1746j1787j1800j1785j1289r972q580q335r169r629q942q019
61871E00145p823p821o984n502m360l701k758j168O25K258L853N464O812P852
61857D86892Q964J0469J2263J4131J6010J7893J9690K1353K2958K4603K6323K7975
61845G09524K9124K9302K8491K7092K5277K2746J9367J5560J1673P405K506k313
61833I25754n911q043r453j0687j1436j1160r738p329m130n41K849N656P813R223
61819H72867R647R054P724N828L139o59n495j0829j5864j9960k3021k5455k7466
61806G79510k8609k8433k7314k6101k5008k3526k1455j9232j7084j4720j2242
61795E35786j0566j0207j0330r765q512p477o949o327n234l983k854j742q37q12
$$ plain form
61781 450191 448335 445287 441967 439275 437248 435483 433921 432839 432277 431921 431588 431508 431979 432834 433410 433069
61765 433069 431782 430190 429092 428893 429500 430652 432183 433910 435481 436567 437275 438256 440205 443217 446636
61750 446636 449576 451523 452439 452490 451895 451036 450369 450013 449568 448550 446921 445037 443185 441432 439865 438605
61734 438605 437509 436197 434548 432925 431740 431057 430816 431147 432093 433271 434307 435514 437604 440620 443679
61719 443679 446069 448226 451207 455349 459860 463703 466558 468800 470817 472558 473697 474048 473673 472586 470510
61704 470510 467193 462953 458636 454801 451115 446927 442350 438411 435922 434464 432792 430106 426667 423186
61690 423186 419998 417024 414277 412034 410455 409265 407957 406240 404221 402195 400341 398569 396664 394584
61676 394584 392591 390998 389824 388848 387933 387016 385822 384014 381848 380234 379726 379731 379253 378175 377200 376633 375985
$$ packed form
61781D50191j856l048l320k692k027j765j562j082n62l56l33q0M71Q55N76l41
61765D33069j287j592j098j99O07J152J531J727J571J086P08R81J949L012L419
61750D46636K940J947R16N1n95q59o67l56m45j018j629j884j852j753j567j260
61734D38605j096j312j649j623j185o83k41L31R46J178J036J207K090L016L059
61719D43679K390K157K981M142M511L843K855K242K017J741J139L51l75j087k076
61704D70510l317m240m317l835l686m188m577l939k489j458j672k686l439l481
61690D23186l188k974k747k243j579j190j308j717k019k026j854j772j905k080
61676C94584j993j593j174r76r15r17j194j808k166j614n08Nm78j078r75n67o48
$$ plain form
61659 375985 374985 374241 374447 375391 376214 376275 375395 373723 371948 371276 372453 374863 377213 379030 380871 383081
61643 383081 385189 386772 388225 390180 392642 395205 397734 400272 402536 404039 404731 405041 405264 405216 404487 402735
61627 402735 399829 396042 392125 388789 386061 383467 380881 378728 377230 375951 374515 373329 373089 373720 374333
61612 374333 374165 373093 371214 368498 365137 361758 358818 355945 352282 347474 342060 336884 332331 328181
61598 328181 323995 319551 314976 310586 306638 303269 300586 298630 297147 295533 293210 290069 286492 283031
61584 283031 280074 277696 275688 273836 272268 271305 270830 270061 268341 266012 264103 263184 262957 262993 263322 264042
61568 264042 264818 265198 265232 265323 265536 265400 264498 263028 261650 260865 260656 260734 261074 262054 263915 266192 267938 268594
61550 268594 268445 268180 268204 268504 268976 269676 270827 272632 274964 277247 278870 279831 280689 281745 282618 282903 282968
$$ packed form
61659C75985j000p44K06R44Q23O1q80j672j775o72J177K410K350J817J841K210
61643C83081K108J583J453J955K462K563K529K538K264J503O92L10K23m8p29j752
61627D02735k906l787l917l336k728k594k586k153j498j279j436j186k40O31O13
61612C74333j68j072j879k716l361l379k940k873l663m808n414n176m553m150
61598C28181m186m444m575m390l948l369k683j956j483j614k323l141l577l461
61584B83031k957k378k008j852j568r63m75p69j720k329j909r19k27L6L29P20
61568B64042P76L80L4R1K13j36r02j470j378p85k09P8L40R80J861K277J746O56
61550B68594j49k65K4L00M72P00J151J805K332K283J623R61Q58J056Q73K85O5
$$ plain form
61533 282968 283635 285209 287193 288996 290496 291795 292722 292866 292066 290683 289318 288267 287326 286160 284745
61518 284745 283302 281867 280269 278567 277198 276544 276589 277124 277971 278795 279111 278858 278623 278807 278801 277604 275245
61501 275245 273024 272192 272821 274086 275185 275730 275658 275194 274769 274687 274816 274746 274193 273205 272106 271347 271325 272174 273681
61482 273681 275379 276699 277163 276686 275793 275451 276439 278724 281346 283064 283412 283259 284062 286372 289277 291480
61466 291480 292615 293223 293738 294099 294250 294401 294616 294628 294282 293812 293469 293189 292847 292635 292943 294028 295854 298015
61448 298015 299658 299896 298642 296904 295964 296291 297449 298840 300285 301922 303916 306318 309033 311776 314219
61433 314219 316271 318157 320125 322072 323578 324412 324909 325656 326820 328041 329095 330338 332177 334300 335911
61418 335911 336690 337149 337929 339104 340352 341544 342911 344787 347284 350080 352413 353492 353126 351909 350707
$$ packed form
61533B82968O67J574J984J803J500J299R27J44q00j383j365j051r41j166j415
61518B84745j443j435j598j702j369o54M5N35Q47Q24L16k53k35J84oj197k359
61501B75245k221q32O29J265J099N45p2m64m25q2J29p0n53r88j099p59k2Q49J507
61482B73681J698J320M64m77q93l42R88K285K622J718L48j53Q03K310K905K203
61466B91480J135O08N15L61J51J51K15J2l46m70l43k80l42k12L08J085J826K161
61448B98015J643K38j254j738r40L27J158J391J445J637J994K402K715K743K443
61433C14219K052J886J968J947J506Q34M97P47J164J221J054J243J839K123J611
61418C35911P79M59P80J175J248J192J367J876K497K796K333J079l66j217j202
$$ plain form
61403 350707 349989 349595 348972 347617 345501 343119 341009 339215 337354 335124 332466 329377 325955 322768 320679
61388 320679 320072 320479 321119 321586 321873 322081 322410 323131 324275 325491 326428 327101 327667 328053 328127 328048 328203 328810 329871
61369 329871 331382 333309 335402 337346 339167 341285 344065 347412 350831 353798 356021 357484 358449 359498
61355 359498 361440 364828 369398 374202 378562 382748 387429 392698 398064 403313 408799 414751 420808 426441
61341 426441 431443 435791 439488 442770 446087 449617 453153 456674 460522 464739 468754 472127 475070 477703
61327 477703 479310 479088 477325 475080 472841 470231 467015 463680 460912 459024 458008 457654 457548 457474 457927 459797
61311 459797 463424 468342 474006 480337 487563 496034 506213 518203 531075 543250 553908 563523 572731
61298 572731 581202 588074 592994 596139 597531 596959 594453 590268 584481 577115 568642 559839 551069 542169
$$ packed form
61403C50707p18l94o23j355k116k382k110j794j861k230k658l089l422l187k089
61388C20679o07M07O40M67K87K08L29P21J144J216R37O73N66L86P4p9J55O07J061
61369C29871J511J927K093J944J821K118K780L347L419K967K223J463R65J049
61355C59498J942L388M570M804M360M186M681N269N366N249N486N952O057N633
61341D26441N002M348L697L282L317L530L536L521L848M217M015L373K943K633
61327D77703J607k22j763k245k239k610l216l335k768j888j016l54j06p4M53J870
61311D59797L627M918N664O331P226Q471J0179J1990J2872J2175J0658R615R208
61298E72731Q471O872M920L145J392n72k506m185n787p366q473q803q770q900
$$ plain form
61284 542169 533148 524526 516735 509623 502854 496473 490676 485295 480100 475534 472574 471664 472179 473188 474377
61269 474377 475901 477670 479322 480890 482946 485925 489613 493495 497400 501623 506567 512462 519369 527283
61255 527283 536131 545572 554809 562871 569333 574564 578982 582326 584218 585250 586710 589057 591412 592898
61241 592898 593748 594572 595182 594909 593642 591799 589575 586969 584273 581723 578826 574967 570731 567730 566855
61226 566855 567423 568380 569580 571446 573991 576829 579863 583342 587324 591498 595584 599720 604384 609920 616011
61211 616011 621699 626219 629775 633195 636859 640442 643687 646828 649965 652573 654113 654876 655902 658216
61197 658216 662359 668320 675624 683708 692527 702616 714309 727169 740380 753391 765784 776845
61185 776845 785827 792569 797410 800580 802155 802633 802969 803685 804256 803734 801879 799346 796725 793731 789608
$$ packed form
61284E42169r021q622p791p112o769o381n797n381n195m566k960r10N15J009J189
61269D74377J524J769J652J568K056K979L688L882L905M223M944N895O907P914
61255E27283Q848R441R237Q062O462N231M418L344J892J032J460K347K355J486
61241E92898Q50Q24O10k73j267j843k224k606k696k550k897l859m236l001q75
61226E66855N68R57J200J866K545K838L034L479L982M174M086M136M664N536O091
61211F16011N688M520L556L420L664L583L245L141L137K608J540P63J026K314
61197F58216M143N961P304Q084Q819J0089J1693J2860J3211J3011J2393J1061
61185G76845Q982O742M841L170J575M78L36P16N71n22j855k533k621k994m123
$$ plain form
61170 789608 784205 778288 772602 766903 760315 752530 744235 736232 728485 720252 710911 700449 689361 678329
61156 678329 667869 658023 648455 639023 630135 622334 615639 609578 603883 598853 594944 592188 590183 588482
61142 588482 586714 584330 580601 575163 568448 561300 554239 547432 541311 536652 533788 532223 531382 531331 532349
61127 532349 534247 536769 540332 545579 552346 559860 568021 577676 589465 603148 618371 635353 654386
61114 654386 675136 696896 719133 741516 763867 786404 809603 833556 857829 882117 906390
61103 906390 930079 951795 970445 986099 999337 1010296 1018854 1025039 1028463 1027906 1022421 1012612 1000004
61090 1000004 985370 968567 949787 929917 909478 888086 865387 841982 819082 797533 777354
61079 777354 758050 739265 721280 704724 689685 675476 661606 648526 636909 626606 617033 608310
$$ packed form
61170G89608n403n917n686n699o588p785q295q003p747q233r341j0462j1088j1032
61156F78329j0460r846r568r432q888p801o695o061n695n030l909k756k005j701
61142E88482j768k384l729n438o715p148p061o807o121m659k864j565q41n1J018
61127E32349J898K522L563N247O767P514Q161R655J1789J3683J5223J6982J9033
61114F54386K0750K1760K2237K2383K2351K2537K3199K3953K4273K4288K4273
61103I06390K3689K1716J8650J5654J3238J0959Q558O185L424n57n485r809j2608
61090A000004j4634j6803j8780j9870k0439k1392k2699k3405k2900k1549k0179
61079G77354j9304j8785j7985j6556j5039j4209j3870j3080j1617j0303r573q723
$$ plain form
61067 608310 601199 596005 592306 589681 587993 587006 586527 586849 588223 589928 590880 591394 593313 597952 604672
61052 604672 611959 619174 626805 635680 646526 659729 674901 691006 707381 724323 742401 761731
61040 761731 782403 805104 830629 858935 889184 920637 953228 987413 1023744 1062379 1102823
61029 1102823 1144340 1186697 1230228 1275179 1321495 1369285 1418886 1470293 1523278 1578448 1637535
61018 1637535 1702252 1773340 1851112 1936274 2029899 2133396 2249080 2380313 2530959 2705950
61008 2705950 2913251 3164575 3474126 3858624 4339890 4945319 5703165 6637399 7766677
60999 7766677 9101109 10629078 12302859 14042781 15761552 17383355 18838164 20048902
60991 20048902 20945935 21509068 21793311 21902682 21931691 21927144 21892534 21806417 21622129 21258430
$$ packed form
61067F08310p111n194l699k625j688r87m79L22J374J705R52N14J919M639O720
61052F04672P287P215P631Q875J0846J3203J5172J6105J6375J6942J8078J9330
61040G61731K0672K2701K5525K8306L0249L1453L2591L4185L6331L8635M0444
61029A102823M1517M2357M3531M4951M6316M7790M9601N1407N2985N5170N9087
61018A637535O4717P1088P7772Q5162R3625J03497J15684J31233J50646J74991
61008B705950K07301K51324L09551L84498M81266O05429P57846R34234J129278
60999G766677J334432J527969J673781J739922J718771J621803J454809J210738
60991B0048902Q97033N63133K84243J09371K9009m547l4610q6117j84288l63699
$$ plain form
60981 21258430 20615561 19622762 18281268 16667307 14899059 13098610 11369282 9785973
60973 9785973 8391193 7197184 6194996 5364955 4682894 4123272 3662523 3281748 2966350
60964 2966350 2703861 2483120 2294901 2132093 1989209 1862440 1749885 1650723 1563853 1487637
60954 1487637 1420749 1362637 1312987 1271033 1235444 1204653 1177321 1152546 1129640 1107872 1086844
60943 1086844 1067032 1049329 1033924 1020200 1007912 997606 989441 982381 975318 968388 962426 957593
60931 957593 953428 949904 947462 946106 945350 945042 945454 946473 947489 948207 948903 949691 950262 950606 951309 952702
60915 952702 954162 954670 953780 951742 948964 945660 941787 937029 930986 923530 914914 905446 895250 884394
60901 884394 873011 861234 849247 837468 826414 816214 806470 796637 786475 776112 765927 756287
$$ packed form
60981B1258430o42869r92799j341494j613961j768248j800449j729328j583309
60973I785973j394780j194009j002188q30041o82061n59622m60749l80775l15398
60964B966350k62489k20741j88219j62808j42884j26769j12555r9162q6870p6216
60954A487637o6888n8112m9650m1954l5589l0791k7332k4775k2906k1768k1028
60943A086844j9812j7703j5405j3724j2288j0306q165p060p063o930n962m833
60931I57593m165l524k442j356p56l08M12J019J016P18O96P88N71L44P03J393
60915I52702J460N08q90k038k778l304l873m758o043p456q616r468j0196j0856
60901H84394j1383j1777j1987j1779j1054j0200r744r833j0162j0363j0185r640
$$ plain form
60889 756287 747162 737998 728353 718606 709600 701463 693248 683917 673313 661953 650308 638690 627535
60876 627535 617356 608377 600416 593039 585754 578287 570908 564315 559005 554813 551172 547684 544315 541218
60862 541218 538490 535949 533064 529365 525121 521314 518619 516531 513771 509569 504388 499479 495837 493534
60848 493534 491848 490014 487805 485362 482600 479138 474871 470246 465825 461747 457782 453622 448936 443410
60834 443410 437050 430329 423869 418073 413171 409311 406383 403989 401807 399834 398123 396616 395472 395144
60820 395144 395746 396648 397202 397655 398776 400702 402721 404166 404982 405328 405202 404685 404121 403702 403160 402174 400914
60803 400914 399942 399674 400116 401051 402213 403281 403840 403584 402649 401691 401361 401595 401602 400704 399016 397127 395342 393552
60785 393552 391627 389538 387178 384433 381441 378396 375165 371509 367710 364470 362011 359731 357031 354138
$$ packed form
60889G56287r125r164r645r747r006q137q215r331j0604j1360j1645j1618j1155
60876F27535j0179q979p961p377p285p467p379o593n310m192l641l488l369l097
60862E41218k728k541k885l699m244l807k695k088k760m202n181m909l642k303
60848D93534j686j834k209k443k762l462m267m625m421m078l965m160m686n526
60834D43410o360o721o460n796m902l860k928k394k182j973j711j507j144l28
60820C95144O02R02N54M53J121J926K019J445Q16L46j26n17n64m19n42r86j260
60803D00914r72k68M42R35J162J068N59k56r35r58l30K34Pq98j688j889j785j790
60785C93552j925k089k360k745k992l045l231l656l799l240k459k280k700k893
$$ plain form
60771 354138 351813 350444 349748 349206 348529 347802 347406 347765 349002 350849 352882 354745 356198 357223 358191 359600
60755 359600 361431 363027 363867 364275 365037 366486 368298 370125 372043 374282 376809 379317 381525 383378 385122
60740 385122 387172 389683 392032 392883 391036 386370 379971 373375 367665 363170 359673 356751 353981 351066
60726 351066 347891 344473 340829 336962 332949 329026 325543 322807 320884 319477 318087 316407 314506 312556
60712 312556 310563 308593 307058 306350 306196 305874 305160 304595 304598 304851 304911 304967 305400 305952 305995 305461 304862 304435 303914
60693 303914 303233 302837 303070 303777 304794 306403 308934 312138 315312 317982 320265 322622 325347 328324 331321
60678 331321 334503 338393 343137 348107 352638 356907 361528 366447 370939 374766 378547 382643 386317 388516
60664 388516 389080 388678 387792 386289 383931 380938 377951 375527 373693 372019 370256 368736 367873 367447 366877 366172
$$ packed form
60771C54138k325j369o96n42o77p27l96L59J237J847K033J863J453J025R68J409
60755C59600J831J596Q40M08P62J449J812J827J918K239K527K508K208J853J744
60740C85122K050K511K349Q51j847m666o399o596n710m495l497k922k770k915
60726C51066l175l418l644l867m013l923l483k736j923j407j390j680j901j950
60712C12556j993j970j535p08j54l22p14n65LK53O0N6M33N52M3n34n99m27n21
60693C03914o81l96K33P07J017J609K531L204L174K670K283K357K725K977K997
60678C31321L182L890M744M970M531M269M621M919M492L827L781M096L674K199
60664C88516N64m02q86j503k358k993k987k424j834j674j763j520q63m26n70p05
$$ plain form
60648 366172 366015 366847 368431 370412 372602 374461 375074 374123 372298 370267 367853 364770 361443 358319 354953
60633 354953 350759 346319 342919 340900 339439 338009 337075 337059 337446 337379 336628 335567 334588 333858 333376 332998 332652
60616 332652 332623 333354 334741 335937 336078 335069 333493 331953 330723 329920 329791 330667 332556 334852 336665 337605
60600 337605 338045 338486 338925 339148 339361 340099 341559 343419 345264 346827 347894 348364 348474 348642 349061 349669 350403
60583 350403 351124 351402 350843 349673 348651 348396 349110 350807 353319 356064 358369 360289 362752 366760 372723
60568 372723 380569 390042 400715 412113 424038 436498 449102 460799 470366 477054 480762 481890 481008
60555 481008 478386 473872 467581 460594 454391 449524 445436 441727 438948 437812 438334 440227 443632 448763
60541 448763 455208 462314 470224 479867 491827 505706 520663 536101 551561 566224 578945 588780
$$ packed form
60648C66172j57Q32J584J981K190J859O13r51j825k031k414l083l327l124l366
60633C54953m194m440l400k019j461j430r34j6L87o7p51j061r79p30m82l78l46
60616C32652k9P31J387J196J41j009j576j540j230q03j29Q76J889K296J813R40
60600C37605M40M41M39K23K13P38J460J860J845J563J067M70J10J68M19O08P34
60583C50403P21K78n59j170j022k55P14J697K512K745K305J920K463M008N963
60568C72723P846R473J0673J1398J1925J2460J2604J1697R567O688L708J128q82
60555D81008k622m514o291o987o203m867m088l709k779j136N22J893L405N131
60541D48763O445P106P910R643J1960J3879J4957J5438J5460J4663J2721R835
$$ plain form
60529 588780 595365 598809 599432 597715 594358 590043 585011 579115 572442 565611 559147 552841 546235 539626
60515 539626 534008 529914 526901 524361 522355 521329 521458 522679 525090 528853 533824 539733 546752 555664
60501 555664 567374 582349 600565 622071 647506 677811 713119 752129 792987 834746 877482
60490 877482 920976 963754 1003526 1038116 1065815 1085399 1096191 1097853 1089985 1072270 1045196 1010217
60478 1010217 969064 923394 875216 826969 780646 737142 696763 659810 626368 596127 569037
60467 569037 545623 526093 509526 494668 481181 469434 459353 450231 441523 433127 424979 417137
60455 417137 410194 404909 401288 398581 396194 393974 391626 388592 384799 380969 377859 375525 373532 371544
60441 371544 369595 367987 366962 366260 365197 363561 362160 361861 362308 362415 362085 362354 363605 364698 364555 363721
$$ packed form
60529E88780O585L444O23j717l357m315n032n896o673o831o464o306o606o609
60515E39626n618m094l013k540k006j026J29J221K411L763M971N909P019Q912
60501E55664J1710J4975J8216K1506K5435L0305L5308L9010M0858M1759M2736
60490H77482M3494M2778L9772L4590K7699J9584J0792J662p868j7715k7074l4979
60478A010217m1153m5670m8178m8247m6323m3504m0379l6953l3442l0241k7090
60467E69037k3414j9530j6567j4858j3487j1747j0081r122q708q396q148p842
60455D17137o943n285l621k707k387k220k348l034l793l830l110k334j993j988
60441C71544j949j608j025p02j063j636j401k99M47J07l30K69J251J093j43q34
$$ plain form
60425 363721 363486 364047 364501 364345 363992 363802 363495 362756 361793 360964 360307 359783 359683 360413 361937 363692 365080 365978
60407 365978 366733 367698 368796 369662 370202 370873 372242 374327 376509 378110 378959 379424 380024 381044 382483 384276
60391 384276 386472 389073 391766 393997 395401 396068 396346 396544 396898 397640 398953 400948 403757 407463 411781
60376 411781 415959 419338 421943 424357 426995 429762 432389 434839 437248 439614 441689 443088 443443 442665 441235
60361 441235 440110 440121 441398 443441 445696 447997 450515 453516 457142 461343 465979 471129 477242 484776 493639
60346 493639 503096 512200 520141 526270 530280 532512 533661 533814 532094 527684 521028 513504 506095 498939
60332 498939 492110 486087 481143 476848 472599 468318 464279 460500 456702 452730 448689 444751 441075 437806
60318 437806 434988 432627 430942 430297 430680 431536 432460 433888 436782 441783 448885 457751 468057 479714 493117
$$ packed form
60425C63721k35N61M54j56l53j90l07p39r63q29o57n24j00P30J524J755J388Q98
60407C65978P55R65J098Q66N40O71J369K085K182J601Q49M65O00J020J439J793
60391C84276K196K601K693K231J404O67K78J98L54P42J313J995K809L706M318
60376D11781M178L379K605K414K638K767K627K450K409K366K075J399L55p78j430
60361D41235j125J1J277K043K255K301K518L001L626M201M636N150O113P534Q863
60346D93639R457R104P941O129M010K232J149J53j720m410o656p524p409p156
60332D98939o829o023m944m295m249m281m039l779l798l972m041l938l676l269
60318D37806k818k361j685o45L83Q56R24J428K894N001P102Q866J0306J1657J3403
$$ plain form
60303 493117 508975 527492 547797 568419 588100 605753 619953 629204 632828 631036 624089 612036
60291 612036 595516 576279 556456 537511 520110 504655 491492 480732 472209 465638 460686 457005
60279 457005 454352 452580 451364 450093 448249 445879 443507 441560 439965 438264 435976 432853 428953 424623
60265 424623 420394 416707 413604 410752 407900 405266 403281 401972 400872 399596 398229 397014 395976 395116
60251 395116 394699 394968 395740 396669 397768 399277 401083 402708 403919 404954 406088 407334 408683 410230 411856
60236 411856 413143 413884 414436 415236 416097 416412 416082 415899 416703 418343 419846 420701 421583 423478 426383 429397 431943
60219 431943 434218 436360 438011 439145 440640 443309 446860 450583 454629 459669 465504 471067 476002 481263
60205 481263 487792 495318 502842 509677 515563 520416 524526 528712 533702 539515 545733 552053 558160 563353
$$ packed form
60303D93117J5858J8517K0305K0622J9681J7653J4200R251L624j792o947j2053
60291F12036j6520j9237j9823j8945j7401j5455j3163j0760q523o571m952l681
60279D57005k653j772j216j271j844k370k372j947j595j701k288l123l900m330
60265D24623m229l687l103k852k852k634j985j309j100j276j367j215j038q60
60251C95116m17K69P72R29J099J509J806J625J211J035J134J246J349J547J626
60236D11856J287P41N52Q00Q61L15l30j83Q04J640J503Q55Q82J895K905L014K546
60219D31943K275K142J651J134J495K669L551L723M046N040N835N563M935N261
60205D81263O529P526P524O835N886M853M110M186M990N813O218O320O107N193
$$ plain form
60191 563353 566866 568650 569551 570610 572170 573616 573976 572895 570935 568761 566238 562786 558430 553854 549377
60176 549377 544633 539522 534773 531082 528208 525380 522135 518308 513791 508972 505041 503005 502479 502024 500611
60161 500611 498272 495542 492945 491047 490299 490572 491251 491965 492894 494231 495657 496564 496648 496199 495970 496731 498707
60144 498707 501387 503969 505997 507501 508782 510343 512862 516839 522184 528367 534873 541301 547210 552328
60130 552328 556928 561580 566435 571088 575215 578937 582368 585128 586663 586957 586686 586674 587300 588391 589620
60115 589620 590912 592447 594306 596320 598361 600570 603021 605278 606652 606924 606580 606239 606016 605508 604181
60100 604181 601699 598092 593816 589605 586040 583135 580264 576600 571869 566798 562686 560295 559213 558485
60086 558485 557766 557575 558431 560091 561854 563373 564904 566739 568692 570341 571666 573167 575153 577019 577598
$$ packed form
60191E63353L513J784R01J059J560J446L60j081j960k174k523l452m356m576m477
60176E49377m744n111m749l691k874k828l245l827m517m819l931k036n26m55j413
60161E00611k339k730k597j898p48K73O79P14R29J337J426R07Q4m49k29P61J976
60144D98707K680K582K028J504J281J561K519L977N345O183O506O428N909N118
60130E52328M600M652M855M653M127L722L431K760J535K94k71j2O26J091J229
60115E89620J292J535J859K014K041K209K451K257J374K72l44l41k23n08j327
60100F04181k482l607m276m211l565k905k871l664m731n071m112k391j082p28
60086E58485p19j91Q56J660J763J519J531J835J953J649J325J501J986J866N79
$$ plain form
60071 577598 576301 573647 570461 566779 561857 555221 547350 539238 531506 524127 516866 509730 502948 496601
60057 496601 490473 484301 478089 472070 466483 461575 457765 455517 454838 455098 455564 456111 457292 459697 463306
60042 463306 467460 471449 475140 479000 483481 488521 493745 498928 504008 508814 513147 517054 520531 522980
60028 522980 523493 521903 519157 516352 513725 510751 506917 502151 496841 491668 487110 482862 478089 472496
60014 472496 466767 461684 457174 452599 447548 442009 436191 430676 426313 423386 421143 418703 416088 413815
60000 413815 411921 410116 408576 407685 407189 406484 405674 405443 405852 406266 406611 407682 409859 412405 414571 416638
59984 416638 419263 422453 425799 429152 432430 435196 437196 438959 441114 443257 444203 443389 441428 439248 437218
59969 437218 435342 433820 432949 432570 431963 430578 428876 428186 429417 432013 434527 436214 437599 439444 441746
$$ packed form
60071E77598j297k654l186l682m922o636p871q112p732p379p261p136o782o347
60057D96601o128o172o212o019n587m908l810k248o79K60M66N47J181K405L609
60042D63306M154L989L691L860M481N040N224N183N080M806M333L907L477K449
60028E22980N13j590k746k805k627k974l834m766n310n173m558m248m773n593
60014D72496n729n083m510m575n051n539n818n515m363k927k243k440k615k273
60000D13815j894j805j540q91m96p05q10k31M09M14L45J071K177K546K166K067
59984D16638K625L190L346L353L278K766K000J763K155K143R46q14j961k180k030
59969D37218j876j522q71l79o07j385j702o90J231K596K514J687J385J845K302
$$ plain form
59954 441746 444061 446219 448134 449306 449249 448337 447613 447656 448065 448101 447448 446255 444880 443806 443445 443735 444068
59937 444068 443886 443243 442611 442158 441498 440256 438775 438026 438702 440537 442686 444693 446830 449436 452234 454552
59921 454552 456110 457411 459370 462697 467536 473530 480163 487038 493867 500327 506133 511170 515328 518228
59907 518228 519542 519679 519732 520365 521067 520876 519647 518142 516959 515912 514550 512899 511388 510265 509325 508202
59891 508202 506860 505783 505668 506849 509045 511738 514691 517969 521644 525799 530721 536674 543320 549755
59877 549755 555418 560758 566684 573433 580282 586278 590970 594310 596245 596649 595503 592897 588952 583982
59863 583982 578642 573561 568730 563571 557842 552217 547709 544726 543038 542467 543057 544557 546324 548080 550386
59848 550386 553983 558898 564553 570490 576501 582153 586763 589947 591775 592209 590859 587711 583768 580505
$$ packed form
59954D41746K315K158J915J172n7r12p24M3M09L6o53j193j375j074l61K90L33
59937D44068j82o43o32m53o60j242j481p49O76J835K149K007K137K606K798K318
59921D54552J558J301J959L327M839N994O633O875O829O460N806N037M158K900
59907E18228J314J37N3O33P02j91j229j505j183j047j362j651j511j123r40j123
59891E08202j342j077j15J181K196K693K953L278L675M155M922N953O646O435
59877E49755N663N340N926O749O849N996M692L340J935M04j146k606l945m970
59863E83982n340n081m831n159n729n625m508k983j688n71N90J500J767J756K306
59848E50386L597M915N655N937O011N652M610L184J828M34j350l148l943l263
$$ plain form
59834 580505 578658 577796 576962 575365 572505 568183 562721 556925 551495 546566 542039 538206 535673 534606 534335
59819 534335 533830 532451 530190 527414 524499 521590 518577 515355 512136 509359 507191 505264 503021 500160
59805 500160 496648 492537 488035 483646 479880 476806 474096 471567 469418 467852 466711 465676 464716 464081 463854
59790 463854 463725 463328 462663 461988 461393 460811 460507 461093 462662 464230 464572 463609 462392 461702 461299 460781 460425 460653
59772 460653 461222 461646 462062 462903 463935 464450 464417 464632 465597 466977 468406 470110 472301 474539 476249 477504
59756 477504 478851 480670 483167 486657 491266 496513 501740 506959 512753 519300 526007 532359 538675 545678
59742 545678 553440 561148 567893 573438 578067 581907 584659 586033 586269 586023 585810 585656 585245 584244 582515
59727 582515 580174 577533 574900 572401 570081 568108 566717 565859 565012 563526 561209 558613 556615 555555 554766
$$ packed form
59834E80505j847q62q34j597k860m322n462n796n430m929m527l833k533j067k71
59819E34335n05j379k261k776k915k909l013l222l219k777k168j927k243k861
59805E00160l512m111m502m389l766l074k710k529k149j566j141j035r60o35k27
59790D63854j29l97o65o75n95n82l04N86J569J568L42r63j217o90m03n18l56K28
59772D60653N69M24M16Q41J032N15l3K15R65J380J429J704K191K238J710J255
59756D77504J347J819K497L490M609N247N227N219N794O547O707O352O316P003
59742E45678P762P708O745N545M629L840K752J374K36k46k13j54m11j001j729
59727E82515k341k641k633k499k320j973j391q58q47j486k317k596j998j060p89
$$ plain form
59712 554766 553189 550542 547645 545511 544410 544041 544147 544486 544525 543885 543081 543179 544571 546613 548596 550543
59696 550543 552744 555072 557107 558628 559627 560214 560824 562144 564330 566503 567552 567277 566299 564955 562882
59681 562882 559843 556464 553775 552211 551354 550547 549412 547701 545021 541086 536247 531346 526852 522408 517508
59666 517508 512339 507536 503282 499225 495302 492031 489800 488344 487234 486399 485804 485010 483665 482301 482081
59651 482081 483650 486469 489433 491935 494276 497159 500869 504902 508286 510189 510244 508558 505649 502289 499056
59636 499056 495977 492802 489607 486865 484932 483718 482878 482036 480943 479774 479158 479400 479660 478605 476053
59621 476053 473328 471651 470770 469631 467808 465626 463316 460761 458010 455428 453291 451626 450426 449660 449176
59606 449176 448904 449105 450123 451871 453832 455525 456840 458025 459476 461280 462814 463090 461853 460139 459387
$$ packed form
59712E54766j577k647k897k134j101l69J06L39L9o40q04R8J392K042J983J947
59696E50543K201K328K035J521R99N87O10J320K186K173J049k75r78j344k073
59681E62882l039l379k689j564q57q07j135j711k680l935m839m901m494m444m900
59666E17508n169m803m254m057l923l271k231j456j110q35n95p94j345j364k20
59651D82081J569K819K964K502K341K883L710M033L384J903N5j686k909l360l233
59636D99056l079l175l195k742j933j214q40q42j093j169o16K42K60j055k552
59621D76053k725j677q81j139j823k182k310k555k751k582k137j665j200p66m84
59606D49176k72K01J018J748J961J693J315J185J451J804J534K76j237j714p52
$$ plain form
59591 459387 460078 461435 462298 462061 461016 460034 459764 459942 459759 459013 458423 458492 458580 457630 455448 452646 449631 446320
59573 446320 442724 439151 435874 433049 430873 429309 427817 425992 424378 423967 424801 425732 425766 425145 424815 425250
59557 425250 426078 426624 426571 426260 426457 427689 429766 432067 434207 436248 438444 441018 444056 447388 450762 454427
59541 454427 459286 466113 474915 485449 497933 512540 528476 544343 559302 573028 584578 592314
59529 592314 595247 593777 588939 581781 573797 567031 562875 561123 560709 561070 562286 564310 566679 568877 570465
59514 570465 570931 569796 566840 562040 555439 547380 538679 530204 522201 514282 506081 497801 490113 483619
59500 483619 478402 474008 469870 465677 461395 457078 452879 449085 445898 443268 441154 439776 439305 439426 439617
59485 439617 439822 440437 441697 443493 445735 448394 451189 453772 456351 459539 463500 467750 472015 476645 481870
$$ packed form
59591D59387O91J357Q63k37j045r82k70J78j83p46n90O9Q8r50k182k802l015l311
59573D46320l596l573l277k825k176j564j492j825j614m11Q34R31L4o21l30M35
59557D25250Q28N46n3l11J97J232K077K301K140K041K196K574L038L332L374L665
59541D54427M859O827Q802J0534J2484J4607J5936J5867J4959J3726J1550P736
59529E92314K933j470m838p158p984o766m156j752m14L61J216K024K369K198J588
59514E70465M66j135k956m800o601q059q701q475q003p919q201q280p688o494
59500D83619n217m394m138m193m282m317m199l794l187k630k114j378m71J21J91
59485D39617K05O15J260J796K242K659K795K583K579L188L961M250M265M630N225
$$ plain form
59470 481870 487163 491752 495411 498364 500823 502945 504918 506665 507807 508286 508776 510043 512156 514712 517598
59455 517598 521116 525545 530959 537352 544579 552326 560456 569212 578659 588075 596359 603031 608435 612882
59441 612882 615944 616746 614764 610196 603706 595910 587128 577642 568059 559228 551719 545554 540532 536571
59427 536571 533634 531524 530053 529335 529797 531939 536107 542282 550036 558948 569211 581601 596719 614498
59413 614498 634512 656273 678888 700833 720706 738101 753117 764953 771532 771024 763609 751618
59401 751618 738105 725494 715369 708781 706103 706508 708131 709017 707794 703387 694717 681350 664290
59388 664290 645484 626479 607988 590649 575424 562983 553241 545789 540299 536247 532822 529624 527057
59375 527057 525588 525000 524900 525629 527927 531727 535836 538992 540977 542668 545234 549214 554169 559255 564230
$$ packed form
59470D81870N293M589L659K953K459K122J973J747J142M79M90J267K113K556K886
59455E17598L518M429N414O393P227P747Q130Q756R447R416Q284O672N404M447
59441F12882L062Q02j982m568o490p796q782r486r583q831p509o165n022l961
59427E36571k937k110j471p18M62K142M168O175P754Q912J0263J2390J5118J7779
59413F14498K0014K1761K2615K1945J9873J7395J5016J1836O579n08p415j1991
59401G51618j3513j2611j0125o588k678M05J623Q86j223m407q670j3367j7060
59388F64290j8806j9005j8491j7339j5225j2441r742p452n490m052l425l198k567
59375E27057j469n88j00P29K298L800M109L156J985J691K566L980M955N086M975
$$ plain form
59360 564230 569705 576184 583199 589863 596119 602914 611083 620489 630425 640527 651003 662140 673866
59347 673866 685887 698126 710802 723987 737286 750255 763017 776021 789112 801321 811800
59336 811800 820520 827656 832678 834606 832987 828137 820540 810576 798853 786296 773625 760928 747909
59323 747909 734381 720475 706588 693263 681029 670282 661287 654159 648702 644314 640276 636225 632338
59310 632338 629057 626676 625175 624556 625319 628364 634082 641750 650287 659599 670532 683286 696529 708449
59296 708449 718050 724775 727374 724230 714971 701096 684797 667584 650177 633163 617307 603368
59284 603368 591840 582766 575680 569918 565163 561618 559577 558995 559624 561473 564910 570279 577544 586343
59270 586343 596204 606544 616627 625944 634765 643920 653714 663347 671769 678755 684527 688541 689590 687301
$$ packed form
59360E64230N475O479P015O664O256O795Q169R406R936J0102J0476J1137J1726
59347F73866J2021J2239J2676J3185J3299J2969J2762J3004J3091J2209J0479
59336H11800Q720P136N022J928j619m850p597r964j1723j2557j2671j2697j3019
59323G47909j3528j3906j3887j3325j2234j0747q995p128n457m388m038m051l887
59310F32338l281k381j501o19P63L045N718P668Q537R312J0933J2754J3243J1920
59296G08449R601O725K599l144r259j3875j6299j7213j7407j7014j5856j3939
59284F03368j1528r074p086n762m755l545k041n82O29J849L437N369P265Q799
59270E86343R861J0340J0083R317Q821R155R794R633Q422O986N772M014J049k289
$$ plain form
59256 687301 682738 677095 670476 662487 653428 644128 634990 626000 617540 610412 604950 600765 597479 595217
59242 595217 594130 593876 593900 594061 594707 596189 598445 601093 603893 606994 610612 614522 618179 621364 624338
59227 624338 627187 629385 630303 629860 628329 625785 622211 617965 613632 609404 605008 600285 595503 591033 586963
59212 586963 583147 579481 576055 573114 570860 569266 568145 567383 566880 566309 565250 563727 562257 561180 560275
59197 560275 559333 558710 558872 559635 560292 560383 560012 559513 559176 559204 559620 560235 560907 561730 562805 564049 565421 567103
59179 567103 569176 571363 573375 575280 577275 579350 581482 583914 586921 590546 594820 599949 606008 612796
59165 612796 620284 628753 638098 647463 656102 664165 672019 679249 685044 689253 692216 693848 693692 691743
59151 691743 688387 683606 677124 669320 661106 652767 643789 634111 624729 616621 609655 603013 596254 589548
$$ packed form
59256F87301m563n643o619p989r059r300r138q990q460p128n462m185l286k262
59242E95217j087k54K4J61O46J482K256K648K800L101L618L910L657L185K974
59227F24338K849K198R18m43j531k544l574m246m333m228m396m723m782m470m070
59212E86963l816l666l426k941k254j594j121p62n03n71j059j523j470j077r05
59197E60275r42o23J62P63O57R1l71m99l37K8M16O15O72Q23J075J244J372J682
59179E67103K073K187K012J905J995K075K132K432L007L625M274N129O059O788
59165F12796P488Q469R345R365Q639Q063P854P230N795M209K963J632j56j949
59151F91743l356m781o482p804q214q339q978r678r382q108o966o642o759o706
$$ plain form
59137 589548 583141 576958 570635 563822 556627 549779 544122 539946 536957 534662 532459 529736 526508 523860
59123 523860 523101 524520 527461 531444 536514 542579 549266 556504 564418 572541 579957 586573 593446 601409
59109 601409 609997 618152 625379 631734 637239 641903 646036 650033 654028 658024 662051 665924 669111 671179
59095 671179 672137 672220 671620 670651 669749 669058 668319 667435 666832 666930 667482 667676 666740 664314 660474 655658 650412 645007
59077 645007 639303 632920 625465 616816 607510 598626 590858 583841 576878 570089 564156 559015 553767 548093
59063 548093 542959 539394 537133 534925 531812 527752 523399 519613 516880 514926 513047 510900 508643 506400
59049 506400 504095 501921 500383 499700 499599 499755 499923 499621 498485 497047 496388 496742 497251 497363 497554 498248 499007
59032 499007 499474 500220 501879 504146 506579 509719 514462 520774 528063 536406 546340 557618 569291 581061
$$ packed form
59137E89548o407o183o323o813p195o848n657m176k989k295k203k723l228k648
59123E23860p59J419K941L983N070O065O687P238P914Q123P416O616O873P963
59109F01409Q588Q155P227O355N505M664M133L997L995L996M027L873L187K068
59095F71179R58Q3o00r69r02o91p39q84o03R8N52J94r36k426l840m816n246n405
59077F45007n704o383p455q649r306q884p768p017o963o789n933n141n248n674
59063E48093n134l565k261k208l113m060m353l786k733j954j879k147k257k243
59049E06400k305k174j538o83j01J56J68l02j136j438o59L54N09J12J91O94P59
59032D99007M67P46J659K267K433L140M743O312P289Q343R934J1278J1673J1770
$$ plain form
59018 581061 593563 607135 621125 634629 647140 658149 666801 672485 675398 676159 675142 672580 669093
59005 669093 665688 663111 661368 660023 658939 658540 659267 660958 663064 665437 668481 672431 676775 680569 683062
58990 683062 684018 683780 683138 682650 681932 680003 676535 672269 667977 663569 658647 653441 648666 644790 641950
58975 641950 640316 640056 641136 643548 647540 653243 660389 668699 678272 689217 701210 713845 727026
58962 727026 740471 753213 764264 773614 781948 789464 795595 799813 802042 802136 799609 794228 786526 777408
58948 777408 767323 755989 742940 728312 713058 698347 684784 672437 661513 652501 645455 639526
58936 639526 633594 627192 620646 614605 609692 606299 604384 603515 603242 603190 602864 601868 600498 599559 599346 599302 598978
58919 598978 598629 598422 597698 595761 592931 590134 587798 585840 584423 583913 584249 585098 586603 589290 593234 597918
$$ packed form
59018E81061J2502J3572J3990J3504J2511J1009Q652N684K913P61j017k562l487
59005F69093l405k577j743j345j084l99P27J691K106K373L044L950M344L794K493
58990F83062R56k38o42m88p18j929l468m266m292m408m922n206m775l876k840
58975F41950j634k60J080K412L992N703P146Q310R573J0945J1993J2635J3181
58962G27026J3445J2742J1051R350Q334P516O131M218K229R4k527n381p702r118
58948G77408j0085j1334j3049j4628j5254j4711j3563j2347j0924r012p046n929
58936F39526n932o402o546o041m913l393j915q69k73n2l26r96j370r39k13m4l24
58919E98978l49k07p24j937k830k797k336j958j417n10L36Q49J505K687L944M684
$$ plain form
58903 597918 603005 608740 615475 623263 632048 641961 653199 665687 678819 691564 703142 713766 724461
58890 724461 736019 748519 761995 776933 793643 811678 830363 849430 868586 886907 903382
58879 903382 917702 929878 939408 945521 948067 947493 944151 938172 929763 919042 905841 890359 873724
58866 873724 857271 841547 826680 813278 801968 792261 782902 773354 764049 755192 746323 737228 728399
58853 728399 720215 712365 704381 696183 687898 679728 672141 665635 660095 654915 649850 645222 641143 637125
58839 637125 632634 627502 621663 615052 607996 601171 594872 588720 582306 575704 569227 563080 557513 552883
58825 552883 549315 546560 544393 542941 542528 543372 545428 548301 551359 554205 556980 559979 563241 566807 571027
58810 571027 575997 580933 584800 587515 589928 592695 595731 598718 601379 603202 603562 602364 600105 597196
$$ packed form
58903E97918N087N735O735P788Q785R913J1238J2488J3132J2745J1578J0624J0695
58890G24461J1558J2500J3476J4938J6710J8035J8685J9067J9156J8321J6475
58879I03382J4320J2176R530O113K546n74l342n979q409j0721j3201j5482j6635
58866H73724j6453j5724j4867j3402j1310r707r359r548r305q857q869r095q829
58853G28399q184p850p984q198q285q170p587o506n540n180n065m628m079m018
58839F37125m491n132n839o611p056o825o299o152o414o602o477o147n567m630
58825E52883l568k755k167j452m13Q44K056K873L058K846K775K999L262L566M220
58810E71027M970M936L867K715K413K767L036K987K661J823L60j198k259k909
$$ plain form
58796 597196 593681 589638 585327 580883 576328 571826 567475 562931 557844 552560 547785 543686 540078 537391
58782 537391 536516 537607 539890 542811 546527 550987 555442 559359 563024 566763 570053 571933 571853 569781 565920
58767 565920 560673 554539 547806 540702 533920 528352 524076 520209 516111 512227 509461 508193 508227 509196 510662
58752 510662 512279 514184 516819 520098 523225 525668 527832 530411 533514 536775 539906 542744 545128 547219
58738 547219 549676 553094 557404 562084 566792 571589 576676 582124 587712 592981 597607 601752 605814 609909
58724 609909 613847 617471 620635 623033 624601 625988 628012 630672 633342 635935 639107 643238 647989 653144
58710 653144 659066 665905 672906 678913 683130 685240 685335 683954 681599 677948 672140 664084 654774 644995 634431
58695 634431 622499 609373 595648 581633 567603 554284 542434 532213 523406 515858 509229 502802
$$ packed form
58796E97196l515m043m311m444m555m502m351m544n087n284m775m099l608k687
58782E37391q75J091K283K921L716M460M455L917L665L739L290J880q0k072l861
58767E65920n247o134o733p104o782n568m276l867m098l884k766j268L4R69J466
58752E10662J617J905K635L279L127K443K164K579L103L261L131K838K384K091
58738E47219K457L418M310M680M708M797N087N448N588N269M626M145M062M095
58724F09909L938L624L164K398J568J387K024K660K670K593L172M131M751N155
58710F53144N922O839P001O007M217K110R5j381k355l651n808q056r310r779j0564
58695F34431j1932j3126j3725j4015j4030j3319j1850j0221q807p548o629o427
$$ plain form
58683 502802 496181 489913 484846 481043 477865 474982 472715 471328 470395 469099 467030 464624 462825 462260 462859
58668 462859 464331 466753 470374 475175 481066 488308 497015 506355 514975 522280 528570 533826 537209 538025
58654 538025 536512 533309 528811 523379 517611 512018 506836 502311 498590 495142 491018 486078 481400 478108
58640 478108 476264 475182 474290 473405 472726 472857 474314 476773 479331 481657 484238 487325 490462 493297 496010
58625 496010 498578 500465 501535 502428 503528 504300 504292 504057 504453 505669 507558 510263 513886 518110 522752 528103
58609 528103 534054 539549 543657 546655 549307 551668 553414 554882 556715 558657 559576 558777 556716 554416 552547
58594 552547 550999 549079 546264 542970 540312 539033 539069 540255 542820 546863 551997 557899 564687 572386 580579
58579 580579 588884 597257 605521 613289 620608 627936 635127 641343 646436 651568 657846 665226 673382 682738
$$ packed form
58683E02802o621o268n067l803l178k883k267j387r33j296k069k406j799n65N99
58668D62859J472K422L621M801N891P242Q707R340Q620P305O290N256L383Q16
58654E38025j513l203m498n432n768n593n182m525l721l448m124m940m678l292
58640D78108j844j082q92q85o79J31J457K459K558K326K581L087L137K835K713
58625D96010K568J887J070Q93J100P72qk35L96J216J889K705L623M224M642N351
58609E28103N951N495M108K998K652K361J746J468J833J942R19p99k061k300j869
58594E52547j548j920k815l294k658j279L6J186K565M043N134N902O788P699Q193
58579E80579Q305Q373Q264P768P319P328P191O216N093N132O278P380Q156R356
$$ plain form
58565 682738 693804 706307 719933 735317 753352 773946 796223 819451 843029 866034 887560
58554 887560 907089 923971 937158 946147 951605 954371 954465 951812 947218 941724 935529 928426 920754 913041
58540 913041 905081 896126 885559 872822 857359 839469 820573 801797 782950 763702 744980 728088
58528 728088 713133 699514 687457 677798 670669 665538 662251 660834 660541 660242 659669 659307 659189 658766 657824
58513 657824 656623 655226 653492 651543 649541 647269 644636 642198 640404 638797 636857 635063 634137 633661 632624
58498 632624 631002 629690 629037 628532 627818 627042 626282 625495 624927 624846 625155 626007 628345 632896 639071 645874 653472
58481 653472 662707 673342 684029 694038 704003 714968 727475 741419 755928 769469 780804 789661
58469 789661 795985 799113 798525 794837 789123 781836 773327 764777 757408 751287 746076 742419 741379 742918
$$ packed form
58565F82738J1066J2503J3626J5384J8035K0594K2277K3228K3578K3005K1526
58554H87560J9529J6882J3187Q989N458K766R4k653m594n494o195p103p672p713
58540I13041p960q955j0567j2737j5463j7890j8896j8776j8847j9248j8722j6892
58528G28088j4955j3619j2057r659p129n131l287j417k93k99n73l62j18m23r42
58513F57824j201j397j734j949k002k272k633k438j794j607j940j794r26m76j037
58498F32624j622j312o53n05p14p76p60p87n68q1L09Q52K338M551O175O803P598
58481F53472R235J0635J0687J0009R965J0965J2507J3944J4509J3541J1335Q857
58469G89661O324L128n88l688n714p287q509q550p369o121n211l657j040J539
$$ plain form
58455 742918 746330 751683 759497 769285 779821 790614 801791 812702 821944 828665 832653 833420 830470
58442 830470 824294 815938 805870 794481 783171 773427 765065 756905 749010 742768 738961 737272 737611 740297
58428 740297 744907 750429 756696 764362 773492 783524 794433 806375 818255 828329 836335 843479 850100
58415 850100 854912 856853 856183 853432 848615 841995 834407 826463 818312 810207 802374 794483 786367 778899
58401 778899 772909 767635 761848 756169 752468 751133 750788 750748 751780 754222 757256 760460 764307 768620 772146
58386 772146 774264 775706 777208 778816 780842 784021 788267 792599 796598 800723 805053 809132 813162 817897
58372 817897 823173 828004 832290 837004 842646 848953 856028 864134 872501 880165 887982 897910 910233 923383
58358 923383 936504 950083 963952 976858 988410 999380 1009697 1018195 1024671 1030095 1034457 1036693
$$ packed form
58455G42918L412N353P814R788J0536J0793J1177J0911R242O721L988P67k950
58442H30470o176q356j0068j1389j1310r744q362q160p895o242l807j689L39K686
58428G40297M610N522O267P666R130J0032J0909J1942J1880J0074Q006P144O621
58415H50100M812J941o70k751m817o620p588p944q151q105p833p891q116p468
58401G78899n990n274n787n679l701j335l45m0J032K442L034L204L847M313L526
58386G72146K118J442J502J608K026L179M246M332L999M125M330M079M030M735
58372H17897N276M831M286M714N642O307P075Q106Q367P664P817R928J2323J3150
58358I23383J3121J3579J3869J2906J1552J0970J0317Q498O476N424M362K236
$$ plain form
58346 1036693 1037262 1038484 1041608 1045699 1050027 1055301 1061754 1068344 1074848 1082724 1092833 1104243 1116177
58333 1116177 1129212 1143684 1158817 1174336 1191071 1209018 1226614 1242709 1257541 1271103 1282477
58322 1282477 1291482 1299123 1305804 1311005 1315185 1319850 1325164 1329708 1333201 1337191 1342483 1348372 1355039 1364069
58308 1364069 1375672 1387971 1400065 1413333 1428699 1445102 1461653 1478803 1496310 1512644 1527583
58297 1527583 1542979 1559898 1577391 1594926 1613375 1632695 1651457 1669685 1689318 1710912 1732856
58286 1732856 1754766 1778419 1804235 1830293 1856062 1883545 1913339 1943270 1972584 2003726 2038068
58275 2038068 2073734 2109771 2148630 2192037 2238071 2284820 2333396 2384739 2437033 2489113 2543057
58264 2543057 2600598 2660227 2720492 2782768 2847984 2914047 2979459 3046164 3115934 3187279 3258798
$$ packed form
58346A036693N69J222L124M091M328N274O453O590O504P876J0109J1410J1934
58333A116177J3035J4472J5133J5519J6735J7947J7596J6095J4832J3562J1374
58322A282477R005P641O681N201M180M665N314M544L493L990N292N889O667R030
58308A364069J1603J2299J2094J3268J5366J6403J6551J7150J7507J6334J4939
58297A527583J5396J6919J7493J7535J8449J9320J8762J8228J9633K1594K1944
58286A732856K1910K3653K5816K6058K5769K7483K9794K9931K9314L1142L4342
58275B038068L5666L6037L8859M3407M6034M6749M8576N1343N2294N2080N3944
58264B543057N7541N9629O0265O2276O5216O6063O5412O6705O9770P1345P1519
$$ plain form
58253 3258798 3332088 3408347 3485641 3562708 3642032 3726128 3814181 3905339 4001646 4104651 4212829
58242 4212829 4325429 4445098 4573753 4709887 4852813 5005145 5168168 5339639 5519412
58233 5519412 5712029 5920258 6141557 6374650 6623801 6892463 7178834 7482329 7808253
58224 7808253 8161220 8540372 8946295 9386015 9865716 10385416 10946649 11558131 12227898
58215 12227898 12957789 13752568 14626536 15594384 16664513 17849129 19171746 20656964 22323675
58206 22323675 24198170 26323963 28750474 31526366 34717965 38424917 42771355 47904182
58198 47904182 54023101 61406078 70400448 81414770 94931117 111477100 131520680
58191 131520680 155358267 183040387 214241966 248039543 282811595 316483356 346939872
$$ packed form
58253C258798P3290P6259P7294P7067P9324Q4096Q8053R1158R6307J03005J08178
58242D212829J12600J19669J28655J36134J42926J52332J63023J71471J79773
58233E519412J92617K08229K21299K33093K49151K68662K86371L03495L25924
58224G808253L52967L79152M05923M39720M79701N19700N61233O11482O69767
58215A2227898P29891P94779Q73968R67848J070129J184616J322617J485218J666711
58206B2323675J874495K125793K426511K775892L191599L706952M346438N132827
58198D7904182O118919P382977Q994370J1014322J3516347J6545983K0043580
58191A31520680K3837587K7682120L1201579L3797577L4772052L3671761L0456516
$$ plain form
58184 346939872 372193948 390274176 399295660 398000920 386384811 365796380 338450809
58177 338450809 306822694 273279607 239892998 208268522 179438494 153910660 131811292
58170 131811292 113002955 97168618 83908626 72828217 63568477 55803638 49253050
58163 49253050 43697054 38964085 34907058 31403278 28363796 25721988 23414765 21384795
58155 21384795 19591864 18006896 16598612 15336725 14202408 13183952 12266065 11432975
58147 11432975 10677177 9995183 9378291 8815985 8304159 7841257 7420076 7031526 6672907
58138 6672907 6344499 6041335 5756012 5486610 5234503 4997263 4770922 4556551 4357491
58129 4357491 4172230 3996483 3830142 3675812 3532422 3396365 3267250 3146830 3033949
$$ packed form
58184C46939872K5254076J8080228R021484j294740j1616109k0588431k7345571
58177C38450809l1628115l3543087l3386609l1624476k8830028k5527834k2099368
58170A31811292j8808337j5834337j3259992j1080409r259740p764839o550588
58163D9253050n555996m732969m057027l503780l039482k641808k307223k029970
58155B1384795j792931j584968j408284j261887j134317j018456r17887q33090
58147A1432975p55798o81994o16892n62306n11826m62902m21181l88550l58619
58138F672907l28408l03164k85323k69402k52107k37240k26341k14371j99060
58129D357491j85261j75747j66341j54330j43390j36057j29115j20420j12881
$$ plain form
58120 3033949 2925986 2823604 2728779 2639760 2553135 2469318 2390940 2317338 2245585 2175641 2109638
58109 2109638 2047315 1986727 1928271 1873494 1821070 1768368 1716014 1666658 1620291 1574900 1530724
58098 1530724 1489560 1450692 1411706 1372896 1337071 1305442 1277169 1252288 1231491 1213467 1195864
58087 1195864 1178550 1163005 1149151 1135702 1122790 1111193 1099766 1086675 1072403 1058549 1044486
58076 1044486 1028284 1010211 992274 974958 957303 939457 922202 904634 885411 865715 848033
58065 848033 832472 817111 801588 787483 775544 765242 756650 750058 744020 736421 727255 718036 708982
58052 708982 699196 689050 679758 671018 661634 652093 643941 637036 629927 622693 616789 612330 607909 603020
58038 603020 598317 593730 588595 583392 579067 574883 569228 562242 555383 548708 540984 532181 523411 514630
$$ packed form
58120C033949j07963j02382r4825q9019q6625q3817p8378p3602p1753o9944o6003
58109B109638o2323o0588n8456n4777n2424n2702n2354m9356m6367m5391m4176
58098A530724m1164l8868l8986l8810l5825l1629k8273k4881k0797j8024j7603
58087A195864j7314j5545j3854j3449j2912j1597j1427j3091j4272j3854j4063
58076A044486j6202j8073j7937j7316j7655j7846j7255j7568j9223j9696j7682
58065H48033j5561j5361j5523j4105j1939j0302q592o592o038p599r166r219r054
58052G08982r786j0146r292q740r384r541q152o905p109p234n904m459m421m889
58038F03020m703m587n135n203m325m184n655o986o859o675p724q803q770q781
$$ plain form
58024 514630 504890 494794 486201 479381 472801 465792 459165 453063 446596 439868 434160 429663 425072 419818
58010 419818 414815 410627 406638 402368 398057 393805 389629 386312 384573 383474 381402 378533 376672 376840
57996 376840 378790 382529 388281 395030 401258 407276 414834 424191 433443 440931 446392 449562 449640 446703 441997
57981 441997 436396 429944 423081 416747 411067 405356 399594 394476 390057 385812 381968 379223 377264 375192
57967 375192 373253 372387 372175 371147 369183 367709 367343 367174 366628 366253 366310 366204 365625 364809 363520 361291 358710
57950 358710 356832 355359 353065 349932 347088 344773 342406 340660 341198 344038 347373 350451 354501 360244
57936 360244 366664 372998 379901 387781 395842 403621 411683 419906 426902 432036 436301 440188 442464 442204
57922 442204 440475 438726 436841 433990 430196 425885 420910 415130 409072 403182 397301 391622 387164 384539
$$ packed form
58024E14630r740j0096q593o820o580p009o627o102o467o728n708m497m591n254
58010D19818n003m188l989m270m311m252m176l317j739j099k072k869j861J68
57996C76840J950L739N752O749O228O018P558R357R252P488N461L170P8k937m706
57981D41997n601o452o863o334n680n711n762n118m419m245l844k745j959k072
57967C75192j939q66k12j028j964j474l66j69n46l75N7j06n79q16j289k229k581
57950C58710j878j473k294l133k844k315k367j746N38K840L335L078M050N743
57936C60244O420O334O903P880Q061P779Q062Q223O996N134M265L887K276k60
57922D42204j729j749j885k851l794m311m975n780o058n890n881n679m458k625
$$ plain form
57908 384539 383121 381999 380831 379302 376901 373827 370986 368475 365199 360536 355238 350162 345395 341191
57894 341191 338340 336796 335257 332980 330833 329736 329340 329128 329477 330548 331366 331287 331297 332557 334459 335491
57878 335491 335397 335228 335609 336050 335809 334632 332816 331057 329935 329186 327942 325990 324149 323069 322428 321734
57862 321734 321113 320859 320964 321563 323042 325153 326872 327707 328465 330134 332732 335739 338920 342121 344887 346864
57846 346864 348066 348474 348010 347156 346716 346605 345684 343180 339463 335144 330384 325481 321123 317493 314044 310645
57830 310645 308017 306520 305463 304208 303109 302728 303011 303768 305111 306875 308493 309978 312126 315225 318460
57815 318460 321118 323398 325427 326547 326321 325233 323648 320961 316578 310942 304856 298631 292592 287531
57801 287531 283816 280811 277860 275151 273013 271263 269885 269429 270002 270765 271142 271616 272635 273748 274653 276023
$$ packed form
57908C84539j418j122j168j529k401l074k841k511l276m663n298n076m767m204
57894C41191k851j544j539k277k147j097l96k12L49J071Q18p9J0J260J902J032
57878C35491r4j69L81M41k41j177j816j759j122p49j244j952j841j080o41o94
57862C21734o21k54J05N99J479K111J719Q35P58J669K598L007L181L201K766J977
57846C46864J202M08m64q54m40j11r21k504l717m319m760m903m358l630l449l399
57830C10645k628j497j057j255j099l81K83P57J343J764J618J485K148L099L235
57815C18460K658K280K029J120k26j088j585k687m383n636o086o225o039n061
57801B87531l715l005k951k709k138j750j378m56N73P63L77M74J019J113R05J370
$$ plain form
57785 276023 278339 280880 282928 285066 288102 291502 294087 295733 297233 299017 301062 303621 307024 311005
57771 311005 314972 318575 321503 323369 324380 325313 326073 325208 321774 316903 312484 309039 305927 302854 300001
57756 300001 297203 294231 291512 289560 288052 286448 285055 284576 285042 286095 287860 290521 293565 296341 298957
57741 298957 301678 304017 305415 306268 307212 307922 307756 307124 306929 307033 306582 305641 305181 305426 305388 304243 302260
57724 302260 300205 298589 297569 296932 296167 295044 294024 293574 293365 292662 291201 289180 286810 284373 282196
57709 282196 280023 277116 273615 270883 269567 268279 265458 261753 259089 258004 257551 257472 258650 261273 264167
57694 264167 266310 267757 268709 268859 268103 266904 265445 263189 259690 255209 250349 245734 242166 240380 240346
57679 240346 241415 243354 246753 252416 260935 272912 289029 309725 335207 365740 401469 441924
$$ packed form
57785B76023K316K541K048K138L036L400K585J646J500J784K045K559L403L981
57771C11005L967L603K928J866J011R33P60q65l434m871m419l445l112l073k853
57756C00001k798k972k719j952j508j604j393m79M66J053J765K661L044K776K616
57741B98957K721K339J398Q53R44P10j66o32j95J04m51r41m60K45l8j145j983
57724C02260k055j616j020o37p65j123j020m50k09p03j461k021k370k437k177
57709B82196k173k907l501k732j316j288k821l705k664j085m53p9J178K623K894
57694B64167K143J447R52J50p56j199j459k256l499m481m860m615l568j786l4
57679B40346J069J939L399N663Q519J1977J6117K0696K5482L0533L5729M0455
$$ plain form
57667 441924 485990 532066 577815 620023 655244 680424 692809 690221 672513 642366 603775 560009
57655 560009 513678 467962 426155 389966 359286 333587 312558 295498 281407 269930 261214 254706
57643 254706 249152 244046 240033 237465 235525 233327 231059 229384 228290 227254 226234 225866 226679 228395 230129
57628 230129 231188 231673 232192 232976 233512 233121 231594 229168 226286 223568 221532 220159 219125 218526 218618 218745
57612 218745 217694 215510 213786 213341 212863 210941 208322 206769 206559 206630 206539 206676 206930 206731 206210 205923 205629
57595 205629 204618 202920 200875 197951 193606 188997 185998 184618 183160 180952 178948 177412 175159 171848
57581 171848 169133 168473 169247 170033 170481 170840 170773 169804 168206 166472 164508 162110 159674 157798 156693 156324
57565 156324 156482 156331 154814 152033 149451 148229 148136 148510 149339 150719 152108 152964 153532 154325 155296 156121 156770
$$ packed form
57667D41924M4066M6076M5749M2208L5221K5180J2385k588j7708l0147l8591m3766
57655E60009m6331m5716m1807l6189l0680k5699k1029j7060j4091j1477q716o508
57643B54706n554n106m013k568j940k198k268j675j094j036j020l68Q13J716J734
57628B30129J059M85N19P84N36l91j527k426k882k718k036j373j034n99R2J27
57612B18745j051k184j724m45m78j922k619j553k10P1r1J37K54j99n21k87k94
57595B05629j011j698k045k924m345m609k999j380j458k208k004j536k253l311
57581A71848k715o60P74P86M48L59o7r69j598j734j964k398k436j876j105l69
57565A56324J58j51j517k781k582j222r3L74Q29J380J389Q56N68P93R71Q25O49
$$ plain form
57548 156770 157308 157588 157605 157674 157915 158096 158226 158634 159179 159145 158308 157354 156856 156651 156662 157390 158947 160429 161062
57529 161062 161314 162069 163222 163877 163611 162849 162293 162425 163264 164158 164265 163598 163132 163455 163930 163791 163521 164404
57511 164404 166950 170393 173575 175852 177287 178293 179077 179338 178777 177830 177361 177527 177579 176974 176068 175401 174899
57494 174899 174113 172753 170761 168394 166444 165639 165525 164690 162437 159546 157086 155337 154324 154440 155702
57479 155702 157071 157413 156802 156201 156187 156529 156684 156172 154729 152511 149939 147240 144632 142914 142962 144232 144739
57462 144739 143216 140547 138393 137233 136603 136505 137387 139068 140805 142357 144098 146030 147452 147770 147122 146052
57446 146052 144921 143766 142586 141691 141626 142493 143509 143802 143614 144035 145379 146651 146949 146679 146845 147793 149192
57429 149192 150686 152002 152822 153055 152903 152427 151511 150452 149915 150061 150472 151138 152552 154500 155882 156376 157117
$$ packed form
57548A56770N38K80J7O9K41J81J30M08N45l4q37r54m98k05J1P28J557J482O33
57529A61062K52P55J153O55k66p62n56J32Q39Q94J07o67m66L23M75j39k70Q83
57511A64404K546L443L182K277J435J006P84K61n61r47m69J66N2o05r06o67n02
57494A74899p86j360j992k367j950q05j14q35k253k891k460j749j013J16J262
57479A55702J369L42o11o01j4L42J55n12j443k218k572k699k608j718M8J270N07
57462A44739j523k669k154j160o30r8Q82J681J737J552J741J932J422L18o48j070
57446A46052j131j155j180q95o5Q67J016K93j88M21J344J272K98k70J66R48J399
57429A49192J494J316Q20K33j52m76r16j059n37J46M11O66J414J948J382M94P41
$$ plain form
57412 157117 158892 160759 161552 161747 162564 163934 164724 164499 163794 162997 162184 161757 162031 162394 161987 161056 160549 160602
57394 160602 160587 160513 161086 162363 163567 164477 165830 168001 170310 172111 173713 175711 178071 180399 182588 184662
57378 184662 186324 187139 187062 186563 186312 186679 187417 187890 187802 187462 187120 186430 185086 183647 183063 183476 184073 184056 183209
57359 183209 181664 179751 178115 177394 177563 178019 178371 178829 179756 181168 182725 184015 184876 185634 186876 188821
57343 188821 191089 193208 195036 196555 197719 198726 199872 200822 200731 199624 198902 199694 201293 202209 202260 202528
57327 202528 203480 204338 204428 204126 204140 204580 205102 205475 205753 206161 206904 207850 208523 208722 208930 209765 211244 213044 215158
57308 215158 217771 220711 223597 226281 228686 230500 231643 232703 234252 236015 237358 238273 239136 239821 239974
57293 239974 239949 240556 241907 243352 244508 245504 246281 246556 246567 246958 247785 248398 248548 248823 249788 251329 253116 255132
$$ packed form
57412A57117J775J867P93J95Q17J370P90k25p05p97q13m27K74L63m07r31n07N3
57394A60602j5p4N73J277J204R10J353K171K309J801J602J998K360K328K189K074
57378A84662J662Q15p7m99k51L67P38M73q8l40l42o90j344j439n84M13N97j7q47
57359A83209j545j913j636p21J69M56L52M58R27J412J557J290Q61P58J242J945
57343A88821K268K119J828J519J164J007J146R50r1j107p22P92J599R16N1K68
57327B02528R52Q58R0l02J4M40N22L73K78M08P43R46O73J99K08Q35J479J800K114
57308B15158K613K940K886K684K405J814J143J060J549J763J343R15Q63O85J53
57293B39974k5O07J351J445J156R96P77K75J1L91Q27O13J50K75R65J541J787K016
$$ plain form
57275 255132 257428 259836 262158 264357 266490 268775 271647 275335 279453 283428 287194 291081 295221 299547
57261 299547 304074 308659 312819 316441 320285 324973 329842 333705 336518 339323 342701 346389 350333 355004
57247 355004 360431 365928 371066 376127 381424 386933 392704 398814 404829 410131 414940 420154 426099 432298
57233 432298 438557 445283 452543 459792 466831 474083 481654 489083 496399 504443 513676 523540 533438 543479
57219 543479 553795 564073 574290 585042 596505 607852 618392 628551 639113 650224 661830
57208 661830 674320 687818 701406 714028 725960 738648 753274 770044 788580 808326 828645
57197 828645 849092 869646 890454 911556 933056 955178 977767 1000070 1021433 1042071 1062798
57186 1062798 1084135 1105901 1127485 1148295 1168154 1187460 1206874 1226749 1246987 1267372 1287789
$$ packed form
57275B55132K296K408K322K199K133K285K872L688M118L975L766L887M140M326
57261B99547M527M585M160L622L844M688M869L863K813K805L378L688L944M671
57247C55004N427N497N138N061N297N509N771O110O015N302M809N214N945O199
57233D32298O259O726P260P249P039P252P571P429P316Q044R233R864R898J0041
57219E43479J0316J0278J0217J0752J1463J1347J0540J0159J0562J1111J1606
57208F61830J2490J3498J3588J2622J1932J2688J4626J6770J8536J9746K0319
57197H28645K0447K0554K0808K1102K1500K2122K2589K2303K1363K0638K0727
57186A062798K1337K1766K1584K0810J9859J9306J9414J9875K0238K0385K0417
$$ plain form
57175 1287789 1308200 1328724 1349619 1370808 1391588 1411281 1429949 1447972 1465251 1481632 1497852
57164 1497852 1515164 1534037 1554202 1575883 1599914 1626477 1654846 1684597 1715996 1748808 1781901
57153 1781901 1814578 1847312 1880560 1913784 1946414 1978923 2012160 2046269 2080965 2116354 2152812
57142 2152812 2190535 2229743 2270895 2314315 2360075 2408536 2460298 2515377 2573212 2633916 2698623
57131 2698623 2768150 2842171 2920242 3002715 3089881 3181004 3274908 3370862 3468333 3566697 3665868
57120 3665868 3766415 3868329 3970432 4071767 4172778 4274463 4377221 4481333 4587691
57111 4587691 4697171 4810232 4928332 5055301 5196595 5357810 5544505 5762402 6016904
57102 6016904 6313614 6660818 7071117 7560207 8145553 8847672 9691608 10705504 11918054
$$ packed form
57175A287789K0411K0524K0895K1189K0780J9693J8668J8023J7279J6381J6220
57164A497852J7312J8873K0165K1681K4031K6563K8369K9751L1399L2812L3093
57153A781901L2677L2734L3248L3224L2630L2509L3237L4109L4696L5389L6458
57142B152812L7723L9208M1152M3420M5760M8461N1762N5079N7835O0704O4707
57131B698623O9527P4021P8071Q2473Q7166R1123R3904R5954R7471R8364R9171
57120C665868J00547J01914J02103J01335J01011J01685J02758J04112J06358
57111D587691J09480J13061J18100J26969J41294J61215J86695K17897K54502
57102F016904K96710L47204M10299M89090N85346P02119Q43936J013896J212550
$$ plain form
57093 11918054 13357536 15050502 17017574 19269076 21804234 24612237 27672143 30953619
57085 30953619 34420829 38036533 41764805 45576769 49455765 53380732 57274991 60951228
57077 60951228 64111587 66425837 67641065 67651055 66496024 64318301 61312604 57688632
57069 57688632 53646821 49366048 45001160 40683947 36522136 32597198 28964271 25654610
57061 25654610 22678958 20031564 17694992 15644683 13852272 12288262 10924587 9736262
57053 9736262 8701311 7799809 7013454 6325939 5723478 5194853 4730780 4322961 3963582
57044 3963582 3645737 3364053 3114567 2893947 2698946 2526402 2373408 2237484 2116867
57035 2116867 2010643 1918410 1839894 1775066 1724474 1688957 1668713 1662515 1667565 1679825 1694508
$$ packed form
57093A1918054J439482J692966J967072K251502K535158K808003L059906L281476
57085C0953619L467210L615704L728272L811964L878996L924967L894259L676237
57077F0951228L160359K314250J215228R990j155031k177723l005697l623972
57069E7688632m041811m280773m364888m317213m161811l924938l632927l309661
57061B5654610k975652k647394k336572k050309j792411j564010j363675j188325
57053I736262j034951r01502p86355o87515o02461n28625m64073m07819l59379
57044C963582l17845k81684k49486k20620j95001j72544j52994j35924j20617
57035B116867j06224r2233p8516o4828n0592l5517k0244o198N050J2260J4683
$$ plain form
57024 1694508 1706496 1710442 1700730 1672163 1621740 1550359 1462857 1366219 1267331 1171519 1082002 1000119
57012 1000119 926102 859923 801481 750247 705130 664876 628414 594747 562906 532353 503258
57001 503258 476054 450709 426703 403654 381616 360773 341256 323432 307930 294964 283930
56990 283930 274256 266646 262986 264759 271787 282629 295873 310832 327201 344358 360979 375231
56978 375231 385378 390435 390386 386002 378587 369644 360329 351143 342331 334488 328383 324298 322158 322393 325952
56963 325952 333064 342636 353535 366063 381396 399658 419127 437325 452330 463052 468863 469312
56951 469312 464020 452867 436522 416797 395990 375710 356536 338903 323808 312281 304391 299351
56939 299351 296754 297398 302597 312874 327690 346314 368259 392555 417240 440290 460693 477789
$$ packed form
57024A694508J1988L946r712k8567n0423p1381q7502r6638r8888r5812q9517q1883
57012A000119p4017o6179n8442n1234m5117m0254l6462l3667l1841l0553k9095
57001E03258k7204k5345k4006k3049k2038k0843j9517j7824j5502j2966j1034
56990B83930r674p610l660J773P028J0842J3244J4959J6369J7157J6621J4252
56978C75231J0147N057m9m384p415q943r315r186q812p843o105m085k140K35L559
56963C25952P112R572J0899J2528J5333J8262J9469J8198J5005J0722N811M49
56951D69312n292j1153j6345j9725k0807k0280j9174j7633j5095j1527p890n040
56939B99351k597O44N199J0277J4816J8624K1945K4296K4685K3050K0403J7096
$$ plain form
56927 477789 489776 493981 488978 475633 455834 431116 403047 373877 345709 319421 295217 273817
56915 273817 256149 242098 230546 220622 212137 204805 197956 191353 185645 181676 179596 178775 178218 177142
56901 177142 175604 174613 175235 177536 180806 184711 189652 196028 203824 213199 224940 239853 257977 278581
56887 278581 300726 323553 346234 367837 387155 402589 412408 415417 411607 402351 389948 376642
56875 376642 363741 351658 340793 332057 326414 324324 325964 331668 341800 356591 376550 402647
56863 402647 435459 474269 517451 563327 609894 653976 691678 719952 737234 742695 735820 717149
56851 717149 688917 654582 617933 582544 551293 525877 506949 494877 490207 493544 505461 526616
56839 526616 557593 598611 649729 710935 781167 856948 932699 1002712 1062452 1107980 1135276
$$ packed form
56927D77789J1987M205n003j3345j9799k4718k8069k9170k8168k6288k4204k1400
56915B73817j7668j4051j1552r924q485p332o849o603n708l969k080q21n57j076
56901A77142j538r91O22K301L270L905M941O376P796R375J1741J4913J8124K0604
56887B78581K2145K2827K2681K1603J9318J5434R819L009l810r256j2403j3306
56875C76642j2901j2083j0865q736n643k090J640N704J0132J4791J9959K6097
56863D02647L2812L8810M3182M5876M6567M4082L7702K8274J7282N461o875j8671
56851G17149k8232l4335l6649l5389l1251k5416j8928j2072m670L337J1917K1155
56839E26616L0977M1018N1118O1206P0232P5781P5751P0013N9740M5528K7296
$$ plain form
56828 1135276 1141156 1124782 1087967 1034416 969115 897963 826906 760649 701982 652215 612101
56817 612101 582333 563315 554702 555538 565103 583506 611219 648054 692630 742441 793964 842888
56805 842888 884875 916340 934464 936900 922239 891052 846135 791685 732365 672749 616627 566259
56793 566259 522465 485515 455715 433224 417873 409401 407544 411820 421622 436622 456638 480807
56781 480807 507106 532887 555707 573586 584741 587420 580214 562786 536485 504052 468429 431882
56769 431882 396151 362784 332703 305839 281847 261013 243813 229803 217711 206639 196509
56758 196509 187407 179229 172064 166159 161270 156628 151781 147011 142835 139567 137381 136171 135216 133578
56744 133578 131041 128180 125491 123034 120915 119408 118407 117434 116396 115714 115496 115247 114638 113924 113343 112733
$$ packed form
56828A135276N880j6374l6815n3551o5301p1152p1057o6257n8667m9767m0114
56817F12101k9768j9018q613Q36R565J8403K7713L6835M4576M9811N1523M8924
56805H42888M1987L1465J8124K436j4661l1187m4917n4450n9320n9616n6122n0368
56793E66259m3794l6950k9800k2491j5351q472j857M276R802J5000K0016K4169
56781D80807K6299K5781K2820J7879J1155K679p206j7428k6301l2433l5623l6547
56769D31882l5731l3367l0081k6864k3992k0834j7200j4010j2092j1072j0130
56758A96509r102q178p165n905m889m642m847m770m176l268k186j210r55j638
56744A33578k537k861k689k457k119j507j001r73j038o82k18k49o09p14n81o10
$$ plain form
56728 112733 112123 112094 113109 114857 116618 117941 118824 119647 121142 123849 127357 130510 132607 133971 135186
56713 135186 136286 137009 137385 137757 138411 139371 140336 140940 141335 142237 143910 145416 145674 145002 144708 145310 146142 146655
56695 146655 146936 146869 146024 144690 143859 143793 143709 143278 143251 144087 145089 145565 145789 146126 146299 146271 146778 148077 149146
56676 149146 149061 148290 147715 147262 146547 146042 146460 147665 149245 151416 154209 156469 157051 156594 156763 158008 159348
56659 159348 160185 161088 162666 164704 166594 167933 168631 168997 169587 170524 171270 171573 172056 173194 174359 174737 174600
56642 174600 174660 174809 174663 174756 175764 176902 176671 175171 174112 174317 174697 174151 173156 172794 173173 173598 173593 173143 172352
56623 172352 171357 170280 169076 167755 166717 166278 165916 164697 162533 160291 158566 157125 155762 154880 154770
56608 154770 154983 154911 154537 154212 154045 153922 153815 153794 153917 154238 154745 155228 155504 155705 156007 156151 155667 154599 153567
$$ packed form
56728A12733o10k9J015J748J761J323Q83Q23J495K707L508L153K097J364J215
56713A35186J100P23L76L72O54R60R65O04L95R02J673J506K58o72k94O02Q32N13
56695A46655K81o7q45j334q31o6q4m31k7Q36J002M76K24L37J73k8N07J299J069
56676A49146q5p71n75m53p15n05M18J205J580K171K793K260N82m57J69J245J340
56659A59348Q37R03J578K038J890J339O98L66N90R37P46L03M83J138J165L78j37
56642A74600O0J49j46R3J008J138k31j500j059K05L80n46r95l62L79M25nm50p91
56623A72352r95j077j204j321j038m39l62j219k164k242j725j441j363q82j10
56608A54770K13p2l74l25j67j23j07k1J23L21N07M83K76K01L02J44m84j068j032
$$ plain form
56589 153567 153050 153032 153385 154132 155251 156596 158108 159744 161152 161818 161641 161125 160973 161692 163460 165951 168358
56572 168358 169986 170825 171309 171633 171757 171954 172919 175289 179317 184912 191774 199602 208385 218215 228622
56557 228622 238529 247256 255073 262272 268215 271974 273485 273320 271734 268848 265430 262427 259783 256697
56543 256697 253070 249785 247405 245449 243141 240217 236797 233153 229797 227164 225080 223047 221092 219755
56529 219755 219170 218806 218165 217134 215611 213532 211370 209950 209502 209457 209294 209032 208764 208294 207500 206580 205766
56512 205766 205143 204753 204427 203587 201760 199347 197356 196359 196103 196076 195934 195497 194913 194677 194939 195037 194399 193575
56494 193575 193502 194013 194155 193895 194245 195555 196861 197309 197196 197171 197338 197640 198242 198998 199326 199180 199437 200684
56476 200684 202234 202997 202874 202664 202946 203588 204173 204449 204470 204525 204853 205458 206340 207745 209734 211701 212925 213511
$$ packed form
56589A53567n17j8L53P47J119J345J512J636J408O66j77n16j52P19J768K491K407
56572A68358J628Q39M84L24J24J97R65K370M028N595O862P828Q783R830J0407
56557B28622R907Q727P817P199N943L759J511j65j586k886l418l003k644l086
56543B56697l627l285k380j956k308k924l420l644l356k633k084k033j955j337
56529B19755n85l64o41j031j523k079k162j420m48m5j63k62k68m70p94r20q14
56512B05766o23l90l26q40j827k413j991r97k56k7j42m37n84k36K62R8o38q24
56494A93575p3N11J42k60L50J310J306M48j13k5J67L02O02P56L28j46K57J247
56476B00684J550P63j23k10K82O42N85K76K1N5L28O05Q82J405J989J967J224N86
$$ plain form
56458 213511 214131 214899 215219 214712 213552 211909 209893 208148 207595 208289 209234 209617 209558 209594 210152 211610 214010
56441 214010 216492 217864 217962 217687 217575 217299 216700 216255 216150 215909 215388 215174 215526 215859 215765 215615 215644 215455 215022
56422 215022 215134 216056 216721 216125 214750 213688 213096 212519 212130 212568 213814 215125 215909 216077 215829 215632 216121
56405 216121 217475 219144 220546 221608 222354 222561 222294 222172 222584 223233 223908 225044 226924 229033 230842 232585
56389 232585 234524 236117 236743 236710 236712 236726 236347 235822 235879 236751 238064 239446 240584 241029 240701 240340 240747 241792
56371 241792 242814 243710 244876 246265 247333 247923 248532 249530 250609 251150 250838 249894 248864 248219 248114 248683 250370
56354 250370 253407 256986 259696 261053 261946 263269 264879 266365 267947 269897 271717 272771 273340 274226 275599
56339 275599 276890 277703 278270 279160 280877 283565 286803 289991 293063 296388 299790 302449 304152 305907 308704
$$ packed form
56458B13511O20P68L20n07j160j643k016j745n53O94R45L83n9L6N58J458K400
56441B14010K482J372R8k75j12k76n99m45j05k41n21k14L52L33r4j50K9j89m33
56422B15022J12R22O65n96j375j062n92n77l89M38J246J311P84J68k48j97M89
56405B16121J354J669J402J062P46K07k67j22M12O49O75J136J880K109J809J743
56389B32585J939J593O26l3KJ4l79n25N7Q72J313J382J138M45l28l61M07J045
56371B41792J022Q96J166J389J068N90O09R98J079N41l12r44j030o45j05N69J687
56354B50370L037L579K710J357Q93J323J610J486J582J950J820J054N69Q86J373
56339B75599J291Q13N67Q90J717K688L238L188L072L325L402K659J703J755K797
$$ plain form
56324 308704 312285 315704 318525 320871 322814 324348 325576 326427 326628 326335 326141 326089 325456 324066 323007 323317
56308 323317 324692 326236 327741 329407 331040 332512 334468 337596 341633 345894 350293 354993 359587 363538
56294 363538 367021 370439 373563 376036 378295 381077 384397 387907 391823 396582 401930 407255 412490 417845
56280 417845 423127 428321 434399 442383 451803 461151 469762 478242 487181 496501 506161 516602 528251 541122
56266 541122 554943 569279 583757 598681 615128 633938 655013 678133 703923 733269 766327
56255 766327 802983 843868 890004 941770 999068 1062261 1132212 1209678 1295332 1389960 1493805
56244 1493805 1606020 1725328 1850720 1980825 2113264 2245470 2375481 2501028 2618603
56235 2618603 2724599 2816753 2893340 2951620 2988586 3003052 2995839 2968276 2921769 2858437 2780745
$$ packed form
56324C08704L581L419K821K346J943J534J228Q51K01k93j94n2o33j390j059L10
56308C23317J375J544J505J666J633J472J956L128M037M261M399M700M594L951
56294C63538L483L418L124K473K259K782L320L510L916M759N348N325N235N355
56280D17845N282N194O078P984R420R348Q611Q480Q939R320R660J0441J1649J2871
56266E41122J3821J4336J4478J4924J6447J8810K1075K3120K5790K9346L3058
56255G66327L6656M0885M6136N1766N7298O3193O9951P7466Q5654R4628J03845
56244A493805J12215J19308J25392J30105J32439J32206J30011J25547J17575
56235B618603J05996R2154P6587N8280L6966J4466p213k7563m6507o3332p7692
$$ plain form
56224 2780745 2690528 2589561 2480850 2368079 2253808 2139330 2026091 1915935 1809900 1708109
56214 1708109 1611059 1519993 1435821 1358464 1287304 1221571 1160442 1103567 1051359 1004099 961105
56203 961105 921517 885257 852300 821779 793074 767110 745025 725984 707966 690537 675248
56192 675248 663216 653772 645601 637926 630431 623208 616912 612025 608083 604501 601661 599944 598212 594906
56178 594906 590412 586772 585065 584641 584828 585760 587373 589157 591121 593676 596490 598836 601094 604389 608648
56163 608648 612533 615526 618610 622708 627802 633850 641166 649647 658884 669126 680898 693739 706757
56150 706757 720363 735883 753576 772870 794660 821437 854687 893948 938957 991046 1051728
56139 1051728 1121250 1198999 1283892 1373861 1466272 1559296 1651644 1740884 1823653 1898015 1964291
$$ packed form
56224B780745r0217j00967j08711j12771j14271j14478j13239j10156j06035j01791
56214A708109r7050r1066q4172p7357p1160o5733o1129n6875n2208m7260m2994
56203I61105l9588l6260l2957l0521k8705k5964k2085j9041j8018j7429j5289
56192F75248j2032r444q171p675p495p223o296m887l942l582k840j717j732l306
56178E94906m494l640j707m24J87R32J613J784J964K555K814K346K258L295M259
56163F08648L885K993L084M098N094O048P316Q481R237J0242J1772J2841J3018
56150G06757J3606J5520J7693J9294K1790K6777L3250L9261M5009N2089O0682
56139A051728O9522P7749Q4893Q9969R2411R3024R2348Q9240Q2769P4362O6276
$$ plain form
56128 1964291 2023375 2075745 2122339 2164600 2202976 2236548 2264339 2285527 2298416 2301045 2293267 2276558
56116 2276558 2251524 2217275 2173420 2120673 2059109 1987989 1908076 1822308 1733564 1643638 1554989
56105 1554989 1471369 1395594 1328264 1269377 1219409 1177997 1143426 1114462 1091221 1073444 1059624
56094 1059624 1048653 1040702 1035617 1032119 1029442 1028191 1028698 1030114 1031915 1034808 1039375 1045332 1052650 1061739
56080 1061739 1071943 1081630 1090416 1099584 1109772 1120106 1130123 1140493 1151210 1161255 1170834 1181836
56068 1181836 1195192 1209754 1224544 1239976 1256120 1272003 1287476 1303619 1320536 1337017 1353054
56057 1353054 1370215 1388779 1407214 1425306 1444874 1466293 1487333 1506816 1526468 1547680 1569442
56046 1569442 1591178 1614612 1640848 1668319 1695642 1723898 1754199 1785658 1817769 1852131 1889777
$$ packed form
56128A964291N9084N2370M6594M2261L8376L3572K7791K1188J2889K629p778j6709
56116B276558k5034l4249m3855n2747o1564p1120p9913q5768q8744q9926q8649
56105A554989q3620p5775o7330n8887m9968m1412l4571k8964k3241j7777j3820
56094A059624j0971p951n085l498k677j251N07J416J801K893M567N957P318R089
56080A061739J0204R687Q786R168J0188J0334J0017J0370J0717J0045R579J1002
56068A181836J3356J4562J4790J5432J6144J5883J5473J6143J6917J6481J6037
56057A353054J7161J8564J8435J8092J9568K1419K1040J9483J9652K1212K1762
56046A569442K1736K3434K6236K7471K7323K8256L0301L1459L2111L4362L7646
$$ plain form
56035 1889777 1929304 1969609 2011785 2056374 2101483 2145820 2190842 2237757 2285106 2331547 2378258
56024 2378258 2426355 2474747 2522873 2572733 2625688 2680022 2734113 2789321 2847427 2908086 2971120
56013 2971120 3038244 3110057 3184462 3260542 3340773 3426989 3517687 3611884 3711802 3818823 3930650
56002 3930650 4045622 4165979 4293770 4427743 4567673 4717333 4879238 5050720 5229266
55993 5229266 5417506 5618839 5832699 6058542 6299959 6560121 6837758 7132393 7448798
55984 7448798 7791344 8159061 8551614 8974934 9435401 9933958 10471896 11056761 11696322
55975 11696322 12392919 13150637 13981930 14900341 15913849 17033287 18280248 19678788 21247992
55966 21247992 23012750 25014354 27301863 29924288 32945116 36458140 40581878 45456594
$$ packed form
56035A889777L9527M0305M2176M4589M5109M4337M5022M6915M7349M6441M6711
56024B378258M8097M8392M8126M9860N2955N4334N4091N5208N8106O0659O3034
56013B971120O7124P1813P4405P6080Q0231Q6216R0698R4197R9918J07021J11827
56002C930650J14972J20357J27791J33973J39930J49660J61905J71482J78546
55993E229266J88240K01333K13860K25843K41417K60162K77637K94635L16405
55984G448798L42546L67717L92553M23320M60467M98557N37938N84865O39561
55975A1696322O96597P57718Q31293R18411J013508J119438J246961J398540J569204
55966B1247992J764758K001604K287509K622425L020828L513024M123738M874716
$$ plain form
55958 45456594 51268997 58276947 66804900 77237521 90032210 105697711 124696978
55951 124696978 147334011 173678829 203454749 235829321 269281697 301783534 331201107
55944 331201107 355537228 372880617 381419188 379860412 368041469 347174555 319510129
55937 319510129 287724216 254407955 221748585 191333730 164084692 140350157 120087171
55930 120087171 103017519 88736567 76807407 66831844 58469806 51428434 45462103
55923 45462103 40379164 36030030 32287416 29044531 26221814 23758930 21600720 19698457
55915 19698457 18017827 16533540 15218512 14046411 13000001 12067295 11232462 10478650
55907 10478650 9796360 9180765 8623312 8113294 7645093 7216691 6823199 6458287 6119707
$$ packed form
55958D5456594N812403P007950Q527953J0432621J2794689J5665501J8999267
55951A24696978K2637033K6344818K9775920L2374572L3452376L2501837K9417573
55944C31201107K4336121J7343389Q538571j558776j1818943k0866914k7664426
55937C19510129l1785913l3316261l2659370l0414855k7249038k3734535k0262986
55930A20087171j7069652j4280952j1929160r975563q362038p041372n966331
55923D5462103n082939m349134l742614l242885k822717k462884k158210j902263
55915A9698457j680630j484287j315028j172101j046410r32706q34833p53812
55907A0478650o82290o15595n57453n10018m68201m28402l93492l64912l38580
$$ plain form
55898 6119707 5807257 5517383 5245562 4991730 4757722 4541452 4338934 4149794 3975466
55889 3975466 3814068 3662427 3521233 3392891 3275831 3165808 3061275 2962830 2868977 2777098
55879 2777098 2687291 2600919 2516758 2432646 2349472 2269477 2192244 2116302 2042943 1974226 1908877
55868 1908877 1844436 1781963 1724251 1670763 1618767 1568333 1521766 1478963 1437725 1398098 1362244
55857 1362244 1330333 1300450 1272259 1247004 1224033 1200835 1176394 1151367 1125312 1097085 1067661
55846 1067661 1039344 1012440 985721 959729 936351 915396 894828 874336 855625 839163 823566
55835 823566 808155 793317 778470 762509 746294 731845 719027 705741 691487 678084 666672
55824 666672 656562 647240 639006 631332 622888 613546 604303 595182 585224 574538 564258 554598 545030
$$ packed form
55898F119707l12450k89874k71821k53832k34008k16270k02518j89140j74328
55889C975466j61398j51641j41194j28342j17060j10023j04533r8445r3853r1879
55879B777098q9807q6372q4161q4112q3174p9995p7233p5942p3359o8717o5349
55868A908877o4441o2473n7712n3488n1996n0434m6567m2803m1238l9627l5854
55857A362244l1911k9883k8191k5255k2971k3198k4441k5027k6055k8227k9424
55846A067661k8317k6904k6719k5992k3378k0955k0568k0492j8711j6462j5597
55835H23566j5411j4838j4847j5961j6215j4449j2818j3286j4254j3403j1412
55824F66672j0110r322q234p674q444r342r243r121r958j0686j0280r660r568
$$ plain form
55811 545030 536113 528819 522270 514594 506096 499187 495056 492651 491044 490491 490984 491984 493844 497322 501560
55796 501560 504718 506804 509530 513116 515626 515990 515411 515093 514667 513682 512691 511935 510542 507831 504047 499310
55780 499310 493170 485607 477085 467411 456028 443661 432128 422291 413732 406611 402058 400347 400303 400901
55766 400901 401866 402328 400596 395922 389127 381028 371683 361650 352487 345368 340290 337061 335824 336239 337326
55751 337326 338549 340031 341533 342331 342147 340991 338102 332452 324518 316220 309011 303166 298741 295644 292741
55736 292741 288638 283531 278766 274535 269782 264552 260401 257926 255757 252694 249169 245766 241891 236898
55722 236898 231241 225660 220294 215208 210766 206950 203392 200435 198982 199038 199741 201120 204288 209405 215017
55707 215017 220055 224912 229773 233412 234744 234326 233299 231759 229057 224862 219305 212865 206573 201346
$$ packed form
55811E45030q917p294o549p676q498o909m131k405j607n53M93J000J860L478M238
55796E01560L158K086K726L586K510L64n79l18m26r85r91p56j393k711l784m737
55780D99310o140p563q522r674j1383j2367j1533r837q559p121m553j711m4N98
55766D00901R65M62j732m674o795q099r345j0033r163p119n078l229j237M15J087
55751C37326J223J482J502P98j84j156k889n650p934q298p209n845m425l097k903
55736B92741m103n107m765m231m753n230m151k475k169l063l525l403l875m993
55722B36898n657n581n366n086m442l816l558k957j453N6P03J379L168N117N612
55707B15017N038M857M861L639J332m18j027j540k702m195n557o440o292n227
$$ plain form
55693 201346 196803 191837 186565 182325 179485 176905 174113 172219 171799 171658 170844 170294 171137 172816 174425
55678 174425 176654 180694 185951 190529 193566 195715 197659 199334 200444 200813 200376 199499 198963 199094 199358 199311
55662 199311 199278 199591 199934 200120 200653 201778 202693 202616 201991 201793 202207 202756 203171 203351 202976 201977 200923 200311 199881
55643 199881 199203 198317 197266 195607 193073 190074 186908 183177 178659 174005 169750 165329 160061 154584 150286
55628 150286 147594 145681 143619 141128 138487 136382 135624 136344 137585 138170 137769 136832 135891 135294 135174 135235 134956
55611 134956 134293 133682 133089 131788 129452 126818 124727 123159 121602 119748 117391 114461 111637 110085 110029
55596 110029 110390 110406 110642 111620 112444 111902 110258 108854 108455 108935 110096 111758 113314 114166 114463 114811 115553
55579 115553 116919 119361 123045 127428 132039 137211 143418 150401 157699 165533 174341 183828 193148 201650
$$ packed form
55693B01346m543m966n272m240k840k580k792j894m20j41q14n50Q43J679J609
55678A74425K229M040N257M578L037K149J944J675J110L69m37q77n36J31K64m7
55662A99311l3L13L43J86N33J125R15p7o25j98M14N49M15J80l75r99j054o12m30
55643A99881o78q86j051j659k534k999l166l731m518m654m255m421n268n477m298
55628A50286k692j913k062k491k641k105p58P20J241N85m01r37r41n97j20O1k79
55611A34956o63o11n93j301k336k634k091j568j557j854k357k930k824j552n6
55596A10029L61J6K36R78Q24n42j644j404l99M80J161J662J556Q52K97L48P42
55579A15553J366K442L684M383M611N172O207O983P298P834Q808R487R320Q502
$$ plain form
55565 201650 208793 213868 216511 217026 215590 211758 205451 197701 189581 181071 171925 162949 155258 148774
55551 148774 142599 136489 130890 125910 121394 117674 115117 113180 111034 108911 107731 107583 107676 107709 108152 109172
55535 109172 110320 111363 112497 113695 114658 115400 116090 116462 116227 115880 116130 116689 116657 115985 115435 115084 114051
55518 114051 111932 109437 107318 105573 103953 102409 100744 98648 96311 94336 92869 91538 90291 89447
55504 89447 88822 87786 86404 85479 85074 84024 81567 78669 76993 77039 77915 78572 78732 78798 79265 80172 81018 81421
55486 81421 81701 82369 83125 83092 82123 81170 81056 81549 82008 82376 83045 84107 85225 86088 86654 87027 87221 87053 86284
55467 86284 84977 83566 82329 81075 79633 78339 77504 76740 75515 74187 73680 74194 74975 75404 75523 75437 75052
55450 75052 74629 74739 75346 75658 75335 75140 75882 77226 78056 77738 76594 75427 74877 75000 75290 75344 75525 76532
$$ packed form
55565B01650P143N075K643N15j436l832o307p750q120q510r146q976p691o484
55551A48774o175o110n599m980m516l720k557j937k146k123j180j48R3L3M43J020
55535A09172J148J043J134J198R63P42O90L72k35l47K50N59l2o72n50l51j033
55518A14051k119k495k119j745j620j544j665k096k337j975j467j331j247q44
55504H9447o25j036j382r25m05j050k457k898j676M6Q76O57J60O6M67R07Q46M03
55486H1421K80O68P56l3r69r53j14M93M59L68O69J062J118Q63N66L73J94j68p69
55467H6284j307j411j237j254j442j294q35p64j225j328n07N14P81M29J19q6l85
55450G5052m23J10O07L12l23j95P42J344Q30l18j144j167n50J23K90N4J81J007
$$ plain form
55432 76532 78314 79969 80857 81168 81158 80543 79140 77556 76625 76480 76688 77015 77543 78219 78829 79391 80171 81244
55414 81244 82259 82778 82732 82567 82922 84041 85466 86374 86259 85241 83789 82301 80839 79130 76898 74376
55398 74376 72321 71325 71292 71808 72684 73824 74873 75515 75891 76250 76433 76301 76371 77322 78984 80536 81600 82360
55380 82360 82659 81971 80445 79146 78846 79251 79678 79828 79551 78582 77001 75477 74656 74640 75324 76717 78596
55363 78596 80382 81708 82716 83545 83985 83926 83650 83344 82858 82215 81752 81419 80594 79177 78212 78686 80093 80965
55345 80965 80559 79312 77815 76223 74756 74043 74513 75753 76806 77034 76588 76111 76025 76189 76260 76237 76381 76659
55327 76659 76643 76048 75001 73697 72220 70927 70511 71235 72346 72727 72059 71065 70639 71035 71847 72540 72895 72988
55309 72988 72903 72642 72376 72485 73056 73622 73828 74158 75395 77375 78923 79148 78266 76993 75739 74628 73768
$$ packed form
55432G6532J782J655Q88L11j0o15j403j584r31j45K08L27N28O76O10N62P80J073
55414H1244J015N19m6j65L55J119J425R08j15j018j452j488j462j709k232k522
55398G4376k055r96l3N16Q76J140J049O42L76L59J83j32P0R51J662J552J064P60
55380H2360K99o88j526j299l00M05M27J50k77r69j581j524q21j6O84J393J879
55363G8596J786J326J008Q29M40n9k76l06m86o43m63l33q25j417r65M74J407Q72
55345H0965m06j247j497j592j467p13M70J240J053K28m46m77q6J64P1k3J44K78
55327G6659j6n95j047j304j477j293m16P24J111L81o68r94m26L96Q12O93L55R3
55309G2988q5k61k66J09N71N66K06L30J237J980J548K25q82j273j254j111q60
$$ plain form
55292 73768 73119 72475 71863 71584 71684 71846 72009 72596 73807 75211 76348 77230 77925 78181 77978 77960 78706 79902
55274 79902 80744 80888 80516 79797 78838 77960 77477 77338 77395 77798 78640 79464 79686 79420 79302 79548 79731 79567 79409
55255 79409 79737 80471 81057 81128 80914 80960 81499 82201 82629 82808 83046 83327 83308 82947 82600 82388 81955 81117 80226 79644
55235 79644 79306 79102 79121 79177 78714 77745 77287 78176 79837 80927 80865 80011 78689 76971 75293 74348 74218 74339
55217 74339 74448 74875 75686 76255 76076 75537 75469 76183 77270 78192 78810 79379 80125 80890 81318 81432 81709 82359 82920
55198 82920 82977 82969 83633 84828 85683 85892 86085 86696 87238 87160 86792 86816 87129 86958 85990 84883 84522 85125 86181 87006
55178 87006 87257 87097 87016 87452 88457 89656 90485 90512 89665 88391 87536 87807 89138 90618 91217 90645 89424 88221
55160 88221 87354 86983 87342 88478 89945 91111 91697 91807 91585 91186 90858 90572 89784 88113 86218 85279 85490
$$ packed form
55292G3768o49o44o12k79J00J62J63N87J211J404J137Q82O95K56k03j8P46J196
55274G9902Q42J44l72p19r59q78m83j39N7M03Q42Q24K22k66j18K46J83j64j58
55255G9409L28P34N86P1k14M6N39P02M28J79K38K81j9l61l47k12m33q38q91n82
55235G9644l38k04J9N6m63r69m58Q89J661J090o2q54j322j718j678r45j30J21
55217G4339J09M27Q11N69j79n39o8P14J087R22O18N69P46P65M28J14K77O50N61
55198H2920N7qO64J195Q55K09J93O11N42p8l68K4L13j71r68j107l61O03J056Q25
55178H7006K51j60q1M36J005J199Q29K7q47j274q55K71J331J480N99n72j221j203
55160H8221q67l71L59J136J467J166N86J10k22l99l28k86p88j671j895r39K11
$$ plain form
55143 85490 85822 85521 85051 85079 85291 84978 84286 84054 84611 85513 86371 87241 88151 88919 89597 90561 91925 93232 93927
55124 93927 93891 93395 92746 92034 91051 89460 87343 85505 84837 85281 85801 85542 84739 84236 84416 85008 85817 87101
55106 87101 88949 90646 91149 90299 89138 88805 89395 90172 90581 90597 90314 89797 89369 89468 90104 90913 91795 92950
55088 92950 94178 94784 94503 93972 93918 94335 94835 95348 96087 97212 98812 100793 102462 102751 101360 99215 97393
55071 97393 96080 95025 94441 94744 95829 97249 98728 99926 100235 99614 99159 99959 101586 102601 102330 101281
55055 101281 100004 98573 97218 96485 96514 96821 96925 96616 95667 94079 92552 91837 91531 90508 88761 87819 88823
55038 88823 91048 92950 93971 94562 94956 94835 94124 93388 93237 93664 94169 94398 94532 94957 95626 96036 95908 95564
55020 95564 95325 94968 94292 93850 94401 95749 96817 96863 96057 94998 94284 94490 95725 97168 97798 97669 97757 98483
$$ packed form
55143H5490L32l01m70K8K12l13o92k32N57R02Q58Q70R10P68O78R64J364J307O95
55124I3927l6m96o49p12r83j591k117j838o68M44N20k59q03n03J80N92Q09J284
55106H7101J848J697N03q50j161l33N90P77M09J6k83n17m28R9O36Q09Q82J155
55088I2950J228O06k81n31n4M17N00N13P39J125J600J981J669K89j391k145j822
55071I7393j313j055n84L03J085J420J479J198L09o21m55Q00J627J015k71j049
55055A01281j277j431j355p33K9L07J04l09r49j588j527p15l06j023j747r42J004
55038H8823K225J902J021N91L94j21p11p36j51M27N05K29J34M25O69M10j28l44
55020I5564k39l57o76m42N51J348J068M6q06j059p14K06J235J443O30j29Q8P26
$$ plain form
55002 98483 99248 99596 99883 100404 100786 100763 100766 101114 101289 100731 99928 99987 101382 103549 105447 106176 105456 103953 102798
54983 102798 102406 102117 101325 100466 100411 101299 102513 103541 104330 104952 105415 105686 105665 105293 104928 105231 106399 107806
54965 107806 108717 109089 109360 109818 110494 111330 112100 112442 112243 111742 111066 110101 109029 108396 108254 107893 106927 106060
54947 106060 106118 106808 107193 107022 106764 106608 106274 105746 105450 105638 106203 107092 108310 109474 109997 109848 109713 110228
54929 110228 111353 112580 113483 114093 114911 116435 118449 120087 120963 121882 123951 127286 131245 135663 140960
54914 140960 146974 152578 156821 159879 162530 165090 167220 168357 167982 165700 161513 156076 150488 145728
54900 145728 142209 139703 137615 135375 132718 129727 126814 124527 123106 122134 120938 119428 118174 117600 117569
54885 117569 117983 119146 121079 123060 124457 125595 127139 128986 130565 131950 133821 136432 139473 142895
$$ packed form
55002I8483P65L48K87N21L82k3LL48J75n58q03N9J395K167J898P29p20j503j155
54983A02798l92k89p92q59n5Q88J214J028P89O22M63K71k1l72l65L03J168J407
54965A07806R11L72K71M58O76Q36P70L42j99n01o76r65j072o33j42l61r66q67
54947A06060N8O90L85j71k58j56l34n28k96J88N65Q89J218J164N23j49j35N15
54929A10228J125J227R03O10Q18J524K014J638Q76R19K069L335L959M418N297
54914A40960O014N604M243L058K651K560K130J137l75k282m187n437n588m760
54900A45728l519k506k088k240k657k991k913k287j421r72j196j510j254n74l1
54885A17569M14J163J933J981J397J138J544J847J579J385J871K611L041L422
$$ plain form
54871 142895 146953 151399 155479 158944 162225 165383 167722 168802 169024 168734 167490 164849 161274 157568 153864
54856 153864 149847 145661 141839 138475 135123 131548 128070 125136 122893 121229 119899 118556 116891 114846
54842 114846 112586 110344 108406 107030 106233 105764 105446 105337 105427 105429 105153 104845 104827 105012 105139 105316 105851 106584 106871
54823 106871 106378 105472 104678 104038 103232 102169 101230 100963 101551 102521 102984 102358 100917 99477 98598 98352 98813 100257
54805 100257 102604 105070 106883 108118 109353 110607 111273 111165 111034 111646 112812 113737 114010 113776 113195 112327
54789 112327 111526 111340 111939 112936 113891 114633 115086 115201 115140 115132 115060 114618 113965 113723 114144 114854 115669 117107 119637
54770 119637 122902 126220 129426 132654 135716 138406 141149 144546 148449 152289 156303 161511 168219 175306
54756 175306 181413 186169 189775 191912 191803 189165 184553 178783 172424 165835 159349 153229 147614 142569
$$ packed form
54871A42895M058M446M080L465L281L158K339J080K22k90j244k641l575l706l704
54856A53864m017m186l822l364l352l575l478k934k243j664j330j343j665k045
54842A14846k260k242j938j376p97m69l18j09R0Kk76l08j8J85J27J77N35P33K87
54823A06871m93r06p94o40q06j063r39k67N88R70M63o26j441j440q79k46M61J444
54805A00257K347K466J813J235J235J254O66j08j31O12J166R25K73k34n81q68
54789A12327q01j86N99R97R55P42M53J15o1qp2m42o53k42M21P10Q15J438K530
54770A19637L265L318L206L228L062K690K743L397L903L840M014N208O708P087
54756A75306O107M756L606K137j09k638m612n770o359o589o486o120n615n045
$$ plain form
54742 142569 138160 134483 131650 129691 128453 127675 127183 126886 126569 125881 124661 123186 121943 121237 121115 121591
54726 121591 122761 124623 126926 129363 131932 134952 138589 142493 146095 149286 152544 156355 160709 165189
54712 165189 169280 172441 174180 174356 173264 171236 168284 164315 159509 154299 149124 144326 140044 136057
54698 136057 132064 128350 125775 124713 124357 123528 121941 120241 119083 118667 118867 119165 118674 116974 114873 113670
54682 113670 113608 113748 113362 112745 112507 112745 113192 113592 113696 113408 113101 113303 113916 114295 114219 114084 113987 113424 112265
54663 112265 111228 110881 110868 110701 110624 110940 111110 110414 109181 108439 108517 108829 108961 109131 109485 109719 109680 109741 110256 111033
54643 111033 111605 111789 111742 111692 111812 112252 113105 114268 115361 115869 115612 115100 115135 115905 116763 117123 117199 117493 117881
54624 117881 117753 116894 115772 114961 114725 115128 116112 117340 118355 119001 119429 119626 119258 118124 116600 115467 115365
$$ packed form
54742A42569m409l677k833j959j238p78m92k97l17o88j220j475j243p06j22M76
54726A21591J170J862K303K437K569L020L637L904L602L191L258L811M354M480
54712A65189M091L161J739J76j092k028k952l969m806n210n175m798m282l987
54698A36057l993l714k575j062l56q29j587j700j158m16K00K98m91j700k101j203
54682A13670o2J40l86o17k38K38M47M00J04k88l07K02O13L79p6j35r7n63j159
54663A12265j037l47j3j67p7L16J70o96j233p42P8L12J32J70L54K34l9O1N15P77
54643A11033N72J84m7n0J20M40Q53J163J093N08k57n12L5P70Q58L60P6K94L88
54624A17881j28q59j122q11k36M03R84J228J015O46M28J97l68j134j524j133j02
$$ plain form
54607 115365 116321 117688 118557 118433 117522 116323 115111 113962 113078 112784 113228 114225 115324 115934 115707 115058 115002
54590 115002 116061 117538 118289 118023 117309 116501 115377 113898 112657 112273 112797 113954 115490 116979 117767 117576
54574 117576 116937 116601 116684 116771 116706 116786 117110 117227 116734 115953 115589 115711 115518 114379 112823 112037 112489 113608 114829
54555 114829 116305 118159 119706 120112 119541 118934 118784 118871 119115 119844 120993 121822 121968 122222 123682 126394 129287
54538 129287 131277 132065 132035 131796 131829 132301 133061 133825 134295 134200 133509 132580 131749 130736 128968 126667 125015 124765
54520 124765 125224 125192 124543 124158 124527 125240 125833 126316 126684 126721 126720 127627 129854 132439 134035 134399 134190 133611 132240
54501 132240 130260 128814 128609 128871 128371 127046 125810 125053 124272 123234 122615 123053 124112 124747 124431 123429
54485 123429 122222 121197 120726 121055 122046 123352 124759 126103 127004 127134 126735 126422 126406 126307 125889 125612 126231 127973
$$ packed form
54607A15365R56J367Q69j24r11j199j212j149q84k94M44R97J099O10k27o49n6
54590A15002J059J477P51k66p14q08j124j479j241l84N24J157J536J489P88j91
54574A17576o39l36Q3Q7o5Q0L24J17m93p81l64J22j93j139j556p86M52J119J221
54555A14829J476J854J547M06n71o07j50Q7K44P29J149Q29J46K54J460K712K893
54538A29287J990P88l0k39L3M72P60P64M70r5o91r29q31j013j768k301j652k50
54520A24765M59l2o49l85L69P13N93M83L68L7jR07K227K585J596L64k09n79j371
54501A32240j980j446k05K62n00j325j236p57p81j038o19M38J059O35l16j002
54485A23429j207j025m71L29R91J306J407J344R01J30l99l13j6r9m18k77O19J742
$$ plain form
54467 127973 130229 131987 132643 132638 133207 135195 138115 140629 141906 142082 141557 140492 139185 138273 138113 138344 138409
54450 138409 138166 137722 137103 136467 136209 136341 136116 134862 132960 131462 130856 130793 130860 130976 131005 130660 129955 129279 128816
54431 128816 128321 127630 126979 126596 126354 126080 125888 126007 126544 127641 129505 131959 134235 135598 136088 136367 136918
54414 136918 137683 138420 139143 140064 141197 142125 142253 141410 140131 139134 138575 138144 137841 138161 139305 140695 141728
54397 141728 142597 143811 145147 145875 146021 146619 148359 150573 152073 152567 152692 152874 152862 152444 151990 151945 152160 152066
54379 152066 151304 149869 147859 145520 143498 142542 142810 143776 144927 146256 147788 149027 149333 148764 148131 148088
54363 148088 148484 148720 148598 148652 149709 152094 155225 158014 159811 160878 161819 162788 163619 164552 166249 168939
54347 168939 171959 174371 175727 176080 175669 174971 174646 174905 175029 173943 171254 167459 163322 159443 156346 154416
$$ packed form
54467A27973K256J758O56nN69J988K920K514J277J76n25j065j307r12j60K31O5
54450A38409k43m44o19o36k58J32k25j254j902j498o06o3O7J16K9l45p05o76m63
54431A28816m95o91o51l83k42k74j92J19N37J097J864K454K276J363M90K79N51
54414A36918P65P37P23R21J133R28J28q43j279r97n59m31l03L20J144J390J033
54397A41728Q69J214J336P28J46N98J740K214J500M94J25J82j2m18m54m5K15r4
54379A52066p62j435k010k339k022r56K68R66J151J329J532J239L06n69o33m3
54363A48088L96K36j22N4J057K385L131K789J797J067R41R69Q31R33J697K690
54347A68939L020K412J356L53m11o98l25K59J24j086k689l795m137l879l097j930
$$ plain form
54331 154416 153551 153185 152824 152412 152089 151862 151630 151323 150865 150168 149317 148669 148559 148873 149023 148445 147207 146063
54313 146063 145727 146124 146546 146538 146251 145805 144827 143094 141219 140061 139605 139090 138282 137906 138587 139992 141334 142288
54295 142288 142979 143388 143291 142721 142179 142295 143283 144625 145373 145027 144079 143381 143090 142748 142362 142627 143793 145023
54277 145023 145401 145080 144858 145089 145633 146440 147489 148370 148709 148797 149111 149346 148791 147631 147013 147572 148678 149450
54259 149450 149882 150499 151452 152469 153334 153961 154254 154331 154690 155786 157512 159318 160632 160990 160083 158127 156046
54242 156046 154860 154828 155360 155729 155591 154905 153693 152094 150483 149339 148926 149114 149543 149944 150250 150346 149908 148702
54224 148702 147016 145572 144958 145262 146153 147091 147531 147304 146919 147168 148315 149918 151515 153075 154615 155758
54208 155758 156061 155544 154613 153582 152546 151515 150346 148740 146671 144725 143629 143518 143977 144677 145498 146041
$$ packed form
54331A54416q65l66l61m12l23k27k32l07m58o97q51o48j10L14J50n78j238j144
54313A46063l36L97M22qk87m46r78j733j875j158m56n15q08l76O81J405J342R54
54295A42288O91M09r7n70n42J16R88J342P48l46r48o98k91l42l86K65J166J230
54277A45023L78l21k22K31N44Q07J049Q81L39Q8L14K35n55j160o18N59J106P72
54259A49450M32O17R53J017Q65O27K93P7L59J096J726J806J314L58r07j956k081
54242A56046j186l2N32L69j38o86j212j599j611j144m13J88M29M01L06R6m38j206
54224A48702j686j444o14L04Q91R38M40k27l85K49J147J603J597J560J540J143
54208A55758L03n17r31j031j036j031j169j606k069j946j096j11M59P00Q21N43
$$ plain form
54192 146041 145675 144371 143059 142701 143251 143924 144314 144732 145510 146450 147229 147874 148520 148933 148703 147841 146810 146038
54174 146038 145750 146216 147632 149590 151139 151688 151499 151025 150203 148835 147330 146445 146402 146720 146853 146529 145634
54157 145634 144310 143203 143014 143706 144569 145097 145321 145275 144818 144117 143728 143885 144198 144302 144322 144507 144927 145797 147471
54138 147471 149684 151349 151689 151151 150732 150837 151279 151926 152652 153006 152665 152036 151762 151791 151570 151030 150703 150862
54120 150862 151181 151321 151353 151545 152175 153496 155392 157100 157825 157668 157428 157489 157469 156984 156197 155461 155013 155147 156069
54101 156069 157292 157750 156935 155564 154795 155117 156220 157550 158634 159216 159455 159807 160441 160998 161132 161017 161029
54084 161029 161244 161567 162097 162974 164012 164856 165432 165904 166337 166715 167286 168539 170690 173395 176079 178493 180936
54067 180936 183879 187370 190869 193902 196843 200715 206008 211961 217286 221383 224545 227083 228707 228841
$$ packed form
54192A46041l66j304j312l58N50O73L90M18P78R40P79O45O46M13k30q62j031p72
54174A46038k88M66J416J958J549N49j89m74q22j368j505q85m3L18J33l24q95
54157A45634j324j107j89O92Q63N28K24m6m57p01l89J57L13J04K0J85M20Q70J674
54138A47471K213J665L40n38m19J05M42O47P26L54l41o29k74K9k21n40l27J59
54120A50862L19J40L2J92O30J321J896J708P25j57k40O1k0m85p87p36m48J34R22
54101A56069J223M58q15j371p69L22J103J330J084N82K39L52O34N57J34j15J2
54084A61029K15L23N30Q77J038Q44N76M72M33L78N71J253K151K705K684K414K443
54067A80936K943L491L499L033K941L872N293N953N325M097L162K538J624J34
$$ plain form
54053 228841 227245 224135 219929 215103 210243 206004 202881 201046 200412 200781 201894 203457 205302 207579 210578
54038 210578 214296 218323 222336 226546 231419 237060 243080 248987 254414 259051 262797 266115 269877 274536
54024 274536 279577 283994 287259 289638 291642 293356 294429 294613 294191 293720 293362 292671 291138 288757 285799
54009 285799 282238 277783 272472 266835 261367 256175 251311 247086 243734 240937 238002 234540 230797 227317
53995 227317 224446 222192 220420 219021 217865 216759 215608 214597 214027 213923 213998 214058 214154 214209 213843 212902 211914
53978 211914 211591 212037 212843 213870 215453 217822 220743 223797 226604 228705 229656 229436 228493 227225 225652 223650
53962 223650 221226 218483 215623 213118 211547 211109 211458 212065 212536 212599 212243 211961 212506 214220 216788 219686
53946 219686 222639 225628 228798 232339 236134 239593 242337 244986 248625 253364 258111 261977 265297 268935
$$ packed form
54053B28841j596l110m206m826m860m239l123j835o34L69J113J563J845K277K999
54038B10578L718M027M013M210M873N641O020N907N427M637L746L318L762M659
54024B74536N041M417L265K379K004J714J073J84m22m71l58o91j533k381k958
54009B85799l561m455n311n637n468n192m864m225l352k797k935l462l743l480
53995B27317k871k254j772j399j156j106j151j011n70j04P5O0R6N5l66r41r88
53978B11914l23M46Q06J027J583K369K921L054K807K101R51k20r43j268j573k002
53962B23650k424k743k860k505j571m38L49O07M71O3l56k82N45J714K568K898
53946B19686K953K989L170L541L795L459K744K649L639M739M747L866L320L638
$$ plain form
53932 268935 273250 278126 283370 288478 292613 295543 298248 301975 306938 312532 318531 325326 333105 341554
53918 341554 350498 360368 371866 385438 400993 417817 434772 450840 465338 477382 485570 488794
53906 488794 487355 482727 476225 468343 459280 449554 439866 430739 422422 414854 407674 400581 393788 387825
53892 387825 382802 378105 372931 366928 360191 352854 344872 336235 327330 318906 311475 304794 298225 291612
53878 291612 285420 279941 274900 270135 266080 263038 260414 257322 253711 250254 247292 244594 242086 240070
53864 240070 238612 237260 235578 233519 231152 228425 225317 221909 218296 214797 212138 210905 210747 210630 209935
53849 209935 208818 207509 205920 204185 202913 202450 202296 201716 200662 199730 199403 199623 199937 199804 198987 197875
53833 197875 197309 197894 199530 201647 203575 204692 204599 203508 202179 201233 200697 200372 200359 200846 201577 201978 201856
$$ packed form
53932B68935M315M876N244N108M135K930K705L727M963N594N999O795P779Q449
53918C41554Q944R870J1498J3572J5555J6824J6955J6068J4498J2044Q188L224
53906D88794j439m628o502p882r063r726r688r127q317p568p180p093o793n963
53892C87825n023m697n174o003o737p337p982q637q905q424p431o681o569o613
53878B91612o192n479n041m765m055l042k624l092l611l457k962k698k508k016
53864B40070j458j352j682k059k367k727l108l408l613l499k659j233j58j17o95
53849B09935j117j309j589j735j272m63j54n80j054r32l27K20L14j33q17j112
53833A97875n66N85J636K117J928J117r3j091j329r46n36l25j3M87P31M01j22
$$ plain form
53816 201856 201706 202241 203742 205888 208102 210031 211758 213684 216285 219905 224516 229512 234027 237783 241497
53801 241497 246114 251749 257742 263611 269407 275052 279946 283584 286157 288229 290080 291655 292944 294111
53787 294111 295341 296738 298301 299845 301116 301988 302367 301935 300317 297676 294714 291902 289028 285753 282199
53772 282199 278619 274804 270354 265414 260674 256666 253419 250727 248364 245972 243157 239909 236703 234019
53758 234019 231886 229931 227758 225210 222450 219942 218232 217511 217315 216766 215239 212871 210407 208617 207832
53743 207832 207940 208574 209253 209543 209332 208887 208543 208381 208339 208472 208876 209448 210013 210660 211656 212972 214162 214832
53725 214832 215092 215452 216374 217936 219775 221385 222607 223823 225472 227472 229324 230686 231616 232312 233003 234028
53709 234028 235632 237586 239383 240862 242345 244057 245787 247257 248498 249744 251265 253389 256304 259640
$$ packed form
53816B01856j50N35J501K146K214J929J727J926K601L620M611M996M515L756L714
53801B41497M617N635N993N869N796N645M894L638K573K072J851J575J289J167
53787B94111J230J397J563J544J271Q72L79m32j618k641k962k812k874l275l554
53772B82199l580l815m450m940m740m008l247k692k363k392k815l248l206k684
53758B34019k133j955k173k548k760k508j710p21j96n49j527k368k464j790p85
53743B07832J08O34O79K90k11m45l44j62m2J33M04N72N65O47R96J316J190O70
53725B14832K60L60R22J562J839J610J222J216J649K000J852J362R30O96O91J025
53709B34028J604J954J797J479J483J712J730J470J241J246J521K124K915L336
$$ plain form
53695 259640 262645 265014 267278 270133 273604 277060 279779 281380 281998 282218 282530 282693 282004 280353 278580
53680 278580 277503 277059 276777 276622 276774 276907 276375 275112 273730 272636 271522 269970 268193 266931 266705 267361
53664 267361 268333 269245 270106 270932 271445 271387 270932 270365 269448 267712 265468 263865 263629 264250 264829 265217 265796 266605
53646 266605 267362 268081 269020 270101 270999 271781 272879 274357 275745 276710 277525 278699 280445 282596 284854 287042
53630 287042 289241 291580 293781 295169 295456 295311 295755 297078 298784 300541 302677 305639 309317 313099 316410
53615 316410 319180 321919 325270 329304 333423 337148 340738 344645 348711 352424 355869 359733 364388 369536
53601 369536 374840 380289 385740 390655 394603 397637 399980 401671 402697 403039 402382 400216 396551 392183 387942
53586 387942 384050 380502 377636 375741 374349 372522 369906 367055 364659 362836 361333 360042 359008 358102
$$ packed form
53695B59640L005K369K264K855L471L456K719J601O18K20L12J63o89j651j773
53680B78580j077m44k82j55J52J33n32j263j382j094j114j552j777j262k26O56
53664B67361R72R12Q61Q26N13n8m55n67r17j736k244j603k36O21N79L88N79Q09
53646B66605P57P19R39J081Q98P82J098J478J388R65Q15J174J746K151K258K188
53630B87042K199K339K201J388K87j45M44J323J706J757K136K962L678L782L311
53615C16410K770K739L351M034M119L725L590L907M066L713L445L864M655N148
53601C69536N304N449N451M915L948L034K343J691J026L42o57k166l665m368m241
53586C87942l892l548k866j895j392j827k616k851k396j823j503j291j034r06
$$ plain form
53572 358102 357001 355564 353986 352446 350784 348776 346660 345074 344382 344315 344448 344741 345413 346536 348026 349746
53556 349746 351301 352048 351850 351588 352262 353705 354922 355732 357192 360042 363508 366214 367776 368911 370409
53541 370409 372660 375881 380036 384559 388825 393014 397985 404174 411000 417589 423732 429966 436953 445007
53527 445007 453992 463414 472718 481719 490787 500589 511643 524153 538015 552801 567859 582718 597554
53514 597554 613141 630227 648967 669053 690205 712281 734928 757478 779471 801131 823122
53503 823122 845850 869202 892796 916177 938831 960412 981051 1001185 1020962 1040098 1058412
53492 1058412 1076143 1093547 1110526 1126980 1143239 1159755 1176490 1193012 1209126 1225069 1241074
53481 1241074 1257160 1273396 1289931 1306521 1322291 1336278 1348061 1357713 1365389 1371285 1375817 1379301
$$ packed form
53572C58102j101j437j578j540j662k008k116j586o92o7J33K93O72J123J490J720
53556C49746J555P47j98k62O74J443J217Q10J460K850L466K706J562J135J498
53541C70409K251L221M155M523M266M189M971O189O826O589O143O234O987Q054
53527D45007Q985R422R304R001R068R802J1054J2510J3862J4786J5058J4859J4836
53514E97554J5587J7086J8740K0086K1152K2076K2647K2550K1993K1660K1991
53503H23122K2728K3352K3594K3381K2654K1581K0639K0134J9777J9136J8314
53492A058412J7731J7404J6979J6454J6259J6516J6735J6522J6114J5943J6005
53481A241074J6086J6236J6535J6590J5770J3987J1783R652P676N896M532L484
$$ plain form
53469 1379301 1381293 1380609 1376344 1368827 1359387 1349217 1338605 1327192 1314711 1301400 1287752 1273994
53457 1273994 1259815 1244664 1228324 1211067 1193187 1174596 1155117 1135074 1115231 1096121 1077701
53446 1077701 1059728 1042171 1025154 1008860 993687 980240 968882 959449 951579 945122 939982 935844
53434 935844 932324 929287 926777 924832 923621 923508 924655 926767 929660 933788 939699 947128 955282 964064
53420 964064 974305 986630 1000701 1015901 1032223 1050068 1069515 1090261 1112047 1134788 1158473
53409 1158473 1183329 1209974 1239032 1270554 1304010 1338842 1374887 1412391 1451854 1493771 1538232
53398 1538232 1584672 1632107 1679746 1727449 1775710 1825197 1876089 1927803 1979464 2030674 2081651
53387 2081651 2132563 2182974 2232092 2279323 2324458 2367458 2408265 2446703 2482459 2515260 2545123
$$ packed form
53469A379301J992o84m265p517r440j0170j0612j1413j2481j3311j3648j3758
53457A273994j4179j5151j6340j7257j7880j8591j9479k0043j9843j9110j8420
53446A077701j7973j7557j7017j6294j5173j3447j1358r433p870o457n140m138
53434I35844l520l037k510j945j211j13J147K112K893M128N911P429Q154Q782
53420I64064J0241J2325J4071J5200J6322J7845J9447K0746K1786K2741K3685
53409A158473K4856K6645K9058L1522L3456L4832L6045L7504L9463M1917M4461
53398A538232M6440M7435M7639M7703M8261M9487N0892N1714N1661N1210N0977
53387B081651N0912N0411M9118M7231M5135M3000M0807L8438L5756L2801K9863
$$ plain form
53376 2545123 2572205 2596239 2616341 2631588 2641633 2646640 2646843 2642395 2633328 2619285 2599458 2573238
53364 2573238 2540916 2503524 2462128 2417609 2370983 2323360 2275446 2227496 2179869 2133197 2087781
53353 2087781 2043250 1999258 1956249 1915013 1875593 1837134 1798861 1760733 1722939 1685227 1647151
53342 1647151 1608794 1570885 1534239 1499405 1466784 1436621 1408783 1382837 1358496 1335754 1314559
53331 1314559 1294753 1276492 1260224 1245836 1232204 1218127 1203525 1189121 1175118 1160848 1145852
53320 1145852 1130646 1116155 1102866 1090888 1080374 1071378 1063505 1056154 1049166 1043079 1038738 1036768 1037205
53307 1037205 1039435 1042595 1046215 1050477 1055871 1062790 1071504 1082200 1094800 1108961 1124505 1141702 1160867
53294 1160867 1181862 1204264 1227871 1252720 1278622 1304977 1331121 1356686 1381608 1405889 1429321
$$ packed form
53376B545123K7082K4034K0102J5247J0045N007K03m448r067j4043j9827k6220
53364B573238l2322l7392m1396m4519m6626m7623m7914m7950m7627m6672m5416
53353B087781m4531m3992m3009m1236l9420l8459l8273l8128l7794l7712l8076
53342A647151l8357l7909l6646l4834l2621l0163k7838k5946k4341k2742k1195
53331A314559j9806j8261j6268j4388j3632j4077j4602j4404j4003j4270j4996
53320A145852j5206j4491j3289j1978j0514q996p873p351o988o087m341j970M37
53307A037205K230L160L620M262N394O919Q714J0696J2600J4161J5544J7197J9165
53294A160867K0995K2402K3607K4849K5902K6355K6144K5565K4922K4281K3432
$$ plain form
53283 1429321 1451270 1470804 1487281 1500875 1512365 1522301 1530394 1535804 1537942 1536968 1533469 1527767 1519726
53270 1519726 1509268 1496793 1482807 1467282 1449832 1430474 1409771 1388089 1365214 1340997 1315942
53259 1315942 1290698 1265223 1239002 1212018 1185083 1159087 1134226 1110035 1085937 1061639 1037203
53248 1037203 1012896 988993 965706 943167 921312 899691 877685 855159 832734 811173 790607
53237 790607 770614 750990 732131 714617 698692 684263 671238 659694 649683 640935 632861 624889
53225 624889 616735 608171 598690 587825 575876 563878 552496 541212 528954 515368 501130 487228
53213 487228 474311 462656 452241 442707 433534 424423 415421 406644 398111 389827 381881 374364 367295
53200 367295 360586 354025 347404 340766 334359 328176 321751 314681 307212 300113 294083 289522 286546 284786
$$ packed form
53283A429321K1949J9534J6477J3594J1490R936Q093N410K138r74l499n702q041
53270A519726j0458j2475j3986j5525j7450j9358k0703k1682k2875k4217k5055
53259A315942k5244k5475k6221k6984k6935k5996k4861k4191k4098k4298k4436
53248A037203k4307k3903k3287k2539k1855k1621k2006k2526k2425k1561k0566
53237G90607j9993j9624j8859j7514j5925j4429j3025j1544j0011q748q074p972
53225F24889q154q564r481j0865j1949j1998j1382j1284j2258j3586j4238j3902
53213D87228j2917j1655j0415r534r173r111r002q777q533q284p946p517p069
53200C67295o709o561o621o638o407o183o425p070p469p099o030m561k976j760
$$ plain form
53186 284786 283313 281294 278797 276531 274811 273174 271084 268595 266197 264345 263229 262618 261827 260295 258346
53171 258346 256994 256731 256923 256723 256144 255784 255758 255490 254507 252943 251203 249540 248133 247221 246903 246933 246953 246821
53153 246821 246561 246044 245014 243493 241952 240885 240320 239946 239622 239494 239612 239776 239889 240106 240389 240213 239182
53136 239182 237752 236851 236772 236916 236702 236252 235923 235610 235019 234466 234852 236673 239264 241266 241850 241418 241113 241687
53118 241687 242926 244118 244905 245550 246469 247731 249076 250234 251090 251570 251489 250644 249145 247605 246720 246544 246381
53101 246381 245597 244405 243508 243103 242630 241570 240110 238791 237755 236651 235184 233588 232510 232500 233518 234824
53085 234824 235385 234595 232790 231088 230595 231540 233162 234500 235289 235953 236794 237573 237999 238229 238536 238745 238497
53068 238497 237934 237629 237748 237718 236915 235414 233910 233055 232970 233215 233182 232647 232011 231895 232526 233597 234631 235288
$$ packed form
53186B84786j473k019k497k266j720j637k090k489k398j852j116o11p91j532j949
53171B58346j352k63J92k00n79l60k6k68r83j564j740j663j407r12l18L0K0j32
53153B46821k60n17j030j521j541j067n65l74l24j28J18J64J13K17K83j76j031
53136B39182j430r01p9J44k14m50l29l13n91n53L86J821K591K002N84m32l05N74
53118B41687J239J192P87O45R19J262J345J158Q56M80q1q45j499j540q85j76j63
53101B46381p84j192q97m05m73j060j460j319j036j104j467j596j078j0J018J306
53085B34824N61p90j805j702m93R45J622J338P89O64Q41P79M26K30L07K09k48
53068B38497n63l05J19l0q03j501j504q55q5K45l3n35o36j16O31J071J034O57
$$ plain form
53050 235288 235472 235393 235409 235536 235296 234363 233159 232312 231726 230790 229463 228386 227849 227403 226790 226538 227116 228123
53032 228123 228913 229479 230053 230258 229502 228085 227095 227076 227432 227322 226613 225725 225004 224650 225008 226462 228963 231793
53014 231793 233957 234892 234860 234582 234415 234059 233150 231937 231078 230938 231386 232154 233052 233831 234315 234739 235614 237050
52996 237050 238567 239801 241022 242560 243993 244424 243588 242195 241033 240166 239278 238466 238229 238811 240001 241544
52980 241544 243307 244929 245820 245851 245728 246316 247757 249594 251524 253656 256100 258772 261552 264269 266513
52965 266513 267924 268632 269023 269059 268386 267240 266632 267270 268737 270083 270829 270969 270388 268911 266783 264518 262282
52948 262282 259849 257183 254665 252688 251342 250511 249983 249384 248356 246924 245504 244463 243832 243469 243237 242927
52932 242927 242252 241115 239766 238565 237641 236868 236100 235363 234828 234620 234618 234485 234003 233349 232956 233043 233385 233639 233842
$$ packed form
53050B35288J84p9J6J27k40r33j204q47n86r36j327j077n37m46o13k52N78J007
53032B28123P90N66N74K05p56j417r90j9L56j10p09q88p21l54L58J454K501K830
53014B31793K164R35l2k78j67l56r09j213q59j40M48P68Q98P79M84M24Q75J436
52996B37050J517J234J221J538J433M31q36j393j162q67q88q12k37N82J190J543
52980B41544J763J622Q91L1j23N88J441J837J930K132K444K672K780K717K244
52965B66513J411P08L91L6o73j146o08O38J467J346P46J40n81j477k128k265k236
52948B62282k433k666k518j977j346q31n28n99j028j432j420j041o31l63k32l10
52932B42927o75j137j349j201r24p73p68p37n35k08kj33m82o54l93Q7L42K54K03
$$ plain form
52913 233842 234453 235810 237610 239095 239792 239888 239766 239402 238574 237550 237092 237612 238650 239401 239511 239139 238486
52896 238486 237627 236668 235773 234979 234132 233016 231495 229735 228334 227994 228795 230006 230825 231131 231267 231306 230986
52879 230986 230348 230017 230651 232239 234020 235057 234980 234326 234066 234689 235873 237162 238703 240971 243906 246664
52863 246664 248310 248565 247941 247403 247829 249464 251798 253994 255435 255815 255038 253357 251409 249749 248378 247008
52847 247008 245593 244195 242539 240243 237485 234912 232827 230957 229078 227334 225803 224278 222732 221472
52833 221472 220563 219616 218510 217816 217988 218518 218552 218093 217975 218649 219535 219693 218797 217326 216091 215620 215772 215899
52815 215899 215542 214963 214787 215259 216038 216713 217226 217824 218791 220188 221673 222724 223305 224094 225585 227071 227152
52798 227152 225348 222682 220439 218934 217811 216949 216503 216395 216397 216565 216995 217269 216748 215450 214056 212991 212104
$$ packed form
52913B33842O11J357J800J485O97R6j22l64q28j024m58N20J038P51J10l72o53
52896B38486q59r59q95p94q47j116j521j760j401l40Q01J211Q19L06J36L9l20
52879B30986o38l31O34J588J781J037p7o54k60O23J184J289J541K268K935K758
52863B46664J646K55o24n38M26J635K334K196J441L80p77j681j948j660j371j370
52847B47008j415j398j656k296k758k573k085j870j879j744j531j525j546j260
52833B21472r09r47j106o94J72N30L4m59j18O74Q86J58q96j471j235m71J52J27
52815B15899l57n79j76M72P79O75N13N98R67J397J485J051N81P89J491J486Q1
52798B27152j804k666k243j505j123q62m46j08KJ68M30K74n21j298j394j065q87
$$ plain form
52781 212104 211415 211515 212786 214695 216369 217606 218826 220268 221733 222988 223897 224121 223238 221323 219114
52766 219114 217428 216598 216513 216902 217480 218046 218615 219294 219985 220377 220295 219836 219212 218664 218592 219348 220784 222283 223415
52747 223415 224283 225008 225277 224828 224182 224388 226029 228709 231577 233994 235663 236494 236747 237152 238493 240857
52731 240857 243433 245302 246333 247076 247774 247935 247129 245850 245137 245480 246515 247652 248471 248570 247661 246019 244330
52714 244330 242875 241367 239761 238614 238236 238007 237087 235476 233874 232790 232248 232085 231981 231441 230299 229111
52698 229111 228610 228940 229893 231541 233945 236440 238020 238475 238461 238407 238112 237591 237522 238371 239611 240300 240111 239434
52680 239434 238776 238381 238216 238059 237729 237368 237246 237257 236961 236266 235616 235247 234657 233211 231030 228972 227904 228143
52662 228143 229388 230914 232111 233043 234234 235723 236792 237006 237155 238533 241444 244911 247858 250055 251863
$$ packed form
52781B12104o89J00J271J909J674J237J220J442J465J255R09K24q83j915k209
52766B19114j686q30q5L89N78N66N69O79O91L92q2m59o24n48p2P56J436J499J132
52747B23415Q68P25K69m49o46K06J641K680K868K417J669Q31K53M05J341K364
52731B40857K576J869J031P43O98J61q06j279p13L43J035J137Q19R9r09j642j689
52714B44330j455j508j606j147l78k29r20j611j602j084n42j63j04n40j142j188
52698B29111n01L30R53J648K404K495J580M55j4n4k95n21o9Q49J240O89j89o77
52680B39434o58l95j65j57l30l61j22J1k96o95o50l69n90j446k181k058j068K39
52662B28143J245J526J197R32J191J489J069K14J49J378K911L467K947K197J808
$$ plain form
52647 251863 253487 254723 255163 254457 252584 250058 247787 246529 246418 246954 247427 247425 247118 247064 247690 248884 250086
52630 250086 250740 250716 250477 250821 252285 254639 257058 258887 260115 261055 261741 261908 261428 260546 259619 258753 257756
52613 257756 256440 254973 253889 253556 253621 253159 251554 249167 246992 245771 245562 246044 246967 248221 249638 250926
52597 250926 251809 252222 252309 252269 252256 252421 252888 253608 254323 254798 255006 255021 254921 254893 255178 255655 255770 255245 254624 254648 255278
52576 255278 255918 256504 257569 259119 260229 260155 259264 258444 258085 258059 258161 258072 257374 256230 255622 256251 257474 258021
52558 258021 257531 256679 255955 255219 254453 254035 253982 253603 252348 250531 248921 247958 247660 247816 247977 247610 246665 245779
52540 245779 245628 246228 247106 247901 248551 249062 249436 249721 249945 250091 250254 250647 251295 251917 252299 252587 253020 253590 254201
52521 254201 254934 255864 256782 257459 258031 258776 259628 260287 260779 261511 262763 264496 266687 269419 272485 275317 277564
$$ packed form
52647B51863J624J236M40p06j873k526k271j258j11N36M73kl07n4O26J194J202
52630B50086O54k4k39L44J464K354K419J829J228R40O86J67m80q82r27q66r97
52613B57756j316j467j084l33O5m62j605k387k175j221k09M82R23J254J417J288
52597B50926Q83M13Q7m0j3J65M67P20P15M75K08J5j00k8K85M77J15n25o21K4O30
52576B55278O40N86J065J550J110p4q91q20l59k6J02q9o98j144o08O29J223N47
52558B58021m90q52p24p36p66m18n3l79j255j817j610r63k98J56J61l67r45q86
52540B45779j51O00Q78P95O50N11L74K85K24J46J63L93O48O22L82K88M33N70O11
52521B54201P33R30R18O77N72P45Q52O59M92P32J252J733K191K732L066K832K247
$$ plain form
52504 277564 279390 280966 281988 282046 281236 280032 278733 277367 275962 274438 272356 269360 265906 263057 261378
52489 261378 260464 259738 259192 259049 259133 259084 258908 258835 258795 258439 257630 256576 255627 255291 256199 258489 261268 263268 264118
52470 264118 264564 265410 266758 268324 269939 271516 273003 274637 276788 279295 281452 282905 284054 285177 285715
52455 285715 285086 283808 282994 282865 282408 280609 277532 274108 271301 269472 268163 266412 263705 260713 258713
52440 258713 258107 257937 257079 255595 254589 254886 256135 257220 257373 256835 256385 256343 256232 255505 254349 253476 253292
52423 253292 253683 254509 255825 257512 259096 260213 260997 261855 263020 264507 266311 268494 271151 274340 277919
52408 277919 281526 284950 288633 293474 300004 307921 316504 325123 333183 339898 344517 346708 346480 343903
52394 343903 339248 333275 326997 321043 315483 310322 305853 302423 300014 298273 296855 295644 294718 294221 294241
$$ packed form
52504B77564J826J576J022N8q10j204j299j366j405j524k082k996l454k849j679
52489B61378r14p26n46j43Q4m9j76p3m0l56q09j054r49l36R08K290K779K000Q50
52470B64118M46Q46J348J566J615J577J487J634K151K507K157J453J149J123N38
52455B85715o29j278q14j29m57j799l077l424k807j829j309j751k707k992k000
52440B58713o06j70q58j484j006K97J249J085J53n38m50m2j11p27j156q73j84
52423B53292L91Q26J316J687J584J117P84Q58J165J487J804K183K657L189L579
52408B77919L607L424L683M841O530P917Q583Q619Q060O715M619K191k28k577
52394C43903m655n973o278n954n560n161m469l430k409j741j418j211r26m97K0
$$ plain form
52379 294241 294716 295510 296607 298123 300038 302084 304158 306725 310423 315147 319915 323916 327441 331398 336080
52364 336080 340902 345281 349214 352797 355656 357227 357365 356339 354446 351974 349440 347466 346379 346099 346382
52349 346382 347016 347919 349234 351216 353766 356303 358440 360687 364020 368729 374069 379188 384059 389334 395551
52334 395551 402759 410790 419698 429814 441394 454261 468020 482667 498722 516426 535098 553727
52322 553727 572115 590939 610729 631303 652324 673799 695734 717747 739396 760600 781386
52311 781386 801448 820316 837771 853869 868805 883092 897559 912708 928051 942472 955217
52300 955217 966259 975769 983657 989776 994303 997644 999958 1000878 999736 996165 990503 983456 975406 966344
52286 966344 956570 947024 938500 930841 923441 916470 910944 907562 905990 905573 906268 908555 912782 918991 927135
$$ packed form
52379B94241M75P94J097J516J915K046K074K567L698M724M768M001L525L957M682
52364C36080M822M379L933L583K859J571J38j026j893k472k534j974j087k80K83
52349C46382O34R03J315J982K550K537K137K247L333M709N340N119M871N275O217
52334C95551P208Q031Q908J0116J1580J2867J3759J4647J6055J7704J8672J8629
52322E53727J8388J8824J9790K0574K1021K1475K1935K2013K1649K1204K0786
52311G81386K0062J8868J7455J6098J4936J4287J4467J5149J5343J4421J2745
52300I55217J1042R510P888O119M527L341K314R20j142l571n662p047q050r062
52286I66344r774r546q524p659p400o971n526l382j572m17O95K287M227O209Q144
$$ plain form
52271 927135 937050 948322 960560 973698 987687 1001977 1015772 1028920 1042179 1056347 1071312 1086193
52259 1086193 1100271 1113545 1126359 1138664 1149839 1159285 1167154 1174318 1181520 1188680 1195218 1200746 1205031
52246 1205031 1207353 1206637 1202582 1196223 1188844 1180608 1170774 1159111 1146502 1134076 1122303 1111099 1100373
52233 1100373 1090145 1080373 1070925 1061650 1052472 1043691 1036137 1030563 1026713 1023428 1019958 1016779 1014793 1014148
52219 1014148 1014300 1014894 1015957 1017387 1018901 1020596 1023071 1026788 1031636 1037239 1043392 1050067 1057245 1064917
52205 1064917 1073080 1081575 1089962 1097648 1104186 1109555 1114210 1118731 1123276 1127537 1131361 1135139 1139368 1144041
52191 1144041 1148833 1153614 1158316 1162435 1165300 1166874 1167834 1168748 1169634 1170353 1170780 1170309 1167716 1162134 1154080
52176 1154080 1145172 1136867 1129518 1122438 1114690 1105957 1096894 1088612 1081798 1076407 1072084 1068562 1065620 1063083
$$ packed form
52271I27135R915J1272J2238J3138J3989J4290J3795J3148J3259J4168J4965J4881
52259A086193J4078J3274J2814J2305J1175R446P869P164P202P160O538N528M285
52246A205031K322p16m055o359p379q236r834j1663j2609j2426j1773j1204j0726
52233A100373j0228r772r448r275r178q781p554n574l850l285l470l179j986o45
52219A014148J52N94J063J430J514J695K475L717M848N603O153O675P178P672
52205A064917Q163Q495Q387P686O538N369M655M521M545M261L824L778M229M673
52191A144041M792M781M702M119K865J574R60R14Q86P19M27m71k593n582q054
52176A154080q908q305p349p080p748q733r063q282o814n391m323l522k942k537
$$ plain form
52162 1063083 1061099 1060211 1060952 1063456 1067397 1072036 1076337 1079558 1081843 1083905 1085968 1087493 1088092 1088189 1088329
52147 1088329 1088349 1087799 1086871 1086260 1086279 1086662 1087211 1088069 1089267 1090523 1091647 1092829 1094360 1096355 1098884 1102133
52131 1102133 1106336 1111750 1118821 1128130 1140055 1154613 1171757 1191647 1214458 1239997 1267674 1296812
52119 1296812 1326851 1357262 1387445 1416907 1445595 1473890 1502073 1529721 1555736 1579015 1599031
52108 1599031 1615825 1629623 1640570 1648700 1654028 1656708 1657116 1655678 1652612 1648032 1642365 1636389 1630703
52095 1630703 1625287 1619757 1613839 1607285 1599496 1589702 1577701 1564211 1550264 1536316 1522125 1507392
52083 1507392 1492299 1477383 1463276 1450907 1441605 1436339 1434647 1434952 1436375 1439835 1446803 1457336 1470010
52070 1470010 1483550 1497769 1512943 1529168 1546495 1564842 1583388 1600749 1616228 1630319 1643533
$$ packed form
52162A063083j984q88P41K504L941M639M301L221K285K062K063J525N99R7J40
52147A088329K0n50r28o11J9L83N49Q58J198J256J124J182J531J995K529L249
52131A102133M203N414P071R309J1925J4558J7144J9890K2811K5539K7677K9138
52119A296812L0039L0411L0183K9462K8688K8295K8183K7648K6015K3279K0016
52108A599031J6794J3798J0947Q130N328K680M08j438l066m580n667n976n686
52095A630703n416n530n918o554p789r794j2001j3490j3947j3948j4191j4733
52083A507392j5093j4916j4107j2369r302n266j692L05J423L460O968J0533J2674
52070A470010J3540J4219J5174J6225J7327J8347J8546J7361J5479J4091J3214
$$ plain form
52059 1643533 1655386 1665118 1672887 1679482 1685170 1689507 1692068 1692701 1691234 1687560 1681969 1674845 1666101 1655346
52045 1655346 1642476 1627615 1610634 1591335 1570030 1547422 1523967 1499885 1475694 1452095 1429336
$$ packed form
52059A643533J1853R732P769O595N688M337K561O33j467l674n591p124q744j0755
52045A655346j2870j4861j6981j9299k1305k2608k3455k4082k4191k3599k2759
$$ [...]
##END NTUPLES=NMR SPECTRUM
##END=
