##TITLE=AC1625_CENAH_8450316_X6tz9YAGww
##JCAMPDX= 6.0         $$ Bruker NMR JCAMP-DX V2.0
##DATA TYPE= NMR SPECTRUM
##DATA CLASS= NTUPLES
##ORIGIN= BRUKER
##OWNER= Administrator
$$ 1.72 TOPSPIN		Version 2.1
$$ 2014-02-18 13:41:13.272 -0800  Administrator@X
$$ Compression mode = diff/dup
##.OBSERVE FREQUENCY= 400.02188249412
##.OBSERVE NUCLEUS= ^1H
##.ACQUISITION MODE= SIMULTANEOUS (DQD)
##.ACQUISITION SCHEME= undefined
##.AVERAGES= 8
##.DIGITISER RES= 22
##SPECTROMETER/DATA SYSTEM= spect
##.PULSE SEQUENCE= zg30
##.SOLVENT NAME= COFFEE_meoh
##.SHIFT REFERENCE= INTERNAL, COFFEE_meoh, 1, 14.98509
##AUDIT TRAIL= $$ (NUMBER, WHEN, WHO, WHERE, PROCESS, VERSION, WHAT)
$$ ##TITLE= Audit trail, TOPSPIN		Version 2.1
$$ ##JCAMPDX= 5.01
$$ ##ORIGIN= Bruker BioSpin GmbH
$$ ##OWNER= Administrator
$$ $$ E:\/data/COFFEE/nmr/AC1625_CENAH_8450316_X6tz9YAGww/30/pdata/1/auditp.txt
$$ ##AUDIT TRAIL=  $$ (NUMBER, WHEN, WHO, WHERE, PROCESS, VERSION, WHAT)
(   1,<2014-02-18 13:41:06.600 -0800>,<Administrator>,<X>,<go>,<TOPSPIN 2.1>,
      <created by zg
	started at 2014-02-18 13:40:00.491 -0800,
	POWCHK enabled, PULCHK disabled,
       configuration hash MD5:
       C8 4E 4E 5D D3 5C D8 9E 9F 52 82 E0 59 8A DE 15
       data hash MD5: 64K
       5B 2C 1E F8 D3 7F 20 BC 48 70 4B 2D 67 F7 2F 34>)
(   2,<2014-02-18 13:41:09.537 -0800>,<Administrator>,<X>,<proc1d>,<TOPSPIN 2.1>,
      <Start of raw data processing
       efp LB = 0 FT_mod = 6 PKNL = 1 PHC0 = 0 PHC1 = 0 SI = 32K 
       data hash MD5: 32K
       2A C4 50 C4 43 A0 74 0F BE 08 7D 5B 96 4E 9C 67>)
(   3,<2014-02-18 13:41:09.834 -0800>,<Administrator>,<X>,<proc1d>,<TOPSPIN 2.1>,
      <pk PHC0 = 96.01501 PHC1 = 0 
       data hash MD5: 32K
       DD A7 02 C1 78 2A 47 7E F6 F1 83 50 9F 64 95 A9>)
(   4,<2014-02-18 13:41:09.944 -0800>,<Administrator>,<X>,<proc1d>,<TOPSPIN 2.1>,
      <abs ABSG = 1 
       data hash MD5: 32K
       46 82 72 60 5B B1 20 E1 DB 48 A5 A0 57 C3 4F 46>)
(   5,<2014-02-18 13:41:10.006 -0800>,<Administrator>,<X>,<proc1d>,<TOPSPIN 2.1>,
      <abs ABSG = 2 
       data hash MD5: 32K
       0B 9C 82 95 2B 1C D9 2C 7E 6A E6 B4 FF 6C 1A CE>)
(   6,<2014-02-18 13:41:10.053 -0800>,<Administrator>,<X>,<proc1d>,<TOPSPIN 2.1>,
      <abs ABSG = 3 
       data hash MD5: 32K
       9C CA 25 71 2E B7 C2 64 01 49 4D 74 08 F0 00 85>)
(   7,<2014-02-18 13:41:10.100 -0800>,<Administrator>,<X>,<proc1d>,<TOPSPIN 2.1>,
      <abs ABSG = 4 
       data hash MD5: 32K
       73 B3 A7 B3 53 B8 7C A0 5B 34 D0 71 39 28 FF FB>)
(   8,<2014-02-18 13:41:10.147 -0800>,<Administrator>,<X>,<proc1d>,<TOPSPIN 2.1>,
      <abs ABSG = 5 
       data hash MD5: 32K
       65 16 64 AB C0 F4 76 64 01 05 6E 9E 15 94 4B 65>)
$$ ##END=
$$ 
$$ $$ hash MD5
$$ $$ 57 35 76 6C E5 28 D6 E8 09 6A 2A 54 97 39 4D 3B
##$RELAX= 
##$RELAX= 
##$RELAX= 
##$RELAX= 
##$RELAX= 
##$RELAX= 
##$RELAX= 
$$ Bruker specific parameters
$$ --------------------------
##$DU= <E:\>
##$EXPNO= 30
##$NAME= <AC1625_CENAH_8450316_X6tz9YAGww>
##$PROCNO= 1
$$ [...]
150 150 150 150 150 150 150 150
##$TP07= 0
##$TPNAME0= <>
##$TPNAME1= <>
##$TPNAME2= <>
##$TPNAME3= <>
##$TPNAME4= <>
##$TPNAME5= <>
##$TPNAME6= <>
##$TPNAME7= <>
##$TPOAL= (0..7)
0.5 0.5 0.5 0.5 0.5 0.5 0.5 0.5
##$TPOFFS= (0..7)
0 0 0 0 0 0 0 0
##$TUNHIN= 0
##$TUNHOUT= 0
##$TUNXOUT= 0
##$USERA1= <user>
##$USERA2= <user>
##$USERA3= <user>
##$USERA4= <user>
##$USERA5= <user>
##$V9= 5
##$VALIST= <valist>
##$VCLIST= <CCCCCCCCCCCCCCC>
##$VD= 0
##$VDLIST= <DDDDDDDDDDDDDDD>
##$VPLIST= <PPPPPPPPPPPPPPP>
##$VTLIST= <TTTTTTTTTTTTTTT>
##$WBST= 2048
##$WBSW= 25
##$XGAIN= (0..3)
0 0 0 0
##$XL= 0
##$YL= 0
##$YMAX_a= 657240
##$YMIN_a= -558141
##$ZGOPTNS= <>
##$ZL1= 120
##$ZL2= 120
##$ZL3= 120
##$ZL4= 120
##$ABSF1= 14.98509
##$ABSF2= -5.573092
##$ABSG= 5
##$ABSL= 3
##$ALPHA= 0
##$AQORDER= 0
##$ASSFAC= 0
##$ASSFACI= 0
##$ASSFACX= 0
##$ASSWID= 0
##$AUNMP= <proc_prof1d_extract_pilot.lims>
##$AXLEFT= 0
##$AXNAME= <>
##$AXNUC= <1H>
##$AXRIGHT= 0
##$AXTYPE= 0
##$AXUNIT= <>
##$AZFE= 0.1
##$AZFW= 0.1
##$BCFW= 0
##$BC_mod= 0
##$BYTORDP= 0
##$COROFFS= 0
##$CY= 15
##$DATMOD= 1
##$DC= 0
##$DFILT= <>
##$DTYPP= 0
##$F1P= 0
##$F2P= 0
##$FCOR= 0.5
##$FTSIZE= 32768
##$FT_mod= 6
##$GAMMA= 0
##$GB= 0
##$INTBC= 1
##$INTSCL= 1
##$ISEN= 128
##$LB= 0
##$LEV0= 0
##$LPBIN= 0
##$MAXI= 10000
##$MC2= 0
##$MEAN= 0
##$ME_mod= 0
##$MI= 0
##$NCOEF= 0
##$NC_proc= -8
##$NLEV= 6
##$NOISF1= 0
##$NOISF2= 0
##$NSP= 0
##$NTH_PI= 0
##$NZP= 0
##$OFFSET= 14.98509
##$PC= 1
##$PHC0= 96.01501
##$PHC1= 0
##$PH_mod= 1
##$PKNL= yes
##$PPARMOD= 0
##$PPDIAG= 0
##$PPIPTYP= 0
##$PPMPNUM= 2147483647
##$PPRESOL= 1
##$PSCAL= 4
##$PSIGN= 0
##$PYNMP= <proc.py>
##$REVERSE= no
##$SF= 400.02
##$SI= 32768
##$SIGF1= 0
##$SIGF2= 0
##$SINO= 400
##$SIOLD= 32768
##$SPECTYP= <>
##$SREGLST= <1H.CDCl3>
##$SSB= 0
##$STSI= 32768
##$STSR= 0
##$SW_p= 8223.68421052631
##$SYMM= 0
##$S_DEV= 0
##$TDeff= 65536
##$TDoff= 0
##$TI= <>
##$TILT= no
##$TM1= 0
##$TM2= 0
##$TOPLEV= 0
##$USERP1= <user>
##$USERP2= <user>
##$USERP3= <user>
##$USERP4= <user>
##$USERP5= <user>
##$WDW= 1
##$XDIM= 32768
##$YMAX_p= 472835846
##$YMIN_p= -825582
##$CURPLOT= <Network HP LaserJet P1505>
##$CURPRIN= <$Network HP LaserJet P1505>
##$DFORMAT= <normdp>
##$LAYOUT= <+/1D_H.xwp>
##$LFORMAT= <normlp>
##$PFORMAT= <normpl>
##$SURQMSG= 1
$$ End of Bruker specific parameters
$$ ---------------------------------
##NTUPLES= NMR SPECTRUM
##VAR_NAME=  FREQUENCY,     SPECTRUM/REAL,   SPECTRUM/IMAG
##SYMBOL=    X,             R,               I
##VAR_TYPE=  INDEPENDENT,   DEPENDENT,       DEPENDENT
##VAR_FORM=  AFFN,          ASDF,            ASDF
##VAR_DIM=   32768,         32768,           32768
##UNITS=     HZ,            ARBITRARY UNITS, ARBITRARY UNITS
##FACTOR=    0.250966925370066, 1,           1
##FIRST=     8223.43324360094, -107084,      171032
##LAST=      0,             -12629,          121967
##MIN=       0,             -825582,         0
##MAX=       8223.43324360094, 472835846,    0
$$ Real data points
##PAGE= N=1
##DATA TABLE= (X++(R..R)), XYDATA
$$ [...]
$$ plain form
19522 196220 -220962 -63571 -327057 314297 67151 -220318 -89532 -281725 -66293 175858
19511 214746 -140958 -114598 391741 118786 46511 -81748 -197471 -180288 176591 52602
19500 -253090 -118734 -406275 308326 195484 130257 29811 -149931 159988 -27056 -225082
19490 -225082 -256460 199105 -36837 27253 97374 -179845 -126262 98472 43842 -51921 -34845
19479 -34845 -74346 10612 133798 -252274 -154603 10567 83088 81023 137599 -62764 82582
19467 -8948 -56804 136054 -56212 1186 -160937 -38309 -225812 -15981 -99096 -116778 -185931
19456 -185931 99602 -114705 -6064 271407 1319 -6719 -203251 195634 -198168 -134621 41125
19444 -201140 -367318 -260544 -301565 102756 -30592 -225604 -269167 95186 -119692 140193
$$ packed form
19522A96220b20962f3571k63486C14297F7151b20318h9532j92193f6293A75858
19511B14746a40958K6360C91741A18786D6511h1748j15723J7183A76591E2602
19500b53090a18734k87541C08326j12842o5227B9811a49931A59988b7056j98026
19490b25082l1378A99105c6837B7253P0121a79845N3583I8472D3842e1921J7076
19479c4845l9501A0612J23186b52274R7671A0567P2521k065N6576f2764H2582
19467h948m7856A36054e6212A186a60937c8309j87503a5981q3115j7682o9153
19456a85931I9602a14705f064B71407A319f719j96532A95634a98168O3547D1125
19444b01140j66178J06774m1021A02756c0592j95012m3563I5186a19692A40193
$$ plain form
19433 -193072 13093 -158139 342271 -67472 -177562 -100422 -353301 158407 -83051 -101495
19423 -101495 -331675 30900 17223 -104451 -285183 15167 -326516 -232231 73779 -240562
19412 -193694 36248 21722 -187089 -76019 80664 70114 63672 29596 -199733 -5352 287956
19400 63917 29674 312044 201720 -31038 -174506 -18343 -56433 -97168 159135 -91502 -105457
19389 -105457 -270643 -64818 -5787 88668 -98976 -134008 -201682 -146229 182384 160759 14233
19377 -9233 -87803 292198 -51959 -200066 301287 -267707 81328 -200467 82577 158804 -103287
19365 -397858 220132 -187663 -91195 -111589 -180897 31176 -50204 -210819 -135578 53249 -227956
19353 -150059 19855 91236 -1761 229035 -49157 44407 39664 -266616 -97945 60192 -84091
$$ packed form
19433a93072A3093a58139C42271f7472j10090P7140k52879A58407h3051j8444
19423a01495k30180C0900j3677a04451j80732A5167c26516R4285G3779b40562
19412a93694C6248j4526a87089g6019H0664j0550o442B9596a99733e352B87956
19400F3917B9674K82370j10324c1038j43468a8343l8090m0735A59135i1502j3955
19389a05457j65186f4818e787H8668i8976l5032o7674N5453A82384k1625A4233
19377i233p8570B92198e1959j48107C01287b67707H1328b00467H2577P6227a03287
19365c97858B20132a87663i1195k0394o9308C1176e0204j60615P5241E3249b27956
19353a50059A9855P1381a761B29035d9157D4407m743b66616i7945F0192h4091
$$ plain form
19341 99655 2785 -126344 -37705 -2783 -227718 27587 -168815 -113749 -308027 -21989 -51017
19330 -51017 42189 -66560 -49973 -269349 109254 -83773 -223246 108124 120006 -214281 -151731
19319 -151731 -223357 -151608 -79073 12617 -139873 -227993 249935 6159 261547 -14545 -48321
19308 -48321 -250915 -132447 34215 57508 -71371 1899 -53262 -214219 -217076 7073 34734 -96344
19295 -278804 69661 61584 -130951 -116507 -341043 -118302 126330 30954 -70851 -125887 -87802
19284 -87802 -229301 -125524 -31309 -269612 83033 146869 -184362 -35651 42331 17629 -18919
19272 83729 26751 13479 -110700 -274494 -493015 -90773 -386713 -166557 47382 -134783
19261 -158050 325026 -165419 -320637 -136378 -120982 80552 -354916 38166 -71632 259620
$$ packed form
19341I9655B785a26344c7705b783k24935B7587a68815N5066j94278b1989k9028
19330e1017D2189f6560J6587k19376A09254h3773j39473A08124J1882b14281O2550
19319a51731p1626P1749P2535A2617a39873q8120B49935F159K55388a4545l3776
19308d8321k02594J18468C4215K3293g1371A899e3262j60957k857G073K7661i6344
19295b78804F9661q077a30951J4444k24536a18302A26330C0954g0851n5036L8085
19284h7802j41499J03777c1309k38303H3033O3836a84362c5651D2331A7629a8919
19272H3729B6751j3272a10700j63794k18521i0773k95940a66557D7382a34783
19261a58050C25026a65419j55218a36378J5396H0552c54916C8166g1632B59620
$$ plain form
19250 157658 -47835 38189 -128245 152390 -279125 101881 -245034 -33850 -295326 277970
19239 -275058 -118521 183156 -89837 -413371 12146 183620 53218 50372 -381345 -163594
19228 -197186 -175307 -159757 -142374 61912 178566 -234240 173697 18626 -123873 -80092 -46773
19217 -46773 -72808 -104028 12011 -81063 -125008 -303906 58292 -334457 56321 -63578 -11129
19205 -252279 -174614 -11127 41727 104169 38888 151159 -307943 -76329 35028 3570 -61302
19193 -160992 -225626 -111017 -210486 172996 101852 -115921 95756 -41794 209868 -381592
19182 -46134 -197790 -134124 -56676 55476 -318757 -361127 316506 -60736 -79626 -111867 -250824
19171 -250824 -149320 -446425 64566 -38415 -282126 115898 -55764 126640 -236846 -191954
$$ packed form
19250A57658d7835C8189a28245A52390b79125A01881b45034c3850k61476B77970
19239b75058a18521A83156h9837l23534A2146J71474E3218k846c81345a63594
19228a97186K1879J5550J7383F1912J16654b34240A73697A8626a23873M3781L3319
19217d6773k6035l1220A2011h1063m3945j78898E8292c34457E6321f3578a1129
19205b52279P7665a1127D1727O2442C8888J12271c07943g6329C5028C570f1302
19193a60992o4634a11017r9469A72996p1144a15921I5756d1794B09868c81592
19182d6134j51656O3666e6676E5476c18757m2370C16506f0736j8890l2241j38957
19171b50824J01504k97105F4566c8415k43711A15898e5764A26640b36846M4892
$$ plain form
19161 -191954 9059 -432728 68841 109025 -353219 -194085 25981 -81787 175671 -77755 -32295
19149 -186876 463347 55306 -172432 -119759 -131695 -461908 97178 -292656 79291 -157014
19138 -304372 -241360 -2502 -52287 180525 -139368 -190637 -17597 -39395 -36403 -284489 -196789
19127 -196789 -139105 -73222 -69646 31669 -400602 46990 -111130 -536574 -202714 -11908 -65566
19116 -65566 -16147 102173 8187 56505 -259822 -81204 6540 -60354 66183 -85779 -109344 48276
19103 -186789 -380010 80739 -30288 -302624 -61182 -301867 222222 -96869 -288940 -132617
19092 -26880 -109124 108743 -130722 -5256 151901 -113969 137434 -226094 -139602 -143175 5353
19080 160583 -413902 154497 41460 -867 293715 -166370 21526 -169896 57277 -247991 -163336
$$ packed form
19161a91954I059d32728F8841M0184c53219J59134B5981h1787A75671g7755c2295
19149a86876D63347E5306a72432N2673j1936l30213I7178b92656G9291a57014
19138c04372O3012b502m9785A80525a39368n1269a7597k1798K992k48086Q7700
19127a96789N7684O5883L576C1669d00602D6990a11130m25444b02714a1908n3658
19116f5566a6147A02173H187M8318b59822h1204F540f0354F6183h5779k3565D8276
19103a86789j93221H0739c0288k72336f1182k40685B22222i6869j92071a32617
19092b6880q2244A08743a30722e256A51901a13969A37434b26094Q6492l573E353
19080A60583d13902A54497D1460h67B93715a66370B1526a69896E7277b47991Q4655
$$ plain form
19069 -163336 -204447 -77407 -157874 -37602 -217106 -133673 65191 -296872 -132093 90800 -230025
19057 -251454 -55128 162469 -43784 69122 61180 201741 -134850 -49975 -114927 -138533 14315
19045 -307299 20344 79848 -310635 -430725 -35586 129328 106070 -303466 106865 -213314
19034 46296 202186 -75034 139803 -5603 -69323 -293334 322472 -94863 11493 -24146 -133919
19023 -133919 131501 302953 193694 228146 -261174 128061 32071 172405 -11390 -150100
19013 -150100 216335 129130 -91258 36662 -231860 70667 -272878 139936 -84185 -185292
19003 -185292 -334889 -129613 103231 -56148 69914 -261398 -24496 -23357 -75088 361072 61699
18991 -204960 -290757 192829 231975 372721 -181134 19728 -43880 239090 89953 -387324
$$ packed form
19069a63336m1111g7407q0467c7602j79504Q3433F5191b96872a32093I0800b30025
19057b51454e5128A62469d3784F9122p942J40561a34850d9975o4952k3606A4315
19045c07299B0344N9504c10635j20090c5586A29328k3258c03466A06865b13314
19034D6296J55890g5034A39803e603o3720k24011C22472i4863A1493b4146j09773
19023a33919A31501J71452j09259L4452b61174A28061C2071J40334a1390j38710
19013a50100B16335q7205i1258C6662b31860G0667b72878A39936h4185j01107
19003a85292j49597a29613A03231e6148F9914b61398b4496J139n1731C61072F1699
18991b04960q5797A92829L9146J40746a81134A9728d3880B39090H9953c87324
$$ plain form
18980 39247 -146823 -382623 -165258 -214487 -175548 109936 -41892 -117855 58062 234969 -98615
18968 121065 -166205 -32236 84286 -337178 -501287 569 51569 21781 -387050 -269684 -35813
18956 46237 -20193 -105213 -56769 -388337 -29980 59288 175991 -190730 -92242 -250106 -9900
18944 -230532 210926 -20159 -79247 277107 46086 169258 22934 157011 83104 297174
18934 297174 7040 -46678 -140427 117494 -54710 192459 -342031 -17263 62751 -85248 30893
18922 37972 -67897 -129127 -228687 135330 100997 195876 43090 -125943 -136519 117171 -98448
18910 68462 -225194 -204695 261542 -195634 -19513 96852 115363 -22352 -350975 20771 218289
18899 218289 151941 65437 -114845 20211 330926 -570923 -189563 -359541 32098 136151
$$ packed form
18980C9247a46823k35800a65258m9229L8939A09936d1892p5963E8062J76907i8615
18968A21065a66205c2236H4286c37178j64109E69N1000B1781c87050J17366c5813
18956D6237b0193q5020M8444l31568b9980E9288J16703a90730i2242j57864i900
18944b30532B10926b0159n9088B77107D6086J23172B2934J34077p3907K14070
18934B97174G040d6678r3749A17494e4710A92459c42031a7263F2751h5248C0893
18922C7972f7897o1230r9560A35330l4333R4879D3090a25943j0576A17171i8448
18910F8462b25194K0499B61542a95634a9513I6852J8511b2352l28623B0771J97518
18899B18289o6348F5437a14845B0211L10715e70923a89563j69978C2098J04053
$$ plain form
18889 136151 309397 -179632 -137455 40474 -163531 -144824 182996 139654 3852 -311914 -54083
18877 98033 87205 -244366 -164195 149097 124517 39736 -185642 -71179 -77946 -39953 142625
18865 -295479 198423 -48668 378541 -61970 -25885 -18039 92597 73442 -84411 -397504 -150054
18853 56142 -246996 61843 -219086 -8576 -187964 6143 -157369 106202 -79390 7009 40736
18842 40736 -136133 -275060 181306 -172408 -423003 60295 172784 -77104 221524 -81342
18831 -247938 -200287 -238025 -554283 -129831 -119005 -132895 -96300 62993 -369947 32770 148466
18820 148466 44045 -403927 -36654 -205614 6295 -29274 93755 -60310 -364058 208007 171896
18809 171896 -158118 159802 -88 196969 -104410 127750 27416 100043 -238980 -378203 -114759
$$ packed form
18889A36151J73246a79632M2177D0474a63531J8707A82996m3342C852c11914e4083
18877I8033j0828b44366Q0171A49097k4580C9736a85642g1179o767L7993A42625
18865b95479A98423d8668C78541f1970b5885P846I2597j9155h4411l13093a50054
18853E6142b46996F1843b19086h576j79388F143a57369A06202g9390G009L3727
18842D0736a36133j38927A81306a72408k50595F0295J12489g7104B21524h1342
18831b47938M7651l7738l16258a29831J0826j3890L6595F2993c69947C2770J15696
18820A48466D4045d03927c6654j68960F295b9274I3755f0310l03748B08007l6111
18809A71896a58118A59802h8A96969a04410A27750B7416P2627b38980j39223a14759
$$ plain form
18797 181087 -182997 -105460 -193880 -240944 -170692 -146242 -75044 -362197 -101428 -177731 -345673
18786 -345673 124795 218900 -49021 -13352 35010 -116212 67308 -154805 234301 -228043
18775 -39900 -240872 50043 152315 -265588 261235 -146535 -157462 -98558 -146526 -109525 134874
18763 -49508 -214069 -171393 -6757 -114580 -406852 -255346 -358175 -202928 -6250 -280982 130078
18751 -141086 -61294 105554 -119693 48589 -6370 78283 83140 -171816 92007 -76992 -54605
18740 -54605 166500 -22914 79008 65983 4241 -382162 -206254 40379 -267825 -152775 -250962
18729 -250962 94785 -146886 -175728 -359565 -160156 -299687 -286596 126658 206202 214900 -8905
18717 269406 128843 156393 -171086 -265546 -268939 -123406 -31080 -36929 -152949 -140868 -248114
$$ packed form
18797A81087a82997P7537q8420m7064P0252K4450P1198k87153a01428p6303j67942
18786c45673A24795R4105d9021a3352C5010a16212F7308a54805B34301b28043
18775c9900k00972E0043J02272b65588B61235a46535j0927N8904m7968L7001A34874
18763d9508j64561M2676f757j07823k92272J51506j02829J55247f250k74732A30078
18751a41086f1294A05554a19693D8589f370G8283M857a71816I2007g6992K2387
18740e4605A66500b2914G9008j3025D241c82162J75908D0379b67825J15050r8187
18729b50962I4785a46886k8842j83837a60156j39531J3091A26658P9544Q698h905
18717B69406A28843K7550a71086r4460l393a23406c1080n849j16020J2081j07246
$$ plain form
18706 -248114 38109 -72097 -450463 16256 154453 -103076 147773 -123363 41186 -213564
18695 21352 103772 249740 -358127 -86191 -245551 -79414 -79242 -260210 145076 39844 100386
18684 100386 439409 -178592 105241 -164048 -214723 15953 88299 -34533 126665 -263390
18673 -170842 -438 -85248 55512 16857 151779 -137307 73476 -90855 98271 -192975 -176356
18662 -176356 277358 -462346 -481093 -230978 -14797 44507 -57350 16901 22865 -1555 -233100
18651 -233100 134308 -108692 -120587 10281 -136710 -349361 -166088 36284 -320306 251817
18640 -57709 -83592 -40396 -339749 -147569 -224923 649321 18783 -336976 -208331 -131072 -125716
18629 -125716 19344 288541 294797 -164580 -191406 -310592 -11427 109769 -417706 125510
$$ packed form
18706b48114C8109g2097l78366A6256J38197a03076A47773a23363D1186b13564
18695B1352Q2420J45968c58127h6191j59360g9414J72j80968A45076C9844O0542
18684A00386L39023a78592A05241a64048n0675A5953P2346c4533A26665b63390
18673a70842d38q4810E5512A6857J34922a37307G3476i0855I8271a92975J6619
18662a76356B77358d62346j8747b30978a4797D4507e7350A6901N964a555k31545
18651b33100A34308a08692j1895A0281a36710k12651a66088C6284c20306B51817
18640e7709k5883d0396k99353a47569p7354F49321A8783c36976J28645P7259N356
18629a25716A9344K69197O256a64580k6826j19186a1427A09769d17706A25510
$$ plain form
18618 -361526 -156453 46104 9385 17358 -27247 -113877 271010 71140 12631 -154990 118772
18606 126267 95608 -41308 219408 171109 32570 -303363 -110435 -317063 67922 287124
18596 287124 -227623 -35015 132075 -193156 114013 -380513 -373556 18615 -143575 -5099 -65174
18585 -65174 -149901 -59925 100444 -112038 -16683 67287 75832 -333585 96290 -471706 18151
18573 -383680 51401 106241 41332 -18933 96578 -182541 47251 -56406 -320656 -56654 49843
18561 150941 128533 -28475 -225226 14592 -297403 -101470 -303953 81527 30109 -231707
18550 78313 52150 146921 -233259 -185016 -336837 113146 140534 -40709 -132817 -285159 1499
18538 -379931 2695 176203 16038 55833 1333 -24327 -174954 196009 98382 59295 235332
$$ packed form
18618c61526a56453D6104I385P973b7247q6630B71010G1140A2631a54990A18772
18606A26267l0659d1308B19408m8299C2570c03363a10435k06628F7922K19202
18596B87124b27623c5015A32075a93156A14013c80513O957A8615a43575e099o0075
18585f5174q4727e9925A00444a12038a6683F7287Q545c33585I6290d71706A8151
18573c83680E1401N4840D1332a8933I6578a82541D7251e6406k64250e6654D9843
18561A50941k2408b8475j96751A4592b97403a01470k02483H1527C0109b31707
18550G8313k6163R4771b33259M8243j51821A13146K7388d0709r2108j52342A499
18538c79931B695J73508A6038L9795A333b4327j50627A96009r7627l9087J76037
$$ plain form
18527 235332 -154129 -121914 -391199 41890 -218140 -141523 9656 24193 -126968 -98673 -250547
18516 -250547 90373 -186197 -122085 -48820 -233026 15171 222596 -203341 -55964 -165163
18506 -165163 -122466 -235017 -66988 -44448 -200987 186016 -291047 27926 169116 -46087
18495 -288236 219274 -1874 -271656 -23821 -211047 182070 69045 -248075 -196488 -28438 -92498
18484 -92498 -196215 -104687 -126381 38168 -277779 177983 -79997 119258 -227060 -202641 37758
18472 67749 -189228 -130513 -135467 -84343 -17846 -15023 -129930 -257586 -211589 -188979 -63452
18460 -279560 61986 -166650 188860 284450 -16978 -154998 -421348 95355 -324803 -252318
18450 -252318 22295 -192056 -111149 16328 -23934 115003 -68412 79280 18399 -177346 -314718
$$ packed form
18527B35332a54129L2215k69285D1890b18140P6617I656J4537a26968K8295j51874
18516b50547I0373a86197O4112d8820j84206A5171K07425b03341e5964j09199
18506a65163M2697j12551f6988K2540j56539A86016b91047B7926J41190d6087
18495b88236B19274a874k69782b3821j87226A82070F9045b48075N1587b8438o4060
18484i2498j03717R1528k1694C8168b77779A77983g9997A19258b27060K4419C7758
18472F7749a89228N8715m954N1124a7846K823j14907j27656M5997K2610f3452
18460b79560F1986a66650A88860R5590a6978j38020k66350I5355c24803P2485
18450b52318B2295a92056Q0907A6328b3934A15003f8412G9280A8399a77346j37372
$$ plain form
18439 -314718 -253524 -174366 -74568 -160314 168925 270160 -164924 -100596 -93678 51217 9026
18427 -175285 -26537 -313530 155430 -65945 -205204 -15849 141565 -46549 103387 74872
18417 74872 58965 338508 39776 37000 -98014 91544 -58193 148103 265351 -140821 3637
18405 -39553 -75435 -91885 222414 3389 -148537 6868 167037 80685 -119934 -147919 150422
18393 128698 -195902 29418 233914 -215840 213171 -328174 228100 125710 -88306 -93907
18383 -93907 -2388 160690 -21815 227484 -45439 -10689 16554 -15655 320154 -123480 117927
18371 -138235 177784 9071 -121237 -112678 42513 -111016 93798 -33439 29698 -251899 -77734
18359 78865 -358493 -171767 -110610 67906 302817 -320471 65412 43274 131098 -98943 -48655
$$ packed form
18439c14718O1194P9158g4568q5746A68925J01235a64924O4328O918E1217I026
18427a75285b6537k86993A55430f5945j39259a5849A41565d6549A03387k8515
18417G4872j5907K79543C9776k776i8014I1544e8193A48103J17248a40821C637
18405c9553l5882j6450B22414C389a48537F868J60169H0685a19934k7985A50422
18393A28698a95902B9418K04496b15840B13171c28174B28100j02390h8306n601
18383i3907b388A60690b1815B27484d5439a0689A6554a5655C20154a23480A17927
18371a38235A77784I071a21237Q559D2513a11016I3798c3439B9698b51899g7734
18359G8865c58493a71767O1157F7906K34911c20471F5412k2138Q7824i8943d8655
$$ plain form
18347 -69258 -123162 -150865 -204476 15442 -9737 -168705 -350169 111038 319246 413723 71234
18335 265313 -90998 -149854 -201953 -12610 104320 -187235 -364725 36467 -218681 10178 374861
18324 374861 -186324 -230216 -52559 -79368 -57610 -118140 -143855 105741 -249039 -10405 104833
18312 -209815 -34660 -143718 -301570 153196 -147875 -27282 -122447 -243302 -77677 184936
18301 -218171 207591 -246497 -196518 -41502 -268940 -94849 -3922 -376724 -43198 -46114 -127274
18290 -127274 -263372 140324 252149 43054 -28636 68794 28351 147293 -16657 -244435
18280 -244435 -132702 -112237 -295951 -18941 77126 119853 -316300 59752 61350 -237325 104840
18268 26842 19729 60811 -228618 167678 4860 184438 -254005 -231130 -169543 -384828 -610
$$ packed form
18347f9258n3904k7703n3611A5442i737j58968j81464A11038K08208R4477G1234
18335B65313i0998n8856n2099a2610A04320a87235j77490C6467b18681A0178L64683
18324C74861a86324m3892e2559k6809K1758o0530k5715A05741b49039a0405A04833
18312b09815c4660j09058j57852A53196a47875b7282r5165j20855g7677A84936
18301b18171B07591b46497M9979d1502k27438i4849c922l72802d3198k916q1160
18290a27274j36098A40324J11825D3054b8636F8794B8351J18942a6657k27778
18280b44435J11733K0465j83714a8941G7126M2727c16300E9752J598b37325A04840
18268B6842p113M1082b28618A67678D860J79578b54005K2875O1587k15285f10
$$ plain form
18256 -168596 32759 -68758 -279422 53889 28044 6056 -7355 -240040 -132660 -95993 254450
18244 -199622 22353 225187 -51752 26804 36098 133302 -96527 223806 -67533 -143185 59168
18232 132945 274237 282675 -72754 -243559 75619 181055 -375312 10764 -124239 161807
18221 120508 -60431 94769 -33007 477688 85738 -43645 -192066 -196645 219966 -335282 -373456
18210 -373456 34660 -25307 -187803 -80923 69097 -203574 -144398 -61341 -272262 -306408 -38318
18198 -368377 -27421 -122863 -3654 12652 -42728 164675 -91948 263706 -85155 -99846 -85047
18187 -85047 83934 -26581 362618 -48954 -107605 -147853 12181 202380 33992 -209928 -212592
18176 -212592 -144009 -51311 243200 -156642 -218081 133448 282552 -150214 152617 32284
$$ packed form
18256a68596C2759f8758k10664E3889k5845F056g355k32685J07380L6667B54450
18244a99622B2353K02834e1752B6804R294R7204i6527B23806f7533p5652E9168
18232A32945J41292Q438g2754j70805G5619J05436c75312A0764a24239A61807
18221A20508f0431I4769c3007D77688H5738d3645j48421m579B19966c35282l8174
18210c73456C4660b5307j62496h0923F9097b03574N9176f1341k10921l4146c8318
18198c68377b7421r5442c654A2652d2728A64675i1948B63706h5155j4691J4799
18187h5047H3934b6581C62618d8954n8651m0248A2181J90199C3992b09928k664
18176b12592O8583e1311B43200a56642o1439A33448J49104a50214A52617C2284
$$ plain form
18165 -63976 -301540 -57274 -321935 -181823 -298125 177351 -172709 -157973 -402002 -199992
18154 -170105 30043 -325723 112560 166257 -40730 134086 -81327 21737 -8857 311190 -2562
18142 148807 294069 97458 394099 260211 -154072 -32995 87910 -218317 -24234 407256
18131 -15032 -29551 -204936 -74707 -95861 5070 72683 -77711 49681 -110072 -459827 -7426
18119 -436726 -399190 -437531 -165840 -463818 -82175 44160 -54506 -284609 5046 -254070 -2898
18107 -162879 -144493 -291834 84376 -163962 -164665 182288 -307010 -314158 214376 -60042 86601
18095 -101264 -1029 -58146 -230614 -197091 -88974 -35222 220843 34205 -71536 -169356 -116554
18084 -116554 -52378 261922 54528 -396159 23658 -65718 -254336 -233102 4152 -137017 -117719
$$ packed form
18165f3976k37564e7274k64661J40112j16302A77351a72709J4736k44029a99992
18154a70105C0043c25723A12560N3697d0730A34086h1327B1737h857C11190b562
18142A48807J45262I7458K96641j33888a54072c2995H7910b18317b4234D07256
18131a5032j4519j75385g4707k1154E070O7613g7711D9681a10072l49755g426
18119d36726L7536l8341a65840k97978h2175D4160e4506k30103E046b54070b898
18107a62879J8386j47341H4376a63962p03A82288c07010p148B14376f0042H6601
18095a01264a029n7117j72468L3523h8974c5222B20843C4205g1536r7820N2802
18084a16554e2378B61922E4528c96159B3658f5718j88618K1234D152a37017J9298
$$ plain form
18073 -117719 -217598 -319063 185663 -160152 225462 -106896 -101181 -342406 289737 59694
18062 217520 158988 230406 200381 -52201 47690 188494 74324 177710 65154 -128015 12241
18050 -177688 -144933 130385 -85392 -265442 -133815 -182890 -135707 -166390 -3763 -143886 -64765
18038 143304 5468 -94447 183216 55766 -116337 89710 25810 -289445 -68321 -188318 85313
18026 28116 -36802 37245 376458 151544 -57072 -48939 134740 106633 -115371 347469 -110554
18014 -416508 92890 101011 -24909 137731 84042 -212836 187819 -91531 -78435 -128020 -35857
18002 -146573 167939 -83457 -239185 -41545 -52841 -189503 -35646 63130 -58438 69150 -140526
17990 -230080 1533 123439 7012 109771 88476 76030 -178888 -306321 -327224 -131484 85186
$$ packed form
18073a17719r9879j01465A85663a60152B25462a06896N715k41225B89737E9694
18062B17520n8532P1418l0025e2201D7690J40804G4324J03386F5154a28015A2241
18050a77688L2755A30385h5392j80050J31627m9075M7183l0683c763j40123f4765
18038A43304E468i4447A83216E5766a16337H9710B5810b89445f8321j19997H5313
18026B8116c6802C7245L39213A51544e7072Q133A34740k8107a15371C47469a10554
18014d16508I2890Q121b4909A37731n3689b12836A87819i1531J3096m9585c5857
18002a46573A67939h3457j55728d1545j1296j36662c5646F3130e8438F9150a40526
17990b30080A533J21906G012J02759k1295j2446a78888j27433k0903a31484H5186
$$ plain form
17978 236942 -81527 -220782 -12832 -170059 -60048 -92965 98297 -84222 -83937 135919 -217281
17966 -153980 -6503 -4284 3373 -128908 -302891 -147288 -120340 -443908 133931 111438 -155033
17954 -370607 450507 257685 -129017 -73630 2906 -128995 -148081 -79477 -52879 88705 14447
17942 -340409 55897 124587 -148551 -53219 38162 -101078 -420276 79822 -289698 39410 -106159
17930 -21457 9117 -29101 -68921 135577 -97544 -32345 -86157 -163012 -316987 430118 236600
17919 236600 47406 -70457 22104 52443 37863 -134033 -114279 -218743 24109 225093 -212457
17907 89831 2603 228117 -171380 -120015 -324963 14438 6011 -121395 -62871 -132525 29514
17895 27616 -152861 32137 -422208 -46825 318768 -47136 18732 291714 -63713 224834 -138833
$$ packed form
17978B36942h1527j39255a2832j57227f0048l2917I8297h4222K85A35919b17281
17966a53980f503K219C373a28908j73983a47288K6948l23568A33931k2493a55033
17954c70607D50507j92822a29017N5387B906a28995j9086O8604K6598H8705A4447
17942c40409E5897O8690a48551e3219C8162a01078l19198G9822b89698C9410a06159
17930b1457I117b9101l9820A35577i7544c2345n3812p6855j53975D30118j93518
17919B36600D7406g0457B2104L0339j4580a34033J9754j04464B4109K00984b12457
17907H9831B603K25514a71380N1365k04948A4438F011a21395N8524o9654B9514
17895B7616a52861C2137d22208d6825C18768d7136A8732K72982f3713B24834a38833
$$ plain form
17883 74906 -56235 -317773 124841 -14637 137258 -25642 -32551 -89292 -60986 -23508 161563
17871 5683 161162 77204 321534 -201639 110141 -52371 132570 -188300 -318586 59442
17860 -101463 -206549 291373 -49699 215699 248181 -134216 -38440 -122207 -76272 -312727
17850 -312727 304316 -17457 -239155 169891 -235980 -177979 -24698 -13793 -210943 32108
17839 -44004 -14872 -121723 69134 -54921 91913 292429 91862 278060 -51332 -166772 -303060
17828 -303060 228672 -27008 122483 -13904 289383 44319 174997 -44002 -253745 -140966
17818 -140966 -35880 -59506 181223 288882 -195182 157847 60605 100154 -218506 431445
17807 9062 -93218 -387774 71589 -223485 -18233 -128218 -163626 66923 -26340 156083 -162495
$$ packed form
17883G4906e6235k61538A24841a4637A37258b5642o909n6741K8306b3508A61563
17871E683J55479G7204K44330b01639A10141e2371A32570a88300j30286E9442
17860a01463j05086B91373d9699B15699L2482a34216c8440q3767M5935k36455
17850c12727C04316a7457k21698A69891b35980N8001b4698J0905j97150C2108
17839d4004a4872j06851F9134e4921I1913K00516I1862J86198e1332j15440j36288
17828c03060B28672b7008A22483a3904B89383D4319J30678d4002k09743J12779
17818a40966c5880k3626A81223J07659a95182A57847F0605L9549b18506D31445
17807I062i3218k94556G1589b23485a8233j09985l5408F6923b6340A56083a62495
$$ plain form
17795 -192993 -54654 -176550 216400 -61819 -14024 93473 -169036 -201468 27067 37768 147596
17784 147596 -199753 -51028 129596 188417 -28695 -208400 19812 -74479 45922 37289 241792
17773 241792 -97747 157818 -213481 -183689 266717 -395536 144317 -181026 -172737 -61174
17762 167305 -124783 -9509 100622 40067 -183356 172307 187766 -132872 265321 168476
17752 168476 -378880 323944 159041 -20925 51864 28594 -80218 48620 26380 71239 485399
17741 485399 -96413 52045 -116298 -233487 58491 61837 -189793 -13535 372624 211352 51509
17729 -38590 -39601 -441152 -61053 -174203 38619 223813 -86911 -83478 -93191 -250676 61943
17717 -20420 8688 59925 -257627 -187339 -95193 36765 -88385 111232 -174374 65251 -143008
$$ packed form
17795a92993e4654j21896B16400f1819a4024I3473a69036l2432B7067J0701J09828
17784A47596a99753e1028A29596N8821b8695j79705A9812g4479D5922q633K04503
17773B41792i7747A57818b13481K9792B66717c95536A44317a81026Q289f1174
17762A67305a24783i509A00622D0067a83356A72307J5459a32872B65321r6845
17752A68476c78880C23944A59041b0925E1864k3270h0218D8620k2240M4859M14160
17741D85399i6413E2045a16298j17189E8491L346a89793a3535C72624j61272E1509
17729c8590j011m01551f1053j13150C8619J85194h6911L433r713j57485F1943
17717b0420H688N1237b57627P0288R2146C6765h8385A11232a74374F5251a43008
$$ plain form
17705 204838 200504 -83133 -65963 -91044 385521 -14913 69311 84840 1895 11753 371766 -62527
17692 -35849 312839 12442 253206 -138375 135411 -125270 -33556 -95787 -298032 2851 99862
17681 99862 80216 219080 -104954 140676 24234 135470 224324 76029 68175 180871 138985
17670 138985 -123772 -73342 -104368 61965 -65229 119633 261376 -150640 343448 -230854
17659 67420 72286 -93670 -227249 188311 136857 17327 188331 117093 155913 176529 84978
17647 -3596 176957 119154 90059 -140394 -33563 13907 -116057 -429625 161659 -55547 6428
17635 -114811 259189 161510 -59954 -63247 127396 -134773 -312467 -57066 15370 110315 -85295
17623 407172 135788 -244052 302871 -264883 112319 62681 -180720 278582 133298 -103969
$$ packed form
17705B04838m334h3133J7170k5081C85521a4913F9311J5529A895R858L60013f2527
17692c5849C12839A2442K40764a38375A35411a25270c3556o2231k02245B851R7011
17681I9862j9646J38864a04954A40676B4234J11236Q8854G6029p854J12696m1886
17670A38985a23772N0430l1026F1965f5229A19633J41743a50640C43448b30854
17659F7420M866i3670j33579A88311n1454A7327J71004p1238L8820K0616H4978
17647c596A76957n7803k9095a40394c3563A3907a16057l13568A61659e5547F428
17635a14811B59189r7679e9954l293A27396a34773j77694e7066A5370R4945h5295
17623D07172A35788b44052C02871b64883A12319m9638a80720B78582A33298a03969
$$ plain form
17612 -49366 64152 -40096 73541 -345926 -302238 -80953 48985 123329 18447 -47229 -344233
17601 -344233 19693 4643 -40181 -19187 23308 -240361 120047 96983 203142 137460 61065
17589 115838 70084 -66460 -229204 203350 -144842 33422 -251235 230887 95416 84760
17579 84760 -574 348162 459000 35719 -158395 -142250 399423 76355 167688 41068 -195327
17567 100582 -593781 98440 -244031 -56953 307243 106703 196449 -71272 376785 89495
17556 231810 47559 -155771 117529 93214 436688 219803 201993 247263 244170 -58793 153442
17544 160320 -119577 226177 156835 210935 202068 -3952 -124177 45123 -123423 116087 6288
17532 8192 -96325 126689 185908 148281 60164 34362 25359 379514 263949 -43689 512151
$$ packed form
17612d9366F4152d0096G3541c45926M3688h0953D8985P4344A8447d7229k97004
17601c44233A9693D643d0181a9187B3308b40361A20047k3064J06159o5682F1065
17589A15838m5754f6460j62744B03350a44842C3422b51235B30887I5416j0656
17579H4760e74C48162J10838C5719a58395J6145C99423G6355R1333D1068a95327
17567A00582e93781I8440b44031e6953C07243A06703Q9746g1272C76785H9495
17556B31810D7559a55771A17529k4315L43474k16885j7810M5270l093e8793A53442
17544A60320a19577B26177o9342N4100q867c952j20225D5123a23423A16087F288
17532H192i6325A26689N9219l7627F0164k5802r003L54155j15565d3689E12151
$$ plain form
17520 185031 17559 -326805 165478 230413 51059 209378 116765 74942 -491154 -210685
17509 -314425 376663 85317 -93080 321360 154918 91163 332293 435536 -125215 178197
17498 276284 462710 -30607 299387 195825 -219555 89468 63382 100268 -78227 -97280 282597
17486 46618 -28917 334448 58913 -345471 -6693 24237 -16987 136487 285922 -9576 125104
17474 -11454 110615 165413 244703 250170 190198 -150003 41333 -84550 -95014 494478 23751
17462 387128 229959 73827 74306 150350 112918 441358 178779 -146623 85327 73139 81438
17451 81438 368804 418728 -77305 24354 233316 507526 276482 436276 116683 477441
17441 477441 399868 524118 212152 271063 154287 335969 248055 407815 324669 181200
$$ packed form
17520A85031A7559c26805A65478O4935E1059J58319r2613m1823d91154b10685
17509c14425C76663H5317i3080C21360A54918o3755K41130J03243a25215A78197
17498B76284J86426c0607B99387j03562b19555H9468k6086L6886g8227j9053B82597
17486D6618b8917C34448E8913c45471f693B4237a6987A36487J49435i576A25104
17474a1454A10615N4798P9290N467n9972a50003D1333h4550j0464D94478B3751
17462C87128j57169G3827M79P6044l7432L28440A78779a46623H5327j2188Q299
17451H1438K87366M9924g7305B4354K08962K74210k31044J59794A16683L60758
17441D77441p7573J24250B12152N8911j16776J81682q7914J59760q3146j43469
$$ plain form
17431 181200 317032 529423 -93749 176385 173970 88688 263553 185129 223925 412107 41406
17419 -11242 169052 240307 -8896 272451 436402 132912 240912 19098 29804 244265 402242
17408 402242 382572 382063 462062 76918 -60498 200704 316557 428075 207842 165276 411137
17397 411137 -15745 275268 -195286 292901 294199 239028 921626 117247 103463 -103686
17386 385235 622765 227469 40999 173641 -86952 -29360 167059 -237454 213249 142463
17376 142463 142488 109957 159732 193640 139391 271759 -29596 332161 179790 307036 -150929
17364 528079 29459 399381 141635 -66169 3026 -336000 144964 34043 67418 302487 29160
17352 -213244 88881 132380 519815 195242 -305532 -500526 38127 -234263 424335 222076
$$ packed form
17431A81200J35832K12391i3749A76385k415q5282J74865p8424L8796J88182D1406
17419a1242A69052P1255h896B72451J63951A32912J08000A9098J0706K14461J57977
17408D02242j9670n09P9999G6918f0498B00704J15853J11518B07842m2566K45861
17397D11137a5745B75268a95286B92901J298n5171O82598A17247j3784a03686
17386C85235K37530B27469D0999J32642h6952b9360A67059b37454B13249p0786
17376A42463K5l2531M9775L3908n4249J32368b9596C32161j52371J27246a50929
17364E28079B9459L69922A41635f6169C026c36000A44964C4043L3375K35069B9160
17352b13244H8881M3499L87435A95242c05532j94994C8127b34263D24335k02259
$$ plain form
17342 222076 242026 216934 38929 327174 110773 128886 298787 -118353 476569 41591
17331 -38366 120005 122556 -88371 69144 403366 7917 243327 34598 257774 279545 -91748
17319 285116 -12162 -180734 253491 69948 139618 -17107 404696 -13579 347020 -147449
17308 -93954 41459 33111 219294 266568 144612 129275 270046 251849 -90618 273043 181437
17297 181437 120368 168829 387399 -29449 278105 304580 83230 576221 311705 -332789
17286 365934 -134014 56172 -93314 267413 174364 149957 68747 71834 200769 180956 209224
17275 209224 210687 298710 -217610 91090 -151562 156934 449029 447591 12241 65504 50911
17264 50911 470905 182390 -65998 -176631 479362 183186 362906 248388 161519 129691
$$ packed form
17342B22076J9950k5092C8929K88245A10773J8113J69901a18353D76569D1591
17331c8366A20005K551h8371F9144L34222G917K35410C4598K23176K1771i1748
17319B85116a2162j68572B53491F9948O9670a7107D04696a3579C47020a47449
17308i3954D1459q348J86183M7274j21956j5337J40771j8197i0618B73043r1606
17297A81437o1069M8461K18570b9449B78105K6475H3230M92991k64516c32789
17286C65934a34014E6172i3314B67413r3049k4407F8747L087J28935j9813K8268
17275B09224J463Q8023b17610I1090a51562A56934K92095j438A2241N3263j4593
17264E0911M19994A82390f5998j10633D79362A83186J79720j14518q6869l1828
$$ plain form
17254 129691 41668 217080 341097 158235 404232 185039 401023 189023 136716 250865
17244 250865 -366 337393 450488 185388 308776 -22232 -64731 10267 145090 430927 314201
17233 314201 87562 261798 374034 338837 408059 141210 349309 234931 26077 168141
17223 168141 -86289 60130 86961 216482 390488 398982 114340 55513 325672 385393 63226
17211 304692 84468 623159 264059 335876 599214 124676 163788 104392 205656 550800
17201 550800 475112 169217 277901 347008 110353 390696 278442 470012 133576 190152
17191 190152 2325 662161 175399 158505 546871 252065 442157 208387 222049 73020
17180 356045 313521 220118 189545 400409 58669 102656 325384 329682 216432 289586 528127
$$ packed form
17254A29691D1668J75412J24017A58235K45997A85039K15984A89023n2307J14149
17244B50865c66C37393J13095A85388J23388b2232m2499A0267J34823K85837j16726
17233C14201H7562J74236J12236l5197O9222A41210K08099j14378B6077J42064
17223A68141h6289F0130K6831J29521J74006Q494A14340E5513K70159N9721F3226
17211C04692H4468N38691B64059P1817K63338A24676L9112n9396J01264L45144
17201E50800p5688A69217J08684O9107A10353K80343j12254J91570A33576N6576
17191A90152B325O59836A75399j6894L88366B52065J90092B08387J3662G3020
17180C56045m2524r3403l0573K10864E8669M3987K22728M298j13250P3154K38541
$$ plain form
17169 528127 115499 18797 329864 420845 177009 314998 431649 319491 172136 192685
17159 192685 472055 370738 445947 130373 270849 508099 510010 288490 185096 39721
17148 384885 343253 319096 381155 592832 713116 23578 447910 159995 357480 174862
17137 246928 300343 840228 171250 198727 491252 128842 316647 289574 346826 167609
17126 276347 195731 259760 508033 488019 222705 -22633 340731 368073 139253 236941 73497
17114 238400 644750 488142 386695 270901 406490 340701 420077 342193 667133 539634
17104 539634 538991 567738 227681 114588 371336 142667 355602 548807 431377 571154
17094 571154 502416 207474 686263 243999 415254 440106 404985 548176 280065 265785
$$ packed form
17169E28127A15499A8797L11067R0981A77009J37989J16651j12158j47355K0549
17159A92685K79370j01317P5209A30373J40476K37250J911k21520j03394C9721
17148C84885m1632k4157O2059K11677J20284B3578M24332A59995J97485A74862
17137B46928N3415N39885A71250K7477K92525A28842J87805k7073N7252A67609
17126B76347q0616O4029K48273k0014B22705b2633C40731K7342A39253R7688G3497
17114B38400M06350j56608j01447j15794J35589o5789P9376p7884L24940j27499
17104E39634o43K8747B27681j13093K56748A42667K12935J93205j17430J39777
17094E71154o8738B07474M78789B43999J71255K4852l5121J43191k68111j4280
$$ plain form
17084 265785 -179949 476714 438660 470715 783361 463514 694687 778125 541717 701606
17074 701606 511105 615094 433779 504163 871731 520397 541884 455093 712062 503205
17064 503205 464457 572084 685470 589641 482694 480398 521985 834624 693577 596145 860798
17053 860798 586465 713104 483621 576218 765741 336053 917326 653717 520662 461116
17043 461116 556278 634086 824802 256088 605246 782222 355743 442304 508613 287612
17033 287612 828019 494175 753217 617056 656646 676344 876547 542742 654290 811177
17023 811177 678413 556858 1030503 944350 742452 845821 343211 476791 464989 780287
17013 780287 656377 540684 815973 387931 568166 692247 657270 750436 411929 555796
$$ packed form
17084B65785a79949D76714l8054L2055L12646l19847K31173Q3438k36408J59889
17074G01606j90501J03989j81315P0384L67568l51334K1487q6791K56969k08857
17064E03205l8748J07627J13386r5829j06947k296M1587L12639j41047r7432K64653
17053H60798k74333J26639k29483R2597J89523C36053N81273k63609j33055n9546
17043D61116R5162P7808J90716B56088L49158J76976C55743Q6561O6309k21001
17033B87612N40407l33844K59042j36161L9590J9698K00203l33805J11548J56887
17023H11177j32764j21555M73645q6153k01898J03369C43211J33580j1802L15298
17013G80287j23910j15693K75289C87931J80235J24081l4977R3166l38507J43867
$$ plain form
17003 555796 871650 402955 842759 692598 856258 647564 885254 721290 772483 901636
16993 901636 869588 905786 570481 808440 1024896 727100 906253 790096 892097 766298
16983 766298 992074 651059 1173517 785871 816004 956302 1065251 1176181 1221993 912299
16973 912299 607667 1027729 879024 775571 1115984 984906 1283429 1093723 1209419 765926
16963 765926 854649 1414327 1059709 1009660 1118851 1183739 947839 1452790 1085519 1148949
16953 1148949 1052039 1107222 1104100 1166615 1202371 1252307 1090749 1266653 1073025 1120025 1273264
16942 1273264 1108478 1240111 1097451 915105 1383166 1223188 1388071 1286051 1336382 992862
16932 992862 1421576 1444251 1342500 1278654 1456413 1618805 1492563 1525940 1558395 1219634
$$ packed form
17003E55796L15854D02955M39804j50161J63660k08694K37690j63964N1193J29153
16993I01636l2048L6198l35305K37959K16456k97796J79153j16157J02001j25799
16983G66298K25776l41015N22458l87646L0133J40298J08949J10930M5812l09694
16973I12299l04632M20062j48705j03453L40413j31078K98523j89706J15696m43493
16963G65926Q8723N59678l54618n0049J09191O4888k35900N04951l67271O3430
16953A148949r6910N5183l122O2515L5756M9936j61558J75904j93628M7000J53239
16942A273264j64786J31633j42660j82346M68061j59978J64883j02020N0331l43520
16932I92862M28714K2675j01751o3846J77759J62392j26242L3377L2455l38761
$$ plain form
16922 1219634 1285956 1564409 1721413 1451582 1402886 1714902 1284390 1852523 1682157 1626921
16912 1626921 1579066 1820274 1837420 1667514 1522449 1513199 2001103 1653805 1670940 1870673
16902 1870673 1488372 1848942 1825345 1576890 1919347 2010450 1620554 2170351 2133814 1976800
16892 1976800 2043990 2111300 1850219 2026809 2309671 2291295 1952958 2317167 2186866 2445435
16882 2445435 2153064 2679044 2473394 2551270 2467918 2387614 2569030 2903725 2862075 2487247
16872 2487247 2909197 2666739 2590222 2554012 2857155 2902681 2848968 3094362 3271297 3102251
16862 3102251 3080134 3251223 3241535 2801437 2800190 3183252 3205367 3483882 3302425 3609676
16852 3609676 3306584 3319474 3963082 3899687 3536375 3557082 3756344 3875942 3962897 4098897
$$ packed form
16922A219634O6322K78453J57004k69831m8696L12016m30512N68133j70366n5236
16912A626921m7855K41208J7146j69906j45065r250M87904l47298J7135J99733
16902A870673l82301L60570k3597k48455L42457R1103l89896N49797l6537j57014
16892A976800O7190O7310k61081J76590K82862j8376l38337L64209j30301K58569
16882B445435k92371N25980k05650P7876q3352q0304J81416L34695m1650l74828
16872B487247M21950k42458p6517l6210L03143M5526n3713K45394J76935j69046
16862C102251k2117J71089r688m40098j247L83062K2115K78515j81457L07251
16852C609676l03092J2890O43608o3395l63312K0707J99262J19598Q6955J36000
$$ plain form
16842 4098897 3808428 4500389 4232175 4197182 4116447 4321606 4545833 4805412 4328530 4730503
16832 4730503 4647258 5019688 4873728 4852784 5038126 5209929 5092494 5339319 5231863 5340934
16822 5340934 5368600 5714908 5752979 5906682 6015698 5982010 6095620 6419317 6742376 6321281
16812 6321281 6826071 6843112 7401663 7146271 7358721 7577354 8001378 7817255 8092320 8291725
16802 8291725 8512495 8839919 8922433 8990943 8881552 9390119 9360561 9730777 10285434 10303537
16792 10303537 10830619 10999443 10950949 11386121 12018427 12472197 12611881 13052153 13530377
16783 13530377 13492967 14113494 14441348 14851739 15573018 15899037 16211882 17182798 17280863 17855661
16773 17855661 18764939 19681888 19866496 20706514 21123513 21951441 22906256 23787830 24425619
$$ packed form
16842D098897k90469O91961k68214l4993q0735K05159K24227K59579m76882M01973
16832D730503q3245L72430j45960k0944J85342J71803j17435K46825j07456J09071
16822E340934K7666L46308L8071J53703J09016l3688J13610L23697L23059m21095
16812F321281N04790J7041N58551k55392K12450K18633M24024j84123K75065J99405
16802H291725K20770L27424Q2514O8510j09391N08567k9558L70216N54657J8103
16792A0303537N27082J68824m8494M35172O32306M53770J39684M40272M78224
16783A3530377l7410O20527L27854M10391P21279L26019L12845R70916R8065N74798
16773A7855661R09278R16949J84608Q40018M16999Q27928R54815Q81574O37789
$$ plain form
16764 24425619 25578837 26521982 27447438 28777170 29867146 30866281 32190617 33545041
16756 33545041 34936581 36912989 38420849 40294684 41903972 43629571 45929737 48363569
16748 48363569 50777127 53068731 55901817 58908647 62101808 65391729 68850883 72400729
16740 72400729 76568282 80751995 85193638 90408544 95377494 100377026 105983882 112196449
16732 112196449 118217940 124778406 130797516 137191552 143763890 150064597 156510054 162571301
16724 162571301 168098925 172913642 176867243 180485316 182778054 184052667 184191799 183389051
16716 183389051 181824025 179235858 175229384 170735517 165780505 159932870 153946401 147478173
16708 147478173 141006313 134424082 127646712 121433493 114987735 108706794 103175354 97578194
$$ packed form
16764B4425619J153218R43145R25456J329732J089976R99135J324336J354424
16756C3545041J391540J976408J507860J873835J609288J725599K300166K433832
16748D8363569K413558K291604K833086L006830L193161L289921L459154L549846
16740G2400729M167553M183713M441643N214906M968950M999532N606856O212567
16732A12196449O021491O560466O019110O394036O572338O300707O445457O061247
16724A62571301N527624M814717L953601L618073K292738J274613J39132q02748
16716A83389051j565026k588167m006474m493867m955012n847635n986469o468228
16708A47478173o471860o582231o777370o213219o445758o280941n531440n597160
$$ plain form
16700 97578194 91662399 86907827 82267616 77921045 73615779 69483536 66080881 62364187
16692 62364187 58870052 56276649 53168668 50634927 48213853 45790673 43278390 41622268
16684 41622268 39609756 38001589 36037037 34789894 33082492 31576869 30328976 28695470
16676 28695470 27661896 26693749 25732617 24413441 23858851 23213614 22201816 21488246 20220137
16667 20220137 19860690 19247296 18386827 18074247 17272481 16585713 16077615 15465613 15043106
16658 15043106 14551928 13990660 13836956 13181019 12854511 12544941 12365733 12108442 11645059
16649 11645059 11262748 10898664 10572936 10429611 10167523 9649551 9563562 9643738 9161089 8856059
16639 8856059 8590228 8249188 7966920 8068311 7803059 7597085 7279725 7334035 7018121 7296479
$$ packed form
16700I7578194n915795m754572m640211m346571m305266m132243l402655l716694
16692F2364187l494135k593403l107981k533741k421074k423180k512283j656122
16684D1622268k012512j608167j964552j247143j707402j505623j247893j633506
16676B8695470j033574r68147r61132j319176n54590o45237j011798p13570j268109
16667B0220137l59447o13394q60469l12580q01766o86768n08098o12002m22507
16658A5043106m91178n61268j53704o55937l26508l09570j79208k57291m63383
16649A1645059l82311l64084l25728j43325k62088n17972q5989Q0176m82649l05030
16639H856059k65831l41040k82268J01391k65252k05974l17360N4310l15914K78358
$$ plain form
16629 7296479 6633166 6627002 6247790 6355955 6301741 6138012 6055208 6036118 5892768 5749647
16619 5749647 5927786 5346353 4976723 5053175 5399588 4805299 5088902 4901956 4770596 4748085
16609 4748085 4879479 4503654 4281197 4364446 4415184 4350652 3826366 3651013 3613765 3768952
16599 3768952 3954121 3835671 3672509 3708479 3651634 3505125 3238989 3286274 3370429 3214185
16589 3214185 3023996 3288345 3210752 3077533 3187735 3184846 2810434 2853351 2778336 2753451
16579 2753451 2884720 2611147 2531581 2445793 2571786 2227987 2417298 2571260 2493542 2390164
16569 2390164 2316420 2376157 2525803 2328707 2035626 1978784 2307190 2137166 1862458 2016018
16559 2016018 2159057 2077634 1985035 1966479 1727114 2055685 1877467 2010840 1933360 1700140
$$ packed form
16629G296479o63313o164l79212J08165n4214j63729q2804j9090j43350j43121
16619E749647J78139n81433l69630P6452L46413n94289K83603j86946j31360k2511
16609D748085J31394l75825k22457Q3249N0738o4532n24286j75353l7248J55187
16599C768952J85169j18450j63162L5970n6845j46509k66136M7285Q4155j56244
16589C214185j90189K64349p7593j33219J10202k889l74412M2917p5015k4885
16579B753451J31269k73573p9566q5788J25993l43799J89311J53962p7718j03378
16569B390164p3744N9737J49646j97096k93081n6842L28406j70024k74708J53560
16559B016018J43039q1423r2599j8556k39365L28571j78218J33373p7480k33220
$$ plain form
16549 1700140 1697932 1886551 1565444 1544611 1625449 1589366 1598239 1396722 1533362 1713734 1131934
16538 1131934 1592778 1785799 1548344 1283550 1452884 1388611 1461833 1458921 1400142 1579149
16528 1579149 1177466 1540518 1109016 1314396 1717704 1219059 1576692 1273171 1390964
16519 1390964 857509 1280437 1354155 1592501 1200581 1263312 1399471 994886 1220777 1080418
16509 1080418 961347 1164127 1314155 1038646 880045 992735 962978 1258738 917379 1110471
16499 1110471 916691 931697 834947 1050613 1176412 864333 1001967 1020895 574197 907447
16489 907447 785889 805960 1172696 815486 1106219 960342 1161490 979735 1047321 824281
16479 824281 554703 978623 893767 571008 804534 415137 1140925 981823 722459 764886
$$ packed form
16549A700140k208J88619l21107k0833Q0838l6083Q873k01517J36640J80372n81800
16538A131934M60844J93021k37455k64794J69334o4273P3222k912n8779J79007
16528A579149m01683L63052m31502K05380M03308m98645L57633l03521J17793
16519A390964n33455M22928P3718K38346l91920O2731J36159m04585K25891j40359
16509A080418j19071K02780J50028k75509j58601J12690k9757K95760l41359J93092
16499A110471j93780J5006r6750K15666J25799l12079J37634J8928m46698L33250
16489I07447j21558K0071L66736l57210K90733j45877K01148j81755O7586k23040
16479H24281k69578M23920q4856l22759K33526l89397P25788j59102k59364M2427
$$ plain form
16469 764886 476066 664402 573681 675861 1004010 562836 785962 589115 534707 1074028
16459 1074028 464965 695518 610957 670941 697284 802289 609078 749413 478016 626609
16449 626609 728415 488432 662935 351683 669102 721398 770138 628041 839922 473802
16439 473802 367911 873884 777824 470614 869044 637570 764476 1116316 739944 572512
16429 572512 973393 383140 497340 602837 668902 168306 588264 760768 174977 346936
16419 346936 508054 395421 209307 243059 672550 290248 316980 351459 852076 964520
16409 964520 517987 608163 605803 434011 294866 413819 196105 403492 86964 714730
16399 714730 471968 379218 349372 329350 786790 727642 801478 389244 300608 238176 118143
$$ packed form
16469G64886k88820J88336r0721J02180L28149m41174K23126j96847n4408N39321
16459A074028D64965K30553q4561N9984K6343J05005j93211J40335k71397J48593
16449F26609J01806k39983J74503l11252L17419N2296M8740j42097K11881l66120
16439D73802j05891N05973r6060l07210L98430k31474J26906L51840l76372j67432
16429E72512M00881C83140J14200J05497O6065A68306M19958J72504A74977J71959
16419C46936J61118j12633j86114L3752M29491B90248K6732L4479N00617J12444
16409I64520m46533R0176k360j71792j39145J18953A96105K07387H6964O27766
16399G14730k42762r2750k9846k0022M57440n9148P3836C89244q8636o2432A18143
$$ plain form
16387 316555 617193 418192 580492 260703 493102 143592 376468 247363 258032 233337
16377 233337 290268 346521 441877 376277 333250 95032 255193 100143 575720 290413 48399
16365 330726 490099 405114 40759 53906 4119 34368 557386 239569 445409 402509 269738
16354 269738 238960 80486 489804 484048 345479 349597 515989 419163 181161 574452 43610
16342 131021 109035 361710 554939 -145644 724794 623336 147676 55469 454139 412467
16332 412467 74040 214945 257029 -68748 307304 576437 -11137 64824 250938 -88434 832
16320 -34606 147669 98563 378240 -2330 114980 328250 548329 236530 348575 309607
16310 309607 168951 334171 85625 263380 248395 242697 332582 -132461 517480 -11341 36238
$$ packed form
16387C16555L00638j99001J62300B60703K32399A43592K32876j29105J0669k4695
16377B33337N6931N6253R5356o5600m3027I5032J60161A00143M75577k85307D8399
16365C30726J59373q4985D0759J3147D119L0249N23018B39569K05840m2900j32771
16354B69738l0778H0486M09318n756j38569M118J66392r6826A81161L93291D3610
16342A31021k1986K52675J93229a45644G24794j01458A47676E5469L98670m1672
16332D12467G4040J40905M2084f8748C07304K69133a1137F4824J86114h8434H32
16320c4606A47669m9106K79677b330A14980K13270K20079B36530J12045l8968
16310C09607j40656J65220H5625J77755j4985n698Q9885a32461E17480a1341C6238
$$ plain form
16298 357111 503086 567899 66356 109385 74661 190894 222320 472953 228011 162037 258686
16287 258686 131649 396988 243030 -154825 258636 -31531 372760 468175 220039 220280
16277 220280 -20999 217796 72341 199994 -60216 62120 350173 71527 25799 142042 231464
16266 231464 10910 235121 362963 -111977 149873 616914 50111 -92395 174726 62195
16255 185565 -1605 -181500 378379 1256 230990 32599 587979 75901 261202 109601 84069
16244 84069 223827 -142561 240110 112703 67325 -294013 -21860 69663 -37616 132390
16233 387761 45891 -168802 -12041 270297 -112704 261663 -195355 223997 323796 8027
16222 307430 426318 212841 285491 91440 -54309 156582 210416 417531 -62160 -103040 -60069
$$ packed form
16298C57111J45975O4813F6356M3029l4724J16233L1426K50633B28011o5974R6649
16287B58686j27037K65339j53958a54825B58636c1531C72760R5415B20039K41
16277B20280b0999B17796G2341J27653f0216F2120K88053G1527B5799J16243Q9422
16266B31464A0910K24211J27842a11977A49873M67041E0111i2395A74726F2195
16255A85565a605j79895C78379A256K29734C2599N55380G5901J85301A09601k5532
16244H4069J39758a42561B40110A12703m5378b94013b1860F9663c7616A32390
16233C87761D5891a68802a2041B70297a12704B61663a95355B23997R9799H027
16222C07430J18888B12841P2650I1440e4309A56582N3834K07115f2160m0880M2971
$$ plain form
16211 -60069 360050 -48844 69224 103916 213106 85624 281703 413107 381869 83433 -56568
16199 -29543 133397 296931 166631 -35950 -24298 228674 231754 -11231 -136110 83352 277904
16188 277904 -19247 -165240 311638 -96884 -147764 -408352 -55409 424213 103109 55167
16178 55167 130803 -12684 310122 137321 106297 -94961 186772 170397 -31190 140018 193942
16167 193942 303045 -9079 -58408 83978 -67570 -84402 87767 -79465 182907 -179009 -57185
16155 -86234 56752 -30397 181988 -165419 145867 -196332 201332 282121 -21952 259086
16144 -159322 71918 -99635 222592 287321 -103878 189776 -77151 -140997 273328 375264
16134 375264 392160 12702 -252548 198243 -234434 177971 107012 -294876 213927 3505
$$ packed form
16211f0069C60050d8844F9224L4692J09190H5624J96079J31404l1238H3433e6568
16199b9543A33397J63534j30300c5950J1652B28674L080a1231j24879H3352J94552
16188B77904a9247j45993C11638i6884n0880k60588e5409D24213A03109m7942
16178E5167P5636a2684C10122A37321l1024i4961A86772j6375c1190A40018N3924
16167A93942J09103i079m9329H3978f7570j6832H7767g9465A82907a79009e7185
16155h6234E6752c0397A81988a65419A45867a96332B01332Q0789b1952B59086
16144a59322G1918i9635B22592O4729a03878A89776g7151o3846B73328J01936
16134C75264J6896A2702b52548A98243b34434A77971p0959b94876B13927C505
$$ plain form
16123 164999 139351 82378 -108825 -76371 149290 -63261 109677 2554 -201899 61222 -124643
16111 221251 -415786 -170389 285585 207840 120532 -440828 249421 37844 605917 651509
16101 651509 143661 275158 89006 -115021 -114759 225039 22139 238577 255819 -48967 238415
16089 -72817 156934 107002 54415 -151200 -458345 -230654 219360 335726 128260 150273
16079 150273 97056 -79608 8704 -23135 1958 160313 -159148 -48530 -366975 -124170 93679
16067 -83421 22821 66485 296573 -185001 259571 223515 -137206 -279459 -81774 162686
16056 -107440 154368 20479 294113 34009 267231 326376 485882 233027 33949 -221938
16045 36511 -75503 65323 176878 254718 123774 129201 -300317 24887 -392312 35228 -141005
$$ packed form
16123A64999k5648n6973a08825L2454A49290f3261A09677B554b01899F1222a24643
16111B21251d15786a70389B85585p7745q7308d40828B49421C7844N68073M5592
16101F51509A43661J31497H9006a15021K62B25039B2139K16438J7242d8967B38415
16089g2817A56934m9932n2587a51200l07145K27691B19360J16366A28260K2013
16079A50273n3217g9608H704b3135A958J58355a59148d8530l18445a24170I3679
16067h3421B2821M3664K30088a85001B59571l6056a37206j42253h1774A62686
16056a07440A54368B0479K73634C4009K33222N9145J59506B33027C3949b21938
16045C6511g5503F5323J11555P7840A23774N427c00317B4887c92312C5228a41005
$$ plain form
16033 292945 -147073 84149 -351239 -29775 101169 -169287 373896 92758 -51348 -565235
16023 -565235 73801 -134406 -74606 250974 230108 68090 88629 -258241 182191 -290337
16012 -62812 -26140 5413 92878 131140 -85890 -159077 -202914 169408 -72876 -106878 89721 -46395
15999 -60150 -194088 -87912 293215 -335451 -246816 -25186 -198561 110559 -16344 -54269 -353369
15988 -353369 277514 -50102 179510 204204 155594 322099 268716 147563 287164 306828
15978 306828 126444 -193856 -38526 173081 11490 -158325 149297 82440 211091 -410444
15967 216484 182811 -18014 82134 -258968 60055 74780 -188871 -62476 -515498 80934 25539
15955 -196573 -246730 -234013 23214 11058 -73508 129521 79881 79317 -184483 88237 -344569
$$ packed form
16033B92945a47073H4149c51239b9775A01169a69287C73896I2758e1348n13887
16023e65235G3801a34406N9800B50974k0866F8090K0539b58241A82191b90337
16012f2812b6140E413Q7465L8262h5890p3187m3837A69408g2876l4002H9721d6395
15999f0150j33938h7912B93215c35451Q8635b5186j73375A10559a6344l7925k99100
15988c53369B77514e0102A79510K4694m8610J66505n3383j21153J39601J9664
15978C06828A26444a93856c8526A73081A1490a58325A49297o6857J28651d10444
15967B16484l3673a8014H2134b58968F0055J4725a88871f2476m53022H0934B5539
15955a96573n0157J2717B3214A1058g3508A29521m9640n64a84483H8237c44569
$$ plain form
15943 -141534 198581 -211676 -256150 -191932 32329 -44951 -48721 63544 99863 101020 300349
15932 300349 -367105 38460 -539 -300429 -237566 116484 448329 -99476 80401 26391 -272967
15920 153284 -57219 -204908 -44968 201323 -157314 43148 275107 -65369 95069 15943 407228
15909 407228 64088 120808 150630 398987 30259 -158248 -123356 -15474 -35920 155978 268552
15898 268552 159719 227329 -215123 -80440 -311666 158829 -113679 36143 4373 105730
15888 105730 63715 -123191 152285 168223 166180 -29115 69197 -119896 -180785 -63021 209123
15876 24040 76540 -293321 241852 -283619 -135035 94671 64280 -57865 -193847 -102389 115226
15864 8574 128296 -200837 -49386 -34040 37463 29032 177161 -266068 -373228 -194351 134311
$$ packed form
15943a41534A98581b11676m4474O4218C2329d4951l770F3544L6319J157J99329
15932C00349c67105C8460e39k99890O2863A16484L31845i9476H0401B6391b72967
15920A53284e7219j47689d4968B01323a57314D3148K31959f5369I5069A5943L91285
15909D07228F4088N6720K9822K48357C0259a58248L4892a5474k0446A55978J12574
15898B68552j08833O7610b15123h0440k31226A58829a13679C6143D373J01357
15888A05730m2015a23191A52285J5938k043b9115F9197a19896o0889f3021B09123
15876B4040N2500b93321B41852b83619a35035I4671l0391e7865j35982R1458A15226
15864H574J19722b00837d9386J5346C7463q431J48129b66068j07160J78877A34311
$$ plain form
15852 11455 256558 48484 252735 289014 -212583 170385 183248 -62801 114189 -161169
15841 50325 77119 -44946 242589 -415284 -325716 222368 62849 -89649 -78927 -20765 205823
15829 16857 -324913 -171548 70395 -107860 119953 -21230 -203147 -128542 23143 -141233
15818 67475 183599 -120718 -302925 -55138 -121144 -54552 229347 -6205 -222040 -42154 -191823
15807 -191823 -59361 200922 -20840 -166959 -35200 64145 -282559 -141274 346303 54522
15796 -251579 -181734 -86263 18490 -192686 7960 26733 -73476 -9024 171028 5593 205746
15785 205746 390978 -97720 -607802 -127559 -191342 -51421 -7850 49260 41276 -351433 -82690
15773 74804 11282 -25093 26359 -576813 -391328 21967 61391 -200342 -450882 1005 -90095
$$ packed form
15852A1455K45103D8484K04251L6279b12583A70385J2863f2801A14189a61169
15841E0325K6794d4946B42589d15284Q9568B22368F2849h9649J0722b0765B05823
15829A6857c24913J53365G0395a07860A19953b1230j81917P4605B3143a41233
15818F7475J16124a20718j82207e5138o6006e4552B29347f205k15835d2154j49669
15807a91823e9361B00922b0840j46119c5200F4145b82559a41274C46303E4522
15796b51579O9845h6263A8490a92686G960J8773g3476i024A71028E593K00153
15785B05746J85232i7720n10082a27559o3783e1421g850D9260p984c51433h2690
15773G4804A1282b5093B6359e76813J85485B1967L9424b00342k50540A005i0095
$$ plain form
15761 -34078 -104265 -5097 -79372 -66046 -306540 -264551 79786 -70649 25102 357261 304158
15750 304158 -84401 -157309 -80663 -12661 141009 61583 221184 -10300 184122 99532 -184390
15738 -290041 96141 -55213 -334856 13903 20556 12245 -148016 -187734 131382 -126207 248982
15726 -101599 -333935 24881 103949 18258 -270875 -167940 -76074 -168267 470108 435005 -244120
15714 -113416 367578 -114727 35109 120890 36686 -8396 -136990 48911 -115931 -227761 -528154
15703 -528154 57962 -307957 -97371 14039 -181461 12302 1093 48535 -223691 120895 29686
15691 160046 220570 294448 -168522 -35332 -148938 85566 -365685 -73298 -68962 99181 395070
15680 395070 -215776 -247352 -1861 -25466 -73970 21114 48294 -14301 -102551 127349 140791
$$ packed form
15761c4078p0187e097p4275J3326k40494M1989G9786g0649B5102L32159n3103
15750C04158h4401p2908P6646a2661A41009F1583J59601a0300A84122q4590a84390
15738b90041I6141e5213k79643A3903O653q311a48016l9718A31382a26207B48982
15726a01599k32336B4881P9068A8258b70875J02935g6074r2193D70108l5103b44120
15714a13416C67578a14727C5109Q5781C6686h396j28594D8911a15931j11830l00393
15703e28154E7962c07957i7371A4039a81461A2302A093M7442b23691A20895B9686
15691A60046O0524P3878a68522c5332j13606H5566c65685g3298M336I9181K95889
15680C95070b15776l1576a861k3605m8504B1114K7180a4301q8250A27349J3442
$$ plain form
15669 140791 -115474 40621 279331 -151140 -212567 211030 -196180 -94048 -202826 175341
15658 -96862 -164016 75245 -216167 127455 -46683 110592 -126783 271896 82991 -285855
15647 25803 -165791 140828 -41028 208118 132282 -192609 -132800 3175 -176634 165937 -91657
15635 -227761 14914 5473 111563 410402 254115 151614 -173243 -166949 29567 123571 155210
15624 155210 -26906 23100 276391 -65686 70123 129232 -25609 180020 -346266 329996 -95310
15612 -431622 -130607 29551 -53854 35422 1792 55047 -23503 -159201 89804 -81479 -104399
15601 -104399 241821 -16964 -127496 212286 68135 -51045 149321 250728 -141087 9485
15590 215658 -27319 -152495 -261680 188951 107309 -132587 45649 181421 41525 42903 148572
$$ packed form
15669A40791a15474D0621K38710a51140o1427B11030a96180i4048j08778A75341
15658i6862o7154G5245b16167A27455d6683A10592a26783B71896H2991b85855
15647B5803a65791A40828d1028B08118p5836a92609N9809C175a76634A65937i1657
15635b27761A4914E473J06090K98839j56287j02501a73243O294B9567R4004L1639
15624A55210b6906B3100K53291f5686G0123N9109b5609A80020c46266C29996i5310
15612d31622a30607B9551e3854C5422A792N3255b3503j35698H9804h1479k2920
15601a04399B41821a6964j10532B12286F8135e1045A49321J01407a41087I485
15590B15658b7319j25176j09185A88951q1642a32587D5649J35772D1525J378J05669
$$ plain form
15579 148572 -18008 308860 -24021 16945 -82192 -360046 106362 -58976 -30004 -273451 -320033
15568 -320033 -384597 331439 153017 228651 16566 467200 -32760 -251092 -19976 364612
15557 -96641 -225701 457435 -128594 -277179 -191462 -207505 -275016 -16279 37615 172179 -11520
15545 -93034 -164544 96284 -189844 265514 -134715 159665 93522 -147703 -3891 -164881 -25907
15533 99172 -162296 85900 -189399 -324701 51645 19681 534512 -110713 90714 145276 29955
15521 42149 -240580 -13010 -43791 -372593 124794 -13625 154695 40741 110165 -246785 188634
15509 -152057 496937 -50915 141145 -19878 -73800 -140043 269317 -272597 -65960 -330596
15499 -330596 -165759 273286 -9860 -146928 276800 90298 -291201 103424 -239517 -334943
$$ packed form
15579A48572a8008C08860b4021A6945h2192k77854A06362e8976K8972k43447m6582
15568c20033o4564C31439A53017P5634A6566M50634c2760k18332a9976C64612
15557i6641j29060D57435a28594j48585Q5717j6043o7511a6279C7615J34564a1520
15545i3034p1510I6284a89844B65514a34715A59665o6143a47703c891j60990b5907
15533I9172a62296H5900a89399j35302E1645A9681N14831a10713I0714N4562B9955
15521D2149b40580a3010l0781l28802A24794a3625A54695D0741O9424b46785A88634
15509a52057D96937e0915A41145a9878n3922o6243B69317b72597f5960k64636
15499c30596J64837B73286i860j37068B76800I0298b91201A03424b39517r5426
$$ plain form
15489 -334943 30014 -123114 115324 125901 -210964 -19557 -255143 22107 248250 -96369
15478 151820 223624 138498 295636 -50040 -240250 -290945 129324 -113124 376837 -134307
15467 17455 90562 32585 -28846 92574 -125270 176867 187221 -116569 -69779 50979 88970
15456 88970 -219795 -157930 -30855 292398 -165397 -182701 136598 14447 76018 235097 25341
15444 -27695 36443 -72557 -424419 -111518 238316 -20729 49714 29922 44433 -19390 -74750
15433 -74750 90481 168322 -147238 -17629 106045 152684 -157241 -43328 -33168 35385 193565
15422 193565 -55481 -128661 -160567 -22712 -105774 -102069 -115815 -320178 79961 370925 -28979
15410 23013 -112680 -151177 92246 234541 -92140 -225783 136514 138503 -51804 1597 184026
$$ packed form
15489c34943C0014a23114A15324J0577b10964a9557k35586B2107K26143i6369
15478A51820P1804q5126J57138e0040j90210n0695A29324a13124C76837a34307
15467A7455P3107C2585b8846I2574a25270A76867J0354a16569M6790E0979L7991
15456H8970b19795O1865c0855B92398a65397j7304A36598A4447O1571J59079B5341
15444b7695C6443g2557l51862a11518B38316b0729D9714j9792J4511a9390n5360
15433g4750I0481P7841a47238a7629A06045M6639a57241d3328J0160C5385J58180
15422A93565e5481p3180l1906b2712q3062L705j3746k04363G9961K90964b8979
15410B3013a12680l8497I2246J42295i2140j33643A36514J989e1804A597J82429
$$ plain form
15399 184026 -54268 -89341 99562 75222 79391 -154972 -218506 -59961 -329319 -116240 -114637
15388 -114637 -206282 -18204 296393 -263551 152882 -128080 -30368 -18184 -144577 106638
15377 188619 250745 92295 -77962 -139102 -225846 62987 17427 205085 -230184 -181055 79491
15365 190171 307686 -67997 62906 -67557 -254318 -213058 87510 196032 179421 53095 -116078
15353 48690 184262 -94050 268965 37440 191098 157700 73989 -127896 96895 215351 -222152
15341 -52674 -104183 105436 -123402 -158283 29536 96480 -41294 182837 -143800 -260311 209630
15329 57262 139897 131041 327168 53626 -69576 -163570 -445789 238458 -138451 148066 -225847
15317 161073 87952 -243160 -64106 -105232 262071 -28350 135362 -169462 194292 -160489
$$ packed form
15399A84026e4268l5073I9562k4340M169a54972o3534e9961k69358a16240J603
15388a14637r1645a8204B96393b63551A52882a28080c0368J2184j26393A06638
15377A88619O2126I2295g7962o1140q6744F2987A7427J87658b30184M9129G9491
15365A90171J17515f7997F2906f7557j86761M1260H7510J08522j6611E3095a16078
15353D8690J35572i4050B68965C7440J53658l3398G3989a27896I6895J18456b22152
15341e2674n1509A05436a23402l4881B9536O6944d1294A82837a43800j16511B09630
15329E7262Q2635q856J96127E3626f9576r3994k82219B38458a38451A48066b25847
15317A61073p3121b43160f4106m1126B62071b8350A35362a69462A94292a60489
$$ plain form
15306 -355709 69762 132892 75476 379658 324590 42813 53809 -128970 50200 198047 62408
15294 229263 311891 199269 -224573 469765 -52886 272887 114001 259032 -5414 -163624
15284 -163624 376552 211735 120976 -174479 59917 -227838 91612 226414 124957 -23004
15273 -17576 121152 -164329 191137 57669 68046 -299149 40395 48853 177034 -121302 -199107
15262 -199107 183171 -156495 99977 4905 111701 344959 -409865 -17793 -37528 61423 46516
15251 46516 414892 312446 5307 617227 1518339 993244 1434762 1308147 1019525 316194
15240 269656 174440 200442 201449 28502 36171 80046 -3036 165850 276472 -55540 89356 -125045
15227 335664 -207845 173079 -6188 -11101 -490154 -322089 273460 155192 55443 174392
$$ packed form
15306c55709F9762O3130n7416L04182n5068D2813J0996a28970E0200J47847F2408
15294B29263Q2628j12622b24573D69765e2886B72887A14001J45031e414j58210
15284a63624C76552j64817r0759a74479E9917b27838I1612J34802j01457b3004
15273a7576A21152a64329A91137E7669J0377b99149D0395Q458J28181a21302p7805
15262a99107A83171a56495I9977D905J06796K33258d09865a7793j9735F1423j4907
15251D6516L68376j02446E307O11920R01112n25095M41518j26615k88622C16194
15240B69656r5216K6002J007B8502P669M3875c036A65850J10622e5540H9356a25045
15227C35664b07845A73079f188m913m79053J68065B73460j18268E5443J18949
$$ plain form
15217 174392 -16292 -55630 -104305 288578 470371 -49786 229102 -34445 338466 -28739 200257
15205 231402 240491 27740 382238 97548 207028 113512 209760 154974 179518 71496 205141
15194 205141 204576 137674 154423 -101923 267589 -39530 93819 77382 120809 115281 -257404
15182 227068 -109334 59197 -130927 -209934 -35101 159994 255487 -104016 -119983 -68462 419351
15170 207580 223057 105544 -61296 365174 242127 355051 71551 686030 234573 1841
15159 -29343 490044 87689 118575 350759 455098 20600 198628 -230508 -421866 4450 -150207
15147 46546 134670 75547 -481020 185156 227684 135514 30021 -227551 -130731 252578 526279
15136 526279 46468 424391 92233 121206 -171741 79079 197190 -66771 -196981 49860 108170
$$ packed form
15217A74392a6292l9338m8675B88578J81793d9786B29102c4445C38466b8739B00257
15205B31402R089B7740L54498I7548J09480r3516R6248n4786K4544G1496J33645
15194B05141n65o6902J6749a01923B67589c9530I3819j6437M3427n528b57404
15182B27068a09334E9197a30927p9007c5101A59994R5493a04016j5967N1521D19351
15170B07580J5477A05544f1296C65174j23047J12924G1551O14479B34573A841
15159b9343D90044H7689L0886K32184J04339B0600J78028b30508j91358D450a50207
15147D6546Q8124n9123d81020A85156M2528r2170C0021b27551R6820B52578K73701
15136E26279D6468L77923I2233K8973a71741G9079J18111f6771j30210D9860N8310
$$ plain form
15125 108170 28101 -188359 -1573 -2581 197250 188189 53216 199958 -268137 11127 267827
15114 267827 -103631 329576 121356 244349 -63985 70828 -224414 -2625 77769 27441 308770
15103 308770 177891 322280 26051 655807 88203 -131221 410187 29096 7575 459102
15093 459102 100072 -108750 -170653 76365 89331 3845 -418845 322571 75647 179584 375747
15082 375747 325470 215345 294838 164237 -6738 266148 11578 -103199 374401 -35461 253174
15070 84685 256703 256530 524502 212620 315219 72555 -107207 23645 330067 274103 333027
15059 333027 23157 146113 366947 93861 205973 213229 309460 145530 316176 610608
15049 610608 -319 191010 151980 12397 331331 230212 -69716 135224 92849 105911 -286889
$$ packed form
15125A08170B8101a88359a573j008A97250r061E3216J46742b68137A1127K56700
15114B67827a03631C29576A21356J22993f3985G0828b24414b625G7769B7441K81329
15103C08770j30879J44389B6051O29756H8203a31221D10187B9096G575M51527
15093D59102A00072a08750o1903G6365J2966C845d18845C22571G5647J03937J96163
15082C75747n0277j10125P9493j30601f738B66148A1578a03199C74401c5461B53174
15070H4685J72018j73K67972B12620J02599G2555a07207B3645L06422n5964N8924
15059C33027B3157J22956K20834I3861J12112P256R6231A45530J70646K94432
15049F10608c19A91010l9030A2397L18934j01119f9716A35224m2375J3062b86889
$$ plain form
15037 142220 268541 224399 286214 93905 18878 219061 36224 366358 200849 271442 53471
15025 161138 267242 -91520 189782 235682 133959 -195513 -162459 74975 375168 198709
15015 198709 422985 356422 -126934 91290 168315 211784 287248 266838 205026 444724 285165
15004 285165 22684 306525 207133 240678 81043 343407 74264 134669 313958 10241 115596
14993 115596 331984 -4923 561735 401673 50443 440553 294796 188976 163662 321176
14983 321176 129177 235294 179083 229335 298412 441476 640894 354773 304420 253067
14973 253067 469332 402529 187460 575706 252129 360969 322672 409643 369176 231576
14963 231576 -38063 35698 488181 307892 43006 216945 378821 112660 423711 373080
$$ packed form
15037A42220J26321m4142O1815I3905A8878K00183C6224L30134j65509P0593E3471
15025A61138J06104i1520A89782M5900j01723a95513L3054G4975L00193j76459
15015A98709K24276o6563a26934I1290P7025M3469P5464k0410o1812K39698j59559
15004B85165B2684K83841r9392L3545H1043K62364G4264O0405J79289A0241J05355
14993A15596K16388d923E61735j60062E0443L90110j45757j05820k5314J57514
14983C21176A29177J06117n6211N0252O9077J43064J99418k86121n0353n1353
14973B53067K16265o6803A87460L88246B52129J08840l8297Q6971m0467j37600
14963B31576c8063C5698M52483j80289D3006J73939J61876A12660L11051n0631
$$ plain form
14953 373080 312593 257327 50196 684514 171183 143802 121943 113881 133224 449099 325329
14942 325329 456960 607044 229930 268473 147875 171044 428370 273875 382316 398458
14932 398458 323575 -179619 334863 357095 466798 126648 682343 228044 136103 300841
14922 300841 451814 171198 367068 181974 -87211 48860 96550 234957 217893 29505
14911 136846 107916 96390 380322 360534 350469 414613 134780 420121 50188 488218 397670
14900 397670 264091 537394 518376 739133 130498 -54664 678854 350810 -10890 444691
14889 643049 -26101 219733 216532 539516 167189 299581 374921 487032 641600 344296
14879 344296 45344 157107 343472 332414 407531 218019 168537 449315 413235 187987
$$ packed form
14953C73080o0487n5266E0196O34318A71183k7381k1859q062J9343L15875j23770
14942C25329J31631J50084B29930L8543j20598K3169K57326j54495J08441J6142
14932C98458p4883a79619C34863K2232J09703A26648N55695B28044r1941J64738
14922C00841J50973A71198J95870A81974h7211D8860M7690J38407j7064B9505
14911A36846k8930j1526K83932j9788j0065O4144A34780K85341E0188M38030r0548
14900C97670j33579K73303j9018K20757A30498e4664F78854l28044a0890D44691
14889F43049b6101B19733l201L22984A67189J32392P5340J12111J54568k97304
14879C44296D5344J11763J86365j1058P5117j89512m9482K80778l6080A87987
$$ plain form
14868 255490 529926 739844 453736 506646 260786 619206 637906 318432 569521 332893
14858 332893 216145 410460 355094 479606 411646 280295 402778 293077 372422 199338
14848 199338 433485 714968 105152 436506 522993 533397 685272 450828 519659 272765
14838 272765 376517 662482 10933 709301 493076 370217 398036 338657 30149 851050
14828 851050 534385 349682 578488 444559 416994 721624 636319 537229 261395 489165
14818 489165 705853 513670 326603 520165 663018 498289 640182 486204 169646 254100
14808 254100 568312 521998 172045 560589 612725 582377 386379 301664 750671 13835
14797 568630 457138 430660 424106 444517 577837 757857 686395 579556 705434 177316
$$ packed form
14868B55490K74436K09918k86108N2910k45860L58420J8700C18432K51089k36628
14858C32893j16748J94315n5366J24512o7960j31351J22483j09701P9345j73084
14848A99338K34147K81483A05152L31354Q6487J0404J51875k34444O8831k46894
14838B72765J03752K85965A0933O98368k16225j22859K7819n9379C0149Q20901
14828H51050l16665j84703K28806j33929k7565L04630q5305r9090B61395K27770
14818D89165K16688j92183j87067J93562J42853j64729J41893j53978A69646Q4454
14808B54100L14212m6314A72045L88544N2136l0348j95998q4715M49007A3835
14797E68630j11492k6478o554K0411J33320J80020p1462j06839J25878A77316
$$ plain form
14786 589833 538079 334689 572778 499121 646566 471565 545282 476297 774669 370442
14775 623176 759194 303905 778373 490407 724809 611179 546082 708158 616687 682205
14765 682205 734342 392036 540282 780862 379047 403818 684455 676760 599102 656394 547432
14754 547432 547124 636994 703765 805875 395684 628440 770884 895521 557842 391562
14744 391562 1006912 585813 760526 800268 770631 591295 431691 454609 635720 645230
14734 645230 478039 808384 948673 793782 868924 1004617 417953 442398 973541 736838
14724 736838 745412 989739 1065402 581963 874720 741678 1113310 893657 1007022 895853
14714 895853 437821 639176 785352 862917 547945 684506 638935 573361 602988 957857
$$ packed form
14786E89833n1754k03390K38089p3657J47445j75001P3717o8985K98372C70442
14775F23176J36018C03905M74468k87966K34402j13630o5097J62076r1471O5518
14765F82205N2137l42306J48246K40580C79047K4771K80637p695p7658N7292j08962
14754E47432l08Q9870O6771J02110C95684K32756J42444J24637l37679j66280
14744C91562O15350m21099J74713L9742k9637j79336j59604K2918J81111R510
14734F45230j67191L30345J40289j54891P5142J35693D17953K4445N31143k36703
14724G36838Q574K44327P5663m83439K92757j33042L71632k19653J13365j11169
14714H95853D37821K01355J46176P7565l14972J36561m5571o5574K9627L54869
$$ plain form
14704 957857 1018866 893038 663941 732890 963487 787879 806743 660934 1150610 805495
14694 805495 796719 644923 853468 800737 833608 887212 788644 885127 690874 659067 1073511
14683 1073511 903517 977080 804949 1130666 987893 888843 1260718 893866 889248 1076360
14673 1076360 788299 952258 1034549 1160681 985898 1077947 721512 996733 956473 829655
14663 829655 650969 1149060 1127830 1343988 992995 1213676 1352610 1119786 1171995 1214034
14653 1214034 1250011 1384335 1571010 1248105 895270 1019577 1551596 1324880 1186626 1232041
14643 1232041 1227489 1740289 1202393 1450294 1168526 1226762 1304023 1425800 1249948 918062
14633 918062 1520026 1575375 1322673 1492430 1044859 1400556 1311333 1270436 1237471 1314355
$$ packed form
14704I57857O1009j25828k29097O8949K30597j75608J8864j45809M89676l45115
14694H05495q776j51796K08545n2731L2871N3604r8568R6483j94253l1807M14444
14683A073511j69994P3563j72131L25717j42773r9050L71875l66852m618J87112
14673A076360k88061J63959Q2291J26132j74783R2049l56435K75221m0260j26818
14663H29655j78686M98091k1230K16158l50993K20681J38934k32824N2209M2039
14653A214034L5977J34324J86675l22905l52835J24307N32019k26716j38254M5415
14643A232041m552N12800n37896K47901k81768N8236P7261J21777j75852l31886
14633I18062O01964N5349k52702J69757m47571L55697q9223m0897l2965P6884
$$ plain form
14623 1314355 1389724 1378795 1321793 1000555 1575496 1461611 1091046 1353073 1221680 1818972
14613 1818972 1853288 1466872 1425526 1409389 1464679 1214981 1720251 1641968 1727697 1330814
14603 1330814 1556286 1581331 1955948 1534715 1492509 1644249 1907189 1836807 1481351 1396989
14593 1396989 1655379 1603732 1550216 1905052 1816561 1907242 1721693 2087944 1907479 1954339
14583 1954339 1788567 2169449 2150903 1990469 1512031 1803061 2175395 2045052 1876188 2037000
14573 2037000 1917862 2355944 2102013 1907827 2245665 2051101 2056995 2268668 2212658 2502245
14563 2502245 2187686 2825532 2600040 2390733 2741853 2640410 2474309 2958995 3471229
14554 3471229 3284865 3748867 4090816 4098022 5404902 7197904 10483708 19215920 41880368
$$ packed form
14623A314355P5369j0929n7002l21238N74941j13885l70565K62027j31393N97292
14613A818972L4316l86416m1346j6137N5290k49698N05270p8283Q5729l96883
14603A330814K25472K5045L74617m21233m2206J51740K62940p0382l55456q4362
14593A396989K58390n1647n3516L54836q8491R0681j85549L66251j80465M6860
14583A954339j65772L80882j8546j60434m78438K91030L72334j30343j68864J60812
14573B037000j19138M38082k53931j94186L37838j94564N894K11673n6010K89587
14563B502245l14559O37846k25492k09307L51120j01443j66101M84686N12234
14554C471229j86364M64002L41949P206J306880J793002L285804Q732212K2664448
$$ plain form
14545 41880368 41920214 21521834 12244646 6932107 4358669 3604948 2401579 2175847
14537 2175847 2396489 2009154 1941140 1900053 1884071 2098922 2007088 2112157 1998202 2082658
14527 2082658 1967085 2548161 2408221 2132666 2425002 2603669 2362299 2597802 2525802 2551486
14517 2551486 2751585 2562796 2861664 2440023 2354392 2651064 2850519 2882060 2777719 2650458
14507 2650458 2719763 2846369 2687415 3048535 3058294 3038974 3124485 2944996 3247606 3334705
14497 3334705 3059817 3432677 3343394 3192701 3362159 3505565 3401860 3408193 3441742 3365615
14487 3365615 3527441 3858306 3400756 3578828 3636873 3846522 3706807 3926967 3888751 3735756
14477 3735756 4075059 3852836 3796014 3921009 4090361 4063066 3933460 4021609 4292242 4359460
$$ packed form
14545D1880368L9846k0398380r277188n312539k573438p53721j203369k25732
14537B175847K20642l87335o8014m1087j5982K14851r1834J05069j13955Q4456
14527B082658j15573N81076j39940k75555K92336J78667k41370K35503p2000K5684
14517B551486K00099j88789K98868m21641q5631K96672J99455L1541j04341j27261
14507B650458O9305J26606j58954L61120R759j9320Q5511j79489L02610Q7099
14497C334705k74888L72860q9283j50693J69458J43406j03705O333L3549p6127
14487C365615J61826L30865m57550J78072N8045K09649j39715K20160l8216j52995
14477C735756L39303k22223n6822J24995J69352k7295j29606Q8149K70633O7218
$$ plain form
14467 4359460 4553856 4433889 4530250 4708748 4768226 4640682 4476303 4672643 4833989 4710854
14457 4710854 5131084 4983706 4881973 5357072 5296214 5326724 5386288 5510036 5394394 5455074
14447 5455074 5605087 5527161 5788770 5965681 5848143 5877453 5907233 5787221 6233778 6370551
14437 6370551 6445966 6351769 6516457 6510857 7018322 6810728 6788388 6706116 6712605 7054481 6974454
14426 6974454 7229599 7740566 7382893 7669939 7424716 7796774 7880710 7936104 8174266 8340208
14416 8340208 8159186 8348935 8663439 8442830 9020990 8737444 9282046 9350307 9383362 9496501
14406 9496501 9674187 9651150 9819409 9998884 9739127 10394700 10405748 10835194 10468825 10870834
14396 10870834 11173336 11502286 11689979 11837057 11990722 11986197 12170084 12694356 12502134 12910738
$$ packed form
14467D359460J94396j19967R6361J78498N9478j27544j64379J96340J61346j23135
14457D710854M20230j47378j01733M75099o0858L0510N9564J23748j15642O0680
14447E455074J50013p7926K61609J76911j17538K9310K9780j20012M46557J36773
14437F370551P5415r4197J64688n600N07465k07594k2340q2272O489L41876q0027
14426F974454K55145N10967l57673K87046k45223L72058Q3936N5394K38162J65942
14416H340208j81022J89749L14504k20609N78160k83546N44602O8261L3055J13139
14406I496501J77686k3037J68259J79475k59757O55573J1048M29446l66369M02009
14396A0870834L02502L28950J87693J47078J53665m525J83887N24272j92222M08604
$$ plain form
14386 12910738 13055244 13736888 13823638 14222419 14271201 14717393 14517999 14881220 15248208 15403509
14376 15403509 15673150 15768137 16301867 16448535 16921547 17340805 17396545 17528238 18154348 18407981
14366 18407981 19138164 19325314 19694918 20515000 20597227 21086557 21635159 21971045 22609812
14357 22609812 23163164 23353661 24307405 24660349 25454930 25774389 26491842 27140702 27884524
14348 27884524 28475982 29614929 29936669 31114303 31767424 31944046 33232300 34259945 35037455
14339 35037455 36007948 37125875 38205735 39167321 40529129 41621329 42683114 44258928
14331 44258928 45312382 46805606 48271038 50323171 51432049 52990729 54835433 56859940
14323 56859940 58646318 60637236 63123982 65134474 67388928 69890418 72295946 75166914
$$ packed form
14386A2910738J44506O81644Q6750L98781M8782M46192j99394L63221L66988J55301
14376A5403509K69641R4987N33730J46668M73012M19258N5740J31693O26110K53633
14366A8407981P30183J87150L69604Q20082Q2227M89330N48602L35886O38767
14357B2609812N53352J90497R53744L52944P94581L19459P17453O48860P43822
14348B7884524N91458J138947L21740J177634O53121J76622J288254J027645P77510
14339C5037455R70493J117927J079860R61586J361808J092200J061785J575814
14331D4258928J053454J493224J465432K052133J108878J558680J844704K024507
14323E6859940J786378J990918K486746K010492K254454K501490K405528K870968
$$ plain form
14315 75166914 77632425 81199768 84120554 87357784 91207739 94788589 98857483 103108533
14307 103108533 107548843 112235811 117452830 122531789 128171288 133995812 140546847 147014361
14299 147014361 154138574 161962430 169823354 178701550 187640015 197345738 207466006 218517890
14291 218517890 229494723 241799728 254317911 267358238 281432843 295564237 310259085
14284 310259085 325150746 340231137 355812054 371704468 386779846 402057514 415998139
14277 415998139 429496122 441873455 452709607 462400255 468661393 471751184 472835846
14270 472835846 472596727 468339684 464138022 459455661 452640521 444407022 434758420 424898559
14262 424898559 414036658 400137601 385482199 369730135 353827921 337509202 321662644
$$ packed form
14315G5166914K465511L567343K920786L237230L849955L580850M068894M251050
14307A03108533M440310M686968N217019N078959N639499N824524O551035O467514
14299A47014361P124213P823856P860924Q878196Q938465R705723J0120268J1051884
14291B18517890J0976833J2305005J2518183J3040327J4074605J4131394J4694848
14284C10259085J4891661J5080391J5580917J5892414J5075378J5277668J3940625
14277D15998139J3497983J2377333J0836152R690648O261138L089791J084662
14270D72835846k39119m257043m201662m682361o815140q233499r648602r859861
14262D24898559j0861901j3899057j4655402j5752064j5902214j6318719j5846558
$$ plain form
14255 321662644 305966824 291685729 277439191 263583147 250267383 237758895 225784617
14248 225784617 214106627 203352007 193830185 184414738 175747099 167277794 159082592 151788414
14240 151788414 144599175 138142472 132220430 126199054 120656208 115517876 110586956 105826594
14232 105826594 101602329 98213606 93918151 90112780 86565524 83010354 80009493 77090740
14224 77090740 74427024 71348510 68900425 66497046 64407651 62557361 60187646 57979778
14216 57979778 56310113 54481965 52607374 51288955 49796488 47961976 46384867 45480453
14208 45480453 44271487 43498521 42259131 40848664 39435265 38380765 36934735 36628535
14200 36628535 35622293 34432559 33782040 32570167 31851955 31532172 30609482 29730235 28682917
$$ packed form
14255C21662644j5695820j4281095j4246538j3856044j3315764j2508488j1974278
14248B25784617j1677990j0754620r521822r415447q667639q469305q195202p294178
14240A51788414p189239o456703n922042o021376n542846n138332m930920m760362
14232A05826594m224265l388723m295455l805371l547256l555170l000861k918753
14224G7090740k663716l078514k448085k403379k089395j850290k369715k207868
14216E7979778j669665j828148j874591j318419j492467j834512j577109r04414
14208D5480453j208966p72966j239390j410467j413399j054500j446030l06200
14200C6628535j006242j189734o50519j211873p18212l19783r22690q79247j047318
$$ plain form
14191 28682917 27994200 27851615 26889022 26618214 25842421 25096447 24625880 24448035 23404857
14182 23404857 22848881 22518986 21847970 21491883 21089238 20920693 20108858 19822629 19522939
14173 19522939 18899135 18479443 18462667 17963683 17904382 17246619 17076392 16429114 16095950 15646613
14163 15646613 15630807 15559058 15130376 14902060 14550496 14153445 13881467 13737657 13490736 13602168
14153 13602168 12913368 12698468 12655905 12714156 12179119 12034910 11901937 11864416 11607595 11281870
14143 11281870 11389026 10758987 10906993 10794709 10334746 10147629 10369693 10348059 9889543
14134 9889543 9853025 10112506 9666043 9210538 9375260 9105648 9241015 8924146 8931415 8382587
14124 8382587 8480217 8324492 8438942 7973035 8055134 8021558 7969934 7666525 7234017 7483311
$$ packed form
14191B8682917o88717j42585r62593k70808p75793p45974m70567j77845j043178
14182B3404857n55976l29895o71016l56087m02645j68545q11835k86229k99690
14173A9522939o23804m19692j6776m98984n9301o57763j70227o47278l33164m49337
14163A5646613j5806p1749m28682k28316l51564l97051k71978j43810k46921J11432
14153A3602168o88800k14900m2563N8251n35037j44209j32973l7521k56821l25725
14143A1281870J07156o30039J48006j12284m59963j87117K22064k1634m58516
14134I889543l6518K59481m46463m55505J64722k69612J35367l16869P269n48828
14124H382587R7630j55725J14450m65907Q2099l3576n1624l03409m32508K49294
$$ plain form
14114 7483311 7444863 7216712 7227286 7100606 6991804 6887554 6684752 6875617 7040749 6721472
14104 6721472 6348563 6511356 6264915 6127091 6103347 6173044 6192880 5904016 5713128 5932401
14094 5932401 5682788 5843688 5640124 5256781 5252817 5669768 5235266 5441248 5159048 5246921
14084 5246921 5455976 4887573 5150421 5097650 4983468 4890131 4692565 4909784 4592934 4560361
14074 4560361 5081949 4638264 4585085 4469213 4485206 4517169 4740765 4599852 4357818 4456512
14064 4456512 4151493 4348695 4193246 4210868 4131091 4144366 3847772 4317487 4064687 3979422
14054 3979422 4090304 3542682 3801736 3826552 4021187 3325179 3707132 3444147 3562052 3582266
14044 3582266 3479920 3537738 3816045 3264518 3544063 3301851 3268576 3323834 3034555 3462175
$$ packed form
14114G483311l8448k28151J0574j26680j08802j04250k02802J90865J65132l19277
14104F721472l72909J62793k46441j37824k3744O9697J9836k88864j90888K19273
14094E932401k49613J60900k03564l83343l964M16951m34502K05982k82200Q7873
14084E246921K09055n68403K62848n2771j14182r3337j97566K17219l16850l2573
14074D560361N21588m43685n3179j15872J5993L1963K23596j40913k42034R8694
14064D456512l05019J97202j55449J7622p9777J3275k96594M69715k52800q5265
14054C979422J10882n47622K59054K4816J94635o96008L81953k62985J17905K0214
14044C582266j02346N7818K78307n51527K79545k42212l3275N5258k89279M27620
$$ plain form
14034 3462175 3167141 3230521 3268672 3576490 3151776 3136642 3340331 3000331 2752430 2909684
14024 2909684 2963953 3125190 2855438 2711299 2794682 2704026 2643860 2593373 2903973 3062260
14014 3062260 2657752 2332455 2840057 2387069 2479049 2501876 2649116 2338857 2585075 2263617
14004 2263617 2056567 2068557 2119432 2328637 2445262 2037021 2296699 2124881 1886769 2398208
13994 2398208 2333278 2174876 2492592 2112406 2681085 3260164 5503165 12054228 33101335
13985 33101335 45700537 26231809 15239340 9800068 7535802 5360547 4662937 3861538
13977 3861538 3968282 3358866 3027362 2912956 2652741 2911791 2656595 2567471 2574766 2870596
13967 2870596 2341410 2590676 2269253 2400014 2546021 2333413 2373900 2486953 2060374 2307770
$$ packed form
14034C462175k95034O3380L8151L07818m24714j5134K03689l40000k47901J57254
14024B909684N4269J61237k69752j44139Q3383r0656o0166n0487L10600J58287
14014C062260m04508l25297N07602m52988R1980K2827J47240l10259K46218l21458
14004B263617k07050J1990N0875K09205J16625m08241K59678j71818k38112N11439
13994B398208o4930j58402L17716l80186N68679N79079K243001O551063K1047107
13985C3101335J2599202j9468728j0992469n439272k264266k175255o97610q01399
13977C861538J06744o09416l31504j14406k60215K59050k55196q9124P295K95830
13967B870596n29186K49266l21423J30761J46007k12608M0487J13053m26579K47396
$$ plain form
13957 2307770 2068349 2072799 2147148 2268391 1664941 1995480 2092720 1815231 1962415 2166527
13947 2166527 1761974 1767012 1936941 1956933 1928065 1845191 1503532 1584763 1982229 1834951
13937 1834951 1855334 1725618 1678545 2178567 1717332 1589545 1691956 1455494 1819075 1582611
13927 1582611 1757491 1873947 1686941 1760277 1915160 1638150 1384347 1696182 1736931 1613040
13917 1613040 1595438 1479537 1709473 1298167 1540703 1705626 1434867 1531215 1258283 1671564
13907 1671564 1624785 1472788 1600479 1106957 1323976 1402904 932268 1369495 1188076 1597315
13897 1597315 1314284 1324124 1412656 1336836 1390968 1270910 1716372 1433431 1013933 1067955
13887 1067955 1414705 1358851 1530319 1416862 1385977 1243139 1322594 1108630 1243278 1266873
$$ packed form
13957B307770k39421M450P4349J21243o03450L30539R7240k77489J47184K04112
13947B166527m04553N038J69929J9992k8868q2874l41659Q1231L97466j47278
13937A834951K0383j29716m7073N00022m61235j27787J02411k36462L63581k36464
13927A582611J74880J16456j87006P3336J54883k77010k53803L11835M0749j23891
13917A613040j7602j15901K29936m11306K42536J64923k70759R6348k72932M13281
13907A671564m6779j51997J27691m93522K17019P8928m70636M37227j81419M09239
13897A597315k83031R840Q8532p5820N4132j20058M45462k82941m19498N4022
13887A067955L46750n5854J71468j13457l0885j42838P9455k13964J34648K3595
$$ plain form
13877 1266873 1321158 943342 1188618 1300083 1145933 1274241 1377430 1182891 1184530 1473933
13867 1473933 1235348 1074895 911643 1369253 996544 1065345 1382050 1304948 929524 1054543
13857 1054543 1098829 1248190 1122339 939086 1249631 1132018 803261 1024320 1043133 1390402
13847 1390402 1060303 859800 817101 1191101 1088895 1159997 956515 895752 804336 1127537
13837 1127537 798089 1051093 1101363 1069625 1049303 1007543 686729 401063 1229745 1025820
13827 1025820 1146935 1219959 1056626 1069190 852886 955713 981731 806146 810128 770573
13817 770573 709151 1132784 1076819 711319 754523 509816 1083758 1047085 854423 641906
13807 641906 993605 930747 524336 993467 875646 1064674 807210 1149709 629895 999077
$$ packed form
13877A266873N4285l77816K45276J11465j54150J28308J03189j94539J639K89403
13867A473933k38585j60453j63252M57610l72709O8801L16705p7102l75424J25019
13857A054543M4286J49361j25851j83253L10545j17613l28757K21059J8813L47269
13847A390402l30099k00503m2699L74000j02206P1102k03482o0763r1416L23201
13837A127537l29448K53004N0270l1738k0322m1760l20814k85666Q28682k03925
13827A025820J21115P3024j63333J2564k16304J02827K6018j75585L982l9555
13817G70573o1422M23633n5965l65500M3204k44707N73942l6673j92662k12517
13807F41906L51699o2858m06411M69131j17821J89028k57464L42499n19814L69182
$$ plain form
13797 999077 935151 705891 933177 607555 956651 814410 873681 843453 425020 654975
13787 654975 604462 659397 906814 1004301 627855 828036 1026797 652466 525071 723280
13777 723280 654473 801738 803946 889498 342474 733553 604135 884899 467908 635407
13767 635407 568316 520039 676679 952284 689388 714829 736587 719141 839720 727437
13757 727437 741798 443975 581079 793519 950716 485784 905140 721833 700254 644368
13747 644368 688451 1006226 521712 751230 301906 684957 936495 542592 388368 597170
13737 597170 551640 966038 680998 575322 662862 485165 418133 366619 697138 881958
13727 881958 570664 425283 625646 463015 656735 502290 714676 547877 655375 438513
$$ packed form
13797I99077o3926k29260K27286l25622L49096j42241N9271l0228m18433K29955
13787F54975n0513N4935K47417R7487l76446K00181J98761l74331j27395J98209
13777G23280o8807J47265K208Q5552C42474L91079j29418K80764m16991J67499
13767F35407o7091m8277J56640K75605k62896K5441K1758j7446J20579j12283
13757G27437J4361k97823J37104K12440J57197m64932M19356j83307k1579n5886
13747F44368M4083L17775m84514K29518C01906L83051K51538l93903j54224K08802
13737E97170m5530M14398k85040j05676Q7540j77697o7032n1514L30519J84820
13727H81958l11294j45381K00363j62631J93720j54445K12386j66799J07498k16862
$$ plain form
13717 438513 593760 883222 523862 509120 562287 828339 753721 802471 579476 481128
13707 481128 523637 457839 804653 377601 691622 380317 467860 442634 543902 433040
13697 433040 246584 371099 468116 411682 481939 730770 502216 346096 382072 379969 476936
13686 476936 632378 984342 417718 562009 638328 618690 -119940 438512 332646 626092
13676 626092 489468 132672 456554 281601 469577 458210 425141 350387 296162 711934
13666 711934 644635 438618 720225 580654 385315 411737 711008 678012 230098 455613
13656 455613 748935 722796 320367 550363 367354 608627 868720 311440 554891 99049
13645 369255 531778 613511 642884 638170 564027 194916 341974 318543 363744 552550 104222
$$ packed form
13717D38513J55247K89462l59360j4742N3167K66052p4618M8750k22995r8348
13707D81128M2509o5798L46814C77601L14021l11305Q7543k5226J01268j10862
13697D33040j86456J24515R7017n6434P0257K48831k28554j56120L5976k103R6967
13686D76936J55442L51964D17718J44291P6319j9638a19940D38512j05866K93446
13676F26092j36624A32672L23882j74953J87976j1367l3069p4754n4225M15772
13666G11934o7299k06017K81607j39571j95339K6422K99271l2996B30098K25515
13656D55613K93322k6139C20367K29996j83009K41273K60093C11440K43451I9049
13645C69255J62523Q1733K9373m714p4143A94916J47058k3431M5201J88806A04222
$$ plain form
13633 228919 503467 386583 860217 571466 847631 226343 585384 388911 456111 648978
13623 648978 435393 339445 693061 625039 356979 319229 306629 297480 227420 465574 703021
13612 703021 413401 685269 398157 179487 242051 458212 521581 504719 483244 650206
13602 650206 269344 359952 332147 345366 210309 785798 259014 437281 478112 340318
13592 340318 392629 428823 491747 264239 468061 382555 524906 238520 599488 170054
13581 40676 236722 617257 443381 456613 263067 81183 567491 227022 566703 495379
13571 495379 173927 46259 328782 218032 47401 142587 196145 506314 131073 341022
13561 341022 110519 238713 324547 169492 212725 306485 89965 430167 304184 423390
$$ packed form
13633B28919K74548j16884M73634k88751K76165B26343L59041j96473O7200J92867
13623F48978k13585r5948L53616o8022k68060l7750j2600r149p0060K38154K37447
13612G03021k89620K71868k87112A79487O2564K16161O3369j6862k1475J66962
13602F50206B69344R0608k7805J3219j35057N75489B59014J78267M0831j37794
13592C40318N2311L6194O2924k27508K03822q5506J42351B38520L60968A70054
13581D0676J96046L80535j73876J3232j93546H1183M86308B27022L39681p1324
13571D95379A73927D6259K82523j10750D7401R5186N3558L10169A31073K09949
13561C41022A10519J28194Q5834j55055M3233R3760H9965L40202j25983J19206
$$ plain form
13551 423390 648869 678135 459701 433464 484631 248156 460015 233914 417784 383389
13541 383389 110203 381003 -94452 415198 -299012 97372 -118578 361156 181760 252336
13531 252336 292148 296076 276042 171161 303372 300914 151880 460533 81469 322262 657497
13520 657497 583818 350551 181052 94771 493026 327568 421770 315102 50151 347126
13510 347126 135472 451611 36294 94232 107756 336957 214875 200438 287954 89099 545215
13499 545215 286782 233958 1592 522129 565091 215740 250145 100551 441489 195009
13488 417574 484951 95076 232306 292314 284864 249262 123862 382336 -10075 -15183 298324
13476 427722 131357 291768 530523 443433 362227 196061 112168 391391 102380 185494
$$ packed form
13551D23390K25479K9266k18434k6237N1167k36475K11859k26101J83870l4395
13541C83389A10203K70800i4452D15198b99012I7372a18578C61156j79396P0576
13531B52336L9812L928k0034j04881J32211k458j49034L08653H1469K40793L35235
13520F57497p3679k33267j69499q6281L98255j65458R4202j06668E0151K96975
13510C47126A35472L16139C6294N7938J3524K29201j22082j4437Q7516H9099M56116
13499E45215k58433n2824A592N20537M2962B15740L4405A00551L40938A95009
13488D17574O7377I5076J37230O0008p450l5602A23862K58474a0075n108B98324
13476D27722A31357J60411K38755q7090q1206j66166q3893K79223A02380Q3114
$$ plain form
13466 185494 288830 -216734 263582 372346 353966 -24929 -103275 512389 36033 503619
13456 503619 344538 233298 361958 303045 123191 528994 18594 185689 -102407 232255
13445 48028 -116504 107875 210415 99090 108383 431560 -214048 77690 220385 62540 337129
13434 337129 146129 10826 235194 261748 289328 382248 321683 461475 228835 17470 229166
13423 229166 125407 99159 408411 169773 243410 268856 51504 534318 269122 -70324
13412 -50094 141112 461318 168503 279036 370593 95348 59497 172338 121095 208212 254291
13401 254291 206348 46325 624355 236024 3002 136109 305227 390300 -29577 159707 121121
13390 121121 61365 252930 -50295 452158 116307 -40842 51280 187540 105974 -24986 113807
$$ packed form
13466A85494J03336b16734B63582J08764j8380b4929p8346E12389C6033M67586
13456E03619j59081j11240J28660n8913A23191M05803A8594J67095a02407B32255
13445D8028a16504A07875J02540I9090R293L23177b14048G7690J42695F2540K74589
13434C37129A46129A0826K24368K6554K7580R2920o0565J39792B28835A7470K11696
13423B29166j03759k6248L09252A69773P3637K5446E1504M82814k65196g0324
13412e0094A41112L20206A68503J10533R1557I5348l5851J12841n1243Q7117M6079
13401B54291m7943D6325N78030B36024C002J33107J69118Q5073b9577A59707l8586
13390A21121n9756J91565e0295D52158A16307d0842E1280J36260q1566b4986A13807
$$ plain form
13378 -133953 96921 62261 132735 -84072 244745 -95127 -53362 218376 376430 128089 94616
13367 94616 96491 466966 547072 264022 586833 152915 -41206 123260 195104 84188 147923
13356 147923 471954 46769 12403 -22851 170778 308556 282746 36240 420342 354299 367188
13345 367188 10956 336539 114444 304713 420404 -34779 238681 124794 294167 334945
13335 334945 181027 405703 216801 177170 316896 281206 -120937 180126 102248 210545
13325 210545 276473 394498 345701 337924 -199753 331908 124110 435407 17557 136951
13315 136951 -11788 173656 109394 365135 106090 187213 168304 203310 -29286 122631 125756
13304 125756 280898 206476 -163111 191226 124440 -11602 -37272 107519 -23732 168100
$$ packed form
13378a33953I6921l4660P0474h4072B44745i5127M1765B18376J58054A28089l3473
13367I4616J875L70475Q0106B64022L22811A52915d1206A23260P1844H4188O3735
13356A47923L24031D6769A2403b2851A70778J37778k5810C6240L84102o6043J2889
13345C67188A0956L25583A14444J90269J15691c4779B38681j13887J69373M0778
13335C34945j53918K24676j88902l9631J39726l5690a20937A80126p7878J08297
13325B10545O5928J18025m8797p777a99753C31908A24110L11297A7557J19394
13315A36951a1788A73656o4262K55741A06090Q1123j8909L5006b9286A22631L125
13304A25756J55142p4422a63111A91226o6786a1602k5670A07519b3732A68100
$$ plain form
13293 -100872 158434 109496 194993 92346 -54277 226326 280146 731813 177796 253923 224219
13282 224219 119253 -124197 416790 444811 430511 -297312 -27997 236413 247579 54809
13271 132513 50511 336110 393170 191182 210623 -12434 138812 42460 -31793 -24132 29151
13259 -136319 444435 257565 212387 140205 299527 476566 -141258 106748 -68196 366005
13248 -65389 150649 215818 94527 -20772 -29555 224746 282336 43370 253694 124501 85190
13237 85190 131808 189331 -37188 -78631 331354 -23797 183400 148868 275924 223712 -100109
13225 -294743 552252 -169114 197098 400543 500672 95210 18030 165393 -268331 239833
13214 195734 506118 275926 32423 100086 24888 -21382 200849 418933 248022 -69965
$$ packed form
13293a00872A58434m8938Q5497I2346e4277B26326N3820M51667A77796P6127k9704
13282B24219j04966a24197D16790K8021j4300b97312b7997B36413J1166E4809
13271A32513E0511K85599N7060A91182J9441a2434A38812D2460c1793P661B9151
13259a36319D44435j86870m5178p2182J59322J77039a41258A06748f8196C66005
13248f5389A50649O5169I4527b0772q783B24746N7590D3370K10324A24501l9311
13237H5190M6618N7523c7188m1443C31354b3797A83400l4532J27056n2212a00109
13225b94743E52252a69114A97098K03445J00129I5210A8030J47363b68331B39833
13214A95734L10384k30192C2423O7663B4888b1382B00849K18084j70911f9965
$$ plain form
13203 64984 -69823 -22904 157174 273404 135609 -45241 265693 -253365 157228 144237
13193 144237 -80124 374055 181499 20669 -51361 80296 21859 -20040 224994 -84647 52164
13181 239796 -22332 12737 90692 -30082 -109879 -83349 -106624 138032 175415 -38537 216958
13169 108744 -25548 77909 -150838 -13192 -33118 94372 191554 115290 489162 -160003 33807
13157 -59289 -85302 462694 215965 214543 -107263 -51484 366937 -132621 16641 45198 -22343
13145 210340 91496 -97417 43178 56300 -54169 184893 221848 -266830 160820 -10007 108372
13133 188916 -53793 134570 434755 63110 227537 -110206 -277487 -17805 235341 244527
13123 244527 -10255 315655 -37507 -13567 323527 -115012 81887 -23131 318838 -89503 281371
$$ packed form
13203F4984f9823b2904A57174J16230A35609d5241B65693b53365A57228j2991
13193A44237h0124C74055A81499B0669e1361H0296B1859b0040B24994h4647E2164
13181B39796b2332A2737P7955c0082p9797K6530k3275A38032L7383c8537B16958
13169A08744b5548G7909a50838a3192j9926I4372R7182p6264L73872a60003C3807
13157e9289k6013D62694B15965j422a07263e1484C66937a32621A6641K8557b2343
13145B10340I1496i7417D3178J3122e4169A84893L6955b66830A60820a0007A08372
13133A88916e3793A34570L00185F3110J64427a10206j67281a7805B35341R186
13123B44527a0255C15655c7507a3567C23527a15012H1887b3131C18838h9503B81371
$$ plain form
13111 39606 -38737 182405 -133452 165107 79966 225580 -268995 217 215889 -76841 -95068
13100 -95068 -109731 99542 214222 55259 -7254 182406 133508 -164969 18188 -39218 249293
13088 227008 123607 -74299 -115364 32108 40456 72979 151685 -47584 -108558 228225 312224
13077 312224 -76448 -379261 158524 223436 -134977 -217966 252859 81029 57456 226072
13067 226072 31244 -136656 -56478 156372 328468 167946 151393 -273467 274533 4496
13056 -251549 334961 139717 150740 150009 108976 129660 263405 10440 8097 -87806 434096
13044 139593 -16421 80720 -35800 227680 -60059 444659 387984 518814 -35552 107068 242996
13033 242996 84851 436934 128181 225100 749 250848 274314 235975 311642 -31596 263360
$$ packed form
13111C9606c8737A82405a33452A65107G9966J45614b68995B17K15672g6841j8227
13100i5068j4663I9542J14680E5259g254A82406m8898a64969A8188c9218B49293
13088B27008j03401g4299m1065C2108Q348L2523P8706d7584o0974B28225Q3999
13077C12224g6448l02813A58524O4912a34977q2989B52859H1029k3573J68616
13067B26072C1244a36656e6478A56372J72096j60522j6553b73467B74533D496
13056b51549C34961A39717J1023p31m1033K0684J33745A0440k343h7806D34096
13044A39593a6421H0720c5800B27680f0059D44659n6675J30830c5552A07068J35928
13033B42996H4851L52083A28181R6919G49K50099K3466l8339P5667c1596B63360
$$ plain form
13021 184337 -6556 361564 108555 168452 -103839 -20124 -94649 294672 168073 266101 -224549
13009 -35619 371218 106049 232162 335298 -288514 99187 135478 72028 350818 420585
12999 420585 236260 289568 -63169 -45655 225791 -27549 -266174 71316 86100 64743 477364
12988 477364 46135 220358 253114 -71597 57570 21053 197105 -143596 121420 -1835 131109
12976 -240460 299971 347005 -335593 410072 189332 -113539 317881 105199 179858 61662
12965 69245 321644 -164394 486037 63130 -54863 -43449 9364 180717 -80943 54325 46483
12954 46483 93702 -61923 169472 143106 120525 -63352 -174447 -66097 -375493 -357630 -423481
12943 -423481 305567 46845 492657 23920 26862 278144 -200742 356860 271864 84537 -124740
$$ packed form
13021A84337f556C61564A08555N9897a03839b0124p4525B94672j26599R8028b24549
13009c5619C71218A06049J26113J03136b88514I9187L6291o3450K78790O9767
12999D20585j84325N3308f3169J7514B25791b7549k38625G1316J4784k1357M12621
12988D77364D6135J74223L2756g1597E7570B1053J76052a43596A21420a835A31109
12976b40460B99971M7034c35593D10072A89332a13539C17881A05199P4659F1662
12965F9245K52399a64394D86037F3130e4863J1414I364J71353h0943E4325p842
12954D6483M7219f1923A69472k6366k2581f3352j11095f6097l09396J7863o5851
12943d23481C05567D6845M45812B3920K942K51282b00742C56860q4996H4537a24740
$$ plain form
12931 -187441 224379 115481 298941 -78641 -177226 -157071 -67287 -40123 24756 -50571 169947
12919 -86451 305787 -120124 -91230 96601 -19437 57204 43669 145761 85746 105597 347721
12908 347721 123457 134083 11170 -45525 -147112 -79948 264498 22147 218040 -49193 102134
12896 49979 216316 169007 17687 196168 -182041 -97969 -75425 181790 240279 187174 60543
12884 -66717 115138 46186 30054 -292537 -65441 243030 -144616 -202966 -37973 -257399 11451
12872 -247641 -180984 174662 408406 92160 -450161 -443447 35812 4597 10807 -268615 -231067
12861 -231067 146020 -104809 -54444 161746 123390 44879 5778 -52088 -93438 190862 178904
12850 178904 202715 177765 124231 -34487 -535574 216152 20163 -28406 105650 -63772 186648
$$ packed form
12931a87441B24379j08898J83460g8641r8585K0155f7287K7164B4756e0571A69947
12919h6451C05787a20124K8894I6601a9437E7204j3535J02092o0015J9851K42124
12908C47721A23457J0626A1170d5525j01587O7164B64498B2147J95893d9193A02134
12896D9979J66337m7309A7687J78481a82041Q4072K2544A81790N8489n3105F0543
12884f6717A15138D6186j6132b92537f5441B43030a44616n8350c7973k19426A1451
12872b47641O6657A74662K33744I2160d50161O714C5812D597O210b68615L7548
12861b31067A46020a04809N0365A61746l8356D4879E778e2088m1350A90862j1958
12850A78904K3811k4950n3534c4487n01087B16152B0163b8406A05650f3772A86648
$$ plain form
12838 180271 1080 -168792 63458 32047 -267971 -56597 413352 208188 67712 -32623 186250
12826 -91179 222966 -174494 243918 79174 9918 124475 -70844 -160786 140285 435258 233249
12815 233249 33385 -245829 -3151 -60864 6211 66302 -143057 -206201 -154 64676 78576 -188059
12802 -122496 -57504 12096 240639 -96159 240662 -218104 28483 -200628 31212 -175637
12791 277487 -81513 -44563 -322960 50142 264316 -41570 -72221 -110246 226293 257397 213910
12780 213910 22684 -15618 99581 306858 -127654 211247 219803 34548 109363 316746 120508
12768 73646 94467 322758 110964 101063 198026 92958 -52271 25440 -144649 -109664 -84188
12757 -84188 -62673 -77671 246007 394547 142773 -282599 -353495 -169889 -34040 -436162
$$ packed form
12838A80271A080a68792F3458l1411b67971e6597D13352k05164F7712c2623A86250
12826i1179B22966a74494B43918G9174I918J14557g0844q9942A40285K94973k02009
12815B33249C3385b45829c151n7713F211O0091a43057o3144a54F4676J3900a88059
12802a22496e7504A2096K28543i6159B40662b18104B8483b00628C1212a75637
12791B77487h1513L6950k78397E0142K14174d1570l0651l8025B26293L1104m3487
12780B13910B2684a5618I9581K07277a27654B11247Q556C4548P4815K07383A20508
12768G3646K0821K28291A10964r901R6963I2958e2271B5440a44649L4985K5476
12757h4188K1515j4998B46007J48540A42773b82599p0896a69889c4040m02122
$$ plain form
12747 -436162 -325 141754 132677 60693 -76842 -83434 24318 -28526 -230011 151381 69900 415800
12735 415800 168559 96639 163235 145465 439571 187655 186932 -13928 229042 -77837 -1358
12723 -41552 -41439 150737 120542 187751 -166218 43925 -111549 -244200 -88933 335410 -282484
12711 182720 -11079 190595 -38801 149489 183378 269519 520946 -71064 216751 112342
12701 112342 -129233 343942 93850 -131492 111441 -69151 -119854 136259 378067 94273
12690 243561 -170011 66078 -202990 -679940 153880 -140789 327763 408581 81431 194894
12680 194894 449746 73777 77212 104533 407123 -47084 50942 6099 196009 13005 182480
12669 182480 27644 -47817 68155 3295 -109044 42039 126503 338378 -16664 431690 66048
$$ packed form
12747d36162c25A41754r077F0693g6842o592B4318b8526k01485A51381F9900L45900
12735D15800A68559p1920O6596j7770K94106A87655p23a3928B29042g7837a358
12723d1552J13A50737l0195O7209a66218D3925a11549j32651h8933C35410b82484
12711A82720a1079A90595c8801A49489L3889Q6141K51427g1064B16751j04409
12701A12342a29233C43942I3850a31492A11441f9151n0703A36259K41808I4273
12690B43561a70011F6078b02990m76950A53880a40789C27763Q0818H1431J13463
12680A94894K54852G3777L435K7321L02590d7084E0942F099J89910A3005J69475
12669A82480B7644d7817F8155C295a09044D2039Q4464K11875a6664D31690F6048
$$ plain form
12657 313879 87180 -73935 259662 111705 131466 -39203 -80193 28462 180826 11191 118011
12646 118011 81843 108561 -20944 119841 67569 49952 40936 211149 -47212 342931 490906
12635 490906 -124825 416754 -55923 323738 22936 147750 174208 186595 -3667 90689 275795
12624 275795 275367 60056 335609 122350 422224 -67435 -129138 314370 103122 136191 101016
12613 101016 68678 -193577 327468 56249 -104078 -78859 64378 278440 71444 81079 60975
12602 60975 198689 10668 -138851 100205 -38563 -81316 124621 302820 114003 -285575
12591 -87064 348383 -265277 -19612 153013 338771 147649 -24727 -138620 -60639 55172
12580 106869 -48230 12253 80616 -21873 1790 208969 301885 62396 -36591 176149 195183
$$ packed form
12657C13879H7180g3935B59662A11705J9761c9203m0990B8462J52364A1191J06820
12646A18011l6168K6718b0944A19841n2272j7617r016J70213d7212C42931J47975
12635D90906a24825D16754e5923C23738B2936J24814K6458J2387c667I0689J85106
12624B75795m28F0056K75553A22350K99874f7435o1703C14370A03122L3069l5175
12613A01016l2338a93577C27468E6249a04078K5219F4378K14062G1444R635k0104
12602F0975J37714A0668a38851A00205c8563m2753A24621J78199A14003b85575
12591h7064C48383b65277a9612A53013J85758A47649b4727j13893f0639E5172
12580A06869d8230A2253O8363b1873A790K07179R2916F2396c6591A76149J9034
$$ plain form
12569 195183 169645 36627 -63559 261351 118157 164779 47997 114473 -25328 -152597 128214
12557 143280 147468 149956 -73730 31190 7359 297890 129410 -68366 10607 32384 -4531 116978
12544 96963 171634 226832 -222619 -313379 -62577 -150482 210354 294992 11625 -378577 -146354
12532 -70614 -270839 -162214 50433 -193640 68663 -137342 -147123 125862 -211909 -126385 -73923
12521 -73923 29124 -123501 -71639 366596 37573 206153 374975 43136 221954 137102 56987
12509 -286808 479537 -209037 127879 3734 -1787 224133 164899 148396 147688 -29088 -222006
12498 -222006 -127441 -26981 342302 39596 56438 -74172 12262 -83264 242141 66261 -367433
12486 232231 -22545 -203956 141037 -127351 -64636 -148528 -176319 303959 22194 257474
$$ packed form
12569A95183k5538C6627f3559B61351A18157M6622D7997O6476b5328j27269A28214
12557A43280M188K488g3730C1190G359K90531A29410f8366A0607K1777d531A16978
12544I6963P4671N5198b22619r0760f2577q7905B10354Q4638A1625c78577a46354
12532g0614k00225J08625E0433a93640F8663a37342r781A25862b11909Q5524N2462
12521g3923B9124a23501N1862C66596C7573J68580J68822D3136J78818q4852E6987
12509b86808D79537b09037A27879C734a787B24133n9234j6503p08b9088j92918
12498b22006R4565b6981C42302C9596J6842g4172A2262h3264B42141F6261c67433
12486B32231b2545j81411A41037a27351O2715q3892k7791C03959B2194K35280
$$ plain form
12476 257474 52551 -37824 -31106 170306 -223372 -78641 -406879 -332045 -146959 -77753 121804
12464 -58721 275754 201773 152743 -67334 8501 -113471 79662 138533 -110048 109573 -347925
12452 -8212 -211359 16884 -420769 -63733 299847 -143605 -1708 160835 -19305 140797 2448
12440 -116455 -43850 -236796 319356 142612 10472 -302562 -22883 -240717 23005 -5703 82960
12428 -131229 -22198 370486 -102446 156560 -26787 -147986 -170328 -188769 124165 6439 -196964
12416 -28159 76193 -317215 259651 -364703 171469 -79792 -274323 198980 -494274 7493
12405 121727 -171564 -84548 276970 -225086 -189185 312765 -91047 13775 -147354 94259
12394 59391 169150 -459045 -108044 201004 241373 282510 40412 -160415 89155 -257309
$$ packed form
12476B57474E2551c7824O718A70306b23372g8641l28238P4834a46959O9206A21804
12464e8721B75754p3981m9030f7334H501a13471G9662N8871a10048A09573c47925
12452h212k03147A6884d20769f3733B99847a43605a708A60835a9305A40797B448
12440a16455d3850j92946C19356A42612A0472c02562b2883k17834B3005e703H2960
12428a31229b2198C70486a02446A56560b6787j21199k2342j8441A24165F439a96964
12416b8159G6193c17215B59651c64703A71469g9792j94531A98980d94274G493
12405A21727a71564h4548B76970b25086L5901C12765i1047A3775a47354I4259
12394E9391J09759d59045a08044B01004M0369M1137D0412a60415H9155b57309
$$ plain form
12383 -152907 79651 -66601 147558 -3224 -20015 215641 285390 -29308 -19096 -87085 -41283
12371 235680 -255676 67924 89489 -424838 -57136 -12028 456939 -12240 268104 -21470 -207652
12360 -207652 102515 19957 -105264 197490 79833 -64266 66870 430355 -12593 -241055
12350 -241055 406484 416196 -264288 185632 -134289 135731 -190225 -295006 -195124 -46659
12339 91034 -112344 208146 -23874 259170 60947 -10919 79471 7664 51316 -117022 53508
12327 310616 -194302 -75438 128378 -23411 308361 -328861 251352 114787 -25601 -36924
12317 -36924 -294756 -128193 129518 -87128 96410 102307 -55678 67560 246061 126111 -35624
12305 -37829 91002 50710 -240933 59309 75699 4826 -178957 -322605 -424983 93650 9843
$$ packed form
12383a52907G9651f6601A47558c224j6791B15641O9749b9308J0212o7989d1283
12371B35680b55676F7924K1565d24838e7136a2028D56939a2240B68104b1470j86182
12360b07652A02515A9957a05264A97490G9833f4266F6870L63485a2593k28462
12350b41055D06484R712b64288A85632a34289A35731a90225j04781R9882d6659
12339I1034a12344B08146b3874B59170F0947a0919G9471G664M3652a17022E3508
12327C10616a94302g5438A28378b3411C08361c28861B51352A14787b5601j1323
12317c6924k57832a28193A29518h7128I6410N897e5678F7560J78501j19950c5624
12305c7829I1002m0292b40933E9309J6390D826a78957j43648j02378I3650I843
$$ plain form
12293 -141618 245325 -152001 285393 285583 222818 15294 164995 311815 -159387 14671 -421385
12281 -90652 168266 174609 -184270 -71776 137272 193288 408619 312174 181920 390062 -134420
12269 230668 -84400 158907 -138064 41153 138539 337883 -98271 256032 -32597 -145456
12259 -145456 191028 216192 137459 136905 398789 31240 29342 158472 2834 -176828 103392
12247 430481 -64258 18056 63821 162217 464577 -74416 -40577 171480 -17316 153168 264917
12236 264917 -36709 284941 128009 243818 114858 -145054 327981 -63416 281090 58981
12225 84313 224917 261028 315992 256669 357571 90050 -74582 148429 325888 16766 32683
12214 32683 19312 134488 -101168 -288943 308214 6206 89410 3654 51755 97672 139786
$$ packed form
12293a41618B45325a52001B85393J90o2765A5294J49701J46820a59387A4671d21385
12281i0652A68266O343a84270g1776A37272N6016K15331r6445j30254K08142a34420
12269B30668h4400A58907a38064D1153R7386J99344i8271B56032c2597j12859
12259a45456A91028K5164p8733n54K61884C1240j898J29130B834a76828A03392
12247D30481f4258A8056M5765R8396L02360g4416L3839A71480a7316A53168J11749
12236B64917c6709B84941A28009J15809A14858a45054C27981f3416B81090E8981
12225H4313J40604L6111N4964n9323J00902I0050g4582A48429J77459A6766J5917
12214C2683j3371J15176a01168j87775C08214F206Q3204C654M8101M5917M2114
$$ plain form
12203 139786 175608 431363 157344 192056 107772 141938 173984 -147409 255166 -66705 531305
12191 79249 -115574 -19463 525181 185995 243616 -199539 297595 213715 -181270 -46387
12180 307536 237991 -33897 -321402 164499 -37248 135483 312415 28610 -46895 170170
12169 135478 -97445 104871 58316 8801 105146 -186210 124202 266711 24132 134907 39462
12157 260836 413586 -43852 302708 158498 114003 -77663 209718 269335 36203 168169
12147 168169 -21576 56659 -68100 14359 -129656 239460 -75488 -127196 -179111 461564 100991
12135 165641 286439 235971 -38065 165596 9816 88029 134979 -32121 -202886 -163201 57100
12123 29005 -100456 -34982 -267362 -36997 -294406 304467 182282 125447 -150676 83156
$$ packed form
12203A39786L5822K55755A57344L4712q4284L4166L2046a47409B55166f6705E31305
12191G9249a15574a9463E25181A85995N7621a99539B97595q3880a81270d6387
12180C07536o9545c3897k87505A64499c7248A35483J76932B8610d6895A70170
12169A35478i7445A04871m6555H801R6345a86210A24202J42509B4132J10775C9462
12157B60836J52750d3852C02708j44210m4495g7663B09718N9617C6203J31966
12147A68169b1576E6659f8100A4359a29656B39460g5488n1708n1915D61564A00991
12135A65641J20798n0468c8065A65596I816P8213M6950c2121j70765L9685E7100
12123B9005a00456c4982k32380c6997k57409C04467j22185n6835a50676H3156
$$ plain form
12112 -55571 51343 -234109 52679 -204975 75430 -450547 -102748 170221 -299852 -24404
12101 815 63215 86313 67775 326678 -317952 -408816 124565 -100268 237421 -138724 -192266
12090 -192266 -5036 38989 46046 -26831 307874 169426 64102 316286 -254415 83618 3193
12078 -67973 39988 -156540 97713 -17490 63120 25943 67499 98178 9950 -88735 160165
12066 584539 2219372 1600999 700075 288108 168022 202924 162033 -90030 72496 445268
12056 445268 58010 327139 -102375 7938 34701 76066 -80613 94836 -96253 -136978 93498
12044 96202 12343 -38649 -70443 -22030 135321 142552 71944 -71085 -234664 -13302 -12427 152134
12031 -167378 -196637 -182116 83518 71964 -231522 -243033 -107944 170385 227050 -84491 -1949
$$ packed form
12112e5571E1343b34109E2679b04975G5430d50547a02748A70221b99852b4404
12101H15O2400K3098j8538K58903c17952r0864A24565a00268B37421a38724n3542
12090a92266e036C8989P057b6831C07874j38448F4102K52184b54415H3618C193
12078f7973C9988a56540I7713a7490F3120B5943M1556L0679I950h8735A60165
12066E84539J634833o18373G00075B88108j20086L4902m0891i0030G2496L72772
12056D45268E8010K69129a02375G938K6763M1365h0613I4836i6253m0725I3498
12044I6202A2343c8649l1794b2030A35321P231p0608g1085j63579a3302Q75A52134
12031a67378k9259J4521H3518j1554b31522j1511a07944A70385N6665h4491a949
$$ plain form
12019 80057 54667 -322175 91162 -119630 227723 -195017 10197 203385 -329579 -22675
12008 338987 351313 -114551 13347 -120706 -246592 208449 13687 149468 -343151 -53220
11997 -15099 430458 -273801 -159552 -82608 -437048 38881 -198753 -348274 -208425 46211
11986 -203776 -156051 -221978 50929 262424 71654 182191 -82119 -132379 -49772 -149772 242110
11974 -68821 -39162 -257404 -240575 51820 -124304 151226 20576 52880 328162 -211112 -26463
11962 151995 -146836 128767 166990 21165 8795 -52524 -261247 -190905 19762 145306 -159771
11950 92838 -123933 34204 -55268 223829 123458 174415 -35457 116079 -268575 62883 194065
11939 194065 -866 -234563 305915 -512041 -87453 108537 -99807 112839 274825 297471 265537
$$ packed form
12019H0057k5390c22175I1162a19630B27723a95017A0197J93188c29579b2675
12008C38987J2326a14551A3347a20706j25886B08449A3687J35781c43151e3220
11997a5099D30458b73801J14249P6944l54440C8881a98753j49521J39849D6211
11986b03776M7725o5927E0929K11495G1654J10537h2119n0260d9772j00000B42110
11974f8821K9659k18242J6829E1820a24304A51226B0576L2304K75282b11112b6463
11962A51995a46836A28767L8223B1165H795e2524k08723P0342A9762J25544a59771
11950I2838a23933C4204e5268B23829j00371N0957c5457A16079b68575F2883J31182
11939A94065h66k33697C05915e12041h7453A08537i9807A12839J61986K2646l1934
$$ plain form
11928 265537 447375 -99530 15970 -403582 79120 400054 83164 428357 -530746 -116355
11917 217346 33063 195580 -315831 -21947 -145715 -94331 29011 -153125 268499 -48028
11906 -142835 193068 306510 186934 -186194 -277035 140335 -31486 -29763 -256410 -273172
11896 -273172 -188215 -155579 -81812 -123037 51922 -109673 -60495 242766 37755 -113509 -52206
11884 -238523 247882 52364 -19810 49087 -140345 199695 -284437 -245033 -369411 -67142
11873 7806 -144933 266625 6846 123326 214159 52340 232573 29693 10694 9976 251733
11862 251733 -174944 321146 160272 -285407 20196 -272728 -188807 -87458 122875 -10089
11851 150131 -184152 58489 -251532 -161566 255682 281167 -317216 -74732 -292784 -6622 197228
$$ packed form
11928B65537J81838i9530A5970d03582G9120L20934H3164L45193e30746a16355
11917B17346C3063J62517c15831b1947j23768N1384B9011a53125B68499d8028
11906a42835A93068J13442j19576a86194r0841A40335c1486J723k26647j6762
11896b73172Q4957L2636P3767m1225E1922a09673M9178B42766C7755a13509e2206
11884b38523B47882E2364a9810D9087a40345A99695b84437L9404j24378f7142
11873G806a44933B66625F846J16480R0833E2340J80233B9693A0694p18K41757
11862B51733a74944C21146A60272b85407B0196b72728Q3921h7458A22875a0089
11851A50131a84152E8489b51532Q9966B55682K5485c17216g4732k18052f622A97228
$$ plain form
11839 -7537 16114 103202 -95801 144261 -117136 -183762 -119062 135545 -330255 38741 -116053
11827 260182 128342 178309 -168194 -32867 -205845 -215449 -151259 -16472 41653 18428 236885
11816 236885 -208588 -27974 -91936 133240 -168589 4474 -236114 -131479 -208695 -164670 -29973
11804 188820 -138604 96934 390745 49186 56691 -269411 133395 270504 -4248 237575 -50663
11792 -380140 107743 202218 165702 60429 -126866 -9781 222185 -108269 13398 -52069 -165861
11781 -165861 -80989 -183465 27564 -107817 166483 -128341 26715 156581 -22237 -158924
11771 -158924 103879 284687 148547 99187 332862 -78648 -164088 -329428 -268535 -139007
11761 -139007 -266904 -39667 43970 101867 17475 101320 -205106 -13098 212607 -144090 -380413
$$ packed form
11839g537A6114Q7088i5801A44261a17136o6626O4700A35545c30255C8741a16053
11827B60182A28342M9967a68194c2867j72978r604O4190a6472D1653A8428K18457
11816B36885b08588b7974o3962A33240a68589D474b36114J04635p7216M4025b9973
11804A88820a38604I6934K93811D9186P505b69411A33395J37109d248B37575e0663
11792c80140A07743R4475l6516F0429a26866i781B22185a08269A3398e2069j13792
11781a65861h0989j02476B7564a07817A66483a28341B6715J29866b2237j36687
11771a58924A03879J80808j36140m9360K33675g8648q5440j65340O0893J29528
11761a39007j27897c9667D3970N7897A7475Q3845b05106a3098B12607a44090k36323
$$ plain form
11750 -380413 38059 -11762 -33410 -42783 -10069 -5108 -8093 195072 131344 96750 -143515 256708
11737 -194605 -191087 296530 205143 124514 -31494 -173134 -51569 186912 -152818 129295 33573
11725 -208196 -231911 108497 91607 -103842 235499 19982 -26796 -97292 -120639 134783 -330545
11713 -92012 7713 20506 275014 -209447 5793 11730 -228366 -3051 -108351 65048 -102727
11701 -47461 235429 -43499 -27135 170985 78173 182612 -286682 134967 2023 245514 -112335
11689 -48064 63325 -300632 438342 -39686 -13000 295266 164413 149950 -100625 361597
11678 164107 193350 220585 133288 -243273 34106 236547 -195711 -167282 172345 106397 135911
11667 135911 83744 -58124 -30335 -2975 81294 76334 -33572 -250265 103024 -311775 191706
$$ packed form
11750c80413C8059a1762k1648r373a0069M961k985A95072o3728l4594a43515B56708
11737a94605L518B96530r1387q0629c1494j41640e1569A86912a52818A29295C3573
11725b08196k3715A08497j6890a03842B35499A9982b6796p0496k3347A34783c30545
11713i2012G713J2793K54508b09447E793N937b28366c051j05300F5048a02727
11701d7461B35429d3499J6364A70985G8173J04439b86682A34967B023K43491a12335
11689d8064F3325c00632D38342c9686a3000B95266j30853j4463a00625C61597
11678A64107K9243K7235q7297b43273C4106K02441a95711K8429A72345o5948K9514
11667A35911n2167e8124K7789b975H1294m960c3572k16693A03024c11775A91706
$$ plain form
11655 -54014 413724 -96674 -53046 -36661 180124 103352 -20165 -18687 46497 193739 107939
11644 107939 -84418 1174 194009 -28505 -131336 -174742 -232533 165435 -66584 141243 41975
11632 84207 -77399 422305 142729 -8390 261823 18659 95253 177023 -122195 -73306 348089
11620 -58700 29528 46171 -129753 2777 16827 128820 91842 -11545 -191693 112485 -178417
11608 -142236 150417 149385 94416 -156052 -12565 18050 103322 229100 -168321 -2307 353269
11596 -29383 60541 -214585 -113873 226697 -111368 68278 -110826 -29142 184271 255932
11586 255932 44064 36385 85346 244925 169167 182377 -196367 -13163 215097 556196 55166
11574 292825 95352 143465 54057 355419 66192 -19301 177410 -21246 -161830 -261666 48113
$$ packed form
11655e4014D13724i6674M3628J6385A80124p6772b0165J478D6497J47242q5800
11644A07939h4418A174J92835b8505j02831m3406n7791A65435f6584A41243D1975
11632H4207g7399D22305A42729h390B61823A8659P6594Q1770a22195M8889C48089
11620e8700B9528J6643a29753B777J4050J11993l6978a1545j80148A12485a78417
11608a42236A50417j032n4969a56052a2565A8050Q5272J25778a68321b307C53269
11596b9383F0541b14585J00712B26697a11368F8278a10826b9142A84271P1661
11586B55932D4064p679M8961J59579p5758J3210a96367a3163B15097L41099E5166
11574B92825I5352M8113E4057L01362F6192a9301A77410b1246j40584r9836D8113
$$ plain form
11562 126876 532676 179935 -42020 180551 -59711 173732 153191 114399 195906 8945 95424
11551 95424 -152402 -24389 -59106 77755 -31945 144785 -54892 119229 111282 73650 -33040
11539 158614 243287 257404 172061 130294 292238 40601 8317 377026 -3164 139800 153277
11528 153277 -61692 -22759 412121 -138406 35402 196770 128502 99495 11925 -97481 496847
11516 173128 162265 170872 229531 147616 346749 269475 187268 543707 111487 215176 13211
11504 -17624 345015 48641 -41987 -24727 119929 287438 426633 -180012 20073 329311
11494 329311 160255 151355 363575 -74050 73564 -129362 123607 212504 51237 -36954 197818
11482 302384 56849 130141 168447 459177 -24024 458862 438481 367053 -287116 231013 211756
$$ packed form
11562A26876M05800A79935d2020A80551e9711A73732k0541l8792Q1507H945Q6479
11551I5424a52402b4389l4717G7755c1945A44785e4892A19229p947l7632c3040
11539A58614Q4673J4117q5343m1767J61944D0601H317L68709c164A39800J3477
11528A53277f1692b2759D12121a38406C5402J61368o8268k9007A1925i7481D96847
11516A73128j0863Q607N8659q1915J99133p7274q2207L56439A11487J03689A3211
11504a7624C45015D8641d1987J7260A19929J67509J39195a80012B0073L09238
11494C29311A60255q900K12220g4050G3564a29362A23607Q8897E1237c6954A97818
11482C02384E6849P3292L8306K90730b4024D58862k0381p1428b87116B31013j9257
$$ plain form
11471 211756 290108 91383 314028 288782 114850 -15559 342559 53917 44265 77463 271485
11460 271485 -93822 -10247 185311 136656 209591 166203 9307 296927 53246 -295952 141685
11448 -85776 44073 232561 315147 185201 168145 -38623 87156 518897 290362 -48083 253290
11436 51162 436078 405484 244411 -73188 51707 -8440 -190163 147365 28375 -157786 56920
11424 305798 106538 245434 -43044 -165596 -117971 124403 -62934 -126993 -47142 1219 101660
11413 101660 -353637 188445 -34493 100100 86185 39000 -259824 -57793 94353 29358 73737
11402 73737 -26644 114031 44659 163248 4776 31921 246907 189689 -205372 171193 58503
11390 22594 134894 62375 -3136 57140 -241922 -118009 -131177 -83599 9210 17114 77541 147636
$$ packed form
11471B11756P8352I1383K22645k5246A14850a5559C42559E3917r652L3198J94022
11460B71485i3822a0247A85311m8655P2935m3388I307K87620E3246b95952A41685
11448h5776D4073J88488Q2586j29946j7056c8623H7156M31741k28535d8083B53290
11436E1162L84916l0594j61073g3188E1707h440j81723A47365B8375a57786E6920
11424C05798A06538J38896d3044j22552M7625A24403f2934o4059d7142A219J00441
11413A01660c53637A88445c4493A00100j3915C9000b59824e7793I4353B9358M4379
11402G3737b6644A14031D4659J18589D776K7145K14986n7218b05372A71193E8503
11390B2594J12300F2375c136E7140b41922a18009j3168M7578I210P904O0427P0095
$$ plain form
11378 147636 169137 108030 -334369 52667 104402 331574 -109709 49043 -276059 114600
11367 -254133 -270366 8313 78439 -19508 -363470 -127181 -35027 -167468 -129570 -248779 14661
11355 307340 -176075 -292149 165561 -101274 -33707 -166986 58156 20194 -48170 166156
11344 202712 385984 214970 -28230 84397 -226092 -153288 149386 67881 -86886 67809 -179109
11332 33633 230753 -170137 -59254 122551 295653 -228111 -37704 -172020 32560 -100568
11321 -74041 346532 -34403 -160054 291672 -146059 291023 -150890 -283885 -225313 -232969
11311 -232969 -37181 -181496 259653 232841 133390 217093 -251833 20252 10033 -256202 -111063
11299 60025 104101 -26289 -228556 131022 -284703 -66444 -176843 -129477 -150574 -139225 -103122
$$ packed form
11378A47636K1501o1107c34369E2667N1735K27172a09709D9043b76059A14600
11367b54133j6233H313P0126a9508l43962a27181c5027j32441L7898j19209A4661
11355C07340a76075j16074A65561a01274c3707j33279E8156B0194d8170A66156
11344B02712J83272j71014b8230H4397b26092P2804A49386F7881h6886F7809a79109
11332C3633J97120a70137e9254A22551J73102b28111c7704j34316C2560a00568
11321g4041C46532c4403j25651B91672a46059B91023a50890j32995N8572p656
11311b32969c7181j44315B59653k6812r9451Q3703b51833B0252A0033b56202a11063
11299F0025M4076b6289k02267A31022b84703f6444j10399M7366k1097J1349L6103
$$ plain form
11288 -103122 20011 180514 179784 -350759 -77770 148096 234467 14725 -318509 322708 145862
11276 163059 -135131 -114995 -46270 208833 -57958 -47961 170898 42756 80524 -324169 -69508
11264 97616 29481 -150603 -334600 -68913 -157727 -77427 -187655 23240 117939 238743 -181799
11252 -156460 200923 -117131 239231 -60962 -297708 -194696 170362 133661 -416565 95168
11241 199163 28535 141680 117281 -109467 55384 -284447 -72100 82560 105391 363569 -238803
11229 -117639 -31393 -247438 259385 123554 163239 -70387 -233811 377086 -37424 108346
11218 234914 -103208 118668 -98337 109765 -111522 86694 -333570 126846 -294393 -2010
11207 -366260 -125638 132316 21324 -225720 -217693 85898 -56220 159991 -80819 49846 59712
$$ packed form
11288a03122B0011J60503p30c50759g7770A48096Q6371A4725c18509C22708A45862
11276A63059a35131K0136d6270B08833e7958R997A70898D2756L7768c24169f9508
11264I7616B9481a50603j83997f8913q8814g7427j10228B3240R4699J20804a81799
11252a56460B00923a17131B39231f0962k36746J03012A70362l6701d16565I5168
11241A99163B8535J13145k4399a09467E5384b84447g2100H2560K2831K58178b38803
11229a17639c1393k16045B59385A23554L9685g0387j63424C77086c7424A08346
11218B34914a03208A18668i8337A09765a11522H6694c33570A26846b94393b010
11207c66260a25638A32316B1324b25720Q027H5898e6220A59991h0819D9846R866
$$ plain form
11196 59712 -177904 -51682 -307378 -122676 189321 180785 -278712 -83053 -144717 -205415 224153
11184 -350765 -63246 -94680 113071 8350 -53851 -209697 51733 -135240 -175336 -43128 -1812
11172 -218680 -247011 -84943 -416510 -199713 97285 275006 201507 -329982 -128691 -250511
11162 -250511 -262625 312007 -2223 -49509 -78937 -10464 -67297 -26359 -53251 -77456 148165
11150 280025 138612 198506 208008 -131219 31176 -85706 83304 320212 -29624 282617 20235
11138 87608 -92306 176298 48973 29533 -49274 -114825 -100808 41118 96374 -83039 264822
11126 135150 133105 45813 -5559 33431 117455 1358 -139780 -47021 202957 20566 47046 80428
11114 80428 -8029 151220 246288 -44918 208373 -38711 437240 133782 112808 177627 -107947
$$ packed form
11196E9712a77904e1682k55696a22676A89321q536b78712h3053o1664o0698B24153
11184c50765f3246l1434A13071H350e3851j55846E1733a35240m0096d3128a812
11172b18680k8331h4943l31567a99713I7285J77721p3499c29982a28691j21820
11162b50511j2114C12007b223m7286k9428a0464n6833b6359k6892k4205A48165
11150B80025A38612N9894R502a31219C1176h5706H3304K36908b9624B82617B0235
11138H7608i2306A76298D8973j9440d9274o5551J4017D1118N5256h3039B64822
11126A35150k045D5813e559C3431Q4024A358a39780d7021B02957B0566K6480L3382
11114H0428h029A51220R5068d4918B08373c8711D37240A33782k0974O4819a07947
$$ plain form
11102 -232276 -127254 304231 248834 271289 170725 239487 -92447 449257 336935 366401
11092 366401 218133 252600 102226 430602 444848 415210 223363 17598 44014 176024
11082 176024 8738 212758 182438 243071 41313 189715 -60978 109156 -63446 244000 129273
11071 129273 531210 639017 314775 298607 -7349 426026 204747 271075 234652 596261
11061 596261 428379 593376 588075 776172 391086 821199 782461 410974 554049 756361
11051 756361 494045 872966 715731 527678 798819 871448 537579 1044111 467220 519369
11041 519369 505187 501209 769331 789532 1039700 716832 605467 509818 558972 633905 750963
11030 750963 690046 326021 668557 314896 1007850 754723 691365 743549 533183 912436
$$ packed form
11102b32276J05022C04231n5397K2455j00564O8762i2447D49257j12322K9466
11092C66401j48268L4467A02226L28376J4246k9638j91847A7598K6416J32010
11082A76024H738K04020l0320O0633D1313J48402f0978A09156f3446B44000j14727
11071A29273M01937J07807C14775j6168g349D26026B04747O6328l6423L61609
11061E96261j67882J64997n301J88097l85086M30113l8738l71487J43075K02312
11051G56361k62316L78921j57235j88053K71141P2629l33869N06532D67220N2149
11041E19369j4182l978K68122K0201K50168l22868j11365r5649M9154P4933J17058
11030G50963o0917C26021L42536C14896O92954k53127o3358N2184k10366L79253
$$ plain form
11020 912436 457740 667601 859101 608812 764954 725315 632346 958888 389452 783798
11010 783798 771754 282760 654063 573478 639115 547570 445347 695930 932598 459632
10999 625530 611868 757876 477000 804865 605044 656393 522268 700462 704693 957662
10989 957662 809332 774578 775783 699031 725735 919512 981821 1013846 1088498 1419645 1162074
10978 1162074 1116120 1220584 1538110 1983617 2198401 2067304 2248346 2628109 2652844 3020613
10968 3020613 2634158 2916698 2657113 2028157 2144436 2033142 2032397 1906894 2058723 2347642
10958 2347642 2327237 2460226 2457776 2081568 2287584 1805332 1745168 1503836 1163557 1039143
10948 1039143 1046425 647739 677447 661064 697629 257240 68197 510349 220874 145727 207153
$$ packed form
11020I12436m54696K09861J91500k50289J56142l9639r2969L26542C89452L94346
11010G83798j2044B82760L71303q0585O5637r1545j02223K50583K36668D59632
10999F25530j3662J46008k80876L27865j99821N1349j34125J78194M231K52969
10989I57662j48330l4754J205p6752K6704J93777O2309L2025P4652L31147k57571
10978A162074m5954J04464L17526M45507K14784j31097J81042L79763K4735L67769
10968C020613l86455K82540k59585o28956J16279j11294p45j25503J51829K88919
10958B347642k0405J32989k450l76208K06016m82252o0164k41332l40279j24414
10948A039143P282l98686K9708j6383L6565B57240F8197M42152B20874p5147O1426
$$ plain form
10937 207153 289645 -22983 -117293 117794 119698 17852 64459 91015 57263 -41185 20992
10925 157909 15557 156790 364304 268302 -261934 164166 18542 272284 388408 317197
10915 317197 -202508 38547 50525 -384055 275970 -92439 409585 194934 1170 128408
10905 128408 40406 -255173 -351257 -240406 64816 -235570 210660 6929 -152033 -287489
10895 -287489 -32655 331226 -111426 129088 -258824 17642 134060 -161279 97062 163786
10885 163786 72188 21315 -102379 43498 112497 -264473 -175368 -302385 105084 -106870
10874 47434 67961 317541 -526 -225487 44671 104670 47749 -85592 17592 51535 -377 368001
10861 260097 297058 414136 -130538 -139954 50030 128003 115239 -15309 -278647 -40189 75619
$$ packed form
10937B07153Q2492b2983r4310A17794J904A7852M6607K6556l3752d1185B0992
10925A57909A5557J41233K07514r6002b61934A64166A8542K53742J16124p1211
10915C17197b02508C8547J1978c84055B75970i2439D09585A94934A170J27238
10905A28408D0406b55173r6084J10851F4816b35570B10660F929a52033j35456
10895b87489c2655C31226a11426A29088b58824A7642J16418a61279I7062O6724
10885A63786G2188B1315a02379D3498O8999b64473Q9105j27017A05084a06870
10874D7434K0527K49580e26k24961D4671N9999D7749h5592A7592L3943c77C68001
10861B60097L6961J17078a30538r416E0030P7973j2764a5309k63338d0189G5619
$$ plain form
10849 -104747 -305261 229148 -46274 -225514 48808 -124105 -131534 -44521 33240 -271271 -274206
10838 -274206 445516 32467 197793 -57760 138256 162208 -49104 -135515 -177416 186594 279952
10827 279952 -18011 321174 -117798 254967 -398058 -27403 -232939 -127873 -84597 135296
10816 -86287 -240452 -67008 46036 -67564 27277 -131822 -202443 197831 -183771 -45063 -176212
10805 -176212 -12639 109155 -55385 -59485 146171 -84161 -53007 -138577 50347 205890 -237425
10793 236277 157426 -45961 -421747 -263859 -88470 41254 -11183 3836 139086 -241758 -119340
10781 -16185 -34286 -160830 149732 -154003 15634 -44460 -237289 -192662 122101 -271936
10770 54025 22980 -44000 -109227 4894 -108638 -147666 5163 -20407 141423 241400 35293 19798
$$ packed form
10849a04747k00514B29148d6274j79240D8808a24105p429d4521C3240b71271k935
10838b74206D45516C2467J65326e7760A38256K3952d9104q6411m1901A86594R3358
10827B79952a8011C21174a17798B54967c98058b7403k05536J05066M3276A35296
10816h6287j54165f7008D6036f7564B7277a31822p0621A97831a83771d5063j31149
10805a76212a2639A09155e5385m100A46171h4161L1154q5570E0347J55543b37425
10793B36277p8851d5961l75786J57888h8470D1254a1183C836J35250b41758a19340
10781a6185j8101j26544A49732a54003A5634d4460j92829M4627A22101b71936
10770E4025B2980d4000o5227D894a08638l9028E163b0407A41423R9977C5293j5495
$$ plain form
10758 19798 -8518 -252210 278616 -248382 -96055 166108 -297526 -94345 -35153 -89614 97846
10746 -74357 -139896 174286 -26812 13320 -325475 183883 163608 244172 -36688 -270032 108386
10734 -39882 95827 160026 -125999 -105745 259576 -142799 124725 311593 179713 -115415
10723 -7642 50285 -15886 127261 47565 -240562 146629 158064 -451505 -59566 53740 -103695
10711 -78939 -151883 260942 -229629 85457 78836 -70411 -132598 207190 -197431 39339 -203691
10699 418636 -163139 143132 -329467 213249 -330182 -166111 54423 -440735 165152 -320257
10688 97999 -165598 251075 -221103 -49833 -109317 -16302 97746 -209253 -92882 26255 94621
10677 94621 -208767 -72603 167190 -83290 -62039 -90892 29716 87152 -62884 -124362 -95584
$$ packed form
10758A9798h518k43692B78616b48382i6055A66108b97526i4345c5153n4461I7846
10746g4357o5539A74286b6812A3320c25475A83883k0275Q0564c6688k33344A08386
10734c9882I5827O4199a25999K0254B59576a42799A24725J86868j31880a15415
10723g642E0285a5886A27261D7565b40562A46629J1435d51505e9566E3740a03695
10711g8939p2944B60942b29629H5457o621g0411o2187B07190a97431C9339b03691
10699D18636a63139A43132c29467B13249c30182J64071E4423d40735A65152c20257
10688I7999a65598B51075b21103d9833n9484a6302I7746b09253i2882B6255O8366
10677I4621b08767g2603A67190h3290K1251k8853B9716N7436f2884o1478K8778
$$ plain form
10666 -95584 182161 -197792 -26799 -234135 -62745 218421 -56851 -70494 -32877 -29726 -390799
10655 -390799 -273900 -33207 27583 -174111 -111317 274652 -41882 96883 -49889 -94652 -30066
10643 252810 150918 298920 -23369 -281223 104352 -271427 284409 34166 -95372 -211371
10633 -211371 -129250 -44705 -305871 -137749 -302158 -71087 3134 32599 312986 190009 -394852
10621 -127016 -45733 -24234 -258833 10703 -309778 392444 -287765 91800 249303 99897
10610 -28894 206168 20532 108132 254496 157699 -121311 -154395 24067 -128166 -19954 -251859
10599 -251859 -130447 -251899 2560 114342 -154481 -39774 -53255 -169195 -187644 135979
10588 -164883 -204319 -110495 157039 344440 19736 -190185 -29698 -128590 -311614 -3844 73315
$$ packed form
10666i5584A82161a97792b6799k07336f2745B18421e6851j3643c2877L151l61073
10655c90799J16899c3207B7583a74111O2794B74652d1882I6883d9889m4763c0066
10643B52810j01892J48002b3369k57854A04352b71427B84409C4166i5372j15999
10633b11371Q2121d4705k61166a37749j64409g1087C134K9465K80387j22977c94852
10621a27016d5733K1499k34599A0703c09778C92444b87765I1800J57503I9897
10610b8894B06168B0532Q7600J46364r6797a21311l3084B4067a28166a9954k31905
10599b51859J21412j21452B560J11782a54481c9774j3481j15940j8449A35979
10588a64883l9436R3824A57039J87401A9736a90185b9698r8892j83024c844G3315
$$ plain form
10576 -123487 -28569 -63496 -1754 48153 -162359 -122905 -100303 110690 -253336 -141186 38780
10564 -65459 52017 -385144 -97384 -84300 -148299 178899 -143089 -253456 -137371 -47721 137747
10552 21297 -255989 11881 46326 -238642 -346187 -151062 -50944 183068 -179315 103640
10541 34176 -210320 -2324 -197013 -52893 78405 48488 -117978 -297708 -50653 -156915 -211225
10530 -211225 200440 171784 11162 130810 -285364 -250865 190649 411413 192362 -71728
10519 -150992 -58158 174384 -24193 -59305 224158 81258 187608 199996 -48258 173941 166899
10508 166899 -112371 206379 -145043 129810 80764 149215 51679 -121450 -65919 80779
10497 -59617 -323887 -372254 -157020 -450632 42882 -203649 269576 -347539 -206095 -172337
$$ packed form
10576a23487b8569l4927a754D8153a62359L9454K2602A10690b53336J12150C8780
10564f5459E2017c85144i7384J3084o3999A78899a43089j10367J16085d7721A37747
10552B1297b55989A1881L4445b38642j07545a51062e0944A83068a79315A03640
10541C4176b10320b324j94689e2893G8405k9917a17978j79730e0653j06262n4310
10530b11225B00440k8656A1162J19648b85364L4499A90649K20764A92362g1728
10519a50992e8158A74384b4193l5112B24158H1258J06350J2388d8258A73941p042
10508A66899a12371B06379a45043A29810m9046O8451E1679a21450N5531H0779
10497e9617k64270m8367a57020k93612D2882b03649B69576c47539J41444L3758
$$ plain form
10487 -172337 -57324 274566 242196 333846 23293 130760 192638 428607 693610 410551
10477 410551 298818 113305 188551 -19728 146467 33818 -318816 220655 111408 -9530
10466 -105550 -268881 98128 132257 -364989 9153 27913 -215426 -220166 4542 154777 89495
10455 89495 -3770 -40303 -115710 -253357 -177248 -286529 -167615 20215 246356 113773 98508
10444 98508 8744 -255848 62059 93295 83660 -167830 9215 326487 -336877 148113 -170011
10432 58196 -184448 -36604 107360 4116 -349766 -2509 -34145 286764 -357156 104224 172755
10421 172755 5926 145787 111818 -99162 267713 -226256 -91686 68035 78974 -199467 239339
10409 382231 -102129 -9188 100657 187261 -371933 -81697 127307 -45602 -14252 257401 121093
$$ packed form
10487a72337e7324B74566l2370R1650B3293J07467O1878K35969K65003k83059
10477D10551j11733A13305P5246a9728A46467C3818c18816B20655j09247i530
10466a05550j63331I8128L4129c64989I153J8760b15426m740D542J50235o5282
10455H9495c770l6533p5407j37647P6109j09281J18914B0215K26141A13773j5265
10444I8508H744b55848F2059L1236r635a67830I215L17272c36877A48113a70011
10432E8196a84448c6604A07360D116c49766b509l1636B86764c57156A04224O8531
10421A72755E926J39861l3969i9162B67713b26256i1686F8035J0939a99467B39339
10409C82231a02129i188A00657Q6604c71933h1697A27307d5602a4252B57401A21093
$$ plain form
10397 -4763 -13002 -98180 -260801 65624 595369 303013 -141886 -33833 54086 91876 50251
10386 50251 518867 63549 75567 -48036 -139299 225882 -180709 211583 155493 270897 167847
10375 167847 247731 -140082 398495 40366 232384 442721 465466 175966 261981 591703
10365 591703 377394 525335 388368 257109 388028 384428 467694 433522 232534 275817
10355 275817 256377 369595 309479 781785 256009 639270 662541 435075 236653 335569
10345 335569 455262 586674 567472 369299 193034 28383 186195 4721 199416 64838
10334 79216 282020 144586 -62992 193298 71080 -172135 179959 60165 33503 179563
10324 179563 120924 477637 220972 340491 303591 -4857 368761 89915 496495 -235736
$$ packed form
10397d763q239q5178j62621F5624N29745k92356a41886c3833E4086L7790m1625
10386E0251M68616F3549J2018d8036r1263B25882a80709B11583n6090J15404j03050
10375A67847P9884a40082C98495D0366J92018K10337K2745A75966Q6015L29722
10365E91703k14309J47941j36967j31259J30919l600Q3266l4172k00988M3283
10355B75817j9440J13218o0116M72306B56009L83261K3271k27466j98422R8916
10345C35569J19693J31412j9202j98173j76265B8383J57812D721J94695F4838
10334G9216K02804j37434f2992A93298G1080a72135A79959F0165k6662J46060
10324A79563n8639L56713B20972J19519l6900d857C68761H9915M06580b35736
$$ plain form
10313 140133 247114 -291892 -103453 61363 -44579 -165140 -82950 -80591 219453 -249345
10302 -27851 16331 -324367 282933 -11173 -182590 313331 202390 57196 -315912 231407
10291 285811 397557 18284 123250 -251564 -66227 -329573 22385 -176348 129602 -261219
10280 -36452 256068 -99421 -211619 24545 -256791 134109 -65521 -18564 115473 327798
10270 327798 -55446 -46118 135956 4689 -73051 152873 136217 48673 165775 223676 200824
10259 200824 385981 414474 283781 299141 346434 188659 169687 162286 -124709 68968 135070
10248 135070 123448 93171 24877 -258241 110057 -288493 123684 10890 -72424 51258 353728
10237 353728 -244105 367063 -36605 -316453 34874 51432 53614 -249906 -334512 -69218 -235771
$$ packed form
10313A40133J06981b91892a03453F1363d4579j20561Q2190K359B19453b49345
10302b7851A6331c24367B82933a1173j71417C13331j10941E7196c15912B31407
10291B85811J11746A8284J04966b51564f6227k63346B2385a76348A29602b61219
10280c6452B56068i9421j12198B4545b56791A34109f5521a8564A15473K12325
10270C27798e5446R328A35956D689g3051A52873j6656D8673J17102N7901k2852
10259B00824J85157K8493j30693J5360M7293j57775j8972p401a24709F8968O6102
10248A35070j1622l0277B4877b58241A10057b88493A23684A0890g2424E1258L02470
10237C53728b44105C67063c6605k79848C4874J6558K182b49906q4606f9218j66553
$$ plain form
10226 -235771 -62927 -91330 13241 -373462 123946 -102341 -178073 -147780 -79236 42090 -52702
10214 -280504 134911 -142318 -105855 25278 -1286 -256215 -59416 -63800 127424 -166272 -40165
10202 -49166 -64969 59556 -307712 -234670 92348 79978 -117560 -260883 -83708 -203966 -425704
10191 -425704 74941 -268287 62614 93097 201377 67545 3096 -74195 -148847 440270 -434955
10179 -262095 -129123 -240713 39772 -265911 124860 -47406 321750 -118761 -239785 76972
10168 -10497 -61573 172754 -88169 91814 -66469 -98019 -82088 30081 134137 8700 35318
10157 35318 -44464 -358418 -160255 -195942 113712 62831 -52443 -209356 -117515 -140702 200506
10145 -83244 -163740 74775 -224448 -123560 13742 29037 -70142 221678 -334337 -285027 -10683
$$ packed form
10226b35771f2927k8403A3241c73462A23946a02341p5732L0293O8544D2090e2702
10214b80504A34911a42318L6463B5278a286k54929e9416m384A27424a66272d0165
10202d9166j5803E9556c07712P3042I2348j2370a17560j43323h3708j20258k21738
10191d25704G4941b68287F2614L0483J08280F7545C096g4195p4652D40270d34955
10179b62095a29123j11590C9772b65911A24860d7406C21750a18761j21024G6972
10168a0497n1076A72754h8169I1814f6469l1550J5931C0081J04056H700K6618
10157C5318d4464l13954a60255l5687A13712n0881e2443j56913R1841k3187B00506
10145h3244q0496G4775b24448J00888A3742J5295g0142B21678c34337M9310a0683
$$ plain form
10133 22831 -80467 -67014 67343 -125197 -317134 112750 -263063 -336661 269173 133 -144367
10121 -32432 156006 -213963 -350527 -157595 34537 -74702 -149066 75851 77460 -187195 -410532
10110 -410532 71796 44037 -255394 178912 -11960 -194137 -169264 -165464 -276664 105944 -33044
10098 -79780 309848 -398138 50716 36250 163323 67241 -59121 -70800 -281350 81820 -257455
10086 246375 -16063 -193246 -283530 -93598 -28561 16357 16572 8144 -34063 114031 275343
10075 275343 -66260 -60077 -16346 -376406 -110691 -25947 -97358 -4019 117462 78238 -64648
10063 -430067 121372 -100418 -156955 61182 -84144 67271 -142012 -167769 -219878 -39462 48784
10051 956 -66209 139737 -290374 -88358 -27738 -46556 -343151 -164023 -47986 325167 -58068
$$ packed form
10133B2831h0467J3453F7343a25197j91937A12750b63063p3598B69173A33a44367
10121c2432A56006b13963j36564a57595C4537g4702p4364G5851J609a87195k23337
10110d10532G1796k7759b55394A78912a1960j82177K4873L800j11200A05944c3044
10098g9780C09848c98138E0716j4466J27073F7241e9121j1679k10550H1820b57455
10086B46375a6063j77183r0284i3598b8561A6357K15H144c4063A14031J61312
10075B75343f6260O183a6346l60060a10691b5947p1411d019A17462l9224f4648
10063d30067A21372a00418n6537F1182h4144F7271a42012k5757n2109c9462D8784
10051I56f6209A39737b90374h8358b7738j8818k96595a64023d7986C25167e8068
$$ plain form
10039 -324364 -256563 190898 121416 82051 -31884 -231690 44545 -49254 42948 383951 -168621
10027 221101 -48134 -223153 -56793 210547 -112743 -284350 -268487 71220 13073 -404125
10016 -82571 -130634 -134699 -27587 -275925 -244964 -42016 76691 114904 -18933 -348088 -278393
10005 -278393 138423 -76202 -32780 -274925 -31070 142402 45383 157275 -30527 70293 -343371
9993 -102871 9923 150897 -41854 -446031 -12821 -411473 -156830 -12568 -144613 -86818 71626
9981 -21820 -260570 -123045 87295 19746 -61843 190064 211582 51778 116576 -156455 56281
9969 122088 120386 26448 -390144 -7391 150795 94917 -193948 219388 -24166 -25079 -6745 46648
9956 -95579 90694 107635 -143876 -262598 30985 76137 -377956 23574 -115646 -95917 -115352
$$ packed form
10039c24364O7801A90898o9482l9365c1884j99806D4545d9254D2948L41003a68621
10027B21101d8134j75019e6793B10547a12743j71607J5863G1220A3073d04125
10016h2571m8063m065b7587k48338L0961d2016G6691L8213a8933l29155O9695
10005b78393A38423g6202c2780k42145c1070A42402D5383J11892c0527G0293c43371
9993a02871I923J40974d1854m04177a2821l98652a56830a2568j32045N7795G1626
9981b1820k38750a23045H7295A9746f1843A90064K1518E1778O4798a56455E6281
9969A22088j702B6448c90144g391A50795n5878a93948B19388b4166r13f745D6648
9956i5579I0694J6941a43876j18722C0985M5152c77956B3574a15646J9729j9435
$$ plain form
9945 -115352 -218467 -108901 -136539 -22496 108010 68023 -78793 -135107 -129561 -210232 -77896
9933 36854 -107132 146 27967 -310986 65959 129529 -117407 72181 119461 36807 28999 -392970
9920 -47635 -26100 54203 30815 -203643 70057 243262 -297000 -36158 -72862 261732 -245515
9908 -30210 -177267 -92639 -111649 -44417 68339 156840 -237935 -55629 -526114 112938 -182238
9896 -63871 28248 -267086 21730 1143 26509 230439 55716 47023 -312215 -209766 83578
9884 -335870 -149092 108099 -372725 -149670 -9592 -53189 -243302 -121227 -10719 -80039 -113242
9873 -113242 -155442 -27052 155437 135594 -140927 -200946 -307834 324982 54343 -1564 179715
9861 -276732 -426914 -54463 -278624 259033 -223889 151198 -288682 -206492 -159625 -46396
$$ packed form
9945a15352j03115a08901k7638b2496A08010l9987g8793n6314N546q0671g7896
9933C6854a07132A46K7821c10986F5959O3570a17407G2181M7280C6807p808c92970
9920d7635K1535E4203k3388b03643G0057J73205b97000c6158l6704B61732b45515
9908c0210j47057Q4628j9010d4417F8339Q8501b37935e5629m70485A12938a82238
9896f3871B8248b67086B1730A143K5366K03930E5716q693c12215J02449H3578
9884c35870a49092A08099c72725a49670i592m3597j90113a21227a0719o9320l3203
9873a13242m2200b7052A55437j9843a40927o0019j06888C24982E4343a564A79715
9861b76732j50182e4463k24161B59033b23889A51198b88682Q2190M6867d6396
$$ plain form
9850 111673 -381693 -91013 -303761 59568 -84177 -100386 -209789 -383621 -6950 102541 -184357
9838 -148569 273788 91799 -132276 17649 -191703 45602 -66898 -262133 -89049 166855 40903
9826 -136904 145132 38963 -203876 -267363 165583 -28671 -305043 69993 -69322 126954 -102969
9814 -49488 -146673 13403 34157 -74214 54529 -78579 90854 -187634 -213347 -133971 -22141 -327153
9802 -327153 -40314 -262387 -60552 -123384 179065 -87002 -141900 -211286 -191808 -62917 -24605
9790 -75340 -296027 36141 -47358 162832 319134 -294378 24333 -289461 -129267 92343 -28821
9778 -286142 174904 -13664 -121485 247015 -5653 -411018 187975 66149 -329426 67080 -90133
9766 -327045 -95273 -357120 -113003 -277115 -165962 23834 -116883 57646 -77381 4811 -185984
$$ packed form
9850A11673c81693i1013k12748E9568h4177j6209j09403j73832f950A02541a84357
9838a48569B73788I1799a32276A7649a91703D5602f6898j95235h9049A66855D0903
9826a36904A45132C8963b03876o3487A65583b8671k76372F9993f9322A26954a02969
9814d9488r7185A3403K0754g4214E4529g8579I0854a87634k5713P9376b2141l05012
9802c27153d0314k22073f0552o2832A79065h7002n4898o9386J9478f2917b4605
9790g5340k20687C6141d7358A62832J56302b94378B4333b89461a29267I2343b8821
9778b86142A74904a3664j07821B47015e653m05365A87975F6149c29426F7080i0133
9766c27045i5273k61847a13003j64112J11153B3834a16883E7646g7381D811a85984
$$ plain form
9754 11554 460000 131897 -283123 -116967 335086 -183803 -207384 123726 -25399 -11607
9743 140438 10776 -258945 201294 -378691 -232299 -144090 -105819 -46965 104507 -25860 -98906
9732 -98906 -82696 -264057 -126508 -62460 145982 -72761 21660 -84444 -229911 -116528 -164038
9721 -164038 145995 171020 -100394 -130505 1862 -266653 221029 -213053 -160466 12092 -312128
9709 -261177 -22660 31028 -449683 -169490 34336 106974 -241327 -92838 -215074 -207936 122649
9697 -84813 -56449 -124807 -35573 -4832 43224 -173942 69588 78044 214332 -138514 -8210 -26828
9685 -26828 -156350 267064 -54184 -224446 -328420 -46641 -165881 43954 -197317 -38439 -214445
9674 -214445 -356393 -463826 13245 -208882 -196546 -126920 -544008 -412879 -26635 -360507
$$ packed form
9754A1554M48446A31897b83123a16967C35086a83803k3581A23726b5399a1607
9743A40438A0776b58945B01294c78691J46392Q8209L8271d6965A04507b5860p3046
9732i8906J6210j81361a26508f2460A45982g2761B1660h4444j45467J13383m7510
9721a64038A45995K5025a00394l0111A862b66653B21029b13053N2587A2092c12128
9709b61177b2660C1028d49683a69490C4336P2638b41327i2838j22236P138A22649
9697h4813K8364o8358c5573d832D3224a73942F9588Q456J36288a38514h210j8618
9685b6828j29522B67064e4184j70262j03974d6641j19240D3954a97317c8439j76006
9674b14445j41948j07433A3245b08882J2336O9626m17088J31129b6635l33872
$$ plain form
9664 -360507 261717 248738 -8599 104676 224140 -243177 114638 -330922 -72723 -230208
9654 -230208 -35053 -56595 100578 -323936 108741 317735 -119928 2217 -79777 110780 31981
9642 127541 -91428 97212 -179543 -65233 -359405 185140 -163465 114467 -35541 145482
9631 -211289 -198003 -96229 -408272 -24708 324434 -361279 172480 102277 -6919 -33971 -90572
9620 -90572 -443876 39515 -195851 -57328 124018 -118642 164160 -45001 -106867 213604 -209138
9608 -420133 -220480 -339514 55402 -180448 -254218 31312 -146643 50232 165429 337974
9598 337974 101330 -70765 -458147 -41891 -247620 158578 -11484 112561 15833 -179371
9587 -65937 35986 -240325 24407 63487 -132969 -145345 105874 -20388 -348361 -149103 97053
$$ packed form
9664c60507B61717j2979h599A04676J19464b43177A14638c30922g2723j57485
9654b30208c5053k1542A00578c23936A08741K08994a19928B217g9777A10780C1981
9642A27541i1428I7212a79543f5233k94172A85140a63465A14467c5541A45482
9631b11289J3286i6229l12043b4708C24434c61279A72480p0203f919k7052n6601
9620i0572l53304C9515a95851e7328A24018a18642A64160d5001o1866B13604b09138
9608d20133J99653j19034E5402a80448p3770C1312a46643E0232J15197J72545
9598C37974A01330g0765l87382d1891k05729A58578a1484A12561A5833a79371
9587f5937C5986b40325B4407L9080a32969j2376A05874b0388l27973a49103I7053
$$ plain form
9575 22093 129853 54780 -31524 97605 -225997 -162330 -578171 167621 226425 242728 -366205
9563 241059 -27524 -110248 -25829 -67950 -43203 -328308 175289 -192438 150933 -253727 -506455
9552 -506455 -86656 55735 28279 -28442 -193023 326713 38161 216710 60235 -53092 -85617
9541 -85617 31036 117808 172986 147440 -193386 -401341 -211774 -16398 -211949 -318063 20408
9529 -318383 137939 79621 -14459 -418265 -319262 23619 -440065 -129106 73086 -253396 -515826
9518 -515826 38137 -117056 -91936 -408904 -475218 15544 -235299 123220 -116965 80901 -334944
9506 112339 117977 -192312 -118080 -49424 134863 -221372 -36881 -146041 59637 85569 -473838
9494 -414003 -75199 -189686 36210 139114 -52716 82654 -35459 -258333 -266574 -41576 -58347
$$ packed form
9575B2093J07760E4780c1524I7605b25997O3667m15841A67621N8804J6303c66205
9563B41059b7524q2724b5829m2121K4747k85105A75289a92438A50933b53727k52728
9552e06455h6656E5735k7456b8442j64581C26713C8161J78549F0235e3092l2525
9541h5617C1036Q6772N5178k5546a93386k07955J89567a6398j95551j06114B0408
9529c18383A37939n8318a4459m03806R9003B3619d40065a29106G3086b53396k62430
9518e15826C8137a17056K5120l16968o6314A5544b35299A23220a16965H0901c34944
9506A12339N638a92312P4232d9424A34863b21372c6881j09160E9637K5932d73838
9494d14003g5199j14487C6210J02904e2716H2654c5459k22874q241d1576j6771
$$ plain form
9483 -58347 -81351 -298811 -121554 76070 142568 76555 -181321 -63157 -253728 61006 -321299
9471 -5889 -194657 -66942 -61555 117205 123035 -1562 -208500 227331 -113846 44162 -194535
9459 -155504 9861 -205568 -182502 -242022 253099 -880 -281559 143539 -126062 -225565 34568
9447 -118631 231652 19751 143103 62637 -202287 -14556 -191957 -205821 -207860 -69519 -307429
9436 -307429 -438991 166339 210449 -304721 93029 -50361 52047 83784 -22630 -22263 -93527
9425 -93527 49191 2713 -212595 -181273 -225346 73736 -492849 101698 99267 90392 268086 -106305
9412 -1396 -19225 80138 154050 -254272 -354336 -193431 -54212 -155331 263318 -244575 -238762
9401 -238762 153116 129864 -96069 245586 -324182 307235 -159105 79102 -208852 -112565
$$ packed form
9483e8347k3004k17460a21554G6070O6498o6013a81321f3157j90571F1006c21299
9471e889j88768f6942N387A17205N830a562k06938B27331a13846D4162a94535
9459a55504I861b05568K3066n9520B53099h80k80679A43539a26062r9503C4568
9447a18631B31652A9751J23352F2637b02287a4556j77401j3864k039f9519k37910
9436c07429j31562A66339M4110c04721I3029e0361E2047L1737b2630L67p1264
9425i3527D9191B713b12595L1322m4073G3736d92849A01698k431q875J77694a06305
9412a396j7829H0138P3912b54272j00064J60905e4212j01119B63318b44575N813
9401b38762A53116k3252i6069B45586c24182C07235a59105G9102b08852R6287
$$ plain form
9391 -112565 -468874 -167132 87012 63536 -55471 139691 21853 -21560 88462 -103901 -24882
9379 -213703 -26391 -46349 -223427 100214 -167946 -80277 9322 -188481 27798 -240432 -227909
9368 -227909 72309 10727 -24281 -113608 -79613 -97059 -380147 -71330 -102480 -12113 -84593
9357 -84593 -308824 -356155 66972 -120877 -13560 -506 -366734 110025 -243768 -47059 402044
9345 -154720 184692 -252096 -183286 -20871 -45838 -60278 167626 -130781 114890 192593 -39418
9333 130275 -175933 56333 -61662 -55279 -52454 -40598 -241545 80652 28501 93034 159262 -29351
9320 24418 97719 -43379 -2597 -294926 -20583 10617 -465159 52106 -29541 33076 -514432
9308 -44106 -151990 46925 68319 -136311 -102548 -18082 43648 -137689 122254 -152628 120893
$$ packed form
9391a12565l56309a67132H7012k3476e5471A39691B1853b1560H8462a03901b4882
9379b13703b6391j9958j77078A00214a67946h0277I322a88481B7798b40432J2523
9368b27909G2309A0727b4281q9327L3995j7446k83088g1330l1150a2113p2480
9357h4593k24231m7331F6972a20877a3560e06l66228A10025b43768d7059D02044
9345a54720A84692b52096O8810b0871k4967j4440A67626a30781A14890P7703c9418
9333A30275a75933E6333f1662O383K825J1856k00947H0652B8501O4533O6228b9351
9320B4418P3301d3379b597k92329b0583A0617d65159E2106b9541C3076e14432
9308d4106j07884D6925K1394a36311L3763a8082D3648a37689A22254a52628A20893
$$ plain form
9296 -158806 -184087 -225208 -245694 -235318 -73016 -82038 -193775 13133 -434226 -330686 128258
9284 -123613 -138938 96567 -31703 -21793 -359348 -217524 -137211 -105515 -195151 175092 -13735
9272 -12752 121418 -166664 71150 -215857 230673 -380359 -237361 -191147 161072 123420
9262 123420 -4145 28844 -384267 215769 23262 240566 47332 5334 -123302 -4355 6239 81530
9250 81530 2374 64703 295569 78006 72963 115620 -75922 -114602 -244596 -132027 -79564 -58273
9238 -58273 -291167 -145541 -295058 57506 49475 -12492 -99297 -207833 49070 12218 -58792
9226 -78463 -448955 -336695 -219083 -270581 17453 -84331 -99463 9284 -222318 279765 44047
9214 -260885 -274823 5571 112314 -269888 347420 272773 414937 -119638 -57995 -19375 156404
$$ packed form
9296a58806k5281m1121k0486J0376g3016r022j11737A3133d34226J03540A28258
9284a23613j5325I6567c1703R910l37555J41824Q0313L1696q9636A75092a3735
9272a2752A21418a66664G1150b15857B30673c80359J42998M6214A61072l7652
9262A23420d145B8844c84267B15769B3262K17304D7332E334a23302d355F239P5291
9250H1530B374O2329K30866G8006n043M2657g5922l8680j29994J12569N2463K1291
9238e8273k32894a45541j49517E7506q031a2492q6805j08536D9070A2218e8792
9226g8463l70492J12260J17612n1498A7453h4331j5132I284b22318B79765D4047
9214b60885j3938E571J06743b69888C47420p4647J42164a19638e7995a9375A56404
$$ plain form
9202 -19693 -367858 -134306 86473 106017 -284779 65785 -41116 -95759 203361 -49475 -188697
9191 -188697 107399 -150614 -503316 -55278 -156660 -58808 28321 -465753 -5029 -2202 -399164
9180 -399164 -217103 -71958 -15701 18775 -142678 119248 -60653 -186041 60676 -118797 -75487
9169 -75487 -4811 60686 188996 -230816 22355 33974 -429487 -139073 -61066 -272691 -116125
9157 -214289 -93792 -330471 210004 -168622 -17972 -132106 -327073 -104537 -83980 73665
9146 64338 -151540 -259041 -136828 -188174 120210 -62916 85190 18923 246669 49025 -19611
9134 129497 135884 332680 15272 203855 -201394 -106353 -163795 78775 288229 -1258 -205173
9123 -205173 -74996 -48641 -206041 -3378 32050 -97045 221439 -283400 3711 -171640 -274754
$$ packed form
9202a9693l48165a34306H6473J9544b84779F5785d1116n4643B03361d9475j39222
9191a88697A07399a50614l52702e5278j01382e8808B8321d65753e029b202l96962
9180c99164J82061g1958a5701A8775a42678A19248f0653j25388F0676a18797M3310
9169g5487d811F0686J28310b30816B2355J1619d29487a39073f1066k11625a16125
9157b14289i3792k36679B10004a68622a7972j14134j94967a04537K0557G3665
9146F4338a51540j07501J22213n1346A20210f2916H5190A8923K27746D9025a9611
9134A29497O387J96796A5272J88583b01394R5041n7442G8775K09454a258k03915
9123b05173g4996K6355j57400c378C2050i7045B21439b83400C711a71640j03114
$$ plain form
9112 -274754 -49602 116202 -170577 -176516 139267 -244383 -346297 -222942 -123021 -7108 -16465
9101 -16465 -115889 -31288 130216 -166967 -103841 54912 -115740 13490 19066 -289221 -220034
9090 -220034 -11687 -153217 43935 24093 10025 56007 -229535 -307906 -33386 -166990 -96831
9079 -96831 -90385 107836 118181 -113552 -54781 -239958 -218546 -249823 -332219 57979 -7250 -32348
9067 -32348 1757 49434 43398 -132370 164422 -26370 -140910 -104440 -165313 -349359 -214953
9056 -214953 -68831 -341607 -174427 105988 114705 -230649 -23620 14134 -118299 -369232 97162
9044 -446048 61887 -101317 -110939 -423921 -297721 155983 -230602 -64109 -65958 168746 129582
9033 129582 -203863 -150052 -450377 185496 -70621 60262 -297568 -105219 100061 -70934
$$ packed form
9112b74754d9602A16202a70577n939A39267b44383j01914J23355R9921g108r357
9101a6465r9424c1288A30216a66967O3126E4912a15740A3490N576b89221O9187
9090b20034a1687j41530D3935j9842A0025M5982b29535p8371c3386j33604P0159
9079i6831O446A07836J0345a13552e4781j85177K1412l1277q2396E7979g250k5098
9067c2348A757M7677o036a32370A64422b6370j14540L6470o0873j84046J34406
9056b14953f8831k72776J67180A05988Q717b30649b3620A4134a18299k50933I7162
9044d46048F1887a01317r622l12982J26200A55983b30602f4109j849A68746l9164
9033A29582b03863N3811l00325A85496g0621F0262b97568a05219A00061g0934
$$ plain form
9022 69211 -15001 48609 51741 -294779 -73326 -153304 123480 -91845 30964 -543842 -128494
9010 -226404 -332203 192481 5325 -218943 110447 -148176 130838 113402 -360904 41375
8999 311780 -42508 88474 64920 7419 -156593 -418497 116 -21265 -180216 -134684 -5289 -152092
8987 -152092 -296627 -73877 105275 -41609 202468 168057 -76843 272703 172247 149681 65690
8975 -247179 -150098 -222737 100367 238123 60957 -31588 -205602 163576 -25723 -140925 36480
8963 139575 177887 -251351 -276226 -174884 68861 -180238 125318 109285 -169505 -150660 100488
8951 -277226 -50566 23873 27832 -51714 -122422 -64990 -239687 -152642 -109592 -185567 53480 -210118
8938 80128 -142842 259907 -24694 92049 227525 207171 -23673 89901 -145971 -159069 -233769
$$ packed form
9022F9211a5001D8609L132b94779g3326p9978A23480i1845C0964e43842a28494
9010b26404j05799A92481E325b18943A10447a48176A30838j7436c60904D1375
8999C11780d2508H8474k3554G419a56593k61904A16b1265j58951M5532e289j46803
8987a52092j44535g3877A05275d1609B02468l4411g6843B72703j00456k2566F5690
8975b47179R7081p2639A00367J37756F0957c1588j74014A63576b5723j15202C6480
8963A39575L8312b51351k4875J01342F8861a80238A25318j6033a69505J8845A00488
8951b77226e0566B3873L959e1714p0708N7432j74697Q7045M3050p5975E3480b10118
8938H0128a42842B59907b4694I2049J35476k0354b3673H9901a45971j3098p4700
$$ plain form
8927 -233769 -48902 -80976 91807 537575 978856 2930714 10233970 4106458 1862814 900410
8916 -40596 486874 75618 -20559 -248385 136354 82457 -48033 186063 325834 -277493 225565
8904 -317225 45503 195219 -52652 -13610 -25402 206777 -80590 -196489 -461469 -411378 42266
8892 271433 -29182 -301520 -139248 -211864 226552 -275870 111592 -80483 -188897 -338747
8882 -338747 -178293 341472 -102870 45215 -149762 -289464 218290 196185 -282473 169985
8871 40406 263235 -142866 -104072 106235 -224751 194639 38788 -87085 87313 -249828 -6478
$$ packed form
8927b33769d8902l2074I1807M45768M41281J951858P303256D106458A862814I00410
8916d0596D86874G5618b0559k27826A36354n3897d8033A86063J39771b77493B25565
8904c17225D5503J49716e2652a3610j1792B06777h0590j15899k64980N0091D2266
8892B71433b9182k72338a39248p2616B26552b75870A11592h0483j08414j49850
8882c38747J60454C41472a02870D5215a49762j39702B18290k2105b82473A69985
8871D0406K22829a42866L8794A06235b24751A94639C8788h7085H7313b49828f478
$$ [...]
##END NTUPLES=NMR SPECTRUM
##END=
