##TITLE=AC1625_CENAH_8450316_X6tz9YAGww
##JCAMPDX= 6.0         $$ Bruker NMR JCAMP-DX V2.0
##DATA TYPE= NMR SPECTRUM
##DATA CLASS= NTUPLES
##ORIGIN= BRUKER
##OWNER= Administrator
$$ 1.72 TOPSPIN		Version 2.1
$$ 2015-07-31 08:02:44.619 -0700  Administrator@X
$$ Compression mode = diff/dup
##.OBSERVE FREQUENCY= 400.02188249412
##.OBSERVE NUCLEUS= ^1H
##.ACQUISITION MODE= SIMULTANEOUS (DQD)
##.ACQUISITION SCHEME= undefined
##.AVERAGES= 64
##.DIGITISER RES= 22
##SPECTROMETER/DATA SYSTEM= spect
##.PULSE SEQUENCE= noesygpps1d.comp
##.SOLVENT NAME= COFFEE_meoh
##.SHIFT REFERENCE= INTERNAL, COFFEE_meoh, 1, 14.96118
##AUDIT TRAIL= $$ (NUMBER, WHEN, WHO, WHERE, PROCESS, VERSION, WHAT)
$$ ##TITLE= Audit trail, TOPSPIN		Version 2.1
$$ ##JCAMPDX= 5.01
$$ ##ORIGIN= Bruker BioSpin GmbH
$$ ##OWNER= Administrator
$$ $$ E:\/data/COFFEE/nmr/AC1625_CENAH_8450316_X6tz9YAGww/32/pdata/1/auditp.txt
$$ ##AUDIT TRAIL=  $$ (NUMBER, WHEN, WHO, WHERE, PROCESS, VERSION, WHAT)
(   1,<2014-02-18 13:54:07.711 -0800>,<Administrator>,<X>,<go>,<TOPSPIN 2.1>,
      <created by zg
	started at 2014-02-18 13:42:38.475 -0800,
	POWCHK enabled, PULCHK disabled,
       configuration hash MD5:
       C8 4E 4E 5D D3 5C D8 9E 9F 52 82 E0 59 8A DE 15
       data hash MD5: 64K
       B3 0C 60 AB 6D 78 B3 F9 0E 75 D6 58 11 97 9C AC>)
(   2,<2014-02-18 13:54:10.867 -0800>,<Administrator>,<X>,<proc1d>,<TOPSPIN 2.1>,
      <Start of raw data processing
       efp LB = 0.3 FT_mod = 6 PKNL = 1 PHC0 = 0 PHC1 = 0 SI = 128K 
       data hash MD5: 128K
       54 78 F9 8C 92 42 CF 48 DD A6 54 D1 9F F1 F1 1A>)
(   3,<2014-02-18 13:54:12.086 -0800>,<Administrator>,<X>,<proc1d>,<TOPSPIN 2.1>,
      <pk PHC0 = -74.20715 PHC1 = 0 
       data hash MD5: 128K
       95 E0 D5 7D A7 A0 E5 79 50 09 D0 F9 A4 8D 11 D8>)
(   4,<2014-02-18 13:54:12.508 -0800>,<Administrator>,<X>,<proc1d>,<TOPSPIN 2.1>,
      <abs ABSG = 1 
       data hash MD5: 128K
       64 1B 0C 6C 80 C5 A1 CE 31 08 20 B7 76 95 EE FA>)
(   5,<2014-02-18 13:54:12.649 -0800>,<Administrator>,<X>,<proc1d>,<TOPSPIN 2.1>,
      <abs ABSG = 2 
       data hash MD5: 128K
       28 77 4A 9D 91 43 4B 38 03 FE 72 6D 73 93 E4 CB>)
(   6,<2014-02-18 13:54:12.727 -0800>,<Administrator>,<X>,<proc1d>,<TOPSPIN 2.1>,
      <abs ABSG = 3 
       data hash MD5: 128K
       C4 3C 0B 38 B2 AC D9 AE 43 5E 75 1B 24 EC 59 7C>)
(   7,<2014-02-18 13:54:12.805 -0800>,<Administrator>,<X>,<proc1d>,<TOPSPIN 2.1>,
      <abs ABSG = 4 
       data hash MD5: 128K
       D1 2F 8C 6C EA E7 BC 5F EF 74 48 35 F9 E0 CA E6>)
(   8,<2014-02-18 13:54:12.914 -0800>,<Administrator>,<X>,<proc1d>,<TOPSPIN 2.1>,
      <abs ABSG = 5 
       data hash MD5: 128K
       CC 21 42 10 37 0B 08 51 AD 3F 66 72 5E E1 C8 B1>)
(   9,<2014-02-18 13:54:15.445 -0800>,<Administrator>,<X>,<audit>,<TOPSPIN 2.1>,
      <user comment:
       ICON-NMR User ID: COFFEE
       data hash MD5: 128K
       CC 21 42 10 37 0B 08 51 AD 3F 66 72 5E E1 C8 B1>)
$$ ##END=
$$ 
$$ $$ hash MD5
$$ [...]
##$TP07= 0
##$TPNAME0= <>
##$TPNAME1= <>
##$TPNAME2= <>
##$TPNAME3= <>
##$TPNAME4= <>
##$TPNAME5= <>
##$TPNAME6= <>
##$TPNAME7= <>
##$TPOAL= (0..7)
0.5 0.5 0.5 0.5 0.5 0.5 0.5 0.5
##$TPOFFS= (0..7)
0 0 0 0 0 0 0 0
##$TUNHIN= 0
##$TUNHOUT= 0
##$TUNXOUT= 0
##$USERA1= <user>
##$USERA2= <user>
##$USERA3= <user>
##$USERA4= <user>
##$USERA5= <user>
##$V9= 5
##$VALIST= <valist>
##$VCLIST= <CCCCCCCCCCCCCCC>
##$VD= 0
##$VDLIST= <DDDDDDDDDDDDDDD>
##$VPLIST= <PPPPPPPPPPPPPPP>
##$VTLIST= <TTTTTTTTTTTTTTT>
##$WBST= 2048
##$WBSW= 25
##$XGAIN= (0..3)
0 0 0 0
##$XL= 0
##$YL= 0
##$YMAX_a= 6315494
##$YMIN_a= -14705636
##$ZGOPTNS= <>
##$ZL1= 120
##$ZL2= 120
##$ZL3= 120
##$ZL4= 120
##$ABSF1= 14.96118
##$ABSF2= -5.597002
##$ABSG= 5
##$ABSL= 3
##$ALPHA= 0
##$AQORDER= 0
##$ASSFAC= 0
##$ASSFACI= 0
##$ASSFACX= 0
##$ASSWID= 0
##$AUNMP= <proc_prof1d_extract.lims>
##$AXLEFT= 0
##$AXNAME= <>
##$AXNUC= <1H>
##$AXRIGHT= 0
##$AXTYPE= 0
##$AXUNIT= <>
##$AZFE= 0.1
##$AZFW= 0.1
##$BCFW= 0
##$BC_mod= 0
##$BYTORDP= 0
##$COROFFS= 0
##$CY= 15
##$DATMOD= 1
##$DC= 0
##$DFILT= <>
##$DTYPP= 0
##$F1P= 0
##$F2P= 0
##$FCOR= 0.5
##$FTSIZE= 131072
##$FT_mod= 6
##$GAMMA= 0
##$GB= 0
##$INTBC= 1
##$INTSCL= 1
##$ISEN= 128
##$LB= 0.3
##$LEV0= 0
##$LPBIN= 0
##$MAXI= 10000
##$MC2= 0
##$MEAN= 0
##$ME_mod= 0
##$MI= 0
##$NCOEF= 0
##$NC_proc= -2
##$NLEV= 6
##$NOISF1= 0
##$NOISF2= 0
##$NSP= 0
##$NTH_PI= 0
##$NZP= 0
##$OFFSET= 14.96118
##$PC= 1
##$PHC0= -74.20715
##$PHC1= 0
##$PH_mod= 1
##$PKNL= yes
##$PPARMOD= 0
##$PPDIAG= 0
##$PPIPTYP= 0
##$PPMPNUM= 2147483647
##$PPRESOL= 1
##$PSCAL= 4
##$PSIGN= 0
##$PYNMP= <proc.py>
##$REVERSE= no
##$SF= 400.020009565659
##$SI= 131072
##$SIGF1= 0
##$SIGF2= 0
##$SINO= 400
##$SIOLD= 131072
##$SPECTYP= <>
##$SREGLST= <1H.CDCl3>
##$SSB= 0
##$STSI= 131072
##$STSR= 0
##$SW_p= 8223.68421052631
##$SYMM= 0
##$S_DEV= 0
##$TDeff= 65536
##$TDoff= 0
##$TI= <>
##$TILT= no
##$TM1= 0
##$TM2= 0
##$TOPLEV= 0
##$USERP1= <user>
##$USERP2= <user>
##$USERP3= <user>
##$USERP4= <user>
##$USERP5= <user>
##$WDW= 1
##$XDIM= 131072
##$YMAX_p= 454986325
##$YMIN_p= -194557
##$CURPLOT= <Network HP LaserJet P1505>
##$CURPRIN= <$Network HP LaserJet P1505>
##$DFORMAT= <normdp>
##$LAYOUT= <+/1D_H.xwp>
##$LFORMAT= <normlp>
##$PFORMAT= <normpl>
##$SURQMSG= 1
$$ End of Bruker specific parameters
$$ ---------------------------------
##NTUPLES= NMR SPECTRUM
##VAR_NAME=  FREQUENCY,     SPECTRUM/REAL,   SPECTRUM/IMAG
##SYMBOL=    X,             R,               I
##VAR_TYPE=  INDEPENDENT,   DEPENDENT,       DEPENDENT
##VAR_FORM=  AFFN,          ASDF,            ASDF
##VAR_DIM=   131072,        131072,          131072
##UNITS=     HZ,            ARBITRARY UNITS, ARBITRARY UNITS
##FACTOR=    0.0627417313425164, 1,          1
##FIRST=     8223.62146879497, -3917,        -63612
##LAST=      0,             -2519,           -64912
##MIN=       0,             -194557,         0
##MAX=       8223.62146879497, 454986325,    0
$$ Real data points
##PAGE= N=1
##DATA TABLE= (X++(R..R)), XYDATA
$$ [...]
61576C65389n87r32p89p02j016j090o33m60j035j574j468j417k035k515j848m90
61560C46798L31K90j01m74o20k63L61M47p6j13Q25J596J270Q00J387K269J860
61543C56587L70n04j58M62P61J159J774K065K013K314L059L456L144K722K580
61528C81804K240J259o3j205j998k402k362k086j930j849j555j170j046r93m68
61513C66176M02P67K09p35j396j659j667j485j325j508j995k324k168j604q16
61498C48872J9N12L41k22n06k71J08L15M44N76N45K71l2j13J01N96J218J600J491
61479C55865J161J177J677K206K288J893J351R71P24K68n71j336j305m54L91N81
61463C66887K59k34q93j526j437m16N51M44l72p09j85N95J256K011K873L408L318
$$ plain form
61576 365389 364802 363870 363081 362379 361363 360273 359640 359180 358145 356571 355103 353686 351651 349136 347288 346798
61560 346798 347129 347419 347318 346844 346224 345961 346322 346769 346693 346580 347405 349001 350271 351071 352458 354727 356587
61543 356587 356957 356453 356295 356757 357518 358677 360451 362516 364529 366843 369902 373358 376502 379224 381804
61528 381804 384044 385303 385240 384035 382037 379635 377273 375187 373257 371408 369853 368683 367637 366644 366176
61513 366176 366578 367345 367554 366819 365423 363764 362097 360612 359287 357779 355784 353460 351292 349688 348872
61498 348872 348891 349403 349744 349522 349016 348745 348853 349168 349612 350188 350733 351004 350972 350859 350960 351556 352774 354374 355865
61479 355865 357026 358203 359880 362086 364374 366267 367618 368589 369313 369581 369010 367674 366369 365915 366306 366887
61463 366887 367146 366912 366019 364493 363056 362640 363191 363635 363263 362554 362369 362964 364220 366231 369104 372512 375830
61446C75830K648J457o6j263j511j030m57K01J460L188M419M476L637K573J721
61431C97283J291J276J318J012M50Q6J44N60J270K071K441K150J766J945K455
61416D17518K650K597K820L134K770J641N33n6l93p10q48q21r59j286j477j557
61400D25556j835k122j835j087p20j041j333j048o09o08q74q61m34J74P71J254
61384D13348J520J597J536J247P30M16O82J203J393J357J660K262K578K498K464
61369D36491K513K247J822J841K160J978J345J309K123K598J955J128J295K151
61355D62956K665K750L092L885M789N784P114Q584R700J0345J0627J0346R221
61342E51858P518N893M753M121L884L712L162K202J343Q54L10o30j548j871j773
$$ plain form
61446 375830 378478 379935 379869 378606 377095 376065 375608 375809 377269 380457 384876 389352 392989 395562 397283
61431 397283 398574 399850 401168 402180 402630 402716 402860 403420 404690 406761 409202 411352 413118 415063 417518
61416 417518 420168 422765 425585 428719 431489 433130 433663 433607 433214 432504 431656 430835 429876 428590 427113 425556
61400 425556 423721 421599 419764 418677 417957 416916 415583 414535 413926 413318 412444 411583 411149 411323 412094 413348
61384 413348 414868 416465 418001 419248 419978 420394 421076 422279 423672 425029 426689 428951 431529 434027 436491
61369 436491 439004 441251 443073 444914 447074 449052 450397 451706 453829 456427 458382 459510 460805 462956
61355 462956 465621 468371 471463 475348 480137 485921 493035 501619 511319 521664 532291 542637 551858
61342 551858 559376 565269 570022 574143 578027 581739 584901 587103 588446 589300 589610 588980 587432 585561 583788
61327E83788j840k159k398k465k473k320j840j123k57Q93K161K756K252J534J887
61312E78396L321M664N338O051P550R514J1174J2507J4136J6298J8358J9417J9175
61299G25899J8077J6681J5001J2573R171N222J482j542l745n263o392p457q563
61286G71144r476r965j0059r952r650q986p906o667n706n219m808l768j939j17
61272F76926P96Q56Q80J294J801K175K640L172L208K545J997K503L989N633P048
61257G17463Q500J0058J1147J1174J0141Q443O316L806J184j047k722m330o363
61244G73770q404r385q862p548o313n235m102l194k844k658k059j331j186j487
61230G09162j323k98J228L063N243P152P824P459P436Q433R599J0097J0225J0461
$$ plain form
61327 583788 581948 579789 577391 574926 572453 570133 568293 567170 566913 567806 569967 572723 574975 576509 578396
61312 578396 581717 586381 591719 597770 605320 614834 626008 638515 652651 668949 687307 706724 725899
61299 725899 743976 760657 775658 788231 797402 802624 804106 802564 798819 793556 787164 779707 771144
61286 771144 761668 751703 741644 731692 722042 713056 705150 698483 692777 687558 682750 678982 677043 676926
61272 676926 677722 678578 679458 680752 682553 684728 687368 690540 693748 696293 698290 700793 704782 710415 717463
61257 717463 725963 736021 747168 758342 768483 776926 783242 787048 788232 787185 784463 780133 773770
61244 773770 765366 755981 747119 739571 733258 728023 723921 720727 717883 715225 713166 711835 710649 709162
61230 709162 707839 707541 708769 711832 717075 724227 732051 739510 746946 755379 764978 775075 785300 795761
61216G95761J0492J0025R564R489R284Q557P993Q258Q741Q461P595O971O678O313
61202I14182O160O856Q191R398J0488J2169J4551J6988J9205K1527K3934K5888
61190A089537K7059K7409K6517K3808J9635J5216J1372Q081N307L271J620n96
61178A258236l637o569q584j0113j2091j4593j6856j8259j8812j8990j9452k0661
61166A089619k2406k3929k4767k5165k5425k5279k4385k3097k2167k1708k0968
61155H30323j9212j6523j3538j0734q194n944m106k617j118N75K022K523J942
61142G55399P74n77k187m079n769o659o635n941m722k989q78J350L493N446P278
61127G33304R296J1757J4379J6588J8378K0400K2922K5406K7496K9703L2408L4831
$$ plain form
61216 795761 806253 816278 825842 835331 844615 853172 861165 869423 878164 886625 894220 901191 907869 914182
61202 914182 920342 927198 935389 944787 955275 967444 981995 998983 1018188 1039715 1063649 1089537
61190 1089537 1116596 1144005 1170522 1194330 1213965 1229181 1240553 1248634 1253941 1257212 1258832 1258236
61178 1258236 1254599 1248030 1239446 1229333 1217242 1202649 1185793 1167534 1148722 1129732 1110280 1089619
61166 1089619 1067213 1043284 1018517 993352 967927 942648 918263 895166 872999 851291 830323
61155 830323 811111 794588 781050 770316 762122 756178 752072 749455 748337 748912 750934 753457 755399
61142 755399 756173 755596 753409 749330 743561 736902 730267 724326 719604 716615 715737 717087 720580 726026 733304
61127 733304 742600 754357 768736 785324 803702 824102 847024 872430 899926 929629 962037 996868
61115I96868L5968L6146L6573L7511L7928L7077L5409L3675L1852K9469K6399
61104A374875K2966J9517J6199J2894R196M677p01o567j2372j7585k1877k5484
61092A375738k9117l3072l6650l8940l9919m0212m0024l9047l7339l5521l3967
61081I71930l2415l0495k8169k5597k3033k0812j8957j6954j4468j2075j0552
61070G38403r626q321o517n150m683m371l452k162j087k63N94J486K276K983L675
61055G03785M487N815P920J0240J1949J3210J5010J7520J9718K1031K2159K3705
61043H76549K5121K5891K6655K8104K9667L0365L0247K9876K9169K7899K6692
61032A186235K6228K6029K5359K4753K5163K6031K6012K5432K6153K8745L1448
$$ plain form
61115 996868 1032836 1068982 1105555 1143066 1180994 1218071 1253480 1287155 1319007 1348476 1374875
61104 1374875 1397841 1417358 1433557 1446451 1455647 1460324 1459623 1453056 1440684 1423099 1401222 1375738
61092 1375738 1346621 1313549 1276899 1237959 1198040 1157828 1117804 1078757 1041418 1005897 971930
61081 971930 939515 909020 880851 855254 832221 811409 792452 775498 761030 748955 738403
61070 738403 728777 720456 713939 708789 704106 699735 696283 694121 693034 692771 693365 694851 697127 700110 703785
61055 703785 708272 714087 722007 732247 744196 757406 772416 789936 809654 830685 852844 876549
61043 876549 901670 927561 954216 982320 1011987 1042352 1072599 1102475 1131644 1159543 1186235
61032 1186235 1212463 1238492 1263851 1288604 1313767 1339798 1365810 1391242 1417395 1446140 1477588
61021A477588L2471L1860L0697K9842L0164L2679L7585M4088N1684O0640P0778
61010A930076Q1047R0919J01211J13197J28186J48269J75708K11042K53692L04976
61000C538323L68116M44721N35034O43579P80291R53028J163997J416048J707230
60991A1550367J995759K170271K089453J691197J072557M44942l301k03116j83173
60982B0624956K075K86356N49026O18486L70610j65280q12541j367156j715498
60973A8391034j855793j842553j732717j570733j391542j218076j058534r13018
60965F808068p82029o66881n66378m78109m01852l38716k88048k47775k16588
60956B821692j93189j74239j55968j37669j21446j08504r7639q7359p7457o8238
$$ plain form
61021 1477588 1510059 1541919 1572616 1602458 1632622 1665301 1702886 1746974 1798658 1859298 1930076
61010 1930076 2011123 2102042 2203253 2316450 2444636 2592905 2768613 2979655 3233347 3538323
61000 3538323 3906439 4351160 4886194 5529773 6310064 7263092 8427089 9843137 11550367
60991 11550367 13546126 15716397 17805850 19497047 20569604 21014546 21011245 20808129 20624956
60982 20624956 20627031 20913387 21462413 22080899 22451509 22286229 21473688 20106532 18391034
60973 18391034 16535241 14692688 12959971 11389238 9997696 8779620 7721086 6808068
60965 6808068 6026039 5359158 4792780 4314671 3912819 3574103 3286055 3038280 2821692
60956 2821692 2628503 2454264 2298296 2160627 2039181 1930677 1833038 1745679 1668222 1599984
60946A599984n9946n3365m9457m7946m7349m6673m5979m5189m3683m1377l8944
60935A080076l6630l4001l1151k8901k7339k5392k2503j9663j7940j6895j5382
60924H04279j3214j1205r923r198q628q035p492p149o964o491n349l826k600j893
60910G02312j472j377j894k697k896k231j556j723k575l330l494l109k578k433
60896F68947k846l298l163k574k146k011j825j620j692j757j170j1J032J814K695
60881F50375L378L161K470K609L671M319M130M416N831O941O537N860O819R050
60867G19567J0526J0422R712R304R219R485J0449J2058J3754J5118J5942J5973
60855H61529J5363J4963J5266J5517J4809J3651J3320J4029J4934J5743J6977
$$ plain form
60946 1599984 1540038 1486673 1437216 1389270 1341921 1295248 1249269 1204080 1160397 1119020 1080076
60935 1080076 1043446 1009445 978294 949393 922054 896662 874159 854496 836556 819661 804279
60924 804279 791065 779860 769937 760739 752111 744076 736584 729435 722471 715980 710631 706805 704205 702312
60910 702312 700840 699463 697569 694872 691976 689745 688189 686466 683891 680561 677067 673958 671380 668947
60896 668947 666101 662803 659640 657066 654920 652909 651084 649464 647772 646015 644845 644834 645866 647680 650375
60881 650375 653753 656914 659384 661993 665664 669983 674113 678529 684360 691301 697838 703698 710517 719567
60867 719567 730093 740515 750227 759531 768750 778235 788684 800742 814496 829614 845556 861529
60855 861529 876892 891855 907121 922638 937447 951098 964418 978447 993381 1009124 1026101
60844A026101J8618J9741J9832J9407J8983J8303J7053J5662J4817J4582J4383
60833A217482J3662J2389J1010R958R167Q113O429M201J617j277m327p265j0103
60820A271056j2986j5503j6954j7594j8678k0706k2620k3379k3397k3516k3534
60809A052189k2894k1994k1535k1151k0030j8456j7383j6826j5913j4414j2929
60798H48664j1762j0799j0363j0828j1473j0981r285p706p116p060o897o672o569
60785G31153o525o708p488q591r105q669p922p520p396p213o882o433n937n770
60771F28994o277p187p794p788p347o581n564m716m399m302m002l865m484n444
60757E49244n669m951m045l432k992k853l241l531k749j233m62q74j176l38R29
$$ plain form
60844 1026101 1044719 1064460 1084292 1103699 1122682 1140985 1158038 1173700 1188517 1203099 1217482
60833 1217482 1231144 1243533 1254543 1264501 1273668 1281781 1288210 1292411 1294028 1292751 1288424 1281159 1271056
60820 1271056 1258070 1242567 1225613 1208019 1189341 1168635 1146015 1122636 1099239 1075723 1052189
60809 1052189 1029295 1007301 985766 964615 944585 926129 908746 891920 876007 861593 848664
60798 848664 836902 826103 815740 804912 793439 782458 773173 765467 758351 751291 744394 737722 731153
60785 731153 724628 717920 710432 701841 692736 684067 676145 668625 661229 654016 647134 640701 634764 628994
60771 628994 622717 615530 607736 599948 592601 586020 580456 575740 571341 567039 563037 559172 554688 549244
60757 549244 543575 538624 534579 531147 528155 525302 522061 518530 515781 514548 514086 513212 512036 511698 512627
60742E12627J321O10n02j400j802j739j758k450l445l640k770j817j488j234l82
60727D90131O88J167R23L12m66j237j601j449j269j480j930k407l063l935m575
60712D69809m658m456m374m447m601m846m933m404l332k497k405k633k437j670
60698D18116p98l68o42j299j555r87j37K34K62N22P67K86o01p16J58R90J357K121
60680D17710L659M863M840M369M568N135N080M466M206M526M775M524M049L802
60666D80572M005M542M802M069K475J094P07R62J136J057Q43M79K64Q93K423L764
60650E14087M005L582L383L331K780J828J160Q43J99j153k829m257n144n463n430
60635E10922n420n563n559n205m737m396l961l146k146j355q77o43p46j314k180
$$ plain form
60742 512627 513948 514558 514056 512656 510854 509115 507357 504907 501462 497822 495052 493235 491747 490513 490131
60727 490131 490819 491986 492909 493221 492755 491518 489917 488468 487199 485719 483789 481382 478319 474384 469809
60712 469809 465151 460695 456321 451874 447273 442427 437494 433090 429758 427261 424856 422223 419786 418116
60698 418116 417318 416950 416308 415009 413454 412467 412330 412564 412826 413348 414115 414401 413800 413084 413242 414232 415589 417710
60680 417710 421369 426232 431072 435441 440009 445144 450224 454690 458896 463422 468197 472721 476770 480572
60666 480572 484577 489119 493921 497990 500465 501559 502266 503228 504364 505421 506264 506743 507007 507900 510323 514087
60650 514087 518092 521674 525057 528388 531168 532996 534156 534999 535198 534045 531216 526959 521815 516352 510922
60635 510922 505502 499939 494380 489175 484438 480042 476081 472935 470789 469434 468557 467914 467168 465854 463674
60620D63674k893k860j647L74J788J319o19k276k595k032j319n33J94K21o02j370
60604D48824j273o27j49J0p0m68q00j51J566L019L064K245J799K036K559L268
60588D64852M023M071K998J688J228J313R12k1p14j070j703k635l103k600j230
60573D68009P55K859M090L977L607M549O785Q804R734J0257J1336J3011J4755
60560E62528J6086J6561J5804J3859J1044P450L148j207m678o919q205q673q238
60547F08560p178o044m933l526j837k12J425L570O221Q633J0262J1364J2490J3820
60533F52615J5176J6164J6144J4490J1233P211L354Nk989n662p558q083p231n807
60519F99062m650l785k809j926j818k389k569j717m05O32J492K360K715K197J567
$$ plain form
60620 463674 460781 457921 456274 456648 458436 459755 459136 456860 454265 452233 450914 450381 450575 450796 450194 448824
60604 448824 447551 446924 446775 446785 446715 446247 445447 445296 446862 449881 452945 455190 456989 459025 461584 464852
60588 464852 468875 472946 475944 477632 478860 480173 481085 481064 480350 479280 477577 474942 471839 469239 468009
60573 468009 468764 471623 475713 479690 483297 487846 494631 503435 513169 523426 534762 547773 562528
60560 562528 578614 595175 610979 624838 635882 643332 646480 645273 640595 633676 625471 616798 608560
60547 608560 601382 595338 590405 586879 585042 584830 586255 589825 596046 604679 614941 626305 638795 652615
60533 652615 667791 683955 700099 714589 725822 733033 736387 736392 733403 727741 720183 712100 704869 699062
60519 699062 694412 690627 687818 685892 684074 681685 679116 677399 676994 677626 679118 681478 684193 686390 687957
60504F87957J833K885M037N444P946J1665J5767J9642K3507K7855L2918L8614
60492H80070M4488M9859N4459N8500O1574O2003N8170N0243L9717K7490J3360
60481A399933k617j9113l4068m5809n3676n8081n9903n9621n7250n3276m8899
60470I07620m4929m1039l6777l2568k8972k5697k2292j9213j7141j5757j4277
60459F08958j2749j1769j1241j0559r683q914q004o645n471n310n645n268m260
60446E03440l951m804n714n676m830l611k075n25L15K02l17q44j490k080j983
60431D66057j127k96l1O7N20J117J277P31l60j471j820r62N94J836K356K466K345
60414D73299J869J179P07N60N62Q16J478K075J876R26o0o85r53n96N86J809J932
$$ plain form
60504 687957 689790 692675 696712 702156 710102 721767 737534 757176 780683 808538 841456 880070
60492 880070 924558 974417 1028876 1087376 1148950 1210953 1269123 1319366 1359083 1386573 1399933
60481 1399933 1397316 1378203 1344135 1298326 1244650 1186569 1126666 1067045 1009795 956519 907620
60470 907620 862691 821652 784875 752307 723335 697638 675346 656133 638992 623235 608958
60459 608958 596209 584440 573199 562640 552957 544043 536039 529394 523923 518613 512968 507700 503440
60446 503440 499489 494685 488971 483295 478465 474854 472779 472254 472569 472771 472454 471610 470120 468040 466057
60431 466057 464930 464634 464603 464670 465190 466307 467584 468315 467955 466484 464664 463702 464296 466132 468488 470954 473299
60414 473299 475168 476347 477054 477614 478176 478992 480470 482545 484421 485347 485287 484602 483649 483053 483639 485448 487380
60397D87380J109P03J324K036J877J143P20J000J835K842L417L178K607K582L084
60382E16837L230K709K272K469K870K931K834K903K918K532J927J553J577J806
60368E51368J858J359L61n17p54n67l64J6P60J232P04k77m60L61J292J972K899
60351E61243M082M753M730M796N387O073O667P550Q531Q689P867O991O312M733
60337F48404J707j489l470m639o199q116r285r221q478p675o948o245n457m446
60323E68443l381k788k909l310l421l109k533j869j387j270j160m90O75J700K372
60308E45563L034L787M470N526P694J0587J2841J4094J5631J8348K1189K2489
60296F85253K1902K0148J7595J4096R611M201k060q398j3183j5301j5286j4530
$$ plain form
60397 487380 488489 489192 490516 492552 494429 495572 496292 497292 499127 501969 505386 508564 511171 513753 516837
60382 516837 520067 522776 525048 527517 530387 533318 536152 539055 541973 544505 546432 547985 549562 551368
60368 551368 553226 554585 554946 554429 553675 553108 552744 552760 553520 554752 555456 555179 554719 555080 556372 558344 561243
60351 561243 565325 570078 574808 579604 584991 591064 597731 605281 613812 622501 630368 637359 643671 648404
60337 648404 650111 648622 645152 640513 634314 626198 616913 607692 599214 591539 584591 578346 572889 568443
60323 568443 565062 562274 559365 556055 552634 549525 546992 545123 543736 542466 541306 540816 541491 543191 545563
60308 545563 548597 552384 556854 562380 570074 580661 593502 607596 623227 641575 662764 685253
60296 685253 707155 727303 744898 758994 768605 772806 770746 762348 749165 733864 718578 704048
60284G04048j3762j2945j2051j1215j0433r660r010q464p841p290p226p528p458
60271E79165o750n996n549m936l872k992k865l072k985k720k573k219j360n12
60257E30764k92l55K4P73J238J274J304J506J669J692J645J532J326J123Q18Q5
60241E46126j040j991k385k429k301j750p44J98Q06J576K821L896M085L762L847
60226E54477M481M997M955M552M189M107M375M842N243N578O095O795P390P941
60212F30017Q847J0033J0838J1028J1200J1723J2055J1629J0735R909R039P790
60200G54843O422N543N278N133M518L171J429R5m19q21k096m000n320n691o044
60185G62041o908p534p252o542o066n643m967m431m411m576m584m684m951m780
$$ plain form
60284 704048 690286 677341 665290 654075 643642 633982 624972 616508 608667 601377 594151 586623 579165
60271 579165 572415 566419 560870 555934 552062 549070 546205 543133 540148 537428 534855 532636 531276 530764
60257 530764 530472 530117 530141 530914 532152 533426 534730 536236 537905 539597 541242 542774 544100 545223 546041 546126
60241 546126 545086 543095 540710 538281 535980 534230 533486 533684 534490 536066 538887 542783 546868 550630 554477
60226 554477 558958 563955 568910 573462 577651 581758 586133 590975 596218 601796 607891 614686 622076 630017
60212 630017 638864 648897 659735 670763 681963 693686 705741 717370 728105 738014 747053 754843
60200 754843 761265 766808 772086 777219 781737 784908 786337 786432 786013 785192 783096 779096 773776 768085 762041
60185 762041 755133 747599 740347 733805 727739 722096 717129 712698 708287 703711 699127 694443 689492 684712
60171F84712l883k908k457k247j964j917k159j972j092l91m57n56k2M23n0p35
60155F62325m47N52J046P21K71J07J94P27J860L088L872M409M989N227M933M918
60139F98792N802O729O566N758N614O199O416N879N345N343N591N726N630N079
60125G80469L972K816K226K205K422K806L159K975K373K372L277L758K711J029
60111H18570J14m27j834l707m487m197m587o397q283q851q239p301o525o125o132
60096G41592n949m846l103j765j130m70O96J964K832L235L230K927K760L050L362
60081G48385L123K595K394K358J828Q02l47j906m349o955q328q322q251r023j0219
60066G03785j1061j1179j0311q453o459n408n233m958m284l809l588k811j276
$$ plain form
60171 684712 680829 677921 675464 673217 671253 669336 667177 665205 664113 663722 663265 662709 662687 663110 663060 662325
60155 662325 661878 662430 663476 664197 664468 664575 664769 665496 667356 670444 674316 678725 683714 688941 693874 698792
60139 698792 704594 711323 717889 723647 729261 735460 741876 747755 753100 758443 764034 769760 775390 780469
60125 780469 784441 787257 789483 791688 794110 796916 800075 803050 805423 807795 811072 814830 817541 818570
60111 818570 818684 818257 816423 812716 808229 804032 799445 793048 784765 775914 767675 760374 753849 747724 741592
60096 741592 735643 730797 727694 725929 724799 724329 725025 726989 729821 733056 736286 739213 741973 745023 748385
60081 748385 751508 754103 756497 758855 760683 761485 761138 759232 754883 747928 739600 731278 723027 714004 703785
60066 703785 692724 681545 671234 662781 656322 650914 645681 640723 636439 632630 629042 626231 624955
60053F24955K2K91OP2P29J698K745L723M609N678P098Q332Q597P902P034O510
60037F90001O198N806N073L617J359j048k898m307n680o780p200p365p993q917
60023F59866r567j0185j1355j2583j2783j1972j1093j0208q436n831l824l377
60011E48652l878m192l848k855j436j60M84P33J029J049L20n23l66O64J407J491
59995E38571J521J656J543J671K995N023O111N922N877O620O945N979M642L882
59981E98958L073J354p38k217l199m246n078n070m406l747l238k703k263j998
59967E64482j493m38P08J255J144Q26O71Q52J388K035K512K907L360L478K804
59952E86491J839J573K055K421K393K566K980K734J480Q1p98j688l195m845n790
$$ plain form
60053 624955 624977 625268 625274 625346 626075 627773 630518 634241 638850 644528 651626 659958 668555 676457 683491 690001
60037 690001 696199 702005 707078 710695 712054 711006 708108 703801 698121 691341 684141 676776 668783 659866
60023 659866 650299 640114 628759 616176 603393 591421 580328 570120 561684 555853 552029 548652
60011 548652 544774 540582 536734 533879 532443 532283 532767 533500 534529 535578 535898 535375 535009 535673 537080 538571
59995 538571 540092 541748 543291 544962 547957 552980 559091 565013 570890 577510 584455 590434 595076 598958
59981 598958 602031 603385 602647 600430 597231 592985 587907 582837 578431 574684 571446 568743 566480 564482
59967 564482 562989 562551 563259 564514 565658 566484 567155 568007 569395 571430 573942 576849 580209 583687 586491
59952 586491 588330 589903 591958 594379 596772 599338 602318 605052 606532 606613 605815 604127 600932 596087 590297
59937E90297n952n785n475n041m620m263l788l158k514j850j136o84o59m31O23
59922E45564J885K238J898K168L264L935L574L194L770M899N813O562P449Q237
59908F04450Q562Q406P878P245P191P927Q125O180K676rq14j040j822k490k252
59893F60213j756j800j900j338m03L90J227K157K531K257K379L430M393M352M003
59878F80135M386N231N705N736N408M124J683p45j960k357l016m071n050n990
59864F89219o956p259o429n271m824m828m414l577k863k172j104M9P43J084J338
59849F42736J185N15K95J463L517N295O655Q163R679J0371R842Q193N439J909
59835G15257j114k266j447M69K833N207O653O190L855O28k550n153o919q039r044
$$ plain form
59937 590297 584345 578560 573085 568044 563424 559161 555373 552215 549701 547851 546715 546031 545372 544941 545564
59922 545564 547449 549687 551585 553753 557017 560952 564526 567720 571490 576389 582202 588764 596213 604450
59908 604450 613012 621418 629296 636541 643732 651659 659784 665964 668640 668631 667817 666777 664955 662465 660213
59893 660213 658457 656657 654757 653419 653016 653406 654633 656790 659321 661578 663957 667387 671780 676132 680135
59878 680135 684521 689752 695457 701193 706601 710725 712408 711663 709703 707346 704330 700259 695209 689219
59864 689219 682263 675004 668575 663304 658480 653652 649238 645661 642798 640626 639522 639571 640314 641398 642736
59849 642736 643921 644436 644731 646194 649711 655006 661661 669824 679503 689874 699716 707909 713348 715257
59835 715257 714143 711877 710430 710899 713732 718939 725592 731782 735637 736265 733715 728562 721643 713604 704560
59820G04560r953j0100r292q349p849p245o062n019m877n000m256k745j431o05
59806F21777J50R20J454J783J906J331q6j451j965k236l290m881n893o054n982
59791E97483n959n783n608n782o059n886n325m737l934k583j188n70o55p15o32
59776E42067r09j543j842j323j73J064J753J475O59M33J286K419K973L182L492
59761E55013L521K880K234K367K894L118L499M899O775P650P073N899M817L919
59747F16558L510L998M922N214M558L613K917K515K456K791L123L020K712K652
59733F64559K672K445K377L034L954M103L373K616K360K438K707L160L440L129
59719G06367K470K027J794J392R28P77Q14O72M98O22P78N74L84Q27J614J919J705
$$ plain form
59820 704560 694607 684507 675215 666866 659017 651772 645710 640691 635814 630814 626558 623813 622382 621777
59806 621777 621927 622847 624301 626084 627990 629321 629235 627784 625819 623583 620293 615412 609519 603465 597483
59791 597483 591524 585741 580133 574351 568292 562406 557081 552344 548410 545827 544639 544069 543414 542699 542067
59776 542067 541158 539615 537773 536450 536277 537341 539094 540569 541228 541661 542947 545366 548339 551521 555013
59761 555013 558534 561414 563648 566015 568909 572027 575526 580425 587200 594850 601923 607822 612639 616558
59747 616558 620068 624066 628988 634202 638760 642373 645290 647805 650261 653052 656175 659195 661907 664559
59733 664559 667231 669676 672053 675087 679041 683144 686517 689133 691493 693931 696638 699798 703238 706367
59719 706367 708837 710864 712658 714050 714978 715755 716569 717241 717739 718361 719139 719713 720097 720924 722538 724457 726162
59702G26162J676J994K009J307K69m09l01N62J551J854J416J029J132J193P72
59687G42216L21K19l8p87j322j040n91p80j236j402j917l527n463o389o394o510
59671G05360o880o904o727o956p279o879n879m992m136k895j786j519j484n79
59657F40465Q57J694K142L257M654M844L850L356M020M604M161L216K230O31j866
59642F82115m403o170p242p784p540o593n505m443l145j938j528j693j423n88
59628F22120j96q23k017l382m900n963n621m128k940k684k503j802j259j491j981
59613E80430k068j927j871j555n51R42K385L352L563L125K756K964L182K542J299
59598E98568L07n55k020l636l990k910j859j757j950j772j640j868j825j133n65
$$ plain form
59702 726162 727838 729832 731841 733148 733417 733008 732707 733269 734820 736674 738090 739119 740251 741444 742216
59687 742216 742537 742756 742718 741931 740609 739569 738978 738198 736962 735560 733643 730116 724653 718264 711870 705360
59671 705360 698480 691576 684849 677893 670614 663735 657856 652864 648728 645833 644047 642528 641044 640465
59657 640465 641322 643016 645158 648415 653069 657913 661763 665119 669139 673743 677904 681120 683350 683981 682115
59642 682115 677712 671542 664300 656516 648976 642383 636878 632435 629290 627352 625824 624131 622708 622120
59628 622120 621924 621101 619084 615702 610802 604839 599218 595090 592150 589466 586963 585161 583902 582411 580430
59613 580430 578362 576435 574564 573009 572458 573400 575785 579137 582700 585825 588581 591545 594727 597269 598568
59598 598568 598875 598320 596300 592664 588674 585764 583905 582148 580198 578426 576786 574918 573093 571960 571395
59583E71395q61j502j520q29j25L9l96j078j404j066n04l13l94k90j15k74m66
59566E60297o9O33O98k9p71j030r16m29M62J188J104N57L50M21K39R6O57J543
59548E65001J862J844K371L208L365L095L683N366P159Q725J0700J3305J6380
59535F46064K0335K4818K6759K2682J3479M327q66k547k630j436J019L332M267
59522G59603M356M371L715J808m56k081l588n879q594j0879j2729j4438j5626
59509F99583j5815j5151j3825j1773r520q153p832p515o675n882n243l963k201
59496E86035j494k335l016k122o35j89o95j016q52n64j50N08J129J639K330K922
59480E81495K688K065K583M478O070O355O414P203P851P464O832O773O471N098
$$ plain form
59583 571395 570534 569032 567512 566683 566558 566597 566201 565123 563719 562653 562149 561836 561442 561152 561037 560763 560297
59566 560297 560228 560861 561559 561530 560759 559729 558813 558384 558846 560034 561138 561695 562045 562466 562705 562801 563458 565001
59548 565001 566863 568707 571078 574286 577651 580746 584429 589795 596954 605679 616379 629684 646064
59535 646064 666399 691217 717976 740658 754137 758464 757598 755051 752421 750985 752004 755336 759603
59522 759603 763959 768330 772045 773853 773397 771316 767728 761849 753255 742376 729647 715209 699583
59509 699583 683768 668617 654792 643019 633499 625346 617514 609999 603324 597442 592199 588236 586035
59496 586035 584541 582206 579190 577068 576433 576244 575549 574533 573681 573117 572967 573475 574604 576243 578573 581495
59480 581495 584183 586248 588831 593309 599379 605734 612148 619351 627202 634666 641498 648271 654742 659840
59466F59840L651L436L960L982L511L304L429L840N158P474R550J0598J1516J2868
59452G46117J3212J1308Q658P652Q171Q202P016N573M215K076j314n442r711j3487
59438G92246j5585j5123j2840j0428q769p641o685n664m344k908j935j302k5K156
59424G01153M180N477P048R702J2691J5151J7446J9714K0773K0028J8933J8915
59412H71211J9496K0159K1879K4285K3208J4602K08j3691k2657k6567k6615k3464
59400H82054j8498j3463p998m01Q017J2017P606l431j5424k3825k7351k6915k4284
59387G48104k1292j8970j7147j5156j2709j0051p686n987m783l462j780j97R92
59374F29876K171L431M015L576L176L887N150N782N907O486P480Q097Q406R158
$$ plain form
59466 659840 663491 666927 670887 674869 678380 681684 685113 688953 694111 701585 711135 721733 733249 746117
59452 746117 759329 770637 779295 786947 795118 803320 810336 815909 820124 822200 820886 815444 805733 792246
59438 792246 776661 761538 748698 738270 729501 721860 715175 709511 705167 702259 700324 699022 698997 701153
59424 701153 705333 710810 717858 727560 740251 755402 772848 792562 813335 833363 852296 871211
59412 871211 890707 910866 932745 957030 980238 994840 995048 981357 958700 932133 905518 882054
59400 882054 863556 850093 842095 841694 849711 861728 869334 865903 850479 826654 799303 772388 748104
59387 748104 726812 707842 690695 675539 662830 652779 645093 639106 634323 630861 629081 628884 629876
59374 629876 632047 635478 639493 643069 646245 650132 655282 661064 666971 673457 680937 689034 697440 706598
59360G06598J0203J0665J0637J1173J2623J4285J5793J7519J9525K1312K2787
59349H73120K4386K6093K7289K7680K7470K6664K5057K2784K0109J6810J2622
59338A130084P969L438j155o189j1192j5350j8685k1663k4018k5095k5079k4812
59326I68253k4636k4350k3913k3211k1559j8632j5455j3318j2058j0575q645p056
59314G64845o202n750n458n297n038m615m396m253l188r49R51J310J293K756N284
59299G31293O951P481Q529J0937J3779J6112J7645J7500J4290Q158J250m396q307
59286H41222j0752j1788j1595j0611q993o699m182j993J20K696N330P127Q289
59273G98171R915J2274J4408J5568J5864J5520J4569J3257J1753R598O399K750
$$ plain form
59360 706598 716801 727466 738103 749276 761899 776184 791977 809496 829021 850333 873120
59349 873120 897506 923599 950888 978568 1006038 1032702 1057759 1080543 1100652 1117462 1130084
59338 1130084 1138053 1141491 1140336 1134147 1122955 1107605 1088920 1067257 1043239 1018144 993065 968253
59326 968253 943617 919267 895354 872143 850584 831952 816497 803179 791121 780546 771901 764845
59314 764845 758643 752893 747435 742138 737100 732485 728089 723836 720648 719699 720650 721960 723253 726009 731293
59299 731293 738244 745725 754254 765191 778970 795082 812727 830227 844517 852675 853925 849529 841222
59286 841222 830470 818682 807087 796476 787483 780784 776602 774609 774729 777425 782755 789882 798171
59273 798171 808086 820360 834768 850336 866200 881720 896289 909546 921299 930897 937296 940046
59261I40046n75l868p677j1221j3130j3482j3627j4153j4531j4562j4596j4422
59249H04202j3482j2201j1504j1033r406o405l337j062Q80K924M724O028P078
59236G57406P896Q254Q379Q522P973N855K777K67j454l569o517r211j0736j1407
59222G64435j1871j2361j2992j3589j3228j1284q820p535p289o264l795j359l78
59209F53670m79n04j9Q21J821K733L436M305N688P010P272O337M920L627K756
59194G03394K615K974K832J825J125J725K737K943K916L660M220L067J147Q30
59180G38010K119K748K034J748K737L502L074K709L580M989N986P000Q603J0290
59166G99129J1436J2150J2415J1784J0541R674R139P676M856J737j024m043p536
$$ plain form
59261 940046 939471 935603 927926 916705 903575 890093 876466 862313 847782 833220 818624 804202
59249 804202 790720 778519 767015 755982 746576 740171 736834 735772 736652 739576 744300 750328 757406
59236 757406 765302 773556 781935 790457 798430 804285 807062 807329 805875 802306 795789 786578 775842 764435
59222 764435 752564 740203 727211 713622 700394 689110 680290 672755 665466 659202 655407 654048 653670
59209 653670 653191 652687 652668 653489 655310 658043 661479 665784 671472 678482 685754 692091 697011 700638 703394
59194 703394 706009 708983 711815 713640 714765 716490 719227 722170 725086 728746 732966 736033 737180 738010
59180 738010 740129 742877 744911 746659 749396 752898 755972 758681 762261 767250 773236 780236 788839 799129
59166 799129 810565 822715 835130 846914 857455 867129 876268 883944 888800 890537 889513 885470 877934
59153H77934j0440j1925j2393j2393j1942j1365j1253j1160r903p635o028n917
59141G55580o382o593o823p126o765n601m451l611k690k188l208n153n795m424
59127F84770k764k096j579m30N60R06J709L606N278N589N568O703Q707J0432J1695
59112G38654J2780J3296J2931J2309J1959J1427J0396R541R245Q600O728M112
59100H61978J712k69j979l334m512n926p140p056n698m502m270m289l909l414
59086H07392k810j594l62p80l066n377o563p571r106r987r302q259q286q787q429
59071G17113p284o255n566n152n389o187o504n827n005m611l925k510j329j201
59057F50368j556j750k157k863k947k163j686k012j876n90M05l3n87L39J823J835
$$ plain form
59153 877934 867494 855569 843176 830783 818841 807476 796223 785063 775160 767525 761497 755580
59141 755580 749198 742605 735782 728656 721891 716290 711839 708228 705538 703350 700142 694989 689194 684770
59127 684770 682006 679910 678331 677901 678461 679367 681076 684682 689960 695549 701117 707820 716527 726959 738654
59112 738654 751434 764730 777661 789970 801929 813356 823752 833293 842538 851138 857866 861978
59100 861978 863690 863421 861442 858108 853596 847670 840530 833474 827776 823274 819004 814715 810806 807392
59086 807392 804582 802988 802626 801846 798780 793403 786840 779269 770163 760176 750874 742615 734329 725542 717113
59071 717113 709829 703574 698008 692856 687467 681280 674776 668949 663944 659333 655408 652898 651569 650368
59057 650368 648812 647062 644905 642042 639095 636932 635246 633234 631358 630768 631173 631140 630553 630892 632715 634550
59041F34550K94j212j881k090k110j926j789j724j200k07L64K78O49K126L700
59026F27822M385M694N415O394P546R403J1429J1704R744P816P759Q212O901M063
59012G33287J575N0j070j687j392p76n33n1J494L470M795N642O712P793Q484R264
58996G77057J0349J0665R444P773O991O764O198N582N394M795K874K97j818l554
58982H48811n165n815m957l713l108k290k57K104L611M971P259R642J0841J1639
58968H73573J3585J6170J7713J8178J8830J9874K0538K0824K1027K0291J7652
58957A078255J3891J0369O812K201l021p696j1985j6497k0265k1914k2174k2875
58945I85101k4018k4129k2980k1696k0458j8400j5634j3249j1454r592p811o871
$$ plain form
59041 634550 634844 633632 631751 629661 627551 625625 623836 622112 620912 620705 621069 621347 621996 624122 627822
59026 627822 632207 636901 642316 648710 656256 665659 677088 688792 698536 706352 714111 722323 729224 733287
59012 733287 734862 734912 733842 732155 730763 729987 729454 729403 730897 734367 739162 744804 751516 759309 767793 777057
58996 777057 787406 798071 807515 815288 822279 829043 835241 840823 846217 851012 853886 854183 852365 848811
58982 848811 843646 837831 832874 829161 826053 823763 823506 825610 829221 834192 841451 851093 861934 873573
58968 873573 887158 903328 921041 939219 958049 977923 998461 1019285 1040312 1060603 1078255
58957 1078255 1092146 1102515 1109327 1111528 1108507 1100811 1088826 1072329 1052064 1030150 1007976 985101
58945 985101 961083 936954 913974 892278 871820 853420 837786 824537 813083 803491 795680 788809
58933G88809o492n626m205l063k457k048j918k127j979j148o84j352j998j296
58919G52416p2J50k10K69J307J489Q45N90R75J411K082L298M077L641L540N813
58903G81621R661J2469J3599J4619J6155J7230J7546J7935J8485J8524J8441J9388
58891I75673K1186K2717K4187K6907L0827L4342L6427L7010L5568L1575K6155
58880A302574K1121J6481J0998M843o36n570j1497j8443k4377k7851k9278k9424
58868A208941k8588k7280k5929k3892k0537j7008j5011j4293j3343j2172j2090
58857I98798j2988j3366j3003j3170j4033j4194j3098j1812j1058j0423r736r490
58845H52427r690r881j0213j0943j1286j0502r527r620j0062r386q134p938q487
$$ plain form
58933 788809 782317 776691 772486 769423 766966 764918 763000 760873 758894 757746 757062 755710 753712 752416
58919 752416 752344 752494 752284 752553 753860 755349 756194 756784 757759 759170 761252 764550 768627 772268 775808 781621
58903 781621 791282 803751 817350 831969 848124 865354 882900 900835 919320 937844 956285 975673
58891 975673 996859 1019576 1043763 1070670 1101497 1135839 1172266 1209276 1244844 1276419 1302574
58880 1302574 1323695 1340176 1351174 1356017 1355381 1349811 1338314 1319871 1295494 1267643 1238365 1208941
58868 1208941 1180353 1153073 1127144 1103252 1082715 1065707 1050696 1036403 1023060 1010888 998798
58857 998798 985810 972444 959441 946271 932238 918044 904946 893134 882076 871653 861917 852427
58845 852427 842737 832856 822643 811700 800414 789912 780385 770765 760703 751317 743183 735245 726758
58832G26758q056o653n863n800n036l464k429k017r71O07J305J310K403M724O380
58817G03198O741P298Q601R151Q129O719N878N103M213L983M264L597J583l68
58803G78090j298j772k234k285k100k632l895m875n471o573q090q933r051r284
58789G09597r185p388m330k082j097L16K819M833N247M976N030N132M918M556
58775G23342L731J872l31j574k171l529n485o540o680p291q230p849o223n427
58761F67615o078o461n710n002m811l811j575L48J063J606K576K908K115J493
58747F46276K042L210M468O111P841Q672Q851R700J1151J1625J0751R814R202
58734G49714Q006O531O447P879Q987Q970Q857Q889Q039O578O118O442N445K985
$$ plain form
58832 726758 718702 712049 706186 700386 695350 691886 689457 687440 686469 687076 688381 689691 692094 696818 703198
58817 703198 709939 717237 725838 734989 743118 749837 755715 760818 765031 769014 773278 776875 778458 778090
58803 778090 776792 775020 772786 770501 768401 765769 761874 756999 751528 744955 736865 727932 718881 709597
58789 709597 700412 693024 688694 686612 685515 685831 688650 693483 698730 703706 708736 713868 718786 723342
58775 723342 727073 728945 728614 727040 724869 721340 715855 709315 702635 695344 687114 679265 673042 667615
58761 667615 661537 655076 649366 644364 639553 635742 634167 634515 635578 637184 639760 642668 644783 646276
58747 646276 648318 651528 655996 662107 669948 678620 687471 697171 708322 719947 730698 740512 749714
58734 749714 757720 764251 770698 778577 787564 796534 805391 814280 822319 828897 835015 841457 846902 849887
58720H49887J585K332L365L505M178O259Q127Q449Q125P941O938M621K252N77
58706I18141j336l795n634o729q690j1921j4724j6401j8390k1097k2576k1751
58694G65097k0183j9138j7710j5243j2880j1292r556p634p062p932q110o782n753
58681F15822n904n611m236l790n227o267n019k804j376k36J283K191K196L081
58667E84103N647Q045R152J0704J3950J6933J7308J5309J1952P079J295l006m777
58654F93694n925p810r006q491q013q878r377p958o115n538n163l650k126j798
58640F03846j395L93K300K892L143M097M492L243J907K010K278J062p49j636j983
58625F25900k421j999l12J011J149J881M328O737P715Q742J1000J2808J2795J2555
$$ plain form
58720 849887 851472 853804 857169 860674 864852 871111 879238 887687 895812 903753 910691 915312 917564 918141
58706 918141 916805 913010 907376 900647 891957 880036 865312 848911 830521 809424 786848 765097
58694 765097 744914 725776 708066 692823 679943 668651 659095 651461 644399 636467 628357 621575 615822
58681 615822 609918 604307 600071 596281 591054 584787 579768 576964 575588 575352 576635 578826 581022 584103
58667 584103 589750 597795 606947 617651 631601 648534 665842 681151 693103 700182 701477 698471 693694
58654 693694 687769 679959 670953 662462 654449 645571 636194 628236 622121 616583 611420 607770 605644 603846
58640 603846 602451 602844 605144 608036 611179 615276 619768 623011 624918 626928 629206 630268 629519 627883 625900
58625 625900 623479 621480 621168 622179 623328 625209 629537 636274 643989 652731 663731 676539 689334 701889
58611G01889J3361J3348J0969Q074O494M707J217j873k327j873l111n087n739
58598G40049o031p629q932p608m949l705l502k335o39R3R70L962P990J0601J2058
58583G30393J4170J6457J7168J6761J6790J6581J4489J1266Q923P441N707M460
58571H80606N124O968Q327R569J2101J5768J9742K4344K9601L3846L6177L8145
58559A120318M0482M0723L6812L0426K3772J6026O324k564p444r138j0098j0079
58547A275560q005n567m940n187m795n463r314j4751j9102k2992k7840l1642l1819
58534A084143k9999k9241k8642k5503k0892j7981j6585j4173j0933q920p594m944
58522H68736j744j84M71K286M246M025K715L005M031K876L4j542j762k931m913
$$ plain form
58611 701889 715250 728598 739567 747641 754135 758842 760059 758186 755859 753986 750875 745788 740049
58598 740049 734018 726389 717457 709849 704900 701195 697693 695358 694719 694812 695782 699744 707734 718335 730393
58583 730393 744563 761020 778188 794949 811739 828320 842809 854075 862998 870439 876146 880606
58571 880606 885730 892698 901025 910594 922695 938463 958205 982549 1012150 1045996 1082173 1120318
58559 1120318 1160800 1201523 1238335 1268761 1292533 1308559 1314883 1312319 1304875 1295737 1285639 1275560
58547 1275560 1267555 1261988 1257048 1251861 1247066 1241603 1232289 1217538 1198436 1175444 1147604 1115962 1084143
58534 1084143 1054144 1024903 996261 970758 949866 931885 915300 901127 890194 881274 873680 868736
58522 868736 866992 866808 867279 869565 873811 877836 880551 883556 887587 890463 890497 888955 887193 884262 879349
58507H79349n472m717m623m941m038k889l782n890o474n572n303n556m699l440
58493H11953l646m412l576j766p77M52L686P024P565O868Q705J2757J5684J7090
58479H77607J9273K2173K3704K3974K4234K2868J7578J0230M431k63o463j2935
58467A026411j6155j6457j6806j6836j4032r642p209o174l131J520M385N783R107
58454I40764J4060J6905J7116J7426J7547J4254P792J896k549p830j3490j6314
58442A007577j6260j6300j6407j3892r658p670q000o748l201p21j89J162L853
58429I13546N282N308O744R759J1661J2424J4507J7050J6368J2393Q670N938J873
58416A041523k979n512o195q333j1343j1529r440r426j1831j2722j1530j1678
$$ plain form
58507 879349 873877 869160 864537 859596 855558 852669 848887 842997 836523 830951 825648 820092 815393 811953
58493 811953 808307 803895 800319 798553 797776 798228 801914 808938 816503 823371 832076 844833 860517 877607
58479 877607 896880 919053 942757 966731 990965 1013833 1031411 1041641 1046072 1045809 1039346 1026411
58467 1026411 1010256 993799 976993 960157 946125 936483 929274 923100 919969 921489 925874 931657 940764
58454 940764 954824 971729 988845 1006271 1023818 1038072 1045864 1047760 1045211 1037381 1023891 1007577
58442 1007577 991317 975017 958610 944718 935060 927390 919390 912642 909441 908720 908531 909693 913546
58429 913546 918828 924136 930880 940639 952300 964724 979231 996281 1012649 1025042 1033712 1039650 1041523
58416 1041523 1038544 1033032 1026837 1018504 1007161 995632 986192 976766 964935 952213 940683 929005
58404I29005j3325j2886j0193q847q967p071l520k420l623k643P76K098P46J154
58390H60284M047M905K581J231K174J888k42l65K008K634P79O14K859L311J473
58375H90181K154O353R118Q682R265J2436J4134J2896J2592J4508J5004J3565
58363A020888J4688J9130K1756K0732K0275K1730K0678J5774J1657J0115P155
58352A204578J740j492j264k368o292q193o244m836n340l274K089N025L862M391
58338A182382R128J2955J3367J4967J9620K2214K0620J9911K2149K2025J7260
58327A376598J3247J2710J0890N767K727M095M508J726J365N606Q054N436L606
58314A456335O186Q073O159N446Q361Q864L563j953l795n674q427n444M929J4200
$$ plain form
58404 929005 915680 902794 892601 883754 874787 867716 864196 861776 858153 855510 856286 858384 859130 860284
58390 860284 864331 869236 871817 873048 875222 877110 876868 876503 878511 881145 881924 882538 885397 888708 890181
58375 890181 892335 898688 907806 916488 925753 938189 952323 965219 977811 992319 1007323 1020888
58363 1020888 1035576 1054706 1076462 1097194 1117469 1139199 1159877 1175651 1187308 1197423 1204578
58352 1204578 1206318 1204826 1203562 1201194 1194902 1186709 1180465 1175629 1170289 1167015 1169104 1174129 1177991 1182382
58338 1182382 1191510 1204465 1217832 1232799 1252419 1274633 1295253 1315164 1337313 1359338 1376598
58327 1376598 1389845 1402555 1413445 1419212 1421939 1426034 1430542 1432268 1433633 1439239 1447293 1452729 1456335
58314 1456335 1462521 1470594 1476753 1482199 1490560 1499424 1502987 1501034 1497239 1491565 1483138 1477694 1482623 1496823
58300A496823J7356J9795K4380K4588J7850J2727J4715J7485J6278J7056K3775
58289A702828K9524K9348K9177L3060L4465K9537K5936K8939L1876K9833K9329
58278B033852L4521L7741L4198L2036L6953M1086L8318L6148M0659M4407M1517
58267B451436M0048M6685N3757N4415N5775O3743O9983O7820O5729P0848P4615
58256C114854O9415O3769O5898O8227O3603O0568O6599P2735P1214P1337Q1135
58245C869354R0936R2352R5218J07716J18805J19404J21294J35000J49100J52468
58235E051647J56245J71666J87378J92159J98334K18203K39368K48993K59762
58226F923755K85158L12567L28649L46853L80787M15960M38688M65884N13752
$$ plain form
58300 1496823 1514179 1533974 1558354 1582942 1600792 1613519 1628234 1645719 1661997 1679053 1702828
58289 1702828 1732352 1761700 1790877 1823937 1858402 1887939 1913875 1942814 1974690 2004523 2033852
58278 2033852 2068373 2106114 2140312 2172348 2209301 2250387 2288705 2324853 2365512 2409919 2451436
58267 2451436 2491484 2538169 2591926 2646341 2702116 2765859 2835842 2903662 2969391 3040239 3114854
58256 3114854 3184269 3248038 3313936 3382163 3445766 3506334 3572933 3645668 3716882 3788219 3869354
58245 3869354 3960290 4052642 4147860 4255576 4374381 4493785 4615079 4750079 4899179 5051647
58235 5051647 5207892 5379558 5566936 5759095 5957429 6175632 6415000 6663993 6923755
58226 6923755 7208913 7521480 7850129 8196982 8577769 8993729 9432417 9898301 10412053
58217A0412053N65415O04287O49385P20415P99630Q68296R47502J059730J185256
58208A7811969J303456J440232J624934J840703K071945K357370K736808L194013
58200C4381430L717946M367032N199674O203834P382099Q838362J0683747J2940801
58192I3714925J5659448J9028349K3224165K8257292L4068172M0380950M5869070
58185C00202371M7601683M2325888K9164413J1028545p033847k0982087k9434631
58178C72872335l3021007l3089268l1127211k8559138k6307060k4483855k2727334
58171A73557462k0791442j8716392j6612731j4539654j2571093j0799810r255949
58164G0270391p919343o798932n911648n201911m570119l976727l453087l021618
$$ plain form
58217 10412053 10977468 11581755 12231140 12951555 13751185 14619481 15566983 16626713 17811969
58208 17811969 19115425 20555657 22180591 24021294 26093239 28450609 31187417 34381430
58200 34381430 38099376 42466408 47666082 53869916 61252015 70090377 80774124 93714925
58192 93714925 109374373 128402722 151626887 179884179 213952351 254333301 300202371
58185 300202371 347804054 390129942 419294355 430322900 423289053 402306966 372872335
58178 372872335 339851328 306762060 275634849 247075711 220768651 196284796 173557462
58171 173557462 152766020 134049628 117436897 102897243 90326150 79526340 70270391
58164 70270391 62351048 55552116 49640468 44438557 39868438 35891711 32438624 29417006
58156B9417006k666126k369209k121538j900476j686252j491732j338201j215106
58148A4628366j098906r92943r10784q38876p55170o68801o03228n54478n02475
58139G702705m49552m11487l82772l46296l07146k83238k71489k54864k34291
58130D761570k23175k18187k04955j85767j74013j67827j55430j39936j33244
58121C159036j31853j23350j10596j05535j05303r8026q6312q1816q2065p5480
58111B158700o4304o0241o1849n7912m9230m6056m7608m4496l8002l7235m0510
58100A611257l8723l3970l5815m2142m2336l6785l5029l7080l4570k8239k6615
58089A219953k9005k6857k0616j8671k0967j9679j4921j4015j6362j4476r077
$$ plain form
58156 29417006 26750880 24381671 22260133 20359657 18673405 17181673 15843472 14628366
58148 14628366 13529460 12536517 11625733 10786857 10031687 9362886 8759658 8205180 7702705
58139 7702705 7253153 6841666 6458894 6112598 5805452 5522214 5250725 4995861 4761570
58130 4761570 4538395 4320208 4115253 3929486 3755473 3587646 3432216 3292280 3159036
58121 3159036 3027183 2903833 2793237 2687702 2582399 2484373 2398061 2316245 2234180 2158700
58111 2158700 2094396 2034155 1972306 1914394 1865164 1819108 1771500 1727004 1689002 1651767 1611257
58100 1611257 1572534 1538564 1502749 1460607 1418271 1381486 1346457 1309377 1274807 1246568 1219953
58089 1219953 1190948 1164091 1143475 1124804 1103837 1084158 1069237 1055222 1038860 1024384 1015307
58078A015307q072j1369j1465q307r105j3922j5497j2907j1702j1135m964N234
58066I02096J0721R432O742L360m785j5280k0803k1734k4915l0363l1608k8762
58054G54101k8589l1536l1026k6056k2453k1260j7551j1341q229q549p010l560
58042E36941l574o801p236m504m441p615q190n171l999n899o073l750l801o948
58028D58939q238o645o653r040r524p722q089j0776j0833p746o612q577r060o780
58014C42644n702o728o156l551k705l751k806j35p3k152j231K681L941J565Q08
57999C16649L142L875J545N83K566L560K296K469M766M908J865j30J60j109m540
57984C42605n396k343l02j863l537l109l119m409l752o79N71j396k697j798k282
$$ plain form
58078 1015307 1007235 995866 984401 976094 966989 953067 937570 924663 912961 901826 896862 902096
58066 902096 912817 922249 928991 932351 927566 912286 891483 869749 844834 814471 782863 754101
58054 754101 725512 693976 662950 636894 614441 593181 575630 564289 556060 547511 540501 536941
58042 536941 533367 526566 519330 514826 510385 502770 494580 489409 485410 479511 473438 469688 465887 458939
58028 458939 450701 444056 437403 428363 418839 411117 403028 392252 381419 373673 367061 358484 349424 342644
58014 342644 336942 330214 324058 320507 317802 314051 311245 311110 311037 308885 307654 310335 314276 315841 316649
57999 316649 319791 323666 325211 325794 328360 331920 334216 336685 341451 346359 348224 348094 348254 347145 342605
57984 342605 337209 334866 334564 332701 329164 326055 322936 318527 314775 314096 314667 313271 310574 308776 306494
57969C06494n381o981n170l638m487m383j211J905K526K805M421N330M402L754
57955C00386M011K827K43k80J774K596J014O09K815M258L344L087M894N846M760
57940C42184M686O787P913O944P251J0046J1610J0177R291J1077J2279J0364P755
57927D58364O555M777J236j384j764k752n672p359o261n919q727j1579j1493j0420
57913C97602j0683j0611q606o822o978o954n080l393l288k526k6J124r87l282
57899C29490k864j559j689j729l5J367N53n38K16J439J568J985L542L958K042
57884C37746O04J750L147K321P07J20q56l342n049m312l581n161p090o850n681
57869C04473n601n578m251l119l464l423j545Op86k131j888j284j761j565R01
$$ plain form
57969 306494 301113 294132 288962 285324 280837 276454 275243 277148 279674 282479 286900 292230 296632 300386
57955 300386 304397 307224 307467 307187 308961 311557 312571 313180 315995 320253 323597 326684 331578 337424 342184
57940 342184 346870 353657 361570 368514 375765 385811 397421 407598 416889 427966 440245 450609 458364
57927 458364 464919 469696 470932 469548 467784 465032 459360 452001 445740 439821 431094 419515 408022 397602
57913 397602 386919 376308 367702 360880 353902 346948 341868 338475 335187 332661 332635 333759 332772 329490
57899 329490 326626 325067 323378 321649 321614 322981 323534 322996 323212 324651 326219 328204 331746 335704 337746
57884 337746 338350 340100 343247 345568 346275 346395 345539 342197 337148 332836 329255 324094 317004 310154 304473
57869 304473 298872 293294 289043 285924 282460 279037 277492 277498 276712 274581 272693 271409 269648 268083 268984
57854B68984L506L847L234L777M494L821L069L852M828M246L038K377J199r26
57840C13346j727j71R02o52k485j967o41q51j336k08R58J37r43J83K177K405J575
57823C10702J884K847K807K431L023L528K680J940K868L878L001J493J304J385
57809C45771p4k169l427m879p593r678r348q360q921r742q814p363p201o926m797
57794B46479k762l329m892m460k794k419k714j527K88N07k9R10K489K509J996
57779B30252L465O021O811O192O870Q773R347Q426Q318R325R243P361N279L848
57765C29531K485J228M90o76l128n314n380m516n072o509o546n309m867n419n414
57750B75584m640m018l108j047Q82Q27m24q63q04j729k874k484j468k097l830
$$ plain form
57854 268984 272490 276337 279571 283348 287842 291663 294732 298584 303412 307658 310696 313073 314272 313346
57840 313346 311619 311448 312350 311698 309213 307246 306605 305754 304418 304210 305168 305305 304362 304545 306722 309127 310702
57823 310702 312586 315433 318240 320671 323694 327222 329902 331842 334710 338588 341589 343082 344386 345771
57809 345771 345697 343528 340101 335222 327629 317951 308603 300243 291322 281580 272766 265403 258202 251276 246479
57794 246479 243717 240388 235496 231036 228242 225823 223109 221582 221870 222377 222348 223258 225747 228256 230252
57779 230252 233717 239738 246549 252741 259611 268384 277731 286157 294475 303800 313043 320404 325683 329531
57765 329531 332016 333244 333734 333058 329930 324616 319236 314720 309648 303139 296593 291284 286417 280998 275584
57750 275584 270944 266926 263818 262771 263653 264480 264056 263193 262389 260660 257786 255302 253834 251737 247907
57735B47907m113k705j660j526j116n40r73j748j052P59J710J675K117K819K177
57720B43731M97k24L97R68J118J504J492j41k477l348k664k164k367k539k974
57705B30809m377n609n060l618l344l895l370k042j944l230m104l953l612k987
57691A79664j434P3J73j65Q22K326K306J332J576K812L081K678L650N757O889
57676B11540P333R658J4271J8937K3028K8512L6213M4631N3264O3894P7476R1797
57664F80554J02143J02230Q6066N3080J1573k6406n4031p1350p9825p9949p4016
57653F50069o6224n8653n0622m2388l5849l1011k5834k0298j6785j5561j3861
57642B72983j0611q208q107q282o860m974m230m102l591k919k165o48J179J657
$$ plain form
57735 247907 243794 241089 239429 237903 236787 236247 235274 233526 232474 233233 234943 236618 238735 241554 243731
57720 243731 244228 244004 244401 245369 246487 247991 249483 249342 246865 243517 240853 238689 236322 233783 230809
57705 230809 226432 220823 215763 212145 208801 204906 201536 199494 197550 194320 190216 186263 182651 179664
57691 179664 178230 178303 178476 178311 179133 181459 183765 185097 186673 189485 192566 195244 198894 204651 211540
57676 211540 218873 228531 242802 261739 284767 313279 349492 394123 447387 511281 588757 680554
57664 680554 782697 884927 970993 1024073 1035646 1009240 955209 883859 804034 724085 650069
57653 650069 583845 525192 474570 432182 396333 365322 339488 319190 302405 286844 272983
57642 272983 262372 254164 246057 237775 230915 225941 221711 217609 214018 211099 208934 208286 209465 211122
57628B11122P70N08J533K119J323M49L44M8p80r37l02o51k521l970l763l195l411
57611A98686l453k558j905k460l192k924k158j781j644j461j446j296l80N57k4
57596A72561j744k461j718j497k820m153m178l716l758l853l564l410l431k864
57582A29394j946j950k808k946k117j947l039m000m057m091m338l699k176j399
57568H8881j830k054j600j765k819l232k589k388k913k468q82n01k085k938j099
57553E7718J557K434J855J450J421J479K308L973M865M061K884K486K062R85M34
57538I1972J144J734J140M75O56M68j047k386k002r25q56j453j554j455j870k168
57522H1873j569o97k82J74R31R59J1k12J348L161L573L283L489L452K105L68k79
$$ plain form
57628 211122 211892 212400 213933 216052 217375 217824 218168 218216 217436 216499 216197 215546 213025 209055 205292 202097 198686
57611 198686 195233 192675 190770 188310 185118 182194 180036 178255 176611 175150 173704 172408 172028 172585 172561
57596 172561 170817 168356 166638 165141 162321 158168 153990 150274 146516 142663 139099 135689 132258 129394
57582 129394 127448 125498 122690 119744 117627 115680 112641 108641 104584 100493 96155 92456 90280 88881
57568 88881 87051 84997 83397 81632 78813 75581 72992 70604 67691 65223 64341 63840 61755 58817 57718
57553 57718 59275 61709 63564 65014 66435 67914 70222 74195 79060 83121 86005 88491 90553 91538 91972
57538 91972 93116 94850 95990 96465 97121 97589 96542 94156 92154 91229 90373 88920 87366 85911 84041 81873
57522 81873 80304 79607 79325 79499 80430 81389 81400 81188 82536 85697 89270 92553 96042 99494 101599 101967 101688
57505A01688j77m03p36o55q82k019k930k520j775k177l290l801l786m087m513
57490F7937m390l939l579k971k012j571j972k160j653j623k657l238k094l79K40
57475C3939j6j97m89j132j246n16l41j426k136j178Jl03j052n37L63j84j520j603
57457B0427n53j99q00r58l34L6j56l04n08j342k307k322j500p59j94N86J130Q16
57439A0759J94P3k1q38j660j293j70L19K4j46j1j53n49o90o64q38r48o21j80N
57419B592J87L69j32j260E3h58k00n68j033n84j29p19j428r51Q4L41N7J25J40
57400e723n97j282q44O1K21k9K54P05N67L49O72P26j43p11J64J318J293J120F12
57380E046M590K922J224p4j778l261l030j644j275C88b763k981k738k818k486
$$ plain form
57505 101688 101511 101108 100372 99717 98835 96816 93886 91366 89591 87414 84124 80323 76537 72450 67937
57490 67937 63547 59608 56029 53058 51046 49475 47503 45343 43690 42067 39410 36172 34078 33699 33939
57475 33939 33923 33726 33237 32105 30859 30343 30002 28576 26440 25262 25263 24960 23908 23371 23734 23550 22030 20427
57457 20427 19874 19675 18875 17917 17583 17619 17463 17159 16651 15309 13002 10680 9180 8421 8227 8813 9943 10759
57439 10759 10953 11026 11005 10167 8507 7214 7044 7363 7387 7241 7230 7077 6528 5838 5174 4336 3388 2767 2587 2592
57419 2592 2779 3148 3016 1756 53 -858 -1058 -1626 -2659 -3243 -3372 -4091 -5519 -6470 -6386 -6045 -5988 -5863 -5723
57400 -5723 -6320 -7602 -8446 -8385 -8164 -8193 -7939 -7234 -6667 -6318 -5646 -4920 -5063 -5774 -5610 -4292 -2999 -1879 612
57380 5046 9636 12558 13782 13708 11930 8669 5639 3995 2720 388 -2763 -5744 -8482 -11300 -13786
57365a3786j746j577k075k207j585q69l89L9J06o04j495j643j199p88k61N38P26
57348b8815j49p20K33J564J547P38O96J113P20K1K95P88k02k065k736k267k458
57331c1697l250k702o50P29L99k99l73m29p72o96k53m89j436j964j900k152k623
57314e0557k267j341j294k134k260j256m98o54q33o07p15j331j779k212l421m759
57298g7918m612l169k363k707k668j637r09j013o40Q01J875J518O62M17M27R7
57282i1839k00j25q0j77Q2O06O44K68L73R59J078P21R00J663J975J718J806K082
57264g7546J345j77p28O1M75l93j245r85l13k9K10M65j38j620k521k048j188q41
57246h7216n67l6R1m12o55k66p8m72o67l62l97j108j760k208l320n037n907n400
$$ plain form
57365 -13786 -15532 -17109 -19184 -21391 -22976 -23845 -24234 -24195 -24089 -24693 -26188 -27831 -29030 -29818 -30079 -29541 -28815
57348 -28815 -28964 -29684 -29451 -27887 -26340 -25602 -24906 -23793 -23073 -23052 -22757 -21969 -22171 -24236 -26972 -29239 -31697
57331 -31697 -34947 -37649 -38299 -37570 -37171 -37470 -37843 -38272 -39044 -39740 -39993 -40482 -41918 -43882 -45782 -47934 -50557
57314 -50557 -52824 -54165 -55459 -57593 -59853 -61109 -61607 -62261 -63094 -63701 -64416 -65747 -67526 -69738 -73159 -77918
57298 -77918 -82530 -85699 -88062 -90769 -93437 -95074 -95983 -96996 -97636 -96835 -94960 -93442 -92780 -92363 -91936 -91839
57282 -91839 -92039 -92164 -92244 -92421 -92339 -91733 -91089 -90821 -90448 -89489 -88411 -87690 -86790 -85127 -83152 -81434 -79628 -77546
57264 -77546 -76201 -76378 -77106 -77045 -76570 -76963 -78208 -79193 -79506 -79535 -79325 -78860 -78998 -80618 -83139 -85187 -86375 -87216
57246 -87216 -87783 -87819 -87728 -88140 -88795 -89061 -89139 -89611 -90278 -90640 -91037 -92145 -93905 -96113 -99433 -104470 -110377 -115777
57228a15777m814n030n287n037n115o003o680o346n673n380n074m484m222m334
57214a89256l671j630Q63L014N202P704R838J1253J2569J3990J4757J4608J4250
57201h6509J3896J2987J1846J1728J2641a0376A964J1831J2271J2895J3341J4462
57189F6764J6322J7561J7803J8447K0070K1240K1100K0838K1250K1203J9988J9012
57177C01598J9384J9904J9176J7863J7029J6131J4422J2784J2326J2691J3323
57166D76631J4784J7205J9087J9426J9594K1381K4644K8503L3268L9381M5795
57155G59699N1296N6194O1226O6014P0215P4695P9971Q4938Q8642R1652R3886
57144A578428R2673Q5130P1322N3287L2564J0788q628k2003k8017k7224k0216
$$ plain form
57228 -115777 -120591 -125621 -130908 -135945 -141060 -147063 -153743 -160089 -165762 -171142 -176216 -180700 -184922 -189256
57214 -189256 -192927 -194557 -193694 -190680 -185478 -177774 -167936 -156683 -144114 -130124 -115367 -100759 -86509
57201 -86509 -72613 -59626 -47780 -36052 -23411 -10376 1964 13795 26066 38961 52302 66764
57189 66764 83086 100647 118450 136897 156967 178207 199307 220145 241395 262598 282586 301598
57177 301598 320982 340886 360062 377925 394954 411085 425507 438291 450617 463308 476631
57166 476631 491415 508620 527707 547133 566727 588108 612752 641255 674523 713904 759699
57155 759699 810995 867189 928415 994429 1064644 1139339 1219310 1304248 1392890 1484542 1578428
57144 1578428 1671101 1756231 1827553 1880840 1913404 1924192 1915564 1893561 1865544 1838320 1818104
57133A818104q275N222J6578K4751L1081L6815M2293M7506N1628N3032N1701N0739
57121B221175N3528O0014O7362P3313P7139P8469P7647P6710P7967Q1679Q6752
57110C031755R3040J01267J11490J23762J39724J61480J89182K21737K59879L06832
57100D740148L66300M41781N37761O59632Q12051R98676J223123J488089J792963
57091A3060524K133421K503095K893837L294187L689181M061072M386157M628461
57083D0649935M740845M681977M440794M046787L552970L003623K414072J777334
57075F9308337J086168L48340m13230j167174j878869k514547l046124l454463
57067E8268438l729938l872921l894473l813586l651232l427120l161337k875439
$$ plain form
57133 1818104 1809829 1815051 1831629 1856380 1887461 1924276 1966569 2014075 2065703 2118735 2170436 2221175
57121 2221175 2274703 2334717 2402079 2475392 2552531 2631000 2708647 2785357 2863324 2945003 3031755
57110 3031755 3124795 3226062 3337552 3461314 3601038 3762518 3951700 4173437 4433316 4740148
57100 4740148 5106448 5548229 6085990 6745622 7557673 8556349 9779472 11267561 13060524
57091 13060524 15193945 17697040 20590877 23885064 27574245 31635317 36021474 40649935
57083 40649935 45390780 50072757 54513551 58560338 62113308 65116931 67531003 69308337
57075 69308337 70394505 70742845 70329615 69162441 67283572 64769025 61722901 58268438
57067 58268438 54538500 50665579 46771106 42957520 39306288 35879168 32717831 29842392
57059B9842392k589418k318304k071845j854773j666141j501256j356730j232664
57051A5251261j129124j042840r68912r03508q43289p84699p26133o69001o14742
57042G569013n62685n12542m66448m26072l89808l55259l22472k92270k63571
57033C977886k35233k08653j85565j64969j44966j25800j08141r0301p0294m8671
57023B595293k6015o26K6188M4232M0454J2330k8642o7433r5877j12868j19860
57012B267176j19218j14128j06960r8356q8682p9015p0188o2318n5620n0275m5459
57001A376957m0138l4797l0761k8091k5844k4000k3172k2743k1411j9375j7960
56990A088665j7275j6246j4568j2576r667n137k68K770L692L429J294m250j2130
$$ plain form
57059 29842392 27252974 24934670 22862825 21008052 19341911 17840655 16483925 15251261
57051 15251261 14122137 13079297 12110385 11206877 10363588 9578889 8852756 8183755 7569013
57042 7569013 7006328 6493786 6027338 5601266 5211458 4856199 4533727 4241457 3977886
57033 3977886 3742653 3534000 3348435 3183466 3038500 2912700 2804559 2714258 2643964 2595293
57023 2595293 2569278 2568652 2594840 2639072 2679526 2691856 2663214 2595781 2499904 2387036 2267176
57012 2267176 2147958 2033830 1926870 1828514 1739832 1660817 1590629 1528311 1472691 1422416 1376957
57001 1376957 1336819 1302022 1271261 1243170 1217326 1193326 1170154 1147411 1126000 1106625 1088665
56990 1088665 1071390 1055144 1040576 1028000 1018333 1013196 1012928 1015698 1019390 1022819 1024113 1019863 1007733
56977A007733j8843k2410k3587k3102k0559j6413j2235q293l302K800Q317J2610
56965H82716J7054K2429K7644L1909L6106M1145M6793N2628N8104O0988N7851
56954A335367M7261L1131J2626n695k1486l2706l9130m2315m3522m2925m0929
56943A157677l8515l6007l3048k9910k7191k4260j9888j4370r098m078K005R274
56931I32591J6252K1746K4743K2655J2836l324k0286l3282m1417m5735m6857m5462
56919G94460m2782l9365l4916k9987k6048k3402k0925j8249j6250j5019j3558
56908E13959j1852j1021j0958j0128q254o824o366n594m011k875k639j833M14
56895D32018K942M682O212Q144J0028J1858J4693J8817K3070K6711K9853L1361
$$ plain form
56977 1007733 988890 966480 942893 919791 899232 882819 870584 862291 858989 861789 870106 882716
56965 882716 899770 922199 949843 981752 1017858 1059003 1105796 1158424 1216528 1277516 1335367
56954 1335367 1382628 1413759 1426385 1420690 1399204 1366498 1327368 1285053 1241531 1198606 1157677
56943 1157677 1119162 1083155 1050107 1020197 993006 968746 948858 934488 925390 921312 923317 932591
56931 932591 948843 970589 995332 1017987 1030823 1027499 1007213 973931 932514 886779 839922 794460
56919 794460 751678 712313 677397 647410 621362 597960 577035 558786 542536 527517 513959
56908 513959 502107 491086 480128 470000 461746 454922 448556 442962 438951 436076 433437 431604 432018
56895 432018 434960 439642 445854 453998 464026 475884 490577 509394 532464 559175 589028 620389
56883F20389K8722K1225J1302J750o483j3035j6987j8167j7724j6316j3584r997
56871E71095p041m754j361L695Q735J2854J7460K3675L0713L8204M7551N9026
56859G99852O9401P4091P0185N6631L4228P164j7650l5054m4531m7948m6689m2137
56847H77543l6434l0736k4326j6832r464k740M794J4122K4188L4403M6469O1902
56835I42889P9797R8508J16614J29660J28730J06494O4848J4616l1775o6329q6694
56824A497358r4868r4932r0206q2150p1959o1539n1984m2586l2665k2845j3439
56813H38185l308Q296K0413L2353M5351O0566P6372Q8485R1424P9875N1963J3175
56801A403150k5273n4310p2145q1103q2780p8503p1444o4546n7682m9466m0509
$$ plain form
56883 620389 649111 670336 681638 683388 676905 663870 646883 628716 610992 594676 581092 571095
56871 571095 564054 559300 557939 561634 570369 583223 600683 624358 655071 693275 740826 799852
56859 799852 869253 943344 1013529 1070160 1104388 1111552 1093902 1058848 1014317 966369 919680 877543
56847 877543 841109 810373 786047 769215 759751 757011 761805 775927 800115 834518 880987 942889
56835 942889 1022686 1121194 1237808 1367468 1496198 1602692 1667540 1682156 1650381 1584052 1497358
56824 1497358 1402490 1307558 1217352 1135202 1063243 1001704 949720 907134 874469 851624 838185
56813 838185 834877 843173 863586 895939 941290 1001856 1078228 1166713 1258137 1338012 1389975 1403150
56801 1403150 1377877 1323567 1251422 1170319 1087539 1009036 937592 873046 815364 765898 725389
56790G25389l2364k4835j6964r449l444J966Q601J6543K4887L3720M2459M7219
56778H13728M3020K8871Q839j1664k8859m0805m7164m9077m7993m4702m0136l5885
56766E48173l2624k9194k4699k0251j7221j5138j2986j1224j0634j0455r568q421
56754C45758p922p577o558n448n101m853l747k432k033k273k396k710l462l576
56740B85670k409j286j390j638p34K24l66j585j456k50K33k01k53K93N13K10n4
56723B75521j75o2J012K874L648K337P25O65J178N55m84m01J22k74n49R37K824
56706B90453K470L79n57L12R26M18J50P26J084P63M44Q8r80k128k023j097r56
56689B90472j555j406m72k85j138j685j464j466k027k327k140k082k104j623j026
$$ plain form
56790 725389 693025 668190 651226 641777 638333 640299 648900 665443 690330 724050 766509 813728
56778 813728 856748 885619 894458 882794 853935 813130 765966 716889 668896 624194 584058 548173
56766 548173 515549 486355 461656 441405 424184 409046 396060 384836 374202 363747 354179 345758
56754 345758 337836 330259 323701 318253 313152 308299 304552 302120 300087 297814 295418 292708 289246 285670
56740 285670 283261 281975 280585 278947 278213 278437 278071 276486 275030 274780 275013 274812 274559 274852 275365 275575 275521
56723 275521 275346 275284 276296 279170 282818 285155 285880 286545 287723 288278 287794 287393 287515 287241 286692 287629 290453
56706 290453 292923 293302 292745 293057 293983 294401 294551 295277 296361 297124 297568 297656 296676 294548 292525 291428 290472
56689 290472 288917 287511 287039 286754 285616 283931 282467 281001 278974 276647 274507 272425 270321 268698 267672
56674B67672j133j527j271p37p86q18J64J323J239O21J203K523K678J780J731
56659B74662K715K909J793R47J230J745J942K392L090L208K847K985L591L670
56645C09726L162K858K611J743Q45J064J870J807J065R91J455J135J20k48L4k91
56629C29947j226j551j185j131j318q69k49o97j831k213j963k293k895k500j575
56614C06451j662k452k376j672j903k747k431j151p73j354j195l29n24j708j833
56599B82341o29p9p44r94l72l46j106q92O05J501J122J020J703J532m9j191p58
56582B82664K6P7M5L91M22R6M45J442J831J530J722K342K137J475K102L795M425
56565C06967L700L656M958O083O729Q512J1512J3628J4232J4907J5551J3627Q666
$$ plain form
56674 267672 266539 265012 263741 263004 262218 261400 261564 262887 264126 264747 265950 268473 271151 272931 274662
56659 274662 277377 280286 282079 283026 284256 286001 287943 290335 293425 296633 299480 302465 306056 309726
56645 309726 312888 315746 318357 320100 320945 322009 323879 325686 326751 327742 329197 330332 330452 330204 330238 329947
56629 329947 328721 327170 325985 324854 323536 322667 322418 321721 319890 317677 315714 313421 310526 308026 306451
56614 306451 304789 302337 299961 298289 296386 293639 291208 290057 289284 287930 286735 286406 285882 284174 282341
56599 282341 281712 281633 280889 279895 279523 279177 278071 277179 277784 279285 280407 281427 283130 284662 284613 283422 282664
56582 282664 282690 282767 282812 283203 283625 283721 284166 285608 287439 288969 290691 293033 295170 296645 298747 302542 306967
56565 306967 310667 314323 319281 325364 332093 340605 352117 365745 379977 394884 410435 424062 432728
56552D32728L950J992J563Q50L24P33J190J050J047J184K37j495j929q03m71j830
56536D40320k888k677l030m761n701m624l692m727o185o182n643n945o205n403
56522C72657m679n176n759n104l965l439l158k848l348m423m134k072o67j438
56508C22447k624k391j671j772j801p53K50M2m72k24O3l73q22r20j610k842k873
56491C01654j352l46p18n43J154K330J563N28O09L09j399k430j097O78O42j04
56475C01478L14R55L19l30P81K390K230Q61L93Q72Q78L24J17J97J51M43J166J120
56457C14659j53j205j118r57j299q32P86J455M7j355q98J78L68O99K133L020J993
56440C17521P79J209J946J061m91r23p65j118j073K68J407R22P0K50L18q04j493
$$ plain form
56552 432728 436678 438670 440233 441083 441407 442140 443330 444380 445427 446611 446848 445353 443424 442621 442150 440320
56536 440320 437432 434755 431725 426964 421263 416639 412947 408220 402035 395853 390210 384265 378060 372657
56522 372657 367978 362802 357043 351939 347974 344535 341377 338529 335181 330758 326624 324552 323885 322447
56508 322447 319823 317432 315761 313989 312188 311435 311685 311727 311255 311031 311094 310721 309899 308979 307369 304527 301654
56491 301654 300302 299956 299238 298695 299849 302179 303742 304270 304879 305188 303789 301359 300262 300940 301582 301478
56475 301478 301792 302747 303066 302736 303517 305907 308137 308998 309391 310263 311141 311465 311582 311779 311930 312373 313539 314659
56457 314659 314506 313301 312183 311226 309927 309095 309881 311336 311383 310028 309130 309308 309676 310375 312508 315528 317521
56440 317521 318300 319509 321455 322516 322025 321102 320337 319219 318146 318414 319821 320743 320813 321063 321381 320577 319084
56423C19084k87J099P08k31J05O75p5r29k92N43j36j051l70P81O40K37J068J757
56405C23326O26p82l49P65N58N7R68J872P80q35o30K40l92j232O1K008J654o9
56387C28626j8J567J923R41Q19J578J438P47J224K065J236k46M10K767L690K350
56371C51117P77l3p28q56O47K609K885J873J473J467L75j049q67L53N51j6M17
56354C60995J469J390N99Q01J546J209M62J028K086J592J99J28J121J241O36Q31
56338C77333J351Q51L55J589L295L133J960K275L640L761K797K538K571J551Q60
56323D09860K487M652M098J627O22J256J014j31p1Q15L53p89j71J428J087p59
56307D27378r83N98J271P39J277K822L025K133K805N006N908M965M411M736M369
$$ plain form
56423 319084 318797 319896 320604 320373 320478 321153 321078 320149 319857 320400 320264 319213 318843 319624 320264 320501 321569 323326
56405 323326 323952 323170 322821 323586 324144 324201 325169 327041 327821 326986 326356 326596 326204 324972 325033 327041 328695 328626
56387 328626 328608 330175 332098 333039 333858 335436 336874 337621 338845 340910 342146 341900 342310 345077 348767 351117
56371 351117 351894 351861 351133 350277 350924 353533 356418 358291 359764 361231 361606 360557 359690 360043 360594 360578 360995
56354 360995 362464 363854 364453 365254 366800 368009 368471 369499 371585 373177 373376 373504 374625 375866 376502 377333
56338 377333 378684 379535 379890 381479 384774 387907 389867 392142 395782 399543 402340 404878 407449 409000 409860
56323 409860 412347 416999 421097 422724 423346 424602 425616 425485 425414 426229 426582 425793 425622 427050 428137 427378
56307 427378 426395 426993 428264 429003 430280 433102 436127 438260 441065 446071 451979 456944 461355 466091 470460
56292D70460L679M623O522O880O178P121R366R960Q796Q596R708R906R245R963
56278E81003J1654J1711J0539J1055J2998J3168J1461J1295J3607J5761J6809
56267G21061J8632K1330K2675K2638K3507K5259K5889K6366K9866L5843M0488
56256A013554M3377M8074N5628O3221O9980P8461Q9399J00465J11138J23532J37539
56245A934368J50445J61901J74054J86204J94856J99482K02586K03724J99338
56236C606958J89017J75694J59087J35363J04409P1133L8380M758k9405o0343
56226D395051q6609j10382j31674j47341j57192j64816j70988j72622j69638j66250
56216B917539j63779j58784j50192j41603j34522j25938j14909j04980r7717r0222
$$ plain form
56292 470460 474139 478762 485284 492164 498342 505463 514829 524789 533585 542181 551889 561795 571040 581003
56278 581003 592657 604368 614907 625962 638960 652128 663589 674884 688491 704252 721061
56267 721061 739693 761023 783698 806336 829843 855102 880991 907357 937223 973066 1013554
56256 1013554 1056931 1105005 1160633 1223854 1293834 1372295 1461694 1562159 1673297 1796829 1934368
56245 1934368 2084813 2246714 2420768 2606972 2801828 3001310 3203896 3407620 3606958
56236 3606958 3795975 3971669 4130756 4266119 4370528 4441661 4480041 4484799 4455394 4395051
56226 4395051 4308442 4198060 4066386 3919045 3761853 3597037 3426049 3253427 3083789 2917539
56216 2917539 2753760 2594976 2444784 2303181 2168659 2042721 1927812 1822832 1725115 1634893
56206A634893q1466p4609p0553o5609n8252n1966m8683m5502m0573l6245l3773
56195A027662l0833k6743k4239k3764k2104j8767j7336j8326j7466j3426j0370
56184H04288j0249r529o435m381n057n071k815j812l735m827k794p78j009r58
56170G44838P93J414p7j39K559M301L398L262N229N499K694J202L314N261M807
56155G88355N374Q676J0801R910J0311J4379J7867J7828J7840K0642K3005K2870
56143I67858K4153K9408L4940L8316M3577N3742O5292P5283Q6806J01955J16349
56132A637679J25789J31324J32868J25659J08813R0082P6335O6262N7508N2828
56122B605147N2946N1180M2017K8455J5135J479j2494k1491k2822k2153k5422
$$ plain form
56206 1634893 1553427 1478818 1408265 1342656 1284404 1232438 1183755 1138253 1097680 1061435 1027662
56195 1027662 996829 970086 945847 922083 899979 881212 863876 845550 828084 814658 804288
56184 804288 794039 784510 778075 773694 768637 763566 760751 758939 755204 750377 747583 746805 745796 744838
56170 744838 745631 747045 746968 746829 749388 753689 757087 760349 765578 771077 773771 774973 778287 783548 788355
56155 788355 793729 802405 813206 823116 833427 847806 865673 883501 901341 921983 944988 967858
56143 967858 992011 1021419 1056359 1094675 1138252 1191994 1257286 1332569 1419375 1521330 1637679
56132 1637679 1763468 1894792 2027660 2153319 2262132 2352214 2428549 2494811 2552319 2605147
56122 2605147 2658093 2709273 2751290 2779745 2794880 2796359 2783865 2762374 2739552 2717399 2691977
56111B691977l1994m0989n6026p7261r6759j08348j14570j18214j15675j05321
56101A826820r3442q4723p5357o2550n1679m6471m1326l1612k2551j9347j7504
56090A280258j1853o471o347p571n032j729j473n99M102P590N863M343P887J1230
56076A280198Q913N572O552P496L557k68J265K834j685p590q320p039q070o182
56062A277233L742J5319K0777K3498K8766L1599K6368J9229J8010J8771J5370
56051A498682J2936J8208K5601K6830K5542K8609L1926K9034K4848K6473K9310
56040A777999K6646K3630K7147L1524K9342K6417L0528L5583L3125K9217L2980
56029B104138L8828L7534L4624L9661M7463M8444M7474N3634O1402O1206N8517
$$ plain form
56111 2691977 2659983 2618994 2562968 2485707 2388948 2280600 2166030 2047816 1932141 1826820
56101 1826820 1733378 1648655 1573298 1510748 1459069 1412598 1371272 1339660 1317109 1297762 1280258
56090 1280258 1268405 1261934 1255587 1248016 1242984 1241255 1239782 1239183 1243285 1250875 1256738 1261081 1268968 1280198
56076 1280198 1289111 1294683 1301235 1308731 1312288 1312020 1313285 1316119 1314434 1306844 1298524 1291485 1283415 1277233
56062 1277233 1280975 1296294 1317071 1340569 1369335 1400934 1427302 1446531 1464541 1483312 1498682
56051 1498682 1511618 1529826 1555427 1582257 1607799 1636408 1668334 1697368 1722216 1748689 1777999
56040 1777999 1804645 1828275 1855422 1886946 1916288 1942705 1973233 2008816 2041941 2071158 2104138
56029 2104138 2142966 2180500 2215124 2254785 2302248 2350692 2398166 2451800 2513202 2574408 2632925
56018B632925O2932O8881O7020O3918O9763P7824P7198P4485Q0715Q8845Q7256
56007C451762Q3464R0358J01133J02756J01867J11386J24118J26671J26724J38456
55997D558695J53905J58056J59014J72723J91213J97935K00910K17448K39904
55988F249803K51260K60393K85468L16934L35094L49470L80762M19455M44490
55979I293129M66878N10018N63624O04512O45621P13707P96720Q67482R40673
55970A5402364J048150J177642J298766J429393J608700J826862K055728K325789
55962B8173394K691536L146305L662404M288219N104214O114119P297710Q739608
55954F9217509J0572401J2832354J5534820J8851103K3014761K8099079L4084323
$$ plain form
56018 2632925 2695857 2764738 2831758 2895676 2965439 3043263 3120461 3194946 3275661 3364506 3451762
56007 3451762 3535226 3625584 3726717 3829473 3931340 4042726 4166844 4293515 4420239 4558695
55997 4558695 4712600 4870656 5029670 5202393 5393606 5591541 5792451 6009899 6249803
55988 6249803 6501063 6761456 7046924 7363858 7698952 8048422 8429184 8848639 9293129
55979 9293129 9760007 10270025 10833649 11438161 12083782 12797489 13594209 14461691 15402364
55970 15402364 16450514 17628156 18926922 20356315 21965015 23791877 25847605 28173394
55962 28173394 30864930 34011235 37673639 41961858 47066072 53180191 60477901 69217509
55954 69217509 79789910 92622264 108157084 127008187 150022948 178122027 212206350
55947B12206350M0881210M7568282N1408694M8519954L6672478J7729357l079901
55940D51906424k0529861l2114349l8054441l9718639l8504334l5621239l2034435
55933B15329126k8308591k4673222k1276985j8260597j5645449j3347198j1324256
55926H2492828r603507q176128o984918o008333n251852m657956m121021l599547
55918C4089566l136948k768061k473446k225366k012315j814410j612068j422170
55910A6624782j276798j168507j062125r52514q62242p90207p12755o31284n70297
55901H598053n30158m86877m37143m00473l77650l48638l11878k86151k72913
55892E146172k54127k28118k11561k05109j91791j70508j57693j54506j44808
$$ plain form
55947 212206350 253087560 300655842 352064536 400584490 437256968 454986325 451906424
55940 451906424 431376563 399262214 361207773 321489134 282984800 247363561 215329126
55933 215329126 187020535 162347313 141070328 122809731 107164282 93817084 82492828
55926 82492828 72889321 64713193 57728275 51719942 46468090 41810134 37689113 34089566
55918 34089566 30952618 28184557 25711111 23485745 21473430 19659020 18046952 16624782
55910 16624782 15347984 14179477 13117352 12164838 11302596 10512389 9799634 9168350 8598053
55901 8598053 8067895 7581018 7143875 6743402 6365752 6017114 5705236 5419085 5146172
55892 5146172 4892045 4663927 4452366 4247257 4055466 3884958 3727265 3572759 3427951
55883C427951j27115j17009j16064j08884r3248q3844q3762q0582p2952p3236
55873B471255q1194q2151p4242p1305p5799p4536o4662n8719o0056n7373m7854
55862A723364m2530m4377m3337l7227l5981m1089m1848l6000l3573l6509l4802
55851A296091k6800k3331k7462k9514k6314k6248l0910l0736k3533j9073k0519
55840A011651j9056j1776p387r163r278n114m638j0276j3535j0818q975j0133
55828H91502o584L704J1386J0973P709M464l831j7506k7914l1191l3309l6754
55816G72649l5659k8761k3744k3567k1481j4602r542r442q082k224K472L107N053
55803F06177J0535J3510J1297R907J2492J3492R445M888K543j552q417j2372j1709
$$ plain form
55883 3427951 3300836 3183827 3067763 2958879 2865631 2781787 2698025 2617443 2544491 2471255
55873 2471255 2390061 2307910 2233668 2162363 2086564 2012028 1947366 1888647 1828591 1771218 1723364
55862 1723364 1680834 1636457 1593120 1555893 1519912 1478823 1436975 1400975 1367402 1330893 1296091
55851 1296091 1269291 1245960 1218498 1188984 1162670 1136422 1105512 1074776 1051243 1032170 1011651
55840 1011651 992595 980819 973432 964269 954991 949877 945239 934963 921428 910610 901635 891502
55828 891502 884918 888622 900008 910981 918690 923154 919323 901817 873903 842712 809403 772649
55816 772649 736990 708229 684485 660918 639437 624835 615293 605851 597769 595545 598017 601124 606177
55803 606177 616712 630222 641519 651426 663918 677410 686855 691743 694286 692734 684317 671945 660236
55790F60236j2457j6810j8484j4531j0980j1550j1243o751l115m353o923p910
55778E35129j0387j5371j7663j4862j1751j1033q640k818J446J764K849O793Q112
55765D63568L726j233k793m435q722j1481r970q436r921j0574p604m955n578n867
55751C75725l172j240k843m469l588l744p156r633q166o397p366p957n674l747
55737C00573m314l692K69L131J540q85o07l39k804n032m401l926o146p878o349
55722B59140m451m789m661k016k23j722l048j314M11o86j654L10K426K010J752
55707B41485M038N870M632L220M187M585J866q61p73p40l329n254l476j256k249
55692B51945l895k632m67n03q70R42K550J353J82K336N414N846N272O719Q667
$$ plain form
55790 660236 647779 630969 612485 597954 586974 575424 564181 557430 554315 549962 543039 535129
55778 535129 524742 509371 491708 476846 465095 454062 445422 442604 444050 445814 448663 455456 463568
55765 463568 467294 466061 463268 458833 450111 438630 428660 420224 410303 399729 392125 387170 381592 375725
55751 375725 372553 371313 368470 364001 360413 356669 349513 339880 331714 325317 317951 309994 304320 300573
55737 300573 296259 292567 292836 295967 297507 296622 296015 295676 292872 287840 283439 279513 273367 265489 259140
55722 259140 254689 249900 245239 243223 243000 241278 238230 236916 237327 236641 234987 235297 237723 239733 241485
55707 241485 245523 251393 256025 259245 263432 268017 269883 269022 268249 267509 264180 258926 255450 254194 251945
55692 251945 248050 245418 244951 244448 243578 244520 247070 248423 248605 250941 256355 262201 267473 274192 282859
55677B82859Q461P560P934P374L819J96m29l75k624m862l907j865k062k774q75
55662B98430J878K090R01J308K495K284K004L604N065L918K130K435K995Q75k506
55647C29906m386n788q537j0592r641q003q665r712q092n695o036p903p865o371
55633B22620n899n767m162k688l551m798l583j590j900l144k149R1M49o30p87
55618A82512p30k283l747k540l78n59k137k018p61j038k235j836m40l38q54k1
55602A60597R66j13j802j354P4l56j723j223L60K69r04o62K40o18k136j388Q14
55585A51041J277J39J05J087P54n50m44P93R60M85J415K842K194K49J01J714K267
55568A66429J281Q33J183P30j69L04J493J079o16j172l57qk87R5O74O6q95n86
$$ plain form
55677 282859 291320 298880 306814 314188 318007 318203 317774 317399 314775 309913 306006 304141 302079 299305 298430
55662 298430 300308 302398 303299 304607 307102 309386 311390 314994 320059 323977 326107 328542 331537 332412 329906
55647 329906 325520 319732 311195 300603 290962 282959 274294 264582 256490 250795 244759 236856 228991 222620
55633 222620 216721 210954 206792 204104 200553 195755 192172 190582 188682 185538 183389 183480 183929 183299 182512
55618 182512 181782 179499 175752 173212 172834 172275 170138 168120 167359 166321 164086 162250 161810 161472 160618 160597
55602 160597 161563 161450 159648 158294 158368 158012 156289 155066 155426 155695 154791 154129 154369 153751 151615 150227 151041
55585 151041 152318 152457 152562 153649 154403 153853 153409 154202 155162 155647 157062 159904 162098 162347 162448 164162 166429
55568 166429 167710 168543 169726 170456 170287 170591 172084 173163 172547 171375 171018 171010 170723 170818 171492 171558 170663 170077
55550A70077lq58j657J11L058L649J933J059J834K212J568J243J314Q11N57J877
55534A88785L304K501N18R8Q08R6j782k353j665j991l396l863l305l349l714k930
55518A67762j906k619m071l768k347k289l003j939K24L86j327j755l06L75n63
55503A42854j181r18j257k054j527j04p1j283j364j55K46k23L75J722J453k60
55487A36253q19M2j9j259j461m79n90j860j700K24J187K63l05N05R62L75L37J157
55469A32813R82m81j134k81K65k82o59o16j379k507j957L1Q54r7o79j15Ro36m66
55450A23665M57J57j278j442PP01L8J28J484J958J033Q56J861J609n48j869r01
55433A27916J91k58q31k91J68k27j87O98P59m57r49M6N38m16q20N89K039J964
$$ plain form
55550 170077 170074 169216 167559 167670 170728 174377 176310 177369 179203 181415 182983 184226 185540 186351 186908 188785
55534 188785 192089 194590 195108 195206 196014 196110 194328 191975 190310 188319 184923 181060 177755 174406 170692 167762
55518 167762 165856 163237 159166 155398 153051 150762 147759 145820 146044 146430 145103 143348 143042 143417 142854
55503 142854 141673 140755 139498 137444 135917 135813 135742 134459 133095 132940 133186 132963 133338 135060 136513 136253
55487 136253 135434 135476 135457 134198 132737 132258 131668 129808 128108 128332 129519 129782 129477 129982 130944 131319 131656 132813
55469 132813 133795 133314 132180 131899 132164 131882 131223 130607 129228 126721 124764 124795 125649 125552 124873 124758 124767 124131 123665
55450 123665 124122 124279 123001 121559 121566 122267 122305 122433 123917 125875 126908 127764 129625 131234 130686 128817 127916
55433 127916 128107 127849 127018 126727 126895 126668 126481 127179 127938 127481 126532 126578 127116 126700 125880 126469 128508 130472
55415A30472J442J586J488N81J23N89L76j167k253j795j261j753k007j012rj49
55399A25251n84m61m58r44r86m05m37j224j189Q3R52P30Q31J882K500J975J469
55382A28985J450Q16m90q70m1L17j40K65J694J960M64n28J12N29m40j130m38N8
55364A32573q21j680j355r01j112r92l19n69j727j547L78J285p7j091J82J702
55348A23929J262J85L67Q35J77l88N20J494Q44l18l25j4p00j317m23R07R51K62
55330A28248J36J34m48n19P26J622N15j306j710r82n72k66P63J685J368O33P69
55313A30796J104L97p30r26m53k88j82L90O67j9o21k7R49R78L01k06n96q91k86
55294A30357J104J468J7j383j047m8l1m46j03L81j0m45K85J485J820J542J457
$$ plain form
55415 130472 131914 133500 134988 135569 135692 136281 136657 135490 133237 131442 130181 128428 126421 125409 125400 125251
55399 125251 124667 124206 123748 122804 121818 121413 120976 119752 118563 118646 119598 120328 121159 123041 125541 127516 128985
55382 128985 130435 131251 130761 129891 129850 130167 130027 130292 131986 133946 134410 133882 133994 134523 134083 132953 132515 132573
55364 132573 131752 130072 128717 127816 126704 125712 125393 124824 123097 121550 121928 123213 123136 122045 122227 123929
55348 123929 125191 125376 125743 126578 126755 126367 126887 128381 129225 128907 128582 128568 127868 126551 126128 127035 127986 128248
55330 128248 128384 128518 128070 127551 128277 129899 130414 129108 127398 126416 125844 125578 126341 128026 129394 130027 130796
55313 130796 131900 132297 131567 130641 130188 129900 129718 130108 130775 130756 130135 130108 131057 132035 132336 132130 131534 130643 130357
55294 130357 131461 132929 132946 131563 130516 130468 130437 129991 129888 130269 130259 129814 130099 131584 133404 134946 136403
55277A36403J171J96o01n15m31j018j206k77L77m31j440j058O6O49J111K070K373
55260A37439J055m31l55M51K99l66j76L98R7o25n29O4J75J91Q24J288O80p9P9
55241A40479J98q76k027j642n31m74j064p02L65O03rl58n01j193j794j096L58
55224A29736J020P97O70O05Mn49j01P68R06O22Q65J221Q29L55Q72J625J044o00
55206A40689j711j802j532r46K40J260J147L35k15o61j378j538m40Q18R01M19
55190A35586N67Q50K04p07o19J0L5j48K96M63p91k168j520N73J598R33K47L88
55172A35797N17K77M01J004J260R33N00mp51j102m49M50N01K0j33j78n41m67O17
55153A38652J436P07m72k93O65N29n67q05J64R25Q44N80L32k84r12q55n16o09
$$ plain form
55277 136403 137574 137770 137169 136654 136223 135205 133999 133722 134099 133668 132228 131170 131236 131885 132996 135066 137439
55260 137439 138494 138063 137708 138159 138458 138092 137916 138314 138411 137786 137257 137321 137496 137687 138511 139799 140479 140400 140479
55241 140479 140677 139801 137774 136132 135601 135127 134063 133361 133726 134329 134320 133962 133461 132268 130474 129378 129736
55224 129736 130756 131553 132223 132828 132832 132283 132182 132950 133856 134478 135343 136564 137393 137748 138620 140245 141289 140689
55206 140689 138978 137176 135644 134698 134938 136198 137345 137680 137465 136804 135426 133888 133448 134266 135167 135586
55190 135586 136153 137003 137207 136500 135881 135891 135926 135778 136074 136537 135746 133578 132058 132631 134229 135162 135409 135797
55172 135797 136314 136591 136992 137996 139256 140189 140689 140685 139934 138832 138383 138833 139334 139354 139221 139043 138502 138035 138652
55153 138652 140088 140795 140323 140030 140695 141224 140657 139852 140016 140941 141785 142365 142697 142413 141501 140646 140130 139521
55135A39521o12K20J079P80j15l42j69n15q54k42N70M05L6P95J837J464K10j53
55117A43915J80k09q96m20M99j08j693j726P1J341J105R06J500J540L26r10j204
55100A44217r53l60Q64J896J347j96n91N21J267P79L45P62J062O35L18N72N87
55083A53072M1k05J77L41o9l08L9N46J086J776J879N80j166j529n01L52O24J284
55065A58019K193J967N38n19n33l62l09K26P92J28j321j664p26l69j171j499o23
55048A54767l1n86r57j65O64L96k60l07m1M2K73O87N09l16o87k50o1o14r59n60
55028A51544l06p56j093p52m74q10j037m99L11P35P72L90o25j669j599m28O68
55011A44372J206J703K005J250k11p87o4O16M64K51M80M92K4j26L01N21L45N62
$$ plain form
55135 139521 138909 139129 140208 140988 140873 140531 140362 139847 138993 138751 139321 139726 139762 140557 142394 143858 144068 143915
55117 143915 144095 143886 142990 142570 143069 142961 141268 139542 139613 140954 142059 142965 144465 146005 146331 145421 144217
55100 144217 143264 142904 143768 145664 147011 146815 146224 146745 148012 148791 149136 149898 150960 151595 151913 152485 153072
55083 153072 153113 152908 153085 153426 153357 153049 153088 153634 154720 156496 158375 158955 157789 156260 155759 156111 156735 158019
55065 158019 160212 162179 162717 162198 161665 161303 160994 161220 162012 162140 160819 159155 158429 158060 156889 155390 154767
55048 154767 154736 154150 153193 153028 153692 154088 153828 153521 153480 153522 153795 154482 154991 154675 153988 153738 153677 153063 152104 151544
55028 151544 151238 150482 149389 148637 148163 147353 146316 145817 146128 146863 147635 148025 147400 145731 144132 143704 144372
55011 144372 145578 147281 149286 150536 150325 149538 149474 150090 150554 150805 151285 151777 151801 151675 151976 152497 152842 153404
54993A53404J170J109K77j03L76O47K48M1L49M08J68O01J543J462P3r80q39o01
54975A59353q72n80P28J641J235N01K85j36j081j271l0J216J187O64P49R80P22
54958A65291O80J442K064J623P92M62K53k70l86L77J032P44K93N69R30M34m97
54941A75833j025j314j731j754r30J33P31J029J196Q60K27L90J664L010L798M642
54925A86759N745O290O318P222R262J0575R986Q732P984O765M069J075p82k224
54911B67776m507o885p858p665p479p249o442n809o282o920o055l910k151j409
54897A87155r61m90l78n81o14m89m91m07J6M09M99Q17J768K791L341L868M821
54880B01074N731O240P026Q601J0160J0663J0056Q522N816K391j65j239k372m928
$$ plain form
54993 153404 154574 155683 155960 155857 156233 156880 157128 157169 157518 157926 158094 158695 160238 161700 161773 160793 159954 159353
54975 159353 158481 157901 158629 160270 161505 162006 162291 162155 161074 159803 159773 160989 162176 162840 163589 164569 165291
54958 165291 165971 167413 169477 171100 171892 172354 172607 172337 171951 172328 173360 174104 174397 174966 175896 176330 175833
54941 175833 174808 173494 171763 170009 169079 169212 169943 170972 172168 173028 173255 173645 175309 178319 182117 186759
54925 186759 192504 198794 205112 212334 221596 232171 242157 250889 258873 265638 269707 270782 270000 267776
54911 267776 263269 256384 248526 240861 233382 226133 219691 213882 207600 200680 194625 190715 188564 187155
54897 187155 186194 185704 185326 184745 184131 183642 183151 182744 182760 183169 183668 184485 186253 189044 192385 196253 201074
54880 201074 206805 213045 220071 228672 238832 249495 259551 268073 273889 276280 276115 274876 272504 267576
54866B67576p873r426r637r597r217p793n984n161n257m983l896k725j981j572
54852A82474j494j742j882j684j704k304k796k479j741j159n17L40O40p5q81q54
54836A62142n10n91n21L94J258P75o07j298q30j2N85R83J051O84K56m1o27j463
54818A61628j509k98J008J328J225J491J429K43j087j139l44p7k69J16R33J111
54802A65789O70N60Q31P22K67K09N05M80K18K76L63j87q34m03R55J764J281J84
54784A73650o43q48l14P34J492J449J226J619K330K679K894L502M126M250M485
54769B02631N654P122P702P728Q538J0119J0874R748P215M198J320q48k008k718
54755B77275l781n196o447p406q078q068p282o581o561o397n099l268k228k022
$$ plain form
54866 267576 259703 250277 240640 231043 221826 214033 208049 202888 197631 192648 188752 186027 184046 182474
54852 182474 180980 179238 177356 175672 173968 171664 168868 166389 164648 163489 162972 163312 163952 163877 162996 162142
54836 162142 161632 161041 160520 160914 162172 162947 162340 161042 160212 160200 160785 161768 162819 163503 163759 163718 163091 161628
54818 161628 160119 159821 160829 162157 163382 164873 166302 166545 165458 164319 163975 163898 163629 163745 164678 165789
54802 165789 166459 167019 167850 168572 168839 169048 169553 170033 170251 170527 170890 170703 169869 169466 170421 172185 173466 173650
54784 173650 173007 172159 171845 172579 174071 175520 176746 178365 180695 183374 186268 189770 193896 198146 202631
54769 202631 208285 215407 223109 230837 239375 249494 260368 270116 277331 281529 282849 282001 279993 277275
54755 277275 273494 268298 261851 254445 246367 238299 231017 224436 217875 211478 206379 203111 200883 198861
54741A98861j664r36m02j50R4Np87j532j161P8J101J669K332L131L807M759O383
54724B15588P874Q209P830P877Q164P523N770L707J548j034l580n251o222p152
54710B50851p610o841n714n881p070p269n756m013l235k881k221j632j554j558
54696A87616j211p84n33k38Q1q0q36j608j949j913j562q83k38j07l49m54l86l62
54678A74204j26O41J381J240L61l46n70p56j117j396j473j366r04j38L34K00N0
54661A70219L09L72k63q47n93j49m32q95n04K62J67o48j026p89o31m99J37P58
54643A64948M03m81o39j26k9l12J03J200J742J298O26N8o63j023j57J289J683
54626A69920R00M14P33P39m1n54j78J90k83j161j736j854j456n55R4k65r17m73
$$ plain form
54741 198861 197197 196261 195859 195709 195803 195808 195021 193489 192328 192406 193507 195176 197508 200639 204446 209205 215588
54724 215588 223462 231671 239501 247378 255542 263065 268835 272542 274090 273056 269476 264225 258003 250851
54710 250851 243241 236400 230686 224805 217735 210466 204710 200697 197462 194581 192360 190728 189174 187616
54696 187616 186405 185621 185088 184850 184931 184851 184015 182407 180458 178545 176983 176100 175862 175755 175406 174952 174566 174204
54678 174204 174078 174719 176100 177340 177701 177355 176785 176029 174912 173516 172043 170677 169773 169635 169969 170169 170219
54661 170219 170528 170900 170637 169790 169197 169048 168616 167721 167217 167479 167646 166998 165972 165183 164552 164053 164190 164948
54643 164948 165351 164870 164231 164105 164076 163764 163867 165067 166809 168107 168733 168791 168128 167105 166948 168237 169920
54626 169920 170820 171234 171967 172706 172665 172111 171933 172123 171840 170679 168943 167089 165633 165078 165172 164907 163990 163517
54608A63517Q21J328O96L49R64J470J109O35O50N38o2k79M30J104O70m99j282
54591A72159j258p47k05rj89k37J78M42m9n66J8J238J560P60J18J80J24m48q14
54572A72255n78l16l78m41m20m65p6J176K211J560j09o61J69M36o65j461o22Q88
54554A72503J644J683J485Q81k9m03l5J88o1NO04Q23M60N91J566K141J575Q31
54536A86452P37P49M33M61J090J314O68J68M36N39j39n98p4N07K34j90Q1M66K43
54517A93577o8k1m10j664k505j800m56J11J14L78M77l26j298j214l27K24K98M89
54499A85579O73K98m06q07r47j045p12K01O87j09j341j509n66K88L78N8j86n9
54481A80475O25J516J701Q60q7k76pJ04K55Q12J361J375J069P89L34l59o61k89
$$ plain form
54608 163517 164338 165666 166362 166711 167675 169145 170254 170889 171539 172077 172015 171736 172166 173270 173940 173441 172159
54591 172159 170901 170154 169949 169940 169751 169514 169692 170134 170085 169519 169537 170775 172335 173095 173213 173393 173517 173069 172255
54572 172255 171677 171361 170983 170542 170122 169657 169581 170757 172968 174528 174419 173758 173927 174363 173698 172237 171615 172503
54554 172503 174147 175830 177315 178196 178167 177764 177729 177917 177856 177861 178465 179288 179748 180339 181905 184046 185621 186452
54536 186452 187189 187938 188371 188832 189922 191236 191904 192072 192508 193047 192908 192310 192236 192743 192977 192787 192868 193334 193577
54517 193577 193509 193488 193078 191414 188909 187109 186653 186764 186878 187256 187733 187407 186109 184895 184568 184792 185090 185579
54499 185579 186252 186550 186144 185337 184390 183345 182633 182834 183521 183412 182071 180562 179996 180284 180662 180720 180534 180475
54481 180475 181100 182616 184317 185177 185090 184814 184807 184911 185166 185978 187339 188714 189783 190572 190906 190547 189886 189597
54463A89597P0p4j74K54P08P23O83P33J33j273k236j888j140j030r69m8J062J179
54445A86310N85L08K85j65p51p05k72k42n51o38o13o88k50J043K030J499K70O8
54427A87523Q26R39m4q02m26M61R79J087J065R04N45O9m35p05l30N40J014O50
54409A93860K12N07J095J069M34k45q64j385j211j02Q99P80J48K33Q33P52q5m94
54391A96436J17J092J673J745J364O12m3q4L18N62M73K72N5j21k2K82K63j52j95
54372B04647M86J012N83k42n18l77m12m87k51j05l88l52O78J816J748P80L03O40
54354B09561R18P20M70M01M28P95J620K061J242k88j201j238j021m94R67K972
54338B17913M149M001L524L776M742N731O071N396L964K579J639O18r22k422l219
$$ plain form
54463 189597 189667 189593 189419 189673 190381 191104 191787 192520 192653 191380 189144 187256 186116 185086 184117 184069 185131 186310
54445 186310 186895 187203 187488 187323 186572 185867 185595 185353 184802 184164 183551 182863 182613 183656 185686 187185 187455 187523
54427 187523 188349 189288 189244 188442 188016 188477 189456 190543 191608 192512 193057 193126 192691 191986 191656 192196 193210 193860
54409 193860 194072 194579 195674 196743 197177 196932 196068 194683 193472 193370 194269 195049 195197 195430 196263 197015 196930 196436
54391 196436 196553 197645 199318 201063 202427 203039 202996 202912 203230 203792 204265 204537 204592 204471 204449 204731 204994 204842 204647
54372 204647 205133 206145 206728 206486 205968 205591 205179 204692 204441 204336 203948 203596 204274 206090 207838 208618 208921 209561
54354 209561 210479 211199 211669 212070 212498 213293 214913 216974 218216 217928 216727 215489 214468 213974 214941 217913
54338 217913 222062 226063 229587 233363 238105 243836 249907 255303 259267 261846 263485 264103 263181 260759 257540
54323B57540l609m137m560m538m456m484l748j851k54m62j672k021j519j673k621
54308B15935k851j779o06l10n85r96j587k018j656p86l59l84l6O03N09k66l74
54291B02454O07J306O35o51j244r44k62N30J172J176N68J43M05Q35O82o2q26j065
54273B05459n59M06J024P78K24L54J203J837J694J171Q23P19O31L36k29o51k61
54256B14959P82J263N46k64O5R03P73j93n26J49O73L44k69p25j280j780j505n40
54238B13375J6k38m11N4M37N5n97p90p23r77j430j463q47K0N25L33j87j73P19
54219B07698J743K024J696J370R89J55p90j139j001j017j155r42o29q15j120n95
54203B06472N45J056N53j01l43m70m64J82J225J543Q15Q4J83O58P42M21R1jL20
$$ plain form
54323 257540 253931 249794 245234 240696 236240 231756 228008 226157 225903 225441 223769 221748 220229 218556 215935
54308 215935 213084 211305 210699 210389 209804 208808 207221 205203 203547 202761 202402 202018 201982 202585 203094 202828 202454
54291 202454 203061 204367 205002 204351 203107 202163 201901 202431 203603 204779 205347 205490 205895 206730 207412 207350 206524 205459
54273 205459 204900 205306 206330 207108 207332 207686 208889 210726 212420 213591 214414 215133 215764 216100 215871 215220 214959
54256 214959 215741 217004 217550 217286 217351 218254 219027 218834 218308 218457 219130 219474 219205 218480 217200 215420 213915 213375
54238 213375 213391 213153 212742 212796 213233 213288 212691 211901 211178 210201 208771 207308 206461 206481 207006 207339 207152 206979 207698
54219 207698 209441 211465 213161 214531 215520 215675 214885 213746 212745 211728 210573 209631 209002 208187 207067 206472
54203 206472 207017 208073 208626 208525 208182 207712 207248 207430 208655 210198 211013 211097 211280 211938 212680 213101 213192 213191 213511
54184B13511J013J476J191O95R00J505J248j47j522j916j554r73l80m3k53o22
54168B14129m65L0J13j40L0M96K73p61j563j671j781k268k463j935j168n23K88
54151B00621J239J682J428R70M36m92j376j145J85J246J221P21L88J3m13k59N15
54134B06980R95P97O91J129J448J151P58P23O86M58M78P01L25o96j127k80Q92
54117B16109J285J074R02P87P03J117K064K637K186J147J54o80j121o77L27P06
54101B28720J14m91n50o51r37m59R00J490K18j529j747n15N71P41N28N01P47J094
54083B28745J071K27q91r81J82J190J072O39R23J539J698J679K073K553K614K580
54067B46913K711K306R98m4M07J709K308J886J241P03J01j90M39J624K372K399
$$ plain form
54184 213511 214524 216000 217191 217886 218786 220291 221539 221392 219870 217954 216400 215427 215047 215004 214751 214129
54168 214129 213664 213694 213807 213667 213697 214193 214466 213705 212142 210471 208690 206422 203959 202024 200856 200333 200621
54151 200621 201860 203542 204970 205940 206376 205884 204508 203363 203548 204794 206015 206736 207124 207137 206724 206465 206980
54134 206980 207975 208772 209463 210592 212040 213191 213949 214672 215358 215816 216294 216995 217320 216624 215497 215217 216109
54117 216109 217394 218468 219370 220157 220860 221977 224041 226678 228864 230011 230165 229485 228364 227687 228014 228720
54101 228720 228834 228343 227793 227142 226205 225746 226646 228136 228354 226825 225078 224563 225134 225875 226403 226904 227651 228745
54083 228745 229816 230043 229152 228171 228353 229543 230615 231254 232177 233716 235414 237093 239166 241719 244333 246913
54067 246913 249624 251930 252928 252884 253291 255000 257308 259194 260435 261138 261239 261049 261488 263112 265484 267883
54051B67883K264K473L165M358N773O930P982R717J2183J4237J5175J5673J6170
54038C83983J5560J2802Q825N372K827O51q07o34Q53K249K860L115L350L377L147
54023D47530K814K286J543J105J348J740J540Q15l8j162k706m060m639m902n590
54008D37624o520p164p755q682r427r270q565q138p885p160o049n132m407l615
53994C37855l169l566m318m577m422m369m199l497k759k657k709k099j310j386
53980B92818k057k173j688j552j848j796j495j873k756k780j610n53m42m63K17
53965B69949R81Q42On02j47Q02J757K177J955J613J748K205K372K123J895J880
53949B91656J915K065K535L149L620M216N242O171O228N737N718O295O684O753
$$ plain form
54051 267883 270147 272620 275785 280143 285916 292846 300828 310545 322728 336965 352140 367813 383983
54038 383983 399543 412345 421170 426542 429369 430020 429213 428579 429432 431681 434541 437656 441006 444383 447530
54023 447530 450344 452630 454173 455278 456626 458366 459906 460721 460683 459521 456815 452755 448116 443214 437624
54008 437624 431104 423940 416185 407503 398076 388806 380241 372103 364218 357058 351009 345877 341470 337855
53994 337855 334686 331120 326802 322225 317803 313434 309235 305738 302979 300322 297613 295514 294204 292818
53980 292818 290761 288588 286900 285348 283500 281704 280209 278336 275580 272800 271190 270637 270195 269732 269949
53965 269949 270930 271772 271778 271276 271129 271931 273688 275865 277820 279433 281181 283386 285758 287881 289776 291656
53949 291656 293571 295636 298171 301320 304940 309156 314398 320569 326797 332534 338252 344547 351231 357984
53935C57984P289Q530R695J0443J1508J3296J4840J4953J3686J2003J0579R566
53923D94372Q948Q517P767O360M572L022K159K157K973M355N990P684R276J0427
53909E78579J0922J1007J1035J0800R622P196M020R79j258k497k955k956k696
53896F31798k441k777m009n360n606m764m302n155o417o675n694l997j665J496
53882E74432N264R309J3258J5433J2813M126p527j6964k1782k3506k4264k4342
53870E16250k3256k1316j9207j7129j5137j3567j2497j1530j0428r402q516p476
53858C46789o204n031m157l473k983k762k610k330k258k741l333l350l060l272
53844B99225l843l703k509j187n54l80j62L8rj40n8K47N92P41N10N2j11J94L78
$$ plain form
53935 357984 365273 373803 383498 393941 405449 418745 433585 448538 462224 474227 484806 494372
53923 494372 503320 511837 519604 525964 530536 533558 535717 537874 540847 545202 551192 558876 568152 578579
53909 578579 589501 600508 611543 622343 631965 639161 643181 644160 642902 640405 637450 634494 631798
53896 631798 629357 626580 622571 617211 611605 606841 602539 597384 590967 584292 578598 574601 572936 574432
53882 574432 579696 589005 602263 617696 630509 634635 627108 610144 588362 564856 540592 516250
53870 516250 492994 471678 452471 435342 420205 406638 394141 382611 372183 362781 354265 346789
53858 346789 340585 335554 331397 327924 324941 322179 319569 317239 314981 312240 308907 305557 302497 299225
53844 299225 295382 291679 289170 287983 287429 287049 286887 286925 286916 286776 286718 286965 287557 288298 288808 288860 288749 288943 289321
53825B89321l6n24l31L20P34J020J738K581K694K181J955K151K022J534J632K528
53809C11520L167K896K509K943L933M663M963N230N759O663P863Q870R097Q686
53795C88762Q362Q370Q219P655P015O419N431L877K312J347J109J443J924J708
53781D53953J99j984l617m455n284o316o850o719o779p421p817p348o677o640
53767C76245o987p063o864o607o000m878l899l718l949l839l519l670m297m677
53753C06278m383l601k570j390m21k47j023k156k781k457j483o54n22q70j053
53738B80667q70p37r82j328j289p83j74J16n0m08n12k28Q7P4j65l55m59m55oJ030
53718B73173K068K431K321K431K729K481J433K14n66r76j289j451j211l88R84
$$ plain form
53825 289321 289285 288761 288430 288750 289484 290504 292242 294823 297517 299698 301653 303804 305826 307360 308992 311520
53809 311520 314687 317583 320092 323035 326968 331631 336594 341824 347583 354246 362109 370979 380076 388762
53795 388762 397124 405494 413713 421368 428383 434802 440233 444110 446422 447769 448878 450321 452245 453953
53781 453953 454152 452168 448551 444096 438812 432496 425646 418927 412148 404727 396910 389562 382885 376245
53767 376245 369258 362195 355331 348724 342724 337846 333947 330229 326280 322441 318922 315252 310955 306278
53753 306278 301895 298294 295724 294334 293913 293666 292643 290487 287706 285249 283766 283112 282590 281720 280667
53738 280667 279797 279060 278078 276750 275461 274678 274504 274620 274570 274162 273650 273422 273509 273583 273418 273063 272604 272149 272143 273173
53718 273173 275241 277672 279993 282424 285153 287634 289067 289281 288715 287739 286450 284999 283788 283400 284384
53703B84384K429L133K773K098K143L018M052M797N221N143M344L131K119J482
53689C30267J067R30J109J233J100J200J797K078J323L66N01J345J390M11l45
53674C45772m05o55j419j709j043m27p27j365j419r56m93j19J90K39J41L09N71
53657C36485J75r08j734j794j540j135K1J826K892K238O64m52p82p44n54m11o94
53640C33553j187q76O12K157K516J878J292J241J528J945K258K058J313O14L51
53625C51253K64J80M53J174J768J891K014K498K878K677K190J900J790J823K224
53610C76977K830L020K782K950L791M404M151L653L580L559L182K984L347L422
53596D24632K432J209J138K136K915K793K094J170J95l81k28J97K57P4J18K13
$$ plain form
53703 284384 286813 289946 292719 294817 296960 299978 304030 308827 314048 319191 323535 326666 328785 330267
53689 330267 331334 332264 333373 334606 335706 336906 338703 340781 342104 342470 342971 344316 345706 346117 345772
53674 345772 345367 344712 343293 341584 340541 340114 339387 338022 336603 335647 335154 335035 335225 335464 335605 335914 336485
53657 336485 336660 335752 334018 332224 330684 329549 329570 331396 334288 336526 337190 336738 335956 335212 334658 334247 333553
53640 333553 332366 331490 332102 334259 336775 338653 339945 341186 342714 344659 346917 348975 350288 350902 351253
53625 351253 351517 351697 352150 353324 355092 356983 358997 361495 364373 367050 369240 371140 372930 374753 376977
53610 376977 379807 382827 385609 388559 392350 396754 400905 404558 408138 411697 414879 417863 421210 424632
53596 424632 427064 428273 429411 431547 434462 437255 439349 440519 440714 440333 440105 440302 440559 440633 440751 440964
53580D40964j02n35l42N49J470J931J952J787J869K745M324N598N722N047M384
53565D77363L686K273R5k001l208l439l193l161l738m585m929m467l572k467j054
53550D43603K34L35j007k583l177k882k340j510j36J272J922J772J369J130J386
53535D39388K431L875M592M161L620M013M934N429N587O127P061P866Q570R557
53521E17211J0658J1412J1840J2154J2141J1693J1532J2374J3847J5084J5953
53510F55899J6847J7808J8737J9943K1471K2461K2252K1577K1558K2028K2006
53499H82587K1364K0762K0318J9685J9148J9342J9979K0150J9751J9399J9048
53488A101533J8065J6741J6358J7366J8600J8786J7986J7187J7106J7695J8356
$$ plain form
53580 440964 440862 440327 439985 440534 442004 443935 445887 447674 449543 452288 456612 462210 467932 472979 477363
53565 477363 481049 483322 483417 481416 478208 474769 471576 468415 464677 460092 455163 450696 447124 444657 443603
53550 443603 443837 444172 443165 440582 437405 434523 432183 430673 430537 431809 433731 435503 436872 438002 439388
53535 439388 441819 445694 450286 454447 458067 462080 467014 472443 478030 484157 491218 499084 507654 517211
53521 517211 527869 539281 551121 563275 575416 587109 598641 611015 624862 639946 655899
53510 655899 672746 690554 709291 729234 750705 773166 795418 816995 838553 860581 882587
53499 882587 903951 924713 945031 964716 983864 1003206 1023185 1043335 1063086 1082485 1101533
53488 1101533 1119598 1136339 1152697 1170063 1188663 1207449 1225435 1242622 1259728 1277423 1295779
53477A295779J8509J8235J8163J8417J8158J6807J5068J3777J2321R439N394K006
53465A462073L39m53j780m017o605q887j0427j1071j1075j0931j0976j1311j1914
53452A362965j2541j2908j3227j4140j5692j7068j7758j8294j9077j9379j8469
53441A184412j6996j6107j5795j5274j4463j3711j2623j0597q314p139p119o957
53429A039317o005m876l994k905j447k87J99N99J559K968M426N813P148Q451R934
53414A060900J1712J3404J4569J5464J6607J7869J8821J9829K1750K4515K7013
53403A262453K8475K9126K9510K9966L0903L2653L4950L7249L9495M1929M4291
53392A641000M6062M7366M8651M9722N0033M9867N0108N0845N1284N1050N0526
$$ plain form
53477 1295779 1314288 1332523 1350686 1369103 1387261 1404068 1419136 1432913 1445234 1454673 1460067 1462073
53465 1462073 1462412 1461959 1460179 1456162 1449557 1440670 1430243 1419172 1408097 1397166 1386190 1374879 1362965
53452 1362965 1350424 1337516 1324289 1310149 1294457 1277389 1259631 1241337 1222260 1202881 1184412
53441 1184412 1167416 1151309 1135514 1120240 1105777 1092066 1079443 1068846 1060532 1053393 1046274 1039317
53429 1039317 1033312 1028436 1024442 1021537 1020090 1019803 1020002 1020601 1022160 1025128 1029554 1035367 1042515 1050966 1060900
53414 1060900 1072612 1086016 1100585 1116049 1132656 1150525 1169346 1189175 1210925 1235440 1262453
53403 1262453 1290928 1320054 1349564 1379530 1410433 1443086 1478036 1515285 1554780 1596709 1641000
53392 1641000 1687062 1734428 1783079 1832801 1882834 1932701 1982809 2033654 2084938 2135988 2186514
53381B186514M9800M8399M6317M4343M2997M1942M0543L8343L5016L0763K6678
53370B631655K3744K1446J8336J3952R074M085j644q398j5250k1101k5813k9928
53358B620158l3841l7521m0483m2084m2303m2097m2398m3020m3226m2879m2080
53347B168226m0357l7509l4875l4153l5208l6476l7405l8740m0400m1008l9985
53336A752110l8419l7201l5871l3952l2026l0684k9504k7910k5988k3896k1524
53325A415135j9241j7917j7664j7657j7594j8157j9418k0174j9554j8206j7033
53314A212520j5861j4197j2341j0841r652q518p441o183m249j932m00n5J89J312
53300A122351K868M043N065O593Q594J0654J2685J4578J5992J7198J9205K2123
$$ plain form
53381 2186514 2236314 2284713 2331030 2375373 2418370 2460312 2500855 2539198 2574214 2604977 2631655
53370 2631655 2655399 2676845 2695181 2709133 2718207 2722292 2720648 2712250 2697000 2675899 2650086 2620158
53358 2620158 2586317 2548796 2508313 2466229 2423926 2381829 2339431 2296411 2253185 2210306 2168226
53347 2168226 2127869 2090360 2055485 2021332 1986124 1949648 1912243 1873503 1833103 1792095 1752110
53336 1752110 1713691 1676490 1640619 1606667 1574641 1543957 1514453 1486543 1460555 1436659 1415135
53325 1415135 1395894 1377977 1360313 1342656 1325062 1306905 1287487 1267313 1247759 1229553 1212520
53314 1212520 1196659 1182462 1170121 1159280 1149628 1141110 1133669 1127486 1123237 1121305 1120905 1120850 1121039 1122351
53300 1122351 1125219 1129262 1134327 1140920 1149514 1160168 1172853 1187431 1203423 1220621 1239826 1261949
53288A261949K4369K4576K3551K3179K3922K4576K4158K2930K1663K0698J9776
53277A515347J8314J6025J3515J1822J1043J0058P955N063K153o57l506o096q116
53264A592920r889j1892j4113j6305j8374k0003k0604k0238j9927k0446k1413
53253A399716k2130k2663k3349k3939k4005k3695k3397k3046k2447k1825k1499
53242A147721k1455k1673k2336k3255k3696k3353k2892k2942k3111k2619k1377
53231H99012j9878j8490j7362j6524j5645j4289j2710j1757j1610j1497j1027
53220G38223j0823j1278j1778j1881j2239j3369j4507j4685j4242j4158j4538
53209E94725j4738j4408j3524j1960r944q321p551p048o323n962o536p370p508
$$ plain form
53288 1261949 1286318 1310894 1334445 1357624 1381546 1406122 1430280 1453210 1474873 1495571 1515347
53277 1515347 1533661 1549686 1563201 1575023 1586066 1596124 1604079 1609142 1611295 1610638 1607132 1601036 1592920
53264 1592920 1583031 1571139 1557026 1540721 1522347 1502344 1481740 1461502 1441575 1421129 1399716
53253 1399716 1377586 1354923 1331574 1307635 1283630 1259935 1236538 1213492 1191045 1169220 1147721
53242 1147721 1126266 1104593 1082257 1059002 1035306 1011953 989061 966119 943008 920389 899012
53231 899012 879134 860644 843282 826758 811113 796824 784114 772357 760747 749250 738223
53220 738223 727400 716122 704344 692463 680224 666855 652348 637663 623421 609263 594725
53209 594725 579987 565579 552055 540095 530151 521830 514279 507231 500908 494946 488410 481040 473532
53196D73532p174p099p104o688o351o866p683p498o217m963m326l926l619l737
53182C90281m068l877l093k436k158j756j061o33q08j205j431j534j565j395j056
53167C62205p28l46J41L41j17q16j115j231j870k825l024k079q70l09m05p58j205
53150C44989j675k084k594l358l904l451k106r86q51j234j304r77p19o97o64m21
53134C17964K6N90J110J317J096P00N14N91N69J49m40n88m3O91J006R75J096J354
53116C28677J178M89j3J10L64J65j82k1N66Q06K42q10j623j627q29N1J65n00j132
53097C26076j181r48q73r11r52j139j373j139l82J64L8k07NL01J21k21r5L17M17
53078C18018K27K37M80O07N65M98L43R9J21M29L15n62j241n91J024K203K282J722
$$ plain form
53196 473532 466358 459259 452155 445467 439116 432250 424567 417069 410852 405889 401563 397637 394018 390281
53182 390281 386213 382336 379243 376807 374649 372893 371832 371199 370391 369186 367755 366221 364656 363261 362205
53167 362205 361477 361131 361272 361613 361496 360680 359565 358334 356464 353639 350615 348536 347666 347357 346952 346194 344989
53150 344989 343314 341230 338636 335278 331374 327923 325817 324831 323980 322746 321442 320465 319746 319049 318385 317964
53134 317964 317990 318580 319690 321007 322103 322803 323317 323908 324477 324626 324186 323598 323555 324246 325252 326227 327323 328677
53116 328677 329855 330344 330331 330441 330805 330970 330788 330767 331333 332139 332381 331571 329948 328321 327492 327543 327708 327208 326076
53097 326076 324895 323947 323074 322163 321211 320072 318699 317560 317178 317342 317380 317173 317178 317479 317600 317379 317284 317601 318018
53078 318018 318245 318482 318962 319569 320134 320632 320975 321074 321195 321624 321939 321377 320136 319545 320569 322772 325054 326776
53060C26776J068M54jk35n13r67j124o29MJ50P5K90M37j10r28j033m49j08l27
53041C22830m93k06K69O70Q77N93k05p37l24M71O96N42P78J051L96p37p51O06
53023C26326J697J380L99j56l20m63l51J26L51p3n97o64n23m70j82M89R33P44
53005C28646M84O99R08M43k99l98J65N58L57n0k24j52N8M51J073J728K006J519
52987C37972L72o11n61M32J350J490J207J179J466J688J712J690J622J444J411
52972C53863J929K864L409K932J826J200J548K061J623L08o78n85M2L27J67j28
52956C72708n57j180j611j527j291j376j494j087l41L7j40m91q48j314j725j817
52940C55946j733j717j470o50K88N26L6n26q12q64n33K14O86J97p47j133j009
$$ plain form
53060 326776 327844 328298 328297 328062 327549 326582 325458 324829 324833 324983 325058 325348 325785 325675 324747 323714 323265 323157 322830
53041 322830 322337 322131 322400 323070 323947 324540 324335 323598 323274 323745 324441 324983 325761 326812 327208 326471 325720 326326
53023 326326 328023 329403 329802 329646 329326 328863 328512 328638 328989 328916 328319 327655 327132 326662 326480 326969 327902 328646
53005 328646 329130 329829 330737 331180 330881 330483 330648 331206 331563 331513 331289 331137 331195 331646 332719 334447 336453 337972
52987 337972 338344 337733 337172 337604 338954 340444 341651 342830 344296 345984 347696 349386 351008 352452 353863
52972 353863 355792 358656 362065 364997 366823 368023 369571 371632 373255 373563 372885 372300 372342 372669 372836 372708
52956 372708 372151 370971 369360 367833 366542 365166 363672 362585 362244 362281 362141 361650 360802 359488 357763 355946
52940 355946 354213 352496 351026 350376 350664 351190 351226 350700 349888 349024 348491 348705 349391 349588 348841 347708 346699
52923C46699j217j705j571p78l39n40m76J75L97m27j311j102k13O6o72j724k304
52906C32958k127j329l98J13Q8j88o17j273j820j626o78L39R68J353J565J414
52890C28742J109J232J818K237K123J650Q03n90j925k129j258o40r45j229n51
52875C30447N48J005P13K02l16p46n77M58J679K176J897J445J233J328J706K133
52859C45331K265K166K288K647K690K231J705J168o5k216m389n701o215o226n535
52844C32144m240l241l046k882k012j146j400k455k965k422j510q48m58l79p31
52829C02409j183j151n97pL50M87K43m99j244j276p03m09q83j613j733r12N11
52812B91790J932K928L470L744L748L316K588K023J787J511R00J30n40j095j451
$$ plain form
52923 346699 345482 343777 342206 341428 341089 340549 340073 340248 340645 340218 338907 337805 337592 337658 336986 335262 332958
52906 332958 330831 329502 329104 329217 329305 329117 328500 327227 325407 323781 323103 323442 324410 325763 327328 328742
52890 328742 329851 331083 332901 335138 337261 338911 339714 339124 337199 335070 333812 333172 332227 330998 330447
52875 330447 330995 332000 332713 332915 332599 331853 331276 331734 333413 335589 337486 338931 340164 341492 343198 345331
52859 345331 347596 349762 352050 354697 357387 359618 361323 362491 362426 360210 355821 350120 343905 337679 332144
52844 332144 327904 324663 321617 318735 316723 315577 314177 311722 308757 306335 304825 303977 303519 303140 302409
52829 302409 301226 300075 299478 299471 299821 300308 300551 300052 298808 297532 296829 296420 295537 293924 292191 291279 291790
52812 291790 293722 296650 300120 303864 307612 310928 313516 315539 317326 318837 319737 319867 319327 318232 316781
52797C16781j415j210j430k061k269j605p43m25l81o6K23r3o40m68M94J312J323
52780C07327Q02L10P0O8K18L33L34M85J072J800J936J099k56j201j110k00O52
52763C13739Q31O30O54P36J97q28j230m92M66N21k19r04j158j114p18J14J021
52746C12246J528J673J718J568J023L62P2K53P43J478K243K435J710N78j09o6
52730C29455M34J082J637J865J825J842J903J586R09M77M12jr76j485q06J87L03
52713C40649j73k45k5k86p36m37K77K0j339k247j764p77l27j15N11J147J005K67
52695C35405k03j00J94M11N83O25L81N0N6M37P46O48L65L90Q50J290J147L84m62
52676C43197q60p26k90K13N55N31K02n1LJ34K0k53l42j63K3r8o50j386j658r52
$$ plain form
52797 316781 315366 314156 312726 310665 308396 306791 306048 305623 305242 305176 305399 305306 304666 304198 304692 306004 307327
52780 307327 308129 308439 308509 308577 308795 309128 309462 309947 311019 312819 314755 315854 315598 314397 313287 313087 313739
52763 313739 314570 315200 315854 316590 316787 315959 314729 314237 314703 315224 315005 314101 312943 311829 311111 311225 312246
52746 312246 313774 315447 317165 318733 319756 320118 320190 320443 321186 322664 324907 327342 329052 329630 329521 329455
52730 329455 329889 330971 332608 334473 336298 338140 340043 341629 342538 343015 343427 343426 342450 340965 340159 340346 340649
52713 340649 340476 340231 340206 339920 339184 338747 339024 339044 337705 335458 333694 332917 332590 332475 332986 334133 335138 335405
52695 335405 335202 335102 335296 335707 336290 336915 337296 337346 337402 337839 338585 339233 339598 339988 340838 342128 343275 343659 343197
52676 343197 342337 341611 341321 341534 342089 342620 342822 342771 342774 342908 342928 342675 342333 342170 342193 342095 341445 340059 338401 337449
52656C37449L96J340J309Q33P17J069J461J562J185J27j375k436k340j440o76
52641C39181m55m66l63p4M17J027J435J444J338J559K115K671L019L155L257L771
52625C63031N039O423O334L875R0l032m523m857m845m806m716m438l806k897k054
52610C44818j395n96L90R42O80K62N88J522K123J920J266O35J96r3m02q51j039
52593C50966l53Q86J364N66k04L35J421J399K97k71M28J441J856J883J905J729
52577C65648J222P28M50K17O4K28L89j14j106j552j050m41m91q69r15o98p18j020
52559C59972j171q36j39L68Q2r82j997k258k028j894j643p30M08O74J0l92J64
52542C47608R92J249R99N82o3p85q16K41J592K118J659R00L76Q4j18k26q8M31
$$ plain form
52656 337449 337845 339185 340494 341327 342044 343113 344574 346136 347321 347448 346073 343637 341297 339857 339181
52641 339181 338726 338260 337897 337823 338240 339267 340702 342146 343484 345043 347158 349829 352848 356003 359260 363031
52625 363031 368070 374493 380827 384702 384792 381760 377237 372380 367535 362729 358013 353575 349769 346872 344818
52610 344818 343423 342827 343217 344159 344839 345101 345689 347211 349334 351254 352520 353155 353351 353258 352856 352005 350966
52593 350966 350613 351499 352863 353429 353225 353560 354981 356380 356677 356406 356834 358275 360131 362014 363919 365648
52577 365648 366870 367598 368048 368265 368329 368557 368946 368832 367726 366174 365124 364683 364192 363323 362408 361710 360992 359972
52559 359972 358801 357965 357826 358194 358276 357294 355297 353039 351011 349117 347474 346744 347152 347826 347836 347444 347608
52542 347608 348600 349849 350848 351430 351367 350582 349766 350007 351599 353717 355376 356276 356652 356736 356618 356392 356304 356735
52524C56735J152J554J384J106J227J467J271R03J037J459J320P98J057K331L338
52509C78139L273L023L563M246L875K536J188K5j492l333m701n109m793m097l192
52494C73151k296j615j065n28k12l10n22m09n3P8k58r67j865k530k330j112L18
52477C57475J021J075J291J952K432K139J264M97L78J014K073K955L234L087L110
52462C84997L689M575N116M770L525J907M47r09k584m501n843o010n396m822m442
52447C74519l839l037k701l103l441k731j090K84M90j64p10o70l16J0L21O22O50
52430C55094K78o5K10J091J903J937J054k02r68p88j05K32J24L34J220K021K011
52413C65381J698K022K842L276L353M056N630P082P777Q460J0090J2357J4049
$$ plain form
52524 356735 357887 359441 360825 361931 363158 364625 365896 366799 367836 369295 370615 371413 372470 374801 378139
52509 378139 381412 384435 387998 392244 396119 398655 399843 399868 398376 395043 390342 385233 380440 376343 373151
52494 373151 370855 369240 368175 367647 367435 367125 366603 366194 366141 366219 365961 364994 363129 360599 358269 357157 357475
52477 357475 358496 359571 360862 362814 365246 367385 368649 369146 369524 370538 372611 375566 378800 381887 384997
52462 384997 388686 393261 398377 403147 406672 408579 409026 408117 405533 401032 395189 389179 383783 378961 374519
52447 374519 370680 367643 364942 361839 358398 355667 354577 354861 355351 355187 354477 353807 353491 353501 353822 354444 355094
52430 355094 355372 355307 355517 356608 358511 360448 361502 361300 360332 359544 359439 359671 359795 360129 361349 363370 365381
52413 365381 367079 369101 371943 375219 378572 382628 388258 395340 403117 411577 421667 434024 448073
52400D48073J4289J2808R549M795n67n420r009j0931j1004r620p848o666o179
52387D22270n920n603n169m319k705o19R66J316O79L9J91J223K652L918M648M761
52371D18328M594M849N974P422P904O696M358J912k12k004l121l094k222j450
52357D49934j341j619j766j584j085l32M93J196J794K329K610K509K347K554L023
52342D61062L311L269L069K814K676L105M219N275N538N399N874P145Q511R624
52328E30891J0778J2004J2915J3522J4261J5127J5716J6140J6843J7431J6914
52317F92542J5356J4117J4038J4540J4997J5766J7211J8724J9553J9792J9849
52306H76485J9757J9686K0286K1752K3171K3578K3052K2227K1324K0298J9242
$$ plain form
52400 448073 462362 475170 484719 489514 488947 483527 474518 463587 452583 442963 435115 428449 422270
52387 422270 416350 410747 405578 401259 398554 397935 398901 400217 400896 400935 401126 402349 405001 408919 413567 418328
52371 418328 422922 427771 433745 441167 449071 455767 460125 462037 461825 459821 456700 453606 451384 449934
52357 449934 448593 446974 445208 443624 442539 442207 442700 443896 445690 448019 450629 453138 455485 458039 461062
52342 461062 464373 467642 470711 473525 476201 479306 483525 488800 494338 499737 505611 512756 521267 530891
52328 530891 541669 553673 566588 580110 594371 609498 625214 641354 658197 675628 692542
52317 692542 707898 722015 736053 750593 765590 781356 798567 817291 836844 856636 876485
52306 876485 896242 915928 936214 957966 981137 1004715 1027767 1049994 1071318 1091616 1110858
52295A110858J7973J5829J2636R190O183L312K03k511l931m256m470n012n576
52282A150428n912o074o063n794n289m485l173j556l16K53P33J679K820L743M768
52267A125762O411Q443J0163J1206J1595J1479J1365J1962J3137J3773J3451J3461
52255A262208J5112J7656J9121J8908J8220J8021J7794J6606J4441J2005R841
52244A439933P951N996L768J599J50m05o61j057j248r00o02j172k446l582m307
52229A443017m937n305m709l144j659j116j152q54m7N44L76j03R7J280K617L197
52213A428102L187L526M605N951P154Q297R282R609R191Q639Q364Q170Q050Q530
52199A530657R696J0777J1312J1846J2749J3348J3089J2685J3012J3612J3380
$$ plain form
52295 1110858 1128831 1144660 1157296 1166486 1172669 1175981 1176184 1173673 1169742 1165486 1161016 1156004 1150428
52282 1150428 1144516 1138442 1132379 1126585 1121296 1116811 1113638 1112082 1111766 1112019 1112752 1114431 1117251 1120994 1125762
52267 1125762 1132173 1140616 1150779 1161985 1173580 1185059 1196424 1208386 1221523 1235296 1248747 1262208
52255 1262208 1277320 1294976 1314097 1333005 1351225 1369246 1387040 1403646 1418087 1430092 1439933
52244 1439933 1447884 1453880 1457648 1459247 1459397 1458992 1458331 1457274 1456026 1455126 1454524 1453352 1450906 1447324 1443017
52229 1443017 1438080 1432775 1428066 1424922 1423263 1422147 1420995 1420141 1420094 1420638 1421014 1420911 1421008 1422288 1424905 1428102
52213 1428102 1431289 1434815 1439420 1445371 1452525 1460822 1470104 1479713 1488904 1497543 1505907 1514077 1522127 1530657
52199 1530657 1540353 1551130 1562442 1574288 1587037 1600385 1613474 1626159 1639171 1652783 1666163
52188A666163J2104J0257P890M892J931j59j637l399n588p649r402j0976j1974
52175A652453j1893j1122j0433r797q848q098q294q779q004n790l597k378j560
52162A553860m80N30J091J665K683L588L403J836n30k757m064m295l976l543k729
52147A546282j254K35Q44P61Q41J085P45j94r80j611k938m913o156n871m861m031
52131A517984l086j537J29J372K712M876P511R853J2111J5023J8369K0979K2228
52118A628524K2631K2901K3092K2846K1980K0628J9156J7984J7370J7269J7431
52107A851812J7613J7734J7989J8805K0293K1819K2454K1959K0939J9957J8929
52096B070303J7427J5034J1377O367P43m242p997j1016j3827j6027j6899j6500
$$ plain form
52188 1666163 1678267 1688524 1696414 1701306 1703237 1703078 1701441 1698042 1692454 1684805 1675403 1664427 1652453
52175 1652453 1640560 1629438 1619005 1609208 1600360 1592262 1583968 1575189 1567185 1561395 1557798 1555420 1553860
52162 1553860 1553380 1553910 1555001 1556666 1559349 1562937 1566340 1568176 1567646 1564889 1560825 1556530 1552554 1549011 1546282
52147 1546282 1545028 1545263 1546107 1546868 1547709 1548794 1549539 1549345 1548365 1546754 1543816 1538903 1532747 1526876 1522015 1517984
52131 1517984 1514898 1513361 1513490 1514862 1517574 1522450 1529961 1539814 1551925 1566948 1585317 1606296 1628524
52118 1628524 1651155 1674056 1697148 1719994 1741974 1762602 1781758 1799742 1817112 1834381 1851812
52107 1851812 1869425 1887159 1905148 1923953 1944246 1966065 1988519 2010478 2031417 2051374 2070303
52096 2070303 2087730 2102764 2114141 2120508 2121251 2117009 2109012 2097996 2084169 2068142 2051243 2034743
52084B034743j5556j4488j3231j1861j0795j0179r603q622p270n759m021j891
52072A921467L50K098L233M397O189Q398J0370J1857J2991J3782J4223J4752J5729
52059B039836J6594J6493J5817J5945J7113J7701J6314J3486J0464P451M142J059
52047B192415j154l124n984r581j2744j5070j7040j8547j8816j7959j7187j7136
52035B038073j7179j6757j6317j6457j6963j7198j6807j5776j4487j3744j4139
52024A862249j5186j5799j5598j4988j4167j3016j1956j1718j2104j2057j1289
52013A714371j0682j0792j0982j0620j0072r992j0439j1361j3182j6236j9995
52002A580018k3363k5451k5993k5418k4594k3981k3102k1486j9822j9244j9643
$$ plain form
52084 2034743 2019187 2004699 1991468 1979607 1968812 1958633 1949030 1940408 1933138 1927379 1923358 1921467
52072 1921467 1921817 1923915 1927148 1931545 1937734 1946132 1956502 1968359 1981350 1995132 2009355 2024107 2039836
52059 2039836 2056430 2072923 2088740 2104685 2121798 2139499 2155813 2169299 2179763 2187214 2191356 2192415
52047 2192415 2191261 2188137 2182153 2172572 2159828 2144758 2127718 2109171 2090355 2072396 2055209 2038073
52035 2038073 2020894 2004137 1987820 1971363 1954400 1937202 1920395 1904619 1890132 1876388 1862249
52024 1862249 1847063 1831264 1815666 1800678 1786511 1773495 1761539 1749821 1737717 1725660 1714371
52013 1714371 1703689 1692897 1681915 1671295 1661223 1651231 1640792 1629431 1616249 1600013 1580018
52002 1580018 1556655 1531204 1505211 1479793 1455199 1431218 1408116 1386630 1366808 1347564 1327921
51991A327921j9889j9667j9846k0853k2095k3206k4513k5755k5829k4434k2794
51980A079040k1999k1845k1914k2450k3330k3409k1997j9913j8035j5908j2795
51969H55445r152n822k688N89L346M794N488O527P731P909O587M244J132k804
51955H83326o945j0150j1972j2835j3026j2360j0850q862o638m273k051r0K074
51942G85348M884P932J0455J2330J3867J4889J4926J4115J2966J1343Q675N122
51930I16852J615j416m365p418j0022j1835j3433j5526j7908j9648k0111j9495
51918G77290j8427j7290j5992j4316j2307j0083p484m378j342O56J548K457M284
51905F84616O604Q495R819J0935J1650J1353R875P468M212K48l603o349p907q908
$$ plain form
51991 1327921 1308032 1288365 1268519 1247666 1225571 1202365 1177852 1152097 1126268 1101834 1079040
51980 1079040 1057041 1035196 1013282 990832 967502 944093 922096 902183 884148 868240 855445
51969 855445 846293 840471 837783 838372 841718 846512 852000 858527 866258 874167 880754 884998 886130 883326
51955 883326 876381 866231 854259 841424 828398 816038 805188 796326 789688 785415 783364 783274 785348
51942 785348 790232 798164 808619 820949 834816 849705 864631 878746 891712 903055 911730 916852
51930 916852 918467 917051 912686 905268 895246 883411 869978 854452 836544 816896 796785 777290
51918 777290 758863 741573 725581 711265 698958 688875 681391 677013 675671 676327 677875 680332 684616
51905 684616 691220 699715 709534 720469 732119 743472 753347 760815 765027 765275 761672 755323 747416 738508
51891G38508r489q988o900l458P57N166R044J1600J2380J1297Q383M128j39k877
51877G69412l594k977j771j07J880L449L695K414J59k437n149p934j0388j1789
51863G34863j1833j1129j0442r575p637m590j719j48L84P28R71O74n5o94j320
51848F78478k617m795p176q908r674r692r457r394r350q626o927n004l788l207
51834E79863k407r13J029L026M707N495N003L663K309J183m7j378k384k993l573
51819E92583m054l821k723j447n33L61J682K977L251K122J60j759l186m205n068
51804E76340n778n996n436m285l050k002r67L33J839L083L469K717J166m62j657
51789E59314k333k448j788m18J011J746J608R16o1j160k069k409k114j432n74
$$ plain form
51891 738508 729019 720031 713131 709673 710430 715596 724640 736240 748620 759917 768300 772428 772289 769412
51877 769412 765818 762841 761070 760963 762843 766292 769987 772401 772560 770123 764974 757040 746652 734863
51863 734863 723030 711901 701459 691884 684247 679657 677938 677790 678174 678902 679873 680547 680492 679798 678478
51848 678478 675861 671066 663890 654982 645308 635616 626159 616765 607415 598789 591862 586858 583070 579863
51834 579863 577456 576543 577572 580598 585305 590800 595803 599466 601775 602958 602911 601533 599149 596156 592583
51819 592583 588529 584708 581985 580538 580005 580366 582048 585025 588276 590398 590558 588799 585613 581408 576340
51804 576340 570562 564566 559130 554845 551795 549793 548826 549159 550998 554081 557550 560267 561433 560971 559314
51789 559314 556981 554533 552745 552327 553338 555084 556692 557608 557547 556387 554318 551909 549795 548363 547789
51774E47789M34J595K908M455O381Q774J1419J3554J4070J2496R682P049N057
51761F45663L010L81k482n095p473r531j0753j0920j0560j0142r541q751q218
51748E55588p858o732m604k781k342k428j617j42Q59J646L484O155P846P781P281
51733E62136P595Q229Q110P111N627L729J636J89n2M45J017J690K510K690J393
51718F14055r71l080m208m686m968m863l938k279o57mo04j801k604k505j620q6
51702E75181K067M386N802N380L168K10k203l269l033k153j173m1J461K962L567
51687E92312K701O47j750l624m483m530m525m914n185m500k918j434q28j068j848
51672E54053l003m122m481l899l129k833k514j075J636M479O334P211P650P483
$$ plain form
51774 547789 548223 549818 552726 557181 563562 572336 583755 597309 611379 623875 633557 640606 645663
51761 645663 648673 649054 646572 641477 634004 624473 613720 602800 592240 582098 572557 563806 555588
51748 555588 547730 540998 536394 533613 531271 528843 527226 527084 527943 529589 533073 539228 547074 554855 562136
51733 562136 569731 577960 586070 593181 598808 602537 604173 604362 604310 604755 605772 607462 609972 612662 614055
51718 614055 613084 610004 605796 601110 596142 591279 587341 585062 584405 584401 583797 581996 579392 576887 575267 575181
51702 575181 577248 581634 587436 592816 595984 596194 593991 590722 587689 585536 584363 584322 585783 588745 592312
51687 592312 595013 595660 593910 590286 585803 581273 576748 571834 566649 562149 559231 557797 556969 555901 554053
51672 554053 551050 546928 542447 538548 535419 532586 530072 528997 530633 535112 541446 548657 556307 563790
51658E63790N862K718n65k411k549j663pK639N757Q152R508J0695J1890J1450
51644F25266P785J588m822r773j2863j3989j3282j1784j0778j0184q765o079l313
51631E29007j826j747k218k337j529K70K447M158N077N342M954L820K334J175
51617E48927N19N5l91r10j970l834n676o317n854n453n449m902l405k000j594
51602E01746j502m27J754M042N680O748P784R320J1641J4470J7027J8500J8324
51589F15107J6032J1517N592j55m364o506o669n358l537k080j024J82J743L525
51575F24005N869R295J3274J6260J7452J7686J8289J9844K2360K5562K8470K9689
51563H48055K9028K8263K9590L3618L9340M5435N0997N5447N8373N9222N6960
$$ plain form
51658 563790 569652 572370 571805 569394 566845 565182 565175 567814 573571 581723 591231 601926 613816 625266
51644 625266 633051 634639 629817 620044 607181 593192 579910 568126 557348 547164 538399 532320 529007
51631 529007 527181 525434 523216 520879 519350 519620 522067 526225 531302 536644 541598 545418 547752 548927
51617 548927 549446 549501 549110 548200 546230 542396 536720 530403 524549 519096 513647 508745 505340 503340 501746
51602 501746 500244 499817 501571 505613 511293 518041 525825 535145 546786 561256 578283 596783 615107
51589 615107 631139 642656 648248 648093 643729 637223 630554 625196 621659 619579 618555 618737 620480 624005
51575 624005 629874 639169 652443 668703 686155 703841 722130 741974 764334 789896 818366 848055
51563 848055 877083 905346 934936 968554 1007894 1053329 1104326 1159773 1218146 1277368 1334328
51552A334328N0563M0180K7281J3387p80j4655k7260l7812m6288n2853n7337n9683
51540A169071o0241n9121n5995n1125m5818m1131l6750l1939k6969k2792j9760
51529G17430j7469j5631j4249j3142j1958j0553r006p435o112n410n249n008m318
51516E91890l496k881k340j790j557j772k057k350l187m615n596n368m642m503
51502E45736m823m759m269l919l572k540q92N19J378K183L131L732L822M041M941
51487E44709O178P056P392P404P034N784L303O7k755m345n057n781o599o762o097
51472E51531n564n970o920p614p870p754o989n678m863n242n835n134l313k035
51458D70750k150k759k657j728o15J61M81O24J172K367L648M357M840O093Q384
$$ plain form
51552 1334328 1384891 1425071 1452352 1465739 1464959 1450304 1423044 1385232 1338944 1286091 1228754 1169071
51540 1169071 1108830 1049709 993714 942589 896771 855640 818890 786951 759982 737190 717430
51529 717430 699961 684330 670081 656939 644981 634428 625422 617987 611875 606465 601216 596208 591890
51516 591890 588394 585513 583173 581383 579826 578054 575997 573647 570460 565845 560249 554881 550239 545736
51502 545736 540913 536154 531885 527966 524394 521854 520962 521481 522859 525042 528173 531905 535727 539768 544709
51487 544709 550887 557943 565335 572739 579773 585557 588860 588927 586172 581827 576770 570989 564390 557628 551531
51472 551531 545967 539997 533077 525463 517593 509839 502850 497172 492309 487067 481232 476098 472785 470750
51458 470750 468600 465841 463184 461456 460841 461002 461483 462107 463279 465646 469294 473651 478491 484584 492968
51443D92968J0982J3323J5586J7875J9512J9463J7159J2814P490K871L62N1P92
51430F31248J247N91j496m735q132j0545j1550j1452j0589r257q092p710p818
51417E41710p463o279m847l645k419r90M6L5p59j375j153j41J232K473L176L247
51401E22848L032L061L610M526N448O147O640P040P412P931Q985J0796J2901J4528
51387F24905J5633J7112J9823K3782K8595L4102M0264M6860N3777O1028O8197
51376A034078P4404P9380Q3755Q7384Q7974Q2544P0176N2676L2817J2753o227
51365A691714k3559l9233n3104o4362p2237p6894p8964p8591p5862p1747o7376
51354I89785o2607n6584m9611m3093l7614l2502k7556k3575k0685j7715j4127
$$ plain form
51443 492968 503950 517273 532859 550734 570246 589709 606868 619682 627172 630043 630405 630456 631248
51430 631248 632495 633086 631590 626855 618723 608178 596628 585176 574587 565330 557238 549528 541710
51417 541710 534247 527968 523121 519476 517057 516067 516113 516148 515389 514014 512861 512720 513952 516425 519601 522848
51401 522848 525880 528941 532551 537077 542525 548672 555312 562352 569764 577695 586680 597476 610377 624905
51387 624905 640538 657650 677473 701255 729850 763952 804216 851076 904853 965881 1034078
51376 1034078 1108482 1187862 1271617 1359001 1446975 1529519 1599695 1652371 1685188 1697941 1691714
51365 1691714 1668155 1628922 1575818 1511456 1439219 1362325 1283361 1204770 1128908 1057161 989785
51354 989785 927178 870594 820983 777890 740276 707774 680218 656643 635958 618243 604116
51343F04116j1181j0018r797q988p603o758o631o313n416m464l714k796j752j307
51329E17378j709k173j893j105o30p88j219j525j687j915k349k928l391l412k897
51314D87757k146j572j175m29J032K710L517K938J584M18k85q13j242j333j090
51299D89871q98r89j217j417j617j847j999j993j790j323o19J42R68K212L946
51284D81430N489O123O058O017O107N935N635N682N655M335J516j343k866l297
51270E32476l662m113l986k975j432K09J588K272K122J620J328J076K67j229k850
51255E22711l962m301l948l287k814k708k685k540k463k581k585k225j757j405
51241D83450q43K02J159J288Q13N38N07J0r72j439r20l93r09j988k190r72Q33
$$ plain form
51343 604116 592935 582917 573120 564132 556529 549771 543140 536827 531411 526947 523233 520437 518685 517378
51329 517378 515669 513496 511603 510498 509868 509080 507861 506336 504649 502734 500385 497457 494066 490654 487757
51314 487757 485611 484039 482864 482435 483467 486177 489694 492632 494216 494634 494349 493536 492294 490961 489871
51299 489871 488973 487984 486767 485350 483733 481886 479887 477894 476104 474781 474162 474304 475272 477484 481430
51284 481430 486919 493042 499100 505117 511224 517159 522794 528476 534131 538466 539982 538639 535773 532476
51270 532476 528814 524701 520715 517740 516308 516517 518105 520377 522499 524119 525447 526523 526790 525561 522711
51255 522711 518749 514448 510500 507213 504399 501691 499006 496466 494003 491422 488837 486612 484855 483450
51241 483450 482607 482809 483968 485256 486069 486607 487114 487124 486152 484713 483793 483400 482491 480503 478313 477341 478174
51224D78174K182K689K361J237k54j166q26L58J266J165L03n27p30k68M50R32
51208D87346J018J012J354K106K897L309L208K735K174J821J746J669J298P79
51194E14472N15N11L23j97n42k65M15J035J580K286L022L360L078K234R04o72
51178E32059j880k233j998j868k125k519k825k929k577j692q67q34j436j873j941
51163E02462k110k256j318J176M121N970O296N603M270K509R72L73N26N43N6l72
51147E28821k72q4n71j758k843l130k788k561k804l065k765k042j534j388j078
51132E00138l59K49L17L85J211K472K999K362J500J452K112K632K590K167J472
51117E23699N00k88j20R78J880J670Q60O39J212J678J523J237J243J169P23N29
$$ plain form
51224 478174 480356 483045 485406 486643 486389 485223 484397 484755 486021 487186 487489 486962 486232 485964 486414 487346
51208 487346 488364 489376 490730 492836 495733 499042 502250 504985 507159 508980 510726 512395 513693 514472
51194 514472 514987 515498 515821 515624 515082 514817 515232 516267 517847 520133 523155 526515 529593 531827 532731 532059
51178 532059 530179 527946 525948 524080 521955 519436 516611 513682 511105 509413 508546 507712 506276 504403 502462
51163 502462 500352 498096 496778 497954 502075 508045 514341 519944 524214 526723 527695 528068 528594 529137 529193 528821
51147 528821 528549 528465 527894 526136 523293 520163 517375 514814 512010 508945 506180 504138 502604 501216 500138
51132 500138 499779 500028 500345 500730 501941 504413 507412 509774 511274 512726 514838 517470 520060 522227 523699
51117 523699 524199 523911 523791 524769 526649 528319 529179 529818 531030 532708 534231 535468 536711 537880 538603 539132
51101E39132J243K311K601J991J420J451J610J349P75K34j96m34k25M32J062J277
51085E56033J215J155R99M84l50j085j277p64J55Q26P64J76l11l38J5N79J192
51068E59468J527J448J546K621M494O043O630O933P891R562J1540J3862J6633
51055F50198J8962J9174J6445J1860P692N765O555R514J3800J8378K1765K2556
51043H22664K0806J8352J6909J5872J2930O980l08o167r124r504q406p075o759
51030H67170q298j1657j6056k0335k3161k3522k1613j8817j6342j4113j1426q247
51018F73583n235k805q16R32K432L683M652N229N531O103P239Q386Q786Q617Q776
51003G35093R534J0121R935R431R476J0245J1246J2220J3410J5003J6657J7712
$$ plain form
51101 539132 540375 542686 545287 547278 548698 550149 551759 553108 553883 554117 553921 553487 553262 553694 554756 556033
51085 556033 557248 558403 559402 559886 559536 558451 557174 556410 556565 557391 558155 558331 558020 557682 557697 558276 559468
51068 559468 560995 562443 563989 566610 571104 577147 583777 590710 598601 608163 619703 633565 650198
51055 650198 669160 688334 704779 716639 724331 730096 736651 746165 759965 778343 800108 822664
51043 822664 843470 861822 878731 894603 907533 914513 914205 908038 898914 889410 881004 873929 867170
51030 867170 858872 847215 831159 810824 787663 764141 742528 723711 707369 693256 681830 673583
51018 673583 668348 665543 664727 665659 668091 671774 676426 681655 687186 693289 700528 708914 717700 726317 735093
51003 735093 744627 754748 764683 774114 783590 793835 805081 817301 830711 845714 862371 880083
50991H80083J7724J6652J4776J2596J0719R522Q833Q181P468P212P837Q932R656
50978A020191R746R711R984J0274R965Q852P403O510P065R414J3095J7351K1958
50965A161519K7188L3006L8719M3644M7704N1189N4318N7258O0181O2968O5089
50954A702783O6027O5641O4037O1437N8225N4759N1039M7013M3267M0737L9581
50943B294546L9019L8699L9420M1868M5098M7067M6371M2997L7771L1804K6190
50932B730850K1423J6982J1914N779j260r053j7598k6771l6378m6378n6592o6277
50920B526641p4495q0832q5362q8090q8884q7911q5617q2265p7858p2619o7125
50909A635583o1896n7134n2760m8531m4222l9927l6067l2826k9873k6920k4250
$$ plain form
50991 880083 897807 914459 929235 941831 952550 962072 970905 979086 986554 993766 1001603 1010535 1020191
50978 1020191 1029937 1039648 1049632 1059906 1069871 1078723 1086126 1092636 1099701 1109115 1122210 1139561 1161519
50965 1161519 1188707 1221713 1260432 1304076 1351780 1402969 1457287 1514545 1574726 1637694 1702783
50954 1702783 1768810 1834451 1898488 1959925 2018150 2072909 2123948 2170961 2214228 2254965 2294546
50943 2294546 2333565 2372264 2411684 2453552 2498650 2545717 2592088 2635085 2672856 2704660 2730850
50932 2730850 2752273 2769255 2781169 2786948 2785688 2776635 2759037 2732266 2695888 2649510 2592918 2526641
50920 2526641 2452146 2371314 2285952 2197862 2108978 2021067 1935450 1853185 1775327 1702708 1635583
50909 1635583 1573687 1516553 1463793 1415262 1371040 1331113 1295046 1262220 1232347 1205427 1181177
50898A181177k2243k0655j8922j7034j5432j4146j2705j0949r286p959o657n134
50886A020055l749l005k817k567j763l97J176K517L357L794M330N492P275Q961
50872A042659R714R536R404J0213J1745J3106J4064J5290J7192J9295K1114K2961
50860A216293K5317K7926L0262L2458L5143L8587M2716M7721N3859O0749O7668
50849A678699P4549Q1992R0215R8650J06819J14908J23183J31350J38705J44503
50839B783573J48070J49069J47947J45474J41518J34769J24289J11020R7189Q4368
50829D067286P2706O1984N2720M5845M1779M0423M1885M6588N4392O4048P3835
50818D663491Q2498Q9082R2120Q9696Q0511O4668M3377J8267r130l7823o7485
$$ plain form
50898 1181177 1158934 1138279 1119357 1102323 1086891 1072745 1060040 1049091 1039805 1031846 1025189 1020055
50886 1020055 1016306 1013301 1010484 1007917 1006154 1005757 1006933 1009450 1012807 1016601 1020931 1026423 1033698 1042659
50872 1042659 1052373 1061909 1071313 1081526 1093271 1106377 1120441 1135731 1152923 1172218 1193332 1216293
50860 1216293 1241610 1269536 1299798 1332256 1367399 1405986 1448702 1496423 1550282 1611031 1678699
50849 1678699 1753248 1835240 1925455 2024105 2130924 2245832 2369015 2500365 2639070 2783573
50839 2783573 2931643 3080712 3228659 3374133 3515651 3650420 3774709 3885729 3982918 4067286
50829 4067286 4139992 4201976 4254696 4300541 4342320 4382743 4424628 4471216 4525608 4589656 4663491
50818 4663491 4745989 4835071 4927191 5016887 5097398 5162066 5205443 5223710 5214580 5176757 5109272
50807E109272r7634j26731j52691j74419j91986k05090k12461k13527k09703k02995
50797C322035j93903j81903j67524j52563j38167j24010j09661r5722q3046p1603
50787B003933o0841n0662m1547l3892k7663k2608j8554j5496j3551j2687j2634
50776A693798j3120j4035j5136j5865j5934j5869j6472j7787j9112k0013k0731
50765A509724k1585k2506k3332k4045k4491k4358k3582k2470k1166j9450j7228
50754A265511j4898j2910j1150r059o262k937L75L257N761Q279J0980J3633J6064
50741A266644J8574K1566K5010K8686L2782L7699M3276M8794N3790N8426O2926
50730A698173O7149P0866P4060P6686P8516P9417P9577P9234P8361P6736P4160
$$ plain form
50807 5109272 5011638 4884907 4732216 4557797 4365811 4160721 3948260 3734733 3525030 3322035
50797 3322035 3128132 2946229 2778705 2626142 2487975 2363965 2254304 2158582 2075536 2003933
50787 2003933 1943092 1892430 1850883 1816991 1789328 1766720 1748166 1732670 1719119 1706432 1693798
50776 1693798 1680678 1666643 1651507 1635642 1619708 1603839 1587367 1569580 1550468 1530455 1509724
50765 1509724 1488139 1465633 1442301 1418256 1393765 1369407 1345825 1323355 1302189 1282739 1265511
50754 1265511 1250613 1237703 1226553 1217494 1211232 1208295 1208670 1211927 1217688 1225967 1236947 1250580 1266644
50741 1266644 1285218 1306784 1331794 1360480 1393262 1430961 1474237 1523031 1576821 1635247 1698173
50730 1698173 1765322 1836188 1910248 1986934 2065450 2144867 2224444 2303678 2382039 2458775 2532935
50719B532935P0439O5348N8657N0259M0254K9105J7654O910k134q449j1148j0058
50707B839772n991r9O899J4675K2815L0820L8374M5091N0035N1927M9877M3565
50695C187760L2908J8004n81k1744m4035o5722q4981j00576j12159j19627j22542
50684B566705j20773j15415j08208j00141r1341q2113p3092o4280n4911m4733
50674A711698l4711k5904j8251j0925l553L481R598J4471J7925J9784J9988J8817
50662A722418J6946J5062J3373J1697J0123R141Q868Q684Q124P534P225O513M646
50649A850354K298J053J443K682M270O652J0046J3746J7144K0425K3832K7124
50637A981069L0314L3986L8269M2227M4983M6723M7924M8408M7924M7162M7392
$$ plain form
50719 2532935 2603374 2668722 2727379 2777638 2817892 2846997 2864651 2871561 2869427 2860978 2849830 2839772
50707 2839772 2833781 2833682 2840581 2855256 2878071 2908891 2947265 2992356 3042391 3094318 3144195 3187760
50695 3187760 3220668 3238672 3238091 3216347 3172312 3106590 3021609 2921033 2808874 2689247 2566705
50684 2566705 2445932 2330517 2222309 2122168 2030827 1948714 1875622 1811342 1756431 1711698
50674 1711698 1676987 1651083 1632832 1621907 1618354 1621835 1631433 1645904 1663829 1683613 1703601 1722418
50662 1722418 1739364 1754426 1767799 1779496 1789619 1798760 1807628 1816312 1824436 1831970 1839195 1845708 1850354
50649 1850354 1852652 1853705 1855148 1857830 1862100 1868752 1878798 1892544 1909688 1930113 1953945 1981069
50637 1981069 2011383 2045369 2083638 2125865 2170848 2217571 2265495 2313903 2361827 2408989 2456381
50626B456381M9426N3397N8540O2141N9378M6153K2957m492k8825m5253n3028
50615B676775n4097n1028m5702l9173l2099k5115j8817j3631r797p220n474m365
50603B370257m520o900j1502j7168k2975k9223l6477m4244n1267n6884o1212o4162
50591A963723o5182o4130o1832n9265n6607n3394m9405m5050m0817l6731l2494
50580A398816k8051k3717j9661j5695j1743q268n736l863j901L47K286L367L666
50567A289847L621L643M120N335P107Q892J0361J1624J2879J4345J6457J9564
50555A407795K3243K6481K8741L0295L1422L1848L1329L0084K8333K6002K3260
50544A718833K0834J9298J8469J7877J7420J7289J7807J9604K3246K8233L2986
$$ plain form
50626 2456381 2505807 2559204 2617744 2679885 2739263 2785416 2808373 2803881 2775056 2729803 2676775
50615 2676775 2622678 2571650 2525948 2486775 2454676 2429561 2410744 2397113 2387316 2380096 2374622 2370257
50603 2370257 2365737 2358837 2347335 2330167 2307192 2277969 2241492 2197248 2145981 2089097 2027885 1963723
50591 1963723 1898541 1834411 1772579 1713314 1656707 1603313 1553908 1508858 1468041 1431310 1398816
50580 1398816 1370765 1347048 1327387 1311692 1299949 1291681 1285945 1282082 1280181 1280528 1282814 1286181 1289847
50567 1289847 1293468 1297111 1301231 1306566 1313673 1322565 1332926 1344550 1357429 1371774 1388231 1407795
50555 1407795 1431038 1457519 1486260 1516555 1547977 1579825 1611154 1641238 1669571 1695573 1718833
50544 1718833 1739667 1758965 1777434 1795311 1812731 1830020 1847827 1867431 1890677 1918910 1951896
50533A951896L6513L9505M3171M7576N1930N6070O0677O6200P2363P8768Q5295
50522B589964R1717R7354J01197J02361J00652R6934R2419Q7187P9874O9357N6274
50511C565290M2203K7800J2628l389j9414l4608m8720o1520p2341q0534q5826
50500C241569q7967q6500q1272p2867o2295n0460l8061k5612j3318j109J0890
50489B732998K1925L0840L6652L8822L6989L0717J9776M777j2730l0988m8710
50478B861068o4857p8174q7637r3343r6339r7386r6497r3808r0154q6291q2120
50467A894462p7233p1758o6144o0469n4654m9019m4034l9554l4947k9913k4748
50456A341989j9847j5309j0986o633k130K200N649P858R323J0807J2485J3960
$$ plain form
50533 1951896 1988409 2027914 2071085 2118661 2170591 2226661 2287338 2353538 2425901 2504669 2589964
50522 2589964 2681681 2779035 2880232 2982593 3083245 3180179 3272598 3359785 3439659 3509016 3565290
50511 3565290 3607493 3635293 3647921 3644532 3625118 3590510 3541790 3480270 3407929 3327395 3241569
50500 3241569 3153602 3067102 2985830 2912963 2850668 2800208 2762147 2736535 2723217 2722108 2732998
50489 2732998 2754923 2785763 2822415 2861237 2898226 2928943 2948719 2953496 2940766 2909778 2861068
50478 2861068 2796211 2718037 2630400 2537057 2440718 2343332 2246835 2153027 2062873 1976582 1894462
50467 1894462 1817229 1745471 1679327 1618858 1564204 1515185 1471151 1431597 1396650 1366737 1341989
50456 1341989 1322142 1306833 1295847 1289214 1287084 1289284 1294933 1302791 1312114 1322921 1335406 1349366
50444A349366J4988J5823J6988J8961K1816K4881K6956K7253K5909K3387J9789
50433A586117J5182J0169N537J571j792m333n686n990n849n673n512n352n088
50420A573301m177k011J306M998Q605J2518J7291K2759K8072L2558L6304L9844
50408A771368M3344M6282M8136M9147M9931N0382M9587M7064M3441L9533L5286
50397B273501L0121K3867J6791R019N80q267j7232k6339l5596m4437n1998n7766
50385B112244o1614o3440o3237o1266n7729n2517m5679l7857k9761k1543j3176
50374A604425n150J887P855J2920J6600J7943J6586J3025P892J507n760j3273
50362A676457k0405k6635l1483l4692l6466l7184l6985l5958l4555l3421l2920
$$ plain form
50444 1349366 1364354 1380177 1397165 1416126 1437942 1462823 1489779 1517032 1542941 1566328 1586117
50433 1586117 1601299 1611468 1617005 1618576 1616784 1612451 1606765 1600775 1594926 1589253 1583741 1578389 1573301
50420 1573301 1569124 1567113 1568419 1573417 1582022 1594540 1611831 1634590 1662662 1695220 1731524 1771368
50408 1771368 1814712 1860994 1909130 1958277 2008208 2058590 2108177 2155241 2198682 2238215 2273501
50397 2273501 2303622 2327489 2344280 2353299 2353879 2345612 2328380 2302041 2266445 2222008 2170010 2112244
50385 2112244 2050630 1987190 1923953 1862687 1804958 1752441 1706762 1668905 1639144 1617601 1604425
50374 1604425 1599275 1601162 1609017 1621937 1638537 1656480 1673066 1686091 1693983 1695490 1689730 1676457
50362 1676457 1656052 1629417 1597934 1563242 1526776 1489592 1452607 1416649 1382094 1348673 1315753
50351A315753l3024l3443l3506l2394k9957k6980k4220k1604j8879j6384j4401
50340A030961j2347r624o892n257m431k946l29K235L704M577N841P522Q953R927
50326A031894J0860J2076J3501J4956J6461J8331K0986K4510K8334L1614L3973
50315A257496L5495L5971L4398K9498K0786R506j455r143j2708j3811j4523j5133
50303A356377j4559j2374r505p045n313m187l516l002k184q40R13K793M384N205
50289A307147N373N905P882J1486J6226K1341K5004K4080J6523M195q026j6337
50277A420799k0239k0890j9023j5238j0850p093m042j189J437L480N032O373P220
50264A345777P042N990M893M336M140L751K933K026J601J727J721P78j165l477
$$ plain form
50351 1315753 1282729 1249286 1215780 1183386 1153429 1126449 1102229 1080625 1061746 1045362 1030961
50340 1030961 1018614 1008990 1002098 996841 992410 989464 989135 991370 995074 999651 1005492 1013014 1021967 1031894
50326 1031894 1042754 1054830 1068331 1083287 1099748 1118079 1139065 1163575 1191909 1223523 1257496
50315 1257496 1292991 1328962 1363360 1392858 1413644 1423150 1421695 1412552 1399844 1386033 1371510 1356377
50303 1356377 1341818 1329444 1319939 1312894 1307581 1303394 1299878 1296876 1294692 1293852 1294765 1297558 1301942 1307147
50289 1307147 1312520 1318425 1326307 1337793 1354019 1375360 1400364 1424444 1440967 1445162 1437136 1420799
50277 1420799 1400560 1379670 1360647 1345409 1334559 1327466 1323424 1322235 1323672 1327152 1332184 1338557 1345777
50264 1345777 1352819 1358809 1363702 1368038 1372178 1375929 1378862 1380888 1382489 1384216 1385937 1386715 1385550 1382073
50250A382073n527p010p750p799p525p203o632n654m721m230l576j864O40K761
50236A315983M149N667P928J0419J2454J4013J5333J6426J7490J8945K0679K1901
50224A481387K2117K1650K0945K0001J8667J6921J4755J2508J1168J1367J2130
50213A663616J1785J0151Q380O554L128k674r565j6170k2626k9071l4077l6216
50201A553215l6070l5063l3105k9109k3312j7327j2165p683m139k877n101j0697
50189A336567j8307k5886l1386l3793l3645l2149k9962k7236k4259k1358j8563
50178A040023j6073j4477j3775j2879j1024r028q028p649o786n689n615o562p056
50165I15382o362n299m540l619k302j488j823k434k114j013k23j51j54M53J708
$$ plain form
50250 1382073 1376546 1369536 1361786 1353987 1346462 1339259 1332627 1326973 1322252 1318022 1314446 1312582 1313222 1315983
50236 1315983 1320132 1325799 1333727 1344146 1356600 1370613 1385946 1402372 1419862 1438807 1459486 1481387
50224 1481387 1503504 1525154 1546099 1566100 1584767 1601688 1616443 1628951 1640119 1651486 1663616
50213 1663616 1675401 1685552 1693932 1700486 1703614 1700940 1691375 1675205 1652579 1623508 1589431 1553215
50201 1553215 1517145 1482082 1448977 1419868 1396556 1379229 1367064 1359381 1355242 1352365 1347264 1336567
50189 1336567 1318260 1292374 1260988 1227195 1193550 1161401 1131439 1104203 1079944 1058586 1040023
50178 1040023 1023950 1009473 995698 982819 971795 962767 954739 947090 940304 934615 929000 922438 915382
50165 915382 909020 903721 899181 895562 893260 891772 889949 887515 885401 884388 884165 884014 883860 884313 886021
50150H86021L188M366M884M786M302L339J624m33j687j575j071j640l414m996
50136H97694n076l671j716J58K055M202O307P713Q146Q043Q017Q151Q127P913
50122I56063P964Q693R996J1528J3168J4984J6875J8591K0211K2319K5467K9521
50110A155380L3800L7879M1905M5941M9318N1103N1084M9883M8282M6805M5924
50099A657304M6033M6994M8137M8768M8407M6444M2166L5316K6199J5215K834
50088B063817r816k1131l0251l7484m3193m6963m8434m8240m7203m5113m1157
50077A644832l5422k9101k3236j7911j2859q316n100l936m693o197p057o893o469
50064A477642o472o693o752o966p839r106j0013j0331j0486j0849j1421j2058
$$ plain form
50150 886021 889209 893575 898459 903245 907547 910886 912510 912077 910390 908815 907744 906104 902690 897694
50136 897694 892618 888947 887231 887389 889444 893646 899953 907666 915812 923855 931872 940023 948150 956063
50122 956063 964027 972720 982716 994244 1007412 1022396 1039271 1057862 1078073 1100392 1125859 1155380
50110 1155380 1189180 1227059 1268964 1314905 1364223 1415326 1466410 1516293 1564575 1611380 1657304
50099 1657304 1703337 1750331 1798468 1847236 1895643 1942087 1984253 2019569 2045768 2060983 2063817
50088 2063817 2054001 2032870 2002619 1965135 1921942 1874979 1826545 1778305 1731102 1685989 1644832
50077 1644832 1609410 1580309 1557073 1539162 1526303 1517987 1512887 1508951 1504258 1498061 1491004 1484111 1477642
50064 1477642 1471170 1464477 1457725 1450759 1442920 1433814 1423801 1413470 1402984 1392135 1380714 1368656
50052A368656j2574j2781j2806j3020j3295j2850j1324r488q190p091n226k452
50040A247559O00L634O755R624J1606J2812J4058J5622J6857J7221J6939J6434
50028A389721J5808J5076J4315J3373J1910R843P303M264P91k433m581n779o982
50015A462629q789j0983j3301j5813j8276j9849j9864j8466j6289j3960j1999
50004A295040j0626r494p989n832l000O52N043R168J1839J3087J4008J5118J5895
49991A342909J6176J6869J8634K0734K1829K1262J9056J5414J1010P143M864M284
49979A520184N150P440J0780J3882J5460J5358J4042J1383O757J14p846j6425
49967A596279k5061l2793l8444m1512m2332m1312l8689l5071l1436k8151k4466
$$ plain form
50052 1368656 1356082 1343301 1330495 1317475 1304180 1291330 1280006 1270518 1262328 1255237 1250011 1247559
50040 1247559 1248159 1251793 1258548 1268172 1279778 1292590 1306648 1322270 1339127 1356348 1373287 1389721
50028 1389721 1405529 1420605 1434920 1448293 1460203 1470046 1477349 1481613 1482404 1479971 1475390 1469611 1462629
50015 1462629 1453840 1442857 1429556 1413743 1395467 1375618 1355754 1337288 1320999 1307039 1295040
50004 1295040 1284414 1274920 1266931 1261099 1258099 1258751 1263794 1272962 1284801 1297888 1311896 1327014 1342909
49991 1342909 1359085 1375954 1394588 1415322 1437151 1458413 1477469 1492883 1503893 1511036 1515900 1520184
49979 1520184 1525334 1532774 1543554 1557436 1572896 1588254 1602296 1613679 1620436 1620550 1612704 1596279
49967 1596279 1571218 1538425 1499981 1458469 1416137 1374825 1336136 1301065 1269629 1241478 1217012
49956A217012j9497j3484p649k949O67L684O040O966N837L008k86k867m346n020
49942A187116n380n939p252r625j2649j5315j6838j7372j7732j8456j9414k0287
49930A020857k1105k1908k2177k1198j9074j6762j4922j3250j1369r707q766p951
$$ plain form
49956 1217012 1197515 1184031 1176382 1173433 1174100 1177784 1183824 1190790 1196627 1199635 1199349 1196482 1192136 1187116
49942 1187116 1181736 1175797 1168545 1158920 1146271 1130956 1114118 1096746 1079014 1060558 1041144 1020857
49930 1020857 999752 977844 955667 934469 915395 898633 883711 870461 859092 849385 840619 832668
$$ [...]
##END NTUPLES=NMR SPECTRUM
##END=
