##TITLE=AC1626_CENAH_8450430_0kxrRob3b6
##JCAMPDX= 6.0         $$ Bruker NMR JCAMP-DX V2.0
##DATA TYPE= NMR SPECTRUM
##DATA CLASS= NTUPLES
##ORIGIN= BRUKER
##OWNER= Administrator
$$ 1.72 TOPSPIN		Version 2.1
$$ 2014-02-18 14:13:58.308 -0800  Administrator@X
$$ Compression mode = diff/dup
##.OBSERVE FREQUENCY= 400.02188249412
##.OBSERVE NUCLEUS= ^1H
##.ACQUISITION MODE= SIMULTANEOUS (DQD)
##.ACQUISITION SCHEME= undefined
##.AVERAGES= 8
##.DIGITISER RES= 22
##SPECTROMETER/DATA SYSTEM= spect
##.PULSE SEQUENCE= zg30
##.SOLVENT NAME= COFFEE_meoh
##.SHIFT REFERENCE= INTERNAL, COFFEE_meoh, 1, 14.98509
##AUDIT TRAIL= $$ (NUMBER, WHEN, WHO, WHERE, PROCESS, VERSION, WHAT)
$$ ##TITLE= Audit trail, TOPSPIN		Version 2.1
$$ ##JCAMPDX= 5.01
$$ ##ORIGIN= Bruker BioSpin GmbH
$$ ##OWNER= Administrator
$$ $$ E:\/data/COFFEE/nmr/AC1626_CENAH_8450430_0kxrRob3b6/10/pdata/1/auditp.txt
$$ ##AUDIT TRAIL=  $$ (NUMBER, WHEN, WHO, WHERE, PROCESS, VERSION, WHAT)
(   1,<2014-02-18 14:13:51.886 -0800>,<Administrator>,<X>,<go>,<TOPSPIN 2.1>,
      <created by zg
	started at 2014-02-18 14:12:45.840 -0800,
	POWCHK enabled, PULCHK disabled,
       configuration hash MD5:
       C8 4E 4E 5D D3 5C D8 9E 9F 52 82 E0 59 8A DE 15
       data hash MD5: 64K
       43 36 ED 25 E0 02 1B 76 D7 B6 A2 A2 54 98 3F 44>)
(   2,<2014-02-18 14:13:54.715 -0800>,<Administrator>,<X>,<proc1d>,<TOPSPIN 2.1>,
      <Start of raw data processing
       efp LB = 0 FT_mod = 6 PKNL = 1 PHC0 = 0 PHC1 = 0 SI = 32K 
       data hash MD5: 32K
       1B 4F 13 07 13 00 69 7C 2F F2 98 4A AC F5 49 6B>)
(   3,<2014-02-18 14:13:54.980 -0800>,<Administrator>,<X>,<proc1d>,<TOPSPIN 2.1>,
      <pk PHC0 = 97.05872 PHC1 = 0 
       data hash MD5: 32K
       3F DE 7F B0 53 04 DA 7F C2 65 4D 5E 90 F0 98 45>)
(   4,<2014-02-18 14:13:55.058 -0800>,<Administrator>,<X>,<proc1d>,<TOPSPIN 2.1>,
      <abs ABSG = 1 
       data hash MD5: 32K
       25 F8 4F 47 FB A0 FE 3C 4F 3F 76 0C F3 8A 55 69>)
(   5,<2014-02-18 14:13:55.136 -0800>,<Administrator>,<X>,<proc1d>,<TOPSPIN 2.1>,
      <abs ABSG = 2 
       data hash MD5: 32K
       3E 91 D5 EA 1D B4 4C 9F 08 68 78 4A 3C 95 AE 3C>)
(   6,<2014-02-18 14:13:55.199 -0800>,<Administrator>,<X>,<proc1d>,<TOPSPIN 2.1>,
      <abs ABSG = 3 
       data hash MD5: 32K
       FF C2 F8 AD 1E 2C 15 73 53 CC D6 94 AC BC CE D1>)
(   7,<2014-02-18 14:13:55.261 -0800>,<Administrator>,<X>,<proc1d>,<TOPSPIN 2.1>,
      <abs ABSG = 4 
       data hash MD5: 32K
       E6 C0 F5 53 30 6A A6 CC 83 69 82 E8 AD 9C BA 23>)
(   8,<2014-02-18 14:13:55.324 -0800>,<Administrator>,<X>,<proc1d>,<TOPSPIN 2.1>,
      <abs ABSG = 5 
       data hash MD5: 32K
       78 91 2F 55 43 20 AC E1 1A 0C 00 2A 75 9B 22 14>)
$$ ##END=
$$ 
$$ $$ hash MD5
$$ $$ E8 B1 89 F5 87 C1 07 A5 DC BA 55 DD 00 1C 50 2A
##$RELAX= 
##$RELAX= 
##$RELAX= 
##$RELAX= 
##$RELAX= 
##$RELAX= 
##$RELAX= 
$$ Bruker specific parameters
$$ --------------------------
##$DU= <E:\>
##$EXPNO= 10
##$NAME= <AC1626_CENAH_8450430_0kxrRob3b6>
##$PROCNO= 1
$$ [...]
150 150 150 150 150 150 150 150
##$TP07= 0
##$TPNAME0= <>
##$TPNAME1= <>
##$TPNAME2= <>
##$TPNAME3= <>
##$TPNAME4= <>
##$TPNAME5= <>
##$TPNAME6= <>
##$TPNAME7= <>
##$TPOAL= (0..7)
0.5 0.5 0.5 0.5 0.5 0.5 0.5 0.5
##$TPOFFS= (0..7)
0 0 0 0 0 0 0 0
##$TUNHIN= 0
##$TUNHOUT= 0
##$TUNXOUT= 0
##$USERA1= <user>
##$USERA2= <user>
##$USERA3= <user>
##$USERA4= <user>
##$USERA5= <user>
##$V9= 5
##$VALIST= <valist>
##$VCLIST= <CCCCCCCCCCCCCCC>
##$VD= 0
##$VDLIST= <DDDDDDDDDDDDDDD>
##$VPLIST= <PPPPPPPPPPPPPPP>
##$VTLIST= <TTTTTTTTTTTTTTT>
##$WBST= 2048
##$WBSW= 25
##$XGAIN= (0..3)
0 0 0 0
##$XL= 0
##$YL= 0
##$YMAX_a= 621042
##$YMIN_a= -528308
##$ZGOPTNS= <>
##$ZL1= 120
##$ZL2= 120
##$ZL3= 120
##$ZL4= 120
##$ABSF1= 14.98509
##$ABSF2= -5.573092
##$ABSG= 5
##$ABSL= 3
##$ALPHA= 0
##$AQORDER= 0
##$ASSFAC= 0
##$ASSFACI= 0
##$ASSFACX= 0
##$ASSWID= 0
##$AUNMP= <proc_prof1d_extract_pilot.lims>
##$AXLEFT= 0
##$AXNAME= <>
##$AXNUC= <1H>
##$AXRIGHT= 0
##$AXTYPE= 0
##$AXUNIT= <>
##$AZFE= 0.1
##$AZFW= 0.1
##$BCFW= 0
##$BC_mod= 0
##$BYTORDP= 0
##$COROFFS= 0
##$CY= 15
##$DATMOD= 1
##$DC= 0
##$DFILT= <>
##$DTYPP= 0
##$F1P= 0
##$F2P= 0
##$FCOR= 0.5
##$FTSIZE= 32768
##$FT_mod= 6
##$GAMMA= 0
##$GB= 0
##$INTBC= 1
##$INTSCL= 1
##$ISEN= 128
##$LB= 0
##$LEV0= 0
##$LPBIN= 0
##$MAXI= 10000
##$MC2= 0
##$MEAN= 0
##$ME_mod= 0
##$MI= 0
##$NCOEF= 0
##$NC_proc= -8
##$NLEV= 6
##$NOISF1= 0
##$NOISF2= 0
##$NSP= 0
##$NTH_PI= 0
##$NZP= 0
##$OFFSET= 14.98509
##$PC= 1
##$PHC0= 97.05872
##$PHC1= 0
##$PH_mod= 1
##$PKNL= yes
##$PPARMOD= 0
##$PPDIAG= 0
##$PPIPTYP= 0
##$PPMPNUM= 2147483647
##$PPRESOL= 1
##$PSCAL= 4
##$PSIGN= 0
##$PYNMP= <proc.py>
##$REVERSE= no
##$SF= 400.02
##$SI= 32768
##$SIGF1= 0
##$SIGF2= 0
##$SINO= 400
##$SIOLD= 32768
##$SPECTYP= <>
##$SREGLST= <1H.CDCl3>
##$SSB= 0
##$STSI= 32768
##$STSR= 0
##$SW_p= 8223.68421052631
##$SYMM= 0
##$S_DEV= 0
##$TDeff= 65536
##$TDoff= 0
##$TI= <>
##$TILT= no
##$TM1= 0
##$TM2= 0
##$TOPLEV= 0
##$USERP1= <user>
##$USERP2= <user>
##$USERP3= <user>
##$USERP4= <user>
##$USERP5= <user>
##$WDW= 1
##$XDIM= 32768
##$YMAX_p= 450787388
##$YMIN_p= -856185
##$CURPLOT= <Network HP LaserJet P1505>
##$CURPRIN= <$Network HP LaserJet P1505>
##$DFORMAT= <normdp>
##$LAYOUT= <+/1D_H.xwp>
##$LFORMAT= <normlp>
##$PFORMAT= <normpl>
##$SURQMSG= 1
$$ End of Bruker specific parameters
$$ ---------------------------------
##NTUPLES= NMR SPECTRUM
##VAR_NAME=  FREQUENCY,     SPECTRUM/REAL,   SPECTRUM/IMAG
##SYMBOL=    X,             R,               I
##VAR_TYPE=  INDEPENDENT,   DEPENDENT,       DEPENDENT
##VAR_FORM=  AFFN,          ASDF,            ASDF
##VAR_DIM=   32768,         32768,           32768
##UNITS=     HZ,            ARBITRARY UNITS, ARBITRARY UNITS
##FACTOR=    0.250966925370066, 1,           1
##FIRST=     8223.43324360094, -137541,      -181341
##LAST=      0,             108383,          45378
##MIN=       0,             -856185,         0
##MAX=       8223.43324360094, 450787388,    0
$$ Real data points
##PAGE= N=1
##DATA TABLE= (X++(R..R)), XYDATA
$$ [...]
19545b2656k7489l18243F8657a60554E9477j2847c60524B26923a87479l8383A84048
19533a70417E805a63638b4466l8806I5084j4558J78323g1633k25836f6585C19161
19521b0875m8011A82373a72627j14425A43853A7242b90956A1262b14429A01817
19510B96811I2896L267b28502h814l00711A0830d1057n3358c0624l6313H3562
19498a97803A99585F2652O0912j9594b05596q386a1427A68456d30624B04119r7864
19487A06255b66527n4675J40397A21795g807A30502a13218m80981a21436n4407
19477a75843A34235h5796o8081j00707P6403d599l21135J33066j62684g9721r7139
19466a76860A51608B0651R5125a87386M9705f1883k19536f6555B72880i3999A37453
$$ plain form
19545 -22656 -50145 -368388 68657 -160554 59477 46630 -360524 226923 -187479 -225862 184048
19533 -170417 5805 -163638 -24466 -63272 95084 80526 258849 -71633 -297469 -66585 319161
19521 -20875 -68886 182373 -172627 -287052 143853 17242 -290956 11262 -214429 101817
19510 296811 92896 96163 -228502 -8814 -309525 10830 -41057 -94415 -30624 -66937 83562
19498 -197803 199585 62652 123564 103970 -205596 -213982 -11427 168456 -430624 204119 106255
19487 106255 -266527 -321202 -180805 121795 -7807 130502 -113218 -594199 -121436 -175843
19477 -175843 134235 -85796 -153877 -254584 -178181 -4599 -325734 -192668 -355352 -79721 -176860
19466 -176860 151608 20651 115776 -187386 -137681 -61883 -281419 -66555 272880 -93999 137453
19454a7674k28498R8903G2443e4935o5728h885B33571b13176E0689d3804j58616
19443b02420B5245K2411M9376a3282m3440B36699k185I6649a46585j8703E1072
19431c80684F6042a69500A77370d0656m29493G3859f0536A28682c1457E8917Q5350
19420A44267c11959F4319M6583L5244F4198e3194A93568a31597b5058B33992b34928
19408B00090k5408O4395i103D46533a18256C5392b98526I6513a87378q9574r0510
19397c67462N7207A75975a04582M4325B5512a4658l9130l20504J19525D2593g7011
19385b41658e4109B71535a5860H131b09537j21945a35758j00306Q9289A79622
19374b19673G4339a38961j12883A60420h8606j16229N9046B0964l704K21899o660
$$ plain form
19454 -17674 -246172 -147269 72443 -54935 -120663 -8885 233571 -213176 50689 -43804 -202420
19443 -202420 25245 47656 97032 -13282 -56722 236699 234514 96649 -146585 -165288 51072
19431 -380684 66042 -169500 177370 -40656 -470149 73859 -60536 128682 -31457 58917 144267
19420 144267 -311959 64319 110902 146146 64198 -53194 193568 -131597 -25058 233992 -234928
19408 200090 174682 239077 -9103 446533 -118256 35392 -298526 96513 -187378 -276952 -367462
19397 -367462 -310255 175975 -104582 -60257 25512 -14658 -53788 -374292 -254767 42593 -77011
19385 -241658 -54109 271535 -15860 8131 -209537 -331482 -135758 -236064 -146775 179622
19374 -219673 74339 -138961 -251844 160420 -88606 -204835 -145789 20964 17260 239159 232499
19363B32499B0708K34270b59051Q4104f0437p8944D2192K44698d5095j34046K5962
19352a53179k5574j11053E4879O7702l7783a17229g724k37372R7769j00167A98696
19340C1712c08024B61649b13957C8542i3040A47545f5690m9427k85869G4612I718
19328a19636L3271j027E3167J9161f80k88206Q5164B83509c07185e8989j35352
19317a94341d9178k4403j10244A86167e6166m31289G1523h7550a8117j82443M5484
19306a55076K5471A15560c06119J01607a4776A94668A07L9446d96612a4075j35001
19295a49076O8704D8625R5138c8637C5386a41140K7423n6917e717k4204m3580
19284g3501A0729h4956G5321g8197A43560Q0683b0038D0519K2709b20381K9351
$$ plain form
19363 232499 20708 254978 -259051 -174947 -60437 -139381 42192 286890 -45095 -179141 -153179
19352 -153179 -178753 -289806 54879 122581 84798 -117229 -7724 -245096 -147327 -247494 198696
19340 31712 -308024 261649 -213957 38542 -93040 147545 -65690 -115117 -400986 74612 9718
19328 -119636 -86365 -87392 53167 72328 -680 -288886 -203722 283509 -307185 -58989 -194341
19317 -194341 -49178 -73581 -183825 186167 -56166 -487455 71523 -87550 -18117 -200560 -155076
19306 -155076 -129605 115560 -306119 -204512 -14776 194668 107 39553 -496612 -14075 -149076
19295 -149076 -80372 48625 143763 -38637 35386 -141140 -113717 -170634 -5717 -29921 -73501
19284 -73501 10729 -84956 75321 -78197 143560 224243 -20038 40519 63228 -220381 -191030
19273a91030B42002b96077E7332a5644k96381a53166B1037b98734A92180a09773
19262a07573j51521a19575A70151a68813M4962k45548a84583k3238p1864d4454
19251A00248A9082L0825A1395d12826a50762j16573i5371A68081b3455G0612K5305
19240I5917I957c0077G2544l608R115a62994C6882g0959r223G8465e8013Q635
19228d9378r2037D235L44546c672B5828G442f6205B10713B2944N2671b04071o1109
19216b65180j906g4912A27117D9955b32107A17932h6878M1633q0449C42216B861
19204b06284C84055e8169k33642a06800F2510a62205j0317P6213q2900j08662
19194b87871G8762a43676J3173k002B6887N3378L5244P5442a1911r2190k3656
$$ plain form
19273 -191030 242002 -296077 57332 -15644 -312025 -153166 21037 -298734 192180 -109773
19262 -107573 -259094 -119575 170151 -168813 -123851 -369399 -184583 -207821 -279685 -44454
19251 100248 19082 49907 11395 -412826 -150762 -267335 -95371 168081 -23455 70612 95917
19240 95917 9957 -30077 72544 68936 78051 -162994 36882 -70959 -80182 78465 -58013 -49378
19228 -49378 -141415 4235 348781 -3672 25828 7442 -66205 210713 22944 75615 -204071 -265180
19216 -265180 -267086 -74912 127117 49955 -232107 117932 -86878 -45245 -125694 342216 2861
19204 -206284 384055 -58169 -291811 -106800 62510 -162205 -172522 -96309 -179209 -287871
19194 -287871 78762 -143676 -130503 -132505 26887 80265 115509 190951 -11911 -104101 -127757
19183a27757h85k92401A41081A3511b76446H2176k0567c36415A28589D0226R0306
19172A30532a27055G9823b35296H7845A0280a3137j69130f0314k87807E7296B514
19160b3078A73946A0809d25238h4798p6944D2402Q0163E6355a93845j02434j26802
19149d23081B7390a88107A49436a96766f9758E3326a49121c9390h969l7853k24091
19138b70913f8886b3828C6311L11226c76933a36077M6273r9518a7989G3592a69970
19126E8819a08696A4266a5400F8340b3513Q003j3792A41023i9945j20034k70368
19115d90347a00981A74401i4538r0826c94A7165a01774L4981A45209a39512F0231
19103b75462h7539l00411a11841k90032G4173l3355a35193A29873b49684a167
$$ plain form
19183 -127757 -885 -293286 141081 13511 -276446 82176 61609 -336415 128589 40226 130532
19172 130532 -127055 79823 -235296 87845 10280 -13137 -182267 -60314 -348121 57296 2514
19160 -23078 173946 10809 -425238 -84798 -161742 42402 122565 56355 -193845 -296279 -423081
19149 -423081 27390 -188107 149436 -196766 -69758 53326 -149121 -39390 -8969 -46822 -270913
19138 -270913 -68886 -23828 36311 347537 -376933 -136077 -89804 -189322 -17989 73592 -169970
19126 58819 -108696 14266 -15400 68340 -23513 -15510 -29302 141023 -99945 -219979 -490347
19115 -490347 -100981 174401 -94538 -185364 -394 17165 -101774 -66793 145209 -139512 60231
19103 -275462 -87539 -387950 -111841 -401873 74173 40818 -135193 129873 -249684 -1167
19092B4230b66359a06097M5998l80647A87642F7606L01701C7904c6282m76886
19082e13168B28620b1887E4688R1233a10509q2494N0782k1484N8689A73138q677
19071A64461c5799q0856G5470C7560a84010n8352A00995c72443G1559K2320J38094
19060B31973b62552c7263m00669B87471c31335B9777A4035i0037j71283f7975
19049B31982F1760K11551a07940E5440b55108A44144m9317b05527c6998j56546
19039a93544D7081j9403J35688a36110J5755n450a4176B5817a18521A96082N4314
19028B50396l2672L9100B6089N4259B0475J17610a47217R138g436B7032A0049
19016A34671C8959L6965i0894k44908D0367A5936K08580e3780j38028R0364j12541
$$ plain form
19092 24230 -266359 -106097 -60099 -440746 187642 67606 369307 37904 -36282 -513168
19082 -513168 228620 -21887 54688 145921 -110509 -193003 -142221 -163705 -105016 173138 164461
19071 164461 -35799 -116655 75470 37560 -184010 -242362 100995 -372443 71559 93879 231973
19060 231973 -262552 -37263 -437932 287471 -331335 29777 14035 -90037 -261320 -67975
19049 231982 61760 273311 -107940 55440 -255108 144144 94827 -205527 -36998 -193544
19039 -193544 47081 27678 163366 -136110 -120355 -125805 -14176 25817 -118521 196082 250396
19028 250396 217724 256824 26089 80348 20475 138085 -147217 -138079 -7436 27032 10049
19016 134671 38959 75924 -90894 -335802 40367 15936 224516 -53780 -191808 -101444 -213985
19005b13985h0474k99423A24696m7860O5152g1337c76j2507j85735L0467A19572
18993A18770J18536i6378r8208G1966h0570A48001a33819A71131b9854E2164e0945
18981d2752j67185A2615e6089A97749d7032l4161b4407d339m4673M542j62859
18970b07329a00377d8674k17402Q156c6279A30492a92676r5850A24466o0080c075
18958A36179d1405j11495N8082j89484j36677J71596M7236A45326a23148F9331
18947a1040j5683k51535R4794H9385a02040k86274A11999b52318J11500r639G274
18935b44024B3622a31796N9546k5120d0434l9080q1151B46016e1436q4563B9990
18923a87534D12850H1346H563J44683A6799d36276E4006a39486D6359h0310E03643
$$ plain form
19005 -213985 -80474 -379897 124696 76836 141988 -71337 -376 -12883 -198618 -168151 119572
18993 118770 237306 -96378 -194586 71966 -80570 148001 -133819 171131 -29854 52164 -50945
18981 -42752 -209937 12615 -56089 197749 -47032 -81193 -24407 -4339 -49012 -44470 -207329
18970 -207329 -100377 -48674 -266076 -257920 -36279 130492 -192676 -288526 124466 64386 -3075
18958 136179 -41405 -152900 -94818 -284302 -420979 -249383 -202147 145326 -123148 69331
18947 -11040 -26723 -278258 -183464 89385 -102040 -388314 111999 -252318 -140818 -150457 7274
18935 -244024 23622 -131796 -72250 -97370 -40434 -79514 -160665 246016 -51436 -135999 29990
18923 -187534 412850 81346 8563 153246 16799 -436276 54006 -139486 46359 -80310 503643
18911c8972j68493b4229j39341O3469B63526a03733e615k45322A70207a24152
18900I6400K8069a05485k99578f2041D6582M6773b90368J08934o416B4548a78555
18888c59536C76143A21833a77184c1307P975n5099q3644F5943b51546B34766B3425
18876e0112p4816C4151O9962c82718a09688A57810m0477M3637a41632A09974c2176
18864a6812I4120K6738a91343L7600B89706d42833a28699B45323a90343j9055
18854b09398D614b08555P7537n0989G450Q8169J04281b09806R4895A40548g7217
18842f0342b1322k0159j03269M7688A59775k1638b13950N4068A67554a00211A48214
18830A44559F9412L9384a71580A72053f3395A06396a77455L6482k89754G7819
$$ plain form
18911 -38972 -207465 -24229 -163570 -100101 263526 -103733 -5615 -250937 170207 -124152
18900 96400 124469 -105485 -405063 -62041 46582 93355 -290368 -181434 -187850 24548 -178555
18888 -359536 376143 121833 -177184 -31307 -23332 -78431 -162075 65943 -251546 234766 23425
18876 -50112 -124928 34151 104113 -382718 -109688 157810 117333 160970 -141632 109974 -32176
18864 -16812 94120 120858 -191343 -153743 289706 -442833 -128699 245323 -190343 -209398
18854 -209398 4614 -208555 -131018 -182007 7450 95619 199900 -209806 -114911 140548 -77217
18842 -60342 -21322 -41481 -144750 -97062 159775 138137 -213950 -159882 167554 -100211 148214
18830 144559 69412 108796 -171580 172053 -63395 106396 -177455 -140973 -430727 77819
18819a85230a7034D48866b48622H547J1136i8914A06306N1758R2555g4429A98861
18807E03087N0900D2408a34840F430d6186l27057J17193B0505K43010g5737K804
18796g2933a1548l06597a9326B01708C100h5631B4236J39879b4863B94505G5445
18784G3009c7431l60690g420l18355J47100j6221B01876J53622b36314R7697G9419
18772I010J2555M1234d18794f4769p6153n2413g2552K492m5554m45304A42395
18760a73806l3816m6767O4470j17390J1093J18329Q4593m2788C392b43392a8426
18748b34609a3588j29964g1229j2538k92004a11934A69840a05815L4066A75558
18737h3861p775B88994d6055q8536A23944b36479B60574d66627p5540a78474E9954
$$ plain form
18819 -185230 -17034 448866 -248622 8547 19683 -98914 106306 158064 250619 -74429 198861
18807 503087 553987 42408 -134840 6430 -46186 -373243 -256050 20505 263515 -75737 -72933
18796 -72933 -11548 -318145 -19326 201708 3100 -85631 24236 164115 -24863 294505 75445
18784 73009 -37431 -398121 -7420 -325775 -178675 -194896 201876 355498 -236314 -138617 79419
18772 9010 21565 62799 -418794 -64769 -140922 -193335 -72552 -70060 -115614 -560918 142395
18760 -173806 -207622 -254389 -189919 -307309 -296216 -177887 -93294 -136082 3392 -243392 -18426
18748 -234609 -13588 -143552 -71229 -83767 -375771 -111934 169840 -105815 -71749 175558
18737 -83861 -91636 288994 -46055 -134591 123944 -236479 260574 -466627 -542167 -178474 59954
18725b33922G8098b1716G8852a398B59098j07259a3818H6065Q9246h7907A04065
18713c517j7737I2307h0164k33917e6043a6876A02677a77928c4681G4885J18921
18702A93806b81759f3648j69822D2673a51517a1386G5439A56J34597o5679K4758
18691I3832c557j54452A43496a48945a3022n7884r7826d2554k7881n510B309N2278
18679E4587a60932G5608L10520b58096h9587l1912J5512A833J5897e2443l3656
18668h6099r619A28925A0927M69776I0408P084g3800j9416J8728B39251E7630
18656a07381A1961N0512K2992b51732R7702B1817a0127A30762k7844f9732j96391
18645b66123d8552a5932j76195N2216f5299o392a680q03k88161P5697A10905a21257
$$ plain form
18725 -233922 78098 -21716 78852 -1398 259098 151839 -13818 86065 175311 -87907 104065
18713 -3517 -21254 92307 -80164 -314081 -56043 -16876 102677 -177928 -34681 74885 193806
18702 193806 -281759 -63648 -233470 42673 -151517 -11386 75439 156 134753 69074 93832
18691 93832 -3557 -158009 143496 -148945 -13022 -70906 -168732 -42554 -70435 -75945 2309 54587
18679 54587 -160932 75608 386128 -258096 -89587 -121499 -105987 1833 17730 -52443 -86099
18668 -86099 -95718 128925 10927 480703 90408 97492 -73800 -93216 -74488 239251 57630
18656 -107381 11961 62473 85465 -251732 -154030 21817 -10127 130762 102918 -69732 -266123
18645 -266123 -48552 -15932 -192127 -139911 -65299 -71691 -1680 -2483 -290644 -214947 110905 -121257
18632a20555m7416B97658j08133r1418b4476B99718c20752i8255Q379j09615A10882
18620b0065A63981E2619N9422G454g5034c1307B88701i7514k7922j1691M4117
18609i3010A55548F0988K9522f6803A44851a73551A14655k3436P8775c40876J11594
18598b29282A93283a45038A27593j6917c2192l93249d6159h521l52925a11730
18587B95908K0677d7674k2271m1309j60131C1055c08592h0894b0929A26487c20282
18575a27252o1892A06481h6607q5672m9786b7595O94A90456R6289M0139D6436
18563A66536a83388J1492d3183j63102C54873a34841J7135l3083A39168g7332
18552b88809a28787A73769G7832A630a47982F663c4447n6714G1231g7933k50670
$$ plain form
18632 -120555 -167971 297658 189525 98107 -24476 299718 -320752 -98255 -89876 -199491 110882
18620 -20065 163981 52619 112041 7454 -75034 -31307 288701 -97514 -125436 -137127 -93010
18609 -93010 155548 60988 90510 -66803 144851 -173551 114655 91219 169994 -340876 -229282
18598 -229282 193283 -145038 127593 110676 -32192 -425441 -46159 -8521 -361446 -111730
18587 295908 316585 -47674 -69945 -111254 -271385 31055 -308592 -80894 -20929 126487 -320282
18575 -127252 -189144 106481 -86607 -172279 -222065 -27595 -26901 190456 286745 326884 46436
18563 166536 -183388 -171896 -43183 -206285 354873 -134841 -117706 -150789 139168 -77332
18552 -288809 -128787 173769 77832 1630 -147982 6663 -34447 -91161 71231 -77933 -328603
18541c28603c4994k00626A82411b83618A46653b07342B72914a04704l21167J15000
18531c10871a8005A27322l4039J62016q4983o4466d0348A85297a26042A6631a06674
18519C598a29629A52793f1950K115q3107k10872A75174b6143j60061k46704d1270
18507b14466e7676A32980J71588j18259a96709B49528A6918J32484c2751C65336
18496G9608i237k85697a16248A57831J19520a96432A17188a96281C6869b50718
18485c03654p2485i6628j16129A07788d20857E7201P7651J35000a39093C60513
18474D412a96295A66524a0910j29812B95324b63480Q9138A26023c33303c7893
18463g6903c3443j41382A06878P1485c57570J58749F5277a00701A40241a56477
$$ plain form
18541 -328603 -34994 -235620 182411 -283618 146653 -207342 272914 -104704 -425871 -310871
18531 -310871 -18005 127322 93283 255299 170316 105850 -40348 185297 -126042 16631 -106674
18519 3598 -129629 152793 -61950 -59835 -142942 -353814 175174 -26143 -186204 -432908 -41270
18507 -214466 -57676 132980 304568 186309 -196709 249528 16918 149402 -32751 365336
18496 79608 -9237 -294934 -116248 157831 277351 -196432 117188 -196281 36869 -250718
18485 -303654 -376139 -96628 -212757 107788 -420857 57201 134852 269852 -139093 360513
18474 4412 -196295 166524 -10910 -140722 295324 -263480 -174342 126023 -333303 -37893
18463 -76903 -33443 -174825 106878 178363 -357570 -198821 65277 -100701 140241 -156477
18452f8948k7163A29754b4983D6484A0851c79698C6399a79063c1751j15734G3707
18440a0321j63876D81089a25194K9241D51771I9864K0594a29552B29934b41194
18429i9034j72354a33761n4725Q4959j54064i230k5563J4414C50701i3934B3480
18417G0430c10199f4730l09060g1373G1282b43780g3417b2393j66589B34776F9221
18405d2994A19436L0719a41609N8210A42056J86591j64225e0381d878j61762J8152
18394a48488H2559K86528A62159A0915b52265h2268q2148k8081E5769b9279l64083
18383c93362g4683B08451i6943a737k75550a03999l9264B512Q3289J12197c16101
18371a25202f553A46436a5267m03856B60277b9555B02610D8926N5495J14782M3728
$$ plain form
18452 -68948 -96111 129754 -24983 46484 10851 -379698 36399 -179063 -31751 -147485 73707
18440 -10321 -174197 481089 -125194 -95953 451771 99864 120458 -129552 229934 -241194
18429 -99034 -271388 -133761 -188486 -103527 -257591 -9230 -34793 -20379 350701 -93934 23480
18417 70430 -310199 -64730 -373790 -71373 71282 -243780 -73417 -22393 -188982 234776 69221
18405 -42994 119436 150155 -141609 -83399 142056 328647 164422 -50381 -4878 -166640 -148488
18394 -148488 82559 369087 162159 10915 -252265 -82268 -164416 -192497 55769 -29279 -393362
18383 -393362 -74683 208451 -96943 -1737 -277287 -103999 -143263 2512 85801 197998 -316101
18371 -125202 -6553 146436 -15267 -419123 260277 -29555 202610 48926 104421 219203 262931
18360B62931b06948L0041N9387n1195K6613n4589B93154l7032o1986i9461A2005
18348A1022c09840j41798A78519d2030k00506A17419f6424B8746c89564A69552
18337i8099m7179A21548K20344c2260A63554Q4552C8975a08800j56942p0631A11610
18325c15898A44647J54409a15902d3566r8853H4268a2042B62930b08238o7501
18315b75739F7831b64030h7910a4896A26475a61398A61683b12382O8863n1730
18305a95249e0209l64914d5020a6608D79445k07200A19456d27077b00038d0207
18294a2642D745f0733j18838A21576b92125A33999a60126B64751c59086i1250
18283i7818b4741j77000I864K4923J6369c9109j07956j14694J10854A34102b86271
$$ plain form
18360 262931 -206948 -176907 -117520 -168715 -142102 -196691 293154 256122 194136 -99461 12005
18348 11022 -309840 -451638 178519 -42030 -242536 117419 -66424 28746 -389564 169552
18337 -98099 -145278 121548 341892 -32260 163554 248106 38975 -108800 -265742 -336373 111610
18325 -315898 144647 299056 -115902 -43566 -142419 84268 -12042 262930 -208238 -275739
18315 -275739 67831 -264030 -87910 -14896 126475 -161398 161683 -212382 -143519 -195249
18305 -195249 -50209 -415123 -45020 -16608 479445 272245 119456 -427077 -200038 -40207
18294 -12642 4745 -60733 -179571 121576 -292125 133999 -160126 264751 -359086 -91250
18283 -97818 -24741 -201741 9864 34787 51156 -39109 -147065 -261759 -150905 134102 -286271
18271A70850D3927d08109A71194d79496a48082d1756D6058a4558j24023M849a5722
18259b14455K6452m7273F4924b62986A39074j2340P9213a01134D8886J7030j3871
18248E2045b63571a09517C38635c32446a30661j07275j27663A41216b12844N4286
18238a58558o3811O287J6568A21902b9994B2064J21640F1559a35093N2233b2999
18226a9015q1209K2390j49152h5428r5681P214E8555b09766L8268E4224O921K1962
18214H3107c92376B7910a95660a7256q3187A4280P1174P7383B6078d8820l1209
18203h0029p8664B79340l9133A10012b0034F7828i685p8464B56006a16257p1847
18192a88104M2310M7488m6131d7624l56478d1747a8038k0343r0736A35044e8926
$$ plain form
18271 170850 43927 -408109 171194 -479496 -148082 -41756 46058 -14558 -138581 -133732 -15722
18259 -214455 -188003 -235276 64924 -262986 139074 126734 205947 -101134 48886 65916 52045
18248 52045 -263571 -109517 338635 -332446 -130661 -237936 -365599 141216 -212844 -158558
18238 -158558 -222369 -216082 -199514 121902 -29994 22064 143704 61559 -135093 -82860 -22999
18226 -19015 -100224 -77834 -226986 -85428 -181109 -173895 58555 -209766 -171498 54224 61145 83107
18214 83107 -392376 27910 -195660 -17256 -100443 14280 85454 162837 26078 -48820 -80029
18203 -80029 -158693 279340 240207 110012 -20034 67828 -9685 -88149 256006 -116257 -188104
18192 -188104 -145794 -98306 -144437 -47624 -404102 -41747 -18038 -38381 -129117 135044 -58926
18180F6774J26751J1288a20640H0167b15571N9738C23076b98280B1001i0411j3939
18169a04350l3367A03346l5979R8173n8827a91482B84268c86462R7579d3978A56610
18157a20105j25418O6773C71810a78420n8857B21914a98163M9507B509K3321b5230
18145A54575G903J20444a25315O804A56316J30187E4790D066K67862b35979D9543
18133i5683b8887j37521K1664e7405a9971r9016A40897C0550R2949J94073a22145
18121a50071I2841J33395A6973O7222j5176b50001J07686B4168N896a58240j86755
18110c44995J34210E4674a79634H7174a65512G8655b74715A3305b6445j27671
18100a54116f6985J3531j55257M275l0777O3458l11262a90029r5514f2369j25866
$$ plain form
18180 66774 193525 204813 -120640 80167 -215571 -155833 323076 -298280 21001 -90411 -104350
18169 -104350 -137717 103346 67367 165540 106713 -191482 284268 -386462 -288883 -43978 156610
18157 -120105 -245523 -178750 371810 -178420 -237277 221914 -198163 -148656 2509 25830 -25230
18145 154575 7903 128347 -125315 -118511 156316 286503 54790 4066 271928 -235979 49543
18133 -95683 -28887 -166408 -144744 -57405 -19971 -118987 140897 30550 123499 317572 -122145
18121 -150071 92841 226236 16973 84195 69019 -250001 -142315 24168 30064 -158240 -344995
18110 -344995 -210785 54674 -179634 87174 -165512 78655 -274715 13305 -26445 -154116
18100 -154116 -66985 -53454 -208711 -204436 -235213 -171755 -483017 -190029 -285543 -62369 -188235
18089a88235d3544j23758b3496C6990a23273E5588a73494f5051A51739B3924a47003
18077C08831N4072b74209B01183H4939J00841a73166f396G981c21676G2829a75065
18065c267n8998B4188K28810a47568l3419k24821E8978a57550B75888a2692C6062
18053A33957b80877E322J31007a68914o3254A71220q606J18810B3306g1467b9242
18041F3199b752n22340B26885D9816a73754A87094f3717j97431A9067h4024m2636
18030a26660F4247c6928j04467H8395B4040J83843H3204h4427A25347a06657L2383
18019g4274b117I352g0659A85462g4733B49184A06502e80460a5794q1959j73335
18008b71088B62645b4862B09628d70255A37212a18325b7353j53240j50423A81689
$$ plain form
18089 -188235 -43544 -167302 -23496 36990 -123273 55588 -173494 -65051 151739 23924 -147003
18077 308831 362903 -274209 201183 84939 185780 -173166 -6396 7981 -321676 72829 -175065
18065 -3267 -62265 24188 252998 -147568 -180987 -405808 58978 -157550 275888 -12692 36062
18053 133957 -280877 5322 136329 -168914 -232168 171220 162614 281424 23306 -71467 -29242
18041 63199 -2752 -525092 226885 49816 -173754 187094 -63717 -261148 19067 -84024 -126660
18030 -126660 64247 -36928 -141395 88395 24040 207883 83204 -84427 125347 -106657 -74274
18019 -74274 -2117 9352 -70659 185462 -74733 249184 106502 -580460 -15794 -97753 -271088
18008 -271088 262645 -24862 209628 -470255 137212 -118325 -27353 -180593 -331016 181689
17997A14899f797A27648a75398B44229k8427f7678F1818B5656J28162n3870f3452
17985b90573B12351a90126L5033M0402p0634F8614K40927e1844o1516L9838A07126
17973A59136c5868q481r5318B4128L2506a20388A37958a38493m4602A18012h1051
17961b256k06356f6657B07794b99513l3124c8397B05759E3053c57425E3426K26799
17950B80225j29028J5805n2938k3001l2990a40692p5944E9265Q057K07834A28158
17938F8235J1831f7572A00908c14117A43732G0254M0805a33615l8725a1061C8861
17926c20495g0442B33197a62169C1982K85051A21833J77534a28096G0460a17307
17915b04157B5653J00250n9984j8767O6084A1798b50595i5919o6930k23803e3760
$$ plain form
17997 114899 -6797 127648 -175398 244229 215802 -67678 61818 25656 153818 99948 -63452
17985 -290573 212351 -190126 -155093 -114691 -185325 68614 309541 -51844 -113360 -73522 107126
17973 159136 -35868 -44349 -139667 24128 56634 -120388 137958 -138493 -183095 118012 -81051
17961 -2256 -208612 -66657 207794 -299513 -332637 -38397 205759 53053 -357425 53426 280225
17950 280225 151197 167002 114064 91063 58073 -140692 -216636 59265 67322 275156 128158
17938 68235 80066 -67572 100908 -314117 143732 70254 111059 -133615 -172340 -11061 38861
17926 -320495 -70442 233197 -162169 31982 317033 121833 299367 -128096 70460 -117307
17915 -204157 25653 125903 65919 47152 113236 11798 -250595 -95919 -162849 -386652 -53760
17903H9323O0165l6094N2403k5516A1731R7841J41488j09880f39426e7081B8896
17891A2812b98246c6638o124e208E9292P8334a58125h857j34707K1603B33870
17879C9554b10218C73199A54210a37918e5330A30796a8590o3919G5036J41831
17869B16867n0991h7990B26271i9830l28881B82885j21366a53892j71724H7258
17858A13450f9154C1290d05761A56194b55052d2752k97358C48624E7245J32795
17848A90040l2620e9598C4259c36848E086a74089F5286N4027h3422A64662a68662
17836A88460c18461A6463J01827M2780h3781j44897j9253J06992j80708A9944
17825b21378A65535h6580m5293q733j94024I8065f1083k45251h6635D1259b2622
$$ plain form
17903 89323 149488 113394 165797 140281 11731 109572 251060 141180 -639426 -57081 28896
17891 12812 -298246 -36638 -42762 -5208 59292 137626 -158125 -8857 -143564 -121961 233870
17879 39554 -210218 373199 154210 -137918 -55330 130796 -18590 -82509 75036 216867
17869 216867 165876 -87990 226271 -99830 -428711 282885 161519 -153892 -325616 87258
17858 113450 -69154 31290 -405761 156194 -255052 -42752 -340110 348624 57245 190040
17848 190040 157420 -59598 34259 -336848 5086 -174089 65286 119313 -83422 164662 -168662
17836 188460 -318461 16463 118290 161070 -83781 -228678 -247931 -140939 -321647 19944
17825 -221378 165535 -86580 -131873 -140606 -334630 98065 -61083 -306334 -86635 41259 -22622
17813i3022l8029A67122c32760a11230n6802b4016G3922B7918a64276B16202A03051
17801A10535a40142B65964a85B2377J75431h6518A06578a91309A80101a30644
17790b26359c2044j4606J205q687B72497c95223a76751I4581K0258A8417J9583
17779C8000J3845b1202B86057c5795r0625c9658o5841A10505I633g0405A78878
17767E8689j0687a19378a6278j12138A06010j5663a7078n7747a5920A63995G3538
17755a86557A74452g7028k64976D35295c1551k46341J28615l0498E3397A5655
17744a90986C09492a63168B69700a56963c5338B60872C1132L78360j75743p4423
17734A59326b13397E7987e2373A62709k5255c2826B1913J37460K8088b26139A38024
$$ plain form
17813 -93022 -131051 167122 -332760 -111230 -168032 -24016 73922 27918 -164276 216202 103051
17801 110535 -140142 265964 -185 22377 197808 -86518 106578 -191309 180101 -130644
17790 -226359 -32044 -46650 -45445 -54132 272497 -395223 -176751 94581 114839 18417 38000
17779 38000 51845 -21202 286057 -35795 -126420 -39658 -105499 110505 9633 -70405 178878
17767 58689 48002 -119378 -16278 -128416 106010 90347 -17078 -74825 -15920 163995 73538
17755 -186557 174452 -77028 -342004 435295 -31551 -277892 -149277 -179775 53397 15655
17744 -190986 309492 -163168 269700 -156963 -35338 260872 31132 409492 233749 159326
17734 159326 -213397 57987 -52373 162709 137454 -32826 21913 159373 187461 -226139 138024
17722f1101B10327J60476b0613C05936C7848J27411C2035m247b05359k40329a12794
17710a0662k08470C17546m9705g0363A31916b9355B44344p2784a60865P3038C99657
17698a50788k7150e9645A56108D9236d5320D2515J3557a1183A33353o5835d226
17686A31984a40598c2216A10400a69255B47995G1050a1354B901d7417E4719i4556
17674i5877F2131j1947K47901a30284K1588k71740a22673G8941b66253d0722A65839
17662b0293A97153J4215C7313M6715a12921B55727A0025K21043b27123B21389
17651a4421B05022i0620K5758C20267E2701R8341g6111A58129P9499F1003J29645
17640A90648M8298a35585a3232D4031L27475o0111d4921k35577A87813d9877A01164
$$ plain form
17722 -61101 210327 370803 -20613 305936 37848 165259 32035 27788 -205359 -445688 -112794
17710 -10662 -219132 317546 267841 -70363 131916 -29355 244344 171560 -160865 -87827 399657
17698 -150788 -177938 -59645 156108 49236 -45320 42515 56072 -11183 133353 67518 -4226
17686 131984 -140598 -32216 110400 -169255 247995 71050 -11354 2901 -47417 54719 -94556
17674 -95877 62131 50184 298085 -130284 -108696 -380436 -122673 78941 -266253 -40722 165839
17662 -20293 197153 211368 37313 84028 -112921 255727 10025 231068 -227123 221389
17651 -14421 205022 -90620 -64862 320267 52701 151042 -76111 158129 237628 61003 190648
17640 190648 238946 -135585 -13232 44031 371506 311395 -44921 -280498 187813 -49877 101164
17628b42172A96844b7521E1451c31310B5324J95265b15111a05606B49809B9674
17617D1691J40649c2111G30M31282c3858m9586C73832E6390f5176B4626P7378
17606A02004d03250J44693C99495A18757J78753B187a1700B90267j42111M0746
17596A88902a1321j74382G943K01723a57614A77453G6948b29923B52215b46991
17585b31744A00882K2002f0187l9522j13914C7159a24983I690K59822a82079b4209
17573a0963B51695L852J09128B8193J98782D0994K33101h3156A09031k6883h5919
17561h2415K8597E2446B1652L4354a73018H976K41029c5910k3589k02885P3256
17550a89128F7147q826J51695i6611k8977o9221N6570c3879a0242C69997A23654
$$ plain form
17628 -242172 196844 -27521 51451 -331310 25324 220589 -215111 -105606 249809 29674
17617 41691 182340 -32111 730 432012 -33858 -83444 373832 56390 -65176 24626 102004
17606 102004 -403250 -258557 399495 118757 297510 2187 -11700 290267 148156 188902
17596 188902 -11321 -185703 7943 209666 -157614 177453 76948 -229923 252215 -246991
17585 -231744 100882 122884 -60187 -99709 -213623 37159 -124983 9690 269512 -182079 -24209
17573 -10963 251695 255547 364675 28193 226975 40994 274095 -83156 109031 82148 -85919
17561 -82415 -53818 52446 21652 56006 -173018 8976 250005 -35910 -59499 -262384 -189128
17550 -189128 67147 58321 210016 -96611 -125588 -194809 -138239 -33879 -10242 369997 123654
17538c02078H7656O3001A7328a38778B12284b71499A9173Q2632J46561a13968
17527D00241m6238a930C79581a44539A49929L50474A42955b37738i8889G3051
17516I2415b75635B38931a13201e59A46234m7469B4930Q6093Q6620g7512A36260
17504b4498N416F8577a11987b8687F2297B7725r987J65496a51653A56893E4271
17492D23985A30780k4397J74702e8915A71425P953Q3894A06004m8882N4688O4151
17481A75961l844R0165a19907K2292M4503j73318C98194A80024l4384p1344Q8021
17470A62317b52284D19889j94548C1832A1285L86015j90536J71139H8757L03254
17460C92011A1756L6464J8917L04659H7590M13530j51224o0079i1040A21712J75699
$$ plain form
17538 -302078 87656 150657 17328 -138778 212284 -271499 19173 101805 248366 -113968
17527 400241 354003 -1930 379581 -144539 149929 500403 142955 -237738 -98889 73051
17516 92415 -275635 238931 -113201 -559 146234 98765 24930 111023 197643 -77512 136260
17504 -24498 -19082 68577 -111987 -28687 62297 27725 17738 183234 -151653 156893 54271
17492 423985 130780 106383 281085 -58915 171425 179378 263272 106004 57122 111810 175961
17481 175961 172117 262282 -119907 -97615 -53112 -226430 398194 180024 145640 74296 162317
17470 162317 -252284 419889 225341 31832 11285 397300 206764 377903 88757 392011
17460 392011 11756 48220 67137 371796 87590 501120 349896 289817 -91040 121712 297411
17449B97411i4466B67995K9953b2899D79882A03912J8566L44618B31192K47441
17439D78633Q783A88486b9799H1305a4806A75299L1857K40360J3767E0747p074
17428D3673K17278I7239m3625J27569F3524J85441K293j01421P321o1627k1371
17417G4160a0839B82097M37038A74874b0010B03314B8001J65789K2361e6463n5236
17406a11699C7509O7593J74095p4756q6037a72671D5444g9633j92984C07978a2630
17394I1846b61894d1328A02651L0405K17636A26455K48163J07306A49600j5493
17384A34107J24557l0697a84509j04268B76091p4394R653l1133a42070C9954a759
17372A38132M1463K04079b5120F95668B97526c7954A63171G0440J88038A9565
$$ plain form
17449 297411 -94466 267995 297948 -22899 479882 103912 122478 467096 231192 478633
17439 478633 487416 188486 -29799 81305 -14806 175299 207156 447516 461283 50747 43673
17428 43673 260951 97239 53614 181183 63524 248965 251258 149837 157158 95531 74160
17417 74160 -10839 282097 719135 174874 -20010 203314 28001 193790 216151 -56463 -111699
17406 -111699 37509 105102 279197 204441 118404 -172671 45444 -79633 -272617 307978 -12630
17394 91846 -261894 -41328 102651 133056 350692 126455 374618 481924 149600 134107
17384 134107 258664 227967 -184509 -288777 276091 201697 211350 180217 -142070 39954 -1759
17372 138132 179595 383674 -25120 695668 297526 -37954 163171 70440 258478 19565
17361A94833J16210j35938L9986F4350L77018A28777P5722Q9859A39233J1678
17351A50911a07742k409A82672K0857j5486a52167e3885A04582O3041l8675A4439
17339a71278L3253P890C4477J33233m5970J87651E0893k2449L6694K57971J16954
17328D40063j74329a2589B81283j18513C6902o095N10488A25776J77028a77488
17317f1612A46201O7670p502n8995N2212o7979D3163e0214B94800F7626J4259
17306H1885K92224r463F0232b94705B68824J04546d4557j03244C78457A70771
17295B77809C0998K75128l4548d3330A55378M49294j34262A05316B7691M15585
17285D43276A18435d4020A84533j7261a9359C15643J1442c8984C67331a71735
$$ plain form
17361 194833 311043 175105 215091 64350 441368 128777 204499 294358 139233 150911
17351 150911 -107742 -110151 182672 203529 188043 -152167 -53885 104582 167623 128948 14439
17339 -171278 -138025 -130135 34477 167710 121740 309391 50893 28444 65138 323109 440063
17328 440063 265734 -12589 281283 162770 36902 30807 541295 125776 302804 -177488
17317 -61612 146201 213871 206369 147374 199586 131607 43163 -50214 294800 67626 81885
17306 81885 374109 364646 60232 -294705 268824 373370 -44557 -147801 378457 170771
17295 277809 30998 306126 271578 -43330 155378 604672 470410 105316 27691 443276
17285 443276 118435 -44020 184533 167272 -19359 315643 327085 -38984 367331 -171735
17274a61015C39585A39302o7295h2882B47455J10432I7225K85171B3931J83333
17264B07264Q6628k8796F0440K39147d4031A47335P2809K1307J10615m7014J8989
17253C24041A07379M1856J96378j3277a06666F02684A74580J49271n2120H7935
17242A31800l2654J11800j3597o5222J82884I4744a2273B36641j108d50D61166
17230A34510Q9169P9602B9779K23050R5354H2358J88204G8748j4248a65986A63696
17218E20397B57554J48036b0714C22512A61035m2380L28307A26269f8884E91142
17207E19266A88009q4456R0805F6279J90609k8851j3839K56946k27795L10892
17197E54241i793F6403R0306R6476L33486k89725l5650J0424K19932B0112L79211
$$ plain form
17274 -161015 339585 139302 72007 -82882 247455 357887 97225 382396 23931 207264
17264 207264 293892 265096 60440 299587 -44031 147335 220144 241451 352066 305052 324041
17253 324041 107379 149235 345613 332336 -106666 602684 174580 323851 271731 87935
17242 131800 99146 210946 197349 132127 315011 94744 -12273 236641 235533 -450 461166
17230 134510 223679 303281 29779 252829 348183 82358 270562 78748 64500 -165986 163696
17218 520397 257554 405590 -20714 322512 161035 118655 446962 126269 -68884 591142
17207 519266 188009 103553 194358 66279 256888 228037 214198 471144 243349 554241
17197 554241 -9793 66403 156709 253185 586671 296946 261296 271720 491652 20112 399323
17186C99323A00746J86874j07541P5521G4123O0580K71917J80071k49195n6203
17176B81293I0355J49481A10301P3687L4945L60419q818B74455r1751e867C68077
17164E25609j482A84548k3313Q6995C7650K09275J6373G6968L05273G9942J94298
17153B74240F0713L55433a17071F951J0389M3263J20307J56336o8766j26109P1117
17142B13488F7662L45769j97830J01593A33364O3328j7142G8515J42550K88815
17132E09880A88423a17141B23004q8183k9698P2692K66784j64184K50559B57723
17121E52007j41474J07970j60375j53987J40504K33998k00015N1821r2073H1760
17110C88639A05711L28440f018D95831A11772J84705K25246A30385L66690J22127
$$ plain form
17186 399323 100746 287620 180079 255600 74123 134703 406620 586691 337496 281293
17176 281293 90355 239836 110301 183988 218933 579352 570534 274455 182704 -5867 368077
17164 525609 524127 184548 161235 248230 37650 246925 263298 76968 382241 79942 274240
17153 274240 60713 416146 -117071 6951 17340 60603 180910 337246 268480 142371 213488
17142 213488 67662 413431 215601 317194 133364 196692 179550 78515 221065 509880
17132 509880 188423 -117141 223004 134821 105123 177815 444599 280415 530974 257723
17121 552007 410533 518503 358128 204141 344645 578643 378628 430449 338376 81760
17110 388639 105711 434151 -6018 495831 111772 296477 521723 130385 497075 619202
17100F19202a57374B89616K58222m2888j84716E2538O71332k06033k55052K22892
17090D85677j53871L2630K68933A00811J88067I262M81833K91206k78256j79335
17080C24710j49526J49992m3333K63148j99451m302L31822C22171K85646k2641
17070E85176n8077A97669R9452A26378L65269L9477O384n5238J90208O2345C25934
17058D25606Q9161n8361k27869L25329k45149K68416M9258J04487l27015K10356
17048F14219B30768L97564J00870A78098N61711j84954L0941k60363L59106j46756
17038E37783q1912M044J21805J14748k41806n856L61652k42351M5260L3639m7944
17027E99062Q924j855j83466L53233o7189C24148O6377M26063p7710L71741C52788
$$ plain form
17100 619202 -157374 289616 547838 504950 320234 52538 723870 517837 262785 485677
17090 485677 331806 364436 633369 100811 288878 9262 491095 782301 504045 324710
17080 324710 175184 325176 281843 544991 345540 341238 673060 322171 607817 585176
17070 585176 527099 197669 297121 126378 491647 531124 537508 482270 672478 734823 325934
17058 425606 514767 456406 228537 553866 308717 577133 626391 730878 403863 614219
17048 614219 230768 628332 729202 178098 739809 554855 585796 325433 684539 537783
17038 537783 455871 459915 581720 696468 454662 448806 810458 568107 613367 647006 599062
17027 599062 607986 606131 422665 775898 708709 324148 390525 816588 738878 1110619 352788
17015I84224m60245L69200l29431o2135M0442J31224J404k65194M78371J17446
17005A005306l29961O1239n8274K31947j29353K6517k35652K31409k81348l2562
16995D89268P6864K83589C84625O06593j42551l35006J50138M50727m05128j57651
16985E51747J89587M74338m5062p4192l99949K0661K08370P1830L21360n58029
16975G60661o6508k9181J83104K91672k22391J54449r3249k25683K11350q2860
16965H81364K3003K77220k40258j26178K34429n9386K5737k57300K49608L91550
16955A399789m55721K22737k83652J77719M0359j40337K26222j18716m0116M01052
16945A429336o77651N15123K2653n1555j52794m4718J49402j77551j2124O7720
$$ plain form
17015 984224 523979 893179 563748 501613 542055 673279 674683 409489 887860 1005306
17005 1005306 675345 736584 678310 910257 780904 807421 571769 803178 521830 489268
16995 489268 566132 849721 384625 991218 848667 513661 663799 1114526 709398 551747
16985 551747 741334 1215672 1170610 1096418 696469 717130 925500 997330 1318690 760661
16975 760661 694153 664972 848076 1139748 917357 1071806 978557 752874 964224 881364
16965 881364 904367 1181587 941329 815151 1049580 990194 1015931 758631 1008239 1399789
16955 1399789 944068 1166805 883153 1060872 1101231 960894 1187116 1068400 1028284 1429336
16945 1429336 751685 1266808 1289461 1237906 1085112 1040394 1189796 1012245 1000121 1067841
16935A067841R4155j23258J18670M01131n3460l56379o4912K63785j14874j08909
16925A123790M78851N0827J66120n54775K02520k46052L77660M556k55358p2647
16915A275492l46810N22625j22138N48449n21104K32028o1260M09380m4400m5766
16905A846496l95435j8168K2748L47104k88884K23820K74746k42272R1179l1604
16895A829730l4645n0166m3737k7865K44065L3797n0077Q5610j29561K1444J61888
16884B040483l06129O0462L30269m17517O20480r6278J2889j5948o5473J53451
16874B316689j45643L00023l6264R9152j51634N78862m34835K61203l20177K44372
16864B711748k11566J25182j94691K81867P2269P3563M6676j8985K96747k12019
$$ plain form
16935 1067841 1161996 1038738 1157408 1558539 1505079 1148700 1083788 1347573 1232699 1123790
16925 1123790 1602641 1653468 1819588 1264813 1467333 1221281 1598941 1603497 1348139 1275492
16915 1275492 928682 1451307 1329169 1877618 1356514 1588542 1527282 1936662 1892262 1846496
16905 1846496 1451061 1432893 1455641 1802745 1513861 1737681 2012427 1770155 1861334 1829730
16895 1829730 1795085 1744919 1701182 1673317 1917382 1951179 1901102 1986712 1857151 1878595 2040483
16884 2040483 1734354 1794816 2125085 1707568 2328048 2231770 2244659 2228711 2163238 2316689
16874 2316689 2171046 2471069 2434805 2533957 2382323 2961185 2526350 2787553 2467376 2711748
16864 2711748 2500182 2625364 2430673 2712540 2784809 2858372 2905048 2886063 3182810 2970791
16854B970791m2176K19659k88956K644L58580J40822k09697K73828j53618M10147
16844C682024J12975l69107J49535M8516q31l50581O35942J20496j88640N70079
16834D410408j21955J793k22787J60874J04746Q7202p8881J66652K33145k44369
16824D496828J84558K06556K93829k41991N56385j39085J36749o2091K03692L36763
16814E972193J08066j93074L66999j79103L72890J56695q970J13566K36542J93828
16804G139632q2106J72137L13084K41305K29684j93579M55793J51085J09752J25746
16794H662533L91231j79178Q11340l605J40831M53663j21770M07004M28077P97376
16784A1787502k45270P10181Q1400O54024L58665J99323M41486L12305M68994
$$ plain form
16854 2970791 2928615 3148274 2859318 2861962 3220542 3361364 3151667 3425495 3271877 3682024
16844 3682024 3794999 3425892 3575427 3623943 3623112 3272531 3908473 4028969 3840329 4410408
16834 4410408 4288453 4290246 4067459 4228333 4333079 4420281 4341400 4508052 4741197 4496828
16824 4496828 4681386 4887942 5181771 4939780 5496165 5357080 5493829 5431738 5635430 5972193
16814 5972193 6080259 5887185 6254184 6075081 6447971 6604666 6595696 6709262 6945804 7139632
16804 7139632 7057526 7229663 7542747 7784052 8013736 7820157 8275950 8427035 8536787 8662533
16794 8662533 9053764 8874586 9685926 9682321 9823152 10276815 10155045 10562049 10990126 11787502
16784 11787502 11542232 12252413 12333813 12987837 13346502 13545825 13987311 14299616 14768610
16775A4768610N24754L97283P22106L28747P10923M01707Q70790R14975Q4829
16766A9724724R97023Q51221Q86836L79553O84718J176523R98816J072717J045964
16757B7818095J320188R31048J555961R09458J781672J574162J845713J475847
16749C9212144J683551K476394J761079K236375K374274K702929K564536K920733
16741E7932015L065613L571266L457437L986363M257692M101306M431313N006340
16733H9809345N461229N321376N712325O134103N936352O165145O706300O648929
16725A37895104O375322O338432N785246N778073M856905M186522L399834K212286
16717A76827724J440547J46711o21524j832941l197350l690024m854349n100750
$$ plain form
16775 14768610 15293364 15690647 16412753 16741500 17452423 17854130 18724920 19639895 19724724
16766 19724724 20721747 21572968 22459804 22839357 23524075 24700598 25699414 26772131 27818095
16757 27818095 29138283 30069331 31625292 32534750 34316422 35890584 37736297 39212144
16749 39212144 40895695 43372089 45133168 47369543 49743817 52446746 55011282 57932015
16741 57932015 60997628 64568894 68026331 72012694 76270386 80371692 84803005 89809345
16733 89809345 95270574 100591950 106304275 112438378 118374730 124539875 131246175 137895104
16725 137895104 144270426 150608858 156394104 162172177 167029082 171215604 174615438 176827724
16717 176827724 178268271 178414982 177793458 175960517 172763167 169073143 164218794 159118044
16709A59118044n969948o129082o575567o629197o764481o472632o288633o396996
16701A07891508n727174n694591n852728m668788n225166m115282m550908l943255
16693F8113616l864893l181409l491950k697475l198053k807147k405018k326898
16685D4140773j988663k059918j906186j689495j700047j928067j096500j815423
16677B9956474j172733r02630j599481p88572r72645j232825j123278m77419q82892
16668B0803999j028649k57083r09271n59713r22298p22935k35019m94724q05528
16659A4868779m69365m41005k58442p23966L19739p75547m74667j57483n79861
16650A1308182n7274o68538o0819j58361q40129N3234j9332o57445j28584j14167
$$ plain form
16709 159118044 153148096 147019014 140443447 133814250 127049769 120577137 114288504 107891508
16701 107891508 102164334 96469743 90617015 85948227 80723061 76607779 72056871 68113616
16693 68113616 64248723 61067314 57575364 54877889 51679836 48872689 46467671 44140773
16685 44140773 42152110 40092192 38186006 36496511 34796464 32868397 31771897 29956474
16677 29956474 28783741 27881111 26281630 25493058 24520413 23287588 22164310 21686891 20803999
16668 20803999 19775350 19518267 18608996 18049283 17126985 16404050 16169031 15674307 14868779
16659 14868779 14399414 13958409 13699967 12976001 13295740 12520193 12045526 11888043 11308182
16650 11308182 11250908 10582370 10521551 10363190 9523061 9576295 9556963 8899518 8770934 8656767
16640H656767n52758J34940l01930j25892j08814j72285P7082k60847o43425p9231
16630F623607l1875J17934j78719m66649k79397K64861l29323r8362n2966j20666
16620E448445k71292o5859j97788J85798Q2220l09717j45215l329k42108m07948
16610D073207N69237k92119l16529j85190R4093k73842J67170j00293R8494j96486
16600C637742J12507q0326k80446j72954N902j9632j00933J90018j50307k69770
16590B871801p2660p8235M02701j94882j27151k16309J93865J60830n90533m9884
16580B299543K4669M24877o99568K11970K09207l34922N73554m36978j25463L73412
16570B520301K30018o89281Q7596j7261K7175j43958j61971l395J84047Q6553
$$ plain form
16640 8656767 8104009 8238949 7937019 7811127 7702313 7530028 7607110 7346263 6702838 6623607
16630 6623607 6591732 6709666 6530947 6064298 5784901 6049762 5720439 5622077 5569111 5448445
16620 5448445 5177153 5111294 4913506 5099304 5181524 4871807 4726592 4723263 4481155 4073207
16610 4073207 4642444 4350325 4033796 3848606 3942699 3668857 3836027 3735734 3834228 3637742
16600 3637742 3750249 3669923 3389477 3216523 3222425 3202793 3101860 3291878 3141571 2871801
16590 2871801 2799141 2720906 3123607 2928725 2801574 2585265 2779130 2939960 2349427 2299543
16580 2299543 2324212 2749089 2049521 2261491 2470698 2135776 2709330 2272352 2146889 2520301
16570 2520301 2750319 2061038 2148634 2131373 2158548 2014590 1852619 1849224 2033271 2119824
16560B119824m8134k65729o5275o3246j15401N27255j83067l18150k70767L53940
16550A671250J40628l19208n4186J12764J29859J80757k02391j70968J91971p5607
16540A604869o3332l52942J00517K62044m96577J89417L49089j41691k76864K50728
16530A425258k78548K71247j32299j65978Q8827J03424l883p2761K00155m63502
16520I71940M35874k45961k15171L0501j28589K98946k75896M09259k18674k56970
16510H05259M02750m95244K23200j17630K92208m4828J37002m26334N50439k54820
16500A072002k8307m456J2927m85682J75625L02933j61764K6006l3185J20205
16490I96304j55920K7366m31785K66434k10159K97419J76119m04093J65625K69923
$$ plain form
16560 2119824 2071690 1805961 1740686 1677440 1562039 2089294 1906227 1588077 1317310 1671250
16550 1671250 1811878 1492670 1438484 1551248 1681107 1861864 1659473 1488505 1680476 1604869
16540 1604869 1541537 1188595 1289112 1551156 1054579 1243996 1593085 1451394 1174530 1425258
16530 1425258 1146710 1417957 1285658 1119680 1208507 1311931 1308048 1235287 1435442 971940
16520 971940 1407814 1161853 946682 977183 848594 1147540 871644 1280903 1062229 805259
16510 805259 1208009 712765 935965 818335 1110543 1065715 1202717 776383 1326822 1072002
16500 1072002 1043695 1039239 1052166 566484 742109 1045042 883278 909284 876099 996304
16490 996304 840384 867750 435965 702399 492240 789659 965778 561685 727310 997233
16480I97233j21294P6771q9733q6503P6306J02249k47484k98863p3627J40827
16470D75882J62063j20159J71228n8193j69175J68283K47071j89565J58519j59930
16460F86024J16861l01309L98638B59739R3217K7569K14866L3993n4949r662L31279
16449H96052D14286M35740l52701L31295j19499R4610j06398k18057k14955J48759
16439D13080j63224L16462k27629L1410j15566M73933l27468O7192J9838K0839
16429E08867B24841m4583P25407D31179M3359A43946L43215M5057k59984j23307
16419A48927L31062J14298j23244K5884N9634p2947B30214P1220R8114J66838
16409E66386l9290j95660J72435k44519J34090j91431L34535A30507l8595L19489
$$ plain form
16480 997233 875939 952710 862977 776474 852780 955029 707545 408682 335055 475882
16470 475882 637945 517786 689014 630821 461646 629929 877000 687435 845954 686024
16460 686024 802885 501576 900214 259739 352956 380525 595391 629384 574435 564773 896052
16449 896052 414286 850026 497325 828620 709121 803731 697333 479276 264321 413080
16439 413080 249856 566318 338689 370099 254533 728466 400998 468190 488028 508867
16429 508867 224841 180258 905665 431179 474538 143946 487161 532218 272234 148927
16419 148927 479989 594287 471043 496927 556561 483614 230214 301434 399548 566386
16409 566386 527096 331436 503871 259352 393442 202011 536546 130507 91912 411401
16399D11401O136p2309P0488J51804J10724k74249O3744J72538j16547A03408
16388B12997L48089j37238j8141A49674J37896J0664J27634J88031k56104n1276
16378C06519k0636K17912A02783a59467E33787M8903j73939A37440J13481J3911
16368B64832L72905b061A64997K37840j97200J98435i3882C48291A68938m0313
16358A28625K68291j45033B5247N28873J5131A65422J77217Q0118j06508A00975
16347E09851C4436J28316L14898i566E07404a14366e380D81465j47915b716C6970
16335C74011b400B11524o1557C7002R5260N2571c05432a07385B42706K24511j44006
16324C23211A24471j3397K08418F1922J15826a66984H0686K48469k8268a52810
$$ plain form
16399 411401 417537 345228 415716 567520 678244 403995 467739 640277 523730 103408
16388 212997 561086 423848 405707 149674 287570 298234 425868 613899 357795 306519
16378 306519 285883 503795 102783 -159467 533787 582690 408751 137440 250921 264832
16368 264832 637737 -2061 164997 402837 205637 404072 -93882 348291 168938 128625
16358 128625 396916 251883 25247 554120 569251 165422 342639 422757 316249 100975
16347 509851 34436 162752 477650 -9566 507404 -114366 -5380 481465 333550 -2716 36970
16335 374011 -2400 211524 149967 37002 132262 184833 -305432 -107385 242706 467217 323211
16324 323211 124471 111074 319492 61922 177748 -166984 80686 329155 300887 -152810
16313B65324K7071D9782g7505B74783H7349J60003A09696J43030a22674B85915
16302C86041j10449K517r3794l5606J7186o973e622E8082K84535H8791a32726
16290a42895C05918k8391p9249K5424I3819L91408A74840d6391m3011j9955B63935
16278e6739E7797a9072D11469q9304J69932k37540B0975K2535L62753E3304E36
16266a32804B45091n6073B1555K67623R584m8890a19140j21155B39320J55485
16256C94805j37380C010M91930j57299e9229F2496N8981b8485D00151h5707A24033
16244F5250g0703I5285J5725a8052q1519p155A76858M1114J22614A09806P9951
16233A89757n018b8269j5523A27976a91050B02428n2474j0218J8413b28678A64087
$$ plain form
16313 265324 292395 49782 -77505 274783 87349 247352 109696 252726 -122674 285915
16302 386041 275592 278109 184315 148709 165895 158922 -5622 58082 342617 88791 -132726
16290 -142895 305918 277527 198278 223702 93819 485227 174840 -46391 -89402 -109357 263935
16278 -56739 57797 -19072 411469 322165 492097 254557 20975 43510 406263 53304 536
16266 -132804 245091 189018 21555 289178 298762 249872 -119140 -240295 239320 394805
16256 394805 257425 3010 494940 337641 -59229 62496 121477 -28485 400151 -85707 124033
16244 65250 -70703 95285 111010 -18052 -99571 -106726 176858 217972 340586 109806 189757
16233 189757 184739 -28269 -43792 127976 -191050 202428 149954 139736 158149 -228678 164087
16221e3289j06743A14702a52137a5851m5377A95558M1881H2984J4551J11704N6390
16210B65629a14376a7699B04430h9003a3576A73902j1550m5288J10286G9148c50587
16198a58654c8833C75335b36201C99201F753L7001K01354E0799K29414a2630B21054
16186A61404b08239C06001a52927F2764K24346C1754L22274l5429i545A43914
16175c67787F7380c11873A71642E8025M2314P3846B099N0733K18670n0063K32597
16164D54036j93545f5518A7094J52192E0041k3285d0223q3021A04312a57757C58196
16152A09520k8940K52651e5669n9835A17474j1245b70725D1229J75935b17178
16141A19199L6121e1433I2858K4697b43903h2982F1965A6302K4668a57419M0649
$$ plain form
16221 -53289 -160032 114702 -152137 -15851 -61228 195558 237439 82984 97535 209239 265629
16210 265629 -114376 -17699 204430 -89003 -13576 173902 162352 117064 227350 79148 -350587
16198 -158654 -38833 375335 -236201 399201 6753 43754 245108 50799 280213 -12630 221054
16186 161404 -208239 306001 -152927 62764 287110 31754 354028 318599 -9545 143914
16175 -367787 67380 -311873 171642 58025 100339 174185 2099 52832 271502 221439 454036
16164 454036 260491 -65518 17094 169286 50041 26756 -40223 -123244 104312 -157757 358196
16152 109520 80580 333231 -55669 -115504 117474 106229 -270725 41229 217164 -217178
16141 119199 155320 -51433 92858 117555 -243903 -82982 61965 16302 40970 -157419 -116770
16130a16770n4929B8894K1577b21489B69996N0873I8087a68705d9623j18639j66612
16119c34874J08812D06050C5423b03001b2354p2010j95926I9905C1946a4832F0459
16107a7262j71896B14979A7825J01390k609m3667L0842J97726j9322B2338a2543
16095c624p2903J7677j19878G6415a18588E0188a88994B89817A06135A0325J37229
16084A47554a12127k05841J47081P3476c6694M299E4856b92599A5503a92731J3550
16073a79181g2284R801k63784A27450i763A06826J48407a37508D3100f9720j4682
16062h4402B34864H8888a30267M6885r047p4073D366a9431A00325b69581k5161
16051b94742a11209A56653e7650C45175a83241j41160J51010o2036A26663K07371
$$ plain form
16130 -116770 -171699 28894 50471 -221489 269996 320869 98087 -168705 -49623 -168262 -334874
16119 -334874 -226062 406050 35423 -203001 -22354 -94364 -290290 99905 31946 -14832 60459
16107 -17262 -189158 214979 17825 119215 116606 72939 103781 301507 282185 22338 -12543
16095 -3624 -76527 -58850 -178728 76415 -118588 50188 -188994 289817 106135 10325 147554
16084 147554 -112127 -317968 -170887 -97411 -36694 -32395 54856 -292599 15503 -192731 -179181
16073 -179181 -72284 -62483 -326267 127450 -9763 106826 255233 -137508 43100 -69720 -84402
16062 -84402 234864 88888 -130267 -83382 -92429 -166502 4366 -19431 100325 -269581 -294742
16051 -294742 -111209 156653 -57650 345175 -183241 -324401 -173391 -235427 126663 334034
16041C34034b3118A5475a60733d61C2569b66345B80536b43041A37136e408j41461
16030a46869j329L8725H5641a14243F6932B9655B883J61339c1869j83550i6999
16018b01694D9887J64029a03441C1305a51541a5603D7944a63074k1227M4112D5347
16006b79379J12218q8649N9911H5391A7110a75467C40403b28286B4735L8675J03610
15995A67020c58198A95176b01867B658O3662N3517m4209b83478h8983H9815e9228
15983D04148j630n5791A51536L03889B05031I9942L31730a52598G8987N4287a15667
15971A10126b55509d658l3260j80811a602k51380a0982k60073a13182A57735p003
15960A50732i9901B982b7417A22992B5857b01652N55R1568B3779a51657j91535
$$ plain form
16041 334034 -23118 15475 -160733 -461 32569 -266345 280536 -243041 137136 -5408 -146869
16030 -146869 -148198 -109473 85641 -114243 66932 29655 2883 164222 -31869 -215419 -96999
16018 -201694 49887 213916 -103441 31305 -151541 -15603 47944 -163074 -184301 -140189 45347
16006 -279379 -167161 -255810 -195899 85391 17110 -175467 340403 -228286 24735 63410 167020
15995 167020 -358198 195176 -201867 2658 66320 119837 75628 -283478 -88983 89815 -59228
15983 404148 402518 346727 151536 455425 205031 99942 431672 -152598 78987 133274 -115667
15971 110126 -255509 -4658 -37918 -218729 -1602 -252982 -10982 -271055 -113182 157735 150732
15960 150732 -99901 2982 -27417 122992 25857 -201652 -201097 -109529 23779 -151657 -343192
15949c43192J17342B28309B3781M5463c8635C8343c60343A05212C9689K05990
15939B45679b98134a02798A59345m3597a01501p8519j4338N7128A08184a86089
15928i9281C3056K54936c85048c7364G4985r232k4887b41512f3676M920C68162
15916c40735O2868J04906A98279k9715C885J05796R1268a74872A9121g2286A58798
15904e3493k5904h314q3657A29817E5101b9857i708n3090D835J05412m6332a07950
15891a27702c5334A36151B7355b95284O8645D4187N5974b47516A11533a89039
15880b4990A16763a73213J2262A1317h6372F1654e3057m8231b6466j23587k0672
15869a70725e7207A96666a1914j76842b0167q8086k2019e3691B0586B54b86429
$$ plain form
15949 -343192 -225850 228309 23781 69244 -38635 38343 -360343 105212 39689 245679
15939 245679 -298134 -102798 159345 115748 -101501 -180020 -194358 -137230 108184 -186089
15928 -99281 33056 287992 -385048 -37364 74985 65753 40866 -241512 -63676 -58756 368162
15916 -340735 -277867 -172961 198279 168564 3885 109681 200949 -174872 19121 -72286 158798
15904 -53493 -79397 -8314 -91971 129817 55101 -29857 -9708 -62798 4835 110247 63915 -107950
15891 -127702 -35334 136151 27355 -295284 -226639 44187 100161 -247516 111533 -189039
15880 -24990 116763 -173213 -160951 11317 -86372 61654 -53057 -101288 -26466 -150053 -170725
15869 -170725 -57207 196666 -11914 -188756 -20167 -108253 -130272 -53691 20586 254 -286429
15857d5993r7861P0058I3585a37705B24815a51104n545B1973e0099A47021b58095
15845E208J32801g9274K4729l8368A1225J60164G8548c21722a04705j15463R31
15834b19237R8799N2293m03934K35841a09095j47493A97555c15377J23896A93173
15823f1584D06951h9785A55476a82232b9411k60210C26636b07099h5032A74356
15812a54468L1748a0827m01335b9549A657b78598C6986N2064b10474C17516d9202
15800b81184a03447A51074g7225b453j93146j45624a29831A75401e1428F8904
15789B3352b3346j15218A33407f3508J2001E2061Q4377e0802A20219a53169k87828
15778d40997b1130l0793k54633d1398A31399N780d20204B55320r6642b25052E9794
$$ plain form
15857 -45993 -143854 -73796 93585 -137705 224815 -151104 -156649 21973 -50099 147021 -258095
15845 5208 138009 -79274 -54545 -92913 11225 171389 78548 -321722 -104705 -220168 -219237
15834 -219237 -120438 -68145 -472079 -236238 -109095 -256588 197555 -315377 -191481 193173
15823 -61584 406951 -89785 155476 -182232 -29411 -289621 326636 -207099 -85032 174356
15812 -154468 -122720 -10827 -412162 -29549 1657 -278598 36986 89050 -210474 317516 -49202
15800 -281184 -103447 151074 -77225 -2453 -195599 -341223 -129831 175401 -51428 68904
15789 23352 -23346 -138564 133407 -63508 -51507 52061 136438 -50802 120219 -153169 -440997
15778 -440997 -21130 -51923 -306556 -41398 131399 137179 -420204 255320 158678 -225052 59794
15766A10503e654k14286B54873i4815J8116N211q7920q3440A50030l7343Q9939
15755B02626b89379B92281G0374O3860c8116C11664I6527M5428p852K61027F2744
15743a01500K8653A63565a12972c9698r2812C01665j16866q7059k6208C4742g1745
15731b15729B1052M52313C5882i6474H3843a37874O3764B93319b20202k1327B1265
15719A68054P936B8895c06783D6885O405n609b76102J20238d7934q4792j02375
15708b35101H7535a39143o9152J01923A31030C8699b82055a2542H0478i3528D5705
15696A17622n7172a3096k22217G6019K51905K0916j19329E9733a8308r1688c377
15684d7912k46861B06200a60127a9430j90581H420P1011c02681Q6636e1604j42839
$$ plain form
15766 110503 -5654 -219940 254873 -94815 -76699 -71488 -159408 -242848 150030 112687 202626
15755 202626 -289379 292281 70374 134234 -38116 311664 96527 141955 134103 395130 62744
15743 -101500 -72847 163565 -112972 -39698 -132510 301665 184799 97740 71532 34742 -71745
15731 -215729 21052 473365 35882 -96474 83843 -137874 -74110 293319 -220202 -241529 21265
15719 168054 175990 28895 -306783 46885 53290 47681 -276102 -155864 -47934 -132726 -235101
15708 -235101 87535 -139143 -208295 -106372 131030 38699 -282055 -12542 80478 -93528 45705
15696 117622 60450 -13096 -235313 76019 327924 348840 229511 59733 -18308 -109996 -3377
15684 -47912 -294773 206200 -160127 -19430 -210011 8420 79431 -302681 -216045 -51604 -194443
15673a94443b4990A11161j1036L1280B0400J77989a31255o6915j17480N5609B34366
15661i7561j69233E6821h5352J4711c4784r5483I2480a56936A37629J94459i1289
15649a2427F3571B5686M9741h2105a2420k83268A10852a51183a2288k43337A16804
15637f6895j75507B27795j11817N3891K8375a0723F874J9547A1744a78418L4202
15626a44216m0977A19053A0098c0132p0310a4805o2233j12154a8222p8408M5196
15615e1434j81574f6567l1050A21264i6496b3140B878a21150B04371e8172j30900
15604a89072G7842b62236e5890A09099b05060C86887a09747H138b1273l2681r23
15593e4877j33851b1901n3242K3221r1283B7580i5512A10670b23933A68823l6548
$$ plain form
15673 -194443 -24990 111161 100125 131405 20400 198389 -131255 -198170 -315650 -260041 234366
15661 -97561 -266794 56821 -85352 -70641 -34784 -130267 92480 -156936 137629 332088 -91289
15649 -12427 63571 25686 75427 -82105 -12420 -295688 110852 -151183 -12288 -255625 116804
15637 -66895 -242402 227795 115978 169869 198244 -10723 6874 26421 11744 -178418 -144216
15626 -144216 -185193 119053 10098 -30132 -100442 -14805 -77038 -189192 -18222 -96630 -51434
15615 -51434 -233008 -66567 -97617 121264 -96496 -23140 2878 -121150 204371 -58172 -189072
15604 -189072 77842 -262236 -55890 109099 -205060 386887 -109747 8138 -21273 -53954 -54877
15593 -54877 -188728 -21901 -75143 -51922 -143205 27580 -95512 110670 -223933 168823 132275
15582A32275L5131d0810o9854B20J38099h5953j06840a6498j6562j98213P0369
15571a60904I6730b5607j01499A25268J61908a56443A62466m0314a41144j1516
15561a52660f8225L3333B67646d7928l5142J7554B14597d0858B30167B8459a81347
15549A47601G3337N8726A0485b44454C1606b0915G2210M9666e9755D2613b22802
15537A97459I3519a6462D0003J43815A1471a3330G5123d3968A06790b27241A20387
15525A04822j2193a57051d5455A38335C8565a03189F2795a21995k32703A38899
15514a40692M3186C12175F1702N0832a11970L1811B23336b49077A1662c02005
15503g0386A33710d4785j73075h2364n8727k7244A64855B3522c7491D744a27961
$$ plain form
15582 132275 167406 -40810 -110664 220 138319 -85953 -192793 -16498 -33060 -231273 -160904
15571 -160904 96730 -25607 -127106 125268 287176 -156443 162466 122152 -141144 -152660
15561 -152660 -68225 -34892 267646 -47928 -83070 -65516 214597 -40858 230167 28459 -181347
15549 147601 73337 132063 10485 -244454 31606 -20915 72210 121876 -59755 42613 -222802
15537 197459 93519 -16462 40003 183818 11471 -13330 75123 -43968 106790 -227241 120387
15525 104822 92629 -157051 -45455 138335 38565 -103189 62795 -121995 -354698 138899
15514 -140692 -97506 312175 61702 112534 -111970 -80159 223336 -249077 11662 -302005
15503 -70386 133710 -44785 -217860 -82364 -141091 -168335 164855 23522 -37491 4744 -127961
15491A57814J02812j22796D8525B629K86665a11377M6045A20600b02190c9292
15480B71621a77150J394c5014G930a35626B49723a72783A24635b10884e1983K1061
15469c0922e99l7682j57083M7855E6936c9002I4511C2945b27244O1875B07017
15457a679k51265A09259L4669a86223A37410i7880D7297L1487O2903F369K54284
15446B60653c03233f1995a7276k61979B97549f940k57890A45196K97275A44979
15435a16511d8660B92954i7548b570H8360d6207a96j39929j95420a3861A87504
15423A62712N0784e7976j14934B20232p0686B4695K77904E7112J64076a0615A81043
15411d5061H0402b12694i6628h346j58917B06619a98804a4153j5571B9532f4989
$$ plain form
15491 157814 260626 137830 48525 2629 289294 -111377 -65332 120600 -202190 -39292
15480 271621 -177150 -175756 -35014 7930 -135626 249723 -172783 124635 -210884 -51983 -30922
15469 -30922 -599 -38281 -195364 -147509 56936 -39002 94511 32945 -227244 -165369 207017
15457 -1679 -252944 109259 143928 -186223 137410 -97880 47297 78784 141687 6369 260653
15446 260653 -303233 -61995 -17276 -279255 297549 -6940 -264830 145196 442471 144979
15435 -116511 -48660 292954 -97548 -2570 88360 -46207 -196 -140125 -335545 -13861 187504
15423 162712 213496 -57976 -172910 220232 149546 24695 302599 57112 221188 -10615 181043
15411 -45061 80402 -212694 -96628 -8346 -167263 206619 -198804 -14153 -29724 29532 -64989
15399A15205b20596F572a22017A0461a25815C14526a49441L8950n0055A12016
15388b0135C01301a34914d3400J7946C7412d3095a2033m3448F6485c14776A41281
15376c3004j2662A8136e4016B5944b07177B16776m4596o6717d1459J7221j49627
15365a73865J10A36021R9472A2011J4013a21276B52674a12464I0247c42129r695
15354c51824A51647j5550a90170A86087h8599k99094b6283j27291E6980M159J92331
15343B53470j2702f7261j33442C45045a70105C82147G8901J42762E881J59574
15333A65455C4868J22885a6585j9248l6672l6273n8424A32157f8459E9818J69334
15322B29152c6173A77260D2410K26491j3338A25358b46490J05410H862b26355
$$ plain form
15399 115205 -220596 6572 -122017 10461 -125815 314526 -149441 -110491 -160546 112016
15388 -20135 301301 -134914 -43400 -25454 37412 -43095 -12033 -55481 66485 -314776 141281
15376 -33004 -45666 18136 -54016 25944 -207177 216776 172180 105463 -41459 -24238 -173865
15365 -173865 -173755 136021 235493 12011 26024 -121276 252674 -112464 90247 -342129 -351824
15354 -351824 151647 136097 -190170 186087 -88599 -387693 -26283 -153574 56980 61139 253470
15343 253470 240768 -67261 -200703 345045 -170105 382147 78901 221663 5881 165455
15333 165455 34868 157753 -16585 -35833 -72505 -108778 -167202 132157 -68459 59818 229152
15322 229152 -36173 177260 42410 268901 255563 125358 -246490 -141080 8862 -226355
15311a2589E7869a37654G5498K0196b24271j9079D399K05259A2376L63505a07964
15299B15063I9521a4492I5455l2514g0792C96536a45591O6590A90443r224n2882
15288A28337n8292L64296F5657a54808H2535f5087G2571K08046I9971J22311a62649
15276A94102i4644E0073c6577j98182A45023O6J7052h6787B7686L9630J05412
15265A72728p8750k9480a52667I9390g5432B1007J27096L1054M0023a3432E4222
15253a34106D28573B07842g5330P71B18843K28290P09437j21507K47590K29422
15243A512075C92344j42559J84746k04741M9299H5710c60588a02912f494A0117
15232A86139N2125n749B8238K00984l1267r4465D0241a11254A10092F966L68069
$$ plain form
15311 -12589 57869 -137654 75498 95694 -224271 -243350 4399 209658 12376 375881 -107964
15299 215063 99521 -14492 95455 62941 -70792 396536 -145591 -79001 190443 181219 128337
15288 128337 70045 434341 65657 -154808 82535 -65087 72571 280617 99971 222282 -162649
15276 194102 -94644 50073 -36577 -234759 145023 145089 162141 -86787 27686 67316 172728
15265 172728 93978 64498 -152667 99390 -75432 21007 148103 179157 219180 -13432 54222
15253 -134106 428573 207842 -75330 -74559 218843 447133 1156570 1035063 1282653 1512075
15243 1512075 392344 249785 434531 229790 279089 85710 -360588 -102912 -6494 10117
15232 186139 238264 232515 28238 229222 197955 103490 40241 -111254 110092 6966 375035
15221C75035c6044B17562O5604J34304A70243K1022d5471B76695r6492b44376
15210A41424b73925B04281b1667k34092I5849N156K01251j20763n0477J2450K15639
15199C59105k3632C0173R6154N6724a54251B0010a97921B8248N3241b53324G7415
15187A72722f229A10423l1363J24538m2576G33R8523M622b2603B67813e7055A9536
15174C17651H6978J6633D618L4018l169L21557i9330H3180A3156J24394a90595
15162F3749p104J56480r7323n0488L500k3381J83452O3147H2J07171J63268b48874
15149A29912M631g328B71245q7382J86714A2842J43348F9888J40477d69464D15422
15137B72240a5427k06303B51246a44883B31934n0534e20070B23820H0660N4387
$$ plain form
15221 375035 -36044 217562 283166 417470 170243 191265 -45471 276695 180203 -244376
15210 141424 -273925 204281 -21667 -255759 95849 101005 302256 181493 131016 143466 359105
15199 359105 335473 30173 126327 183051 -154251 20010 -197921 28248 81489 -253324 77415
15187 172722 -6229 110423 79060 203598 161022 733 99256 103878 -22603 267813 -57055 19536
15174 317651 86978 103611 4618 38636 35467 357024 -99330 83180 13156 137550 -190595
15162 63749 56645 213125 115802 65314 68814 45433 228885 292032 82 107253 270521 -248874
15149 129912 134543 -7328 271245 183863 370577 12842 156190 69888 210365 -469464 415422
15137 272240 -15427 -221730 251246 -144883 231934 181400 -520070 223820 80660 135047
15127A35047o6244O1781J69228A17147A7773K61045K18129I7917R4428C7626h4316
15115B23413A07458a90041A03721O9951D2092b9636j00319B05815l0666a63647
15104C2601K11440H2353J75182r9297A2374K703K83284j35118J53144i6977C97261
15092A75842d35976B95783k4014m7354k9916K48290j17172b95454A31078K18394
15082C49472c6611G2722J66775J312I5875J64489J84318q6740l901j21649b37292
15070B76330B9942K49888b24696i8936C4268a37769E4358K61764A00925a6559
15059F09332A18699J2711o4389B722K90530g2776B11546Q2253H9518J3391J47058
15048B49967j22724P2323j545L65622A69622J59485m8374K96900B82653j30722
$$ plain form
15127 135047 68803 130584 299812 117147 17773 278818 496947 97917 192345 37626 -84316
15115 223413 107458 -190041 103721 173672 42092 -29636 -129955 205815 175149 -163647
15104 32601 244041 82353 257535 158238 12374 15077 298361 163243 316387 -96977 397261
15092 175842 -435976 295783 271769 224415 194499 442789 325617 -295454 131078 349472
15082 349472 -36611 72722 239497 240809 95875 260364 444682 357942 354041 232392 -237292
15070 276330 29942 279830 -224696 -98936 34268 -137769 54358 316122 100925 -16559
15059 609332 118699 131410 67021 2722 293252 -72776 211546 293799 89518 102909 249967
15048 249967 127243 199566 198021 563643 169622 329107 280733 577633 282653 151931
15038A51931P1598L81389A64486p9923J60793E9037K74317q961o3229J00536r1930
15027B69770K963n9513J56070j39152F4648K05357r3193K05239A12744a09452
15016C87779o8197N4199j34438i4711b4686A32700f899A65842J9111K55655j76646
15005B63962A10824J27538e9656D41134j2789j21276a321D64268I5157K5816n6986
14994F3987K40412K93590k95468A51250M03350j52203j95595a7208A18592J24505
14984B43097K268r8073K60678a08181A72346R57d6852p1914E6330N05082A21957
14972B6206L58520j59872Q0073a79892C37070j28536J9732M121N6812G7381M32940
14961E10321b39446B95669J09099K19708A63648L80128k936a4643r2682D32826
$$ plain form
15038 151931 223529 604918 164486 84563 245356 59037 333354 324393 261164 361700 269770
15027 269770 272733 213220 369290 230138 64648 270005 176812 382051 112744 -109452
15016 387779 319582 373781 239343 -94711 -24686 132700 -6899 165842 184953 440608 263962
15005 263962 110824 238362 -59656 441134 428345 307069 -1321 464268 95157 120973 63987
14994 63987 304399 597989 302521 151250 554600 402397 206802 -17208 118592 243097
14984 243097 245365 147292 407970 -108181 172346 173303 -46852 -118766 56330 561412 121957
14972 26206 384726 224854 304927 -179892 337070 208534 228266 232387 289199 77381 510321
14961 510321 -239446 295669 404768 624476 163648 543776 540840 -14643 -107325 432826
14950A04953K86546j24811K09466A67955q707J2751G3984J81324A6509D512O34743
14939F39255A90104r911K44278A21582K69833I7204D4376J84701O2948r7094N4202
14928B49133l9115j8703O4587K38833j74047p9889J56841j56113J31088J20967
14918D93582B41865J33176F8929a72916C15035A43133o4574J75987J4227J61034
14908D29807A75229K50704J34511A77445O3116k9546J84568M699a49212A48069
14897A87125L4170r711L99523g223B95778q2026J0380J25617K48318j93788j82921
14886B21358a09191D17760Q9159M0050B02111E1099K10132J68714j02366J36477
14876D64056N8511n9306P3302B20167J25695j59915C8317K78619Q6119Q2815k28328
$$ plain form
14950 104953 391499 266688 476154 167955 159248 171999 73984 255308 16509 4512 639255
14939 639255 190104 180193 424471 121582 391415 97204 44376 229077 292025 194931 249133
14928 249133 210018 191315 255902 494735 320688 240799 397640 241527 372615 493582
14918 493582 241865 375041 68929 -172916 315035 143133 78559 254546 268773 429807
14908 429807 175229 425933 560444 177445 240561 211015 395583 400282 -149212 148069
14897 187125 221295 211584 611107 -7223 295778 213752 224132 349749 598067 404279 221358
14886 221358 -109191 417760 506919 546969 202111 51099 261231 429945 327579 464056
14876 464056 522567 463261 536563 220167 345862 185947 38317 316936 403055 485870 257542
14865B57542a22789A87348L48427M6832k60741L07597E7001J94261L54041k67144
14855C38159L07798B51018K4553L33466j82011j8125J17933O4353j50597r3429
14845C47161M979n6083l3551K72386j80404R6299B20991N56577k74777R0746B57915
14833F78477l28697j0586J60193A01648n0134K52525l5844L9858J26006K31752
14823F65811l12312j02094K73419j91817L44541C06598l9695P38K08812K11837
14813F88290P9285C62228L16116j62147Q9942B10460M01561B04598K52377O8806
14803E25781K5903k02506J55285J55427L5093J26383l68192J09986r3327L13930
14793G83763k33939k13835M9296J32971J44762j45031k13078J45082J80607M5510
$$ plain form
14865 257542 -122789 187348 535775 582607 321866 629463 57001 251262 605303 338159
14855 338159 645957 251018 275571 609037 427026 408901 526834 591187 440590 347161
14845 347161 352140 296057 262506 534892 354488 450787 220991 777568 502791 593537 257915
14833 678477 349780 339194 499387 101648 51514 304039 268195 308053 434059 665811
14823 665811 353499 251405 524824 333007 677548 306598 266903 267641 476453 688290
14813 688290 767575 362228 678344 516197 606139 210460 612021 204598 456975 525781
14803 525781 551684 349178 504463 659890 694983 821366 453174 563160 469833 783763
14793 783763 549824 335989 385285 518256 663018 517987 304909 449991 630598 676108
14783F76108j58915k37029J22685J71265n9009o3155J74832k11374L86441C23250
14772B78151M50628k99391M44191k65578m3152K3095k42888j3940L64612k77150
14762D18578J91405o0639j96620P1155K76387l27331K77668r4892J98069k26246
14752E27534K09846j01696J43868O4104l77898L96680l67391j8967N38938l27657
14742F87361p7227j18389K84368l11437J6122K43147j10509L8885K36175r1298
14732G97198J23562l21145K36127j07996P2626k67131J04812r5281L42063l68283
14722E16552K3795J92480L4654J72805J33247k48765k87041J45490J88574p8108
14712G93683J96752j26490K07744k57729J28747j65974k73043N35987l07418o9516
$$ plain form
14783 676108 517193 280164 402849 574114 515105 451950 626782 415408 801849 323250
14772 278151 728779 429388 873579 608001 564849 587944 345056 331116 695728 418578
14762 418578 609983 549344 352724 423879 700266 372935 650603 555711 753780 527534
14752 527534 737380 635684 779552 843656 465758 862438 495047 476080 1015018 687361
14742 687361 610134 491745 776113 464676 480798 723945 613436 652321 888496 797198
14732 797198 920760 599615 835742 727746 800372 533241 638053 542772 884835 516552
14722 516552 540347 732827 767481 940286 1073533 824768 537727 683217 871791 793683
14712 793683 990435 863945 1071689 813960 942707 776733 503690 1039677 732259 662743
14702F62743J91428O4082j96327j55595M63965m93462R5735L55041k9105D74900
14691G24029M27193k55028l5293m5308k00210M31919k68157j39732J53400K53855
14681A046668j73351J0320J96333j71353J39710L9037r0301o3761K16136N4903
14671A204341m60294L32281j55109l35818N39039o0384P8932m01424M00600m10545
14661G31619R7535L51161k75621J4942J50701J00170k0633J14200n994k33093
14651A024987L76571m77343p5962J58793K99646j66753k46981K36778N2529k17409
14641I64856N06722n42561M64892k26898K7636k24402K97652k55678J33953K92228
14631A438400k64392P4919q3985l76907N55257K32578m64988L76466m01018J53703
$$ plain form
14702 662743 854171 918253 721926 566331 1030296 536834 632569 987610 958505 474900
14691 724029 1151222 896194 860901 815593 615383 1047302 779145 639413 792813 1046668
14681 1046668 873317 883637 1079970 908617 1048327 1087364 997063 933302 1149438 1204341
14671 1204341 744047 1076328 921219 585401 1124440 1064056 1142988 741564 1142164 731619
14661 731619 829154 1180315 904694 919636 1070337 1170507 1149874 1264074 1258080 1024987
14651 1024987 1401558 924215 848253 1007046 1306692 1139939 892958 1129736 1182265 964856
14641 964856 1471578 929017 1393909 1167011 1194647 970245 1267897 1012219 1146172 1438400
14631 1438400 1174008 1248927 1164942 788035 1343292 1575870 1110882 1487348 1086330 1240033
14621A240033O7713q1531k029K27471k40328p8666K07100K5874l2143K88731k23780
14610A398445r0300l5196L53039j6243n56569N81668m40164O32929l06733k5318
14600A495558r2619K78700o6005J44727j37002O3066j61973K02897Q196O7925
14590A803470l04407K52327K94262n87727L19118j47186K35316K47999k98896
14581A814276r2895M1968P0431N1556k08375P03399l35146P7647q2127q0149J72886
14570B133471J71291k22375k5981o1274J32978K20839J32948n2689q8787j26982
14560B213439L30562j34584L73283j41499K74350q5734L49753M78667N3409P67973
14550D479619O32621J572434L634564R523160J9103047m81996j7545961r636693
$$ plain form
14621 1240033 1307746 1226215 1224186 1451657 1211329 1132663 1339763 1365637 1333494 1622225 1398445
14610 1398445 1308145 1272949 1625988 1609745 1053176 1634844 1194680 1827609 1520876 1495558
14600 1495558 1402939 1681639 1615634 1760361 1623359 1686425 1524452 1727349 1735545 1803470
14590 1803470 1499063 1751390 2045652 1457925 1777043 1629857 1865173 2113172 1814276
14581 1814276 1721381 1763349 1833780 1885336 1676961 2380360 2045214 2122861 2040734 1960585 2133471
14570 2133471 2304762 2082387 2056406 1995132 2128110 2348949 2481897 2429208 2340421 2213439
14560 2213439 2544001 2409417 2782700 2641201 2915551 2829817 3179570 3658237 3711646 4479619
14550 4479619 5112240 6684674 10319238 19842398 38945445 38463449 20917488 11280795
14542A1280795n402704k218706n74099o65466q5188j69827k05462r1920R7141
14533A964564N51029n56116J81343J83616j8185j23784R4298l8104m29480N77670
14523B386851k86871R6564L82752k92846o8534L16901J67385j26713j58606J08231
14513B525114l16645N64699M3561l29604P3498L80686m55346J31650j16248K25975
14503B727340j5972J33819O0734K14240j76467J07074p6979K38713K19635o12473
14493B819664M74573k06167K73320j2107j11296J28662L8158M8008k762k09092
14483C240961O33712k54458J05537j90995L179K70228q4765J24892n0967k41606
14473C555718L35336K5242k83316M81605l4488K31882k49030K77501K29900m27515
$$ plain form
14542 11280795 5878091 3659385 3085286 2419820 2334632 2164805 1959343 1867423 1964564
14533 1964564 2515593 1959477 2140820 2324436 2306251 2182467 2276765 2238661 1809181 2386851
14523 2386851 2099980 2196544 2579296 2286450 2217916 2534817 2702202 2575489 2416883 2525114
14513 2525114 2208469 2773168 2816729 2487125 2560623 2941309 2485963 2617613 2501365 2727340
14503 2727340 2711368 2845187 2905921 3120161 2943694 3050768 2973789 3212502 3432137 2819664
14493 2819664 3294237 3088070 3361390 3349283 3237987 3366649 3404807 3452815 3450053 3240961
14483 3240961 3874673 3620215 3725752 3534757 3537936 3808164 3723399 3848291 3797324 3555718
14473 3555718 3891054 3916296 3632980 4114585 4080097 4311979 4062949 4340450 4570350 4142835
14463D142835N42927l71922L53624m42551L50110j57473J93444P0667J3847L81161
14453E076669k00029L45383J14024m11301q7407K92728M5777N6394M30000l99516
14443E262722K23927q3798K6695J88587q4151L84188J75940k47081M68052k35676
14433F079405M21080l19417O3479L09959j59872M45819L278n4890j26787O00853
14423G262907m28089L84024K08607r6830o6543M95530J69140J63810K0686O9647
14413H182889k07222L35951L3124K3319M09907J622P7583O81384l72809K73477
14403I439225J41925K63119q8018J61664L45086j56417J55983M78313o2480J10476
14393A0788876J60554J33236N14099p4202M97110O4743K25916J79612N26725j59114
$$ plain form
14463 4142835 4685762 4313840 4667464 4224913 4575023 4417550 4610994 4681661 4695508 5076669
14453 5076669 4876640 5222023 5336047 4924746 4837339 5130067 5175844 5232238 5662238 5262722
14443 5262722 5486649 5402851 5429546 5618133 5533982 5918170 6094110 5847029 6315081 6079405
14433 6079405 6500485 6181068 6244547 6554506 6394634 6840453 6843731 6788841 6662054 7262907
14423 7262907 6834818 7218842 7427449 7330619 7264076 7759606 7928746 8092556 8113242 8182889
14413 8182889 7975667 8311618 8344742 8368061 8777968 8779590 8857173 9538557 9165748 9439225
14403 9439225 9581150 9844269 9756251 9917915 10263001 10106584 10262567 10740880 10678400 10788876
14393 10788876 10949430 11082666 11596765 11522563 12019673 12084416 12310332 12489944 13016669 12857555
14383A2857555P09460k27323J59884P58203J48849J96987K31065N324J72157N42716
14373A5554877M42176L01938N0817J3909R37449P2375M22403N13383k09968O76970
14363A8776329L95743M29021L81497O15889j07592Q86488M21748N58583J77509
14354B2535215R47175O45833M47784M75182R1718J183406O38140N77955J068507
14345B8610915P06260O68299O73712Q49213R97864K43908J573520R35200N84272
14336C5843163J482441J212784Q32270Q30152K007719Q58489J638513J004281
14328D5709812J657503J349975J886019J463680J850525J866448J711288K082075
14320E9577325K080336K268693K077338K378209K633528K468145L044807K997126
$$ plain form
14383 12857555 13567015 13339692 13499576 14257779 14406628 14603615 14834680 14840004 15012161 15554877
14373 15554877 15997053 16298991 16349808 16363717 17301166 17373541 17795944 18309327 18099359 18776329
14363 18776329 19172072 19601093 19982590 20598479 20490887 21377375 21799123 22357706 22535215
14354 22535215 23482390 24128223 24576007 25051189 25142907 26326313 26964453 27542408 28610915
14345 28610915 29317175 29985474 30659186 31508399 32506263 32750171 34323691 35258891 35843163
14336 35843163 37325604 38538388 39370658 40200810 42208529 43067018 44705531 45709812
14328 45709812 47367315 48717290 50603309 52066989 53917514 55783962 57495250 59577325
14320 59577325 61657661 63926354 66003692 68381901 71015429 73483574 76528381 79525507
14312G9525507L212276L109227L655273L927470L433365M144652M637320M414639
14304A10059729M848721N170322N807739N707278O153036O327239P054270P661530
14296A58789864P823194Q130262Q800938R422926R870002J0201806J1276393J1424602
14288B35739987J1880175J2595788J3355755J3717451J3995708J4506763J4653314
14281C30444941J5104746J4993705J4605125J4530686J3693086J2565521J1592970
14274D27530780J0230048Q230471M788865P224j783604k491899k438907k990948
14266D41082030o817915q155976q543309r647251j1293658j3073406j4080261
14259C69470254j5234386j5447614j5661198j5751441j5059198j3837826j3600991
$$ plain form
14312 79525507 82737783 85847010 89502283 93429753 96863118 101007770 105645090 110059729
14304 110059729 114908450 120078772 125886511 131593789 137746825 144074064 151128334 158789864
14296 158789864 166613058 174743320 183544258 192967184 202837186 213038992 224315385 235739987
14288 235739987 247620162 260215950 273571705 287289156 301284864 315791627 330444941
14281 330444941 345549687 360543392 375148517 389679203 403372289 415937810 427530780
14274 427530780 437760828 445991299 450780164 450787388 449003784 446511885 444072978 441082030
14266 441082030 434264115 426108139 417564830 407917579 396623921 383550515 369470254
14259 369470254 354235868 338788254 323127056 307375615 292316417 278478591 264877600
14252B64877600j3737224j2355964j2415302j1115731j1360697j0166345r481318
14245A84245019r251475q179141p833229p686945p400839o771561o508054n671423
14237A24942352n189077n618775n170243m661905m252922l922793m047951l784848
14229H8293838l548791l299716l254734k983562k717254k682732k830065k303363
14221F4673621k552296j576527k219583k188445j504888k051115j677057j378917
14213D9524793j343151j529135j877924j319496j305263j169266m09923j408853
14205C9161782j273752j040914j299478q20199o54190o84133j074029r89524p44042
14196C0581521j054717k89483r74743n87306p06981n65324r64225j16489r09037
$$ plain form
14252 264877600 251140376 238784412 226369110 215253379 203892682 193726337 184245019
14245 184245019 174993544 166814403 158981174 151294229 143893390 137121829 130613775 124942352
14237 124942352 119753275 114134500 108964257 104302352 100049430 96126637 92078686 88293838
14229 88293838 84745047 81445331 78190597 75207035 72489781 69807049 66976984 64673621
14221 64673621 62121325 60544798 58325215 56136770 54631882 52580767 50903710 49524793
14213 49524793 48181642 46652507 44774583 43455087 42149824 40980558 40570635 39161782
14205 39161782 37888030 36847116 35547638 34727439 34073249 33389116 32315087 31325563 30581521
14196 30581521 29526804 29237321 28262578 27675272 26968291 26402967 25438742 25322253 24413216
14187B4413216o76803l60805o66467m17884l17087n17919m12311o80686o44257
14178A9718997p2246l60990k87001l19877k19399j007042j55517k85035l42951
14169A6668939m35074k22827n63950j14185j65728o13408J06026j70323m35287
14160A4054183k00466k11387m81858j39960M0392l49617J2847j8197m59025j82843
14150A2064069k98532k38157m58496m2780k38701M402j40926m50633q0046j67713
14140I952487m05208J93216J64145p62156r103k9162k5036R9536l47102l74461
14130H457156J02573r8414n6413q7325k73075l4317m0560k14416l01913J25514
14120G578810n5949l70607o8586k23479K60699j36593k8406k81042P2926j80894
$$ plain form
14187 24413216 23736413 23375608 22709141 22291257 21974170 21456251 21043940 20363254 19718997
14178 19718997 19646751 19285761 18998760 18678883 18459484 17452442 17296925 17011890 16668939
14169 16668939 16233865 16011038 15447088 15332903 15167175 14553767 14659793 14489470 14054183
14160 14054183 13853717 13642330 13160472 13020512 13060904 12711287 12724134 12705937 12246912 12064069
14150 12064069 11765537 11527380 11068884 11026104 10787403 10791805 10650879 10200246 10120200 9952487
14140 9952487 9547279 9740495 9904640 9142484 9133381 9104219 9079183 9178719 8831617 8457156
14130 8457156 8559729 8461315 8404902 8317577 8044502 8010185 7969625 7755209 7453296 7578810
14120 7578810 7522861 7152254 7083668 6860189 7120888 6984295 6955889 6674847 6747773 6566879
14110F566879l697l51736K9744J77260n03568K09499k65961J25661l46530N60570
14100F198121o66015J65690r9061O4365J95557n30834n3538J32571K2972k39187
14090E190641R0371j42864k95163L03487k44550j21007n3342P4543j31340O9354
14080D740130k1517l72754L07070l28853p084k93277K72580j86510P7352k27914
14070C959223J28557M84j7053J39705m145m31524j32868M05677j66840J87630
14060D068846p1921m34458N82215m24645L42938p12992L39810j13283r3415K58226
14050C741321m24646j21580N8258l34375N18930k90547L36367l74272j15690K64378
14040C258144j03446j91180p432q4407j759O0708o1029j9435J97519K22771m18152
$$ plain form
14110 6566879 6563182 6211446 6241190 6418450 5914882 6124381 5858420 5984081 5637551 6198121
14100 6198121 5532106 5697796 5598735 5663100 5858657 5327823 5274285 5406856 5429828 5190641
14090 5190641 5281012 5138148 4842985 5146472 4901922 4780915 4727573 4802116 4670776 4740130
14080 4740130 4718613 4345859 4652929 4324076 4316992 4023715 4296295 4109785 4187137 3959223
14070 3959223 4087780 4088264 4071211 4210916 4206771 3775247 3642379 4048056 3881216 4068846
14060 4068846 3996925 3562467 4144682 3720037 4062975 3349983 3689793 3576510 3483095 3741321
14050 3741321 3316675 3195095 3253353 2918978 3437908 3147361 3483728 3109456 2993766 3258144
14040 3258144 3154698 2963518 2956086 2871679 2869920 2930628 2869599 2850164 3047683 3270454 2852302
14029B852302J00862m1406O35l8707j42456L16473n10657Q862n3842J98499L6188
14018B726753m17499j4175j397l57450J71522M29791l42080K89034m37603J79265
14008B226161o9541J68764j90552J5072Q4448J1994o1101j58559J67999m85735
13998A708950J23175J59286r4683m1157k4272L77984J51719j85808J73199M21217
13988B769610K642279P327525J9728147Q177500j5226030j1567065m960146k562521
13980F329299j306865n13303j027358k96138r9809j47395l24936k31462L53388
13971B735421k88914Q6010n3688j88k70313j10514j42127N08720l21704J15007
13961B257710j29474n25971L71935k30700J95578j08628J22934j96004K7064J10442
$$ plain form
14029 2852302 2953164 2911758 2912393 2873686 2731230 3047703 2537046 2545908 2492066 2690565 2726753
14018 2726753 2309254 2295079 2293682 1936232 2107754 2537545 2195465 2484499 2046896 2226161
14008 2226161 2156620 2325384 2134832 2149904 2234352 2246346 2185245 2026686 2194685 1708950
13998 1708950 1832125 1991411 1896728 1855571 1831299 2209283 2361002 2175194 2348393 2769610
13988 2769610 5411889 12739414 32467561 40645061 25419031 13851966 8891820 6329299
13980 6329299 5022434 4509131 3481773 3185635 3085826 2938431 2613495 2382033 2735421
13971 2735421 2446507 2532517 2478829 2478641 2208328 2097814 1955687 2464407 2142703 2257710
13961 2257710 2128236 1602265 1974200 1743500 1939078 1830450 1953384 1757380 1784444 1894886
13951A894886r5973R8163k02909R2497j14380R1018j59001J38494J24744q3994
13941A783545k60566K02657j96441j9017J17284L1575J57034l33704k10944R2970
13931A364393K87685K34083j70034j51698k80655J41771k4751K67358k93595N48687
13921A923244q92987N05582p2728n3052J05477k89069n8811K1703Q5174J11231
13911A385764r7294l23554L85098O5523Q4263l2667j8515j88177M0M15669m69709
13900A206441j1460L04277l10404j48228N21013l37193N2239P195Q6479l00544
13890A069815j6993R8236P8768j7097L70119j57533r345k22931j70552M2258J53714
13879A218459k21721m1764K64492J31784m14093K14935K0081n0952P0941o6885
$$ plain form
13951 1894886 1798913 1897076 1694167 1786664 1672284 1763302 1604301 1742795 1867539 1783545
13941 1783545 1522979 1725636 1529195 1510178 1627462 1659037 1816071 1482367 1271423 1364393
13931 1364393 1652078 1886161 1716127 1564429 1283774 1425545 1400794 1668152 1374557 1923244
13921 1923244 1030257 1535839 1463111 1410059 1515536 1226467 1167656 1189359 1274533 1385764
13911 1385764 1288470 964916 1350014 1415537 1499800 1467133 1448618 1260441 1260481 1676150 1206441
13900 1206441 1194981 1499258 1188854 1040626 1561639 1224446 1276685 1283880 1370359 1069815
13890 1069815 1052822 1151058 1229826 1212729 1582848 1425315 1415970 1193039 1022487 1064745 1218459
13879 1218459 996738 954974 1219466 1351250 937157 1152092 1172173 1121221 1192162 1125277
13869A125277k48073K6295J28828k0108l2926J57911n5490K1468k09431L03273
13859A197024j47010k37010K12882J01339l81885L0188K15910l0518P6076k10852
13849H26144J3679j35631O2142J76796J18423m66661K80742L24620l61375J8539
13839H57418L84881k93845m9992J47161K7719m79509R9490J03152l0371Q5736
13829H51840K11018k29386j50962J04276o792N2286K44232m05640m3658O01725
13819A228939n55383N4690n8682L56762m40405J75625O2355m9581R4575J6496
13809H85391m4107k01358L11029m65823q0727K65971Q6016j33433L3712M0407
13799F97078j80757J85323q7872J85118q5478K42959j42703r7084j71001J10261
$$ plain form
13869 1125277 877204 903499 1032327 1012219 979293 1137204 1081714 1103182 893751 1197024
13859 1197024 1050014 813004 1025886 1127225 745340 775528 991438 960920 1036996 826144
13849 826144 839823 704192 766334 943130 1061553 594892 875634 1200254 838879 857418
13839 857418 1242299 948454 898462 1045623 1073342 593833 693323 796475 766104 851840
13829 851840 1062858 833472 682510 786786 779994 832280 1076512 670872 627214 1228939
13819 1228939 673556 728246 669564 1026326 585921 761546 823901 774320 868895 885391
13809 885391 841284 639926 950955 485132 404405 670376 756392 622959 656671 697078
13799 697078 516321 701644 613772 798890 713412 956371 813668 716584 545583 655844
13789F55844k39868J80893l4956K59924k16760K89863n9114l40191K24825M7328
13779G67788J85820l1242l10999K79833q4402o9019o3820Q5781l734J09796j60484
13768G05318j53028K28173j59341N8098j49817P7742K57923D31584J33166k522
13758E62228j54359M13626p9391k01857K32910B92327L02432j32086j09151M50983
13748H04505k42127p6267m7092L77343J5789C44724L60850l35804q2369K19085
13738E06486M44176l18097k10498M9930m0623N954J29290j81444J61423L40786
13728H87383l72304j16248P9999L2072p7143j45451J53497J34391k3944o2303
13718D89949j08544M32851C65246K60142j24617B10746N84684o8377B73786O58038
$$ plain form
13789 655844 415976 596869 561913 821837 605077 894940 835826 495635 720460 767788
13779 767788 953608 922366 611367 891200 806798 737779 673959 759740 756006 865802 705318
13768 705318 552290 780463 621122 679220 529403 607145 865068 431584 564750 562228
13758 562228 407869 821495 742104 540247 773157 292327 594759 462673 353522 804505
13748 804505 562378 486111 439019 816362 832151 344724 705574 369770 287401 506486
13738 506486 950662 632565 422067 471997 431374 437328 566618 385174 546597 887383
13728 887383 515079 398831 478830 510902 433759 288308 441805 576196 552252 489949
13718 489949 381405 814256 365246 625388 500771 210746 795430 727053 273786 931824
13708I31824l58973j65769Q0791j81895L40939P2449k07209L44347k76472l5168
13698E44864K40895C0360M41440K02838k11567L68535C95128k1438E7165K96023
13688C53188o5105L68410r4688B78689N44432l34547J5276l0274o0717k4325L66745
13677G55279l15970L27092C34363M9853J14315B41202R9692K10422F9527D319
13666F93343p7178B54495J62663j12940O0580K71268j63699o827e0513C00221
13655C13089K80054k40214J72408o9324A77973k6683J29673J78235j9502j31745
13645C07951K39871B38153p8663K83244J6483O9491j61064O8003M0j31325K72462
13634E76824j87073j52054K38846K45439k47127n0918c6972A98169L01901p6898
$$ plain form
13708 931824 572851 407082 487873 305978 646917 719366 512157 856504 580032 544864
13698 544864 785759 30360 471800 674638 463071 831606 395128 373690 57165 353188
13688 353188 288083 656493 561805 278689 823121 488574 503850 473576 412859 388534 755279
13677 755279 439309 766401 334363 384216 498531 241202 340894 551316 69527 4319
13666 693343 616165 254495 417158 304218 364798 636066 472367 465540 -50513 300221
13655 313089 593143 352929 525337 456013 177973 151290 280963 459198 439696 307951
13645 307951 547822 238153 159490 442734 459217 528708 367644 435647 435687 304362 576824
13634 576824 389751 237697 476543 721982 474855 423937 -36972 198169 500070 423172
13624D23172r9564A11649N50568B18347l1141K90l4337R8062K61900A75526L61059
13613E36585K74255C86170A75420K58082A89170L92843j82210F7178L35278p6694
13603C25762l2770j24575o0235M70276K8984A33930E8190L860K69659G1604K80953
13592C52557j08624J89512A98704k2115L5482K77010j16794H0366K83846B6445
13581E15824A03261A3061J24550K05507J88912B30131L04552k49135q5632n8137
13571A41779P2406J74504M4633A66635o0797O2691M77157j51982j41465j11760
13561B40479L62578A74482J40275J04485A55854K25017J56058G3914M74455j21017
13551D27352j80540M6564J03613m1650r9734J05770g4534E35572k52906K95492
$$ plain form
13624 423172 323608 111649 662217 218347 187206 187496 153159 251221 513121 175526 536585
13613 536585 810840 386170 175420 433502 189170 582013 399803 67178 402456 325762
13603 325762 292992 168417 108182 578458 607442 133930 58190 62050 331709 71604 352557
13592 352557 243933 433445 198704 176589 212071 489081 372287 80366 364212 26445
13581 515824 103261 13061 137611 343118 532030 230131 534683 285548 199916 141779
13571 141779 214185 388689 433322 166635 105838 168529 645686 493704 352239 240479
13561 240479 603057 174482 314757 419242 155854 380871 536929 73914 548369 427352
13551 427352 246812 293376 396989 355339 255605 361375 -74534 535572 282666 578158
13541E78158j08518F585J87656a44361A15221J00306J96986r1734J33387k19330
13531B34836K02081C4725N64513I3526K8679K6780J43594j15840K57724A29262
13520B47037j8073Q7152J55643f1658A58376L71360A14885L39313j34449A15237
13509C25695J15727P9185a5285B50370L21960d5597B50111J87807O7018k35373
13499B69563n9242L43816H0649B0906J90602Q373J64111j03533j2199j19693K02852
13488C51419a62772A85818H0521N7157P9334o6704f9149A73026K27766j50447
13478B50345D3675J32244J64364j13086J45665e0121k228B98506h1508C05327
13467B16994L6279p1125j5469n008a58384k2792E71144k46592O5848j44231H1584
$$ plain form
13541 578158 469640 6585 194241 -144361 115221 215527 412513 320779 454166 234836
13531 234836 436917 34725 599238 93526 122205 148985 292579 176739 434463 129262
13520 247037 228964 316116 471759 -61658 158376 529736 114885 454198 319749 115237
13509 325695 441422 520607 -15285 250370 572330 -45597 250111 437918 504936 269563
13499 269563 210321 554137 80649 20906 211508 219881 383992 280459 268260 148567 351419
13488 351419 -162772 185818 80521 137678 217012 150308 -69149 173026 400792 250345
13478 250345 43675 175919 340283 227197 372862 -50121 -52349 298506 -81508 305327
13467 216994 253273 182148 166679 161671 -158384 -181176 571144 324552 390400 246169 81584
13455E154O12354B34083N4615r6071j8326N3949O4628o8886K17493B13313J53290
13444C66603R6550j72858E1457q010j4136J89867A07408M65364k44844A35931
13433A01498e6671A47738a61008A77635q3873J19086o4101n8373f3333C80321
13422I390L58576j14130a11364E44306B45242J4675J53818n7957K28850B18439
13411E05526B4117J79175J64843a08339b631D02533j57310f5478A42145J20275
13401B62420j27204b4322A95689L19884d6208B21591H2172g8331B90836M5741
13391C36577q6918B8221M15712b8700A76585e8450A12467L39105j21334J38950
13381D69188k10170o915B1298M2743a35816A99384a11916E01634A31835b01885
$$ plain form
13455 5154 617508 234083 288698 192627 174301 228250 292878 223992 441485 213313 366603
13444 366603 463153 290295 51457 43447 29311 219178 107408 572772 327928 135931
13433 101498 -56671 147738 -161008 177635 93762 212848 148747 90374 -63333 380321
13422 9390 367966 253836 -111364 544306 245242 259917 413735 355778 584628 218439
13411 505526 24117 203292 368135 -108339 -2631 402533 245223 -65478 142145 262420
13401 262420 135216 -24322 195689 515573 -46208 221591 82172 -78331 290836 336577
13391 336577 249659 28221 443933 -28700 176585 -58450 112467 451572 330238 469188
13381 469188 259018 252103 21298 64041 -135816 199384 -111916 501634 131835 -201885
13370B17800q6360N0011K651M02485B19269J67515A39410a83249D13798J9439
13360D33237A21338J22127J20707a1479E6938J38111i2199A68991a58188o330
13350a64518D35670A74019l6036N26582k36000j91890K38716j72301j10619n8486
13340A33985b1431C45259J59874A49800m8775L11865J28626A75900f0457B23762
13329C58759L1448G7309P8312J20792L0032l0319R6313A84852R8455o8517P3987
13318B88777j04613A0579N5139K52105M014j47672C2418J70937J47409C6381M8379
13307H4760a474A41046P3301J62094C2722A3118P7095m3505N1180a94279B23962
13295C07083R9231A92311K08279H7552N8603O9023K315e0649B11087G3328K79671
$$ plain form
13370 217800 131440 181451 184102 586587 219269 386784 139410 -183249 413798 433237
13360 433237 121338 243465 364172 -11479 56938 195049 -92199 168991 -158188 -164518
13350 -164518 435670 174019 137983 664565 428565 236675 475391 303090 192471 133985
13340 133985 -21431 345259 505133 149800 101025 412890 541516 175900 -60457 223762
13329 358759 390207 77309 155621 276413 306445 276126 372439 184852 283307 214790 288777
13318 288777 184164 10579 65718 317823 321837 174165 32418 203355 350764 36381 84760
13307 84760 -1474 141046 214347 376441 32722 13118 90213 46708 97888 -194279 223962
13295 307083 406314 192311 400590 87552 146155 215178 217493 -50649 211087 73328 352999
13284C52999G2923K65948Q8771b4206B8136M9946P3225b846j85010B34697K78779
13273E13476H9720R9938I1201a11539q5869I5518M9472a16220A11819J4134P1158
13262A97111d6446B97599H3145K63239g0043A12604c01292J22325A1115J50183
13252A61298o2410C0868A4999P4845g1727C42263A37795j7161n8518J6888f3962
13240A05960Q3339D8346K40240J56907E4229g0325K9860B9465J97002g3499C24695
13228A34397L6000h0281B11101O4176a3702q936C152J74711b5591q73A85398a36001
13215B41299B4119J13817J07680A11625M6677o1794L13847j66843o6500H8139
13204C1973P7324J66416A37516J10790i3507K4626c4307n8479j01557f2123a5290
$$ plain form
13284 352999 72923 338871 427642 -24206 28136 78082 151307 -2846 -187856 234697 513476
13273 513476 89720 189658 91201 -111539 -197408 95518 144990 -116220 111819 125953 197111
13262 197111 -46446 297599 83145 346384 -70043 112604 -301292 -178967 11115 161298
13252 161298 98888 30868 14999 89844 -71727 342263 137795 120634 62116 79004 -63962
13240 105960 189299 48346 288586 445493 54229 -70325 -40465 29465 226467 -73499 324695
13228 134397 170397 -80281 211101 275277 -13702 -22638 3152 177863 -25591 -26464 185398 -136001
13215 241299 24119 137936 245616 111625 158302 96508 410355 243512 177012 88139
13204 31973 109297 275713 137516 248306 -93507 -68881 -34307 -92786 -194343 -62123 -15290
13192b5188l176H4554C7193a73606B14150I3122a53947C72319E0474J90286I9140
13180a33754C39649Q7364f1351o0973A52965e26442a44269B35639n191G050b41537
13168C014a07784B41005G9108c8874B28309e2095A80716E9107J51048A01251a93355
13156c67934A60311h7271A94753r2195h3460C947J04593J6665j6817Q8680b10683
13144C612J8060d6612g194A71125a7743B34504D0299R1271D5275M17127g7234
13132c4884B96361C324K62926b39030E630b47694Q1117P6306o3925G1606g6197
13120A55731c41773A98425m0856K20085j10528j20892L2058F9050j1245P48P5648
13109A34201K0498k2048b91534d8850B89376c388A93560M063j3379E3790R8207
$$ plain form
13192 -25188 -28364 84554 37193 -173606 214150 93122 -153947 372319 50474 240760 99140
13180 -133754 339649 427013 -61351 -122324 152965 -526442 -144269 235639 230448 7050 -241537
13168 3014 -107784 241005 79108 -38874 228309 -52095 180716 59107 210155 101251 -193355
13156 -367934 160311 -87271 194753 102558 -83460 3947 108540 125205 108388 197068 -210683
13144 3612 21672 -46612 -7194 171125 -17743 234504 40299 131570 45275 462402 -77234
13132 -34884 296361 3324 266250 -239030 5630 -247694 -166577 -90271 -154196 71606 -76197
13120 155731 -341773 198425 157569 377654 267126 146234 178292 69050 57805 58553 134201
13109 134201 154699 132651 -291534 -48850 289376 -3388 193560 197623 184244 53790 151997
13098A51997Q169i0851a82A53889d7226A10205e1935B42484o6174a45210J5057
13087a30153F7078M61786A24162J94099a49838B32359J83970a76048k81d4168
13076e8433G8691a06842A74202b36699J09330C61680j8941F0210O1520E3259a47959
13064A8364N4214j8460N6158a17067A01401a55515b919A06343K5589C2685d2880
13052A82530b48709c5345C65222n8903A03017Q6484j4637g8002A85559b4669p1709
13041i6378C33858j65265A1176J70059J00724j7114i2702C73303g9861j02423
13031a82284f6933j58599B45762p0999N7331I2100h4498K5608A14240L7239b70210
13019C05310a99045F9397k79K6187J27040N439c642D2849A446R6443D0550a5729
$$ plain form
13098 151997 160166 -90851 -182 153889 -47226 110205 -51935 242484 176310 -145210 -130153
13087 -130153 67078 528864 124162 318261 -149838 232359 416329 -176048 -176329 -44168
13076 -58433 78691 -106842 174202 -236699 -127369 361680 342739 60210 121730 53259 -147959
13064 18364 72578 54118 110276 -117067 101401 -155515 -2919 106343 131932 32685 -42880
13052 182530 -248709 -35345 365222 306319 103017 189501 174864 -78002 185559 -24669 -96378
13041 -96378 333858 168593 11176 181235 281959 264845 -92702 373303 -79861 -182284
13031 -182284 -66933 -225532 245762 174763 232094 92100 -84498 -58890 114240 151479 -270210
13019 305310 -199045 69397 69118 95305 222345 227784 -3642 42849 1446 97889 40550 -15729
13006D28661Q848D5105K81691A17936L3042c8469C2447J49650H6479o263P1498
12995A51714c04433a43104D6933e2603k47618J33934C81223h3147B36348F250
12984i9799K3517I673K02174a02263k2375B62796b6099A00606k5480J56119h3459
12972g509A95519k8125j7076A9779a85910F703i8240F3198e5771B7171f4561B91489
12959C20109G6170d5598I1788M03b19209b7320j20610O4652k50041f7341j28359
12948a95700C01957a23465j52307k2822J00773E9177b74397I5010C7032L6906
12938G3938O0898c4099l5959j22987A10503A2920g0778C53105k8843n8286a34344
12926A37965k4717k1898k4875b22824A51124B2989O6354J7922J56039g0052H2511
$$ plain form
13006 428661 437509 45105 326796 117936 150978 -38469 32447 182097 86479 80216 151714
12995 151714 -304433 -143104 46933 -52603 -300221 -166287 381223 -83147 236348 6250
12984 -99799 -76282 9673 211847 -102263 -124638 262796 -26099 100606 75126 231245 -83459
12972 -7509 195519 167394 150318 19779 -185910 6703 -98240 63198 -55771 27171 -64561 291489
12959 320109 76170 -45598 91788 92191 -219209 -27320 -147930 -83278 -333319 -67341 -195700
12948 -195700 301957 -123465 -275772 -298594 -197821 59177 -274397 95010 37032 73938
12938 73938 134836 -34099 -70058 -193045 110503 12920 -70778 353105 324262 265976 -134344
12926 137965 113248 91350 66475 -222824 151124 22989 89343 107265 263304 -70052 82511
12914B0336d2735h78C0449J03340a7045C82854j03435A8688K84119L517f3904
12902A29625b05760g4658B10318b01453B71796j19585k768M9590a94493D17924
12891B07540a8226r6077C371a98863A63288C964g7230I733o81L9858L25428H0049
12878b5762B46907a06138A36990C8921K158e0409C4717i6113q6033A03767c71260
12866g8064j28647C6367a307k39358L7417b477j1976j94244B96725A22857m1027
12855H1830P3605a560k13548A12376a93489B3504L8995a2763A09743B4588L3519
12844E8107b01210A28326R4021m4488a82626A43756a01906A70339a42346K3267
12834a19079B7552a16816E8178a06610B15116E4962e9844A15280J53856J29958
$$ plain form
12914 20336 -42735 -878 30449 133789 -17045 382854 279419 18688 302807 306324 -63904
12902 129625 -205760 -74658 210318 -201453 271796 152211 149443 199033 -194493 417924
12891 207540 -18226 -114303 3371 -198863 163288 3964 -77230 9733 9052 48910 374338 80049
12878 -25762 246907 -106138 136990 38921 41079 -50409 34717 -96113 -182146 103767 -371260
12866 -78064 -206711 36367 -1307 -240665 -203248 -2477 -14453 -208697 296725 122857 81830
12855 81830 155435 -1560 -215108 112376 -193489 23504 62499 -12763 109743 24588 58107
12844 58107 -201210 128326 222347 177859 -182626 143756 -101906 170339 -142346 -119079
12834 -119079 27552 -116816 58178 -106610 215116 54962 -59844 115280 269136 399094
12824C99094l6711f4467b6267p2821H8985L86086b88231f515q1137j28896A95643
12812B08163g0442A36059C443h6091k26625a11458n1607J5455A52440b0784j61679
12801a82463h4635A18405J51020a82012B7276c09718a36120A49407h0364b536
12790c0096A16247a82918j3739A99676p9975b80112A39779J6915O8129F8457c84800
12778b04844G1183f2192k44021c4245n72968a16807l03989e9581A55846a73983
12767C39310h5096C4883f4146C52149b93005d9213a4209k55477J7642C1244a33280
12755f6006D5509f7411k0563j81973c2724A7994J89978g814j48714j38422C55778
12743h1004B13282a07571j04799i3908L5985K4611A96333r1254M6986o8343a79425
$$ plain form
12824 399094 362383 -64467 -26267 -99088 88985 475071 -288231 -6515 -87652 -216548 195643
12812 208163 -70442 136059 3443 -86091 -312716 -111458 -163065 -147610 152440 -20784 -182463
12801 -182463 -84635 118405 269425 -182012 27276 -309718 -136120 149407 -80364 -2536
12790 -30096 116247 -182918 -196657 199676 119701 -280112 139779 156694 224823 68457 -384800
12778 -204844 71183 -62192 -306213 -34245 -607213 -116807 -420796 -59581 155846 -173983
12767 339310 -85096 34883 -64146 352149 -293005 -49213 -14209 -269686 -252044 31244 -133280
12755 -66006 45509 -67411 -87974 -269947 -32724 17994 207972 -7814 -156528 -294950 355778
12743 -81004 213282 -107571 -212370 -93908 -57923 -33312 196333 105079 152065 83722 -179425
12731A02138K75052a79277P854j70171A24415B7400a07769E0648O6052j7263E997
12719a34894N3772a7892k53006C79610b70795D7631J43483G8958b2847I4149m358
12708H9791R1317H4272Q4559a65771A08045C5355L20067b0124B45785a09745L4160
12697g5585m5247A7046J69178h2254A18778a05278B60722l9672a83988B04510
12686c8559H7336m3262K00320K6945b9278D4586K81897i3310b434C04856K29162
12675E34018a25279p9901C02633A06871i4362p3337B27523m912P8745c63430F8656
12663f0804j18904b4298j01435A59073M6434j9569N9603P3512C8175J8419a42900
12651B91616C4127K32670g8249C0315J89129a26082G7329g4016C33559i135F7993
$$ plain form
12731 102138 377190 -179277 -171423 -341594 124415 27400 -107769 50648 116700 99437 5997
12719 -134894 -81122 -17892 -270898 379610 -270795 47631 191114 78958 -22847 94149 89791
12708 89791 181108 84272 168831 -165771 108045 35355 355422 -20124 245785 -109745 -75585
12697 -75585 -120832 17046 186224 -82254 118778 -105278 260722 221050 -183988 204510
12686 -38559 87336 44074 244394 271339 -29278 44586 326483 -93310 -2434 304856 534018
12675 534018 -125279 -205180 302633 106871 -94362 -167699 227523 222611 301356 -363430 68656
12663 -60804 -179708 -24298 -125733 159073 205507 185938 245541 319053 38175 56594 -142900
12651 291616 34127 266797 -78249 30315 219444 -126082 77329 -74016 333559 -9135 67993
12639e02649C5110L07277E43J73994i6445B0773K52060o5194c1485A09338L56528
12628D65866A58057C3822J09402D1176L32513b58047h830A4017K13978a30913
12617A39659e3579p201F3087a42547A505J71720f8301F6540A2189J94784C5892
12605a01919E4555O7835K86338j85230G6172j9128K5066N0368J12289B7690M3967
12594G1657K29042D1985M03390A1633K23953F5964g5893B7373i4376D37879D2595
12582C18916a38211I8450L56746f6468B13208f4164L1554A21156f5925c1328B17457
12570D18871j56588E0475i0116B63023b10561f9144D060f786A51489C2175h2690
12558A96043f1998m3283B51069f9433C38413b81461a23903B69449a41878j08607
$$ plain form
12639 -502649 35110 342387 543 174537 -96445 20773 272833 207639 -31485 109338 465866
12628 465866 158057 33822 143224 41176 373689 -258047 -8830 14017 227995 -130913
12617 139659 -53579 -60780 63087 -142547 1505 173225 -68301 66540 12189 206973 35892
12605 -101919 54555 122390 408728 223498 76172 57044 82110 132478 244767 27690 71657
12594 71657 300699 41985 445375 11633 235586 65964 -75893 27373 -94376 437879 42595
12582 318916 -138211 98450 455196 -66468 213208 -64164 -32610 121156 -65925 -31328 217457
12570 418871 262283 50475 -90116 263023 -210561 -69144 4060 -6786 151489 32175 -82690
12558 196043 -61998 -105281 251069 -69433 338413 -281461 -123903 269449 -141878 -250485
12548b50485i0850c4828A27563B7945Q7073n7298J66086I3467a7007H9542a68750
12536D65155b69736A95705A5328L1863b6167A27603a11818A18149M3773c52585
12525d3898G2272M6269J27200J7332a7796k17190A11043a18738c6367j63799C03536
12513b08521k22119h5407j35760E6033M6191p102a07076B24731a97731h8134C60591
12501A64012a17098A61536o6809K14633c1497k92821B33097a803k9990I1834B1443
12489H8291f9621A60436L832b53799J00153B92434e7775A37358B8216P9552J9977
12478A27745Q0564k2307b53002J12690B12525b81976A59390Q3173I0146C8051
12467A30325b58947B8286a42356C5666J09813E6279L4217C0116c6256n6543j09567
$$ plain form
12548 -250485 -90850 -34828 127563 27945 115018 57720 223806 93467 -17007 89542 -168750
12536 465155 -269736 195705 15328 47191 -26167 127603 -111818 118149 161922 -352585
12525 -43898 72272 118541 245741 263073 -17796 -234986 111043 -118738 -36367 -200166 303536
12513 -208521 -430640 -85407 -221167 56033 102224 95122 -107076 224731 -197731 -88134 360591
12501 164012 -117098 161536 94727 309360 -31497 -324318 233097 -1803 -31793 91834 21443
12489 88291 -69621 160436 164268 -253799 -153646 292434 -57775 137358 28216 107768 127745
12478 127745 208309 186002 -253002 -140312 212525 -281976 159390 242563 90146 38051
12467 130325 -258947 28286 -142356 35666 145479 56279 90496 30116 -36256 -92799 -202366
12456b02366A47265c0807Q506D3523a03905b2208i077G7108a28178B01847c8985
12444d11840K01894H386K43472D5254b8226p3116A32325a33380G2354e2708G4937
12432A78196a10030r3108A1722Q9669l5298M08718b1780q7576C49969e1538k10319
12421b61857i2276M4875H7898R0436a50290C11222C1159G352J78179a4873k03064
12410b17937R2360j88477a48684D0136a12632B29204d78446b07416g4632B25506
12399A85383b40848B58440B3945k697g2992p0306j73444B134e620j22039C12801
12387b5116j56828m8925A04904c20312a05025j036B23198H8760b96131G3019d5342
12375a01178D3849a64322L2062n8327K7749E7881J25593A5715K06669k5303r6098
$$ plain form
12456 -202366 147265 -30807 -22301 43523 -103905 -22208 -9077 77108 -128178 201847 -38985
12444 -411840 -209946 8386 251858 45254 -28226 -101342 132325 -133380 72354 -52708 74937
12432 178196 -110030 -203138 11722 101391 66093 474811 -21780 -109356 349969 -51538 -261857
12421 -261857 -92276 -47401 87898 178334 -150290 311222 31159 7352 185531 -14873 -217937
12410 -217937 -125577 -314054 -148684 40136 -112632 229204 -478446 -207416 -74632 225506
12399 185383 -240848 258440 23945 21248 -72992 -143298 -316742 2134 -5620 -127659 312801
12387 -25116 -181944 -230869 104904 -320312 -105025 -106061 223198 88760 -296131 73019 -45342
12375 -101178 43849 -164322 -132260 -190587 -162838 57881 183474 15715 222384 197081 100983
12364A00983e8065J7093q4487e4105E9715k8282J5013b94417G800a61362d8517
12352h1979k53868A99149I8252B9614c15042O0286E1728J63252c15743B28800
12341C7064k480O9821L05710A52292P4482d8353B30489l5023E9970Q9411d3625
12329B22603e7528k4698E5283J76224E7406J53488K31907A23900K05500h9043
12318C4563R9987M5731a4249B0441d0238l00717D8412d3199r0312h608r3762E0576
12305d4655j31610k830j14015J45532H4672b46753d0904D26956b05399E1529b67926
12293a21794B08436i6047H2510c07962C78279a46533k7357C69466K55385a17828
12282A19801i7043B17269J90475j75258e17859J97096A48107K86721I9651h192
$$ plain form
12364 100983 -58065 -40972 -125459 -54105 59715 31433 46446 -294417 7800 -161362 -48517
12352 -81979 -335847 199149 98252 29614 -315042 -254756 51728 214980 -315743 228800
12341 37064 34584 104405 410115 152292 226774 -48353 230489 195466 59970 149381 -43625
12329 222603 -57528 -82226 55283 231507 57406 210894 442801 123900 329400 -89043
12318 34563 134550 180281 -14249 20441 -40238 -340955 48412 -43199 -133511 -8608 -102370 50576
12305 -44655 -176265 -179095 -293110 -147578 84672 -246753 -40904 426956 -205399 51529 -267926
12293 -121794 208436 -96047 82510 -307962 378279 -146533 -173890 369466 624851 -117828
12282 119801 -97043 217269 407744 232486 -517859 -320763 148107 434828 99651 -8192
12271G6613a02376H0957J44832A7133K34243N5789K1841k7706A39719a09945F0283
12259A86465C2850J13595b4760A73922B441f4808D45118A64035J64646I6206K55284
12248C51490h5403n0910A67392J31123F3709n548J84990Q3628i910j15081H4111
12236B97026a10815A8291M1133L14951g3425A14218Q6145J51765b22651c834C16126
12224B72859C8592J42963G6049J20523l0654J35783j14880M4969I3731D0406f1415
12212B41154r8174l910J70734F6062j5255J15541Q8989j1722j2446O7473L0775
12201C29417A6371a26292A45401N1681c0863D16467b01407G3261K427J92048A14124
12189B13909L2294j6130K81467c2292A62999r194J7610c7014B75127K780a3045
$$ plain form
12271 76613 -102376 80957 225789 17133 251376 307165 329006 301300 139719 -109945 60283
12259 186465 32850 146445 -24760 173922 2441 -64808 445118 164035 328681 96206 351490
12248 351490 -85403 -136313 167392 298515 63709 58161 243151 326779 -9910 -124991 84111
12236 297026 -110815 18291 59424 374375 -73425 114218 200363 352128 -222651 -3834 316126
12224 272859 38592 181555 76049 196572 165918 301701 186821 231790 93731 40406 -61415
12212 241154 142980 139070 309804 66062 50807 166348 255337 243615 231169 298642 329417
12201 329417 16371 -126292 145401 197082 -30863 416467 -201407 73261 75688 267736 114124
12189 213909 246203 230073 511540 -32292 162999 153805 171415 -37014 275127 277907 -13045
12177a88789C27270O1095F4581R5928o7370J45777D6213a02849B86168a5815B00846
12165A1031c09402B29641c08116c6147I0308L440b0054A9529c9438A65898J04560
12154B70458h3458B32027L8104a28511B5437K3489K43362E4051J12141k7039m1666
12143I7487B5475J52720h7923b5751l29719D60456D6142Q1085J75328B5952a9800
12131A2840J10765a91204b6451m6812A77195h8982c1267p3153A09422a52589B42081
12119f7372B09767j6910b6300j13636A57077J85752d35026a25081j04339A67823
12108A45506b41969D7171d05888a27457I7985a74560A48475m5361K046A4387g6824
12096A39855i3800H4518J63238b01083d0029j5983k03130R5770A14407b61743
$$ plain form
12177 -188789 327270 388365 64581 160509 93139 238916 46213 -102849 286168 -15815 200846
12165 11031 -309402 229641 -308116 -36147 90308 93748 -20054 19529 -39438 165898 270458
12154 270458 -83458 232027 270131 -128511 25437 48926 292288 54051 166192 139153 97487
12143 97487 25475 178195 -87923 -25751 -355470 460456 46142 127227 302555 25952 -19800
12131 12840 123605 -191204 -26451 -73263 177195 -88982 -31267 -104420 109422 -152589 242081
12119 -67372 209767 192857 -26300 -139936 157077 342829 -435026 -125081 -229420 167823
12108 145506 -241969 47171 -405888 -127457 97985 -174560 148475 103114 105160 14387 -76824
12096 139855 -93800 84518 247756 -201083 -40029 -56012 -259142 -163372 114407 -261743
12085C3460c1768n4727j66704A4391b16885H1631K88529b06780p147B04138b23531
12073D63447f7940A145944O18255l41328D85515a71672C27432m9398J6055a71723
12062a31769B13965a72562C54630a33189C63103a6421A80507L8365d4844n3953
12052i8797B1177L04927A51895c20416Q4391k6183C20761F6335a6636C686N6P640
12040A1382L8765f6179j68800m3242a28479a5369G3855a72128C03353A12140J35178
12029B47318E6638b6124j19803K3494F8727J20156a5856l1274o7852B54148I6218
12017d0211Q840A49951n057N9628a60712A19245B7891J0432b09547N9154g4777
12005a0229j86504M2610D8042p727e0564k28630n1662A49774J0023c43806I6048
$$ plain form
12085 33460 -31768 -86495 -253199 14391 -216885 81631 370160 -206780 -213927 204138 -223531
12073 463447 -67940 1145944 1764199 1422871 485515 -171672 327432 278034 294089 -171723
12062 -131769 213965 -172562 354630 -133189 363103 -16421 180507 218872 -44844 -98797
12052 -98797 21177 326104 151895 -320416 -236025 -262208 320761 66335 -16636 3686 3742 11382
12040 11382 50147 -66179 -234979 -278221 -128479 -15369 73855 -172128 303353 112140 247318
12029 247318 56638 -26124 -145927 -122433 68727 188883 -15856 -47130 -114982 254148 96218
12017 -40211 -31371 149951 144894 204522 -160712 119245 27891 38323 -209547 -150393 -74777
12005 -10229 -196733 -154123 48042 40315 -50564 -279194 -330856 149774 159797 -343806 96048
11993A53358D5337a24176C04208c55724A45023a7915m0270l0136A21818a3464
11982D14744A5045N4924N569O6069A4728J2889e295m12551a34580k6220k38106
11971c98906a26037l499A11739L4731f0010E6995J97624a8828k94425j44438b00827
11959a19417A73758A057O5414R864b00890e9668D566L76477A32021n6705j2637
11948F2679a37743j6249K9363F9930a78240E2190a87614A14139b01444e592A99807
11936A93551c41793B16083a49868B2272a6767A68426m65o678b69986f446p0714
11925g7160j19112P8732k9029C540J45992e6630L743F4350b61115E5223J00384
11914A55607J11880d111m8967A28795a02736A42784G701b35394j04435G1989J35365
$$ plain form
11993 153358 45337 -124176 304208 -355724 145023 -17915 -58185 -88321 121818 -13464
11982 414744 15045 69969 75538 141607 14728 27617 -5295 -417846 -134580 -160800 -398906
11971 -398906 -126037 -129536 111739 146470 -60010 56995 254619 -18828 -313253 -457691 -200827
11959 -119417 173758 1057 66471 76335 -200890 -59668 4566 381043 132021 75316 62679
11948 62679 -137743 -153992 -124629 69930 -178240 52190 -187614 114139 -201444 -5592 199807
11936 193551 -341793 216083 -149868 22272 -16767 168426 167961 161283 -269986 -6446 -77160
11925 -77160 -196272 -117540 -146569 3540 149532 -56630 -52887 64350 -261115 55223 155607
11914 155607 267487 -4111 -53078 128795 -102736 142784 7701 -235394 -339829 71989 207354
11903B07354F6942m701b5760C14816g1688j90762O5326A16463b84434K6207b3642
11891a27312A79418J87016f7167p5895A57977C5257b36226E8160J39837f466B86942
11879b74743d5603a6186j45467R949d2843k31041a11411D6357b16601O8239H2963
11867c77531a46807n3733N9610q9510k1005f0825M79A7554f23555A71644R5247
11856B66891c6482D6419a25382I1342J96203q1609o7671a13364A95547b5744j63753
11845a89497D2551J22751a36432p6439F496h8415l34607b3938k50293h7345m1322
11834a28667j03914R1495A16469a88906P0579J2692o9687j22039A58699k0380
11824A38319c71986a14794A00033g9959A37563b18202b9279B41452i666k21730
$$ plain form
11903 207354 66942 62241 -25760 314816 -71688 -262450 -197124 116463 -284434 -258227 -23642
11891 -127312 179418 366434 -67167 -143062 157977 35257 -236226 58160 197997 -6466 286942
11879 -274743 -45603 -16186 -161653 -151704 -42843 -273884 -111411 46357 -216601 -148362 82963
11867 -377531 -146807 -200540 -140930 -230440 -251445 -60825 -60346 17554 -623555 171644 266891
11856 266891 -36482 46419 -125382 91342 287545 205936 138265 -113364 195547 -25744 -189497
11845 -189497 42551 165302 -136432 -212871 6496 -88415 -423022 -23938 -274231 -87345 -128667
11834 -128667 -232581 -141086 116469 -188906 -118327 -105635 -175322 -297361 158699 138319
11824 138319 -371986 -114794 100033 -79959 137563 -218202 -29279 241452 -9666 -231396
11814b31396A64175B0961n858j864a53449A84692l4658k4329c91511A51570k8095
11803A23475a04272b7027F1275a23190B20621b9009j51109P2237H0661l7114J44927
11792A88474d34099a11366E7502O4294R9923b77594A731J32111a56606f6032A93072
11780C43874I5415p372a65071O5895D760J85732L2293I450N6371a95082p478P5896
11768a26664A41060a42582A25688J0401a4388j48876G3956f5540j17699E5461
11757C9016a27341A36142a66686A79392o9808J55909J21218A3682J18154A0826
11746D12620B1828a28423B5241D857c4295H1785L9157a025B3492L3477d3969A7112
11733A82791q7708b7955A38169a88611C10601A15578C7716a27280B16210K5891
$$ plain form
11814 -231396 164175 20961 15103 13239 -153449 184692 150034 125705 -391511 151570 123475
11803 123475 -104272 -27027 61275 -123190 220621 -29009 -180118 -107881 80661 43547 188474
11792 188474 -434099 -111366 57502 121796 221719 -277594 1731 133842 -156606 -66032 193072
11780 343874 95415 88043 -165071 -99176 4760 190492 222785 9450 65821 -195082 -202560 -126664
11768 -126664 141060 -142582 125688 136089 -14388 -163264 73956 -65540 -183239 55461
11757 39016 -127341 136142 -166686 179392 109584 265493 386711 13682 131836 10826
11746 412620 21828 -128423 25241 4857 -34295 81785 120942 -1025 23492 56969 -43969 17112
11733 182791 95083 -27955 138169 -188611 310601 115578 37716 -127280 216210 242101
11723B42101K4100b52765i1164R000H2384R699J90294a05609C6013b27202D7468
11711A10743K97359a27870f0531C47145A06799R0256a18876L0801D9138A7016
11700c999G3720J56335j14054c12286A184a48356B40394b26139c0622B2861J4869
11689C7730K12233b29157i0877B06026d8762A32411k5l4884m2213L56593G8312
11677a46816A45788E9999c50753f8060A38215b6970A80234l8075a56033f03A25635
11665B49079n6618q7667M0879Q1458A11156k1573M3951E9113R2312N606F0535
11653g9360D3146b04882A90229c33864B64395j2728a9507G4408h668C62575g1936
11641a66379C3455d18335a76311C96901g3558c5936C8958C869K3192N0564j9952
$$ plain form
11723 242101 266201 -252765 -91164 -82164 82384 92083 282377 -105609 36013 -227202 47468
11711 110743 408102 -127870 -60531 347145 106799 197055 -118876 -88075 49138 17016
11700 -3999 73720 230055 116001 -312286 1184 -148356 240394 -226139 -30622 22861 37730
11689 37730 249963 -229157 -90877 206026 -48762 132411 132386 97502 55289 411882 78312
11677 -146816 145788 59999 -350753 -68060 138215 -26970 180234 142159 -156033 -603 125635
11665 249079 192461 104794 145673 227131 111156 89583 133534 59113 151425 157031 60535
11653 -79360 43146 -204882 190229 -333864 264395 251667 -19507 74408 -8668 362575 -71936
11641 -166379 33455 -418335 -176311 396901 -73558 -35936 38958 3869 27061 77625 57673
11630E7673f7358C90868A82842b7639n0542A64419a24023E7495h7514A27273B9622
11618d6238B32368a08497K9024j29717a4435m032A35021J34527a46098A52008
11607G7870h087B47597c47292A74046R3259F4105J66990m2112b84094A36561J5470
11596A52031b2442G3784i5249d0139D457b98516c770H1216f3326j89531A19319
11584C25738A3011K58924P7828q9626D3469A3354L46859I865a42543O6479B97862
11572F4740b15884C27028f0454A09492m2702K67541A40941R8658f621B98545D4975
11560g6460C02040j0460G4736i7229B10212d4937E9980a4468B99878A00672K89785
11549C90457i0412A42236g1270A88454b71290F7715b36612b0912D3070j6824M36901
$$ plain form
11630 57673 -67358 390868 182842 -27639 -78181 164419 -124023 57495 -87514 127273 29622
11618 -46238 232368 -108497 -79473 -209190 -14435 -18467 135021 269548 -146098 152008
11607 77870 -8087 247597 -347292 174046 267305 64105 231095 188983 -284094 136561 152031
11596 152031 -22442 73784 -95249 -40139 4457 -298516 -3770 81216 -63326 -252857 119319
11584 325738 13011 271935 349763 260137 43469 13354 360213 9865 -142543 -76064 297862
11572 64740 -215884 327028 -60454 109492 66790 334331 140941 239599 -6621 298545 44975
11560 -76460 302040 291580 74736 -97229 210212 -44937 59980 -14468 299878 100672 390457
11549 390457 -90412 142236 -71270 188454 -271290 67715 -236612 -20912 43070 26246 463147
11538D63147a9966j31789D112J020J82412J36822j25423r7685B2823J62055a09514
11526f0809B03798L06527H5681K86055b89023A27476h9719A71036M5004a4383
11515B08017A2053J58451D9619f8185A55933P0028C8082b41030e0168J1473l51026
11504c89721C51516A7388B923b03A27856K8081n3862K40979B443f6062a5147F045
11491A84281E2056J50548K46228C8275J30854A0555J8047K75397j01352C0623
11480B78764n7834l0908A3129a72216M6523K454A61729a5796E60958k27711r1762
11469B41485P4187A45582E7234J60663P9529N8980k1309H7974b84999B9588L46541
11458C76129a81718A40312E4012J81158n6656D9887k4710J37034J92995j76922
$$ plain form
11538 463147 -19966 -151755 4112 5132 187544 324366 198943 101258 22823 184878 -109514
11526 -60809 203798 510325 85681 371736 -289023 127476 -89719 171036 216040 -14383
11515 208017 12053 170504 49619 -68185 155933 225961 38082 -241030 -50168 -38695 -389721
11504 -389721 351516 17388 2923 -203 127856 155937 102075 343054 2443 -66062 -15147 6045
11491 184281 52056 202604 448832 38275 169129 10555 28602 303999 202647 30623
11480 278764 220930 190022 13129 -172216 -125693 -123239 161729 -15796 560958 333247 241485
11469 241485 315672 145582 57234 217897 297426 356406 335097 87974 -284999 29588 376129
11458 376129 -181718 140312 54012 235170 178514 49887 25177 162211 355206 178284
11448A78284K01126A7756J08524a25471F3137J52927b49619G6240h3125D14288
11437C1985b8376C59385d13139J48462B6129K09879c0704r1809j0664c1742o9612
11426a01354A50651J6133F0243d9057B02586K75409o0947H7488a78999L2597E4227
11414B01969q4909a45293d0205A98647f4309G8291a10192a3416k826j62727A15794
11402E8825J63000a78756N0562B62267b51840E5462N8000O2813a50312D34099
11391a90086c3874A11092L9490D0849L26217A77320f5402m20382a16997A69946
11380A02871J10473c682A10452a61152A01499m2273J46907b18456A23085f685
11369b2366k22904f228k18383B59634h3409A54479b02738n8864A70985J19346
$$ plain form
11448 178284 379410 17756 126280 -125471 63137 216064 -249619 76240 -83125 414288
11437 31985 -28376 359385 -413139 -264677 26129 236008 -30704 -122513 -133177 -31742 -101354
11426 -101354 150651 166784 60243 -49057 202586 477995 417048 87488 -178999 -146402 54227
11414 201969 117060 -145293 -40205 198647 -64309 78291 -110192 -13416 -16242 -178969 115794
11402 58825 221825 -178756 -128194 262267 -251840 55462 113462 176275 -150312 434099
11391 -190086 -33874 111092 150582 40849 367066 177320 -65402 -485784 -116997 169946
11380 102871 213344 -3682 110452 -161152 101499 59226 206133 -218456 123085 -6685
11369 -22366 -245270 -6228 -224611 259634 -83409 154479 -202738 -261602 170985 290331
11359B90331G3518O9181O3023F9439a20245A57877c60147O1821a1623q5779j90345
11348b87747J20053n3803D360K71269i1849K8046B8653K49475A07459D8855h352
11336D4865b10341g5914F7871b62776g1493i793j47708a3298n0976a1581q1682
11325i3263r4282H0738b83027a22720A58958a26334c4359j28887D13050A25361
11314a72361g0292B63970i3374b9331B07499j01859a12386C85939A12266c3980
11303D5345M611a86015b3805G5160l931J11781A0278a70351A28388b32201G2161
11291A17077b04872f5513B15957a59538J9748c3497A04073a54297e1094k07871
11281b58965B0177a5816A34480g2895k05434L4854A01533L74421a86554A28404
$$ plain form
11359 290331 73518 142699 205722 69439 -120245 157877 -360147 -298326 -11623 -97402 -287747
11348 -287747 -167694 -221497 4360 275629 -91849 -63803 28653 278128 107459 48855 -8352
11336 44865 -210341 -75914 67871 -262776 -71493 -9793 -157501 -13298 -64274 -11581 -93263
11325 -93263 -187545 80738 -283027 -122720 158958 -126334 -34359 -163246 413050 125361
11314 -172361 -70292 263970 -93374 -29331 207499 105640 -112386 385939 112266 -33980
11303 45345 49956 -186015 -23805 75160 71229 183010 10278 -170351 128388 -232201 72161
11291 117077 -204872 -65513 215957 -159538 -139790 -33497 104073 -154297 -51094 -258965
11281 -258965 20177 -15816 134480 -72895 -278329 -243475 101533 475954 -186554 128404
11270a35321M5068K8265J0680p8743B07948h8449C97119c02378A36712b82170
11259b5819A9504B05L33277b29288j9225e76E6730c39155b8148A4617c16864D1096
11246c12096J05779h7961l08349d5987B55792c384q3938K9569B51440a71323k5254
11235a96577O1806B39110H5229P098N4056m7947K00332b39209G7770c60763J39913
11224b20850A56214b50921J10753j15183a3800l33183Q9811J04406B02296b07298
11213G4502h0566B11327j05511O3580J83052c50156a7546B38039A06598b7705
11202f821A05654b0224L272r5000B05287b60128B4271b28188d4807A16905c25053
11190a70828L360L7034m03894c4872A93399a93772A3075a65832k6777L369A05987
$$ plain form
11270 -135321 -90253 -61988 -51308 -130051 207948 -88449 397119 -302378 136712 -282170
11259 -25819 19504 205 333482 -229288 -248513 -576 56730 -339155 -28148 14617 -316864 41096
11246 -312096 -206317 -87961 -396310 -45987 255792 -3384 -87322 -57753 251440 -171323 -196577
11235 -196577 -134771 239110 85229 92327 146383 98436 298768 -239209 77770 -360763 -220850
11224 -220850 156214 -250921 -140168 -255351 -13800 -346983 -257172 -152766 202296 -207298
11213 74502 -80566 211327 105816 169396 352448 -350156 -17546 238039 106598 -27705
11202 -6821 105654 -20224 -16952 -111952 205287 -260128 24271 -228188 -44807 116905 -325053
11190 -170828 -167468 -130434 -534328 -34872 193399 -193772 13075 -165832 -192609 -189240 105987
11178b31295q0382J18258Q0579A86640b35166Q8962k73255i8015o371j67339G5693
11166a57670l9701A65444G754Q2270C0796J5395Q0928Q3682B3352d3597n0221
11155i3818A13075c432o9173j66682f9915B43262D3723L14467A31279A6839D391
11143E9407h3086B48038b380B5521j2488Q8857n803a54046l6393A63636c475B76122
11130a42383B07066j8424I239c04q4063A68043F5804k2121C599a34017A35404
11118h2179A86475M9015a87795M5630M1619A37278B2523J13821n3177L33721A37212
11106B03924l2255J15923A12647J2280m253K39428a82151A12105a20379G4306
11095A49256J17048g0204A22333P0808E9725N4025O2405J44570J63424j85502
$$ plain form
11178 -231295 -311677 -193419 -112840 186640 -235166 -146204 -419459 -98015 -104386 -271725 75693
11166 -157670 -197371 165444 7754 90024 30796 46191 127119 210801 23352 -43597 -93818
11155 -93818 113075 -3432 -72605 -239287 -69915 243262 43723 358190 131279 16839 4391
11143 59407 -83086 248038 -2380 25521 13033 101890 96087 -154046 -190439 163636 -3475 276122
11130 -142383 207066 188642 9239 -304 -84367 168043 65804 43683 3599 -134017 135404
11118 -82179 186475 235490 -187795 -142165 -100546 137278 22523 136344 83167 416888 137212
11106 203924 171669 287592 112647 124927 120674 360102 -182151 112105 -120379 74306
11095 149256 266304 -70204 122333 193141 59725 113750 176155 320725 484149 298647
11085B98647a58604B30431o2773L30502k14334E1644A0223h5702C80289A57066
11074B92076m938B436J97856J43898K35509j61973J34312A52597K00861J96570
11064E50028n7170j86399M70750j17335q0238L6394A12418Q30046j89098j06370
11054F46996l08364L33827j96913j65133M31671N8404k92092N90656m43293m166
11044F51593r4986L6172A44584N78024J98897l98276J75048J92428l79870J89819
11034G00654k82637Q9475R7305J08397k57501K23016k8095K55894J0436D10242
11023F46861q2193K69483D06915J27189K1111J92522j42482R1502l06360l6774
11013C53623j380M90735j34499j44312O867J02877j62852j32011p387K42958k99095
$$ plain form
11085 298647 -158604 230431 167658 498160 283826 51644 10223 -85702 380289 157066
11074 292076 287138 2436 200292 344190 579699 417726 552038 152597 353458 550028
11064 550028 492858 306459 777209 659874 579636 616030 112418 942464 753366 646996
11054 646996 338632 672459 475546 310413 742084 800488 508396 1099052 655759 651593
11044 651593 556607 592779 144584 722608 921505 523229 698277 890705 510835 700654
11034 700654 418017 507492 604797 713194 455693 678709 650614 906508 916944 410242
11023 646861 564668 834151 406915 534104 555215 747737 605255 696757 390397 353623
11013 353623 352243 842978 708479 564167 571034 673911 511059 379048 371661 614619 315524
11002C15524L90268M3662k66298J14353Q687J6753k47981K04517J4798J69728
10992G64011j73282M23629l23061N51942l57778k57118L80240j20469j72903M9319
10982G64530L48030K15071l82808L84400j68420K89189L79195j32477L56660M15305
10972B468675K28123j11497J33275l04230N6052k29604k20006O2838o799k53039
10962A823788K91598m1108q5619M39169r24j55243K82930l52932K13427k23794
10952B191292o72193k722j62178k13496k44575l1335k39662M2457k22229m3245
10942D02114P2380A92404J88221j30221n5339J92938r8617Q1558n1243j47596
10932A72105J76828j10907M375L7991k5994D1813M24685A73311a06151o3665G9305
$$ plain form
11002 315524 705792 749454 483156 597509 606196 622949 374968 579485 594283 764011
10992 764011 590729 1014358 691297 1243239 885461 628343 1008583 888114 715211 764530
10982 764530 1112560 1327631 944823 1329223 1160803 1449992 1829187 1696710 2053370 2468675
10972 2468675 2696798 2585301 2718576 2414346 2470398 2240794 2020788 2083626 2076827 1823788
10962 1823788 2115386 2074278 1988659 2427828 2426904 2271661 2554591 2201659 2415086 2191292
10952 2191292 1519099 1516377 1354199 1140703 896128 864793 625131 667588 445359 402114
10942 402114 474494 192404 380625 250404 195065 388003 289386 370944 319701 172105
10932 172105 348933 238026 242401 280392 254398 41813 466498 173311 -106151 -169816 79305
10920A19615m2704J57072A10880C4990L78323b7403A60073Q3853h3914r5122e0802
10908a05327C2889a39106e0493A21783b16122A77620a11165G7431P2316c6802
10897b4822l2774G5924L4715a9829j66967g4159I1185d58878A66643b10808B49494
10885a14358d683j64560I3126g3606j57800N1284I7322h6386A18045A4672g2020
10873a1068k1202i567n6626B49054r9643C1407P7293L70144a23617k97491Q5165
10862c35943D3019N9589C7570a311A09673C2387a62129A20623c38986B53178i7101
10850B64014J2000A05740B442a02718F4172b65394Q4249B05225a53769B059c78574
10838B6122O5580c0702j86122I8910d8149m60859A29742D1996a5615B18231a69784
$$ plain form
10920 119615 76911 233983 110880 34990 413313 -27403 160073 243926 -83914 -179036 -50802
10908 -105327 32889 -139106 -50493 121783 -216122 177620 -111165 77431 149747 -36802
10897 -24822 -57596 75924 110639 -19829 -186796 -74159 91185 -458878 166643 -210808 249494
10885 -114358 -4683 -169243 93126 -73606 -231406 -180122 97322 -86386 118045 14672 -72020
10873 -11068 -32270 -9567 -66193 249054 149411 31407 108700 478844 -123617 -421108 -335943
10862 -335943 43019 102608 37570 -1311 109673 32387 -162129 120623 -338986 253178 -97101
10850 264014 276014 105740 2442 -102718 64172 -265394 -181145 205225 -153769 2059 -378574
10838 26122 91702 -30702 -216824 98910 -48149 -509008 129742 41996 -15615 218231 -169784
10826A19965a77264k2728D0572g2525C3137i2250q7331J7350F9246i5915k39256
10815c35171c9553L51G5235a20592G301a53498b3119k00029j72791a23630A69771
10803b4270m2995k58785J10233d3096m5829B5791Q4956J47539b29765C477M4553
10792D8030a9155F3717C344b7561j56470k11722e6444K3671k44102e605j59212
10781a64817g556D203c65217A02452b70361J21992B43244d152A0858b19223E0296
10769B53656c02502c045r2047A4008L1680Q2060b54825L2395C2493J16793c50552
10757a29143j44323a18858D74696c42737a6851B24425D1799i5804L5076B3834
10746F122J90357a33471j8935f3928C1165a49703a9754C86157E8060b55816A58561
$$ plain form
10826 119965 -177264 -199992 40572 -72525 33137 -92250 -179581 -162231 69246 -95915 -335171
10815 -335171 -39553 -39202 75235 -120592 7301 -153498 -23119 -223148 -395939 -123630 169771
10803 -24270 -67265 -326050 -215817 -43096 -88925 25791 110747 258286 -229765 3477 48030
10792 48030 -19155 63717 3344 -27561 -184031 -395753 -56444 -32773 -276875 -5605 -164817
10781 -164817 -7556 4203 -365217 102452 -270361 -148369 243244 -4152 10858 -219223 50296
10769 253656 -302502 -3045 -95092 14008 45688 127748 -254825 -222430 32493 149286 -350552
10757 -129143 -273466 -118858 474696 -342737 -16851 224425 41799 -95804 -60728 23834
10746 6122 196479 -133471 -152406 -63928 31165 -149703 -19754 386157 58060 -255816 158561
10734E8326j5174K15441b17231A96804c7495A40651c41990h7351H4406K8746g3777
10722g1122A00161M9077a24413j28432k7736j20288a45484j12961q6304a22805
10711i5916j77185i8910o6910A62297a38108M3237E0010a19309C275a02943J5225
10700h7718k1247B50292A5757a53265A71147i7383k8744A58417g4107k14459A86521
10688E7823h9559F1531a05304E7217b10231f87j39360o6290j8081a442j41481
10677a42923k29015A7751N2850a64856C1790b25024a9819n3554B80359c05280
10666a55310d5041j46137Q5918A38477c83993a66490E0720a86313C81265b46882
10655B71453I1489i5555A19196B2660a72617A45347b36133B58025b7268A06964
$$ plain form
10734 58326 43152 258593 -217231 196804 -37495 140651 -341990 -87351 84406 113152 -73777
10722 -71122 100161 149238 -124413 -252845 -280581 -400869 -145484 -258445 -344749 -122805
10711 -95916 -273101 -98910 -165820 162297 -138108 -94871 50010 -119309 3275 -102943 -87718
10700 -87718 -108965 250292 15757 -153265 171147 -97383 -126127 158417 -74107 -288566 186521
10688 57823 -89559 61531 -105304 57217 -210231 -687 -140047 -206337 -224418 -1442 -142923
10677 -142923 -371938 17751 70601 -164856 31790 -225024 -19819 -73373 280359 -305280
10666 -155310 -45041 -191178 -105260 138477 -383993 -166490 50720 -186313 381265 -246882
10655 271453 91489 -95555 119196 22660 -172617 145347 -236133 258025 -27268 106964
10644F0651A7180a42072j04665j40791a28758C5393a66330O9489c9869q2518C10689
10632A26145a52982k12176C2991J4884a54193Q182a6400j57644P4194A60288e8793
10620G5095a9812C09097g4837j28246B43123C6278J37765b64527C23272b94162
10609G2908K3011J07441H5679h4764A28546D2186b43251B63434g1282k12567j315
10598b85164b6679A88290O2926i931j17721B6740K2438L4879l3714N3324b8816
10586D7936K6446b2358E1161J9252B6267b57776a9538C01528J6753A28171b6033
10574f1316A70374C2972b85443C72012C3647Q0494b75795C49942c88624a3131
10563G671Q6377c292A31493j7380a35037B26621m2359P6022r5119a89873G6956
$$ plain form
10644 60651 17180 -142072 -246737 -387528 -128758 35393 -166330 -96841 -39869 -122387 310689
10632 126145 -152982 -365158 32991 47875 -154193 -146011 -16400 -174044 -99850 160288 -58793
10620 75095 -19812 309097 -74837 -203083 243123 36278 174043 -264527 323272 -294162
10609 72908 95919 203360 85679 -84764 128546 42186 -243251 263434 -71282 -283849 -285164
10598 -285164 -26679 188290 251216 -9931 -127652 26740 49178 84057 50343 103667 -28816
10586 47936 74382 -22358 51161 70413 26267 -257776 -19538 301528 318281 128171 -26033
10574 -61316 170374 32972 -285443 372012 33647 114141 -275795 349942 -388624 -13131
10563 7671 94048 -3292 131493 114113 -135037 226621 184262 260284 165165 -189873 76956
10551c8672j34239J8568d0827B37805j09356n1726a42437A83553F0167i9939A81667
10539b06942F6381K9007J23382b34444C429R5792d10328J30908d6365l25760B03198
10527a75991A28979a881j80659g4861m67371J24274A21827a68531P7012C6526
10516A82395d79093A64618b43138A24366o002f1143J7531I5500b1674B4742a87044
10504c17402f4910B78141h3569A90720L0543k0910a89257n8915Q0884A34961j7141
10493A17820b21189d2066A20821L1232K2947b8404B94377A0090J5402K721K05961
10482B34174Q0403L6412M81288C43731K41189A36271J76093o8214n6168F4084
10471B28804a36218M0602k6538j34308A3655j338a09212B73722a822p980l43522
$$ plain form
10551 -38672 -172911 -154343 -40827 237805 128449 76723 -142437 183553 60167 -99939 181667
10539 -206942 66381 95388 218770 -234444 3429 99221 -410328 -279420 -46365 -372125 203198
10527 -175991 128979 -1881 -182540 -74861 -542232 -417958 121827 -168531 -91519 36526
10516 182395 -479093 164618 -243138 124366 118364 -61143 -43612 95500 -21674 24742 -187044
10504 -317402 -64910 278141 -83569 190720 221263 200353 -189257 -248172 -167288 134961 117820
10493 117820 -221189 -42066 120821 152053 175000 -28404 294377 10090 25492 28213 234174
10482 234174 314577 350989 832277 343731 584920 136271 312364 244150 187982 64084
10471 228804 -136218 -95616 -122154 -256462 13655 12317 -109212 273722 -1822 -9802 -353324
10460c53324C8578N3668e0299A19855a14197A63343n7814Q1164c07011c0971o2848
10449i3819k19822l950a9569m36523a63283N8064j20686n1855l0707b0309j96615
10438b16924J06056b416G7491O6908a17588j65640a12641C4665N6273b23656J3575
10427b10081O7948O5699m26189A32934O155a1230C06442b5262C62248j3284H8903
10415E5750K2580g5801B19039A03771G430P2186i9351l45712B14396a64818q996
10404a73814B26368b8179B63081b52675Q8736F456K59642B9133Q3272f5623A98150
10392B35239m4271q9271M5409d1336B20922a3666k30361C14377d79604a00569
10381a38521A67764J02087a26761C37238a03463A64482d1857D50514M9303B02786
$$ plain form
10460 -353324 38578 92246 -50299 119855 -114197 163343 105529 186693 -307011 -30971 -93819
10449 -93819 -313641 -317591 -19569 -456092 -163283 -105219 -225905 -277760 -308467 -20309 -216924
10438 -216924 -110868 -2416 77491 144399 -117588 -283228 -112641 34665 90938 -223656 -210081
10427 -210081 -142133 -76434 -502623 132934 139089 -11230 306442 -25262 362248 348964 88903
10415 55750 78330 -75801 219039 103771 7430 79616 -99351 -445063 214396 -164818 -173814
10404 -173814 226368 -28179 263081 -252675 -163939 6456 266098 29133 112405 -65623 198150
10392 235239 190968 101697 147106 -41336 220922 -13666 -244027 314377 -479604 -100569
10381 -138521 167764 269851 -126761 337238 -103463 164482 -41857 450514 499817 202786
10370B17231p9918C4628J53496L15471p8931Q550G7531K48005K67992A85603D0533
10358D88269B04367c4163C11987A0517K33510H4095O11111j69523B33716J77162
10348D10878E3169O24248k03209b7149E21070l399R408A20801c1384B48807o3707
10337A85100o2549R5406Q1556a2682A77063q4233K66076b75459D779K97630J30160
10326D32569r5181j53080b099E0385N7124J35579e2120A08907f3702G3888L97446
10315D71334b00895A42356M0059c93771d9616j40399H6496J1889h1368I3335b01325
10303A24568a57888A10416L9270i7826F4092O6170c004o7197F4480a96920A19018
10291A6205J78969E7593N349A3046b48755M9291i6549G4471K9620l9052c14203
$$ plain form
10370 217231 137313 34628 188124 503595 424664 433214 77531 325536 593528 185603 40533
10358 488269 204367 -34163 311987 10517 244027 84095 695206 525683 233716 410878
10348 410878 53169 677417 474208 -27149 521070 517671 527079 120801 -31384 248807 185100
10337 185100 122551 217957 299513 -12682 177063 92830 358906 -275459 4779 302409 432569
10326 432569 337388 184308 -2099 50385 107509 243088 -52120 108907 -63702 73888 471334
10315 471334 -200895 142356 182415 -393771 -49616 -190015 86496 98385 -81368 93335 -201325
10303 124568 -157888 110416 149686 -97826 64092 130262 -3004 -70201 64480 -196920 119018
10291 16205 195174 57593 62942 13046 -248755 -199464 -96549 74471 104091 65039 -314203
10279b07469A02675J02879J58351a06919B35454e7097A03707J75195I1645b35094
10268a42757A87010P4699A15137j7723J6222b91476O0456D14111j55919j08345
10258A49847J91358j32010K0527J45283J51681A23272m8959h8757l1885A87605
10247h3018D9673i5445k06834a27408E354c7853I8360j98a54624a8124I6068J16224
10235B12292b19997i9107A14994c3416J2096k93546b8258k7216r6589j15305H0295
10223d4007j73803D4077a73405B17534g9206B39895J1669b78835a25844J3579
10213a12265c063k1239o2558B71838I3126a70364b2938j04528g391j62229C0942
10201A37712f8442l74090A45398b04198B10230d47000a64828A10997c44330N4106
$$ plain form
10279 -207469 102675 205554 363905 -106919 235454 -57097 103707 278902 91645 -235094
10268 -142757 187010 261709 115137 97414 113636 -291476 -231020 414111 258192 149847
10258 149847 341205 209195 229722 375005 526686 123272 74313 -88757 -120642 187605
10247 -83018 49673 -95445 -302279 -127408 5354 -37853 98360 98162 -154624 -18124 96068 212292
10235 212292 -219997 -99107 114994 -33416 -21320 -314866 -28258 -55474 -152063 -267368 80295
10223 -44007 -217810 44077 -173405 217534 -79206 239895 251564 -278835 -125844 -112265
10213 -112265 -3063 -24302 -86860 271838 93126 -170364 -22938 -127466 -7391 -169620 30942
10201 137712 -68442 -442532 145398 -204198 210230 -447000 -164828 110997 -344330 -290224
10191b90224j5098a50495a9537A5992a46836m14793a44999A66551b426j80535
10181a82961h695o7879c0335j37419A1956d47246a07861c4350j51879P5178k7600
10170a38651f6716q6716N7674L8969k38291L2798M2606l6837a27690j25665K5556
10159b27799A11083C0810J3260c39374D52117A65383O8923E2387d12233a51599
10148i6037r7179m0996Q1889F6235J25244F9373b11858k9334A37392a97640A55613
10136f5662j393A72495e7985q5243k3196L7331l3537C9070b38314D4338a15223
10124f1361j11816p4645O3272N5292j67035Q3324H7321b25582i0634B52985a38121
10112A64759d1842B53592b43806A69044c90129J91651B84743G4243c25963A20845
$$ plain form
10191 -290224 -305322 -150495 -19537 15992 -146836 -561629 -144999 166551 -2426 -182961
10181 -182961 -8695 -76574 -30335 -167754 11956 -447246 -107861 -34350 -186229 -111051 -138651
10170 -138651 -66716 -153432 -95758 -56789 -295080 -262282 -219676 -256513 -127690 -253355 -227799
10159 -227799 111083 30810 44070 -339374 452117 165383 234306 52387 -412233 -151599
10148 -96037 -193216 -234212 -152323 66235 191479 69373 -211858 -241192 137392 -197640 155613
10136 -65662 -67055 172495 -57985 -143228 -166424 -129093 -162630 39070 -238314 44338 -115223
10124 -61361 -173177 -247822 -184550 -129258 -296293 -212969 87321 -225582 -90634 252985 -138121
10112 164759 -41842 253592 -243806 169044 -390129 -198478 284743 74243 -325963 120845
10101b1442j1038A20590C4442a96383h0926o8085B5241N4651A8963E498g7066
10089a33450N3911j440F5084J17317k6602i9972k52064k2403N5225N82F371Q7094
10077I3465i0330K6851j34599h8943k00765a23857B64988j10359h4458C26457
10066E0449M7148c31439D3881a22328j72013R6990Q1241A67312a35790B08321
10055a02924B09543q6903a07361I7356d6091A98272b01099A52805c29566A11035
10044c43628b9500l32895A20352M2801J36564c20038q289J64049j36539c840A14165
10032I5273A4311a3815o0478b0604B48472b20327j36274a52674f061k29498A10012
10020b43907f064j70658e8403a4877A59583b26840I4087b78699A26146a58116
$$ plain form
10101 -21442 -32480 120590 34442 -196383 -80926 -149011 25241 79892 18963 5498 -77066
10089 -133450 -79539 -80979 65084 182401 155799 -99972 -352036 -374439 -319214 -318632 6371 93465
10077 93465 -90330 -63479 -198078 -88943 -289708 -123857 264988 154629 -84458 326457
10066 50449 97597 -331439 43881 -122328 -294341 -197351 -116110 167312 -135790 208321
10055 -102924 209543 122640 -107361 97356 -46091 198272 -201099 152805 -329566 111035
10044 -343628 -29500 -362395 120352 163153 299717 -320038 -328327 -164278 -300817 -3840 114165
10032 95273 14311 -13815 -74293 -20604 248472 -220327 -356601 -152674 -6061 -235559 110012
10020 -243907 -6064 -176722 -58403 -14877 159583 -226840 94087 -278699 126146 -158116
10009G9659e0543k73482J3871B94698H5539h6435L9945B12007L9245d67618I3313
9997B4345f7175j98729I2365b39397p784G2822a43050J4528C9400i7818b6791
9985b20762i3001l7836N3783I210a88832c1895l3193k73337a06987d8880k16897
9974b65777A05960e8814F19105b41056a01017j72268g55k35231a06719A02762
9963A0087L43g4313l21561R7015C35727h6595j57421d2331j44644j90169L0564
9952c46580A62052n0632c32611k1259a70325j25307B98764e9734j03544B30331
9941b07124a02384A207e1888B7586b30369R5753d8992k70571C9072j4424c31359
9929A00964a56341N9494d3720C0717a02391O096j11809F9665a31522B89577b8111
$$ plain form
10009 79659 -50543 -324025 -310154 294698 85539 -86435 -46490 212007 251252 -467618 93313
9997 24345 -67175 -265904 92365 -239397 -247181 72822 -143050 -128522 39400 -97818 -26791
9985 -220762 -93001 -130837 -77054 9210 -188832 -31895 -65088 -338425 -106987 -48880 -265777
9974 -265777 105960 -58814 619105 -241056 -101017 -273285 -755 -235986 -106719 102762
9963 10087 10430 -74313 -395874 -298859 335727 -86595 -244016 -42331 -186975 -377144 -346580
9952 -346580 162052 111420 -332611 -353870 -170325 -295632 298764 -59734 -163278 230331
9941 -207124 -102384 1207 -51888 27586 -230369 -134616 -48992 -319563 39072 24648 -331359
9929 100964 -156341 -96847 -43720 30717 -102391 -96295 -208104 69665 -131522 289577 -28111
9917b55713l01424A48433d0250q4664K6575F2837L9005b12660a00156F5136b2839
9905b64439B26428d07291A87519J19289b7927r0975A76692c54468e7596j42281
9895a99877p1205b867j38133i640A41765e5506k61790H3410b9347m82823G4869
9883b7995k30701o2921a10600b4400j62463o7949b8728o1628E996g8387B89772
9871b25441j67918B9512c7673k83752H6125f0134j25552j24757J9366B98912d5999
9859a36355k56250M2297e3058o5459D5271k1527f1710r219D5568h6560j31574
9848b18134P5582L9355q7424k2815f7432A94151r0225j9074J64683c07351A08721
9836e1675A13709c06409I2723b50977M3162f5047j4687K052A01486c2207r2597
$$ plain form
9917 -255713 -557137 148433 -40250 -124914 -98339 62837 101842 -212660 -100156 65136 -22839
9905 -264439 226428 -407291 187519 306808 -27927 -118902 176692 -354468 -57596 -199877
9895 -199877 -271082 -2867 -141000 -9640 141765 -55506 -317296 83410 -29347 -512170 74869
9883 -27995 -258696 -321617 -110600 -24400 -186863 -254812 -28728 -90356 5996 -78387 289772
9871 -225441 -393359 29512 -37673 -321425 86125 -60134 -185686 -310443 -291077 298912 -45999
9859 -136355 -392605 -350308 -53058 -118517 45271 23744 -61710 -70929 45568 -86560 -218134
9848 -218134 -142552 -103197 -190621 -213436 -67432 194151 103926 84852 249535 -307351 108721
9836 -51675 113709 -306409 92723 -250977 -207815 -65047 -79734 -77682 101486 -32207 -124804
9825a24804m9140F9411A4819b38399O42D00814D7508a33402j33069C1429e0103
9813c62884R7680b248B8449J87693b07571n0903A86487b21316N8722M3556j10923
9802b29961F3191a95566A38786c61123a63769A42369a94209C74820a06856K1661
9792h5195m0713k4733k13598A20172h0909k94482d4431A08306L64583C9316a415
9780F1459d00005B1421c14612B0157a96894j02997e1090j09726N6011L4j35612
9769b40383k67442D512a50454b8851B68777A26416n4221H341d9790f713m04407
9758d11120j5001c3131a3068A50362a97563m2043P8710J6792j32776B99269c99075
9746b74950c520j70239B81237a07141k39784a52270B02506H6859b47845H1018
$$ plain form
9825 -124804 -173944 69411 14819 -238399 -237757 400814 47508 -133402 -266471 31429 -50103
9813 -362884 -265204 -2248 28449 216142 -207571 -258474 186487 -221316 -162594 -119038 -229961
9802 -229961 63191 -195566 138786 -361123 -163769 142369 -194209 374820 -106856 -85195
9792 -85195 -125908 -150641 -364239 120172 -80909 -375391 -44431 108306 472889 39316 -1415
9780 61459 -400005 21421 -314612 20157 -196894 -299891 -51090 -160816 -104805 -104771 -240383
9769 -240383 -507825 4512 -150454 -28851 268777 126416 72195 8341 -49790 -6713 -411120
9758 -411120 -426121 -33131 -13068 150362 -197563 -239606 -160896 -144104 -276880 299269 -399075
9746 -274950 -3520 -173759 281237 -107141 -346925 -152270 202506 86859 -247845 81018
9735b04781A40616D2412b29083C1825E403K4624e1741C6305K38705H2357e115
9723a38031J8688G1985b9192j78833M070o6226J14843L2786q3278G0529a13479
9711D4683b70871a7056H8906Q5707e77988B4015a0216i07A2940b6428k34187A37708
9698a592E2013N0595R1974a78377g3557k88833D0788c5847A63006D1255f3571
9686D6877A0909a94399J7833H9784J16234N6349G6570F886J23516a05877n8539
9675a64416b1058j46907E69861a0041m9308A15199a676D7086J6074l574R3495
9664A53081c20636I5797l4379a20828j97482a20248P731B21475b83824E2184a57684
9652e8608j80219G2726g4979A4431e3131p9605L4808I9555c19852A3198J4897
$$ plain form
9735 -204781 140616 42412 -229083 31825 5403 30027 -51741 36305 275010 82357 -5115
9723 -138031 -119343 71985 -29192 -208025 -203955 -270181 -155338 -122552 -205830 70529 -113479
9711 44683 -270871 -17056 88906 174613 -577988 24015 -10216 -907 12940 -26428 -260615 137708
9698 -1592 52013 102608 194582 -178377 -73557 -362390 40788 -35847 163006 41255 -63571
9686 46877 10909 -194399 -176566 89784 206018 262367 76570 6886 130402 -105877 -164416
9675 -164416 -21058 -167965 569861 -10041 -59349 115199 -1676 47086 63160 59586 153081
9664 153081 -320636 95797 61418 -120828 -318310 -120248 -112517 221475 -283824 52184 -157684
9652 -58608 -238827 72726 -74979 14431 -53131 -132736 -97928 99555 -319852 13198 28095
9641B8095h6264I6521a27426j68208C73022g1836j66769L8018K3559K3190D6281
9629a0451k23473A1168K89379a62383o8603d5878j98330A23295J11508g5G476
9617a93068A74458a16894a9182j54822j25027a44561j59503Q7624J04929c3132
9606b36836c1270E44948b04248P5842k1702b9220j30589m9688a6663C0578a53063
9594d1605k17564o385D02689a54391b9824A7556M4166b54874A05957a20476G7901
9582A87b06051f1564o3113j49622i6615a6055B28181l1617b76037B8873a31822
9570b2933r7077D9119b01332b7087f141D40498a39917J627B1024c5212m8505k12892
9558b96609A59150a04406A61254b79089B65151E4062b43706J17778e4714j799
$$ plain form
9641 28095 -86264 96521 -127426 -295634 373022 -71836 -238605 -200587 -177028 -153838 46281
9629 -10451 -233924 11168 300547 -162383 -230986 -45878 -244208 123295 234803 -75 7476
9617 -193068 174458 -116894 -19182 -174004 -299031 -144561 -304064 -216440 -111511 -33132
9606 -236836 -31270 544948 -204248 -128406 -150108 -29220 -159809 -209497 -16663 30578 -153063
9594 -41605 -259169 -265554 402689 -154391 -29824 17556 61722 -254874 105957 -120476 77901
9582 187 -206051 -61564 -124677 -274299 -96615 -16055 228181 196564 -276037 28873 -131822
9570 -22933 -120010 49119 -201332 -27087 -6141 440498 -139917 -138290 21024 -35212 -83717 -296609
9558 -296609 159150 -104406 161254 -279089 265151 54062 -243706 -125928 -54714 -56513
9548e6513k60724a6131k07612A215Q2844J89223i7638c5014k52860A5295J61330
9537A76625d0023G1317a71980K042l98150i9676L7313A53967R8214h6468i225
9525A16778b07219P8691O4001r3163p1110Q8168A49063C608f8884j73941k6725
9514b69550n734A52701J41124h9449j9870F0969a81148M6620A08459a56216N2413
9503a03803q3741j70159E645a29104n3425m4114a9014C0778P1371B0067J37426
9492A57493l1945b28791n9993R6419D8868e5973A35030b74987b4266n0378A2702
9480h0366J3201C6859J30301b5798l04759c9464k77761c1421m4145L163j29440
9469b01843p4327a05231B47555a40344B6034K1605a72091L0271e1082j68231j2377
$$ plain form
9548 -56513 -317237 -16131 -223743 1215 84059 273282 -97638 -35014 -287874 15295 176625
9537 176625 -40023 71317 -171980 -169938 -568088 -99676 -62363 153967 252181 -86468 -9225
9525 116778 -207219 -128528 -64527 -157690 -228800 -140632 149063 3608 -68884 -242825 -269550
9514 -269550 -275284 152701 293825 -89449 -109319 60969 -181148 -134528 108459 -156216 -103803
9503 -103803 -187544 -357703 5645 -129104 -182529 -226643 -19014 30778 102149 20067 157493
9492 157493 125548 -228791 -288784 -192365 48868 -55973 135030 -274987 -24266 -74644 12702
9480 -80366 -67165 36859 167160 -25798 -330557 -39464 -317225 -31421 -75566 -72403 -201843
9469 -201843 -276170 -105231 247555 -140344 26034 47639 -172091 -141820 -51082 -219313 -231690
9458b31690j60437d8702I9700m407J14684P6464C7294c95267J77755r1507h0932
9446a20426A8679c0423k77550R4357C8731c26048P9422p6934q1763d4523j17475
9435a61998A92667B4000L30736a04345b1317l17718c975k32337b8077G8323c5282
9423G9049a08367A1540a86875B47126b65293H6350d60960A63058J9331C2570b13680
9411d08979D4161a22708B9736P1197J17335c07128p4850a54829L6295l350B9937
9399b21108c6471F4814c4356D5858J90528a48871o2907c3934k00833i4186o8899
9388a63085K4736D6243a97389b2866j26942A07374a60063A37283a64910K782A21866
9376g3245j39230L6688j26266a11956J7862C42903b49539B82864a45901k97954
$$ plain form
9458 -231690 -392127 -48702 99700 95293 209977 286441 37294 -395267 -217512 -309019 -80932
9446 -120426 18679 -30423 -307973 -213616 38731 -326048 -246626 -323560 -405323 -44523 -161998
9435 -161998 192667 24000 354736 -104345 -21317 -339035 -3975 -236312 -28077 78323 -35282
9423 79049 -108367 11540 -186875 247126 -265293 86350 -460960 163058 182389 32570 -213680
9411 -408979 44161 -122708 29736 100933 218268 -307128 -381978 -154829 -118534 -121884 29937
9399 -221108 -36471 64814 -34356 45858 236386 -148871 -211778 -33934 -234767 -94186 -163085
9388 -163085 -138349 46243 -197389 -22866 -149808 107374 -160063 137283 -164910 -162128 121866
9376 -73245 -212475 -175787 -302053 -111956 -94094 342903 -249539 282864 -145901 -443855
9366d43855d3445A10364B9223F563L19017a15875m7086i372j91161E90c14650
9354i0812c8223E7474a66252c1951j72711o7742f3432A79922o0525H156a87603
9342C7980a01692A74956G5131a42545B07967r6820b07381d3334j64213B56845
9331e5280m01507f2991j2551j63153c3178o0923j07183C0452M2653A2919N8004
9320G0923J59481c40519a20319C83296a9814k9600l10l32302A21964i0791A01662
9308a77693a1684I6178c02917a1821j71931h1289A80276a10971l03049a38308
9297E1019J95453C4684a74981j29870M4959a0455k73767B0169b8618j96753A0105
9285b86205B1238J74690A4570f1798q0621j83277J04296J02324E7841a35372j45159
$$ plain form
9366 -443855 -43445 110364 29223 6563 325580 -115875 -162961 -9372 -200533 590 -314650
9354 -90812 -38223 57474 -166252 -31951 -204662 -272404 -63432 179922 119397 8156 -187603
9342 37980 -101692 174956 75131 -142545 207967 111147 -207381 -43334 -207547 256845
9331 -55280 -456787 -62991 -75542 -238695 -33178 -94101 -201284 30452 73105 12919 70923
9320 70923 230404 -340519 -120319 383296 -19814 -49414 -49724 -382026 121964 -90791 101662
9308 -177693 -11684 96178 -302917 -11821 -183752 -81289 180276 -110971 -414020 -138308
9297 51019 246472 34684 -174981 -304851 -259892 -10455 -284222 20169 -28618 -225371 10105
9285 -286205 21238 195928 14570 -61798 -142419 -325696 -221400 -119076 57841 -135372 -280531
9274b80531a6251B0504P8421b60722A78533a67870B50194F9408f5547r918b7940
9262b52514O3432D4737a49667m4298K9313j62681a53585e8801b3165A864b86159
9250c16078Q8270C5817b1403l4375j01267L8399C09865c5060A74428e4830k90329
9239c45159F9084i1762k06780n6848A9231c9147q0978C1632a10617j10293b4435
9227B26677a06369Q910k0836I5318a99460Q9588B29712f9882n2144q9322A28462
9215C1384a96842C83621m1150h9406B45645D8302c24834e891G3031M1990d485
9203b40718J04073D9877I089J7646L6304N4535a40444A76087n7574h5786I0097
9191a38984H1059J04775a81950g4524G0209a64093l422Q1789k93559a38317C6953
$$ plain form
9274 -280531 -16251 20504 98925 -260722 178533 -167870 250194 69408 -65547 -75465 -27940
9262 -252514 -189082 44737 -149667 -193965 -164652 -327333 -153585 -58801 -23165 1864 -286159
9250 -316078 -227808 35817 -21403 -55778 -157045 -118646 309865 -35060 174428 -54830 -345159
9239 -345159 69084 -91762 -298542 -355390 19231 -39147 -120125 31632 -110617 -220910 -24435
9227 226677 -106369 -97459 -118295 95318 -199460 -109872 229712 -69882 -122026 -211348 128462
9215 31384 -196842 383621 342471 -89406 245645 48302 -324834 -5891 73031 115021 -4485
9203 -240718 -136645 49877 9089 26735 63039 117574 -140444 176087 118513 -85786 90097
9191 -138984 81059 185834 -181950 -74524 70209 -164093 -167515 -85726 -379285 -138317 36953
9179b39302J04392C8180a57403j03991Q7875F7973a59348A93145c72221Q5052
9169b87169F1068j121b15725a07257f472B25858c93747O4064h9424B03967a78689
9157B30638a54536M5477J2673B75457d1053C6382K1793c56855J50269n4529f5381
9145d39473E9335a23231k14843B98308j15526E6490d04k69443a19232k9120L5501
9134a12851k78689A74342b56829d972m01648b5500m64468A6146a11022A41282
9123B24528a81234M1252C9786n464Q5342E3269a41185L1959B44352j14821B7292
9111A44260E9615a32892F9897j8628a27879r173j15394a4436j21461k4137O4662
9100i5372k75724L5396h5945A62752k1426b12275c9915A66163a33437A60715b26222
$$ plain form
9179 -239302 -134910 38180 -157403 -261394 -173519 67973 -159348 193145 -372221 -287169
9169 -287169 61068 59947 -215725 -107257 -6472 225858 -393747 -329683 -89424 203967 -178689
9157 230638 -154536 -109059 -96386 275457 -41053 36382 58175 -356855 -206586 -261115 -65381
9145 -439473 59335 -123231 -338074 298308 182782 56490 -404 -269847 -119232 -148352 -112851
9134 -112851 -391540 174342 -256829 -4972 -406620 -25500 -489968 16146 -111022 141282
9123 224528 -181234 -139982 39786 34322 119664 53269 -141185 -109226 244352 129531 27292
9111 144260 59615 -132892 69897 51269 -127879 -137052 -252446 -14436 -135897 -160034 -95372
9100 -95372 -371096 -335700 -85945 162752 141326 -212275 -39915 166163 -133437 160715 -226222
9088d22321B67034b3236l52553L1309J12223A03585f3132J2646n5722j47783I5596
9076A72755m577o7765f2950A68191g7088j52464A00326d6899A30996c34154i810
9064b19436Q2127a9466j14132A83921b60896D692a3019A42205b5069K314o5849
9053h8604J9594J9732p3251r9195A6386a31121B0200f5471j66952D0328i5336
9041a31784A90338b54540c9962j75000L4598a834l22229A81263K2621J48739a99617
9029b77818H624J6149c8105B32989b42988I9851Q4628a44032A23025c67221e3248
9017b00203l8677I5830b63140H5304C0326r76a81613A61737Q477a13608A1996
9005b69143H7733J02906J7619A7902i4444B664M186K55432a59235j18715O1874
$$ plain form
9088 -422321 267034 -23236 -375789 -344480 -232257 103585 -63132 -50486 -106208 -253991 95596
9076 172755 168178 100413 -62950 168191 -77088 -229552 100326 -46899 130996 -334154 -9810
9064 -219436 -137309 -19466 -133598 183921 -260896 4692 -13019 142205 -25069 -22755 -88604
9053 -88604 -69010 -49278 -122529 -221724 16386 -131121 20200 -65471 -232423 40328 -95336
9041 -131784 190338 -254540 -39962 -214962 -180364 -1834 -324063 181263 203884 352623 -199617
9029 -277818 8624 24773 -38105 232989 -242988 99851 184479 -144032 123025 -367221 -53248
9017 -200203 -238880 95830 -263140 85304 30326 29350 -181613 161737 170214 -113608 11996
9005 -269143 87733 190639 208258 17902 -94444 2664 6850 262282 -159235 -277950 -216076
8994b16076Q0636A52272a73229m3487l1692N1885q0799e2416b3025A36461J5018
8983A51479g3199k0865A31942c70227a73146e4379j3475J4308a0511o4414n3326
8972a28251A1206O9845b01737A08422d3150k95511A30563a05442M6390k2878k6826
8961a08756k7180f4031j25189k2754N4833D3880i0911a4087r3752K0067o4505
8950a52277D2476c39024h2527A51958a552q1688a7509l755B58889d5639D8624
8938H8068d5794A46706B6271J98422P8427g8285k24042L1082d7115B715b68033
8926C0287M78740h4369F53662J147194N225415J388461C119247A178078l18006
8917H60072C78246q8640a8077C24398j56942q1478a96073C02417A47852J07620
$$ plain form
8994 -216076 -135440 152272 -173229 -216716 -248408 -196523 -277322 -52416 -23025 136461 151479
8983 151479 -73199 -94064 131942 -370227 -173146 -54379 -67854 -53546 -10511 -74925 -128251
8972 -128251 11206 81051 -201737 108422 -43150 -338661 130563 -105442 -59052 -81930 -108756
8961 -108756 -135936 -64031 -189220 -211974 -157141 43880 -90911 -14087 -107839 -87772 -152277
8950 -152277 42476 -339024 -82527 151958 -1552 -83240 -17509 -21264 258889 -45639 48624
8938 88068 -45794 146706 26271 224693 303120 -78285 -302327 -271245 -47115 2715 -268033
8926 30287 509027 -84369 653662 1800856 7026271 8414732 3119247 1178078 860072
8917 860072 378246 289606 -18077 324398 167456 85978 -196073 302417 147852 255472
8907B55472E8641b93963a05085m3658A84555M2700c78954Q3510A41302a44397
8896I2338N1651j2473A3290J03428b50081a23348M5611k83394i4544O64r0897
8885a84777A0389a51443j04572e8741A13183k2809J64098I7593A5945a19980B05359
8873B3603a38173K322e5713l01945J60160A34019J78055a07430l79568I6841a6328
8861B06787b08113j18455B2560c0677A0421K7879a42031k4967A40557a32766B34507
$$ plain form
8907 255472 58641 -293963 -105085 -148743 184555 227255 -378954 -295444 141302 -144397
8896 92338 143989 131516 13290 116718 -250081 -123348 -77737 -361131 -94544 -93880 -184777
8885 -184777 10389 -151443 -256015 -58741 113183 90374 254472 97593 15945 -119980 205359
8873 23603 -138173 -135851 -55713 -357658 -197498 134019 312074 -107430 -486998 96841 -16328
8861 206787 -208113 -326568 22560 -30677 10421 38300 -142031 -166998 140557 -132766 234507
$$ [...]
##END NTUPLES=NMR SPECTRUM
##END=
