##TITLE=AC1626_CENAH_8450430_0kxrRob3b6
##JCAMPDX= 6.0         $$ Bruker NMR JCAMP-DX V2.0
##DATA TYPE= NMR SPECTRUM
##DATA CLASS= NTUPLES
##ORIGIN= BRUKER
##OWNER= Administrator
$$ 1.72 TOPSPIN		Version 2.1
$$ 2014-02-18 14:26:57.607 -0800  Administrator@X
$$ Compression mode = diff/dup
##.OBSERVE FREQUENCY= 400.02188249412
##.OBSERVE NUCLEUS= ^1H
##.ACQUISITION MODE= SIMULTANEOUS (DQD)
##.ACQUISITION SCHEME= undefined
##.AVERAGES= 64
##.DIGITISER RES= 22
##SPECTROMETER/DATA SYSTEM= spect
##.PULSE SEQUENCE= noesygpps1d.comp
##.SOLVENT NAME= COFFEE_meoh
##.SHIFT REFERENCE= INTERNAL, COFFEE_meoh, 1, 14.96096
##AUDIT TRAIL= $$ (NUMBER, WHEN, WHO, WHERE, PROCESS, VERSION, WHAT)
$$ ##TITLE= Audit trail, TOPSPIN		Version 2.1
$$ ##JCAMPDX= 5.01
$$ ##ORIGIN= Bruker BioSpin GmbH
$$ ##OWNER= Administrator
$$ $$ E:\/data/COFFEE/nmr/AC1626_CENAH_8450430_0kxrRob3b6/12/pdata/1/auditp.txt
$$ ##AUDIT TRAIL=  $$ (NUMBER, WHEN, WHO, WHERE, PROCESS, VERSION, WHAT)
(   1,<2014-02-18 14:26:52.732 -0800>,<Administrator>,<X>,<go>,<TOPSPIN 2.1>,
      <created by zg
	started at 2014-02-18 14:15:21.855 -0800,
	POWCHK enabled, PULCHK disabled,
       configuration hash MD5:
       C8 4E 4E 5D D3 5C D8 9E 9F 52 82 E0 59 8A DE 15
       data hash MD5: 64K
       D1 D0 06 D3 74 EC 34 A9 F8 FA 48 FD C6 E5 CF 61>)
(   2,<2014-02-18 14:26:55.716 -0800>,<Administrator>,<X>,<proc1d>,<TOPSPIN 2.1>,
      <Start of raw data processing
       efp LB = 0.3 FT_mod = 6 PKNL = 1 PHC0 = 0 PHC1 = 0 SI = 128K 
       data hash MD5: 128K
       6D C3 A7 39 DB 8A 9D B5 A7 51 53 76 E7 1E 80 5F>)
(   3,<2014-02-18 14:26:56.669 -0800>,<Administrator>,<X>,<proc1d>,<TOPSPIN 2.1>,
      <pk PHC0 = -80.08484 PHC1 = 0 
       data hash MD5: 128K
       E3 3F AA D2 80 D5 19 E8 2B 19 6B 92 3D 4D F6 EC>)
(   4,<2014-02-18 14:26:57.107 -0800>,<Administrator>,<X>,<proc1d>,<TOPSPIN 2.1>,
      <abs ABSG = 1 
       data hash MD5: 128K
       19 9D 7A 95 FC 17 6D 14 E3 17 3E 51 EE 6E 88 AA>)
(   5,<2014-02-18 14:26:57.201 -0800>,<Administrator>,<X>,<proc1d>,<TOPSPIN 2.1>,
      <abs ABSG = 2 
       data hash MD5: 128K
       16 6C 78 E0 1E AC 1E AF CA CE A0 E3 19 7A 79 D7>)
(   6,<2014-02-18 14:26:57.294 -0800>,<Administrator>,<X>,<proc1d>,<TOPSPIN 2.1>,
      <abs ABSG = 3 
       data hash MD5: 128K
       65 15 FA BF 8B 6B E3 00 5B 13 FD 38 98 BA AF 0C>)
(   7,<2014-02-18 14:26:57.357 -0800>,<Administrator>,<X>,<proc1d>,<TOPSPIN 2.1>,
      <abs ABSG = 4 
       data hash MD5: 128K
       79 D0 93 7A D1 0E 60 CB 29 2D 6E 2E AD 2B 55 95>)
(   8,<2014-02-18 14:26:57.419 -0800>,<Administrator>,<X>,<proc1d>,<TOPSPIN 2.1>,
      <abs ABSG = 5 
       data hash MD5: 128K
       83 FC 4B 64 C5 91 18 A9 A0 7F 3E AD 39 9C CD 47>)
$$ ##END=
$$ 
$$ $$ hash MD5
$$ $$ 6A E0 02 B3 F6 35 10 D3 33 DF B6 E7 1D 46 02 74
##$RELAX= 
##$RELAX= 
##$RELAX= 
##$RELAX= 
##$RELAX= 
##$RELAX= 
##$RELAX= 
##$RELAX= 
$$ Bruker specific parameters
$$ --------------------------
##$DU= <E:\>
##$EXPNO= 12
$$ [...]
150 150 150 150 150 150 150 150
##$TP07= 0
##$TPNAME0= <>
##$TPNAME1= <>
##$TPNAME2= <>
##$TPNAME3= <>
##$TPNAME4= <>
##$TPNAME5= <>
##$TPNAME6= <>
##$TPNAME7= <>
##$TPOAL= (0..7)
0.5 0.5 0.5 0.5 0.5 0.5 0.5 0.5
##$TPOFFS= (0..7)
0 0 0 0 0 0 0 0
##$TUNHIN= 0
##$TUNHOUT= 0
##$TUNXOUT= 0
##$USERA1= <user>
##$USERA2= <user>
##$USERA3= <user>
##$USERA4= <user>
##$USERA5= <user>
##$V9= 5
##$VALIST= <valist>
##$VCLIST= <CCCCCCCCCCCCCCC>
##$VD= 0
##$VDLIST= <DDDDDDDDDDDDDDD>
##$VPLIST= <PPPPPPPPPPPPPPP>
##$VTLIST= <TTTTTTTTTTTTTTT>
##$WBST= 2048
##$WBSW= 25
##$XGAIN= (0..3)
0 0 0 0
##$XL= 0
##$YL= 0
##$YMAX_a= 6492926
##$YMIN_a= -14029507
##$ZGOPTNS= <>
##$ZL1= 120
##$ZL2= 120
##$ZL3= 120
##$ZL4= 120
##$ABSF1= 14.96096
##$ABSF2= -5.597221
##$ABSG= 5
##$ABSL= 3
##$ALPHA= 0
##$AQORDER= 0
##$ASSFAC= 0
##$ASSFACI= 0
##$ASSFACX= 0
##$ASSWID= 0
##$AUNMP= <proc_prof1d_extract.lims>
##$AXLEFT= 0
##$AXNAME= <>
##$AXNUC= <1H>
##$AXRIGHT= 0
##$AXTYPE= 0
##$AXUNIT= <>
##$AZFE= 0.1
##$AZFW= 0.1
##$BCFW= 0
##$BC_mod= 0
##$BYTORDP= 0
##$COROFFS= 0
##$CY= 15
##$DATMOD= 1
##$DC= 0
##$DFILT= <>
##$DTYPP= 0
##$F1P= 0
##$F2P= 0
##$FCOR= 0.5
##$FTSIZE= 131072
##$FT_mod= 6
##$GAMMA= 0
##$GB= 0
##$INTBC= 1
##$INTSCL= 1
##$ISEN= 128
##$LB= 0.3
##$LEV0= 0
##$LPBIN= 0
##$MAXI= 10000
##$MC2= 0
##$MEAN= 0
##$ME_mod= 0
##$MI= 0
##$NCOEF= 0
##$NC_proc= -2
##$NLEV= 6
##$NOISF1= 0
##$NOISF2= 0
##$NSP= 0
##$NTH_PI= 0
##$NZP= 0
##$OFFSET= 14.96096
##$PC= 1
##$PHC0= -80.08484
##$PHC1= 0
##$PH_mod= 1
##$PKNL= yes
##$PPARMOD= 0
##$PPDIAG= 0
##$PPIPTYP= 0
##$PPMPNUM= 2147483647
##$PPRESOL= 1
##$PSCAL= 4
##$PSIGN= 0
##$PYNMP= <proc.py>
##$REVERSE= no
##$SF= 400.0200096534
##$SI= 131072
##$SIGF1= 0
##$SIGF2= 0
##$SINO= 400
##$SIOLD= 131072
##$SPECTYP= <>
##$SREGLST= <1H.CDCl3>
##$SSB= 0
##$STSI= 131072
##$STSR= 0
##$SW_p= 8223.68421052631
##$SYMM= 0
##$S_DEV= 0
##$TDeff= 65536
##$TDoff= 0
##$TI= <>
##$TILT= no
##$TM1= 0
##$TM2= 0
##$TOPLEV= 0
##$USERP1= <user>
##$USERP2= <user>
##$USERP3= <user>
##$USERP4= <user>
##$USERP5= <user>
##$WDW= 1
##$XDIM= 131072
##$YMAX_p= 427636898
##$YMIN_p= -11976
##$CURPLOT= <Network HP LaserJet P1505>
##$CURPRIN= <$Network HP LaserJet P1505>
##$DFORMAT= <normdp>
##$LAYOUT= <+/1D_H.xwp>
##$LFORMAT= <normlp>
##$PFORMAT= <normpl>
##$SURQMSG= 1
$$ End of Bruker specific parameters
$$ ---------------------------------
##NTUPLES= NMR SPECTRUM
##VAR_NAME=  FREQUENCY,     SPECTRUM/REAL,   SPECTRUM/IMAG
##SYMBOL=    X,             R,               I
##VAR_TYPE=  INDEPENDENT,   DEPENDENT,       DEPENDENT
##VAR_FORM=  AFFN,          ASDF,            ASDF
##VAR_DIM=   131072,        131072,          131072
##UNITS=     HZ,            ARBITRARY UNITS, ARBITRARY UNITS
##FACTOR=    0.0627417313425164, 1,          1
##FIRST=     8223.62146879497, -2717,        -65447
##LAST=      0,             -1390,           -66826
##MIN=       0,             -11976,          0
##MAX=       8223.62146879497, 427636898,    0
$$ Real data points
##PAGE= N=1
##DATA TABLE= (X++(R..R)), XYDATA
$$ [...]
$$ plain form
63885 950822 915059 881065 848491 817991 790385 765847 744157 725273 709246 695874 684858
63874 684858 676326 670939 669349 671551 676777 684048 692918 703694 717005 733209 752204 773654 797236
63861 797236 822653 849521 877305 905483 933841 962510 991462 1019909 1046472 1070102 1090614
63850 1090614 1108165 1122477 1132892 1139061 1141159 1139384 1133599 1123606 1109487 1091456 1069531 1043599
63838 1043599 1013806 980729 945200 908056 870060 831909 794199 757348 721569 686969 653708
63827 653708 622078 592411 564931 539710 516746 496005 477352 460479 444983 430552 417055
63816 417055 404418 392453 380913 369765 359368 350224 342498 335859 329881 324497 319902 316050 312466
63803 312466 308679 304696 300854 297329 294027 290940 288305 286276 284632 282962 280951 278354 274937 270752
$$ packed form
63885I50822l5763l3994l2574l0500k7606k4538k1690j8884j6027j3372j1016
63874F84858q532n387j590K202N226P271Q870J0776J3311J6204J8995K1450K3582
63861G97236K5417K6868K7784K8178K8358K8669K8952K8447K6563K3630K0512
63850A090614J7551J4312J0415O169K098j775n785r993j4119j8031k1925k5932
63838A043599k9793l3077l5529l7144l7996l8151l7710l6851l5779l4600l3261
63827F53708l1630k9667k7480k5221k2964k0741j8653j6873j5496j4431j3497
63816D17055j2637j1965j1540j1148j0397r144p726o639n978n384m595l852l584
63803C12466l787l983l842l525l302l087k635k029j644j670k011k597l417m185
$$ plain form
63789 270752 266386 262584 259582 257038 254624 252366 250330 248268 245806 242838 239642 236727 234686 233967
63775 233967 234549 235840 237034 237603 237548 237321 237499 238285 239239 239638 239160 238003 236454 234703 233144 232291 232123
63758 232123 231911 231126 230159 229673 229601 229405 229167 229665 231244 233233 234725 235554 236190 237025 238067 239148 240183
63741 240183 241318 242938 245358 248364 251217 253282 254569 255591 256813 258358 260124 262056 264277 266991
63727 266991 270204 273649 277122 280733 284590 288290 291181 293238 295288 298144 301699 305114 307615 308886
63713 308886 308956 308131 306965 305892 304798 303255 301238 299305 297909 296801 295412 293700 292256 291569 291491 291620
63697 291620 291936 292718 293959 295221 296181 297024 298143 299647 301356 303102 304834 306506 308041 309403 310625
63682 310625 311765 312850 313742 314138 313931 313574 313709 314315 314674 314510 314724 316435 319511 322597 324581 325494 325954
$$ packed form
63789B70752m366l802l002k544k414k258k036k062k462k968l196k915k041p19
63775B33967N82J291J194N69n5k27J78P86R54L99m78j157j549j751j559q53j68
63758B32123k12p85r67m86p2j96k38M98J579J989J492Q29O36Q35J042J081J035
63741B40183J135J620K420L006K853K065J287J022J222J545J766J932K221K714
63727B66991L213L445L473L611L857L700K891K057K050K856L555L415K501J271
63713C08886P0q25j166j073j094j543k017j933j396j108j389j712j444o87p8J29
63697B91620L16P82J241J262R60Q43J119J504J709J746J732J672J535J362J222
63682C10625J140J085Q92L96k07l57J35O06L59j64K14J711L076L086J984R13M60
$$ plain form
63665 325954 326314 326564 326679 326662 326320 325202 322786 318904 314138 309614 306074 303207 300203 296759 293161 289614
63649 289614 286123 283036 280956 279854 278899 277520 276190 275823 276778 278824 281610 284666 287207 288581 289007
63634 289007 289565 291325 294519 298445 302102 305104 308032 311723 316300 321260 326468 332392 339181 346236
63620 346236 353223 360871 370100 380766 392082 404028 417471 432904 449843 467717 486682 507223
63608 507223 529468 553190 578125 603932 630090 656023 680988 703597 721869 734345 741172 743853
63596 743853 743962 742336 739340 735375 730873 725979 720511 714168 706582 697158 685151 670149 652527 633308
63582 633308 613517 593704 574039 554719 536163 518917 503443 489967 478380 468335 459586 452362
63570 452362 447338 445039 445154 446500 447838 448747 449625 450928 452745 455182 458752 463922 470446 477554 484782
$$ packed form
63665C25954L60K50J15j7l42j118k416l882m766m524l540k867l004l444l598l547
63649B89614l491l087k080j102r55j379j330l67R55K046K786L056K541J374M26
63634B89007N58J760L194L926L657L002K928L691M577M960N208N924O789P055
63620C46236O987P648R229J0666J1316J1946J3443J5433J6939J7874J8965K0541
63608E07223K2245K3722K4935K5807K6158K5933K4965K2609J8272J2476O827K681
63596G43853J09j626k996l965m502m894n468o343p586r424j2007j5002j7622j9219
63582F33308j9791j9813j9665j9320j8556j7246j5474j3476j1587j0045q749p224
63570D52362n024k299J15J346J338R09Q78J303J817K437L570N170O524P108P228
$$ plain form
63555 484782 492324 500608 510012 521018 534178 549718 567552 587909 611585 639203 670422 704184
63543 704184 739433 775074 809168 838575 859934 871404 873790 869987 863119 855010 846311 837610 829771
63530 829771 823166 817178 810802 803385 794466 783269 768798 750374 727941 702139 674306 646068
63518 646068 618558 592152 567112 544024 523243 504322 486540 469782 454403 440423 427456
63507 427456 415344 404355 394709 386432 379666 374583 370801 367324 363395 359210 355566 352929 350959 348928
63493 348928 346516 344203 342774 342434 342559 342384 341736 340976 340550 340769 341701 342964 343937 344475 345193 346714 348965
63476 348965 351490 354000 356137 357243 357123 356706 357051 357856 357777 356158 353570 350635 347302 343491 339548 335732
63460 335732 331977 328549 326144 324927 324134 323114 322169 321955 322603 323942 326001 328735 331774 334936 338506
$$ packed form
63555D84782P542Q284R404J1006J3160J5540J7834K0357K3676K7618L1219L3762
63543G04184L5249L5641L4094K9407K1359J1470K386l803o868q109q699q701p839
63530H29771o605n988o376p417q919j1197j4471j8424k2433k5802k7833k8238
63518F46068k7510k6406k5040k3088k0781j8921j7782j6758j5379j3980j2967
63507D27456j2112j0989r646q277o766n083l782l477l929m185l644k637j970k031
63493C48928k412k313j429l40J25j75o48p60m26K19R32J263R73N38P18J521K251
63476C48965K525K510K137J106j20m17L45Q05p9j619k588k935l333l811l943l816
63460C35732l755l428k405j217p93j020r45k14O48J339K059K734L039L162L570
$$ plain form
63445 338506 342537 346548 350553 355714 363067 372066 381370 390754 401267 413699 428030 444487 464040
63432 464040 487376 513926 542115 569976 595400 616579 632761 644363 652334 657889 662816 669149
63420 669149 678085 689735 704170 722051 743821 768915 796291 825178 854668 883023 908170 928709
63408 928709 943951 953394 956996 955864 951880 946470 940190 933313 926084 918305 909401 899079 887314
63395 887314 873444 856006 833972 807784 778872 748715 718672 690027 663356 638104 613548
63384 613548 590047 568761 550295 534325 520530 509058 499845 492182 485451 479931 476397 475192 476053
63371 476053 478692 483133 489427 497262 506015 515242 525160 536533 549888 564962 581165 598431 617243
63358 617243 637874 660176 684220 710577 739618 770822 802969 834539 863696 888505 907802
$$ packed form
63445C38506M031M011M005N161P353Q999R304R384J0513J2432J4331J6457J9553
63432D64040K3336K6550K8189K7861K5424K1179J6182J1602P971N555M927O333
63420F69149Q936J1650J4435J7881K1770K5094K7376K8887K9490K8355K5147K0539
63408I28709J5242R443L602j132l984n410o280o877p229p779q904j0322j1765
63395H87314j3870j7438k2034k6188k8912l0157l0043k8645k6671k5252k4556
63384F13548k3501k1286j8466j5970j3795j1472r213p663o731n520l534j205Q61
63371D76053K639M441O294P835Q753R227R918J1373J3355J5074J6203J7266J8812
63358F17243K0631K2302K4044K6357K9041L1204L2147L1570K9157K4809J9297
$$ plain form
63347 907802 921600 930285 933789 932164 926644 919369 912003 905008 898157 891103 883401 874446 863606 850132
63333 850132 833088 811857 786849 759412 731018 702793 675601 650040 626318 604625 585625
63322 585625 570104 558165 549381 543700 541363 541537 541752 539302 533016 523401 511543 498355 484511
63309 484511 470461 456474 442939 430516 419753 410745 403428 397960 394415 392255 390530 388691 386943
63296 386943 385751 385230 385037 384743 384178 383436 382565 381417 379913 378276 376703 374843 372028 368119 363795 359892
63280 359892 356751 354333 352552 351199 349902 348472 347174 346396 346244 346606 347402 348548 349906 351397 352950
63265 352950 354290 355189 356095 357990 361276 365176 368665 371633 374680 378144 381883 385864 390346 395520 401389
63250 401389 407920 414978 422213 429442 437079 445829 455995 467384 479744 492949 506964 522105 539169
$$ packed form
63347I07802J3798Q685L504j625n520p275p366o995o851p054p702q955j0840j3474
63333H50132j7044k1231k5008k7437k8394k8225k7192k5561k3722k1693j9000
63322E85625j5521j1939q784n681k337J74K15k450o286r615j1858j3188j3844
63309D84511j4050j3987j3535j2423j0763r008p317n468l545k160j725j839j748
63296C86943j192n21j93k94n65p42q71j148j504j637j573j860k815l909m324l903
63280C59892l141k418j781j353j297j430j298p78j52L62P96J146J358J491J553
63265C52950J340Q99R06J895L286L900L489K968L047L464L739L981M482N174N869
63250D01389O531P058P235P229P637Q750J0166J1389J2360J3205J4015J5141J7064
$$ plain form
63237 539169 558821 580881 604689 630068 657463 687186 719030 752611 787547 823298 859355
63226 859355 895671 932418 969349 1005924 1042110 1078423 1115116 1152005 1189340 1228055 1268642
63215 1268642 1310242 1351370 1391084 1428945 1464152 1495294 1520821 1539326 1549505 1550354 1541479 1523058
63203 1523058 1495671 1460439 1419135 1373687 1325553 1275789 1225586 1176398 1129565 1086111 1046957
63192 1046957 1012969 984624 961784 943950 930692 921814 917216 916731 920169 927446 938582 953457
63180 953457 971608 992326 1014857 1038428 1062295 1086054 1109872 1134090 1158575 1182747 1206291
63169 1206291 1229469 1252587 1275434 1297319 1317267 1333981 1346013 1352370 1352803 1347240 1335192 1316076
63157 1316076 1289994 1257900 1221108 1180859 1138268 1094347 1050090 1006578 964817 925318 888103
$$ packed form
63237E39169J9652K2060K3808K5379K7395K9723L1844L3581L4936L5751L6057
63226H59355L6316L6747L6931L6575L6186L6313L6693L6889L7335L8715M0587
63215A268642M1600M1128L9714L7861L5207L1142K5527J8505J0179Q49q875j8421
63203A523058k7387l5232m1304m5448m8134m9764n0203m9188m6833m3454l9154
63192A046957l3988k8345k2840j7834j3258q878m598m85L438P277J1136J4875
63180I53457J8151K0718K2531K3571K3867K3759K3818K4218K4485K4172K3544
63169A206291K3178K3118K2847K1885J9948J6714J2032O357M33n563j2048j9116
63157A316076k6082l2094l6792m0249m2591m3921m4257m3512m1761l9499l7215
$$ plain form
63146 888103 853318 821553 793281 768304 746181 726916 710689 697078 685180 674517 665276 657567
63134 657567 650968 645032 639839 635795 633150 631901 631865 632653 633809 635185 637071 639952 644278 650332 657892
63119 657892 665937 673194 679204 684589 690101 695776 701163 705910 709802 712703 714852 716843 718868 720378
63105 720378 721057 721737 723514 726114 728008 728241 727387 726435 725520 724269 722798 721680 721131 720794 720250 719375 718309
63088 718309 717396 717133 717845 719473 721854 725083 729312 734350 739824 745597 751759 758306 765241 772859 781417
63073 781417 790568 799680 808825 818872 830335 842701 855297 868367 882776 898928 916604 935725
63061 935725 956786 980501 1007489 1038317 1073358 1112459 1155052 1200871 1250386 1304487 1363948
63050 1363948 1429195 1500193 1576315 1656500 1739846 1825947 1914491 2004659 2095183 2185006 2273776
$$ packed form
63146H88103l4785l1765k8272k4977k2123j9265j6227j3611j1898j0663r241p709
63134F57567o599n936n193m044k645j249l6P88J156J376J886K881M326O054P560
63119F57892Q045P257O010N385N512N675N387M747L892K901K149J991K025J510
63105G20378O79O80J777K600J894K33q54r52r15j251j471j118n49l37n44q75j066
63088G18309r13k63P12J628K381L229M229N038N474N773O162O547O935P618Q558
63073G81417R151R112R145J0047J1463J2366J2596J3070J4409J6152J7676J9121
63061I35725K1061K3715K6988L0828L5041L9101M2593M5819M9515N4101N9461
63050A363948O5247P0998P6122Q0185Q3346Q6101Q8544R0168R0524Q9823Q8770
$$ plain form
63039 2273776 2361716 2449200 2536559 2624230 2712847 2802991 2894746 2987518 3080122 3170692 3256406
63028 3256406 3333686 3399126 3450225 3485036 3501502 3497753 3473087 3428170 3364247 3282805 3186270
63017 3186270 3078391 2963261 2844147 2723607 2604436 2489836 2382542 2284144 2195286 2116276
63007 2116276 2047512 1989606 1943196 1908477 1885001 1872003 1868802 1874652 1888364 1908425 1933453 1962362
62995 1962362 1994280 2028687 2065550 2104927 2146466 2189597 2234121 2280019 2326625 2372517 2416474
62984 2416474 2458043 2496834 2531505 2559818 2579519 2589042 2587685 2575398 2552215 2517622 2470782 2411786
62972 2411786 2342598 2266425 2186133 2103434 2019387 1935215 1852525 1772963 1697757 1627427 1561904
62961 1561904 1500922 1444228 1391421 1341915 1295402 1252158 1212507 1175999 1141435 1107789 1074849
$$ packed form
63039B273776Q7940Q7484Q7359Q7671Q8617R0144R1755R2772R2604R0570Q5714
63028C256406P7280O5440N1099L4811J6466l749k4666m4917o3923q1442r6535
63017C186270j07879j15130j19114j20540j19171j14600j07294r8398q8858p9010
63007B116276o8764n7906m6410l4719k3476j2998l201N850J3712K0061K5028K8909
62995A962362L1918L4407L6863L9377M1539M3131M4524M5898M6606M5892M3957
62984B416474M1569L8791L4671K8313J9701R523j357j2287k3183l4593m6840n8996
62972B411786o9188p6173q0292q2699q4047q4172q2690p9562p5206p0330o5523
62961A561904o0982n6694n2807m9506m6513m3244l9651l6508l4564l3646l2940
$$ plain form
62950 1074849 1042981 1012519 983493 955683 928806 902738 877640 853767 831241 810210 791127
62939 791127 774498 760187 747291 734955 723168 712554 703492 695662 688458 681628 675432 670202 665901
62926 665901 662214 659072 656859 655893 655770 655518 654456 652674 650600 648325 645505 641817 637350 632594 628115
62911 628115 624102 620153 615644 610400 604868 599602 594792 590438 586658 583485 580481 576971 572802 568608
62897 568608 565218 562923 561436 560393 559696 559358 559197 558855 558139 557255 556580 556162 555627 554655 553504 552896 553289
62880 553289 554343 555211 555402 555247 555407 556015 556533 556501 556137 555958 555990 555667 554471 552367 549603 546469 543387
62863 543387 540891 539257 538228 537282 536127 534897 533999 533825 534453 535548 536638 537490 538110 538530 538897 539592
62847 539592 540771 541848 542015 541364 540757 540317 538928 535867 532206 529674 528528 527552 525980 524325 523173
$$ packed form
62950A074849l1868l0462k9026k7810k6877k6068k5098k3873k2526k1031j9083
62939G91127j6629j4311j2896j2336j1787j0614r062p830p204o830o196n230m301
62926F65901l687l142k213r66j23k52j062j782k074k275k820l688m467m756m479
62911F28115m013l949m509n244n532n266m810m354l780l173l004l510m169m194
62897E68608l390k295j487j043o97l38j61l42p16q84o75m18n35r72j151o08L93
62880E53289J054Q68J91j55J60O08N18l2l64j79L2l23j196k104k764l134l082
62863E43387k496j634j029r46j155j230q98j74O28J095J090Q52O20M20L67O95
62847E39592J179J077J67o51o07m40j389l061l661k532j146r76j572j655j152
$$ plain form
62832 523173 522200 520837 519197 517774 516763 516214 516452 517804 520049 522558 524951 527398 530387 534331 539238
62817 539238 544598 549795 554763 560047 566095 572799 579847 587187 594851 602664 610481 618530 627126 636160
62803 636160 645230 654245 663589 673694 684715 696694 709828 724391 740455 757796 776199 795874
62791 795874 817468 841555 868327 898058 931691 970448 1014840 1064538 1119398 1180160 1247931
62780 1247931 1323534 1407776 1501765 1606240 1720714 1843800 1974278 2111294 2253593 2399098
62770 2399098 2545258 2689198 2827320 2955203 3068292 3162615 3234972 3282926 3305079 3301316
62760 3301316 3272687 3221084 3148960 3059062 2954255 2837614 2712563 2582539 2450357 2317983
62750 2317983 2186988 2059053 1935938 1819134 1709543 1607328 1512072 1423378 1341426 1266777
$$ packed form
62832E23173r73j363j640j423j011n49K38J352K245K509K393K447K989L944M907
62817E39238N360N197M968N284O048O704P048P340P664P813P817Q049Q596R034
62803F36160R070R015R344J0105J1021J1979J3134J4563J6064J7341J8403J9675
62791G95874K1594K4087K6772K9731L3633L8757M4392M9698N4860O0762O7771
62780A247931P5603Q4242R3989J04475J14474J23086J30478J37016J42299J45505
62770B399098J46160J43940J38122J27883J13089R4323P2357M7954K2153l763
62760C301316k8629n1603p2124q9898j04807j16641j25051j30024j32182j32374
62750B317983j30995j27935j23115j16804j09591j02215r5256q8694q1952p4649
$$ plain form
62740 1266777 1199534 1138936 1083946 1033968 988804 948151 911535 878726 849862 825025 803792
62729 803792 785297 768640 753270 739171 726777 716584 708633 702363 697100 692703 689675 688587 689506
62716 689506 692063 696013 701552 709077 718738 730349 743767 759340 777914 800292 826659 856685
62704 856685 890245 927863 970257 1017670 1069963 1127294 1190232 1259107 1333637 1413458 1498745
62693 1498745 1589923 1686829 1788265 1892154 1995847 2096366 2190639 2275648 2348465 2406451
62683 2406451 2447675 2471090 2476206 2462827 2431363 2383188 2320329 2244865 2158891 2065009 1966397
62672 1966397 1866081 1766218 1668127 1572865 1481591 1395369 1314760 1239757 1170178 1106011 1047234
62661 1047234 993448 944035 898724 857728 821184 788752 759900 734282 711589 691279 672727
$$ packed form
62740A266777o7243o0598n4990m9978m5164m0653l6616l2809k8864k4837k1233
62729H03792j8495j6657j5370j4099j2394j0193p951o270n263m397l028j088R19
62716F89506K557L950N539P525R661J1611J3418J5573J8574K2378K6367L0026
62704H56685L3560L7618M2394M7413N2293N7331O2938O8875P4530P9821Q5287
62693A498745R1178R6906J01436J03889J03693J00519R4273Q5009P2817N7986
62683B406451M1224K3415N116j3379l1464m8175o2859p5464q5974r3882r8612
62672A966397j00316r9863r8091r5262r1274q6222q0609p5003o9579o4167n8777
62661A047234n3786m9413m5311m0996l6544l2432k8852k5618k2693k0310j8552
$$ plain form
62650 672727 655495 639250 623668 608762 595077 583207 573121 564176 555675 547251 538999 531556
62638 531556 525847 522310 520440 519289 518270 517155 515645 513523 511076 508782 506554 503839 500572 497489
62624 497489 495326 494045 493063 491942 490701 489730 489584 490659 492931 496039 499581 503235 506854 510768 515853
62609 515853 522843 531635 541609 552498 564521 577744 591935 607145 623926 642874 664413 689144
62597 689144 717906 751296 789567 833074 882336 937463 997885 1062791 1131388 1202586 1274937
62586 1274937 1347048 1417490 1484073 1543851 1594316 1634217 1662922 1679560 1683297 1674036 1652313 1618899
62574 1618899 1575094 1523154 1465791 1405188 1342768 1279606 1216587 1154347 1093615 1035595 981547
62563 981547 931970 886556 844967 807295 773734 744104 717858 694422 673469 654900 638538
$$ packed form
62650F72727j7232j6245j5582j4906j3685j1870j0086q945q501q424q252p443
62638E31556n709l537j870j151j019j115j510k122k447k294k228k715l267l083
62624D97489k163j281r82j121j241r71j46J075K272L108L542L654L619L914N085
62609E15853O990Q792R974J0889J2023J3223J4191J5210J6781J8948K1539K4731
62597F89144K8762L3390L8271M3507M9262N5127O0422O4906O8597P1198P2351
62586A274937P2111P0442O6583N9778N0465L9901K8705J6638L737r261k1723l3414
62574A618899m3805n1940n7363o0603o2420o3162o3019o2240o0732n8020n4048
62563I81547m9577m5414m1589l7672l3561k9630k6246k3436k0953j8569j6362
$$ plain form
62552 638538 624004 611036 599830 590624 582978 576017 569506 564113 560306 557618 555368 553446 551816
62539 551816 549962 547677 545913 545754 546666 546814 545176 542458 539898 538167 537794 539629 544064 550315 557202
62524 557202 564458 572793 582928 595038 609048 625053 643487 665170 691117 721989 757679 797644
62512 797644 841540 889342 940868 995495 1052442 1111145 1171172 1231752 1291427 1348140 1399614
62501 1399614 1443703 1478625 1503262 1517434 1521866 1517754 1506327 1488843 1466789 1441934 1416182 1391502
62489 1391502 1369880 1353031 1341959 1336778 1337022 1342265 1352623 1368768 1391310 1419968 1453164 1488233
62477 1488233 1521967 1551272 1573933 1589125 1597109 1598251 1592240 1578048 1554333 1520081 1475533 1422755
62465 1422755 1364826 1304093 1241499 1177711 1114180 1052555 993613 937635 885594 839027 798616
$$ packed form
62552F38538j4534j2968j1206r206p646o961o511n393l807k688k250j922j630
62539E51816j854k285j764j59R12J48j638k718k560j731l73J835M435O251O887
62524E57202P256Q335J0135J2110J4010J6005J8434K1683K5947L0872L5690L9965
62512G97644M3896M7802N1526N4627N6947N8703O0027O0580N9675N6713N1474
62501A399614M4089L4922K4637J4172M432m112j1427j7484k2054k4855k5752k4680
62489A391502k1622j6849j1072n181K44N243J0358J6145K2542K8658L3196L5069
62477A488233L3734K9305K2661J5192P984J142o011j4192k3715l4252m4548n2778
62465A422755n7929o0733o2594o3788o3531o1625n8942n5978n2041m6567m0411
$$ plain form
62454 798616 763616 732942 706220 683570 664894 649811 637973 629049 622581 618155 615685 615402 617571
62441 617571 622199 628909 637050 646044 655642 665731 676033 686134 695603 703811 709755 712447 711474 706972
62427 706972 699224 688692 676269 662912 648926 634074 618543 603329 589416 576969 565579 554965
62415 554965 545085 535795 526782 517876 509286 501520 495048 489897 485519 481184 476547 471783 467310 463637
62401 463637 461262 460296 460109 459735 458825 457956 457960 459189 461453 464247 466917 468928 470295 471583 473376 475849
62385 475849 478873 482213 485622 489102 493209 498705 505670 513205 520279 526648 532749 538933 545146 551254
62371 551254 557399 563965 571249 579203 587517 596056 605137 615299 626945 640453 656432 675455 697639
62358 697639 722993 752115 785983 824854 867861 913863 962150 1012001 1062029 1110425 1155558
$$ packed form
62454G98616l5000l0674k6722k2650j8676j5083j1838q924o468m426k470k83K169
62441F17571M628O710Q141Q994R598J0089J0302J0101R469Q208N944K692r73m502
62427G06972p748j0532j2423j3357j3986j4852j5531j5214j3913j2447j1390j0614
62415E54965r880r290r013q906q590p766o472n151m378m335m637m764m473l673
62401D63637k375r66j87l74r10q69MJ229K264K794K670K011J367J288J793K473
62385D75849L024L340L409L480M107N496O965P535P074O369O101O184O213O108
62371E51254O145O566P284P954Q314Q539R081J0162J1646J3508J5979J9023K2184
62358F97639K5354K9122L3868L8871M3007M6002M8287M9851N0028M8396M5133
$$ plain form
62347 1155558 1196035 1230536 1258047 1278225 1291356 1298178 1299786 1297269 1291034 1280733 1266075 1247412
62335 1247412 1225386 1200529 1173634 1146084 1119255 1093821 1070006 1048162 1028546 1010802 994220
62324 994220 978285 962454 945699 927095 906843 886010 865119 843614 820843 796975 772737
62313 772737 748788 725693 704046 684169 665854 648735 632802 618418 605980 595720 587630 581388
62301 581388 576492 572647 569878 568127 566876 565459 563756 562407 562230 563472 565678 568236 570858 573498
62287 573498 576053 578457 580969 583975 587386 590574 593048 594856 596174 596914 597128 597395 598319 599881 601716
62272 601716 603766 606042 608041 609238 610274 612812 617864 624844 632614 640967 650692 662683 677627 696315
62258 696315 719504 747370 779459 815344 855133 899229 947698 999861 1054278 1109048 1162187
$$ packed form
62347A155558M0477L4501K7511K0178J3131O822J608k517o235j0301j4658j8663
62335A247412k2026k4857k6895k7550k6829k5434k3815k1844j9616j7744j6582
62324I94220j5935j5831j6755j8604k0252k0833k0891k1505k2771k3868k4238
62313G72737k3949k3095k1647j9877j8315j7119j5933j4384j2438j0260q090o242
62301E81388m896l845k769j751j251j417j703j349j77J242K206K558K622K640
62287E73498K555K404K512L006L411L188K474J808J318P40K14K67R24J562J835
62272F01716K050K276J999J197J036K538N052O980P770Q353R725J1991J4944J8688
62258F96315K3189K7866L2089L5885L9789M4096M8469N2163N4417N4770N3139
$$ plain form
62247 1162187 1211865 1256533 1295091 1326994 1352008 1369833 1380115 1382793 1378072 1365888 1345794 1317761
62235 1317761 1282942 1243334 1200791 1156673 1112252 1068887 1027640 989051 953500 921531 893568
62224 893568 869522 848935 831419 816711 804320 793364 782913 772428 761903 751660 742024 732992
62212 732992 724119 714766 704589 693835 683157 673184 664234 656293 649136 642542 636501 631189 626660
62199 626660 622727 619360 617129 616901 618933 622442 626285 629878 633316 636805 640409 644377 649279 655454
62185 655454 662506 669709 676994 685163 694842 705333 714841 721893 726333 729042 731097 733407 736696 741276
62171 741276 746893 753220 760554 769762 781608 796534 815063 837831 865052 896322 931134 969046
62159 969046 1008961 1048688 1085702 1118273 1145611 1167388 1183626 1194838 1201592 1203939 1201701 1195267
$$ packed form
62247A162187M9678M4668L8558L1903K5014J7825J0282K678m721j2184k0094k8033
62235A317761l4819l9608m2543m4118m4421m3365m1247l8589l5551l1969k7963
62224H93568k4046k0587j7516j4708j2391j0956j0451j0485j0525j0243r636r032
62212G32992q873r353j0177j0754j0678r973q950p941p157o594o041n312m529
62199F26660l933l367k231k28K032L509L843L593L438L489L604L968M902O175
62185F55454P052P203P285Q169R679J0491R508P052M440K709K055K310L289M580
62171G41276N617O327P334R208J1846J4926J8529K2768K7221L1270L4812L7912
62159I69046L9915L9727L7014L2571K7338K1777J6238J1212O754K347k238o434
$$ plain form
62147 1195267 1185538 1172956 1157102 1137481 1114439 1089189 1063290 1038243 1015186 994597 976387
62136 976387 960462 947099 936731 929472 924899 922092 919884 917335 914135 910461 906490 902342 898391
62123 898391 895218 893039 891592 890756 890896 892335 894901 898395 903171 909712 917754 926281 934309 941244 946482
62108 946482 949240 949008 945940 940725 934414 928449 924329 922751 923101 923993 924252 923351 921284 918488 915889
62093 915889 914550 914996 916908 919578 922650 926407 931398 937801 945121 952547 959603 966405 973212 979901
62079 979901 986201 992408 999624 1009030 1020959 1034722 1049234 1063693 1077766 1091353 1104358 1116758
62067 1116758 1128882 1141429 1154974 1169510 1184736 1200835 1218582 1238434 1259742 1281124 1301322
62056 1301322 1319362 1334130 1344571 1350493 1352667 1351834 1347909 1340423 1329355 1315048 1297490 1276184
$$ packed form
62147A195267r729j2582j5854j9621k3042k5250k5899k5047k3057k0589j8210
62136I76387j5925j3363j0368p259m573k807k208k549l200l674l971m148l951
62123H98391l173k179j447q36J40J439K566L494M776O541Q042Q527Q028O935N238
62108I46482K758k32l068n215o311n965m120j578L50Q92K59r01k067k796k599
62093I15889j339M46J912K670L072L757M991O403P320P426P056O802O807O689
62079I79901O300O207P216R406J1929J3763J4512J4459J4073J3587J3005J2400
62067A116758J2124J2547J3545J4536J5226J6099J7747J9852K1308K1382K0198
62056A301322J8040J4768J0441N922K174q33l925p486j1068j4307j7558k1306
$$ plain form
62044 1276184 1250825 1221739 1189526 1154607 1117405 1078791 1039982 1001946 965162 930044 897233
62033 897233 867057 838864 811494 784697 759676 737833 719265 702915 687947 674324 662109
62022 662109 650855 639960 629143 618336 607493 596833 586924 578211 570640 563895 557708 551791 545911
62009 545911 540356 535883 532825 530554 528260 526027 524678 524753 526124 528441 531495 535134 539256 543870 548895
61994 548895 553955 558665 562958 566838 570038 572269 573501 573514 571558 567184 561296 555611 550963 546790 542299
61979 542299 537383 532245 526866 521270 515739 510327 504661 498675 493115 488840 485917 483764 481903 480196
61965 480196 478651 477432 476862 476978 477230 476949 476030 474845 473638 472304 470672 468746 466745 465075 464149 464071
61949 464071 464674 465940 468122 471297 475159 479467 484252 489319 494121 498685 504184 511806 521311 531454
$$ packed form
62044A276184k5359k9086l2213l4919l7202l8614l8809l8036l6784l5118l2811
62033H97233l0176k8193k7370k6797k5021k1843j8568j6350j4968j3623j2215
62022F62109j1254j0895j0817j0807j0843j0660r909q713p571o745o187n917n880
62009E45911n555m473l058k271k294k233j349P5J371K317L054L639M122M614N025
61994E48895N060M710M293L880L200K231J232J3j956m374n888n685m648m173m491
61979E42299m916n138n379n596n531n412n666n986n560m275k923k153j861j707
61965D80196j545j219n70J16K52k81r19j185j207j334j632j926k001j670r26p8
61949D64071O03J266K182L175L862M308M785N067M802M564N499P622R505J0143
$$ plain form
61935 531454 541648 552305 563507 574376 584140 593029 601554 609494 616239 621675 626084 629365 630975
61922 630975 630555 628161 623983 618331 611859 605293 598904 592670 586995 582774 580603 580350 581738 584896 589992
61907 589992 596646 604193 612349 621143 630233 638736 645869 651466 655742 658768 660337 660202 658310 654944
61893 654944 650664 646057 641531 637423 634189 632165 631140 630367 629124 627079 624246 620928 617668 614740
61879 614740 611469 606527 599200 590030 580034 569844 560037 551613 545268 540403 535770 531145 527649 526266
61865 526266 526736 528126 529863 531890 534392 537823 542850 549814 558461 568473 579938 592961 607100
61852 607100 621624 636216 651124 666756 683406 701183 719833 738631 756714 773545 788966
61841 788966 802854 814855 824373 830753 833660 833302 830138 824354 816021 805916 795696 786868 779850
$$ packed form
61935E31454J0194J0657J1202J0869R764Q889Q525P940O745N436M409L281J610
61922F30975m20k394m178n652o472o566o389o234n675m221k171k53J388L158N096
61907E89992O654P547Q156Q794R090Q503P133N597M276L026J569j35j892l366
61893F54944m280m607m526m108l234k024j025p73j243k045k833l318l260k928
61879F14740l271m942p327r170r996j0190r807q424o345m865m633m625l496j383
61865E26266M70J390J737K027K502L431N027O964Q647J0012J1465J3023J4139
61852F07100J4524J4592J4908J5632J6650J7777J8650J8798J8083J6831J5421
61841G88966J3888J2001R518O380K907l58l164n784q333j0105j0220q828p018
$$ plain form
61828 779850 774393 770639 769264 770685 774553 780022 786158 792140 797420 801765 804916 806212 804813 800341
61814 800341 793139 783916 773333 761798 749409 736064 721816 707053 692229 677538 663050 649004
61802 649004 635711 623291 611820 601536 592555 584452 576583 568819 561628 555416 550174 545769 542177
61789 542177 539306 536956 535147 534166 534091 534513 534908 535104 535174 535061 534574 533759 533082 533183 534370 536374 538629
61772 538629 540823 543011 545188 547156 549054 551572 555116 559020 562295 565050 568453 573227 578983 585278
61758 585278 592486 601121 610915 621190 631609 641807 650687 656977 660456 661911 661831 659807 655375 648900
61744 648900 641307 633299 625066 616572 607924 599588 592231 586178 581115 576643 573035 570940 570256 569806 568437
61729 568437 566111 563705 562061 561516 561969 562980 563971 564750 565736 567352 569280 570629 570903 570548 570573 571717
$$ packed form
61828G79850n457l754j375J421L868N469O136N982N280M345L151J296j399m472
61814H00341p202r223j0583j1535j2389j3345j4248j4763j4824j4691j4488j4046
61802F49004j3293j2420j1471j0284q981q103p869p764p191o212n242m405l592
61789E42177k871k350j809r81p5M22L95J96P0j13m87q15o77J01J187K004K255
61772E38629K194K188K177J968J898K518L544L904L275K755L403M774N756O295
61758E85278P208Q635R794J0275J0419J0198Q880O290L479J455q0k024m432o475
61744F48900p593q008q233q494q648q336p357o053n063m472l608k095o84m50j369
61729E68437k326k406j644n45M53J011R91P79R86J616J928J349K74l55K5J144
$$ plain form
61713 571717 573843 575889 576609 575686 574053 572763 571736 570095 567696 565665 565128 565883 566703 566584 565316 563196
61697 563196 560801 558949 558204 558189 557692 555704 552268 548258 544617 541846 539921 538379 536577 534165 531372
61682 531372 528722 526500 524566 522655 520670 518589 516271 513572 510635 507924 505827 504295 502951 501490
61668 501490 499835 497975 495862 493523 491127 488863 486850 485202 484029 483305 482894 482765 482983 483375 483511 483283
61652 483283 483250 484013 485332 486316 486517 486458 486888 487952 489338 490958 493021 495523 498017 500040 501518 502617
61636 502617 503387 503784 503978 504322 504950 505640 506235 506949 507892 508466 507767 505683 503097 500761 498432 495537 492194
61619 492194 488934 485671 481723 476943 472200 468506 466107 464599 463342 461489 458146 453114 447281 441780
61605 441780 436814 431680 425889 419846 414300 409480 405054 400843 397166 394320 391882 388959 385224 381359
$$ packed form
61713E71717K126K046P20r23j633j290j027j641k399k031n37P55Q20j19j268k120
61697E63196k395j852p45j5m97j988l436m010l641k771j925j542j802k412k793
61682E31372k650k222j934j911j985k081k318k699k937k711k097j532j344j461
61668E01490j655j860k113k339k396k264k013j648j173p24m11j29K18L92J36k28
61652D83283l3P63J319R84K01n9M30J064J386J620K063K502K494K023J478J099
61636E02617P70L97J94L44O28O90N95P14R43N74o99k084k586k336k329k895l343
61619D92194l260l263l948m780m743l694k399j508j257j853l343n032n833n501
61605D41780m966n134n791o043n546m820m426m211l677k846k438k923l735l865
$$ plain form
61591 381359 378211 375783 373460 370968 368507 366009 363026 359618 356721 355150 354595 354055 352982 351586 350230
61576 350230 349016 347862 346546 344719 342283 339814 338201 337717 337667 337130 335935 334824 334708 335846 337720
61561 337720 339632 341267 342567 343324 343300 342802 342709 343695 345662 348091 350643 353153 355338 356932 358020 358958
61545 358958 360023 361312 362776 364077 364565 363783 362032 360223 359174 359146 359892 360974 362107 363404 365176
61530 365176 367368 369396 370698 371154 370720 369021 365829 361809 358256 355971 354717 353776 352678 351359 349994
61515 349994 348861 348188 348025 348320 349084 350296 351706 352932 353780 354311 354652 354876 354995 354962 354825 354967 355918 357662
61497 357662 359401 360385 360809 361528 363007 364987 367098 369243 371321 373033 374166 374817 375195 375381 375355 375106
61481 375106 374743 374637 375379 377285 380018 382916 385620 388077 390077 391191 391279 390676 389838 388999 388198 387427 386739
$$ packed form
61591C81359l148k428k323k492k461k498k983l408k897j571n55n40j073j396j356
61576C50230j214j154j316j827k436k469j613m84n0n37j195j111j16J138J874
61561C37720J912J635J300P57k4m98r3R86J967K429K552K510K185J594J088R38
61545C58958J065J289J464J301M88p82j751j809j049k8P46J082J133J297J772
61530C65176K192K028J302M56m34j699l192m020l553k285j254r41j098j319j365
61515C49994j133o73j63K95P64J212J410J226Q48N31L41K24J19l3j37J42R51J744
61497C57662J739R84M24P19J479J980K111K145K078J712J133O51L78J86k6k49
61481C75106l63j06P42J906K733K898K704K457K000J114Q8o03q38q39q01p71o88
$$ plain form
61464 386739 386370 386564 387136 387496 387477 387749 388860 390124 390213 388776 386707 384845 383275 382035 381580 382056 382855
61447 382855 383458 384116 385146 386107 386443 386547 387412 389324 391577 393451 394875 396043 396958 397647 398438 399724
61431 399724 401507 403364 404803 405644 406112 406659 407634 409093 410853 412698 414575 416633 419059 421811 424606
61416 424606 427282 430004 432875 435450 437007 437365 437182 437351 438237 439529 440580 440893 440472 439745 438977 437861
61400 437861 435969 433515 431276 429748 428704 427597 426050 423987 421723 419961 419232 419201 419000 418323 417738 417778
61384 417778 418282 418909 419722 420902 422348 423978 426002 428477 430953 433014 434872 436974 439326 441678 444051
61369 444051 446566 449004 451165 453529 456913 461336 465697 468736 470003 469838 468767 467182 465416 463940
61355 463940 463430 464536 467453 471816 477174 483490 490950 499325 507800 515612 522709 529616 536607 543100
$$ packed form
61464C86739l69J94N72L60j9K72J111J264Q9j437k069j862j570j240m55M76P99
61447C82855O03O58J030R61L36J04Q65J912K253J874J424J168R15O89P91J286
61431C99724J783J857J439Q41M68N47R75J459J760J845J877K058K426K752K795
61416D24606K676K722K871K575J557L58j83J69Q86J292J051L13m21p27p68j116
61400D37861j892k454k239j528j044j107j547k063k264j762p29l1k01o77n85M0
61384D17778N04O27Q13J180J446J630K024K475K476K061J858K102K352K352K373
61369D44051K515K438K161K364L384M423M361L039J267j65j071j585j766j476
61355D63940n10J106K917M363N358O316P460Q375Q475P812P097O907O991O493
$$ plain form
61341 543100 548050 550956 552311 552987 553468 553974 554948 556790 559120 560858 561250 560473 559199 557999 557210 556853
61325 556853 556524 555822 555037 554947 555867 557477 559710 563044 567642 572994 578879 585903 594475 603951 613518 623400
61309 623400 634371 646584 659675 673654 688853 705285 722864 741881 762352 783031 801984
61298 801984 818012 830710 839429 843366 842789 839049 833097 824879 814457 802658 790070 776229 760577
61285 760577 743698 726947 711204 696534 682726 669626 657123 645347 634850 626261 619772 615130
61273 615130 612040 610376 610047 610814 612230 613815 615384 617154 619370 621952 624773 628139 632641 638593 645982
61258 645982 654827 665049 675954 686371 695506 703304 709929 715343 719508 722496 724196 724364 723187 721375
61244 721375 719486 717562 715632 714086 713195 712656 712018 711317 710945 711124 711812 712914 714253 715484 716388 717295
$$ packed form
61341E43100M950K906J355O76M81N06R74J842K330J738L92p77j274j200p89l57
61325E56853l29p02p85r0R20J610K233L334M598N352N885P024Q572R476R567R882
61309F23400J0971J2213J3091J3979J5199J6432J7579J9017K0471K0679J8953
61298H01984J6028J2698Q719L937n77l740n952q218j0422j1799j2588j3841j5652
61285G60577j6879j6751j5743j4670j3808j3100j2503j1776j0497q589o489m642
61273F15130l090j664l29P67J416J585J569J770K216K582K821L366M502N952P389
61258F45982Q845J0222J0905J0417R135P798O625N414M165K988J700J68j177j812
61244G21375j889j924j930j546q91n39o38p01l72J79O88J102J339J231R04R07
$$ plain form
61228 717295 719074 722674 728613 736639 745886 755583 765623 776205 787008 797267 806768 816187 826175
61215 826175 836553 846717 856410 865701 874576 882981 891002 898578 905272 910675 914871 918147 920565 922257
61201 922257 923963 926685 930865 936322 943047 951613 962642 976181 991668 1008281 1025172 1041585 1056932
61188 1056932 1070727 1082350 1090950 1095692 1096257 1093158 1087496 1080231 1071660 1061645 1050101 1036961 1021896
61175 1021896 1004669 985937 967128 949172 931763 914239 896755 880028 864174 848424 832034
61164 832034 815021 797969 781529 766204 752209 739273 726784 714398 702532 692133 683949 677981
61152 677981 673631 670452 668726 669187 672114 676902 682623 688710 694790 700020 703087 703080 700133 695073 688596
61137 688596 681099 673251 666355 661757 659900 660138 661561 663785 666876 670882 675801 681833 689295 698386
$$ packed form
61228G17295J779L600N939Q026R247R697J0040J0582J0803J0259R501R419R988
61215H26175J0378J0164R693R291Q875Q405Q021P576O694N403M196L276K418J692
61201I22257J706K722M180N457O725Q566J1029J3539J5487J6613J6891J6413J5347
61188A056932J3795J1623Q600M742N65l099n662p265q571j0015j1544j3140j5065
61175A021896j7227j8732j8809j7956j7409j7524j7484j6727j5854j5750j6390
61164H32034j7013j7052j6440j5325j3995j2936j2489j2386j1866j0399q184n968
61152F77981m350l179j726M61K927M788N721O087O080N230L067pk947n060o477
61137F88596p497p848o896m598j857K38J423K224L091M006M919O032P462R091
$$ plain form
61123 698386 709369 722837 739319 758590 779825 802507 826797 852918 880624 909355 938501
61112 938501 967447 995852 1024014 1052342 1080249 1106211 1129289 1149952 1168913 1185745 1199335
61101 1199335 1209187 1215492 1218229 1217057 1211958 1203100 1190069 1172072 1149165 1122625 1093798 1063171
61089 1063171 1030870 997572 964404 932234 901498 872561 845753 821017 797872 775978 755637
61078 755637 737471 721548 707099 693343 680474 669503 661052 654634 649207 644124 639361 635174 631825
61065 631825 629436 627930 627304 628050 630796 635300 640278 644658 648623 653026 658309 664617 672443 682238 693544
61050 693544 705411 717757 731611 747907 766598 786966 808125 829214 849868 870752 893080
61039 893080 917390 943242 970100 997724 1025524 1052420 1077910 1102763 1128178 1154669 1182140
$$ packed form
61123F98386J0983J3468J6482J9271K1235K2682K4290K6121K7706K8731K9146
61112I38501K8946K8405K8162K8328K7907K5962K3078K0663J8961J6832J3590
61101A199335R852O305K737j172n099q858j3031j7997k2907k6540k8827l0627
61089A063171l2301l3298l3168l2170l0736k8937k6808k4736k3145k1894k0341
61078G55637j8166j5923j4449j3756j2869j0971q451o418n427n083m763m187l349
61065F31825k389j506o26P46K746M504M978M380L965M403N283O308P826R795J1306
61050F93544J1867J2346J3854J6296J8691K0368K1159K1089K0654K0884K2328
61039H93080K4310K5852K6858K7624K7800K6896K5490K4853K5415K6491K7471
$$ plain form
61028 1182140 1210600 1240255 1271222 1303536 1337239 1372153 1407869 1444177 1481138 1518537 1555875
61017 1555875 1593455 1633105 1677300 1727779 1785275 1850130 1922578 2002686 2090734 2187828 2296120
61006 2296120 2418847 2560647 2727788 2928215 3172119 3472775 3846153 4309561 4882405
60997 4882405 5589970 6465765 7548131 8872572 10461052 12302070 14318641 16344891
60989 16344891 18148974 19514780 20338909 20673652 20688237 20587976 20549732 20689034 21033937
60980 21033937 21497010 21879563 21940249 21502361 20528318 19113927 17422515 15616601 13823688
60971 13823688 12131682 10593957 9234817 8056613 7048555 6193903 5473988 4870218
60963 4870218 4365054 3942243 3586968 3286371 3029861 2808754 2616002 2446498 2297089
$$ packed form
61028A182140K8460K9655L0967L2314L3703L4914L5716L6308L6961L7399L7338
61017A555875L7580L9650M4195N0479N7496O4855P2448Q0108Q8048R7094J08292
61006B296120J22727J41800J67141K00427K43904L00656L73378M63408N72844
60997D882405P07565Q75795J082366J324441J588480J841018K016571K026250
60989A6344891J804083J365806Q24129L34743J4585j00261l8244J39302L44903
60980B1033937M63073L82553O0686m37888r74043j414391j691412j805914j792913
60971A3823688j692006j537725j359140j178204j008058q54652p19915o03770
60963D870218n05164m22811l55275l00597k56510k21107j92752j69504j49409
$$ plain form
60954 2297089 2165584 2049728 1947281 1856730 1777451 1709130 1651124 1602122 1560190 1523250 1489647
60943 1489647 1458092 1427280 1396198 1365088 1335416 1308347 1283628 1260426 1238800 1219668 1203620
60932 1203620 1190542 1180333 1173287 1169629 1169207 1171796 1177323 1185766 1197213 1211981 1230134 1250746 1272128
60919 1272128 1292927 1312728 1331492 1348872 1364224 1376846 1386057 1391527 1393767 1393703 1391314 1385115 1373560
60906 1373560 1356776 1336435 1314107 1290257 1264791 1237955 1210486 1183193 1156594 1130758 1105361
60895 1105361 1080020 1054695 1029662 1005134 981118 957723 935423 914771 895834 878044 860757
60884 860757 843980 828378 814386 801457 788509 775126 761918 749532 737747 725923 713993
60873 713993 702447 691434 680468 669129 657569 646136 634891 623844 613340 603844 595484 588087
$$ packed form
60954B297089j31505j15856j02447r0551p9279o8321n8006m9002m1932l6940l3603
60943A489647l1555l0812l1082l1110k9672k7069k4719k3202k1626j9132j6048
60932A203620j3078j0209p046l658m22K589N527Q443J1447J4768J8153K0612K1382
60919A272128K0799J9801J8764J7380J5352J2622R211N470K240o4k389o199j1555
60906A373560j6784k0341k2328k3850k5466k6836k7469k7293k6599k5836k5397
60895A105361k5341k5325k5033k4528k4016k3395k2300k0652j8937j7790j7287
60884H60757j6777j5602j3992j2929j2948j3383j3208j2386j1785j1824j1930
60873G13993j1546j1013j0966j1339j1560j1433j1245j1047j0504r496q360p397
$$ plain form
60861 588087 581563 575911 570909 566183 561687 557852 555026 552944 550922 548486 545619 542478 539187 536007
60847 536007 533400 531614 530358 529156 527979 527165 526626 525485 522804 518520 513443 508402 503650 499031 494514
60832 494514 490383 486980 484285 481888 479563 477823 477560 478997 481321 483680 486216 489623 493864 497960
60818 497960 501104 503463 505662 507918 509978 511579 512627 513128 513227 513183 513089 512749 512056 511273 510674 510101 509219
60801 509219 508110 507203 506597 505778 504156 501622 498411 494708 490628 486392 482184 477814 472810 466997 460766
60786 460766 454624 448624 442515 436405 430894 426391 422534 418596 414333 410141 406391 402960 399604 396553
60772 396553 394442 393656 393927 394637 395430 396417 397845 399690 401636 403381 404866 406343 408350 411467 415811
60757 415811 420779 425659 430492 435934 442078 447958 452565 455915 458624 460848 462385 463585 465339 468047
$$ packed form
60861E88087o524n652n002m726m496l835k826k082k022k436k867l141l291l180
60847E36007k607j786j256j202j177q14n39j141k681m284n077n041m752m619m517
60832D94514m131l403k695k397k325j740k63J437K324K359K536L407M241M096
60818D97960L144K359K199K256K060J601J048N01R9m4r4l40o93p83n99n73q82
60801E09219j109r07o06q19j622k534l211l703m080m236m208m370n004n813o231
60786D60766o142o000o109o110n511m503l857l938m263m192l750l431l356l051
60772C96553k111p86K71P10P93R87J428J845J946J745J485J477K007L117M344
60757D15811M968M880M833N442O144N880M607L350K709K224J537J200J754K708
$$ plain form
60743 468047 471199 473985 475666 475300 472071 466316 459574 453074 446648 439598 432030 424675 417816 411192
60729 411192 404791 399038 394179 390064 386565 383736 381502 379657 378200 377277 376724 376023 374833 373261 371636
60714 371636 370261 369331 368686 367668 365715 363224 361379 360925 361446 362064 362490 363125 364403 366322 368432 370049
60698 370049 370698 370667 370994 372623 375550 378996 382282 385326 388344 391429 394486 397383 400092 402826 406095
60683 406095 410382 415643 421343 427174 433553 441109 449731 458517 466734 474437 481882 488683 494020 497643
60669 497643 500192 502436 504460 505718 505616 503918 500836 496880 492489 487757 482678 477669 473443 470211
60655 470211 467316 463945 459967 455856 452047 448769 446320 445068 445075 445964 447149 448071 448287 447561 445897 443427
60639 443427 440377 437209 434520 432550 430918 429053 426727 424045 421244 418839 417593 417844 418995 420174
$$ packed form
60743D68047L152K786J681l66l229n755o742o500o426p050p568p355o859o624
60729D11192o401n753m859m115l499k829k234j845j457r23n53p01j190j572j625
60714C71636j375r30o45j018j953k491j845m54N21O18M26O35J278J919K110J617
60698C70049O49l1L27J629K927L446L286L044L018L085L057K897K709K734L269
60683D06095M287N261N700N831O379P556Q622Q786Q217P703P445O801N337L623
60669D97643K549K244K024J258j02j698l082l956m391m732n079n009m226l232
60655D70211k895l371l978m111l809l278k449j252PQ89J185R22K16p26j664k470
60639D43427l050l168k689j970j632j865k326k682k801k405j246K51J151J179
$$ plain form
60625 420174 421233 422551 423999 424854 424877 424791 425306 426190 426687 426501 425971 425498 425227 425114 425019 424724 424160 423535 423131
60606 423131 422990 422933 422742 422239 421346 420216 419143 418210 417181 415946 414882 414530 415033 416226 418205 421424
60590 421424 426034 431314 436010 439220 440858 441359 441126 440368 439305 438274 437555 437224 437241 437567 438124 438758 439434
60573 439434 440454 442396 445794 450870 457486 465289 474077 484074 495650 508610 521969 534752 546890
60560 546890 558999 571243 582685 591758 597205 598584 596293 591351 585004 578326 572045 566559 561990
60547 561990 558360 555986 555589 557669 561839 567200 573476 581411 591923 605254 621187 639716 660961
60534 660961 684451 708817 732279 753285 770777 784164 793292 798363 799721 797565 791886 782810 771113
60521 771113 758310 745966 734764 724309 713963 703841 694931 688229 683865 681139 679263 677855 676728
$$ packed form
60625D20174J059J318J448Q55K3q6N15Q84M97j86n30m73k71j13r5k95n64o25m04
60606D23131j41n7j91n03q93j130j073r33j029j235j064l52N03J193J979L219
60590D21424M610N280M696L210J638N01k33p58j063j031p19l31J7L26N57O34O76
60573D39434J020J942L398N076O616P803Q788R997J1576J2960J3359J2783J2138
60560E46890J2109J2244J1442R073N447J379k291m942o347o678o281n486m569
60547E61990l630k374l97K080M170N361O276P935J0512J3331J5933J8529K1245
60534F60961K3490K4366K3462K1006J7492J3387R128N071J358k156n679r076j1697
60521G71113j2803j2344j1202j0455j0346j0122q910o702m364k726j876j408j127
$$ plain form
60508 676728 675636 674656 674607 676493 680476 685939 692791 702168 715483 733303 755657 783033 816268 855586
60494 855586 900376 949951 1003834 1061180 1120444 1179816 1237658 1292499 1343076 1388514 1427892
60483 1427892 1459392 1480297 1488207 1482162 1462620 1430882 1388783 1338466 1281959 1221107 1158041 1095351
60471 1095351 1035353 979278 927375 879653 836213 797031 761745 729829 700972 675241 652792
60460 652792 633303 615844 599580 584509 571159 559597 549109 538914 528865 519374 511036 504348
60448 504348 499336 495329 491447 487458 483718 480317 476876 473396 470603 469003 468119 467123 465803 464365 462658
60433 462658 460244 457103 453804 451045 449311 448780 449179 449827 450159 450152 450109 450301 450998 452430 454426 456468 458443
60416 458443 460874 463913 466645 468103 468652 469550 471252 472918 473605 473198 472122 470810 469708 469246 469525 470347
$$ packed form
60508F76728j092r80m9J886L983N463O852R377J3315J7820K2354K7376L3235L9318
60494H55586M4790M9575N3883N7346N9264N9372N7842N4841N0577M5438L9378
60483A427892L1500K0905P910o045j9542l1738m2099n0317n6507o0852o3066o2690
60471A095351n9998n6075n1903m7722m3440l9182l5286l1916k8857k5731k2449
60460F52792j9489j7459j6264j5071j3350j1562j0488j0195j0049r491q338o688
60448E04348n012m007l882l989l740l401l441l480k793j600q84r96j320j438j707
60433D62658k414l141l299k759j734n31L99O48L32pm3J92O97J432J996K042J975
60416D58443K431L039K732J458N49Q98J702J666O87m07j076j312j102m62K79Q22
$$ plain form
60400 470347 471558 472967 473992 474072 473538 473436 474254 475461 476631 478332 481329 485394 489546 493214 496498
60385 496498 499474 501897 503719 505266 506768 508094 509224 510559 512476 514811 517179 519593 522318 525094
60371 525094 527018 527499 527020 526639 526893 527552 528297 529157 530235 531449 532722 534109 535531 536697 537488 538140
60355 538140 538903 539861 541383 544280 549025 555079 561551 568337 576001 584576 593165 600915 607797 614102 619552
60340 619552 623309 624621 623232 619400 613888 607771 601790 595843 589332 582070 574660 567961 562357 557657
60326 557657 553449 549377 545214 540992 537070 533772 530849 527616 523819 520101 517302 515540 514410 513908
60312 513908 514482 516123 518125 520182 523192 528426 536148 545658 556591 569581 585490 604261 624695
60299 624695 645088 663937 680180 693000 701612 705349 703965 697691 687041 672803 656305 639390
$$ packed form
60400D70347J211J409J025Q0n34j02Q18J207J170J701K997M065M152L668L284
60385D96498K976K423J822J547J502J326J130J335J917K335K368K414K725K776
60371E25094J924M81m79l81K54O59P45Q60J078J214J273J387J422J166P91O52
60355E38140P63R58J522K897M745O054O472O786P664Q575Q589P750O882O305N450
60340F19552L757J312j389l832n512o117n981n947o511p262p410o699n604m700
60326E57657m208m072m163m222l922l298k923l233l797l718k799j762j130n02
60312E13908N74J641K002K057L010N234P722R510J0933J2990J5909J8771K0434
60299F24695K0393J8849J6243J2820Q612L737j384o274j0650j4238j6498j6915
$$ plain form
60287 639390 623870 610934 600950 593444 587268 581293 575344 570211 566467 563557 560333 556265 551716 547193
60273 547193 542748 538084 532959 527475 522102 517358 513379 509989 507176 505104 503493 501527 498840 496157
60259 496157 494466 493843 493605 493333 493136 493140 493399 494214 495904 498184 500342 502067 503644 505348 507112 508791
60243 508791 510238 511127 511226 510846 510494 510052 508957 507276 505957 505703 506190 506748 507318 508339 510050 512344 515104
60226 515104 518299 521775 525149 527935 529862 531332 533517 537635 543980 551856 560469 569481 578721 587918
60212 587918 597023 606477 616768 627810 638933 649432 659071 668165 677174 686166 694790 702881 710747
60199 710747 718492 725390 730524 733892 736257 738018 738887 738659 737517 735416 731963 727186 721755 716111 709971
60184 709971 703123 696085 689509 683396 677321 671035 664446 657481 650412 643893 638292 633375 629050 625860
$$ packed form
60287F39390j5520j2936r984p506o176n975n949n133l744k910l224m068m549m523
60273E47193m445m664n125n484n373m744l979l390k813k072j611j966k687k683
60259D96157j691o23k38k72j97MK59Q15J690K280K158J725J577J704J764J679
60243E08791J447Q89R9l80l52m42j095j681j319k54M87N58N70J021J711K294K760
60226E15104L195L476L374K786J927J470K185M118O345P876Q613R012R240R197
60212E87918R105R454J0291J1042J1123J0499R639R094R009Q992Q624Q091P866
60199G10747P745O898N134L368K365J761Q69k28j142k101l453m777n431n644o140
60184G09971o848p038o576o113o075o286o589o965p069o519n601m917m325l190
$$ plain form
60170 625860 624157 623225 621867 619570 616512 612828 608620 604541 601544 599939 599138 598393 597359 596026 594580
60155 594580 593356 592551 591982 591417 591079 591472 592773 594760 597250 600194 603413 606615 609652 612449 614840
60140 614840 616901 619337 623015 628060 633800 639652 645628 651951 658602 665316 671670 677117 681392 685025
60126 685025 689043 693942 699207 704014 708073 711674 715328 719657 725285 732292 739795 746444 751457 755081
60112 755081 758066 760856 763374 765378 766784 767548 767418 766048 763408 759846 755658 750849 745467 739904 734495
60097 734495 728979 722828 716160 709980 705310 702318 700350 698597 696540 694049 691314 688686 686386 684402
60083 684402 682739 681649 681366 681586 681404 679972 677205 673731 670083 666040 660880 654283 646782 639252 632086
60068 632086 625037 617817 610625 603962 598061 592699 587627 582999 579157 576034 573094 569990 567063 564937
$$ packed form
60170F25860j703r32j358k297l058l684m208m079k997j605q01p45j034j333j446
60155E94580j224q05n69n65l38L93J301J987K490K944L219L202L037K797K391
60140F14840K061K436L678N045N740N852N976O323O651O714O354N447M275L633
60126F85025M018M899N265M807M059L601L654M329N628P007P503O649N013L624
60112G55081K985K790K518K004J406P64j30j370k640l562m188m809n382n563n409
60097G34495n516o151o668o180m670k992j968j753k057k491k735k628k300j984
60083F84402j663j090k83K20j82j432k767l474l648m043n160o597p501p530p166
60068F32086p049p220p192o663n901n362n072m628l842l123k940l104k927k126
$$ plain form
60054 564937 563764 563205 563088 563713 565394 568014 571155 574444 577682 580849 584127 587780 591960 596761 602427
60039 602427 609094 616286 623018 628618 633102 636607 638903 639774 639450 638185 635740 631802 626700 621086 615060
60024 615060 608266 600904 593964 588134 582983 577599 571719 565873 560580 555810 551194 546456 541603 536871
60010 536871 532560 528766 525244 521574 517506 513084 508511 504023 499953 496764 494829 494112 494162 494443 494681
59995 494681 494922 495423 496524 498505 501419 505111 509476 514581 520426 526691 532808 538209 542435 545279 547043
59980 547043 548379 549530 549887 548638 545732 541810 537411 532774 528234 524090 519998 515260 509943 505082
59966 505082 501445 498727 496378 494620 494051 494699 496049 497721 499629 501813 504581 508406 513014 516970 518945
59951 518945 519263 519460 520480 522142 524303 527484 531908 536727 540811 543892 546430 548661 550304 551043 550944
$$ packed form
60054E64937j173n59j17O25J681K620L141L289L238L167L278L653M180M801N666
60039F02427O667P192O732N600M484L505K296Q71l24j265k445l938n102n614o026
60024F15060o794p362o940n830n151n384n880n846n293m770m616m738m853m732
60010E36871m311l794l522l670m068m422m573m488m070l189j935p17N0K81K38
59995D94681K41N01J101J981K914L692M365N105N845O265O117N401M226K844J764
59980E47043J336J151L57j249k906l922m399m637m540m144m092m738n317m861
59966E05082l637k718k349j758n69O48J350J672J908K184K768L825M608L956J975
59951E18945L18J97J020J662K161L181M424M819M084L081K538K231J643P39r9
$$ plain form
59936 550944 550392 549837 549499 549265 548991 548962 549807 551792 554457 557174 559878 563046 567121 572242 578413 585579
59920 585579 593520 601939 610808 620466 631213 642865 654794 666323 676911 685977 692843 697119 699062
59907 699062 699290 698143 695549 691519 686457 680818 674705 668109 661368 655134 649825 645309 641190 637340
59893 637340 634171 632387 632399 633973 636549 639868 644076 649201 654842 660528 666130 671701 677199 682626 688345
59878 688345 694946 702746 711480 720310 728126 734128 738306 741194 743016 743396 741989 738972 734585 728654
59864 728654 721095 712641 704430 696927 689739 682469 675280 668534 662389 656920 652286 648553 645526 642937
59850 642937 640686 638895 637808 637715 638869 641474 645733 651754 659293 667694 676102 683592 689165 692147 692896
59835 692896 692812 693298 694935 697792 701946 707063 711804 714462 714320 712011 708623 704859 700935 696738 692035
$$ packed form
59936E50944n52n55l38k34k74k9Q45J985K665K717K704L168M075N121O171P166
59920E85579P941Q419Q869R658J0747J1652J1929J1529J0588R066O866M276J943
59907F99062K28j147k594m030n062n639o113o596o741o234n309m516m119l850
59893F37340l169j784J2J574K576L319M208N125N641N686N602N571N498N427N719
59878F88345O601P800Q734Q830P816O002M178K888J822L80j407l017m387n931
59864G28654p559q454q211p503p188p270p189o746o145n469m634l733l027k589
59850F42937k251j791j087r3J154K605M259O021P539Q401Q408P490N573K982P49
59835F92896q4M86J637K857M154N117M741K658j42k309l388l764l924m197m703
$$ plain form
59820 692035 686879 681794 677247 673121 669189 665921 664144 663865 664022 663536 662114 659968 657276 654120 650543
59805 650543 646504 642083 637758 634053 630879 627719 624508 621726 619447 616912 613456 609447 605873 603266
59791 603266 601350 599569 597663 595804 594358 593467 592866 592220 591533 590964 590371 589471 588414 587751 587753 588176 588757
59774 588757 589491 590314 590997 591553 592404 594025 596713 600606 605394 609929 612766 613406 612690 611899 611967 613488 616605
59757 616605 620553 624166 627376 631588 637934 645759 653485 660403 666803 672728 677618 681156 683697 685752
59743 685752 687575 689256 690714 691583 691594 691075 690619 690347 690049 689986 690903 692992 695396 697068 697787 698124 698789
59726 698789 700274 702727 705763 708595 710729 712422 714131 715636 716183 715537 714499 714065 714309 714399 713632 712177
59710 712177 710761 709908 709623 709672 710028 711091 713514 717628 722967 728532 733702 738704 744067 749869 755787
$$ packed form
59820F92035n156n085m547m126l932l268j777k79J57m86j422k146k692l156l577
59805F50543m039m421m325l705l174l160l211k782k279k535l456m009l574k607
59791F03266j916j781j906j859j446q91o01o46o87n69n93r00j057o63KM23N81
59774E88757P34Q23O83N56Q51J621K688L893M788M535K837O40p16p91O8J521L117
59757F16605L948L613L210M212O346P825P726O918O400N925M890L538K541K055
59743F85752J823J681J458Q69J1n19m56k72k98o3R17K089K404J672P19L37O65
59726F98789J485K453L036K832K134J693J709J505N47o46j038m34K44R0p67j455
59710G12177j416q53k85M9L56J063K423M114N339N565N170N002N363N802N918
$$ plain form
59695 755787 761648 767515 773366 779063 784548 789642 793701 795993 796504 795980 795050 793713 791764 789288 786521
59680 786521 783558 780469 777343 773996 769918 764774 758749 752188 745159 737618 729850 722502 716283 711699
59666 711699 708811 707094 705820 704813 704647 705855 708191 710932 713766 717088 721461 727027 733452 740359
59652 740359 747691 755557 763616 770848 776192 779340 780536 779728 776409 770356 762000 751917 740495 728348
59638 728348 716495 705680 695870 686778 678508 671245 664682 658316 652140 646512 641419 636331 630803 624836
59624 624836 618618 612205 605528 598454 590907 583121 575755 569477 564409 560109 556078 552102 548240 544741
59610 544741 542010 540396 539874 540026 540453 541184 542602 544886 547540 549667 550775 551139 551208 550973 550326 549769 550097
59593 550097 551265 552190 551907 550501 548644 546714 544744 542890 541489 540799 540905 541618 542336 542314 541394 540131
$$ packed form
59695G55787N861N867N851N697N485N094M059K292N11n24r30j337j949k476k767
59680G86521k963l089l126l347m078n144o025o561p029p541p768p348o219m584
59666G11699k888j717j274j007j66J208K336K741K834L322M373N566O425O907
59652G40359P332P866Q059P232N344L148J196q08l319o053q356j0083j1422j2147
59638G28348j1853j0815r810r092q270p263o563o366o176n628n093n088n528n967
59624F24836o218o413o677p074p547p786p366o278n068m300m031l976l862l499
59610E44741k731j614n22J52M27P31J418K284K654K127J108L64O9k35o47n57L28
59593E50097J168R25k83j406j857j930j970j854j401o90J06P13P18k2r20j263
$$ plain form
59577 540131 538941 537518 535475 533146 531199 529677 528019 525987 524112 523114 523186 523884 524502 524569 524162 523706
59561 523706 523414 523112 522750 522764 523594 525035 526362 527055 527152 527066 527363 528574 530859 533823 536882 539796 542765
59544 542765 546113 550135 555195 561773 570339 581189 594409 610023 628208 648992 671210 691819
59532 691819 706988 714400 714536 709814 702914 695877 689986 685841 683594 683251 684436 685952 686274 684837 682314
59517 682314 679332 675550 670442 664284 657633 650317 641747 632008 621924 612120 602614 593283 584247 575846
59503 575846 568559 562785 558434 554981 552168 550259 549251 548429 547268 546225 545947 546207 546503 547290 549532
59488 549532 553146 556858 559707 561834 563727 565595 567691 570476 574037 577851 581455 584878 588288 591683
59474 591683 595123 598806 602738 606722 610770 615074 619418 623044 625278 625976 625416 624232 623557 624567 627498
$$ packed form
59577E40131j190j423k043k329j947j522j658k032j875r98P2O98O18O7m07m56
59561E23706k92l02l62J4Q30J441J327O93R7q6K97J211K285K964L059K914K969
59544E42765L348M022N060O578Q566J0850J3220J5614J8185K0784K2218K0609
59532F91819J5169P412J36m722o900p037n891m145k247l43J185J516L22j437k523
59517F82314k982l782n108o158o651p316q570r739j0084r804r506r331r036q401
59503E75846p287n774m351l453k813j909j008q22j161j043k78K60K96P87K242
59488E49532L614L712K849K127J893J868K096K785L561L814L604L423L410L395
59474E91683L440L683L932L984M048M304M344L626K234O98n60j184o75J010K931
$$ plain form
59459 627498 631421 635287 639035 643528 649619 657399 666167 674966 683273 691161 698812 706071 712668 718512
59445 718512 723437 726839 727966 726411 722046 714823 705170 694315 683608 673657 664591 656856 650972 646588
59431 646588 642579 638237 633875 630267 628041 627548 628730 631144 634709 640359 649233 661271 675250 690190
59417 690190 705970 722673 740289 759230 780232 803459 828356 854220 879683 901307 914135
59406 914135 914883 904389 886665 866302 847060 831600 821162 815729 815254 820175 829754 840232 845885
59393 845885 842465 829508 809716 786805 763790 742356 723169 706623 693195 683008 675468 669756
59381 669756 665567 663006 661951 661939 662619 663971 666123 669203 673330 678499 684497 691099 698207 705697 713449
59366 713449 721707 731136 742117 754200 766630 779235 792371 806150 820274 834670 849733 865640
$$ packed form
59459F27498L923L866L748M493O091P780Q768Q799Q307P888P651P259O597N844
59445G18512M925L402J127j555m365p223r653j0855j0707r951r066p735n884m384
59431F46588m009m342m362l608k226m93J182K414L565N650Q874J2038J3979J4940
59417F90190J5780J6703J7616J8941K1002K3227K4897K5864K5463K1624J2828
59406I14135P48j0494j7724k0363j9242j5460j0438n433m75M921R579J0478N653
59393H45885l420j2957j9792k2911k3015k1434j9187j6546j3428j0187p540n712
59381F69756m189k561j055j2O80J352K152L080M127N169N998O602P108P490P752
59366G13449Q258R429J0981J2083J2430J2605J3136J3779J4124J4396J5063J5907
$$ plain form
59354 865640 881840 897639 913165 929329 946775 965211 983959 1002780 1021754 1040481 1057986
59343 1057986 1073560 1087247 1099247 1109252 1116678 1121150 1122356 1119886 1113775 1104948 1094500 1082725
59331 1082725 1069401 1054723 1039211 1022942 1005797 988463 972176 957290 942998 928728 914950
59320 914950 902233 890439 879424 869703 861711 854995 848897 843587 839627 836848 834408 831819 829322
59307 829322 827405 826469 826820 828449 830863 833553 836576 840298 844754 849766 855634 863193 872977 884417
59293 884417 895777 904621 908569 906231 897745 884452 868033 849940 831376 813445 797164 783329
59281 783329 772285 763876 757792 753978 752538 753302 755910 760371 767137 776321 787222 798889 810916
59268 810916 823309 835748 847333 857119 864670 870118 873768 875673 875529 872947 867758 860050 850138 838619
$$ packed form
59354H65640J6200J5799J5526J6164J7446J8436J8748J8821J8974J8727J7505
59343A057986J5574J3687J2000J0005P426M472J206k470o111q827j0448j1775
59331A082725j3324j4678j5512j6269j7145j7334j6287j4886j4292j4270j3778
59320I14950j2717j1794j1015r721p992o716o098n310l960k779k440k589k497
59307H29322j917r36L51J629K414K690L023L722M456N012N868P559R784J1440
59293H84417J1360Q844L948k338q486j3293j6419j8093j8564j7931j6281j3835
59281G83329j1044q409o084l814j440P64K608M461O766R184J0901J1667J2027
59268H10916J2393J2439J1585R786P551N448L650J905j44k582n189p708r912j1519
$$ plain form
59254 838619 826232 813400 800200 787093 775173 765115 756234 747480 739202 732942 729359 727349 725598
59241 725598 724144 723881 725222 727818 731083 734457 737573 740635 744269 748680 753241 757134 759836 760751 759141
59226 759141 755042 749724 744612 740051 735553 730823 726071 721780 718687 717513 718107 719197 719578 719343 719477
59211 719477 720620 722739 725660 729245 733196 737177 741079 744894 748636 752626 757377 762789 767987 772405
59197 772405 776485 780700 784465 786803 787664 787811 787706 787360 787008 787013 787191 787052 786707 786855 787846 789335 790789
59180 790789 791709 791548 790177 788441 787475 787363 787187 786497 786020 786737 788943 792611 798010 805386 814251 823469
59164 823469 832058 839803 847202 854837 862639 869677 874853 877808 879084 879443 879151 877825 874882 870186 864320
59149 864320 858049 851551 844481 836803 829012 821287 812980 803354 792410 780670 768600 756719 745726
$$ packed form
59254H38619j2387j2832j3200j3107j1920j0058q881q754q278o260l583k010j751
59241G25598j454k63J341K596L265L374L116L062L634M411M561L893K702R15j610
59226G59141m099n318n112m561m498m730m752m291l093j174N94J090L81k35J34
59211G19477J143K119K921L585L951L981L902L815L742L990M751N412N198M418
59197G72405M080M215L765K338Q61J47j05l46l52NJ78j39l45J48R91J489J454
59180G90789R20j61j371j736r66j12j76o90m77P17K206L668N399P376Q865R218
59164H23469Q589P745P399P635P802P038N176K955J276L59k92j326k943m696n866
59149H64320o271o498p070p678p791p725q307r626j0944j1740j2070j1881j0993
$$ plain form
59136 745726 735887 726623 717309 708159 699753 692061 684646 677576 671438 666610 663153 661257 661179 662839 666002
59121 666002 670616 676404 682512 688337 694535 702399 712342 723696 735758 748128 760106 770824 780149
59108 780149 788607 796217 802227 806220 808698 810204 810615 809642 807335 803661 798197 790851 782533 774632 767960
59093 767960 762487 757802 753528 749437 745447 741506 737531 733608 730066 726994 723789 719652 714546 709170
59079 709170 703918 698334 691791 684414 677135 670999 666411 662822 659218 655154 651178 647925 645065 641639
59065 641639 637293 632590 628157 624182 620774 618180 616320 614609 612515 610052 607594 605479 603851 602591
59051 602591 601405 600231 599510 599717 600687 601818 602824 603786 604514 604418 603161 601030 598576 596229 594301 592950
59035 592950 592026 591240 590502 589895 589505 589607 590805 593490 597267 601366 605527 610077 615391 621800 629772 639418
$$ packed form
59136G45726r839r264r314r150q406p692p415p070o138m828l457j896p8J660L163
59121F66002M614N788O108N825O198P864R943J1354J2062J2370J1978J0718R325
59108G80149Q458P610O010L993K478J506M11r73k307l674n464p346q318p901o672
59093G67960n473m685m274m091l990l941l975l923l542l072l205m137n106n376
59079G09170n252n584o543p377p279o136m588l589l604m064l976l253k860l426
59065F41639m346m703m433l975l408k594j860j711k094k463k458k115j628j260
59051F02591j186j174p21K07R70J131J006R62P28r6j257k131k454k347j928j351
59035E92950r24p86p38o07l90J02J198K685L777M099M161M550N314O409P972R646
$$ plain form
59019 639418 649878 659937 669182 677851 685583 691247 694316 695658 696492 697052 696670 694857 691970 688893
59005 688893 686267 684025 681879 680276 680337 682481 685740 689078 692842 697935 703993 709552 713889 717453 720439
58990 720439 722235 722630 722389 722097 721368 719871 718277 717518 717701 718443 719785 722139 725648 730142 735564 742148
58974 742148 750318 760555 773065 787518 803466 820940 840108 860426 880751 900371 919277 937378
58962 937378 954245 969772 984284 997655 1008976 1017362 1022450 1023938 1021430 1015089 1005747 994049 980059
58949 980059 963927 946219 927399 907756 888091 869561 852483 836194 820572 806661 795162
58938 795162 785221 775585 766313 758446 752551 748397 745675 744158 743348 742649 741816 740905 740036 739492 739608 740264
58922 740264 740918 741425 742198 743258 743884 743687 743278 743224 743087 742298 741384 741454 742857 745189 748207 751959 756298
$$ packed form
59019F39418J0460J0059R245Q669P732N664L069J342Q34N60l82j813k887l077
59005F88893k626k242k146j603O1K144L259L338L764N093O058N559M337L564K986
58990G20439J796L95k41k92p29j497j594p59J83P42J342K354L509M494N422O584
58974G42148Q170J0237J2510J4453J5948J7474J9168K0318K0325J9620J8906J8101
58962I37378J6867J5527J4512J3371J1321Q386N088J488k508o341r342j1698j3990
58949I80059j6132j7708j8820j9643j9665j8530j7078j6289j5622j3911j1499
58938G95162r941r636r272p867n895m154k722j517q10o99q33r11q69n44J16O56
58922G40264O54N07P73J060O26j97m09n4j37p89r14P0J403K332L018L752M339
$$ plain form
58905 756298 761147 767091 774984 785062 796980 810481 825332 840861 856284 871487 886915 902767
58893 902767 918826 935022 951610 968840 986868 1005961 1026372 1047975 1070223 1092319 1113222
58882 1113222 1131796 1147345 1159860 1169556 1176463 1180641 1182291 1181290 1177070 1169471 1159409 1148276 1137004
58869 1137004 1126073 1115894 1106560 1097581 1088519 1079740 1071962 1065173 1058458 1050777 1041611 1031080 1019776
58856 1019776 1008261 996393 983394 968875 953464 938177 923651 910272 898361 887552 876547
58845 876547 864266 851039 838036 825818 814116 802680 791525 780446 769081 757534 746366
58834 746366 735907 726117 717079 709095 702199 696100 690774 686762 684684 684616 686043 688358 691408 695536
58820 695536 700991 707364 713897 720274 726725 733429 740349 747644 755482 763253 769773 774642 778653 782414
$$ packed form
58905G56298M849N944P893J0078J1918J3501J4851J5529J5423J5203J5428J5852
58893I02767J6059J6196J6588J7230J8028J9093K0411K1603K2248K2096K0903
58882A113222J8574J5549J2515R696O907M178J650j001m220p599j0062j1133j1272
58869A137004j0931j0179r334q979r062q779p778o789o715p681r166j0531j1304
58856A019776j1515j1868j2999j4519j5411j5287j4526j3379j1911j0809j1005
58845H76547j2281j3227j3003j2218j1702j1436j1155j1079j1365j1547j1168
58834G46366j0459r790r038p984o896o099n326m012k078o8J427K315L050M128
58820F95536N455O373O533O377O451O704O920P295P838P771O520M869M011L761
$$ plain form
58806 782414 785386 786902 787301 787151 786017 782978 778061 772186 765936 759243 752107 744736 736973 728354 718873
58791 718873 709199 700139 692314 686169 681771 678725 676775 676385 678162 681887 686691 692082 698163 704894
58777 704894 711737 718160 723997 729141 733197 735524 735457 732553 726914 719282 710591 701373 691651 681261
58763 681261 670241 659084 648687 639809 632574 626678 621946 618286 615351 612896 611317 611011 611232 610624
58749 610624 609072 607964 608313 609721 611688 614739 619413 625170 631294 638103 646240 655394 664635 673499
58735 673499 681977 689987 697665 705606 714066 722474 730380 738077 745503 751492 755223 757647 760317 763507
58721 763507 766674 770028 774256 779237 784540 790804 799076 808896 818493 826867 834362 841119 846314 849194
58707 849194 849736 848046 843968 837487 828680 817234 802810 785884 767483 748161 728086 707921 688669
$$ packed form
58806G82414K972J516L99j50j134l039m917n875o250o693p136p371p763q619r481
58791G18873r674r060p825o145m398l046j950l90J777L725M804N391O081O731
58777G04894O843O423N837N144M056K327o7k904n639p632q691r218r722j0390
58763F81261j1020j1157j0397q878p235n896m732l660k935k455j579l06K21o08
58749F10624j552j108L49J408J967L051M674N757O124O809Q137R154R241Q864
58735F73499Q478Q010P678P941Q460Q408P906P697P426N989L731K424K670L190
58721G63507L167L354M228M981N303O264Q272R820R597Q374P495O757N195K880
58707H49194N42j690m078o481q807j1446j4424j6926j8401j9322k0075k0165j9252
$$ plain form
58694 688669 670703 653805 638047 623798 611003 599370 589048 580219 572298 564525 557102 550698
58682 550698 545180 540032 535699 533000 531297 528827 525078 521456 519243 518181 517510 517227 517791 519512 522669
58667 522669 527337 532832 538239 543806 550832 559824 569629 578689 586194 591675 594515 594536 592362 588690 583704
58652 583704 577488 570432 562955 555348 548049 541476 535578 530137 525493 522189 519931 517777 515428 513527
58638 513527 512596 512544 513256 514784 516804 518744 520591 522716 524849 526123 526258 525768 524931 523547 521907 520975
58622 520975 521328 522765 525095 528351 532030 535220 537873 541089 545718 551407 557273 562757 567579 571671
58608 571671 575404 579274 583218 586936 590711 594992 599303 602619 604803 606537 607876 608181 607532 606830 606292
58593 606292 605306 604170 604442 606906 610603 614692 620046 628010 638529 650443 662907 675675 688635
$$ packed form
58694F88669j7966j6898j5758j4249j2795j1633j0322q829p921p773p423o404
58682E50698n518n148m333k699j703k470l749l622k213j062o71k83N64J721L157
58667E22669M668N495N407N567P026Q992R805R060P505N481K840K1k174l672m986
58652E83704o216p056p477p607p299o573n898n441m644l304k258k154k349j901
58638E13527r31n2P12J528K020J940J847K125K133J274J35m90q37j384j640r32
58622E20975L53J437K330L256L679L190K653L216M629N689N866N484M822M092
58608E71671L733L870L944L718L775M281M311L316K184J734J339L05o49p02n38
58593F06292r86j136K72K464L697M089N354P964J0519J1914J2464J2768J2960
$$ plain form
58580 688635 701779 715185 728501 740856 751592 760528 767477 772424 776454 781505 788710 797779 808413
58567 808413 821386 837751 857797 881297 908064 937717 969498 1002689 1036607 1069918 1100621
58556 1100621 1126922 1147614 1161713 1168765 1169667 1166287 1160018 1151537 1141942 1133029 1126151 1121629 1119128
58543 1119128 1117429 1113916 1105846 1092590 1075506 1055550 1032371 1005915 977298 947615 917378 887682
58531 887682 860381 836446 815417 797036 781965 770306 760959 753276 747892 745003 743210 741070 738606
58518 738606 736407 734374 732279 730385 728631 726282 723198 720294 717983 715481 712468 710011 708715 707378
58504 707378 704802 701753 699713 698603 697111 694671 691824 689201 687142 685915 685443 685325 685671 687302 690633
58489 690633 695152 700430 706707 714062 722164 731342 742674 756470 771975 789139 809137 832254 856667
$$ packed form
58580F88635J3144J3406J3316J2355J0736Q936O949M947M030N051P205R069J0634
58567H08413J2973J6365K0046K3500K6767K9653L1781L3191L3918L3311L0703
58556A100621K6301K0692J4099P052R02l380o269q481r595q913o878m522k501
58543A119128j699l513q070j3256j7084j9956k3179k6456k8617k9683l0237k9696
58531H87682k7301k3935k1029j8381j5071j1659r347p683n384k889j793k140k464
58518G38606k199k033k095j894j754k349l084k904k311k502l013k457j296j337
58504G07378k576l049k040j110j492k440k847k623k059j227m72j18L46J631L331
58489F90633M519N278O277P355Q102R178J1332J3796J5505J7164J9998K3117K4413
$$ plain form
58476 856667 880291 902485 922932 940253 952914 960391 962531 959076 950915 940478 929692 918620
58464 918620 906996 895738 885863 877432 870821 867635 868938 873827 881063 890862 903718 918748 934623
58451 934623 950810 966426 979160 987019 990119 989281 984008 973561 959029 942697 926033 909667
58439 909667 894396 880766 868484 857549 849058 843682 840455 838365 837999 840270 844739 850645 858336
58426 858336 868170 879148 890201 901634 913737 925171 934358 941284 946328 948604 947256 943173 937688
58413 937688 930781 922308 913665 906233 899388 891996 884687 878560 872899 866431 859857 854970 852153 850793
58399 850793 851070 853189 855896 858114 861118 866732 874224 881312 887432 893614 899907 905403 910244 915186
58385 915186 919572 921935 922068 920400 916059 907809 896372 883638 870324 856654 844574 836801 834127
$$ packed form
58476H56667K3624K2194K0447J7321J2661P477K140l455q161j0437j0786j1072
58464I18620j1624j1258r875q431o611l186J303M889P236R799J2856J5030J5875
58451I34623J6187J5616J2734P859L100q38n273j0447j4532j6332j6664j6366
58439I09667j5271j3630j2282j0935q491n376l227k090l66K271M469N906P691
58426H58336R834J0978J1053J1433J2103J1434R187O926N044K276j348m083n485
58413I37688o907q473q643p432o845p392p309o127n661o468o574m887k817j360
58399H50793K77K119K707K218L004N614P492P088O120O182O293N496M841M942
58385I15186M386K363J33j668m341q250j1437j2734j3314j3670j2080p773k674
$$ plain form
58372 834127 835799 841769 852142 865237 878873 893094 909176 926627 943902 961490 981329 1003338
58360 1003338 1025278 1045959 1065957 1085246 1102662 1117735 1130668 1140632 1146513 1149247 1151109 1152812
58348 1152812 1153609 1153979 1155665 1159168 1163552 1168719 1175610 1184281 1193910 1204544 1216815 1230414 1244915
58335 1244915 1261424 1281048 1302359 1322838 1342211 1361909 1381871 1400473 1416962 1431341 1442564
58324 1442564 1449581 1453551 1456447 1458261 1458270 1457909 1459380 1462513 1466285 1472415 1483931 1501080 1522290 1548269
58310 1548269 1581201 1620420 1662791 1706868 1752691 1797797 1837582 1869622 1894100 1910532 1918300
58299 1918300 1920098 1920477 1920795 1919465 1916856 1915628 1916430 1917789 1920346 1926743 1937152 1949422 1963712 1982376
58285 1982376 2005047 2028587 2052220 2078103 2106642 2136155 2167389 2203147 2242899 2282959 2322611
$$ packed form
58372H34127J672N970J0373J3095J3636J4221J6082J7451J7275J7588J9839K2009
58360A003338K1940K0681J9998J9289J7416J5073J2933R964N881K734J862J703
58348A152812P97L70J686L503M384N167O891Q671R629J0634J2271J3599J4501
58335A244915J6509J9624K1311K0479J9373J9698J9962J8602J6489J4379J1223
58324A442564P017L970K896J814Rl61J471L133L772O130J1516J7149K1210K5979
58310A548269L2932L9219M2371M4077M5823M5106L9785L2040K4478J6432P768
58299A918300J798L79L18j330k609j228Q02J359K557O397J0409J2270J4290J8664
58285A982376K2671K3540K3633K5883K8539K9513L1234L5758L9752M0060L9652
$$ plain form
58274 2322611 2364815 2410233 2456165 2502285 2551808 2605703 2661324 2718088 2778892 2844414 2911538
58263 2911538 2979053 3049473 3123563 3198511 3273133 3349361 3426995 3502644 3575661 3649502 3725555
58252 3725555 3801415 3876936 3955979 4040298 4127774 4218519 4316382 4422452 4533493 4648957 4772954
58241 4772954 4907170 5048646 5196874 5356057 5527775 5708463 5896797 6096479 6309152
58232 6309152 6531925 6764591 7011810 7275543 7553084 7845151 8157819 8493971 8851401
58223 8851401 9231746 9641948 10084473 10556257 11060163 11606747 12201691 12843141 13534929
58214 13534929 14290053 15117316 16018192 17001847 18089479 19298914 20640129 22131992 23808009
58205 23808009 25700291 27836461 30260858 33042143 36255567 39982632 44341911 49504563
$$ packed form
58274B322611M2204M5418M5932M6120M9523N3895N5621N6764O0804O5522O7124
58263B911538O7515P0420P4090P4948P4622P6228P7634P5649P3017P3841P6053
58252C725555P5860P5521P9043Q4319Q7476R0745R7863J06070J11041J15464J23997
58241D772954J34216J41476J48228J59183J71718J80688J88334J99682K12673
58232F309152K22773K32666K47219K63733K77541K92067L12668L36152L57430
58223H851401L80345M10202M42525M71784N03906N46584N94944O41450O91788
58214A3534929P55124Q27263R00876R83655J087632J209435J341215J491863J676017
58205B3808009J892282K136170K424397K781285L213424L727065M359279N162652
$$ plain form
58197 49504563 55681078 63131872 72211521 83376291 97138809 114058590 134794547
58190 134794547 160092741 190606807 226592926 267501081 311413344 354563697 391614282
58183 391614282 417130758 427636898 422867673 405410395 379246897 348324703 315773463
58176 315773463 283673999 253141737 224630606 198319311 174345950 152813468 133723572
58169 133723572 116981227 102436012 89891221 79107931 69842563 61880809 55031914
58162 55031914 49116954 43983430 39516873 35623248 32211965 29205816 26551341 24205340
58154 24205340 22121385 20258977 18593663 17106739 15773712 14571109 13484921 12503686
58146 12503686 11611787 10797138 10057080 9389203 8783830 8231735 7731131 7280392 6871402
$$ packed form
58197D9504563O176515P450794R079649J1164770J3762518J6919781K0735957
58190A34794547K5298194L0514066L5986119M0908155M3912263M3150353L7050585
58183C91614282K5516476J0506140m769225j7457278k6163498l0922194l2551240
58176C15773463l2099464l0532262k8511131k6311295k3973361k1532482j9089896
58169A33723572j6742345j4545215j2544791j0783290r265368p961754o848895
58162E5031914n914960n133524m466557l893625l411283l006149k654475k346001
58154B4205340k083955j862408j665314j486924j333027j202603j086188r81235
58146A2503686q91899q14649p40058o67877o05373n52095n00604m50739m08990
$$ plain form
58137 6871402 6496480 6154617 5844468 5558047 5287655 5032912 4795134 4570984 4357476
58128 4357476 4157320 3973187 3801730 3638722 3485253 3343641 3211824 3086685 2968570
58119 2968570 2857960 2752133 2649474 2552864 2464612 2382198 2302852 2227862 2158412 2091704 2025471
58108 2025471 1962117 1904217 1849874 1796657 1746124 1700299 1657383 1615081 1574585 1537190 1500487
58097 1500487 1462091 1423913 1388757 1355778 1323236 1292687 1266326 1242836 1219777 1197650 1177951
58086 1177951 1159648 1141106 1123186 1106979 1090707 1072203 1052315 1032773 1012917 991559 969816
58075 969816 948895 927171 902412 874832 845223 812372 775343 736144 697193 658282 618974
58064 618974 581928 550918 527463 511938 505519 507849 514929 522621 530571 539887 549084 555581 559346
$$ packed form
58137F871402l74922l41863l10149k86421k70392k54743k37778k24150k13508
58128D357476k00156j84133j71457j63008j53469j41612j31817j25139j18115
58119B968570j10610j05827j02659r6610q8252q2414p9346p4990o9450o6708o6233
58108B025471o3354n7900n4343n3217n0533m5825m2916m2302m0496l7395l6703
58097A500487l8396l8178l5156l2979l2542l0549k6361k3490k3059k2127j9699
58086A177951j8303j8542j7920j6207j6272j8504j9888j9542j9856k1358k1743
58075I69816k0921k1724k4759k7580k9609l2851l7029l9199l8951l8911l9308
58064F18974l7046l1010k3455j5525o419K330P080P692P950R316R197O497L765
$$ plain form
58051 559346 561714 562114 559173 553665 547312 539978 530950 521588 513622 506090 497027 487016 478071 470033
58037 470033 461177 451599 443081 436128 429845 424130 419431 414792 408604 400962 393183 385520 377405 369328
58023 369328 362476 357015 352467 348970 346484 343758 339937 336181 333845 332172 329749 327031 325246 323963
58009 323963 322040 320122 319874 321483 324053 327706 333106 339574 345815 351994 359122 367014 374739 382390
57995 382390 390449 397998 403377 405882 405010 398999 386350 368248 347584 326135 304540 284163 266699
57982 266699 252335 240202 230196 222581 216483 210737 205666 202190 199840 197618 196128 196709 198967 201246
57968 201246 203152 205491 208153 210144 211508 213137 214927 216090 217082 219220 222421 225213 226915 227999
57954 227999 228434 227604 225901 224562 223828 222935 221936 221796 222585 223264 223478 224095 225807 228609 232742 238752 246479
$$ packed form
58051E59346K368M00k941n508o353p334r028r362p966p532r063j0011q945q038
58037D70033q856r578q518o953o283n715m699m639o188p642p779p663q115q077
58023C69328o852n461m548l497k486k726l821l756k336j673k423k718j785j283
58009C23963j923j918k48J609K570L653N400O468O241O179P128P892P725P651
57995C82390Q059P549N379K505q72o011j2649j8102k0664k1449k1595k0377j7464
57982B66699j4364j2133j0006p615o098n746n071l476k350k222j490N81K258K279
57968B01246J906K339K662J991J364J629J790J163R92K138L201K792J702J084
57954B27999M35q30j703j339p34q93r99j40P89O79K14O17J712K802M133O010P727
$$ plain form
57937 246479 255142 264478 274679 285443 296331 307861 320964 335436 350011 363624 375486 384474
57925 384474 389835 392158 392442 390760 387120 382790 379035 375150 369583 362512 355492 349017 342501 336320
57911 336320 331650 328240 324509 320117 316459 314224 312327 309769 306807 303713 299879 294862 289075 282936
57897 282936 276427 269826 263824 258614 253857 249674 246694 245110 244732 245803 248627 252495 256170 259302
57883 259302 262221 264656 266088 267068 268623 270504 271577 271818 272225 272731 272031 269728 267031 264955 263327
57868 263327 261930 261112 260835 260412 259628 259032 258895 259025 259640 261126 262947 264200 265245 267330 270573 273963
57852 273963 277380 281781 287076 291679 294689 296875 298865 300078 300112 299597 298812 296908 293402 289194 285304
57837 285304 281743 278267 275034 271798 267715 262712 257882 253834 249894 245687 242247 240574 240196 240098 240138
$$ packed form
57937B46479Q663R336J0201J0764J0888J1530J3103J4472J4575J3613J1862Q988
57925C84474N361K323K84j682l640m330l755l885n567p071p020o475o516o181
57911C36320m670l410l731m392l658k235j897k558k962l094l834n017n787o139
57897B82936o509o601o002n210m757m183k980j584l78J071K824L868L675L132
57883B59302K919K435J432R80J555J881J073K41M07N06p00k303k697k076j628
57868B63327j397q18k77m23p84n96j37J30O15J486J821J253J045K085L243L390
57852B73963L417M401N295M603L010K186J990J213L4n15p85j904l506m208l890
57837B85304l561l476l233l236m083n003m830m048l940m207l440j673l78r8M0
$$ plain form
57822 240138 240585 241148 241425 241665 242235 242936 243472 244016 244765 245583 246491 247694 248719 248461 246572 243891 240984
57805 240984 237308 232539 227679 223955 221337 219021 216752 214934 213921 213876 214870 216641 218706 221082 224267
57790 224267 228167 231791 234500 236876 239822 243313 246526 248740 249921 250892 252970 256682 260876 264049
57776 264049 266564 270280 275767 281306 285276 288089 290876 293503 295048 295357 294929 293812 291671 288545 284699
57761 284699 280067 274616 268850 263368 258248 253437 249286 246109 243672 241711 240545 240587 241607 243057 244886
57746 244886 247525 251328 256330 262284 268542 274193 278642 281892 284185 285655 286353 286262 285312 283784 282518
57731 282518 282125 282178 281916 281484 281535 281786 281148 279402 277540 276222 275017 273473 271714 269599 266457 262226
57715 262226 257816 253861 250151 246719 244250 242693 240600 236792 231824 226985 222657 218444 214159 209854
$$ packed form
57822B40138M47N63K77K40N70P01N36N44P49Q18R08J203J025k58j889k681k907
57805B40984l676m769m860l724k618k316k269j818j013m5R94J771K065K376L185
57790B24267L900L624K709K376K946L491L213K214J181R71K078L712M194L173
57776B64049K515L716N487N539L970K813K787K627J545L09m28j117k141l126l846
57761B84699m632n451n766n482n120m811m151l177k437j961j166M2J020J450J829
57746B44886K639L803N002N954O258N651M449L250K293J470O98r1r50j528j266
57731B82518l93N3k62m32N1K51o38j746j862j318j205j544j759k115l142m231
57715B62226m410l955l710l432k469j557k093l808m968m839m328m213m285m305
$$ plain form
57701 209854 205476 201167 197341 193992 190581 187021 183936 181573 179470 177616 176763 176932 176845 175720 174548
57686 174548 174584 175671 177113 179187 182508 186734 191229 196454 203467 212590 223810 238096 257049 281522
57672 281522 311813 349135 395778 453709 523743 605894 699150 799923 900488 989070 1052467
57661 1052467 1080701 1071234 1029478 965224 888414 807171 727520 653343 586734 528924 480461
57650 480461 440418 406667 377728 353638 334499 319204 306388 295621 286765 279110 272150 266303
57638 266303 261801 257748 253379 249365 246606 244551 242138 239695 238378 238162 237876 236981 235928 234887 233486
57623 233486 231694 229808 227594 224572 221106 218144 215906 213757 211262 208422 205070 201121 197342 194847
57609 194847 193773 193304 192882 192570 192357 192051 191716 191412 190620 188810 186337 183961 181758 179462 177469 176271
$$ packed form
57701B09854m378m309l826l349l411l560l085k363k103j854q53J69q7j125j172
57686A74548L6J087J442K074L321M226M495N225P013R123J1220J4286J8953K4473
57672B81522L0291L7322M6643N7931P0034Q2151R3256J00773J00565Q8582O3397
57661A052467K8234r467m1756o4254p6810q1243p9651p4177o6609n7810m8463
57650D80461m0043l3751k8939k4090j9139j5295j2816j0767q856p655o960n847
57638B66303m502m053m369m014k759k055k413k443j317k16k86q95j053j041j401
57623B33486j792j886k214l022l466k962k238k149k495k840l352l949l779k495
57609A94847j074m69m22l12k13l06l35l04p92j810k473k376k203k296j993j198
$$ plain form
57593 176271 175183 172895 169308 165571 162301 158961 155162 151372 148067 145218 142928 141614 141128 140540 139180
57578 139180 137258 135247 133245 131133 128784 126011 122816 119604 116637 113537 110033 106878 105094 104494
57564 104494 103936 102923 101870 100884 99469 97580 95830 94420 92876 91115 89786 89187 88842 88540 88900 90441
57548 90441 92899 95876 99395 103307 106792 108981 109748 109601 109252 109461 110788 113215 116357 119949 123650
57533 123650 126517 127555 126900 125763 125065 124828 124867 125160 125363 124931 124128 124090 125475 127672 129761 131541 133208
57516 133208 134685 135863 137060 138745 141026 143657 146255 148342 149590 150180 150604 151090 151581 152171 152988 153654
57500 153654 153558 152682 151554 150321 148583 146235 143746 141381 138875 136135 133636 131861 130822 130300 129959
57485 129959 129187 127526 125424 123895 123294 123109 123051 123388 123976 123925 122744 121012 119351 117459 114862 112005
$$ packed form
57593A76271j088k288l587l737l270l340l799l790l305k849k290j314m86n88j360
57578A39180j922k011k002k112k349k773l195l212k967l100l504l155j784o00
57564A04494n58j013j053r86j415j889j750j410j544j761j329n99l45l02L60J541
57548I0441K458K977L519L912L485K189P67j47l49K09J327K427L142L592L701
57533A23650K867J038o55j137o98k37L9K93K03m32q03l8J385K197K089J780J667
57516A33208J477J178J197J685K281K631K598K087J248N90M24M86M91N90Q17O66
57500A53654r6q76j128j233j738k348k489k365k506k740k499j775j039n22l41
57485A29959p72j661k102j529o01j85n8L37N88n1j181j732j661j892k597k857
$$ plain form
57469 112005 109819 108531 107590 106631 105901 105757 106115 106483 106434 106052 105877 106330 107307 108493 109754 110836 111085
57452 111085 110127 108606 107515 106982 106543 106366 107165 108779 109979 110064 109773 110205 111580 113514 115765 118189
57436 118189 120524 122705 125030 127682 130528 133531 136835 140255 143289 145833 148261 150621 152446 153624
57422 153624 154748 156296 158101 159910 161731 163277 163822 163221 162447 162639 164025 166221 169088 172714 176835
57407 176835 180719 183614 185279 186244 187399 188917 189841 189343 188114 187665 188466 189787 191299 193499 196381
57392 196381 199004 200896 202769 205235 207840 210042 212298 215508 220104 226125 233305 240613 246621 250962
57378 250962 254549 257919 260445 261789 262895 264575 266179 266835 267171 268594 271435 274852 278015 280410 281600
57363 281600 281839 282516 284949 289003 293700 298674 304060 309455 314146 318202 322389 327090 332131 337482 343398
$$ packed form
57469A12005k186j288r41r59p30j44L58L68m9l82j75M53R77J186J261J082K49
57452A11085r58j521j091n33m39j77P99J614J200Q5k91M32J375J934K251K424
57436A18189K335K181K325K652K846L003L304L420L034K544K428K360J825J178
57422A53624J124J548J805J809J821J546N45o01p74J92J386K196K867L626M121
57407A76835L884K895J665R65J155J518R24m98j229m49Q01J321J512K200K882
57392A96381K623J892J873K466K605K202K256L210M596O021P180P308O008M341
57378B50962L587L370K526J344J106J680J604O56L36J423K841L417L163K395J190
57363B81600K39O77K433M054M697M974N386N395M691M056M187M701N041N351N916
$$ plain form
57348 343398 349944 356997 364425 371802 378363 383912 389286 395260 401493 407290 412771 418386 423902 428901
57334 428901 433849 439585 446105 452861 459860 467336 474737 481291 487404 494242 502070 510204 518594 528081
57320 528081 538846 549801 559931 569268 578228 586851 595120 603267 611411 619453 627559 636181 645424
57307 645424 654970 664671 674601 684546 694185 703829 714203 725381 736722 748035 759962 772839 786013
57294 786013 798770 811407 824884 839713 855523 871420 886624 901063 915477 930670 946696
57283 946696 963077 979646 996680 1014284 1032282 1050635 1069354 1088027 1106204 1124298 1143379
57272 1143379 1163857 1185063 1206359 1227965 1250391 1273707 1297808 1322825 1348775 1375190 1401552
57261 1401552 1427893 1454621 1481953 1509786 1537962 1566378 1594960 1623674 1652501 1681374 1710247
$$ packed form
57348C43398O546P053P428P377O561N549N374N974O233N797N481N615N516M999
57334D28901M948N736O520O756O999P476P401O554O113O838P828Q134Q390R487
57320E28081J0765J0955J0130R337Q960Q623Q269Q147Q144Q042Q106Q622R243
57307F45424R546R701R930R945R639R644J0374J1178J1341J1313J1927J2877J3174
57294G86013J2757J2637J3477J4829J5810J5897J5204J4439J4414J5193J6026
57283I46696J6381J6569J7034J7604J7998J8353J8719J8673J8177J8094J9081
57272A143379K0478K1206K1296K1606K2426K3316K4101K5017K5950K6415K6362
57261A401552K6341K6728K7332K7833K8176K8416K8582K8714K8827K8873K8873
$$ plain form
57250 1710247 1739171 1768215 1797371 1826748 1856632 1887135 1918008 1949124 1980920 2013900 2047933
57239 2047933 2082551 2117813 2154248 2191864 2229750 2266812 2302618 2337469 2371960 2406565 2441404
57228 2441404 2476301 2511024 2545196 2577941 2608259 2636195 2663214 2690839 2719306 2748104 2777357
57217 2777357 2807878 2840180 2874327 2910661 2949839 2992179 3037558 3085843 3136689 3189089 3241905
57206 3241905 3294764 3347654 3399896 3450416 3499002 3546268 3592243 3635941 3676472 3713762 3748030
57195 3748030 3779436 3808483 3835917 3861923 3886087 3908387 3929492 3949942 3969830 3989441 4009370
57184 4009370 4029687 4049765 4069270 4088567 4107981 4127435 4147080 4167401 4188382 4209408 4230338
57173 4230338 4251771 4273879 4295936 4317486 4339012 4360805 4382125 4402298 4421879 4441800 4461896
$$ packed form
57250A710247K8924K9044K9156K9377K9884L0503L0873L1116L1796L2980L4033
57239B047933L4618L5262L6435L7616L7886L7062L5806L4851L4491L4605L4839
57228B441404L4897L4723L4172L2745L0318K7936K7019K7625K8467K8798K9253
57217B777357L0521L2302L4147L6334L9178M2340M5379M8285N0846N2400N2816
57206C241905N2859N2890N2242N0520M8586M7266M5975M3698M0531L7290L4268
57195C748030L1406K9047K7434K6006K4164K2300K1105K0450J9888J9611J9929
57184D009370K0317K0078J9505J9297J9414J9454J9645K0321K0981K1026K0930
57173D230338K1433K2108K2057K1550K1526K1793K1320K0173J9581J9921K0096
$$ plain form
57162 4461896 4481127 4498866 4515243 4530600 4545254 4559501 4573239 4585756 4596279 4604411 4609795 4611859
57150 4611859 4610240 4604935 4595679 4581877 4563557 4541653 4516857 4489030 4458452 4426896 4396613 4368854
57138 4368854 4344119 4323198 4306990 4295799 4289672 4288928 4293294 4300836 4308705 4314830 4318312 4318833 4316847
57125 4316847 4314046 4312542 4313641 4318215 4327820 4344117 4367011 4394265 4423066 4451306 4477638 4501515
57113 4501515 4523396 4544202 4564613 4585721 4610311 4642666 4687308 4748829 4832685 4944838 5090470
57102 5090470 5274127 5501261 5778880 6115400 6521786 7013345 7609410 8331562 9203607
57093 9203607 10252355 11504911 12983198 14701509 16667835 18883333 21339166 24017141
57085 24017141 26894961 29947813 33145047 36451998 39834655 43241959 46555675 49551245
$$ packed form
57162D461896J9231J7739J6377J5357J4654J4247J3738J2517J0523Q132N384K064
57150D611859j619n305r256j3802j8320k1904k4796k7827l0578l1556l0283k7759
57138D368854k4735k0921j6208j1191o127p44M366P542P869O125L482N21j986
57125D316847k801j504J099M574R605J6297K2894K7254K8801K8240K6332K3877
57113D501515K1881K0806K0411K1108K4590L2355M4642O1521Q3856J12153J45632
57102E090470J83657K27134K77619L36520M06386M91559N96065P22152Q72045
57093I203607J048748J252556J478287J718311J966326K215498K455833K677975
57085B4017141K877820L052852L197234L306951L382657L407304L313716K995570
$$ plain form
57077 49551245 51931842 53435831 53938522 53471350 52163262 50170523 47642180 44715651
57069 44715651 41519103 38173245 34793470 31486985 28342040 25418809 22751648 20358245
57061 20358245 18245049 16407382 14829944 13489521 12357484 11402257 10593255 9903839
57053 9903839 9310308 8789765 8321495 7890237 7486273 7102606 6733967 6378348 6036944
57044 6036944 5711489 5402537 5110341 4835655 4578845 4339247 4115955 3908354 3715495
57035 3715495 3535803 3367829 3210632 3063422 2925813 2798582 2683172 2580146 2489050 2410105
57025 2410105 2345018 2295661 2262466 2243735 2234768 2227022 2209907 2175518 2122156 2053285 1973963 1888795
57013 1888795 1802013 1717538 1638164 1565056 1498189 1437110 1381406 1330782 1284930 1243475 1206151
$$ packed form
57077D9551245K380597J503989N02691m67172j308088j992739k528343k926529
57069D4715651l196548l345858l379775l306485l144945k923231k667161k393403
57061B0358245k113196j837667j577438j340423j132037r55227q09002o89416
57053I903839n93531n20543m68270m31258m03964l83667l68639l55619l41404
57044F036944l25455l08952k92196k74686k56810k39598k23292k07601j92859
57035C715495j79692j67974j57197j47210j37609j27231j15410j03026r1096p8945
57025B410105o5087m9357l3195j8731q967p746j7115l4389n3362o8871p9322q5168
57013A888795q6782q4475p9374p3108o6867o1079n5704n0624m5852m1455l7324
$$ plain form
57002 1206151 1172751 1142640 1114666 1088045 1063051 1040195 1019079 998854 979555 962008 946507
56991 946507 932648 920489 910796 903947 899700 898172 899909 904613 910870 917461 923743 928299 928673 923386
56977 923386 913341 900494 886110 871095 856821 844333 833362 823168 813849 805863 798863 792061
56965 792061 785378 779278 773788 768600 763884 760277 758237 757955 759405 761615 762184 758277 748011 730582
56951 730582 705862 674837 640060 604586 570332 537920 507764 480557 456874 436953 420734
56940 420734 407657 396837 388027 382194 380644 383986 392407 406366 426213 451387 480370 510727
56928 510727 538474 558422 566635 562755 549365 529546 505774 480382 455480 432151 410577 390983
56916 390983 373819 359270 347392 338449 332225 327322 322210 316896 312561 309663 307396 305037 302748
$$ packed form
57002A206151l3400l0111k7974k6621k4994k2856k1116k0225j9299j7547j5501
56991I46507j3859j2159r693o849m247j528J737M704O257O591O282M556L74n287
56977I23386j0045j2847j4384j5015j4274j2488j0971j0194r319p986p000o802
56965G92061o683o100n490n188m716l607k040k82J450K210N69l907j0266j7429
56951G30582k4720l1025l4777l5474l4254l2412l0156k7207k3683j9921j6219
56940D20734j3077j0820q810n833j550L342Q421J3959J9847K5174K8983L0357
56928E10727K7747J9948Q213l880j3390j9819k3772k5392k4902k3329k1574j9594
56916C90983j7164j4549j1878q943o224m903n112n314m335k898k267k359k289
$$ plain form
56903 302748 300894 299532 298835 299187 300642 302949 306186 310702 316388 322775 329937 338572 349194 361997
56889 361997 377544 396694 419564 445173 472051 498388 521502 538268 546661 546561 539096 525945
56877 525945 509363 491876 475301 460383 447500 437180 429806 425449 424288 426708 432873 442733 456692
56864 456692 475848 501511 534808 576533 626403 682041 738834 790821 831691 856036 861295 849047
56852 849047 823809 790366 752546 713791 677232 644720 616791 594050 577789 568963 567515 573270
56840 573270 586755 608789 640087 681814 735793 803367 884090 975153 1070778 1161483 1235253
56829 1235253 1281484 1295044 1277327 1234335 1173930 1103739 1030073 957943 891446 833424 784689
56818 784689 744371 711499 685937 667861 657322 654814 661554 678606 706176 744219 792917 851521
$$ packed form
56903C02748j854j362o97L52J455K307L237M516N686O387P162Q635J0622J2803
56889C61997J5547J9150K2870K5609K6878K6337K3114J6766Q393j00p465j3151
56877E25945j6582j7487j6575j4918j2883j0320p374m357j161K420O165R860J3959
56864D56692J9156K5663L3297M1725M9870N5638N6793N1987M0870K4345N259j2248
56852H49047k5238l3443l7820l8755l6559l2512k7929k2741j6261q826j448N755
56840E73270J3485K2034L1298M1727N3979O7574Q0723R1063R5625R0705P3770
56829A235253M6231J3560j7717m2992o0405p0191p3666p2130o6497n8022m8735
56818G84689m0318l2872k5562j8076j0539k508O740J7052K7570L8043M8698N8604
$$ plain form
56806 851521 916430 980567 1034614 1069563 1079739 1064838 1029266 979234 920436 857850 796142
56795 796142 738958 688019 643552 605447 573681 548036 528106 513629 504586 501173 503771 512680
56783 512680 527815 548930 575848 607468 640223 668362 686445 691445 682719 661334 630169 593580
56771 593580 555474 517695 480795 445806 414320 387045 363247 341801 322340 305357 291533
56760 291533 280842 272162 264034 256050 249029 243577 239107 234818 230891 227914 225616 223110 220124 217048
56746 217048 213983 210695 207483 205106 203686 202523 201200 200097 199474 198807 197577 196178 195452 195582 195937
56731 195937 195906 195455 194893 194420 194063 193844 193832 194015 194214 194213 193958 193538 193008 192371 191794 191674 192328 193671 195278
56712 195278 196717 197811 198645 199369 199917 199986 199477 198908 199113 200468 202586 204839 206946 208927 210715 212008
$$ packed form
56806H51521O4909O4137N4047L4949J0176j4901l5572n0032n8798o2586o1708
56795G96142n7184n0939m4467l8105l1766k5645j9930j4477r043l413K598Q909
56783E12680J5135K1115K6918L1620L2755K8139J8083N000q726k1385l1165l6589
56771E93580l8106l7779l6900l4989l1486k7275k3798k1446j9461j6983j3824
56760B91533j0691q680q128p984p021n452m470m289l927k977k298k506k986l076
56746B17048l065l288l212k377j420j163j323j103o23o67j230j399p26J30L55
56731A95937l1m51n62m73l57k19j2J83J99jk55m20n30o37n77j20O54J343J607
56712A95278J439J094Q34P24N48O9n09n69K05J355K118K253K107J981J788J293
$$ plain form
56696 212008 212409 211649 209806 207401 205158 203560 202613 201934 201045 199763 198463 197737 197591 197291 196331 195212
56680 195212 194811 195241 195955 196717 197747 198941 199767 200079 200343 200767 200837 200047 198658 197441 197014 197586 198906
56663 198906 200308 201212 201761 202604 204012 205649 207200 208658 209922 210804 211556 212791 214633 216532 218099
56648 218099 219507 220892 222011 222798 223642 224802 226122 227533 229270 231284 233033 234083 234353 233649 231713
56633 231713 228988 226535 224876 223648 222627 222089 221727 220319 217231 213416 210112 207301 204309 201236 198823
56618 198823 197370 196641 196453 196548 196290 195305 194167 193657 193670 193503 192975 192574 192745 193631 195223 197089 198225 197924
56600 197924 196698 195779 195791 196320 196569 196013 194628 192893 191438 190510 190120 190726 192966 196348 199083 199928 199548
56583 199548 199379 199875 200676 201774 203383 205002 205697 205259 204371 203797 204044 205470 207979 210809 213329 215855
$$ packed form
56696B12008M01p60j843k405k243j598r47o79q89j282j300p26j46l00r60j119
56680A95212m01M30P14P62J030J194Q26L12K64M24P0p90j389j217m27N72J320
56663A98906J402R04N49Q43J408J637J551J458J264Q82P52J235J842J899J567
56648B18099J408J385J119P87Q44J160J320J411J737K014J749J050K70p04j936
56633B31713k725k453j659j228j021n38l62j408l088l815l304k811k992l073k413
56618A98823j453p29j88R5k58r85j138n10J3j67n28m01J71Q86J592J866J136l01
56600A97924j226r19J2N29K49n56j385j735j455r28l90O06K240L382K735Q45l80
56583A99548j69M96Q01J098J609J619O95m38q88n74K47J426K509K830K520K526
$$ plain form
56567 215855 219077 223000 227114 231324 236033 241532 247935 255476 264274 274005 284180 294249 303046 308903
56553 308903 311114 310749 309330 307286 304451 301256 298397 295898 293568 291733 290396 288328 284452 279717
56539 279717 276128 274138 272409 269993 267275 264748 262348 260226 258810 257764 256100 253693 251559 250299
56525 250299 249398 248400 247659 247371 246925 245838 244522 243506 242566 241196 239411 237666 236408 235952 236228 236438
56509 236438 235577 233537 231205 229315 227859 226750 226259 226409 226556 226041 224869 223510 222399 221791 221638 221442
56493 221442 220693 219630 219125 219633 220674 221495 221866 222072 222399 222751 222706 222104 221666 222528 224787 227012 227778 227197
56475 227197 226304 225556 224871 224703 225850 228251 230955 233297 235255 236765 237614 238014 238367 238469 237755 236274
56459 236274 234653 233209 232002 231459 231933 232749 232821 232195 231904 232384 233183 234156 235562 236873 236881 235366 233452
$$ packed form
56567B15855L222L923M114M210M709N499O403P541Q798R731J0175J0069Q797N857
56553C08903K211l65j419k044k835l195k859k499k330j835j337k068l876m735
56539B79717l589j990j729k416k718k527k400k122j416j046j664k407k134j260
56525B50299r01r98p41k88m46j087j316j016r40j370j785j745j258m56K76K10
56509B36438q61k040k332j890j456j109m91J50J47n15j172j359j111o08j53j96
56493B21442p49j063n05N08J041Q21L71K06L27L52m5o02m38Q62K259K225P66n81
56475B27197q93p48o85j68J147K401K704K342J958J510Q49M00L53J02p14j481
56459B36274j621j444j207n43M74Q16P2o26k91M80P99R73J406J311Qj515j914
$$ plain form
56442 233452 231982 230828 230136 230821 233087 235566 236831 236925 236768 236839 237155 237799 238705 239397 239427 238746 237428 235617
56424 235617 233951 233319 233936 235195 236520 237695 238380 238231 237610 237264 237120 236408 235114 234274 234519 235388 236449
56407 236449 237997 240153 242224 243484 243835 243352 241996 240115 238441 237342 236843 237337 239137 241288 242223
56392 242223 241928 242090 243703 245930 247811 249556 251407 252732 253265 253942 255452 257043 257845 258289 259164 260245
56376 260245 260990 261684 262740 263677 263977 264261 265451 267296 268809 269775 270821 272335 274072 275529 276218 276077
56360 276077 276005 277209 279514 281275 281636 281829 283358 285868 287910 288967 289581 290139 290695 291501 292650 293620
56344 293620 294053 294521 295731 297480 299192 300842 302494 303699 304347 305421 307758 310631 312765 314319 316614
56329 316614 320142 324034 327408 330272 333064 336123 339613 343310 346564 348987 350915 352751 354304 355394
$$ packed form
56442B33452j470j154o92O85K266K479J265R4j57P1L16O44R06O92L0o81j318j811
56424B35617j666o32O17J259J325J175O85j49o21l46j44p12j294q40K45Q69J061
56407B36449J548K156K071J260L51m83j356j881j674j099m99M94J800K151R35
56392B42223k95J62J613K227J881J745J851J325N33O77J510J591Q02M44Q75J081
56376B60245P45O94J056R37L00K84J190J845J513R66J046J514J737J457O89j41
56360B76077p2J204K305J761L61J93J529K510K042J057O14N58N56Q06J149R70
56344B93620M33M68J210J749J712J650J652J205O48J074K337K873K134J554K295
56329C16614L528L892L374K864K792L059L490L697L254K423J928J836J553J090
$$ plain form
56315 355394 356647 358876 361924 364793 366753 367849 368606 369674 371433 373632 375834 378305 381778 386138
56301 386138 390406 394417 399326 405658 412047 416976 420862 425220 430504 435901 440705 444806 448325 451794
56287 451794 456268 462297 469205 476169 483465 491840 501280 511359 522204 534178 547073 560553 574836
56274 574836 590023 605368 620228 635269 651754 670058 689754 710623 732643 755553 779447
56263 779447 805428 834712 867461 903273 942387 985653 1033864 1087932 1149124 1218428 1296353
56252 1296353 1384024 1483599 1596676 1723204 1862922 2016862 2186215 2370549 2568401 2778800
56242 2778800 3000746 3231659 3467474 3703692 3935252 4156118 4360325 4542854 4698575
56233 4698575 4821417 4906338 4951698 4958505 4928079 4861865 4762770 4634969 4482710 4310532 4123984
$$ packed form
56315C55394J253K229L048K869J960J096P57J068J759K199K202K471L473M360
56301C86138M268M011M909O332O389M929L886M358N284N397M804M101L519L469
56287D51794M474O029O908O964P296Q375R440J0079J0845J1974J2895J3480J4283
56274E74836J5187J5345J4860J5041J6485J8304J9696K0869K2020K2910K3894
56263G79447K5981K9284L2749L5812L9114M3266M8211N4068O1192O9304P7925
56252A296353Q7671R9575J13077J26528J39718J53940J69353J84334J97852K10399
56242B778800K21946K30913K35815K36218K31560K20866K04207J82529J55721
56233D698575J22842Q4921M5360O807l0426o6214r9095j27801j52259j72178j86548
$$ plain form
56222 4123984 3928546 3728164 3525934 3325453 3129958 2940916 2758997 2585786 2422913
56213 2422913 2270311 2127140 1993792 1871103 1758251 1653563 1556946 1469330 1389963 1316528
56203 1316528 1247981 1185121 1128221 1076206 1028544 985907 948347 914538 883462 855340 830384
56192 830384 807981 787649 769565 753725 739675 727366 717162 708705 700779 692565 684153 675886
56180 675886 668150 661666 656929 653417 650251 647373 645094 643049 640803 639018 638628 639289 640055 641126 643349
56165 643349 646425 649259 651845 655214 659712 664974 671328 679581 689469 699899 710588 722074 734384
56152 734384 747211 761101 776875 794260 812668 832856 856028 881835 909162 938458 971220
56141 971220 1007571 1046558 1088786 1136754 1192837 1258868 1337183 1429280 1532940 1642472 1751880
$$ packed form
56222D123984j95438k00382k02230k00481j95495j89042j81919j73211j62873
56213B422913j52602j43171j33348j22689j12852j04688r6617q7616p9367p3435
56203A316528o8547o2860n6900n2015m7662m2637l7560l3809l1076k8122k4956
56192H30384k2403k0332j8084j5840j4050j2309j0204q457p926q214q412q267
56180F75886p736o484m737l512l166k878k279k045k246j785l90O61P66J071K223
56165F43349L076K834K586L369M498N262O354Q253R888J0430J0689J1486J2310
56152G34384J2827J3890J5774J7385J8408K0188K3172K5807K7327K9296L2762
56141I71220L6351L8987M2228M7968N6083O6031P8315R2097J03660J09532J09408
$$ plain form
56130 1751880 1856242 1951089 2033677 2105394 2170464 2231654 2288843 2341186 2387756 2425838 2451616
56119 2451616 2463709 2464269 2456319 2442029 2423492 2402136 2376289 2341379 2293368 2230633 2152938 2061393
56107 2061393 1959939 1854395 1749239 1647147 1551483 1466223 1392702 1329017 1273449 1226155
56097 1226155 1186954 1154208 1126872 1105302 1089034 1076037 1065080 1056775 1051503 1048335 1046619 1046464
56085 1046464 1047141 1047241 1046967 1048043 1050928 1054430 1058400 1064230 1072330 1081829 1093286 1108984 1129887 1154971
56071 1154971 1183966 1217834 1255936 1295619 1335247 1374669 1412144 1444021 1468292 1485476 1495495
56060 1495495 1497206 1491833 1483225 1473535 1462108 1449573 1439165 1432512 1427893 1424362 1424073 1428704 1436961
56047 1436961 1447410 1460494 1476061 1492251 1508664 1527413 1549455 1573164 1597966 1625744 1656945
$$ packed form
56130A751880J04362R4847Q2588P1717O5070O1190N7189N2343M6570L8082K5778
56119B451616J2093N60p950j4290j8537k1356k5847l4910m8011o2735p7695r1545
56107B061393j01454j05544j05156j02092r5664q5260p3521o3685n5568m7294
56097A226155l9201l2746k7336k1570j6268j2997j0957q305n272l168j716j55
56085A046464O77J00k74J076K885L502L970N830Q100R499J1457J5698K0903K5084
56071A154971K8995L3868L8102L9683L9628L9422L7475L1877K4271J7184J0019
56060A495495J711n373q608r690j1427j2535j0408o653m619l531k89M631Q257
56047A436961J0449J3084J5567J6190J6413J8749K2042K3709K4802K7778L1201
$$ plain form
56036 1656945 1689006 1720526 1753370 1788813 1825304 1862005 1900797 1942816 1986664 2031897 2080340
56025 2080340 2131997 2183737 2234184 2285837 2340315 2395765 2451157 2508695 2569586 2631800 2694421
56014 2694421 2759757 2828797 2899415 2971455 3048541 3132109 3218877 3307048 3399623 3498514 3601140
56003 3601140 3706366 3818139 3939405 4067944 4201991 4344263 4496513 4656030 4821644
55994 4821644 4997211 5184963 5381685 5585837 5801862 6032889 6276194 6530966 6803384
55985 6803384 7098532 7414522 7750197 8111037 8501527 8919728 9365787 9847594 10371378
55976 10371378 10935503 11540786 12197897 12917217 13701425 14556527 15500005 16549495 17714748
55967 17714748 19010424 20465240 22109042 23965246 26068842 28479406 31266817 34504321
$$ packed form
56036A656945L2061L1520L2844L5443L6491L6701L8792M2019M3848M5233M8443
56025B080340N1657N1740N0447N1653N4478N5450N5392N7538O0891O2214O2621
56014B694421O5336O9040P0618P2040P7086Q3568Q6768Q8171R2575R8891J02626
56003C601140J05226J11773J21266J28539J34047J42272J52250J59517J65614
55994D821644J75567J87752J96722K04152K16025K31027K43305K54772K72418
55985F803384K95148L15990L35675L60840L90490M18201M46059M81807N23784
55976A0371378N64125O05283O57111P19320P84208Q55102R43478J049490J165253
55967A7714748J295676J454816J643802J856204K103596K410564K787411L237504
$$ plain form
55959 34504321 38294663 42791182 48186134 54710565 62674593 72488685 84625448 99595886
55951 99595886 117998734 140544673 167927094 200556223 238204518 279499529 321359058
55944 321359058 358940059 386723467 400484281 398900612 383695060 358434960 327066779
55937 327066779 293026165 258951658 226659147 197210559 171075284 148326964 128789463
55930 128789463 112137778 97994708 86000697 75825634 67160341 59733420 53331393
55923 53331393 47786716 42955669 38720016 34994988 31715363 28817422 26243446 23952561
55915 23952561 21913016 20090193 18452552 16981363 15663208 14478744 13408036 12440187
55907 12440187 11568058 10779174 10060512 9406580 8814233 8274657 7778236 7322363 6906780
$$ packed form
55959C4504321L790342M496519N394952O524431P964028R814092J2136763J4970438
55951I9595886J8402848K2545939K7382421L2629129L7648295M1295011M1859529
55944C21359058L7581001K7783408J3760814j583669j5205552k5260100l1368181
55937C27066779l4040614l4074507l2292511k9448588k6135275k2748320j9537501
55930A28789463j6651685j4143070j1994011j0175063q665293p426921o402027
55923E3331393n544677m831047m235653l725028l279625k897941k573976k290885
55915B3952561k039545j822823j637641j471189j318155j184464j070708r67849
55907A2440187q72129p88884p18662o53932n92347n39576m96421m55873m15583
$$ plain form
55898 6906780 6526010 6173522 5848661 5552333 5280253 5027144 4793250 4580038 4383551
55889 4383551 4198558 4025405 3866483 3719617 3581078 3451596 3333354 3224359 3121544
55880 3121544 3026151 2940231 2860801 2783000 2706157 2631474 2556750 2479013 2399748 2322199 2245918
55869 2245918 2169144 2094020 2024190 1959403 1897477 1839428 1787558 1740453 1695007 1651816 1613700
55858 1613700 1580202 1548180 1516697 1487020 1458931 1431102 1404124 1379368 1355921 1332057 1308396
55847 1308396 1286182 1264008 1239720 1214134 1189450 1165507 1141009 1116792 1094283 1072272 1048758
55836 1048758 1024550 1001450 978284 952368 923588 893556 862043 827894 792374 758102 725779
55825 725779 695366 669298 650885 640318 635521 635944 642189 652924 665614 679510 694650 708866
$$ packed form
55898F906780l80770l52488l24861k96328k72080k53109k33894k13212j96487
55889D383551j84993j73153j58922j46866j38539j29482j18242j08995j02815
55880C121544r5393q5920p9430p7801p6843p4683p4724p7737p9265p7549p6281
55869B245918p6774p5124o9830o4787o1926n8049n1870m7105m5446m3191l8116
55858A613700l3498l2022l1483k9677k8089k7829k6978k4756k3447k3864k3661
55847A308396k2214k2174k4288k5586k4684k3943k4498k4217k2509k2011k3514
55836A048758k4208k3100k3166k5916k8780l0032l1513l4149l5520l4272l2323
55825G25779l0413k6068j8413j0567m797M23O245J0735J2690J3896J5140J4216
$$ plain form
55813 708866 719296 726093 731277 734660 734385 730870 726634 722562 717789 713041 710670 711238 713108 715465
55799 715465 718877 722841 725537 726216 725409 722834 717477 709485 699691 687680 672776 656509 641651 629243
55785 629243 618894 611211 607003 604557 600599 593896 585438 575589 563947 551744 541420 533738 527821
55772 527821 523871 523193 525785 530580 537738 547750 558345 565469 567763 567334 565910 563105 558858 554543
55758 554543 550821 546920 542851 539950 538451 536633 532935 526714 516538 500243 477654 451276 423636
55745 423636 395880 369409 346406 327729 312184 298846 288330 281042 276002 272295 270045 269189 268822
55732 268822 268465 268523 268952 268977 268605 268858 269949 270715 270375 269363 268001 265897 263145 260634 258647 256613 254586
55715 254586 253517 253660 254202 254871 256382 258963 261988 265444 270088 275692 280726 284356 287238 289872 291660
$$ packed form
55813G08866J0430O797N184L383k75l515m236m072m773m748k371N68J870K357
55799G15465L412L964K696O79q07k575n357p992r794j2011j4904j6267j4858j2408
55785F29243j0349p683m208k446l958o703q458r849j1642j2203j0324p682n917
55772E27821l950o78K592M795P158J0012J0595P124K294m29j424k805m247m315
55758E54543l722l901m069k901j499j818l698o221j0176j6295k2589k6378k7640
55745D23636k7756k6471k3003j8677j5545j3338j0516p288n040l707k250q56l67
55732B68822l57N8M29K5l72K53J091P66l40j012j362k104k752k511j987k034k027
55715B54586j069J43N42O69J511K581L025L456M644N604N034L630K882K634J788
$$ plain form
55700 291660 292135 291678 290432 287953 284378 280640 277130 273536 270212 268114 267057 265732 263844 262535 262234
55685 262234 261963 261468 262187 265140 269454 273917 278535 283592 288549 292835 296528 299449 300803 300469 299396
55670 299396 298009 295509 291567 287382 284207 281981 280199 278951 278322 277936 277875 278896 281013 283030 284246
55655 284246 285442 287486 290152 293105 296657 300592 303455 304076 302874 300743 297706 293514 288487 282816
55641 282816 276043 268165 260315 253436 247179 240886 234628 228445 221741 214537 208279 204258 202035 200454
55627 200454 199249 198514 197499 195358 192545 190220 188696 187501 186503 185874 185265 184086 182402 180756 179275
55612 179275 177662 175855 174129 172803 172211 172531 173176 172989 171600 170041 169429 169585 169585 169103 168526 168078 167459
55595 167459 166136 163755 160633 157965 156896 157156 157395 156991 156573 156532 156234 155266 154271 153810 153487 153069 153366
$$ packed form
55700B91660M75m57j246k479l575l738l510l594l324k098j057j325j888j309l01
55685B62234k71m95P19K953M314M463M618N057M957M286L693K921J354l34j073
55670B99396j387k500l942m185l175k226j782j248o29l86o1J021K117K017J216
55655B84246J196K044K666K953L552L935K863O21j202k131l037m192n027n671
55641B82816o773p878p850o879o257o293o258o183o704p204o258m021k223j581
55627B00454j205p35j015k141k813k325j524j195r98o29o09j179j684j646j481
55612A79275j613j807j726j326n92L20O45j87j389j559o12J56%m82n77m48o19
55595A67459j323k381l122k668j069K60K39m04m18m1k98r68r95m61l23m18K97
$$ plain form
55578 153366 154906 156667 157359 157280 157714 158990 160307 161113 161634 162287 163476 165632 168574 171078 171905 171099
55562 171099 169697 168550 168078 168652 170262 172070 173096 173222 172933 172367 171316 169907 168526 167261 166084
55547 166084 165417 165854 167332 169030 170010 169773 168470 166934 166186 166525 167420 168471 169963 172138 174498 176275
55531 176275 177084 176771 175279 173153 171507 170854 170515 169690 168435 166990 164898 161717 158028 154832 152280
55516 152280 149834 147314 144956 142740 140535 138768 138129 138611 139391 139617 138909 137349 135448 133866 132750
55501 132750 131603 130137 128833 128216 128114 128115 128215 128400 128129 126982 125408 124162 123362 122778 122612 123217 124309
55484 124309 125189 125525 125356 124755 124173 124631 126734 129709 132220 133865 135097 136052 136415 136259 135998 135452 133932
55467 133932 131388 128710 126648 125136 123891 123048 122814 122950 122944 122488 121641 120679 119919 119562 119702 120488 122074
$$ packed form
55578A53366J540J761O92p9M34J276J317Q06N21O53J189K156K942K504Q27q06
55562A71099j402j147m72N74J610J808J026J26k89n66j051j409j381j265j177
55547A66084o67M37J478J698R80k37j303j536p48L39Q95J051J492K175K360J777
55531A76275Q09l13j492k126j646o53l39q25j255j445k092l181l689l196k552
55516A52280k446k520k358k216k205j767o39M82P80K26p08j560j901j582j116
55501A32750j147j466j304o17j02JJ00J85k71j147j574j246q00n84j66O05J092
55484A24309Q80L36j69o01n82M58K103K975K511J645J232R55L63j56k61n46j520
55467A33932k544k678k062j512j245q43k34J36om56q47r62p60l57J40P86J586
$$ plain form
55450 122074 124253 126393 127980 129057 129922 130639 131009 130774 129697 127790 125648 124178 123752 123966 124341 124783
55434 124783 125129 124914 123983 122865 122173 122073 122599 123833 125315 125998 125381 124207 123515 123450 123470 123181 122449 121289
55416 121289 120170 119889 120578 121383 121590 121406 121134 120491 119414 118623 118441 118010 116732 115662 116094 117416 117874
55399 117874 117047 116081 115690 115474 115240 115515 116478 117572 118531 119727 121159 122099 122077 121380 120288 118676 116696
55382 116696 115049 114162 113721 113355 113182 113418 114007 114896 116207 117898 119680 121310 122490 122603 121254 119135
55366 119135 117587 117125 117076 116889 117003 117994 119497 120588 120939 121090 121668 122620 123283 123102 122214 121143 119975
55349 119975 118286 116139 114548 114360 115132 115772 115977 116236 116680 116835 116507 116055 115702 115290 114808 114469 114151 113472
55331 113472 112569 112193 112840 114300 116108 117879 119173 119651 119494 119116 118446 117135 115512 114571 114732 115247 115100
$$ packed form
55450A22074K179K140J587J077Q65P17L70k35j077j907k142j470m26K14L75M42
55434A24783L46k15r31j118o92j00N26J234J482O83o17j174o92o5K0k89p32j160
55416A21289j119k81O89Q05K07j84k72o43j077p91j82m31j278j070M32J322M58
55399A17874q27r66l91k16k34K75R63J094R59J196J432R40k2o97j092j612j980
55382A16696j647q87m41l66j73K36N89Q89J311J691J782J630J180J13j349k119
55366A19135j548m62m9j87J14R91J503J091L51J51N78R52O63j81q88j071j168
55349A19975j689k147j591j88P72O40K05K59M44J55l28m52l53m12m82l39l18o79
55331A13472r03l76O47J460J808J771J294M78j57l78o70j311j623r41J61N15j47
$$ plain form
55314 115100 114008 112345 110656 109513 109378 110281 111855 113750 115654 117052 117528 117359 117255 117428 117494 117364
55298 117364 117580 118544 119938 121189 122096 122760 123269 123605 123617 123102 122278 121989 122875 124399 125353 125320 124964 124855
55280 124855 124778 124370 123692 122877 121902 121011 120733 121080 121256 120506 118861 116848 115061 114220 114950 116968 118986
55263 118986 119938 119969 119861 119895 119829 119645 119698 120174 120828 121291 121401 121212 120840 120291 119483 118477 117622 117289 117554 118294
55243 118294 119437 120787 121847 122283 122387 122593 122589 121597 119559 117389 115864 114855 113925 113192 113179 114094 115590
55226 115590 117109 118310 119261 120199 121065 121482 121413 121447 121933 122232 121532 120186 119420 119738 120414 120625 120303 119710
55208 119710 118973 118336 118189 118529 118933 119328 120166 121588 122963 123596 123452 122997 122800 123401 124950 126730 127608
55191 127608 127218 126219 125303 124561 123950 123601 123365 122739 121654 120680 120128 119618 118916 118506 118832 119551 120078 120340
$$ packed form
55314A15100j092j663j689j143j35R03J574J895J904J398M76j69j04J73O6j30
55298A17364K16R64J394J251R07O64N09L36J2n15q24k89Q86J524R54l3l56j09
55280A24855p7m08o78q15r75q91k78L47J76p50j645k013j787q41P30K018K018
55263A18986R52L1j08L4o6j84N3M76O54M63J10j89l72n49q08j006q55l33K65P40
55243A18294J143J350J060M36J04K06mr92k038k170j525j009r30p33j3R15J496
55226A15590J519J201R51R38Q66M17o9L4M86K99p00j346p66L18O76K11l22n93
55208A19710p37o37j47L40M04L95Q38J422J375O33j44m55j97O01J549J780Q78
55191A27608l90r99r16p42o11l49k36o26j085r74n52n10p02m10L26P19N27K62
$$ plain form
55173 120340 120545 120719 120959 121623 122775 123916 124667 125200 125585 125377 124459 123666 123820 124602 125164 125451 126065 127080
55155 127080 127937 128506 129418 131046 132754 133551 133228 132580 132474 132857 132818 131711 129976 128550 127729 127160 126811
55138 126811 127116 127981 128449 127772 126219 124520 123156 122568 123258 124956 126307 126163 124867 123678 123291 123558
55122 123558 124204 125044 125721 125921 125718 125229 124267 122931 122059 122295 123005 123047 122482 122532 123765 125280 125983 125844
55104 125844 125474 125166 124930 125023 125758 126912 127838 128196 128299 128689 129564 130651 131520 131981 132216 132523 132935 133178
55086 133178 133129 133222 134105 135747 137142 137319 136516 135886 136008 136337 136292 136148 136344 136609 136582 136724 137676 139072 140055
55067 140055 140720 141847 143262 143802 143162 142456 142484 142653 142262 141711 141577 141504 140953 140252 139851 139267 137926 136523
55049 136523 136296 137134 137577 136715 135088 133550 132149 130493 128682 127463 127594 129101 131029 132067 131595 130054
$$ packed form
55173A20340K05J74K40O64J152J141P51N33L85k08r18p93J54P82N62K87O14J015
55155A27080Q57N69R12J628J708P97l23o48j06L83l9j107j735j426q21n69l49
55138A26811L05Q65M68o77j553j699j364n88O90J698J351j44j296j189l87K67
55122A23558O46Q40O77K00k03m89r62j336q72K36P10M2n65N0J233J515P03j39
55104A25844l70l08k36R3P35J154R26L58J03L90Q75J087Q69M61K35L07M12K43
55086A33178m9R3Q83J642J395J77q03o30J22L29m5j44J96K65k7J42R52J396R83
55067A40055O65J127J415N40o40p06K8J69l91n51j34p3n51p01m01n84j341j403
55049A36523k27Q38M43q62j627j538j401j656j811j219J31J507J928J038m72j541
$$ plain form
55033 130054 128290 126934 126449 127075 128333 129157 129046 128570 128291 127825 126656 125407 125370 126954 129289 131232
55017 131232 132238 132393 132115 131774 131312 130523 129854 130267 131835 133201 133148 132176 131694 132122 132677 132661 132092 131340
54999 131340 130965 131695 133726 136166 137927 138937 139822 140777 141555 142167 142636 142455 141349 140307 140690 142436
54983 142436 144261 145496 146475 147160 146875 145691 144784 144829 145104 144751 144008 143624 143855 144570 145658 146766 147306
54966 147306 147215 147145 147494 147864 147903 148043 148919 150571 152611 154583 155800 155522 153905 152256 151693 151864 151501 149947
54948 149947 147660 145523 144135 143587 143531 143544 143617 144050 144785 145267 145161 144838 144863 145407 146381 147723 149265 150731
54930 150731 152205 154224 157094 160422 163710 167095 171135 176167 182220 189362 197768 207444 218024 228707
54916 228707 238384 246083 251379 254184 254283 251574 246732 240936 234748 227836 220026 211990 204523 197764 191586
$$ packed form
55033A30054j764j356m85O26J258Q24j11m76k79m66j169j249l7J584K335J943
55017A31232J006J55k78l41m62p89o69M13J568J366n3r72m82M28N55j6n69p52
54999A31340l75P30K031K440J761J010Q85R55P78O12M69j81j106j042L83J746
54983A42436J825J235R79O85k85j184r07M5K75l53p43l84K31P15J088J108N40
54966A47306r1p0L49L70L9J40Q76J652K040J972J217k78j617j649n63J71l63j554
54948A49947k287k137j388n48n6J3P3M33P35M82j06l23K5N44R74J342J542J466
54930A50731J474K019K870L328L288L385M040N032O053P142Q406R676J0580J0683
54916B28707R677P699N296K805R9k709m842n796o188o912p810q036p467o759o178
$$ plain form
54901 191586 186154 181531 177211 172764 168675 165868 164538 163985 163459 162652 161446 159783 157932 156512 156114
54886 156114 157043 159293 162514 166080 169528 173050 177420 183425 191422 201202 211999 222675 232131 239690
54872 239690 245129 248493 249904 249431 247078 242898 237078 229783 221132 211633 202474 194781 188520 182627
54858 182627 176439 170556 166055 163319 161911 161150 160403 159213 157618 156182 155269 154488 153198 151361 149450
54843 149450 147716 146015 144358 143104 142488 142262 141984 141481 140862 140219 139510 138757 138236 138287 138896 139605 140037 140341
54825 140341 140886 141605 141993 141766 141176 140582 140020 139365 138654 138093 137879 138091 138541 138754 138373 137578 136890 136606 136745
54806 136745 137451 138871 140571 141642 141677 141171 140733 140345 139737 139033 138595 138480 138529 138825 139720 141485 144080 147082
54788 147082 149705 151208 151559 151488 151672 152105 152371 152245 151858 151609 152126 153944 156959 160450 163843 167099 170287
$$ packed form
54901A91586n432m623m320m447m089k807j330n53n26q07j206j663j851j420l98
54886A56114R29K250L221L566L448L522M370O005P997R780J0797J0676R456P559
54872B39690N439L364J411m73k353m180n820p295q651r499r159p693o261n893
54858A82627o188n883m501k736j408p61p47j190j595j436r13p81j290j837j911
54843A49450j734j701j657j254o16k26k78n03o19o43p09p53n21N1O09P09M32L04
54825A40341N45P19L88k27n90n94n62o55p11n61k14K12M50K13l81p95o88k84J39
54806A36745P06J420J700J071L5n06m38l88o08p04m38j15M9K96Q95J765K595L002
54788A47082K623J503L51p1J84M33K66j26l87k49N17J818L015L491L393L256L188
$$ plain form
54771 170287 173370 176732 181284 187486 194727 202255 210309 219594 229912 240059 249052 256726 263003 267172
54757 267172 268206 265615 259818 251879 242909 233575 224190 215192 207250 200699 195207 190243 185700 181760
54743 181760 178482 175797 173662 171901 170211 168671 167821 167817 167958 167710 167801 169422 172482 175563 177733 179592
54727 179592 182214 185800 189887 194411 199947 206956 215160 223701 231775 239015 245217 249738 251568 250291
54713 250291 246709 242019 236557 229861 221941 213778 206402 200069 194692 190506 187753 185931 183855 180570
54699 180570 176091 171366 167634 165597 164905 164480 163494 162016 160628 159627 158805 157899 156923 155961 154879 153511
54683 153511 152065 151052 150602 150095 148815 147019 145936 146437 147989 149286 149728 149847 150343 151175 151786 151842 151472
54666 151472 150889 150099 148996 147640 146347 145482 145166 145227 145479 145922 146574 147222 147489 147129 146182 144999 144267 144758
$$ packed form
54771A70287L083L362M552O202P241P528Q054R285J0318J0147Q993P674O277M169
54757B67172J034k591n797p939q970r334r385q998p942o551n492m964m543l940
54743A81760l278k685k135j761j690j540q50mJ41k48R1J621L060L081K170J859
54727A79592K622L586M087M524N536P009Q204Q541Q074P240O202M521J830j277
54713B50291l582m690n462o696p920q163p376o333n377m186k753j822k076l285
54699A80570m479m725l732k037o92m25r86j478j388j001q22r06r76r62j082j368
54683A53511j446j013m50n07j280j796j083N01J552J297M42J19M96Q32O11N6l70
54666A51472n83p90j103j356j293q65l16O1K52M43O52O48K67l60r47j183p32M91
$$ plain form
54648 144758 146607 148821 149924 149309 147802 146809 147110 148527 150438 152247 153517 153992 153651 152599 150962
54633 150962 149035 147440 146846 147332 148243 148873 149197 149692 150541 151287 151334 150534 149211 147818 146725 146116 145924
54616 145924 145996 146405 147389 148853 150263 151272 152135 153140 153917 153824 152861 151693 150826 150258 149886 149743 149744 149673 149470
54597 149470 149141 148447 147254 146109 145778 146117 146213 145801 145696 146419 147275 147414 147067 146947 147087 147140 147375 148329 149665
54578 149665 150365 150090 149553 149387 149386 149115 148716 148767 149597 150934 152036 152200 151425 150485 150136 150343 150588 150702 150955
54559 150955 151445 151977 152519 153280 154264 155197 155970 156733 157453 157734 157244 156140 155010 154549 155187 156733 158472
54542 158472 159869 161030 162173 162939 162801 162031 161602 162067 163062 164003 164709 165224 165554 165870 166467 167225 167451 166585
54524 166585 164842 162925 161304 160014 158970 158285 158262 159052 160236 160942 160669 159904 159555 159835 160125 159889 159269
$$ packed form
54648A44758J849K214J103o15j507r93L01J417J911J809J270M75l41j052j637
54633A50962j927j595n94M86R11O30L24M95Q49P46M7q00j323j393j093o09j92
54616A45924P2M09R84J464J410J009Q63J005P77r3r63j168q67n68l72j43Jp1k03
54597A49470l29o94j193j145l31L39R6m12j05P23Q56J39l47j20J40N3K35R54J336
54578A49665P00k75n37j66jk71l99N1Q30J337J102J64p75r40l49K07K45J14K53
54559A50955M90N32N42P61R84R33P73P63P20K81m90j104j130m61O38J546J739
54542A58472J397J161J143P66j38p70m29M65R95R41P06N15L30L16N97P58K26q66
54524A66585j743j917j621j290j044o85k3P90J184P06k73p65l49K80K90k36o20
$$ plain form
54507 159269 158695 158354 158158 157891 157255 156188 155154 154807 155299 156283 157568 159217 161000 162422 163482 164715
54491 164715 166150 166903 166347 165118 164348 164310 164494 164666 165079 165628 165591 164502 162862 161676 161450 161798 161988 161729
54473 161729 161361 161256 161218 160795 160168 160269 161736 164089 166294 167884 169131 170251 170984 171053 170647 170250 170139
54456 170139 170204 170163 169838 169231 168434 167554 166786 166444 166702 167286 167629 167426 166860 166207 165467 164525 163455 162438 161535
54437 161535 160735 160109 159734 159559 159551 159865 160632 161686 162764 163951 165603 167715 169617 170539 170441 170061 170114 170556
54419 170556 170785 170449 169825 169326 168951 168451 167832 167310 166864 166290 165779 165996 167285 169045 170254 170511 170277 170181
54401 170181 170381 170663 170901 171220 171816 172717 173740 174624 175227 175708 176544 178184 180516 182767 184151 184609 184636
54384 184636 184468 183901 183010 182417 182385 182125 180742 178646 177252 177274 178048 178713 179319 180337 181634 182547 182761 182708
$$ packed form
54507A59269n74l41j96k67o36j067j034l47M92R84J285J649J783J422J060J233
54491A64715J435P53n56j229p70l8J84J72M13N49l7j089j640j186k26L48J90k59
54473A61729l68j05l8m23o27J01J467K353K205J590J247J120P33O9m06l97j11
54456A70139O5m1l25o07p97q80p68l42K58N84L43k03n66o53p40r42j070j017r03
54437A61535q00o26l75j75qL14P67J054J078J187J652K112J902R22r8l80N3M42
54419A70556K29l36o24m99l75n00o19n22m46n74n11K17J289J760J209K57k34r6
54401A70181K00K82K38L19N96R01J023Q84O03M81Q36J640K332K251J384M58K7
54384A84636j68n67q91n93l2k60j383k096j394K2P74O65O06J018J297R13K14n3
$$ plain form
54366 182708 183101 184331 186158 187846 188742 188903 189057 189838 191319 193323 195866 199030 202730 206839 211272
54351 211272 215684 219423 222195 224507 226959 229202 230124 229084 226621 223771 221021 218053 214257 209361
54337 209361 203757 198422 194381 192047 191034 190602 190207 189547 188305 186234 183673 181697 181357 182693 184714
54322 184714 186369 187281 187520 187170 186446 185804 185389 184612 182883 180689 179298 179276 179808 179645 178263 175969 173463
54305 173463 171597 171044 171703 172631 172932 172525 171906 171484 171421 171761 172356 172919 173420 174123 174958 175259 174563 173380
54287 173380 172663 172718 173139 173641 174341 175223 175926 176250 176483 177029 177944 178944 179661 179856 179586 179210 179064 179123 179169
54268 179169 179189 179383 179814 180377 181154 182471 184452 186717 188641 189774 189986 189396 188331 187260 186587 186454 186697
54251 186697 187025 187303 187668 188232 188678 188374 187114 185531 184534 184410 184704 184835 184562 183900 183006 182258 182124 182691
$$ packed form
54366A82708L93J230J827J688Q96J61J54P81J481K004K543L164L700M109M433
54351B11272M412L739K772K312K452K243R22j040k463k850k750k968l796m896
54337B09361n604n335m041k334j013m32l95o60j242k071k561j976l40J336K021
54322A84714J655R12K39l50p24o42m15p77j729k194j391k2N32j63j382k294k506
54305A73463j866n53O59R28L01m07o19m22o3L40N95N63N01P03Q35L01o96j183
54287A73380p17N5M21N02P00Q82P03L24K33N46R15J000P17J95k70l76j46N9M6
54268A79169K0J94M31N63P77J317J981K265J924J133K12n90j065j071o73j33K43
54251A86697L28K78L65N64M46l04j260j583r97j24K94J31k73o62q94p48j34N67
$$ plain form
54233 182691 183471 183874 183789 183569 183553 183776 184110 184451 184715 184793 184665 184504 184540 184794 185077 185208 185141 184869 184448 184140
54213 184140 184273 184775 185128 185002 184694 184616 184609 184196 183351 182471 181680 180763 179791 179154 178804 178153 177090 176441 176901
54194 176901 177941 178437 178098 177714 178098 179337 180969 182403 183062 182600 181164 179310 177650 176642 176537 177222
54178 177222 178204 179042 179766 180692 181854 182864 183275 182911 181916 180626 179346 178091 176707 175293 174288 173895
54162 173895 173720 173247 172524 172107 172465 173636 175236 176590 177146 177072 177135 177615 177776 176949 175830 175874 177464 179468
54144 179468 180753 181401 182128 183099 183863 184128 184055 183907 183761 183607 183507 183567 183792 183989 183845 183199 182250 181434 181066
54125 181066 181116 181269 181174 180865 180952 182130 184262 186211 186943 186583 186073 185995 186233 186669 187599 189252 191300 193118
54107 193118 194393 195331 196420 197955 199640 200700 200621 199714 198713 197943 197194 196333 195571 195085 194814 194764 195140
$$ packed form
54233A82691P80M03q5k20j6K23L34L41K64P8j28j61L6K54K83J31o7k72m21l08
54213A84140J33N02L53j26l08p8pm13q45q80p91r17r72o37l50o51j063o49M60
54194A76901J040M96l39l84L84J239J632J434O59m62j436j854j660j008j05O85
54178A77222R82Q38P24R26J162J010M11l64r95j290j280j255j384j414j005l93
54162A73895j75m73p23m17L58J171J600J354N56p4O3M80J61q27j119M4J590K004
54144A79468J285O48P27R71P64K65p3j48j46j54j00O0K25J97j44o46r49q16l68
54125A81066N0J53r5l09Q7J178K132J949P32l60n10p8K38M36R30J653K048J818
54107A93118J275R38J089J535J685J060p9r07j001p70p49q61p62m86k71n0L76
$$ plain form
54090 195140 195951 196759 197058 196836 196632 197065 198286 199749 200668 200892 201204 202468 204695 207352 210415 214471
54074 214471 219733 225571 231331 237083 243149 249156 253997 256626 256759 254969 252313 249688 247308 244887
54060 244887 242335 239983 238050 236238 234233 232340 231253 231231 231842 232561 233375 234710 236880 239746 242893
54045 242893 245997 248974 251797 254421 257023 260170 264494 270189 276930 284273 292009 300220 309103 318635
54031 318635 328248 337021 344470 351031 357511 364212 370868 377264 383383 389001 393637 397040 399389 400981
54017 400981 402070 403036 404209 405381 405836 405014 402836 399333 394432 388306 381463 374195 366311 357704 348904
54002 348904 340740 333654 327571 322140 316855 311193 305006 298705 292910 288079 284445 281888 279600 276351
53988 276351 271561 265976 260961 257264 254697 252759 251155 249811 248792 248206 248014 247957 247848 247767 247733 247383 246260
$$ packed form
54090A95140Q11Q08K99k22k04M33J221J463R19K24L12J264K227K657L063M056
54074B14471N262N838N760N752O066O007M841K629J33j790k656k625k380k421
54060B44887k552k352j933j812k005j893j087k2O11P19Q14J335K170K866L147
54045B42893L104K977K823K624K602L147M324N695O741P343P736Q211Q883R532
54031C18635R613Q773P449O561O480O701O656O396O119N618M636L403K349J592
54017D00981J089R66J173J172M55q22k178l503m901o126o843p268p884q607q800
54002C48904q164p086o083n431n285n662o187o301n795m831l634k557k288l249
53988B76351m790n585n015l697k567j938j604j344j019n86j92n7j09q1l4l50j123
$$ plain form
53971 246260 244374 242222 240365 239190 238879 239268 239798 239961 239820 239865 240390 241229 242085 242878 243786 245200 247555
53954 247555 250935 254799 258327 261092 263203 264889 266278 267742 270091 274085 279720 286195 292580 298495
53940 298495 304205 310220 316865 324166 332038 340481 349551 359212 369269 379549 390083 401007 412278
53927 412278 423666 435212 447655 462087 479051 498052 517894 537159 554199 567195 574906 577543
53915 577543 576773 574857 573769 574600 577160 580197 582551 584231 586019 588092 589562 589486 587797 585046 581656
53900 581656 577729 573207 567924 561801 555258 549054 543450 537735 530841 522172 511716 499796 487118
53887 487118 474655 462936 451566 439834 427672 415681 404420 394116 384964 377151 370430 364065
53875 364065 357413 350436 343553 337149 331324 325971 320908 315918 310768 305365 299950 294962 290518 286239
$$ packed form
53971B46260j886k152j857j175l11L89N30J63j41M5N25Q39Q56P93R08J414K355
53954B47555L380L864L528K765K111J686J389J464K349L994N635O475O385N915
53940B98495N710O015O645P301P872Q443R070R661J0057J0280J0534J0924J1271
53927D12278J1388J1546J2443J4432J6964J9001J9842J9265J7040J2996P711K637
53915E77543p70j916j088Q31K560L037K354J680J788K073J470p6j689k751l390
53900E81656l927m522n283o123o543o204n604n715o894q669j0456j1920j2678
53887D87118j2463j1719j1370j1732j2162j1991j1261j0304r152p813o721o365
53875C64065o652o977o883o404n825n353n063m990n150n403n415m988m444m279
$$ plain form
53861 286239 281863 277825 274722 272255 269355 265553 261659 258716 256742 254954 252848 250622 248783 247718
53847 247718 247407 247203 246190 244175 242062 240851 240591 240748 241190 242079 243014 243158 242347 241398 241078 241259 241352 241229
53829 241229 241401 242419 244208 245880 246357 245438 244190 243951 245000 246543 247888 249127 250651 252483 254330
53814 254330 255931 257199 258328 259904 262621 266625 271320 275943 280225 284529 289513 295689 303049 311103
53800 311103 319448 328211 337637 347384 356664 365055 372673 379499 385106 389316 392568 395288 397335 398527
53786 398527 399371 400660 402444 403889 404166 403078 400781 397364 392901 387621 381694 374944 367033 357968 348278
53771 348278 338664 329608 321378 314207 308209 303151 298552 294145 290066 286458 283062 279443 275555 271823
53757 271823 268636 265892 263078 259732 255839 251887 248507 245999 244245 243059 242370 241909 241011 239153 236649
$$ packed form
53861B86239m376m038l103k467k900l802l894k943j974j788k106k226j839j065
53847B47718l11k04j013k015k113j211k60J57M42Q89R35J44q11r49l20J81R3j23
53829B41229J72J018J789J672M77r19j248k39J049J543J345J239J524J832J847
53814B54330J601J268J129J576K717M004M695M623M282M304M984O176P360Q054
53800C11103Q345Q763R426R747R280Q391P618O826N607M210L252K720K047J192
53786C98527Q44J289J784J445K77j088k297l417m463n280n927o750p911r065r690
53771C48278r614r056q230p171n998n058m599m407m079l608l396l619l888l732
53757B71823l187k744k814l346l893l952l380k508j754j186o89m61q98j858k504
$$ plain form
53742 236649 234454 233240 232919 233069 233491 234193 235126 236194 237377 238592 239512 239767 239433 239185 239731 241043 242255
53725 242255 242455 241477 239876 238312 237336 237547 239325 242169 244832 246548 247759 249240 250843 251696 251383 250379
53709 250379 249422 249047 249639 251238 253211 254722 255788 257362 260166 263955 268134 272532 277137 281542 285243
53694 285243 288239 290870 293183 294955 296240 297424 298688 299789 300571 301336 302487 303937 305159 305766 305826
53679 305826 305507 304687 303173 301189 299301 297766 296375 295093 294401 294552 294915 294683 294054 293950 294527 294819 294183
53662 294183 293303 293161 293523 293298 292213 291334 291764 293409 295274 296575 297184 297292 297071 296739 296596 296817 297331
53645 297331 298052 299148 300820 302840 304578 305630 306206 306708 307202 307606 308233 309622 311813 314187 316118 317453
53629 317453 318302 318847 319498 320745 322506 324049 325067 326467 329460 333964 338517 341843 343938 345471 346754
$$ packed form
53742B36649k195j214l21J50M22P02R33J068J183J215R20K55l34k48N46J312J212
53725B42255K00r78j601j564r76K11J778K844K663J716J211J481J603Q53l13j004
53709B50379r57l75N92J599J973J511J066J574K804L789M179M398M605M405L701
53694B85243K996K631K313J772J285J184J264J101P82P65J151J450J222O07O0
53679C05826l19q20j514j984j888j535j391j282o92J51L63k32o29j04N77K92o36
53662B94183q80j42L62k25j085q79M30J645J865J301O09J08k21l32j43K21N14
53645B97331P21J096J672K020J738J052N76N02M94M04O27J389K191K374J931J335
53629C17453Q49N45O51J247J761J543J018J400K993M504M553L326K095J533J283
$$ plain form
53614 346754 347786 348898 350713 353503 357040 361125 365830 371096 376485 381559 386231 390575 394560 398267
53600 398267 402098 406380 410940 415416 419768 424015 427660 430021 431104 431472 431210 429856 427651 425971 425841
53585 425841 426582 426662 425416 423256 420673 417999 415925 415167 415409 415405 414334 412483 410476 408581 407022 406197
53569 406197 406062 405781 404567 402656 401107 400704 401297 402056 402321 402315 402936 404614 406556 407660 408015 408820 410686
53552 410686 412774 413868 413633 412472 410848 409337 408762 409605 411472 413632 415800 417995 420049 421816 423646
53537 423646 426066 429090 432302 435514 438998 443129 448085 453747 459634 465210 470594 476653 484017 492285
53523 492285 500683 509183 518350 528342 538785 549630 561367 574223 587714 601294 615018 629334
53511 629334 644565 660857 678361 697151 717053 737667 758552 779401 800199 821198 842652
$$ packed form
53614C46754J032J112J815K790L537M085M705N266N389N074M672M344L985L707
53600C98267L831M282M560M476M352M247L645K361J083L68k62j354k205j680j30
53585D25841P41Q0j246k160k583k674k074p58K42mj071j851k007j895j559q25
53569D06197j35k81j214j911j549m03N93P59K65oO21J678J942J104L55Q05J866
53552D10686K088J094k35j161j624j511n75Q43J867K160K168K195K054J767J830
53537D23646K420L024L212L212L484M131M956N662N887N576N384O059P364Q268
53523D92285Q398Q500R167R992J0443J0845J1737J2856J3491J3580J3724J4316
53511F29334J5231J6292J7504J8790J9902K0614K0885K0849K0798K0999K1454
$$ plain form
53500 842652 864555 886668 908606 929774 949547 967890 985582 1003382 1021106 1038025 1054076
53489 1054076 1070089 1086737 1103844 1120932 1137909 1154844 1171571 1187973 1204388 1221210 1238272
53478 1238272 1255091 1271653 1288424 1305467 1321999 1337053 1350259 1361642 1370911 1377473 1381213 1382770
53466 1382770 1382817 1381351 1378060 1373120 1367145 1360357 1352338 1342832 1332396 1321979 1312047 1302365 1292411 1281668
53452 1281668 1269729 1256499 1242338 1227737 1212890 1197775 1182545 1167468 1152443 1136960 1120814
53441 1120814 1104701 1089939 1077600 1067959 1060669 1055245 1051276 1048273 1045626 1042981 1040641 1039279 1039151
53428 1039151 1039740 1040286 1040499 1040640 1041095 1042089 1043798 1046521 1050697 1056685 1064450 1073494 1083346 1094120 1106376
53413 1106376 1120401 1135942 1152691 1170656 1189858 1210073 1231193 1253467 1277061 1301705 1327231
$$ packed form
53500H42652K1903K2113K1938K1168J9773J8343J7692J7800J7724J6919J6051
53489A054076J6013J6648J7107J7088J6977J6935J6727J6402J6415J6822J7062
53478A238272J6819J6562J6771J7043J6532J5054J3206J1383R269O562L740J557
53466A382770M7j466l291m940n975o788q019r506j0436j0417r932r682r954j0743
53452A281668j1939j3230j4161j4601j4847j5115j5230j5077j5025j5483j6146
53441A120814j6113j4762j2339r641p290n424l969l003k647k645k340j362j28
53428A039151N89N46K13J41M55R94J709K723M176N988P765R044R852J0774J2256
53413A106376J4025J5541J6749J7965J9202K0215K1120K2274K3594K4644K5526
$$ plain form
53402 1327231 1354187 1383334 1414619 1447193 1480502 1514939 1551334 1590147 1631256 1674245 1718720
53391 1718720 1764486 1811508 1859558 1907969 1955964 2003230 2050012 2096655 2143210 2189379 2234620
53380 2234620 2278287 2319890 2359247 2396323 2430998 2463081 2492404 2518734 2541723 2561127 2576871
53369 2576871 2588701 2595973 2598017 2594578 2585679 2571337 2551788 2527744 2500043 2469161 2435431 2399552
53357 2399552 2362438 2324671 2286477 2248070 2209592 2170929 2132256 2094731 2059950 2028472 1999304
53346 1999304 1970944 1942490 1913647 1884283 1854341 1823886 1792976 1761799 1731084 1702006 1675354
53335 1675354 1650951 1628080 1606321 1585876 1567280 1550973 1536976 1524836 1513860 1503332 1492412
53324 1492412 1480154 1466060 1450478 1434065 1416946 1398923 1380377 1362268 1345099 1328487 1312036
$$ packed form
53402A327231K6956K9147L1285L2574L3309L4437L6395L8813M1109M2989M4475
53391A718720M5766M7022M8050M8411M7995M7266M6782M6643M6555M6169M5241
53380B234620M3667M1603L9357L7076L4675L2083K9323K6330K2989J9404J5744
53369B576871J1830P272K044l439q899j4342j9549k4044k7701l0882l3730l5879
53357B399552l7114l7767l8194l8407l8478l8663l8673l7525l4781l1478k9168
53346A999304k8360k8454k8843k9364k9942l0455l0910l1177l0715k9078k6652
53335A675354k4403k2871k1759k0445j8596j6307j3997j2140j0976j0528j0920
53324A492412j2258j4094j5582j6413j7119j8023j8546j8109j7169j6612j6451
$$ plain form
53313 1312036 1296091 1281309 1267941 1255935 1245402 1236608 1229649 1224300 1219959 1215755 1211198 1206924 1204239
53300 1204239 1203675 1204492 1205969 1208602 1213482 1220943 1230497 1241809 1254995 1269996 1286333 1303683 1322249
53287 1322249 1342343 1363735 1385531 1406625 1426398 1445010 1462943 1480183 1496136 1510367 1522945
53276 1522945 1533780 1542125 1547235 1549226 1548789 1546322 1541943 1536089 1529259 1521024 1510088 1495708 1478686
53263 1478686 1460555 1442099 1423049 1402975 1382035 1360820 1339765 1318849 1297763 1276282 1254524
53252 1254524 1232902 1211852 1191577 1172013 1153058 1134777 1117257 1100188 1082751 1064172 1044421
53241 1044421 1024206 1004310 985141 966820 949295 932263 915366 898717 882906 868263 854452
53230 854452 841182 828950 818568 810068 802590 795371 788322 781460 774197 765567 754998 742595 728685
$$ packed form
53313A312036j5945j4782j3368j2006j0533q794o959n349m341m204m557m274k685
53300A204239n64Q17J477K633M880P461R554J1312J3186J5001J6337J7350J8566
53287A322249K0094K1392K1796K1094J9773J8612J7933J7240J5953J4231J2578
53276A522945J0835Q345N110J991m37k467m379n854o830q235j0936j4380j7022
53263A478686j8131j8456j9050k0074k0940k1215k1055k0916k1086k1481k1758
53252A254524k1622k1050k0275j9564j8955j8281j7520j7069j7437j8579j9751
53241A044421k0215j9896j9169j8321j7525j7032j6897j6649j5811j4643j3811
53230H54452j3270j2232j0382q500p478p219p049o862p263q630j0569j2403j3910
$$ plain form
53217 728685 713396 696807 679315 661549 643798 625783 607290 588963 572110 557621 545321
53206 545321 534381 524084 514068 504248 494774 485787 476957 467524 457100 446186 435548 425285
53194 425285 414953 404465 394386 385247 376959 369039 361177 353478 346306 339985 334574 329890 325771
53181 325771 322197 319061 316017 312754 309310 305899 302586 299355 296403 294051 292448 291536 291225 291319 291387 291050
53165 291050 290356 289624 288923 288019 286780 285337 283799 282130 280350 278591 276932 275459 274512 274476 275191 275883
53149 275883 275908 275365 274730 274095 273065 271451 269809 269101 269729 271000 271714 271345 270475 269973 269994 270043 269797 269478
53131 269478 269444 269834 270650 271868 273286 274548 275465 276167 276843 277493 278061 278648 279460 280582 281871 283024 283766
53114 283766 284099 284354 284865 285628 286383 286984 287465 287781 287715 287093 285942 284405 282664 280949 279451 278183 277038
$$ packed form
53217G28685j5289j6589j7492j7766j7751j8015j8493j8327j6853j4489j2300
53206E45321j0940j0297j0016r820r474q987q830r433j0424j0914j0638j0263
53194D25285j0332j0488j0079r139q288p920p862p699p172o321n411m684m119
53181C25771l574l136l044l263l444l411l313l231k952k352j603r12l11R4O8l37
53165B91050o94p32p01r04j239j443j538j669j780j759j659j473r47l6P15O92
53149B75883K5n43o35o35j030j614j642p08O28J271P14l69q70n02K1M9k46l19
53131B69478l4L90Q16J218J418J262R17P02O76O50N68N87Q12J122J289J153P42
53114B83766L33K55N11P63P55O01M81L16o6o22j151j537j741j715j498j268j145
$$ plain form
53097 277038 275927 274771 273487 272246 271600 271952 272958 273837 274277 274625 275081 275233 274676 273742 273215 273438 273970
53080 273970 274075 273403 272285 271498 271582 272373 273302 274095 274813 275180 274474 272490 270223 269049 269325 270183 270652 270550
53062 270550 270307 270331 270688 271112 271148 270448 269078 267495 266185 265407 265246 265705 266650 267765 268710 269359 269878 270500
53044 270500 271148 271327 270543 268879 267004 265546 264644 264175 264164 264703 265686 266839 267898 268561 268487 267734 267060 267322
53026 267322 268565 270060 271209 272003 272559 272754 272590 272399 272316 271975 271163 270462 270675 271756 272878 273539 274072
53009 274072 275027 276543 278472 280553 282249 282928 282643 282355 282871 283771 283866 282555 280271 277736 275395 273621
52993 273621 272844 273100 273817 274407 274919 275837 277376 279179 280653 281469 281811 282200 282993 284045 285059 286173 287845
52976 287845 290096 292349 294298 296481 299491 302867 305283 305813 304653 302698 300827 299536 298785 298106 297191
$$ packed form
53097B77038j111j156j284j241o46L52J006Q79M40L48M56J52n57r34n27K23N32
53080B73970J05o72j118p87Q4P91R29P93P18L67p06j984k267j174K76Q58M69j02
53062B70550k43K4L57M24L6p00j370j583j310p78j61M59R45J115R45O49N19O22
53044B70500O48J79p84j664j875j458r02m69j1N39R83J153J059O63p4p53o74K62
53026B67322J243J495J149P94N56J95j64j91q3l41q12p01K13J081J122O61N33
53009B74072R55J516J929K081J696O79k85k88N16R00R5j311k284k535k341j774
52993B73621p77K56P17N90N12R18J539J803J474Q16L42L89P93J052J014J114J672
52976B87845K251K253J949K183L010L376K416N30j160j955j871j291p51o79r15
$$ plain form
52961 297191 296411 296407 297162 297909 298026 297565 296789 295769 294726 294239 294529 294845 294140 292276 290083 288298 286977
52944 286977 285932 285164 284587 283785 282495 281131 280405 280467 280732 280561 279858 278960 278227 277855 277865 278042 278026 277704 277430
52925 277430 277616 278139 278398 278032 277298 276654 276247 276028 276126 276714 277536 277922 277399 276153 274805 273804 273058 272107
52907 272107 270695 269282 268878 270067 272184 273667 273401 271627 269489 267877 266824 265863 264738 263703 263244
52892 263244 263603 264673 266293 268448 270959 273133 274122 273754 272781 272133 272088 272335 272654 273233 274270 275539 276484
52875 276484 276723 276385 275945 275795 276006 276520 277433 278909 280870 283000 285219 287911 291440 295429 298791 300581
52859 300581 300775 300230 299954 300357 300925 300505 298152 294023 289426 285765 283345 281298 278590 274888 270584 266440
52843 266440 263315 261693 261037 259978 257719 255082 253549 253397 253431 252615 251182 249837 248629 247252 245939
$$ packed form
52961B97191p80mP55P47J17m61p76j020j043m87K90L16p05j864k193j785j321
52944B86977j045p68n77q02j290j364p26O2K65j71p03q98p33l72J0J77j6l22k74
52925B77430J86N23K59l66p34o44m07k19R8N88Q22L86n23j246j348j001p46r51
52907B72107j412j413m04J189K117J483k66j774k138j612j053r61j125j035m59
52892B63244L59J070J620K155K511K174R89l68r73o48m5K47L19N79J037J269R45
52875B76484K39l38m40j50K11N14R13J476J961K130K219K692L529L989L362J790
52859C00581J94n45k76M03N68m20k353m129m597l661k420k047k708l702m304m144
52843B66440l125j622o56j059k259k637j533j52L4q16j433j345j208j377j313
$$ plain form
52828 245939 245377 245875 247179 248895 250579 251576 251421 250451 249583 249403 249840 250576 251333 251833 252028 252430 253666
52811 253666 255595 257372 258515 259424 260599 261886 262826 263339 263636 263734 263458 262778 261785 260441 258657 256566
52795 256566 254484 252626 250997 249530 248218 247188 246685 246868 247572 248382 248993 249388 249687 250034 250616 251521 252496
52778 252496 253121 253336 253584 254293 255466 256844 258227 259430 260133 260078 259368 258483 257962 258004 258233 257982 257020 255922
52760 255922 255468 255810 256544 257367 258123 258340 257510 255920 254563 253992 253909 254054 254663 255698 256458 256644 257102 258763
52742 258763 261342 263895 266207 268729 271451 273794 275521 276917 278085 278862 279440 280286 281292 281755 281406
52727 281406 280819 280670 281139 282206 283797 285376 286052 285501 284313 283167 282105 280918 279661 278404 276989
52712 276989 275458 274244 273468 272534 271029 269604 269185 269597 269783 269370 269167 269877 271041 271707 271696 271674 272224 273327
$$ packed form
52828B45939n62M98J304J716J684R97j55r70q68j80M37P36P57N00J95M02J236
52811B53666J929J777J143R09J175J287R40N13K97R8k76o80r93j344j784k091
52795B56566k082j858j629j467j312j030n03J83P04Q10O11L95K99L47N82R05R75
52778B52496O25K15K48P09J173J378J383J203P03n5p10q85n21M2K29k51r62j098
52760B55922m54L42P34Q23P56K17q30j590j357n71q3J45O09J035P60J86M58J661
52742B58763K579K553K312K522K722K343J727J396J168P77N78Q46J006M63l49
52727B81406n87j49M69J067J591J579O76n51j188j146j062j187j257j257j415
52712B76989j531j214p76r34j505j425m19M12J86m13k03P10J164O66j1k2N50J103
$$ plain form
52694 273327 274680 276059 277295 278203 278737 279035 279173 279000 278390 277562 276932 276597 276188 275337 274160 273083 272323
52677 272323 271740 271229 270973 271177 271677 272056 272117 272021 271847 271245 269841 268031 266957 267454 269165 270983 272224
52660 272224 273053 273831 274535 274938 274974 274787 274689 275200 276764 279193 281644 283335 284029 283774 282703 281353 280626
52643 280626 280923 281655 282089 282267 282575 282829 282563 281981 281800 282188 282709 283343 284724 287151 290088 292975 295901
52626 295901 299106 302397 305397 307856 309310 308976 306506 302552 298160 293943 290162 287141 285027 283436
52612 283436 281929 280672 280042 279756 279009 277569 276199 275772 276351 277345 278330 279424 280902 282647 284139 285008
52596 285008 285442 285870 286360 286634 286666 286818 287216 287411 287040 286482 286469 287235 288439 289790 291283 292820 294071 294785
52578 294785 295015 294969 294885 295072 295767 296786 297497 297298 296148 294566 293130 291963 290753 289280 287900 287285 287654
$$ packed form
52694B73327J353J379J236R08N34K98J38j73o10q28o30l35m09q51j177j077p60
52677B72323n83n11k56K04N00L79O1r6j74o02j404j810j074M97J711J818J241
52660B72224Q29P78P04M03L6j87r8N11J564K429K451J691O94k55j071j350p27
52643B80626K97P32M34J78L08K54k66n82j81L88N21O34J381K427K937K887K926
52626B95901L205L291L000K459J454l34k470l954m392m217l781l021k114j591
52612B83436j507j257o30k86p47j440j370m27N79R94R85J094J478J745J492Q69
52596B85008M34M28M90K74L2J52L98J95l71n58j3P66J204J351J493J537J251P14
52578B94785K30m6q4J87O95J019P11j99j150j582j436j167j210j473j380o15L69
$$ plain form
52561 287654 288490 289143 289477 289776 290234 290756 291041 290684 289396 287446 285685 284814 284688 284634 284305 283900 283654 283514
52543 283514 283360 283175 282916 282462 281807 281099 280485 280115 280302 281332 283001 284563 285386 285598 285942 286990 288544
52526 288544 289851 290452 290729 291386 292453 293154 292983 292526 292827 294186 296054 297938 299851 301852 303765 305616
52510 305616 307919 311193 315376 319892 324045 327189 328746 328406 326287 322821 318554 314006 309514 305129
52496 305129 300817 296827 293608 291351 289842 288866 288416 288360 288236 287700 286937 286369 286148 286196 286578 287442 288654
52479 288654 289804 290564 290844 290702 290400 290469 291336 292853 294538 296359 298904 302570 306943 311320 315571 320048
52463 320048 324791 329277 333053 336148 338698 340502 341282 341116 340294 338846 336576 333500 329939 326200 322497
52448 322497 319176 316576 314511 312306 309604 306876 304817 303524 302601 301820 301288 301093 301133 301278 301413 301383 301134
$$ packed form
52561B87654Q36O53L34K99M58N22K85l57j288j950j761q71j26n4l29m05k46j40
52543B83514j54j85k59m54o55p08o14l70J87J030J669J562Q23K12L44J048J554
52526B88544J307O01K77O57J067P01j71m57L01J359J868J884J913K001J913J851
52510C05616K303L274M183M516M153L144J557l40k119l466m267m548m492m385
52496C05129m312l990l219k257j509r76m50n6j24n36p63n68k21M8L82Q64J212
52479B88654J150P60K80j42l02O9Q67J517J685J821K545L666M373M377M251M477
52463C20048M743M486L776L095K550J804P80j66q22j448k270l076l561l739l703
52448C22497l321k600k065k205k702k728k059j293r23p81n32j95M0J45J35l0k49
$$ plain form
52431 301134 300819 300477 299809 298655 297521 297129 297486 297961 298276 298854 300072 301682 303144 304021 303946 302873 301666
52414 301666 301749 303670 306535 309392 312584 317026 322611 328329 333833 339923 347395 356223 366049 376588
52400 376588 387006 395548 400539 401642 399800 396138 391311 385643 379424 372960 366562 360546 355144 350441
52386 350441 346472 343317 341013 339497 338743 338869 340000 342087 344883 347999 351055 354045 357543 362174 367729
52371 367729 373200 377918 382350 387391 393177 399000 404126 408159 410801 411917 411989 411902 412026 411880 410939 409432
52355 409432 408073 407375 407537 408702 410859 413629 416554 419537 422661 425653 427977 429555 431027 433084 435811
52340 435811 438925 442460 446881 452550 459299 466649 474349 482610 491903 502594 514774 528335 543109
52327 543109 558923 575646 593274 611971 631954 653262 675637 698633 721883 745286 768960
$$ packed form
52431C01134l15l42o68j154j134l92L57M75L15N78J218J610J462Q77p5j073j207
52414C01666Q3J921K865K857L192M442N585N718N504O090P472Q828R826J0539
52400C76588J0418Q542M991J103j842l662m827n668o219o464o398o016n402m703
52386C50441l969l155k304j516p54J26J131K087K796L116L056K990L498M631N555
52371C67729N471M718M432N041N786N823N126M033K642J116P2q7J24j46r41j507
52355D09432j359o98J62J165K157K770K925K983L124K992K324J578J472K057K727
52340D35811L114L535M421N669O749P350P700Q261R293J0691J2180J3561J4774
52327E43109J5814J6723J7628J8697J9983K1308K2375K2996K3250K3403K3674
$$ plain form
52316 768960 792968 817173 841461 866061 891433 917815 945053 973034 1002029 1032285 1063304
52305 1063304 1093896 1123120 1151067 1178582 1206320 1234109 1261129 1286472 1309443 1329397 1345591
52294 1345591 1357511 1365435 1370339 1373027 1373485 1371344 1366786 1360541 1352992 1343759 1332437 1319485 1306067
52281 1306067 1293211 1281352 1270580 1260968 1252601 1245483 1239581 1234956 1231878 1230792 1232092 1235909 1242181
52268 1242181 1250921 1262223 1275897 1291270 1307561 1324337 1341477 1358853 1376409 1394587 1414288
52257 1414288 1436097 1459550 1483375 1506536 1528866 1550634 1571600 1590784 1607159 1620268 1630066
52246 1630066 1636497 1639569 1639656 1637326 1632857 1626212 1617373 1606360 1593091 1577727 1561139 1544342 1527358
52233 1527358 1509338 1490053 1470540 1451778 1433540 1415246 1397329 1380759 1365580 1350951 1336525
$$ packed form
52316G68960K4008K4205K4288K4600K5372K6382K7238K7981K8995L0256L1019
52305A063304L0592K9224K7947K7515K7738K7789K7020K5343K2971J9954J6194
52294A345591J1920P924M904K688M58k141m558o245p549r233j1322j2952j3418
52281A306067j2856j1859j0772r612q367p118n902m625l078j086J300L817O272
52268A242181Q740J1302J3674J5373J6291J6776J7140J7376J7556J8178J9701
52257A414288K1809K3453K3825K3161K2330K1768K0966J9184J6375J3109R798
52246A630066O431L072Q7k330m469o645q839j1013j3269j5364j6588j6797j6984
52233A527358j8020j9285j9513j8762j8238j8294j7917j6570j5179j4629j4426
$$ plain form
52222 1336525 1322847 1310408 1299308 1289939 1282888 1277765 1273114 1268130 1263731 1261246 1260641 1260798 1261105 1261968
52208 1261968 1263981 1267334 1271912 1277330 1282881 1287991 1292781 1297807 1303261 1308827 1314237 1319579 1325149 1331442
52194 1331442 1339141 1348570 1359058 1369296 1378459 1386589 1393903 1400214 1405147 1408432 1409711 1408472 1404552
52181 1404552 1398498 1391149 1382954 1373852 1363690 1352581 1340947 1329366 1318303 1307992 1298638 1290588
52169 1290588 1284059 1278794 1274373 1270806 1268374 1266955 1266123 1266068 1267689 1271265 1275642 1279339 1282071 1284457 1286554
$$ packed form
52222A336525j3678j2439j1100r369p051n123m651m984m399k485o05J57L07Q63
52208A261968K013L353M578N418N551N110M790N026N454N566N410N342N570O293
52194A331442P699R429J0488J0238R163Q130P314O311M933L285J279j239l920
52181A404552o054p349q195r102j0162j1109j1634j1581j1063j0311r354q050
52169A290588o529n265m421l567k432j419q32n5J621L576M377L697K732K386K097
$$ [...]
##END NTUPLES=NMR SPECTRUM
##END=
