##TITLE=AC1627_CENAH_8450474_PSb4FjsyFP
##JCAMPDX= 6.0         $$ Bruker NMR JCAMP-DX V2.0
##DATA TYPE= NMR SPECTRUM
##DATA CLASS= NTUPLES
##ORIGIN= BRUKER
##OWNER= Administrator
$$ 1.72 TOPSPIN		Version 2.1
$$ 2014-02-18 14:46:42.701 -0800  Administrator@X
$$ Compression mode = diff/dup
##.OBSERVE FREQUENCY= 400.02188249412
##.OBSERVE NUCLEUS= ^1H
##.ACQUISITION MODE= SIMULTANEOUS (DQD)
##.ACQUISITION SCHEME= undefined
##.AVERAGES= 8
##.DIGITISER RES= 22
##SPECTROMETER/DATA SYSTEM= spect
##.PULSE SEQUENCE= zg30
##.SOLVENT NAME= COFFEE_meoh
##.SHIFT REFERENCE= INTERNAL, COFFEE_meoh, 1, 14.98509
##AUDIT TRAIL= $$ (NUMBER, WHEN, WHO, WHERE, PROCESS, VERSION, WHAT)
$$ ##TITLE= Audit trail, TOPSPIN		Version 2.1
$$ ##JCAMPDX= 5.01
$$ ##ORIGIN= Bruker BioSpin GmbH
$$ ##OWNER= Administrator
$$ $$ E:\/data/COFFEE/nmr/AC1627_CENAH_8450474_PSb4FjsyFP/10/pdata/1/auditp.txt
$$ ##AUDIT TRAIL=  $$ (NUMBER, WHEN, WHO, WHERE, PROCESS, VERSION, WHAT)
(   1,<2014-02-18 14:46:36.169 -0800>,<Administrator>,<X>,<go>,<TOPSPIN 2.1>,
      <created by zg
	started at 2014-02-18 14:45:30.435 -0800,
	POWCHK enabled, PULCHK disabled,
       configuration hash MD5:
       C8 4E 4E 5D D3 5C D8 9E 9F 52 82 E0 59 8A DE 15
       data hash MD5: 64K
       C1 94 DE 49 0A 91 95 E3 FE C1 FA 76 79 43 66 10>)
(   2,<2014-02-18 14:46:38.966 -0800>,<Administrator>,<X>,<proc1d>,<TOPSPIN 2.1>,
      <Start of raw data processing
       efp LB = 0 FT_mod = 6 PKNL = 1 PHC0 = 0 PHC1 = 0 SI = 32K 
       data hash MD5: 32K
       BD 71 B0 45 E8 12 ED DC 2B 82 A7 E3 68 A0 24 AD>)
(   3,<2014-02-18 14:46:39.279 -0800>,<Administrator>,<X>,<proc1d>,<TOPSPIN 2.1>,
      <pk PHC0 = 95.12512 PHC1 = 0 
       data hash MD5: 32K
       88 3E 98 0A 60 31 6B 58 37 19 E0 FA 72 62 D0 BF>)
(   4,<2014-02-18 14:46:39.373 -0800>,<Administrator>,<X>,<proc1d>,<TOPSPIN 2.1>,
      <abs ABSG = 1 
       data hash MD5: 32K
       4E A0 74 84 A0 8F 32 C6 C0 23 DB F4 A3 53 4F CF>)
(   5,<2014-02-18 14:46:39.435 -0800>,<Administrator>,<X>,<proc1d>,<TOPSPIN 2.1>,
      <abs ABSG = 2 
       data hash MD5: 32K
       77 2B F5 64 5E 09 55 FE 4F 20 7D 8C A1 65 C6 62>)
(   6,<2014-02-18 14:46:39.482 -0800>,<Administrator>,<X>,<proc1d>,<TOPSPIN 2.1>,
      <abs ABSG = 3 
       data hash MD5: 32K
       43 51 1B F0 6E F3 0D 70 D5 72 B5 B1 C0 90 2B DE>)
(   7,<2014-02-18 14:46:39.529 -0800>,<Administrator>,<X>,<proc1d>,<TOPSPIN 2.1>,
      <abs ABSG = 4 
       data hash MD5: 32K
       8B EF F1 34 34 81 14 8A 8B 13 A4 FB FF BC 8B DA>)
(   8,<2014-02-18 14:46:39.591 -0800>,<Administrator>,<X>,<proc1d>,<TOPSPIN 2.1>,
      <abs ABSG = 5 
       data hash MD5: 32K
       35 2C 72 09 2D B6 A6 00 79 76 63 AB 9D DF C2 1A>)
$$ ##END=
$$ 
$$ $$ hash MD5
$$ $$ 72 68 89 7B 9A 20 AF A1 34 D9 A5 30 B9 E0 A7 63
##$RELAX= 
##$RELAX= 
##$RELAX= 
##$RELAX= 
##$RELAX= 
##$RELAX= 
##$RELAX= 
$$ Bruker specific parameters
$$ --------------------------
##$DU= <E:\>
##$EXPNO= 10
##$NAME= <AC1627_CENAH_8450474_PSb4FjsyFP>
##$PROCNO= 1
$$ [...]
150 150 150 150 150 150 150 150
##$TP07= 0
##$TPNAME0= <>
##$TPNAME1= <>
##$TPNAME2= <>
##$TPNAME3= <>
##$TPNAME4= <>
##$TPNAME5= <>
##$TPNAME6= <>
##$TPNAME7= <>
##$TPOAL= (0..7)
0.5 0.5 0.5 0.5 0.5 0.5 0.5 0.5
##$TPOFFS= (0..7)
0 0 0 0 0 0 0 0
##$TUNHIN= 0
##$TUNHOUT= 0
##$TUNXOUT= 0
##$USERA1= <user>
##$USERA2= <user>
##$USERA3= <user>
##$USERA4= <user>
##$USERA5= <user>
##$V9= 5
##$VALIST= <valist>
##$VCLIST= <CCCCCCCCCCCCCCC>
##$VD= 0
##$VDLIST= <DDDDDDDDDDDDDDD>
##$VPLIST= <PPPPPPPPPPPPPPP>
##$VTLIST= <TTTTTTTTTTTTTTT>
##$WBST= 2048
##$WBSW= 25
##$XGAIN= (0..3)
0 0 0 0
##$XL= 0
##$YL= 0
##$YMAX_a= 652678
##$YMIN_a= -554380
##$ZGOPTNS= <>
##$ZL1= 120
##$ZL2= 120
##$ZL3= 120
##$ZL4= 120
##$ABSF1= 14.98509
##$ABSF2= -5.573092
##$ABSG= 5
##$ABSL= 3
##$ALPHA= 0
##$AQORDER= 0
##$ASSFAC= 0
##$ASSFACI= 0
##$ASSFACX= 0
##$ASSWID= 0
##$AUNMP= <proc_prof1d_extract_pilot.lims>
##$AXLEFT= 0
##$AXNAME= <>
##$AXNUC= <1H>
##$AXRIGHT= 0
##$AXTYPE= 0
##$AXUNIT= <>
##$AZFE= 0.1
##$AZFW= 0.1
##$BCFW= 0
##$BC_mod= 0
##$BYTORDP= 0
##$COROFFS= 0
##$CY= 15
##$DATMOD= 1
##$DC= 0
##$DFILT= <>
##$DTYPP= 0
##$F1P= 0
##$F2P= 0
##$FCOR= 0.5
##$FTSIZE= 32768
##$FT_mod= 6
##$GAMMA= 0
##$GB= 0
##$INTBC= 1
##$INTSCL= 1
##$ISEN= 128
##$LB= 0
##$LEV0= 0
##$LPBIN= 0
##$MAXI= 10000
##$MC2= 0
##$MEAN= 0
##$ME_mod= 0
##$MI= 0
##$NCOEF= 0
##$NC_proc= -8
##$NLEV= 6
##$NOISF1= 0
##$NOISF2= 0
##$NSP= 0
##$NTH_PI= 0
##$NZP= 0
##$OFFSET= 14.98509
##$PC= 1
##$PHC0= 95.12512
##$PHC1= 0
##$PH_mod= 1
##$PKNL= yes
##$PPARMOD= 0
##$PPDIAG= 0
##$PPIPTYP= 0
##$PPMPNUM= 2147483647
##$PPRESOL= 1
##$PSCAL= 4
##$PSIGN= 0
##$PYNMP= <proc.py>
##$REVERSE= no
##$SF= 400.02
##$SI= 32768
##$SIGF1= 0
##$SIGF2= 0
##$SINO= 400
##$SIOLD= 32768
##$SPECTYP= <>
##$SREGLST= <1H.CDCl3>
##$SSB= 0
##$STSI= 32768
##$STSR= 0
##$SW_p= 8223.68421052631
##$SYMM= 0
##$S_DEV= 0
##$TDeff= 65536
##$TDoff= 0
##$TI= <>
##$TILT= no
##$TM1= 0
##$TM2= 0
##$TOPLEV= 0
##$USERP1= <user>
##$USERP2= <user>
##$USERP3= <user>
##$USERP4= <user>
##$USERP5= <user>
##$WDW= 1
##$XDIM= 32768
##$YMAX_p= 477487194
##$YMIN_p= -754673
##$CURPLOT= <Network HP LaserJet P1505>
##$CURPRIN= <$Network HP LaserJet P1505>
##$DFORMAT= <normdp>
##$LAYOUT= <+/1D_H.xwp>
##$LFORMAT= <normlp>
##$PFORMAT= <normpl>
##$SURQMSG= 1
$$ End of Bruker specific parameters
$$ ---------------------------------
##NTUPLES= NMR SPECTRUM
##VAR_NAME=  FREQUENCY,     SPECTRUM/REAL,   SPECTRUM/IMAG
##SYMBOL=    X,             R,               I
##VAR_TYPE=  INDEPENDENT,   DEPENDENT,       DEPENDENT
##VAR_FORM=  AFFN,          ASDF,            ASDF
##VAR_DIM=   32768,         32768,           32768
##UNITS=     HZ,            ARBITRARY UNITS, ARBITRARY UNITS
##FACTOR=    0.250966925370066, 1,           1
##FIRST=     8223.43324360094, -209793,      -28727
##LAST=      0,             -179611,         -141929
##MIN=       0,             -754673,         0
##MAX=       8223.43324360094, 477487194,    0
$$ Real data points
##PAGE= N=1
##DATA TABLE= (X++(R..R)), XYDATA
$$ [...]
$$ plain form
19522 -244451 -176986 -321640 -553773 52253 8076 113851 14996 86983 -196865 -157492 -206842
19511 -206842 -71239 246265 -26492 -17202 -288197 -216597 -6409 168473 -22695 -207822 211873
19499 99644 47397 -360008 127799 -205271 -136004 136434 -221449 -201061 -246197 -29173 -207509
19488 -207509 -31130 -207913 83165 -111433 -120736 48460 3462 -417503 29154 97077 -12607
19476 -281923 -86487 22942 103362 85871 186115 -105718 -126817 5198 49147 -47382 -339280
19465 -339280 -94280 -190758 751712 -76359 -66464 -202444 125737 -391816 37766 86918 303622
19454 303622 -34846 -145411 -53241 -116703 -258775 -500894 -192562 6027 -39325 116499 -246738
19442 -267394 -182848 -65895 -176976 -153602 -106 136384 100772 -255402 -59197 94476 -310683
$$ packed form
19522b44451O7465j44654k32133E2253H076J05775A4996P1987a96865L9373m9350
19511b06842g1239B46265b6492R290k70995P1600f409A68473b2695j85127B11873
19499I9644D7397c60008A27799b05271O9267A36434b21449K0388m5136b9173j78336
19488b07509c1130j76783H3165a11433r303D8460C462d17503B9154O7923a2607
19476b81923h6487B2942Q0420j7491J00244a05718k1099E198M3949d7382k91898
19465c39280i4280r6478G51712g6359R895j35980A25737c91816C7766M9152K16704
19454C03622c4846j10565e3241o3462j42072k42119a92562F027c9325A16499b46738
19442b67394Q4546f5895j11081K3374a06A36384l5612b55402e9197I4476c10683
$$ plain form
19430 -165194 128970 -272513 260209 -114921 -310096 11278 -337527 20092 -168798 -202423
19420 -202423 -46583 -250104 -78229 -245600 361138 -169967 62202 -131548 2930 -298325
19409 -104825 288937 -64546 -200704 -258522 279919 -153075 -202479 248014 -462314 153246
19398 163748 -161131 354559 -152355 146581 49891 -183707 219764 -17959 24761 -138030
19387 23985 256103 -129747 -98230 -192447 -7465 26588 -264116 -114893 -137356 -138337 98976
19375 123028 -34775 59517 156181 -153036 -122179 -290845 -92867 52966 -71848 -43428 -10032
19363 126200 -322730 116459 558385 -48213 -75566 -399549 150375 -137559 61378 -162162
19352 -299809 114131 -74274 -184099 -371138 -187628 234076 -31844 -191475 -52819 126191
$$ packed form
19430a65194A28970b72513B60209a14921j95175A1278c37527B0092a68798l3625
19420b02423d6583k03521g8229j67371C61138a69967F2202a31548B930b98325
19409a04825B88937f4546j36158n7818B79919a53075m9404B48014d62314A53246
19398A63748a61131C54559a52355A46581D9891a83707B19764a7959B4761a38030
19387B3985K32118a29747L1517r4217g465B6588b64116a14893k2463r81I8976
19375A23028c4775E9517R6664a53036L0857j68666i2867E2966g1848K8420a0032
19363A26200c22730A16459M41926d8213k7353l23983A50375a37559F1378a62162
19352b99809A14131g4274j09825j87039J83510B34076c1844j59631e2819A26191
$$ plain form
19341 104577 161996 130360 -101504 19555 -93978 153799 28259 29365 147731 -29074 -119165
19330 -119165 -294026 -244533 25058 -287868 80340 -67526 -33097 -43633 104316 99512 192224
19319 192224 244855 -191994 -273786 -132512 -576830 240633 41793 -76959 -197661 -197805 -223113
19308 -223113 -20442 -190063 -216770 -173016 208495 202450 119534 -194207 -128602 -168485 -397812
19297 -397812 -116007 -192040 -94846 121146 91428 -281954 580200 203495 50649 -108370
19286 97668 -62914 15575 88614 -12575 -66394 -88810 -238013 18896 23216 -113963 -268592
19275 -268592 -95374 -29087 50099 118458 192984 15262 63664 89748 255281 -411555 38268
19263 -350725 -95953 -225387 32530 -63772 -14599 81612 46732 -20812 -168549 -152968 230693
$$ packed form
19341A04577N7419l1636a01504A9555i3978A53799B8259J106J18366b9074r0091
19330a19165j74861M9493B5058b87868H0340f7526c3097j0536A04316m804R2712
19319A92224N2631a91994q1792a32512m44318B40633D1793g6959j20702j44k5308
19308b23113b0442j69621k6707M3754B08495o045q2916a94207O5605l9883k29327
19297c97812a16007p6033i4846A21146k9718b81954E80200B03495E0649a08370
19286I7668f2914A5575P3039a2575n3819k2416j49203A8896M320a13963j54629
19275b68592i5374b9087E0099O8359P4526A5262M8402K6084J65533d11555C8268
19263c50725i5953j29434C2530f3772a4599H1612l4880b0812j47737J5581B30693
$$ plain form
19251 -41645 119253 -309352 -279988 -241210 -165640 44796 -314329 -119390 11408 -252074 -183189
19240 -183189 -107563 -255630 -90490 31463 -478211 100506 232887 -147270 -53834 -88100
19230 -88100 -228181 225426 -288545 -18821 143756 45447 -197118 -397662 103880 7343
19219 -12602 -91119 -57329 -50363 27315 32909 -407173 -59283 -130143 -118829 -143376 78234 -349256
19206 -75089 -206618 -135075 208277 151854 -397127 -21984 45743 -193784 -406653 272371
19195 -329378 -317480 -55951 -106817 -373028 -404863 200438 -54820 -457325 -441752 -11484 -71314
19184 -71314 2582 -29493 -219586 10817 -49930 -256515 162791 127102 123401 155240 -246111
19172 167967 -105056 39383 -120613 -137981 36109 147843 -130864 -214977 204248 197663 -443105
$$ packed form
19251d1645A19253c09352K9364L8778P5570D4796c14329a19390A1408b52074O8885
19240a83189P5626j48067i0490C1463d78211A00506J32381a47270e3834l4266
19230h8100j40081B25426b88545a8821A43756D5447a97118k00544A03880G343
19219a2602p8517L3790O966B7315N594d07173e9283p0860J1314k4547G8234c49256
19206g5089j31529P1543B08277n6423c97127b1984D5743a93784k12869B72371
19195c29378J1898e5951n0866k66211l1835B00438e4820m02505J5573a1484n9830
19184g1314B582b9493j90093A0817d9930k06585A62791l5689l701L1839b46111
19172A67967a05056C9383a20613j7368C6109J11734a30864q4113B04248o585d43105
$$ plain form
19160 -113472 23796 -38779 -72673 -105278 270215 -64764 -31092 -55944 55527 -191333 -25792
19148 -253472 -108318 -276322 -223717 -11414 49548 -60357 -98846 -57467 -108581 -74016 -14945
19136 72108 1118 147414 138568 22550 93291 -203022 -201935 -54464 110188 -212289 -405232
19125 -405232 48185 -154282 -33740 -235653 245072 -18016 27692 -148247 -211370 -133097 -126697
19114 -126697 -11708 106808 -88510 -46006 11018 -187886 142535 366053 106489 -141082
19103 -189635 116288 69795 -110225 -173662 31734 61809 110078 -12804 89292 -157717 -89097
19092 -89097 154775 -47112 168521 -277912 -261292 -20858 -102813 -112751 -187432 -65046 41664
19080 -120808 -73758 -158430 78589 -171054 291561 -52640 150450 -111245 174021 -259865
$$ packed form
19160a13472B3796c8779l3894l2605B70215f4764c1092k4852E5527a91333b5792
19148b53472a08318j68004N2605a1414D9548f0357l8489M1379n1114L4565a4945
19136G2108A118J46296q846B2550P0741b03022J087e4464A10188b12289j92943
19125d05232D8185a54282c3740k01913B45072a8016B7692a48247o3123P8273O400
19114a26697a1708A06808h8510M2504A1018a87886A42535K23518A06489a41082
19103a89635A16288m6493a10225o3437C1734L0075M8269a2804H9292a57717O8620
19092h9097A54775d7112A68521b77912J6620b0858q1955r938p4681f5046D1664
19080a20808M7050q4672G8589a71054B91561e2640A50450a11245A74021b59865
$$ plain form
19069 -283977 -430195 -33446 -137972 -12349 209476 -41676 -121915 -8795 98263 -147513 -204530
19058 -204530 -146199 43893 -158020 -128686 -191513 -296320 178704 435063 -28604 -277302
19048 -277302 -202345 -81007 176662 -128695 385934 -111592 180472 92259 166584 -115668
19037 -65516 -59913 13641 -144446 26048 89701 133994 116207 164021 -187097 -206619 94601
19025 -48279 259499 205054 304889 194324 -189608 271212 111445 -148967 -434930 -337728
19015 -337728 285261 -137353 223152 -3620 187399 -20014 -79696 -137135 -410008 133192
19004 45718 100868 -305375 -68350 -339980 336476 -192041 -338349 -36243 -360877 -139602
18993 -45982 -200773 75264 305311 240254 -108843 88554 -384808 163974 48107 190681
$$ packed form
19069b83977j46218c3446j04526a2349B09476d1676q0239h795I8263a47513n7017
19058b04530N8331D3893a58020K9334o2827j04807A78704K56359b8604k48698
19048b77302P4957h1007A76662a28695C85934a11592A80472q8213P4325a15668
19037f5516N603A3641a44446B6048O3653M4293j7787M7814a87097j9522I4601
19025d8279B59499n4445R9835j10565a89608B71212A11445a48967k85963R7202
19015c37728B85261a37353B23152c620A87399b0014n9682n7439k72873A33192
19004D5718N5150c05375f8350k71630C36476a92041j46308c6243l24634a39602
18993d5982j54791G5264K30047o5057a08843H8554c84808A63974D8107J42574
$$ plain form
18983 190681 -423533 -44398 285953 -59957 -141196 -34379 -113811 -125034 92206 -223178 -317880
18972 -317880 2877 -153087 -59178 -175781 1973 -17210 -148134 174802 -191533 30412 -323376
18960 6408 -229103 -69860 -178856 -54585 61138 -175558 -207030 -136831 202754 12069 325949
18949 325949 34928 -61107 -60769 412170 25672 -379913 216241 -56803 141179 -138782 200934
18937 -40094 -454220 122504 -246458 -203024 118220 -193551 61092 -155298 225836 -91219
18926 -272384 224858 31004 -106630 -474862 -132642 -94723 -118858 57338 193368 -354549
18915 -89824 86340 -326236 119908 194863 -27941 69258 -402691 109076 40180 -23808 79715
18903 -222086 -106974 -355600 -43984 -399305 -367548 -56756 -183867 46996 10851 313523
$$ packed form
18983A90681d23533d4398B85953e9957q1239c4379p9432j1223I2206b23178r4702
18972c17880B877a53087e9178j16603A973a7210j30924A74802a91533C0412c23376
18960F408b29103f9860j08996e4585F1138a75558l1472P0199B02754A2069L13880
18949C25949C4928f1107L38D12170B5672c79913B16241e6803A41179a38782B00934
18937d0094m14126A22504b46458M3434A18220a93551F1092a55298B25836i1219
18926b72384B24858C1004a06630l68232a32642L7919k4135E7338J36030c54549
18915h9824H6340c26236A19908P4955b7941F9258d02691A09076D0180b3808G9715
18903b22086a06974k48626d3984l55321L1757e6756j27111D6996A0851L02672
$$ plain form
18893 313523 -58882 -120660 22481 27836 -278237 -52197 -72615 -63096 -350286 -94752 -7670 -133335
18881 -133335 13347 -45741 -92274 -589923 -228823 115051 192757 348655 -116212 86690
18870 -348343 60267 -242530 46343 -25679 161687 16779 -195814 138607 -522232 -330729
18860 -330729 -193748 15694 -100721 36197 -362204 -79310 172188 130974 369970 21166
18849 245983 195056 179951 105290 112563 -374717 7782 -152803 120147 -91865 191447 -86914
18837 -124022 -124684 -99966 177370 -196396 -199372 -142384 198076 -281554 -29978 -271589 -227572
18826 -227572 -119003 178517 279801 176 253229 -275829 -163656 -28079 37705 6780 343916
18815 343916 164507 -54047 75183 22230 448873 206176 -24612 175938 24618 132583
$$ packed form
18893C13523e8882o1778B2481N355b78237e2197k0418R519k87190i4752g670j25665
18881a33335A3347d5741m6533m97649b28823A15051P7706J55898a16212H6690
18870c48343F0267b42530D6343b5679A61687A6779a95814A38607e22232J91503
18860c30729J36981A5694a00721C6197c62204g9310A72188m1214K38996B1166
18849B45983n0927j5105p4661P273c74717G782a52803A20147i1865A91447h6914
18837a24022o62K4718A77370a96396k976N6988A98076b81554b9978k41611M4017
18826b27572J08569A78517J01284A76K53053b75829J12173b8079C7705F780L37136
18815C43916A64507e4047G5183B2230M26643B06176b4612A75938B4618J07965
$$ plain form
18805 132583 -17894 -228694 -297492 243163 321216 55584 20499 62742 71871 -53277 -149703
18794 -149703 103676 118558 66001 -60112 -281231 -24890 -91058 -188768 -166550 -44723 194487
18782 -361258 -171991 -403 -26698 272397 -44312 13991 -302055 -148618 -109337 68229 -237704
18770 -82810 -118031 -7236 -43294 -21384 148162 -250784 -141460 -110744 -61137 -179177 -108330
18759 -108330 -146980 19507 -332938 121889 -374201 -14852 -22666 147801 -174726 -384101
18749 -384101 -159027 218515 -100866 -148031 -68580 48351 -245275 85977 12859 -27960 77445
18737 -71819 -53312 -1625 54431 -15962 -243496 -8873 144683 221017 80720 171524 253950 158987
18725 158987 -171953 73293 -258880 -104077 -115125 -54244 -131760 169384 -156008 -5928 162914
$$ packed form
18805A32583a7894k10800o8798B43163P8053E5584B0499M2243R129e3277r6426
18794a49703A03676J4882n2557f0112k21119b4890o6168r7710K2218d4723A94487
18782c61258a71991d03k6295B72397d4312A3991c02055a48618L9281F8229b37704
18770h2810l5221g236l6058b1384A48162b50784J09324L0716M9607j18040P0847
18759a08330l8650A9507c32938A21889c74201a4852p814A47801a74726k09375
18749c84101a59027B18515a00866m7165f8580D8351b45275H5977A2859b7960G7445
18737g1819J8507a625E4431a5962k27534h873A44683P6334H0720R0804Q2426r4963
18725A58987a71953G3293b58880a04077j1048e4244p7516A69384a56008e928A62914
$$ plain form
18713 -208119 -34971 112517 343345 77048 54837 -54964 -217786 84769 -152314 44610 -266655
18701 14275 5385 -17436 -296280 -174304 127875 -375616 -240318 -156334 -49691 25182 -140300
18689 -67459 -11026 -255082 -189223 105342 -233407 202917 173406 -33144 8620 -134104 5745
18677 -253190 -150159 -455026 50900 60222 122532 -30927 -247005 106756 23912 -213046 39265
18665 64370 237614 -18376 -12410 -124370 153363 -220002 -62803 -89138 305953 -89284 -71370
18654 -71370 10755 -196433 -30827 40863 -308132 -217794 -179250 -333282 25698 131581 -193312
18642 -6195 -49335 -353432 2563 -193021 -385959 346142 -19481 -131582 -358601 -202542 -31145
18630 -150997 -126990 -143795 -247667 -200499 -471774 10533 251051 112332 -135487 -209705
$$ packed form
18713b08119c4971A12517K30828G7048k2211e4964j62822H4769a52314D4610b66655
18701A4275E385a7436k78844J21976A27875c75616J35298Q3984d9691B5182a40300
18689f7459a1026k44056O5859A05342b33407B02917k9511c3144H620a34104E745
18677b53190J03031l04867E0900R322O2310c0927k16078A06756B3912b13046C9265
18665F4370J73244a8376N966j11960A53363b20002f2803k6335C05953h9284J7914
18654g1370A0755a96433c0827D0863c08132R0338L8544j54032B5698J05883a93312
18642f195m3140l04097B563a93021j92938C46142a9481j12101k27019J56059c1145
18630a50997K4007j6805j03872M7168k71275A0533K40518A12332a35487p4218
$$ plain form
18620 -209705 -375410 -106228 15575 45978 -102989 -49857 187907 287092 -330391 -230285
18610 -230285 269771 -298902 61810 -349283 -252006 31952 -4220 12666 -249668 286656 296151
18599 296151 18072 205420 102595 164804 112974 53554 122092 129643 30856 13827 -230507
18587 -314109 -188377 -94814 -353447 -163817 -41674 79247 66116 55043 13263 -253173 -297561
18576 -297561 -199473 119809 13507 -376067 -241340 437984 83783 -220495 -210245 -148740
18566 -148740 184879 -45682 -56936 -243859 -86982 -80156 78658 80881 -121356 -95504 289848
18554 -17613 -99926 -31994 236983 71561 826 -257294 82564 152464 -301058 33903 -12456
18542 -312432 11407 2467 45466 61814 129189 -9595 -53003 -386443 69597 -382465 -153701
$$ packed form
18620b09705j65705a06228A5575L0403a02989d9857A87907R9185c30391J00106
18610b30285B69771b98902F1810c49283R7277C1952d220A2666b49668B86656R495
18599B96151A8072J87348A02595O2209n1830E3554O8538P551C0856A3827b30507
18587c14109J25732R3563k58633a63817d1674G9247j3131j1073A3263b53173m4388
18576b97561R8088A19809A3507c76067J34727D37984H3783b20495J0250O1505
18566a48740A84879d5682j1254j86923h6982O826G8658K223a21356K5852B89848
18554a7613q2313c1994B36983G1561H26b57294H2564O9900c01058C3903a2456
18542c12432A1407B467M2999J6348O7375i595m3408l33440F9597c82465a53701
$$ plain form
18530 -26054 -69644 293269 -275729 232197 -173364 171040 -63616 -114 127723 -10385 60018
18518 105217 114687 -49444 -335668 403 119808 -297923 65637 -12379 -235055 -31509 -158024
18507 -158024 142094 -52420 -106131 208003 65987 -409706 145419 -125424 57460 -117727
18496 143368 -6285 -134091 -316310 278530 109946 -72484 75246 -65228 -202156 -73767 33854
18484 -42118 -75269 -72628 289238 37638 -344746 354099 -363307 126814 136270 -142162 -59780
18472 180864 -97295 -231879 -51107 52067 4836 -196469 -124200 -384109 90754 -39589 290274
18460 114577 253597 -83850 -247616 96770 -255294 202430 -303557 -112755 -137755 38310
18449 128302 -259231 -2342 112331 149524 -274820 265908 109787 -78753 -187928 -106425
$$ packed form
18530b6054m3590B93269b75729B32197a73364A71040f3616a14A27723a0385F0018
18518A05217R470d9444k86224D03J19405b97923F5637a2379k22676c1509j26515
18507a58024A42094e2420n3711B08003F5987d09706A45419a25424E7460a17727
18496A43368f285j27806j82219B78530A09946g2484G5246f5228j36928g3767C3854
18484d2118l3151K641B89238C7638c44746C54099c63307A26814R456a42162e9780
18472A80864i7295j34584e1107E2067D836a96469P2269k59909I0754c9589B90274
18460A14577J39020h3850j63766I6770b55294B02430c03557a12755k5000C8310
18449A28302b59231b342A12331L7193b74820B65908A09787g8753j09175Q1503
$$ plain form
18439 -106425 -207478 -36525 -103077 -130279 -78890 162855 -529084 -203397 21901 80541 4238
18427 -290646 -181077 -93049 -21212 -159187 239722 -40369 5649 240673 -167946 156311
18416 84181 16285 -119998 71065 50340 32760 104477 -35136 -148431 102141 -57875 -49412
18405 -49412 -314678 191381 273957 4865 99706 167985 -68011 310085 -62414 -220219 -205756
18394 -205756 151607 99358 304688 139010 -127309 -67405 137099 -73326 -66813 81515 -156709
18382 -230914 66556 -87457 -241013 -105259 -175017 -87009 -52329 -159996 300123 -125482
18371 -96418 -358814 -65487 -75399 149928 -141878 -266410 9135 56894 -237798 278026 217877
18360 217877 -80295 44533 -47926 51566 -96881 -52434 214470 -53671 9463 116623 -89876
$$ packed form
18439a06425j01053c6525o6552k7202N1389A62855e29084b03397B1901N8640D238
18427b90646J09569Q8028b1212j37975B39722d0369E649K35024a67946A56311
18416H4181A6285a19998G1065k0725j7580P1717c5136j13295A02141e7875Q463
18405d9412k65266A91381Q2576D865R4841O8279f8011C10085f2414j57805J4463
18394b05756A51607n2249K05330A39010a27309N9904A37099g3326O513H1515a56709
18382b30914F6556h7457j53556a05259o9758h7009L4680j07667C00123a25482
18371i6418k62396f5487r912A49928a41878j24532I135M7759b37798B78026o0149
18360B17877h0295D4533d7926E1566i6881M4447B14470e3671I463J07160h9876
$$ plain form
18348 325602 -352936 17803 -3073 27244 -82721 184188 -84671 -190529 3163 145313 19844
18336 419742 121277 -213985 425685 -155519 -210151 -223035 237498 -75107 47498 132416
18326 132416 -429036 43349 6521 -340689 146181 -319457 -141259 58241 -335259 -210628
18316 -210628 109378 -10235 128368 159362 -51246 131117 -70003 -32088 -258430 -12160 -401512
18305 -401512 92584 -185261 69623 -12397 7712 -73094 95237 -153375 -58082 -391523 -57928
18293 -107737 55686 -109903 13211 -26917 -19534 190871 132957 -138697 -14538 33420 4205
18281 322738 -124861 -298398 -81280 24570 -39043 -204077 -53041 -264291 82438 -126475
18270 -148078 -196031 -316217 -5180 128812 -267171 -8495 189155 -362872 20725 -148297 -178464
$$ packed form
18348C25602c52936A7803c073B7244h2721A84188h4671j05858C163J42150A9844
18336D19742A21277b13985D25685a55519n4632j2884B37498g5107D7498Q4918
18326A32416d29036D3349F521c40689A46181c19457a41259E8241c35259J24631
18316b10628A09378a0235A28368L0994e1246A31117g0003c2088k26342a2160l89352
18305d01512I2584a85261F9623a2397G712g3094I5237a53375e8082l33441e7928
18293a07737E5686a09903A3211b6917P383A90871n7914a38697a4538C3420D205
18281C22738a24861j73537h1280B4570c9043j65034e3041k11250H2438a26475
18270a48078m7953j20186e180A28812b67171h495A89155c62872B0725a48297l0167
$$ plain form
18259 -178464 -120221 -280530 -27704 62790 -53332 116327 63080 -205259 78952 198111 -157089
18247 -42356 -141948 28340 211597 66416 -149369 148891 -166559 108529 -169835 -156926
18237 -156926 -90137 -294215 -284565 31925 -422185 -63851 -5596 179456 -8417 -47994 218597
18225 -45029 143637 -119179 74821 -259867 -199994 50360 -109738 16959 -48353 -332546 33425
18213 49710 -104637 59681 -46790 119607 23216 -163405 188557 10925 89472 145771 -280409
18201 98060 148868 -247908 80906 6570 -39685 -200446 -153741 220925 -5206 -180897 -85393
18189 -54591 -84543 -250709 77407 -181575 8449 -53888 256950 -400293 -5672 58433 117493
18178 117493 105608 89538 -60329 -27650 -239631 -35375 -90392 119961 -98442 118531 491662
$$ packed form
18259a78464N8243j60309b7704F2790e3332A16327n3247b05259G8952J19159a57089
18247d2356r9592B8340J83257F6416a49369A48891a66559A08529a69835J2909
18237a56926O6789k04078R650C1925d22185f3851e596A79456h417l9577B18597
18225d5029A43637a19179G4821b59867N9873E0360a09738A6959d8353k84193C3425
18213D9710a04637E9681d6790A19607B3216a63405A88557A0925P8547N6299b80409
18201I8060N0808b47908H0906F570c9685j60761M6705B20925e206j75691h5393
18189e4591k9952j66166G7407a81575H449e3888B56950d00293e672E8433N9060
18178A17493j1885j6070f0329b7650k11981c5375n5017A19961i8442A18531L73131
$$ plain form
18167 491662 37523 -102798 -25501 -120601 158041 58944 -73588 -70547 243872 -69688 -126812
18156 -126812 191348 -14273 -413143 40209 -271372 222621 -133930 202431 -108461 -87207
18146 -87207 381742 -33473 6881 -275237 32230 284761 26609 85959 -8210 -68217 339770
18134 -415057 -73429 104979 -281881 111898 -285508 257803 -235431 -4952 -146993 83931
18123 -93449 -56830 77710 35038 -155455 -283834 -23597 -38474 18751 105080 414792 59274
18111 46146 -206645 22750 52243 22579 -68280 -150785 -138814 2456 53006 -59441 -102261 -8690
18098 194824 -260628 160316 -122181 -14428 -131154 -60584 -179073 218080 -153084 33416
18087 -260897 223618 22968 -560370 36077 -11680 -294255 156156 140805 -133017 -209638
$$ packed form
18167D91662C7523a02798b5501r5100A58041E8944g3588L041B43872f9688n7124
18156a26812A91348a4273l98870D0209b71372B22621a33930B02431a08461K1254
18146h7207C81742c3473F881b75237C2230K52531B6609N9350h210o0007C39770
18134d15057g3429A04979b81881A11898b85508B57803b35431d952j42041H3931
18123i3449L6619G7710C5038a55455j28379b3597j4877A8751Q6329L09712E9274
18111D6146b06645B2750K9493B2579f8280q2505J1971B456N0550e9441m2820h690
18098A94824b60628A60316a22181a4428j16726f0584j18489B18080a53084C3416
18087b60897B23618B2968e60370C6077a1680k82575A56156j5351a33017p6621
$$ plain form
18077 -209638 120015 -151937 202338 -135496 65788 -442597 382490 -128539 -366734 -185953
18067 -185953 148564 -14861 -139961 -398801 -207717 39630 68088 175850 -216609 187364
18056 234638 -391816 -17223 -30368 -56304 35520 154732 -216947 -192636 14276 185695 56915
18044 8550 -260138 -53870 -413404 239801 55304 -246523 -41105 -53295 62109 60591 -289072
18032 89628 -164156 -289379 296147 -55324 9050 -397777 -100466 -165762 -348453 -114946
18021 -76133 64152 60314 -12595 203979 -129098 161595 154245 -236576 14961 76673 -103716
18009 27673 404328 153864 -138874 -189490 -238775 -2703 34724 27173 -5263 159414 33648
17997 303362 -72633 152258 -164447 58571 168422 -250883 -32003 -3565 -176956 -279280
$$ packed form
18077b09638A20015a51937B02338a35496F5788d42597C82490a28539k38195J80781
18067a85953A48564a4861j25100k58840J91084C9630K8458J07762b16609A87364
18056B34638c91816a7223j3145k5936C5520J19212b16947K4311A4276J71419E6915
18044H550b60138e3870l59534B39801E5304b46523d1105j2190F2109j518b89072
18032H9628a64156j25223B96147e5324I050c97777a00466o5296j82691a14946
18021g6133F4152l838a2595B03979a29098A61595p350b36576A4961O1712a03716
18009B7673L76655A53864a38874n0616m9285b703C4724p551e263A59414C3648
17997C03362g2633A52258a64447E8571J09851b50883c2003c565j73391j02324
$$ plain form
17987 -279280 -129258 93844 -30887 228626 -38300 155927 -191600 49182 112586 -114161
17976 -147624 -4587 -62346 230540 -185469 316528 -221654 -69942 -60435 -12548 171152 -248933
17964 -44661 54793 153009 -42294 -281714 -17497 323388 -205079 -12251 -203065 -27755 263101
17952 -387909 321755 323167 369260 -332859 -246562 9812 40595 -302439 222726 79417 -353922
17940 92071 92842 214889 162429 -106270 -82799 -318144 110334 -112423 -50423 -272799 18478
17928 -280973 59602 -190064 -146433 -207678 176515 -151615 131647 -166999 -169767 -206382 -49611
17916 620 118515 231662 -190946 -133414 264854 -60699 -69434 78663 -20832 -76459 -201035
17905 -201035 273407 73286 -367930 -218702 -55960 214619 52764 -203349 -26336 -172188
$$ packed form
17987b79280a29258I3844c0887B28626c8300A55927a91600D9182O3404a14161
17976a47624d587n7759B30540a85469C16528b21654f9942R507a2548A71152b48933
17964d4661E4793R8216d2294k39420a7497C23388b05079a2251j90814b7755B63101
17952c87909C21755J412M6093c32859Q6297I812L0783c02439B22726G9417c53922
17940I2071P71J22047n2460a06270K3471k35345A10334a12423e0423k22376A8478
17928b80973E9602a90064M3631o1245A76515a51615A31647a66999k768l6615d9611
17916F20J17895J13147a90946N7532B64854f0699q735G8663b0832n5627j24576
17905b01035B73407G3286c67930J49228e5960B14619E2764b03349b6336j45852
$$ plain form
17895 -172188 -2273 -51924 267340 218169 -175311 -158500 -150829 -134504 118224 26886 -51393
17883 84167 151965 -47605 -21998 -61257 106619 -116868 -118559 53529 130641 -478811 -115121
17871 -32106 120103 231682 -324119 -216449 11707 -111143 210003 100540 89243 12328
17860 -28069 105358 -111745 24702 -44439 -319564 129614 -285044 117118 92532 116855
17850 116855 -2393 -8800 -138523 73780 23175 -181581 -223026 82964 -35417 1742 -141564
17838 44252 50916 186888 -203881 371969 245227 -3935 -23514 -68176 -13736 -227052 264157
17826 66672 -176389 -389898 -276823 -33150 -319314 203722 28500 160248 425573 -187876
17815 63588 159699 -106098 5214 -356407 -46446 46958 206959 -62415 -135263 132293 -59734
$$ packed form
17895a72188b273m9651B67340m9171a75311J6811P671J6325A18224B6886e1393
17883H4167O7798d7605b1998l9259A06619a16868j691E3529P7112d78811a15121
17871c2106A20103J11579c24119J07670A1707a11143B10003A00540j1297A2328
17860b8069A05358a11745B4702d4439k75125A29614b85044A17118k4586K4323
17850A16855b393o407j29723G3780B3175a81581m1445H2964c5417A742a41564
17838D4252O664J35972b03881C71969j26742c935j9579m4662a3736k13316B64157
17826F6672a76389k13509J13075c3150k86164B03722B8500J31748K65325a87876
17815F3588R6111a06098E214c56407d6446D6958J60001f2415p2848A32293e9734
$$ plain form
17803 25032 610403 108644 -296184 149221 -207175 -131938 -128460 -191028 -198361 23236 6681
17791 -68158 -265911 -529146 -158621 5257 49931 44979 134702 208117 413427 -162238 90323
17779 -78163 203598 118783 142980 -148775 30821 -124191 7628 3922 -32429 185256 288169
17768 288169 9938 135738 -367101 -320242 46179 56340 -35679 196178 -163930 75104 -143011
17756 -322171 46438 390054 -1458 165779 -277653 -80219 34522 149649 100811 97537 85149
17745 85149 -28253 151363 -42095 137209 263683 -339492 85169 9306 19476 -297611 -105486
17733 61618 -250916 -115801 -223462 -88232 11833 -65485 -3992 108761 77650 108307 -90293
17721 -58690 -5434 -122188 -121565 -14825 270131 116778 166487 -144515 184178 119359 37262
$$ packed form
17803B5032N85371A08644b96184A49221b07175P5237L478o2568p333B3236F681
17791f8158j97753k63235a58621E257M4674m952Q9723P3415K05310a62238I0323
17779g8163B03598q4815K4197a48775C0821a24191G628l706c2429A85256J02913
17768B88169I938J25800c67101M6859D6179J0161c5679A96178a63930G5104a43011
17756c22171D6438L43616a458A65779b77653h0219C4522J15127m8838l274j2388
17745H5149b8253A51363d2095A37209J26474c39492H5169I306J0170b97611a05486
17733F1618b50916a15801j07661h8232A1833f5485c992A08761l1111L0657i0293
17721e8690e434j16754O23a4825B70131A16778M9709a44515A84178o4819C7262
$$ plain form
17709 109323 263198 139898 -201241 141535 36233 24439 -5335 51469 -59049 -16584 -206813
17698 -206813 256659 287268 169428 -12717 68721 18835 -53436 -136900 403520 -50745 -300250
17687 -300250 249320 193684 140128 104635 -213984 20524 105440 22819 27977 296781 126664
17675 216577 -1898 138476 295567 -9343 -159189 -6775 62361 -139042 -25871 -188198 -12404
17663 121659 -28344 151344 -45905 117932 158392 212524 -138709 155610 4498 -183812 137389
17651 64875 173288 16626 8756 166659 -243298 296521 4742 51061 301 269611 397565
17640 397565 15435 -46701 168100 184046 -61616 182756 295780 79643 314392 -422824
17629 -34473 223742 245857 -164980 56229 -173900 74949 -180193 -246747 -47470 272574 146165
$$ packed form
17709A09323J53875j23300b01241A41535C6233j1794e335E1469e9049a6584j90229
17698b06813B56659L0609j17840a2717F8721A8835e3436q3464D03520e0745k49505
17687c00250B49320n5636n3556l5493b13984B0524Q4916B2819N158K68804A26664
17675B16577a898A38476J57091i343j49846f775F2361a39042b5871j62327a2404
17663A21659b8344A51344d5905A17932M0460N4132a38709A55610D498a83812A37389
17651F4875J08413A6626p870J57903b43298B96521D742M6319C01K69310J27954
17640C97565A5435d6701A68100J5946f1616A82756J13024G9643K34749d22824
17629c4473B23742K2115a64980E6229a73900G4949a80193o6554d7470B72574j26409
$$ plain form
17618 146165 56794 28356 -158898 247591 292880 -104755 224850 195175 -62167 -321656
17608 -321656 212128 353639 154960 86668 173584 81244 1607 -57882 113113 -240484 2335
17596 82815 -254543 199476 13917 65933 337546 502 112815 115408 -182512 170188 113133
17585 113133 -12366 174499 118551 213270 37457 -20106 -73108 173938 -10997 129219 85443
17574 85443 114377 105996 19911 -50494 340137 97967 151783 291687 121519 -222256 207375
17562 146746 -196588 -318363 -136626 -243091 170754 -206031 -78201 88310 -43473 -105897
17552 -105897 -49761 43069 84148 -296821 96410 141547 90762 -282859 263494 349375 235523
17541 235523 76483 207704 144286 47048 -210742 -65864 33772 472145 142309 100096 59993
$$ packed form
17618A46165E6794B8356a58898B47591M5289a04755B24850k9675f2167k59489
17608c21656B12128J41511A54960o8292Q6916H1244A607e7882A13113b40484B335
17596H2815b54543A99476A3917N2016K71613E02J12313K593a82512A70188n7055
17585A13133a2366A74499n5948R4719C7457b0106n3002A73938a0997A29219m3776
17574H5443K8934q381A9911e0494C40137I7967N3816J39904A21519b22256B07375
17562A46746a96588j21775a36626j06465A70754b06031g8201H8310d3473o2424
17552a05897d9761D3069M1079b96821I6410M5137n0785b82859B63494Q5881j13852
17541B35523G6483J31221o3418D7048b10742f5864C3772M38373A42309m2213m0103
$$ plain form
17530 59993 -161147 -438910 44925 107608 19164 301918 -279613 174927 273073 309783 -113359
17518 215242 -105141 397986 68926 198432 -135900 297720 209933 215075 157173 323083
17508 323083 122986 145149 168360 -12937 226254 -12812 177968 -64785 15965 344785 27076
17496 51422 181891 639236 15086 50902 -184546 -189415 324375 577963 159467 -82391 71570
17484 38166 -46575 359171 114012 48521 85385 -24310 182287 -60967 542642 336397 66612
17472 209032 108526 314301 84408 86712 -34201 -95942 194118 233022 173035 289990 101206
17460 -81514 6031 -74656 12662 -201474 125923 381901 58834 247297 208122 357775 -130529
17448 330582 622114 -43041 266539 147878 -84368 229902 311574 -101493 434637 264713
$$ packed form
17530E9993a61147k77763D4925O2683A9164K82754b79613A74927R8146L6710a13359
17518B15242a05141C97986F8926J29506a35900B97720q7787N142n7902J65910
17508C23083A22986K2163K3211a2937B26254a2812A77968f4785A5965L28820B7076
17496E1422J30469M57345A5086L5816a84546m869C24375K53588A59467h2391G1570
17484C8166d6575C59171A14012D8521L6864b4310A82287f0967E42642k06245F6612
17472B09032j00506K05775H4408K304c4201o1741A94118L8904n9987J16955A01206
17460h1514F031g4656A2662b01474A25923K55978E8834J88463l9175J49653a30529
17448C30582K91532d3041B66539j18661h4368B29902Q1672a01493D34637j69924
$$ plain form
17438 264713 370103 23385 342991 147731 200351 193113 128651 510251 118719 116280 177009
17427 177009 263921 -138322 281346 329226 350571 175549 -78656 159818 377359 175590
17416 238540 255784 93535 646470 223190 296152 261151 117561 -130166 336715 131132
17405 -92362 204213 529374 -13622 209796 -256502 208936 266459 -228312 230865 533884
17395 533884 -204565 423658 409681 117313 111527 139609 329895 -204343 23317 112640 267267
17384 267267 430758 238508 308319 94104 272932 659700 268870 48778 179918 -11153
17373 98603 -197567 247847 244323 141097 318105 221612 -62707 236616 24821 -188816 106062
17361 260944 292610 67222 176830 276561 416337 -131470 490127 133511 -71862 264981
$$ packed form
17438B64713J05390B3385L19606A47731N2620p238o4462L81600A18719k439O0729
17427A77009Q6912a38322B81346M7880K1345j75022g8656A59818K17541A75590
17416B38540J7244I3535N52935B23190P2962l5001A17561a30166C36715A31132
17405i2362B04213L25161a3622B09796b56502B08936N7523b28312B30865L03019
17395E33884b04565D23658j3977A17313n786K8082J90286b04343B3317Q9323J54627
17384B67267J63491j92250O9811I4104J78828L86768B68870D8778J31140a1153
17373I8603a97567B47847l524j03226J77008r6493f2707B36616B4821a88816A06062
17361B60944L1666F7222J09608R9731J39776a31470D90127A33511g1862B64981
$$ plain form
17350 -8744 238814 -45643 -83872 307944 272291 128885 205932 228705 341163 143187 -12109
17338 273420 893 -24501 297127 -94985 -188693 -181807 241616 135169 47646 339150 23217
17326 272919 506921 260045 206341 -3491 256674 450867 156008 76000 217458 489193
17316 489193 -44331 36399 375233 125734 103505 -140347 253161 185237 378137 -19635
17305 69511 454943 28621 44166 2042 289297 -80778 363105 96231 405941 -90216 327694
17293 -178477 283650 543254 106418 -74360 -450108 351283 264020 -17818 415208 382191
17283 382191 -26510 44407 204182 4573 267954 173210 172729 115570 429580 121307 159716
17272 159716 -129038 392524 241997 -32969 85665 36487 198316 -90586 75388 -217155
$$ packed form
17350h744B38814d5643l8229C07944l5653A28885P7047K2773J12458A43187a2109
17338B73420H93b4501B97127i4985r3708O886B41616j06447D7646K91504B3217
17326B72919K34002k46876n3704c491B56674J94193A56008G6000J41458K71735
17316D89193d4331C6399L38834A25734k2229a40347B53161o7924J92900a9635
17305F9511L85432B8621J5545B042K87255h0778C63105I6231L09710i0216C27694
17293a78477B83650K59604A06418g4360l75748C51283q7263a7818D15208l3017
17283C82191b6510D4407J59775D573K63381r4744m81n7159L14010A21307L8409
17272A59716a29038C92524j50527c2969H5665C6487J61829i0586G5388b17155
$$ plain form
17261 302229 182435 440350 202173 123291 313077 383586 320607 299220 130154 131328 180146
17250 180146 129180 431481 306776 188326 159483 186628 27137 140514 207288 79839 178695
17239 178695 262666 341897 149433 85414 455937 165687 -31302 281473 385416 17251
17228 149120 157981 210365 90473 331470 -139652 319669 130256 333933 199599 158672
17218 158672 7010 97468 378920 96779 223931 477541 272428 245961 188779 304723 147444
17206 -91144 69613 232504 564551 577957 203245 -104040 303979 307815 272553 231017 473923
17195 473923 118365 54374 -16635 394457 167752 449544 207893 631723 185731 456533
17185 456533 522957 220473 509929 270832 175789 74207 275026 252024 55678 198618
$$ packed form
17261C02229j19794K57915B02173p8882J89786P0509o2979k1387A30154J174M8818
17250A80146n0966L02301j24705j18450k8843K7145B7137J13377O6774G9839R8856
17239A78695Q3971P9231A49433o4019L70523A65687c1302B81473J03943A7251
17228A49120Q861N2384I0473K40997a39652C19669A30256K03677j34334m0927
17218A58672G010R0458K81452I6779J27152K53610k05113k6467n7182J15944A47444
17206i1144F9613J62891L32047J3406B03245a04040C03979L836l5262m1536K42906
17195D73923A18365E4374a6635C94457A67752K81792B07893M23830A85731K70802
17185D56533O6424B20473K89456k39097r5043G4207K00819k3002E5678J42940
$$ plain form
17175 198618 290321 566198 43409 375523 527868 292611 304658 710607 151451 134563
17165 134563 413045 187745 342784 345937 468166 388538 278735 238633 347713 413618
17155 413618 415230 116466 218317 275696 103423 62674 -453 112175 143679 290840 301166
17144 301166 374347 136555 470368 641430 413133 141221 529744 441071 577043 381464
17134 381464 138397 215060 293711 304202 181166 138356 489762 684953 183886 350147
17124 350147 510280 455765 203289 390662 743377 425379 333727 219250 357415 651290
17114 651290 -269162 614318 516358 336005 571432 276087 462806 748432 189292 580077
17104 580077 -12161 777309 280495 370608 200153 219518 445346 457929 594474 404365
$$ packed form
17175A98618R1703K75877D3409L32114J52345k35257J2047M05949A51451j6888
17165A34563K78482A87745J55039L153J22229p9628j09803m0102J09080O5905
17155D13618J612A16466J01851N7379A03423m0749d53A12175L1504J47161J0326
17144C01166P3181A36555L33813J71062k28297A41221L88523q8673J35972j95579
17134C81464A38397P6663P8651J0491j23036m2810L51406J95191A83886J66261
17124C50147J60133n4515B03289J87373L52715l17998r1652j14477J38165K93875
17114F51290b69162F14318r7960j80353K35427B76087J86719K85626A89292L90785
17104E80077a2161G77309B80495R0113j70455J9365K25828J2583J36545j90109
$$ plain form
17094 404365 301880 593659 569196 383941 542727 637335 422292 308351 136105 224405
17084 224405 702883 433059 347174 307204 703596 325172 260048 517499 317440 538944
17074 538944 344492 580301 452897 244660 664548 480955 156426 484544 484344 166495
17063 441129 402015 281740 638324 601503 325207 872918 609267 417728 302005 596967
17053 596967 579868 787678 345303 741145 418610 233641 547463 691449 343989 559710
17043 559710 476938 666734 421609 271603 667375 509513 529537 503142 458000 750678
17033 750678 482226 787949 590803 774150 691269 722549 868703 453083 647940 879135
17023 879135 551070 670004 938197 438338 547149 773788 762349 843995 707327 675815
$$ packed form
17094D04365j02485K91779k4463j85255J58786R4608k15043j13941A36105Q8300
17084B24405M78478k69824q5885l9970L96392C25172o5124K57451k00059K21504
17074E38944j94452K35809j27404k08237M19888j83593A56426L28118k00A66495
17063D41129l9114j20275L56584l6821k76296N47711k63651j91539j15723K94962
17053E96967j7099K07810C45303L95842l22535j84969L13822J43986C43989K15721
17043E59710q2772J89796k45125j50006L95772j57862K0024k6395m5142K92678
17033G50678k68452L05723j97146J83347q2881L1280J46154m15620J94857K31195
17023H79135l28065J18934K68193D38338J08811K26639j1439Q1646j36668l1512
$$ plain form
17013 675815 752778 510832 556330 453767 659824 728083 689629 728423 773529 490488 951096
17002 951096 851285 478559 678233 809976 781257 812533 689804 584691 481285 930784
16992 930784 1154897 779796 892439 636458 709002 1409964 930324 991624 1030927 1145838
16982 1145838 1130187 624511 986553 675444 1054459 1090241 772078 896158 1036098 1243112
16972 1243112 867607 743088 1079833 1178253 1175312 863128 1339512 565613 1064803 1097831
16962 1097831 1127036 970288 792180 1090621 1323055 1343899 1212512 1015557 1032211 1007545
16952 1007545 1077744 1175474 1306685 1246536 1300610 1308817 1212295 1013688 1137698 1225740 1045650
16941 1045650 1409526 1063122 1308688 1412979 1469542 1326023 1353462 1490995 1101021 1365784
$$ packed form
17013F75815P6963k41946M5498j02563K06057O8259l8454L8794M5106k83041M60608
17002I51096r9811l72726J99674J31743k8719L1276j22729j05113j03406M49499
16992I30784K24113l75101J12643k55981P2544P00962m79640O1300L9303J14911
16982A145838j5651n05676L62042l11109L79015L5782l18163J24080J39940K07014
16972A243112l75505j24519L36745R8420k941l12184M76384E65613M99190L3028
16962A097831K9205j56748j78108K98441K32434K0844j31387j96955J6654k4666
16952A007545P0199R7730J31211o0149N4074Q207r6522j98607J24010Q8042j80090
16941A045650L63876l46404K45566J04291N6563j43519K7439J37533l89974K64763
$$ plain form
16931 1365784 1449311 1232260 1490752 1417449 1356638 1597505 1324828 1221484 1298919 1550871
16921 1550871 1411618 1418053 1661604 1565247 1420766 1545914 1559132 1471798 1387446 1712097
16911 1712097 1566816 1562986 1832955 1592516 1594167 1726357 1975175 2051454 1860017 2013274
16901 2013274 1985484 2126714 1961973 1937871 2101088 1977375 1736208 1852033 1769167 1971614
16891 1971614 1891975 2073100 2326142 2049572 2110112 2158793 2065011 2218371 2667395 2173303
16881 2173303 2357888 2340791 1900491 2495175 2296891 2349754 2551875 2237159 2725730 2569758
16871 2569758 2982085 2475691 2664459 2966139 2743958 2746163 2893628 2542756 2834754 3090149
16861 3090149 3044988 3319238 2980796 3274445 3065592 3217832 2925176 3515464 3043712 3437312
$$ packed form
16931A365784Q3527k17051K58492p3303o0811K40867k72677j03344P7435K51952
16921A550871j39253O435K43551r6357j44481J25148J3218q7334q4352L24651
16911A712097j45281l830K69969k40439J651J32190K48818P6279j91437J53257
16901B013274k7790J41230j64741k4102J63217j23713k41167J15825q2866K02447
16891A971614p9639J81125K53042k76570O0540M8681r3782J53360M49024m94092
16881B173303J84585j7097m40300N94684j98284N2863K02121l14716M88571j55972
16871B569758M12327n06394J88768L01680k22181K205J47465l50872K91998K55395
16861C090149m5161K74250l38442K93649k08853J52240k92656N90288m71752L93600
$$ plain form
16851 3437312 3098375 3256836 3394875 3064805 3457972 3862320 3879668 3805651 3826563 3739443
16841 3739443 3631334 3903764 4069471 3896400 4208706 4184782 4287566 4190723 4208922 4191728
16831 4191728 4682250 4596539 4956138 4394591 5017333 4924866 4985375 4879782 5342083 5346843
16821 5346843 5393413 5789686 5656219 5754246 6025544 5740549 6326799 6331895 5954770 6598565
16811 6598565 6550908 7015429 6971581 7027028 7215607 7574245 7501114 7690499 8023352 8182110
16801 8182110 8032864 8375791 8432504 8552600 9178034 9003895 9337327 9805563 9996801 10375738
16791 10375738 10555579 10754689 10599301 11375384 11480339 11806656 12201676 12442973 13061336
16782 13061336 13397996 13970631 13903853 14394133 14738118 15360149 15606896 16076670 16661276
$$ packed form
16851C437312l38937J58461J38039l30070L93167M04348J7348p4017K0912q7120
16841C739443j08109K72430J65707j73071L12306k3924J02784r6843J8199j7194
16831D191728M90522q5711L59599n61547O22742r2467O0509j05593M62301M760
16821E346843M6570L96273j33467R8027K71298k84995N86250N096l77125O43795
16811F598565m7657M64521m3848N5447J88579L58638p3131J89385L32853J58758
16801H182110j49246L42927N6713J20096O25434j74139L33432M68236J91238L78937
16791A0375738J79841J99110j55388P76083J04955L26317L95020K41297O18363
16782A3061336L36660N72635o6778M90280L43985O22031K46747M69774N84606
$$ plain form
16773 16661276 17553433 17904542 18562733 19250491 19743570 20415396 20898052 21821814 22853744
16764 22853744 23724412 24321835 25355315 26431434 27350300 28031085 29689006 30765213 32436885
16755 32436885 33335769 35295226 36806121 38605379 40509601 42037519 44283887 46096511
16747 46096511 48764155 51487288 53685531 56699161 59644507 62724263 66376749 70065903
16739 70065903 74313961 78227345 82806384 87684911 92585534 98145849 103842971 109978034
16731 109978034 116185133 122573402 129466202 136362826 143182266 150324417 157392942 163991039
16723 163991039 170156052 175870959 180924753 185082685 188268749 190026502 190741728 190564248
16715 190564248 188965418 186219266 182656097 178273704 172462534 166643788 160099688 152974404
$$ packed form
16773A6661276Q92157L51109O58191O87758M93079O71826M82656R23762J031930
16764B2853744Q70668N97423J033480J076119R18866O80785J657921J076207J671672
16755C2436885Q98884J959457J510895J799258J904222J527918K246368J812624
16747D6096511K667644K723133K198243L013630K945346L079756L652486L689154
16739G0065903M248058L913384M579039M878527M900623N560315N697122O135063
16731A09978034O207099O388269O892800O896624O819440P142151P068525O598097
16723A63991039O165013N714907N053794M157932L186064J757753P15226j77480
16715A90564248j598830k746152l563169m382393n811170n818746o544100p125284
$$ plain form
16707 152974404 145860271 138915370 131709052 124745411 118210653 111237903 105226820 99233512
16699 99233512 93588945 88135183 83411533 78672347 74075968 69954471 66207915 62301647
16691 62301647 59032407 55781072 53199346 50131460 47866750 45532455 43232951 41198639
16683 41198639 39422176 36882389 35617755 34196706 32539834 31018614 29777001 28678185
16675 28678185 27389726 26274899 24913838 24328532 22895078 22141115 21390444 20541686 19646635
16666 19646635 18966037 18534596 17548297 17160726 16605637 16093493 15421280 14729141 14332972
16657 14332972 13883081 13436780 12994006 13024644 12522272 11944225 11705766 11262559 10745940
16648 10745940 10345782 10300664 10247058 9612382 9776437 9500333 8920611 8905135 8519509 8315363
$$ packed form
16707A52974404p114133o944901p206318o963641o534758o972750o011083n993308
16699I9233512n644567n453762m723650m739186m596379m121497l746556l906268
16691F2301647l269240l251335k581726l067886k264710k334295k299504k034312
16683D1198639j776463k539787j264634j421049j656872j521220j241613j098816
16675B8678185j288459j114827j361061n85306j433454p53963p50671q48758q95051
16666A9646635o80598m31441r86299l87571n55089n12144o72213o92139l96169
16657A4332972m49891m46301m42774L0638n02372n78047k38459m43207n16619
16648A0745940m00158m5118n3606o34676J64055k76104n79722j5476l85626k04146
$$ plain form
16638 8315363 8245544 8008072 7792054 7628129 7338554 7270827 7030252 6608066 6562272 6561459
16628 6561459 6253290 6202052 5674292 5819847 5727162 5755805 5381547 5241186 5603303 5239445
16618 5239445 5159518 5066775 4829538 4533841 4852661 4624769 4452743 4325702 4280977 4353547
16608 4353547 4376838 4374313 4192076 3940206 3930158 3698847 3711013 3881078 3439116 3447768 3573925
16597 3573925 3844835 3491008 2942407 3443689 3367905 3208391 3280771 3159669 2735669 3206365
16587 3206365 2704216 2808750 3042619 2861383 2627293 2897340 2883030 2589498 2488820 2731304
16577 2731304 3069875 2675799 2437567 2559440 2035472 2338146 2391078 2072528 2377402 2253785
16567 2253785 1997943 2009579 2219804 2138823 1666955 1777113 1822473 1652027 1777390 2039219
$$ packed form
16638H315363o9819k37472k16018j63925k89575o7727k40575m22186m5794q13
16628F561459l08169n1238n27760J45555r2685K8643l74258j40361L62117l63858
16618E239445p9927r2743k37237k95697L18820k27892j72026j27041m4725P2570
16608D353547K3291k525j82237k51870j0048k31311J2166J70065m41962Q652J26157
16597C573925K70910l53827n48601N01282p5784j59514P2380j21102m24000M70696
16587C206365n02149J04534K33869j81236k34090K70047j4310k93532j00678K42484
16577B731304L38571l94076k38232J21873n23968L02674N2932l18550L04874j23617
16567B253785k55842J1636K10225q0981m71868J10158M5360j70446J25363K61829
$$ plain form
16557 2039219 1949681 1545775 1891587 1750300 1280909 1822838 1905379 1574047 1735455 1473106
16547 1473106 1273356 1713405 1551301 1537147 1388947 1528661 1916026 1518167 1571629 1302014
16537 1302014 1416800 1262803 1328062 1728967 1615809 1288114 1342475 1158956 1224434 1141564
16527 1141564 1116317 1433525 1235468 940647 977164 1397408 1282156 1332845 1681465 733059
16516 1344800 1151521 989429 921773 1190634 1068949 814597 1161412 992811 978804 850313
16506 850313 1004922 825880 1008283 986411 1062933 1032234 903850 997690 986176 1084767 812319
16495 812319 830501 922171 777195 846548 691103 843786 940666 686077 1024534 944689
16485 944689 956110 774705 681477 1073340 926054 725360 786506 770937 623197 918950
$$ packed form
16557B039219q9538m03906L45812j41287m69391N41929Q2541l31332J61408k62349
16547A473106j99750M40049j62104j4154j48200J39714L87365l97859N3462k69615
16537A302014J14786j53997O5259M00905j13158l27695N4361j83519O5478q2870
16527A141564k5247L17208j98057k94821L6517M20244j15252N0689L48620G33059
16516A344800j93279j62092o7656K68861j21685k54352L46815j68601j4007j28491
16506H50313J54609j79042J82403k1872P6522l0699j28384R3840j1514R8591k72448
16495H12319J8182R1670j44976O9353j55445J52683R6880k54589L38457p9845
16485I44689J1421j81405r3228L91863j47286k00694O1146j5569j47740K95753
$$ plain form
16475 918950 702896 649699 592132 721557 1112466 940651 718574 510617 688845 763212
16465 763212 920130 511609 1014446 242029 665181 291261 656568 658164 587359 438581
16455 438581 476300 499940 463907 601785 681614 921588 491251 850980 273026 635340
16445 635340 541899 768965 539068 309381 417869 538012 591483 223342 677965 389047
16435 389047 537013 251336 496091 447518 662344 682997 150895 474440 614067 477587
16425 477587 486937 576725 401969 630830 625236 303595 450754 202329 188613 295516 426350
16414 426350 84018 245567 654917 763933 291778 383739 176030 569317 436178 305622
16404 305622 161145 767266 420447 399216 414519 16426 391986 482997 226035 37556
$$ packed form
16475I18950k16054n3197n7567J29425L90909j71815k22077k07957J78228P4367
16465G63212J56918m08521N02837B42029M23152B91261L65307J596p0805j48778
16455D38581L7719K3640l6033J37878P9829K39974m30337L59729B73026L62314
16445F35340r3441K27066k29897k29687J08488J20143N3471B23342M54623k88918
16435C89047J47966B51336K44755m8573K14826K0653A50895L23545J39627j36480
16425D77587R350Q9788j74756K28861n594C03595J47159B02329j3716J06903J30834
16414D26350H4018J61549M09350J09016B91778R1961A76030L93287j33139j30556
16404C05622j44477O06121l46819k1231J5303A6426L75560R1011B26035C7556
$$ plain form
16393 259168 514017 220194 331935 381596 345855 330653 197330 233322 224691 145628 546181
16382 546181 463648 296268 249034 99577 136407 268584 383705 -72589 221173 242891 474306
16371 474306 342618 462989 37634 170246 148771 17083 496436 173656 99599 124825
16361 124825 106007 466083 156401 558864 433534 361966 398649 172655 189259 310268
16351 310268 229870 31842 550329 50821 135291 378988 407166 383829 304800 412665 153912
16339 303550 325 372611 419934 8770 155116 384309 153891 256994 -4105 405936 36971
16327 111736 80661 219687 132070 424440 289236 194715 211059 356784 89996 403483
16317 403483 -77217 111981 573560 -89498 -382820 245946 493312 306423 -90092 -94207
$$ packed form
16393B59168K54849B20194J11741M9661l5741j5202j33323L5992q631p9063M00553
16382E46181q2533j67380m7234I9577L6830J32177J15121g2589B21173K1718K31415
16371D74306j31688J20371C7634J32612k1475A7083M79353A73656p4057K5226
16361A24825j8818L60076A56401M02463j25330p1568L6683A72655J6604J21009
16351C10268q0398C1842N18487E0821Q4470K43697K8178k3337p9029J07865A53912
16339C03550C25L72286M7323H770J46346K29193A53891J03103d105D05936C6971
16327A11736l1075J39026q7617K92370j35204r4521J6344J45725H9996L13487
16317D03483g7217A11981M61579h9498k93322B45946K47366j86889i0092m115
$$ plain form
16307 -94207 208824 255192 11579 346779 -144262 161758 285713 -127505 -21950 483016
16296 -141238 197013 -34980 -121730 421355 -41502 363767 -51960 212091 427621 41224
16285 177142 244052 -15419 355719 285859 -261390 540427 211668 77789 -105920 -34951
16274 20383 81094 507819 92487 -193770 416449 -3676 -56542 160316 197248 136997 232730
16263 232730 -175447 116174 400722 -152402 -24026 -57786 272988 171463 -97349 123831
16252 -57180 274864 -17349 9353 -4909 144887 250668 155014 -213957 358700 85721 284937
16241 284937 47030 182472 77113 -60664 629920 79709 -188108 243433 208805 295844 54621
16229 223626 186804 11926 132392 -64725 -70709 226669 41422 377417 -91510 191651 217891
$$ packed form
16307i4207B08824M6368A1579L35200a44262A61758J23955a27505b1950D83016
16296a41238A97013c4980q6750D21355d1502C63767e1960B12091K15530D1224
16285A77142O6910a5419C55719o9860b61390E40427B11668G7789a05920c4951
16274B0383O0711M26725I2487a93770D16449c676n2866A60316L6932o0251R5733
16263B32730a75447A16174K84548a52402b4026l3760B72988j01525i7349A23831
16252e7180B74864a7349I353d909A44887J05781r5654b13957C58700H5721J99216
16241B84937D7030J35442G7113f0664F29920G9709a88108B43433l4628Q7039E4621
16229B23626l6822A1926J20466f4725n984B26669D1422L35995i1510A91651K6240
$$ plain form
16218 217891 243709 64530 241351 175162 280218 -168421 -268175 52529 1093 12412 -106862
16206 278088 23156 423358 70490 61130 481548 88066 -56918 -160499 -76509 -68618 -17301
16194 -107646 -17708 -42727 -137030 -100829 -203260 -409839 -117132 185507 192985 89078 7091
16182 49104 11854 -187414 258445 207597 -318599 -43337 -27139 -86261 -127276 -33923 -113555
16171 -113555 79503 -172665 -128543 10164 1066 130236 -24884 217075 -30362 -269175 -77645
16159 202609 -22133 219136 272467 -13203 262168 252983 75111 -85891 195769 -22993 197492
16147 226182 -258923 382524 -209668 2851 232346 14798 254210 -226693 73554 298522
16137 298522 504496 -225065 -401772 -186004 60551 192001 -6296 67316 13508 226097
$$ packed form
16218B17891K5818F4530J76821o6189J05056a68421r9754E2529A093J1319a06862
16206B78088B3156M00202G0490r360M20418H8066e6918j03581g6509P891a7301
16194a07646a7708k5019r4303L6201j02431k06579a17132A85507P478H9078G091
16182D9104A1854a87414B58445n0848c18599d3337J6198n9122m1015c3923p9632
16171a13555G9503a72665M4122A0164A066J29170b4884B17075c0362k38813g7645
16159B02609b2133B19136N3331a3203B62168r185G5111h5891A95769b2993A97492
16147B26182b58923C82524b09668B851K29495A4798K39412b26693G3554K24968
16137B98522K05974b25065j76707a86004F0551J31450f296F7316A3508K12589
$$ plain form
16127 226097 -163620 60064 -53852 143073 70501 11082 -16078 -28314 51464 -211457 234090
16115 -121304 257897 37549 -107445 120136 343126 -99019 191848 -194931 376275 -71468
16104 -144764 161204 265267 424146 141102 103158 252546 -100675 173176 26 146699
16094 146699 289737 195698 -284036 -271095 -160766 -41715 -13 81950 -355793 263892 72463
16082 -332237 531 -53559 -21793 -40373 121455 -28543 24185 100959 174259 59574 -88063 -3003
16069 310087 211407 13097 -113678 -102843 303044 -189567 -64942 -208138 -390207 -54788
16058 51969 -211844 96984 65650 -194585 185052 -94205 -133551 -47366 182522 -113889 -131349
16047 -131349 -496582 -110383 -212788 -107156 -27965 -315 -5108 62864 -172067 21571 67123
$$ packed form
16127B26097a63620F0064e3852A43073G0501A1082a6078j2236E1464b11457B34090
16115a21304B57897C7549a07445A20136K22990i9019A91848a94931C76275g1468
16104a44764A61204J04063J58879A41102l7944J49388a00675A73176B6J46673
16094A46699J43038r4039b84036J2941J10329d1715a3H1950c55793B63892G2463
16082c32237E31e3559b1793j8580A21455b8543B4185P6774P3300E9574h8063c003
16069C10087r8680A3097a13678J0835C03044a89567f4942j43196j82069e4788
16058E1969b11844I6984l1334a94585A85052i4205l9346d7366A82522a13889j7460
16047a31349l65233a10383j02405J05632b7965c15m793F2864a72067B1571M5552
$$ plain form
16036 67123 185199 136360 -191994 -245257 538 54287 208298 -157482 -98216 -7836 228861
16024 -80353 200840 -143672 93700 79964 123654 219383 160403 18850 -150612 -312697 -116777
16012 131364 146303 -96572 -124184 140856 -186691 -133395 68492 201904 150737 -31327 -497092
16001 -497092 -384757 -141096 -38994 126639 134499 -141974 57475 -111582 80989 54073 -64974
15989 116028 119910 -106404 123405 -378388 -88409 73192 270717 609568 387645 14381
15978 50016 183232 -248583 260630 90110 -104706 -2772 23610 -247820 -53987 63435 249683
15967 249683 68885 59238 12249 71384 -281676 -3815 -219081 -90776 195438 128514 -320685
15955 244113 64117 3074 95572 -176135 -78854 -53235 141581 128673 -206997 -148955 -283627
$$ packed form
16036F7123J18076m8839a91994n3263E38N3749J54011a57482N9266g836B28861
16024h0353B00840a43672I3700j3736M3690R5729n8980A8850a50612j62085a16777
16012A31364J4939i6572k7612A40856a86691N3296F8492J33412n1167c1327m65765
16001d97092J12335a41096c8994A26639P860a41974E7475a11582H0989k6916f4974
15989A16028L882a06404A23405c78388h8409G3192J97525L38851k21923A4381
15978E0016J33216b48583B60630I0110a04706b772B3610b47820e3987F3435J86248
15967B49683F8885r647A2249N9135b81676c815k15266i0776A95438o6924c20685
15955B44113F4117C074R2498a76135g8854K5619A41581j2908b06997N8042j34672
$$ plain form
15944 -283627 -109880 -161407 -430121 -380492 410705 16375 -5978 -156194 -169726 -239649 -204903
15933 -204903 -224934 -182515 212715 73192 135210 3039 29026 -6771 8311 -229277 75612 32561
15920 396670 -64047 -41708 -98850 153271 -81999 -130682 145911 -92111 -81853 -298630 38977
15908 -176326 -19496 37855 -160181 51765 12002 -24907 -43399 30782 -66533 -126901 166236
15896 152394 -41042 -1035 -266206 35360 -57356 46105 227252 -33963 184835 -90294 210726
15884 224912 -125303 -66435 155114 -203 168604 44430 52166 154310 -278 86562 -328647
15872 141714 44144 -79668 -259709 110684 -445551 -188462 309818 -100312 -141533 -9213
15861 -37278 128134 -133708 20908 -121995 -213269 -19297 -19238 182891 341387 -253376 93340
$$ packed form
15944b83627a09880n1527k68714M9629D10705A6375e978j50216j3532o9923L4746
15933b04903k0031M2419B12715G3192O2018C039K5987f771H311b29277G5612C2561
15920C96670f4047K2339n7142A53271h1999m8683A45911i2111J0258k16777C8977
15908a76326a9496C7855a60181E1765A2002b4907j8492C0782f6533o0368A66236
15896A52394d1042a035k65171C5360e7356D6105J81147c3963A84835i0294B10726
15884B24912a25303N8868A55114b03A68604D4430P736J02144b78H6562c28647
15872A41714D4144g9668j80041A10684d45551a88462C09818a00312m1221i213
15861c7278A28134a33708B0908a21995r1274a9297N9A82891J58496b53376I3340
$$ plain form
15849 68727 -70392 -245324 -52062 -115302 -148565 -6888 -85773 -215332 6115 -388964 266255
15837 333171 337591 -94125 -192356 -220079 93168 -185757 102633 -19670 -31618 105425 193986
15826 193986 -67362 -2375 -225793 -101809 -270103 22700 -145118 3082 -51014 -8612 -46586
15815 -46586 -284674 55553 177201 81928 -68477 -404005 -179326 147949 -77401 -25728 38576
15803 -57427 68061 -298498 20016 -240725 -169010 -204510 66868 -21660 96477 -134998 -79691
15792 -79691 -137385 -75237 33412 227730 -20595 -69383 20183 -64535 -150714 278369 16199
15780 140564 -21997 329679 89510 349790 -159646 -249223 62571 -166489 31028 85659 -78939
15768 67646 -218113 -136865 -75947 -313144 290216 171481 -58000 57571 -189252 68234 154656
$$ packed form
15849F8727g0392j74932e2062o3240l3263f888p8885j29559F115c88964B66255
15837C33171M420i4125r8231k7723I3168a85757A02633a9670j1948A05425Q8561
15826A93986f7362b375k23418a01809j68294B2700a45118C082e1014h612l7974
15815d6586k38088E5553J21648H1928f8477l35528a79326A47949g7401b5728C8576
15803e7427F8061b98498B0016b40725P1715l5500F6868b1660I6477a34998N5307
15792g9691n7694O2148C3412J94318b0595m8788B0183f4535q6179B78369A6199
15780A40564b1997C29679H9510K60280a59646q9577F2571a66489C1028N4631g8939
15768F7646b18113Q1248O0918k37197B90216j18735e8000E7571a89252F8234Q6422
$$ plain form
15757 154656 82567 181097 351251 145410 226181 154604 -6339 -53181 125899 80303 -71998
15745 356905 194592 127554 161323 144263 266324 -107439 -132394 -197485 -181950 -194752 63223
15733 -90996 86464 152660 -207967 -41963 1729 116806 -102180 291235 -194134 122517 81740
15722 81740 16256 -95443 13733 181837 48652 -114096 -157039 46430 -90244 345570 256241
15711 256241 -132208 45975 -51760 -25258 -84554 -245991 -82702 325584 -227276 -36490 -63562
15700 -63562 33768 -112497 163471 -143080 -302881 -212752 264544 -5990 243012 172472 -4677
15688 129971 62081 -114046 271769 157824 11170 -66003 -189253 114494 368724 -55262
15677 132565 -321148 -27037 -130959 -75250 -82030 46706 284843 181421 -203640 -124690 -95056
$$ packed form
15757A54656p2089R8530J70154A45410Q0771p1577f339m6842A25899m5596g1998
15745C56905j62313o7038L3769j7060J22061a07439k4955o5091J5535j2802F3223
15733i0996H6464O6196b07967d1963A729J15077a02180B91235a94134A22517m0777
15722H1740A6256i5443A3733J68104D8652a14096m2943D6430i0244C45570q9329
15711B56241a32208D5975e1760b5258n9296j61437h2702C25584b27276c6490k7072
15700f3562C3768a12497A63471a43080j59801R0129B64544e990B43012p0540d677
15688A29971F2081a14046B71769j13945A1170f6003j23250A14494K54230e5262
15677A32565c21148b7037j03922N5709o780D6706K38137j03422b03640P8950K9634
$$ plain form
15666 -95056 -27705 -80950 143044 131375 -104771 66519 -25027 -142331 -67138 -109668 80617
15654 -255887 201510 133650 -171263 -261256 16832 -236597 162255 163684 418207 -172526
15643 167637 -202553 150585 31606 -64108 -176985 -18895 -174879 245902 -182630 -176495
15633 -176495 81238 -123536 -115077 -87480 -261206 -20783 58371 -96283 -68877 -932 -77771 25237
15620 182009 284760 -63979 100083 -58589 19722 303556 -5425 137010 -117045 -224655
15610 -224655 -120698 -277269 123207 -279407 -154634 379818 273588 -174808 91272 -211267
15599 -295697 -92176 -177268 -53507 -123576 172657 -100281 255535 -32432 90183 172071 -15362
15587 176499 -283133 -70478 273711 -102329 -208771 -93637 -87023 -184433 -55863 105490 54234
$$ packed form
15666i5056b7705n3245A43044j1669a04771F6519b5027j17304f7138m2530H0617
15654b55887B01510o7860a71263q9993A6832b36597A62255J429K54523a72526
15643A67637b02553A50585C1606f4108j12877a8895j55984B45902a82630O135
15633a76495H1238a23536Q459K7597j73726b0783E8371i6283K7406i32p6839B5237
15620A82009J02751f3979A00083e8589A9722K83834e425A37010a17045j07610
15610b24655J03957j56571A23207b79407J24773C79818j06230a74808I1272b11267
15599b95697i2176q5092e3507p0069A72657a00281B55535c2432I0183Q1888a5362
15587A76499b83133g0478B73711a02329j06442i3637O614r7410e5863A05490n1256
$$ plain form
15576 54234 201506 -298191 43567 -248849 -435791 -57288 -98836 -243933 -92115 75653 -122603
15564 -64578 -67997 171204 63972 -27800 287709 -181012 -32462 -15158 -224117 -196356 223227
15552 44398 241899 179350 -111921 -399156 99589 -168865 62454 -106450 363521 54195
15541 267564 82040 35774 -91294 197947 24562 398379 111372 -194123 -41892 -635 103946
15529 14338 -12222 -215458 -255539 -209172 -137670 -113527 277926 -125851 -123140 -358441 13275
15517 -111913 -22860 -54685 27006 -41755 30734 -53688 73814 -30937 197909 -251247 -136956
15506 -136956 -1457 40257 217705 128217 70215 52934 -53509 -137105 101689 10632 94496
15495 94496 255089 -282745 38470 214514 -36737 44525 -40020 -91100 146962 262160 -279955
$$ packed form
15576E4234J47272b98191D3567b48849j86942e7288m1548j45097i2115G5653a22603
15564f4578l419A71204F3972b7800B87709a81012c2462a5158k08959K7761B23227
15552D4398J97501o2549a11921k87235I9589a68865F2454a06450C63521E4195
15541B67564H2040C5774i1294A97947B4562L73817A11372a94123d1892f35A03946
15529A4338a2222k03236m0081M6367P1502K4143B77926a25851K711k35301A3275
15517a11913b2860l1825B7006d1755C0734e3688G3814c0937A97909b51247J14291
15506a36956a457D0257J77448q9488n8002j7281e3509q3596A01689A0632Q3864
15495I4496J60593b82745C8470J76044c6737D4525d0020n1080A46962J15198b79955
$$ plain form
15483 -21155 10593 -251490 277605 -36179 -180673 496432 -42505 -17691 169258 118458 -57016
15471 -177180 256911 -25349 -3930 458599 -264811 95981 -228812 16694 -34059 -268027 -325265
15460 -325265 240026 -41176 -68687 15208 83608 -214168 -106802 177812 -321992 -250680
15450 -250680 -199213 151330 17236 169545 -67882 -116884 -192033 229249 -111334 -71114 -22590
15438 -203246 -20655 136474 125866 224212 167325 -155268 -203526 23998 -197705 80592 213111
15427 213111 -28829 -30680 22308 203895 -152121 -102611 -50618 -12635 -264247 -376806 -133325
15415 283692 66021 -301987 94392 88858 -171608 75888 -160129 -172501 46454 255634 24360
15403 -138589 -26656 172853 72815 -105030 -215363 2728 -157906 -137608 110332 -56811 -28356
$$ packed form
15483b1155A0593b51490B77605c6179j44494D96432d2505a7691A69258n0800e7016
15471a77180B56911b5349c930D58599b64811I5981b28812A6694c4059k33968n7238
15460c25265B40026d1176k7511A5208O8400b14168a06802A77812c21992P1312
15450b50680N1467A51330A7236J52309f7882m9002p5149B29249a11334M0220b2590
15438b03246b0655A36474j0608R8346n6887a55268m8258B3998a97705H0592J32519
15427B13111b8829j851B2308J81587a52121M9510e0618a2635k51612j12559a33325
15415B83692F6021c01987I4392n534a71608G5888a60129j2372D6454K09180B4360
15403a38589b6656A72853G2815a05030j10333B728a57906K0298A10332e6811b8356
$$ plain form
15391 95104 89580 -49055 60857 71854 -25201 105611 84613 150503 -106978 133253 -81928
15379 105103 -61628 -95915 303835 -371759 -26204 -177835 258924 16442 -32290 300051
15368 -23948 -243437 277177 -73403 250404 -315246 401039 15135 184020 -159653 -193920
15358 -193920 6075 93306 59687 -377317 -36885 12000 -103591 149912 -35145 65100 231415
15347 231415 -83820 90857 132220 75201 -142545 -144132 41506 171298 219824 188203 231378
15336 231378 185189 -326675 39531 66673 204548 123327 48601 -21669 45824 -94552 -153116
15325 -153116 -78417 111132 24574 47965 -211561 39719 379584 276335 57585 -76539 -97780
15314 -97780 272019 -73028 387431 -50737 120345 191209 145615 95029 302097 -144448 370203
$$ packed form
15391I5104n524d9055F0857J0997b5201A05611k0998O5890a06978A33253h1928
15379A05103f1628l4287C03835c71759b6204j51631B58924A6442c2290C00051
15368b3948k19489B77177g3403B50404c15246D01039A5135J68885a59653l4267
15358a93920F075Q7231l3619c77317c6885A2000a03591A49912c5145F5100J66315
15347B31415h3820I0857M1363n7019a42545j587D1506J29792M8526l1621M3175
15336B31378m6189c26675C9531K7142J37875q1221D8601b1669D5824i4552n8564
15325a53116P4699A11132B4574K3391b11561C9719L39865j03249E7585g6539k1241
15314i7780B72019g3028C87431e0737A20345P0864m5594n0586K07068a44448C70203
$$ plain form
15302 40961 96231 107855 93227 245894 -65983 -53377 109130 32069 -235629 464 -154434
15290 354687 -23521 10503 416200 521995 117538 13018 -98249 -406690 -113287 129762
15279 358408 -172064 -24352 -194853 145807 -257847 1147 276678 346332 120051 37469
15268 -179103 174444 33120 215057 227563 -151163 227991 108193 390937 209650 -225071
15257 375169 1070 152249 -26153 340043 -92830 190817 300191 -223922 219476 568076
15247 568076 1316710 1475896 1192873 1735975 1107002 671966 442768 137729 358929 7165
15236 -56913 8835 -71090 -27884 -122802 26226 185666 103745 -385138 173861 54582 105338
15225 105338 -134293 193653 64470 -32696 -120351 -186873 -28514 -42832 47750 294166 56824
$$ packed form
15302D0961N5270J1624j4628J52667f5983J2606A09130C2069b35629D64a54434
15290C54687b3521A0503M05697J05795A17538A3018i8249l08441a13287A29762
15279C58408a72064b4352j70501A45807b57847A147K75531O9654A20051C7469
15268a79103A74444C3120J81937J2506a51163B27991A08193K82744j81287b25071
15257C75169A070J51179b6153C40043i2830A90817J09374b23922B19476L48600
15247E68076P48634J59186k83023N43102o28973m35036k29198A37729K21200G165
15236e6913H835g1090b7884r4918B6226J59440q1921c85138A73861E4582N0756
15225A05338a34293A93653F4470c2696q7655o6522b8514j4318D7750K46416E6824
$$ plain form
15213 268817 -150027 -278539 205791 177223 338629 39950 282799 74114 150133 -169467
15202 -145659 207430 104914 126332 -151256 -175471 81979 -58142 -94496 40034 -322408 210563
15190 216687 -138137 215511 93606 -158319 52224 -666 249291 -122920 -167901 -67679 216286
15178 -29308 -106218 -310774 -223417 93518 184910 156631 -50301 -219207 73915 -194897 268976
15166 -404578 134625 28200 85691 203371 152892 -130933 -24004 246930 -85186 -150615 -43708
15154 96752 139131 -39288 310776 226377 -11222 98700 -86211 118335 333710 -134275 241121
15142 -243965 152080 -216464 425532 -82017 -64317 8280 222722 -123703 -120881 -125914 337369
15130 109569 23188 -65041 61969 324273 31897 140385 97708 -45623 183690 111110 115499
$$ packed form
15213B68817a50027j28512B05791k8568J61406C9950K42849G4114P6019a69467
15202a45659B07430j02516K1418a51256k4215H1979e8142l6354D0034c22408B10563
15190B16687a38137B15511I3606a58319E2224f66B49291a22920m4981f7679B16286
15178b9308p6910k04556Q7357I3518R1392k8279e0301j68906G3915a94897B68976
15166d04578A34625B8200N7491J17680n0479a30933b4004B46930h5186o5429d3708
15154I6752M2379c9288C10776q4399a1222I8700h6211A18335K15375a34275B41121
15142b43965A52080b16464D25532h2017J7700H280K14442a23703K822n033C37369
15130A09569B3188f5041F1969K62304C1897J08488m2677d5623A83690p2580M389
$$ plain form
15119 115499 -22421 57158 159338 154368 -57270 106690 -131469 -38463 87755 395578 303290
15108 303290 -306584 143973 175031 40672 -263932 272005 -265113 341817 136847 260266
15098 260266 275195 -86801 -169547 -287338 97541 199789 57106 17288 7592 -15183 54974
15086 106556 202145 218077 311209 -147924 -211463 133454 49164 -42111 183165 -4968 486406
15074 273174 160858 321687 411313 -35051 185548 -53040 78256 18095 568669 453537
15064 453537 154198 -163963 282132 25517 245190 98647 -127156 -3947 121741 149685
15054 149685 404291 418650 -173316 428446 149841 20887 283383 -68344 316302 -3347
15043 -18972 275228 179092 613488 326976 92855 246322 153228 285956 339990 181980
$$ packed form
15119A15499b2421E7158J02180m970e7270A06690a31469c8463H7755L07823r2288
15108C03290c06584A43973L1058D0672b63932B72005b65113C41817A36847J23419
15098B60266J4929h6801q2746j17791I7541J02248E7106A7288G592a5183E4974
15086A06556R5589J5932R3132a47924o3539A33454D9164d2111A83165d968D86406
15074B73174j12316J60829Q9626c5051A85548e3040G8256A8095N50574j15132
15064D53537A54198a63963B82132B5517K19673I8647a27156c947A21741K7944
15054A49685K54606J4359a73316D28446A49841B0887K62496f8344C16302c347
15043a8972B75228r6136M34396k86512I2855J53467r3094J32728N4034j58010
$$ plain form
15033 181980 34726 226692 -129594 194967 383204 -220631 -146689 48370 218182 79359
15022 59039 176344 88303 81668 213590 -245099 23844 14901 -115883 144461 525512 470923
15011 470923 37636 231123 61483 -1723 447001 332641 159500 259640 92022 175976 10063
14999 123618 195015 206057 521002 78765 121097 73717 -46 500040 2603 113607 60004 403805
14987 403805 236177 354079 51269 414121 60907 345499 -114876 345375 382577 400538
14977 400538 99081 381955 300725 72572 232163 1859 -270157 67962 215001 392737 253639
14966 253639 139162 150404 517533 333510 248495 204070 155845 564604 71901 193673
14956 193673 571856 98467 263154 57249 105036 84870 383381 146410 387998 200630
$$ packed form
15033A81980C4726J91966a29594A94967J88237b20631P3942D8370J69812G9359
15022E9039J17305q8041o635J31922b45099B3844q943a15883A44461L81051n4589
15011D70923C7636J93487F1483a723D47001j14360A59500J00140I2022Q3954A0063
14999A23618P1397J1042L14945G8765M2332m7380d6E00040B603J11004n3603L43801
14987D03805j67628J17902E1269L62852F0907K84592a14876C45375L7202J7961
14977D00538I9081K82874q1230G2572J59591A859b70157F7962J47039J77736j39098
14966B53639j14477J1242L67129j84023q5015m4425m8225M08759G1901J21772
14956A93673L78183I8467J64687E7249M7787k0166K98511A46410K41588j87368
$$ plain form
14946 200630 221987 141696 279827 295465 361378 182668 235388 313370 146090 258957 137686
14935 137686 460367 477531 490674 306097 253979 427994 173889 283752 258275 423597
14925 423597 106160 348106 160517 243233 137459 547078 89826 168311 229104 -164206
14914 86659 566814 345821 564154 279169 131061 540181 40501 516823 403737 264497
14904 264497 511616 254878 364046 288516 263821 77023 191184 209376 401856 237693
14894 237693 252921 276874 372777 363531 451047 100104 374060 464207 328464 480048 302345
14883 302345 203199 244706 576180 364120 -7790 660152 409269 352992 392402 529864 547060
14872 547060 -28110 794803 345996 211967 762547 173278 662134 292007 461200 560638
$$ packed form
14946B00630K1357q0291J38131J5638O5913j78710N2720P7982A46090J12867j21271
14935A37686L22681J7164J3143j84577n2118J74015A73889J09863k5477J65322
14925D23597A06160K41946A60517Q2716j05774M09619H9826P8485O0793a64206
14914H6659M80155k20993K18333B79169A31061M09120D0501M76322j13086j39240
14904B64497K47119B54878J09168p5530k4695G7023J14161J8192J92480j64163
14894B37693J5228K3953R5903r246Q7516A00104K73956R0147j35743J51584j77703
14883C02345r9146M1507L31474k12060g790F60152k50883n6277L9410J37462J7196
14872E47060b8110G94803C45996j34029N50580A73278M88856B92007J69193R9438
$$ plain form
14862 560638 173521 177907 522290 541054 85090 268002 270148 299618 212744 410749 474403
14851 474403 482048 746852 122987 561775 573222 532815 550526 523375 226001 387381 390490
14840 390490 239492 670863 751097 382538 118467 338197 390999 561515 428870 632739
14830 632739 472542 644591 573485 352308 470720 644123 555880 360843 314016 269682
14820 269682 410160 625797 643998 383176 203110 177036 434592 382890 761651 464141
14810 464141 400337 392394 324799 322229 377985 950871 260015 684528 679953 717970 665447
14799 665447 35994 401209 296392 664686 631207 535171 169465 324175 486224 474628
14789 474628 559689 504028 561049 377890 669969 607813 720899 636690 444824 571516
$$ packed form
14862E60638A73521M386L44383J8764H5090J82912K146K9470q6874J98005O3654
14851D74403P645K64804A22987M38788J1447m0407J7711k7151B26001J61380L109
14840C90490j50998M31371Q0234l68559A18467K19730N2802J70516j32645K03869
14830F32739j60197J72049p1106k21177J18412J73403q8243j95037m6827m4334
14820B69682J40478K15637J8201k60822j80066k6074K57556n1702L78761k97510
14810D64141o3804p943o7595k570N5756N72886B60015M24513m575L8017n2523
14799F65447C5994L65215j04817L68294l3479r6036A69465J54710J62049j1596
14789D74628Q5061n5661N7021j83159K92079o2156J13086q4209j91866J26692
$$ plain form
14779 571516 832365 780167 739283 725892 406398 198592 508952 481229 570685 567612 635153
14768 635153 340765 488180 690282 732200 693254 698489 412551 762351 517840 345750
14758 345750 476797 626643 487752 604570 670543 658465 547702 546835 705971 363644
14748 363644 834845 962253 796195 912761 551849 621718 287862 686404 694209 481551
14738 481551 476739 717253 892707 882459 624439 843694 692233 517985 748948 664265
14728 664265 654057 768132 764226 999293 723920 810445 674986 1011569 1044883 662729
14718 662729 897920 803403 676768 546585 647411 663988 660576 610995 943803 870294 696640
14707 696640 773467 951088 679394 792292 975233 1125116 641828 951978 540453 771456
$$ packed form
14779E71516K60849n2198m0884j3391l19494A98592L10360k7723Q9456l073O7541
14768F35153k94388J47415K02102M1918l8946N235k85938L49800k44511j72090
14758C45750J31047J49846j38891J16818O5973j2078j10763q67J59136l42327
14748C63644M71201J27408j66058J16566l60912O9869B87862L98542P805k12658
14738D81551m812K40514J75454j0248k58020K19255j51461j74248K30963q4683
14728F64265j0208J14075l906K35067k75373Q6525j35459L36583L3314l82154
14718F62729K35191r4517j26635j30183J00826J6577l412m9581L32808p3509j73654
14707F96640P6827J77621k71694J12898J82941J49883m83288L10150m11525K31003
$$ plain form
14697 771456 1004571 1177658 719125 1265231 827353 1124164 969857 815892 1117538 975696
14687 975696 826169 1318880 778292 974368 1323393 1424279 1135896 688898 987631 1028832
14677 1028832 1208605 1131935 858247 1009173 660537 1272864 1053125 1080088 1038790 999735
14667 999735 810407 1025999 945488 825230 1121665 1180149 889267 1355535 1215406 822005
14657 822005 1091777 1013836 1039350 1147564 953574 947235 1164395 1217370 982402 1099296
14647 1099296 1130380 1359830 1380636 1410217 1106140 1422249 1088987 1203243 1549869 1463296
14637 1463296 1320832 1375387 1491932 1162589 1203845 1158688 1311183 1124338 1479587 1337013
14627 1337013 1133509 1554022 1180753 1408214 1286778 1461325 1298461 1557069 1351003
$$ packed form
14697G71456K33115J73087m58533N46106m37878K96811j54307j53965L01646j41842
14687I75696j49527M92711n40588J96076L49025J00886k88383m46998K98733M1201
14677A028832J79773p6670k73688J50926l48636O12327k19739K6963m1298l9055
14667I99735j89328K15592q0511j20258K96435N8484k90882M66268j40129l93401
14657H22005K69772p7941K5514J08214j93990o339K17160N2975k34968J16894
14647A099296L1084K29450K0806K9581l04077L16109l33262J14256L46626q6573
14637A463296j42464N4555J16545l29343M1256m5157J52495j86845L55249j42574
14627A337013k03504M20513l73269K27461j21436J74547j62864K58608k06066
$$ plain form
14618 1351003 1537787 1682442 1751428 1794273 1435893 1487012 1637996 1430426 1649304 1590302
14608 1590302 1452176 1489827 1561769 1527606 2006326 1619528 1351868 1673871 1586995 1569491
14598 1569491 1510427 1409159 1369474 1695946 1943738 1477259 2095888 1591023 1933504 1817531
14588 1817531 2059458 1743232 2168001 1924333 2034327 2021043 1843502 1879850 2116329 1595191
14578 1595191 1955259 1957389 2011390 2070855 1649500 2147471 1994114 2172699 2054737 2497104
14568 2497104 2433115 2276221 2242420 2349149 2367810 2506006 2534998 2418354 2705621 2625662
14558 2625662 3087314 2604807 3107311 3021003 3515499 4028796 3785733 4450130 5495630
14549 5495630 6851900 10766300 21518174 40687995 42419025 22805613 12086775 7126840
$$ packed form
14618A351003J86784J44655O8986M2845l58380N1119J50984k07570K18878n9002
14608A590302j38126L7651P1942l4163M78720l86798k67660L22003q6876j7504
14598A569491n9064j01268l9685L26472K47792m66479O18629n04865L42481j15973
14588A817531K41927l16226M24769k43668J09994j3284j77541L6348K36479n21138
14578A595191L60068K130N4001N9465m21355M97971j53357J78585j17962M42367
14568B497104o3989j56894l3801J06729J8661J38196K8992j16644K87267p9959
14558B625662M61652m82507N02504q6308M94496N13297k43063O64397J045500
14549E495630J356270L914400J0751874J9169821J731030j9613412j0718838m959935
$$ plain form
14541 7126840 4093424 2774039 2611676 2380930 2105579 2123396 1942408 1887564 1926147 2185221
14531 2185221 2089931 2132992 2330936 2266088 2326452 2287494 2398679 2509865 2648777 2285123
14521 2285123 2387732 2670935 2451551 2698995 2724315 2556657 2570115 2673624 2680608 2740690
14511 2740690 2710654 2769546 2594085 2973592 2923530 2847186 3249013 2885625 3196431 2947900
14501 2947900 2821461 3029880 3243360 2995081 3233313 3162284 3122888 3159724 3282100 3437803
14491 3437803 3371156 3205317 3396367 3273661 3382558 3831757 3874306 3509219 3374800 3920103
14481 3920103 3840018 3926849 4132176 4098008 3837576 3998333 4199444 4206538 4096511 4171877
14471 4171877 4562247 4275679 4262892 4526533 4562444 4526916 4602992 4762664 4578042 4608886
$$ packed form
14541G126840l033416j319385j62363k30746k75351J7817j80988n4844L8583K59074
14531B185221r5290M3061J97944o4848O0364l8958J11185J11186J38912l63654
14521B285123J02609K83203k19384K47444K5320j67658J3458J03509O984O0082
14511B740690l0036N8892j75461L79507n0062p6344M01827l63388L10806k48531
14501B947900j26439K08419K13480k48279K38232p1029l9396L6836J22376J55703
14491C437803o6647j65839J91050j22706J08897M49199M2549l65087j34419N45303
14481C920103q0085Q6831K05327l4168k60432J60757K01111P094j10027P5366
14471D171877L90370k86568j2787K63641L5911l5528P6076J59672j84622L0844
$$ plain form
14461 4608886 4857493 4839584 5041982 4856189 5129578 5142049 5124148 4948098 4904485 5208834
14451 5208834 5253979 5488533 5544542 5328167 5731128 5991604 5427114 5860547 5707343 5748348
14441 5748348 6311319 6324443 6168889 6341377 5990363 6313778 6813878 7113414 6878509 6546744
14431 6546744 7036236 6948288 7124242 7165518 7399076 7225662 7245205 7614183 7680325 7619974
14421 7619974 7689185 8115916 7866612 8071609 8273458 8427242 8494764 8653066 8641938 8832647
14411 8832647 8663358 8946556 9041076 9425404 9406912 9515669 9926095 9976401 9785045 9712717
14401 9712717 10308175 10549272 10547757 10554785 10943706 10978881 11169376 11973016 11572574 12117003
14391 12117003 12028440 12323717 12961776 12303234 13124493 13549055 13315574 13501632 13831818
$$ packed form
14461D608886K48607j7909K02398j85793K73389J2471j7901j76050m3613L04349
14451E208834M5145K34554N6009k16375M02961K60476n64490M33433j53204M1005
14441E748348N62971J3124j55554J72488l51014L23415N00100K99536k34905l31765
14431F546744M89492q7948J75954M1276K33558j73414J9543L68978O6142o0351
14421G619974O9211M26731k49304K04997K01849J53784O7522J58302j1128J90709
14411H832647j69289K83198R4520L84328j8492J08757M10426N0306j91356p2328
14401I712717N95458K41097j515P028L88921L5175J90495Q03640m00442N44429
14391A2117003q8563K95277O38059o58542Q21259M24562k33481J86058L30186
$$ plain form
14382 13831818 13895173 14393937 14406350 14567815 15286216 15398317 15843200 16085068 16172321 16805352
14372 16805352 16832245 17321693 17528171 17980413 18295195 18802051 19072495 19546424 20102145
14363 20102145 20230775 20767865 20971339 21837312 22350942 22869075 23184433 23483424 24268933
14354 24268933 24663796 25526201 26205277 26736756 27327400 28216029 28874503 29726641 30196924
14345 30196924 30788743 31771749 32775127 33391819 34299234 35139306 36257928 37217452 38347103
14336 38347103 39247082 40419717 41792249 42859746 44553972 45711092 46829980 48322699
14328 48322699 49656273 51726779 53427070 55090651 56698002 58830664 60844600 62933512
14320 62933512 65155855 67579345 69728183 72553078 75249493 77962609 81107195 84188040
$$ packed form
14382A3831818O3355M98764J2413J61465P18401J12101M44883K41868Q7253O33031
14372A6805352K6893M89448K06478M52242L14782N06856K70444M73929N55721
14363B0102145J28630N37090K03474Q65973N13630N18133L15358K98991P85509
14354B4268933L94863Q62405O79076N31479N90644Q88629O58474Q52138M70283
14345C0196924N91819R83006J003378O16692R07415Q40072J118622R59524J129651
14336C8347103Q99979J172635J372532J067497J694226J157120J118888J492719
14328D8322699J333574K070506J700291J663581J607351K132662K013936K088912
14320F2933512K222343K423490K148838K824895K696415K713116L144586L080845
$$ plain form
14312 84188040 87777994 91281016 94922522 98813914 103190431 107529137 112811539 117473440
14304 117473440 122910113 128384407 134699644 140995034 147875908 154902027 162835935 171048632
14296 171048632 179624557 188938846 198616346 208994280 220012959 231379252 243242991
14289 243242991 255897652 269670044 282926545 297391765 312268817 327396585 343052768
14282 343052768 358950183 374608709 390122035 405779897 420507217 434610575 447308022
14275 447308022 458866987 468424414 475185870 477487194 475803449 473328679 469970461 467859690
14267 467859690 461491489 454268491 446388876 436487588 425806369 413441050 399151163
14260 399151163 383476848 367116328 350519691 334061861 317848274 301894690 287263674
$$ packed form
14312H4188040L589954L503022L641506L891392M376517M338706N282402M661901
14304A17473440N436673N474294O315237O295390O880874P026119P933908Q212697
14296A71048632Q575925R314289R677500J0377934J1018679J1366293J1863739
14289B43242991J2654661J3772392J3256501J4465220J4877052J5127768J5656183
14282C43052768J5897415J5658526J5513326J5657862J4727320J4103358J2697447
14275D47308022J1558965R557427O761456K301324j683745k474770l358218k110771
14267D67859690o368201p222998p879615r901288j0681219j2365319j4289887
14260C99151163j5674315j6360520j6596637j6457830j6213587j5953584j4631016
$$ plain form
14253 287263674 273613354 259695418 246293898 233907424 221924695 210676444 200404327
14246 200404327 190018314 181211460 172226608 164024315 156397989 148725024 141780905 135744090
14238 135744090 129644371 123955531 118411700 113254595 108214807 103673700 99658447 95804360
14230 95804360 92016404 88060471 84595811 81473688 78297527 75469837 72780914 69879806
14222 69879806 67428262 65236208 63080795 60810051 58718100 56690345 54977903 53120507
14214 53120507 51627941 50470799 48821614 46894137 45560867 43835885 42910615 42311445
14206 42311445 40612574 39433933 38224735 37358454 36344154 35394339 34781743 33943013 33011641
14197 33011641 31865136 30757683 30505088 29421969 28855397 27991389 27403753 26549290 26168570
$$ packed form
14253B87263674j3650320j3917936j3401520j2386474j1982729j1248251j0272117
14246B00404327j0386013q806854q984852q202293p626326p672965o944119o036815
14238A35744090o099719n688840n543831n157105n039788m541107m015253l854087
14230I5804360l787956l955933l464660l122123l176161k827690k688923k901108
14222F9879806k451544k192054k155413k270744k091951k027755j712442j857396
14214E3120507j492566j157142j649185j927477j333270j724982r25270n99170
14206D2311445j698871j178641j209198q66281j014300r49815o12596q38730r31372
14197C3011641j146505j107453k52595j083119n66572q64008n87636q54463l80720
$$ plain form
14188 26168570 25276471 25028146 24300308 23783343 23170502 22547834 22198547 21828114 21417546
14179 21417546 20797506 20330730 20122744 19634912 19146451 18815976 18475119 18344876 17889425
14170 17889425 17469196 16943560 16759321 16441970 16223404 15880231 15549898 15241040 15023675
14161 15023675 14724385 14495023 14084826 14012295 13505460 13739465 13131748 13264572 12912165
14152 12912165 12622789 12270943 12071537 12252480 12164628 11253613 11444583 10946905 10976848 10968222
14142 10968222 10737908 10515870 10513577 10324668 9952430 9904238 9864209 9923795 9526836 9416928
14132 9416928 9465388 9086836 9044129 9059811 8539434 8237437 8885463 8085361 8520493 8392167
14122 8392167 8104936 7826195 7949409 7844881 7582177 7756370 7388582 7236897 7088188
$$ packed form
14188B6168570q92099k48325p27838n16965o12841o22668l49287l70433m10568
14179B1417546o20040m66776k07986m87832m88461l30475l40857j30243m55451
14170A7889425m20229n25636j84239l17351k18566l43173l30333l08858k17365
14161A5023675k99290k29362m10197p2531n06835K34005o07717J32824l52407
14152A2912165k89376l51846j99406J80943q7852r11015J90970m97678K9943q626
14142A0968222k30314k22038k293j88909l72238m8192m0029N9586l96959j09908
14132I416928M8460l78552m2707J5682n20377l01997O48026q00102M35132j28326
14122H392167k87231k78741J23214j04528k62704J74193l67788j51685j48709
$$ plain form
14113 7088188 7260862 7006510 7051450 7027761 6509520 6599913 6762228 6120182 5894976 6465281
14103 6465281 6326820 6255407 5971117 5744799 5960344 5991103 6045106 5863020 5759421 5274246
14093 5274246 5279517 5476684 5726046 5348533 5293447 5526631 5053503 5371846 4830545 4938869
14083 4938869 5034345 5012106 4835069 4900811 4851759 4632468 4775389 4639214 4663397 4560718
14073 4560718 4633310 4235687 4128344 4359744 4330430 4152747 4684665 4219252 4094573 4211766
14063 4211766 3977860 3979475 4190136 4227352 4108062 4302329 4192806 4135910 4187102 3451953
14053 3451953 3916778 3928996 3746717 3679068 4014016 3747980 3401453 3402407 3428468 3206250
14043 3206250 3256317 3317081 2939448 3538328 3221726 3038230 3099841 3375874 3190613 2940073
$$ packed form
14113G088188J72674k54352M4940k3689n18241R0393J62315o42046k25206N70305
14103F465281j38461p1413k84290k26318K15545L0759N4003j82086j03599m85175
14093E274246N271J97167K49362l77513n5086K33184m73128L18343n41301J08324
14083D938869R5476k2239j77037O5742m9052k19291J42921j36175K4183j02679
14073D560718P2592l97623j07343K31400k9314j77683N31918m65413j24679J17193
14063D211766k33906J615K10661L7216j19290J94267j09523n6896N1192p35149
14053C451953M64825J2218j82279o7649L34948k66036l46527R54K6061k22218
14043C206250N0067O0764l77633N98880l16602j83496O1611K76033j85261k50540
$$ plain form
14033 2940073 3165198 3182866 2990561 3073599 2792085 3070279 3002538 3165371 2898352 2537720
14023 2537720 2641787 2416469 2498475 2758532 2396215 2016771 2484166 2503257 2612998 2628718
14013 2628718 2714267 2437719 2674615 2525291 2441183 2269561 2426888 2235711 2384440 2624640
14003 2624640 2330060 2163267 2151781 2388741 2017786 1976577 2154970 2171744 2310113 1748701
13993 1748701 1973218 2060974 2136825 2410934 2916531 5538430 13913490 33388983 43736500
13984 43736500 27912248 14548238 9133457 6578915 5605458 4400917 4164627 3483011
13976 3483011 3188401 3028015 2584250 2808373 2823563 2762365 2164546 2380776 2403352 2416170
13966 2416170 2328654 2355669 2417899 2386278 2461467 2248396 1892720 2307996 2080509 1956475
$$ packed form
14033B940073K25125J7668j92305Q3038k81514K78194o7741J62833k67019l60632
14023B537720J04067k25318Q2006K60057l62317l79444M67395J9091J09741J5720
14013B628718Q5549k76548K36896j49324q4108j71622J57327j91177J48729K40200
14003B624640k94580j66793j1486K36960l70955m1209J78393J6774J38369n61412
13993A748701K24517Q7756P5851K74109N05597K621899Q375060J9475493J0347517
13984D3736500j5824252j3364010n414781k554542r73457j204541k36290o81616
13976C483011k94610j60386m43765K24123J5190o1198n97819K16230K2576J2818
13966B416170q7516K7015O2230l1621P5189k13071l55676M15276k27487j24034
$$ plain form
13956 1956475 1648985 2025432 2252178 1894229 2025801 1961701 2030375 2024158 1840403 1925917
13946 1925917 1519710 2047657 2152094 1812401 1834290 1586920 1808472 1823636 2052355 1605010
13936 1605010 1712660 1742429 1454514 1801455 1516559 1525212 1754507 1898857 1537130 1408598
13926 1408598 1494954 1190540 1335070 1550388 1682519 1424288 1677366 1413928 1369103 1667432
13916 1667432 1447683 1183756 1490240 1497379 1454420 1394235 1385582 1386011 1173647 1741346 1202987
13905 1202987 1415592 1263258 1236385 1133405 1175126 1221262 1201627 1814344 1399997 1390946
13895 1390946 1162190 1336965 1016355 1404853 1067620 1323409 1406508 1169431 1217807 1210760
13885 1210760 1013926 1402517 1163540 1135028 1287348 827951 1120596 1180455 1211622 1368089
$$ packed form
13956A956475l07490L76447K26746l57949J31572o4100O8674o217j83755Q5514
13946A925917m06207N27947J04437l39693K1889k47370K21552J5164K28719m47345
13936A605010J07650K9769k87915L46941k84896Q653K29295J44350l61727j28532
13926A408598Q6356l04414J44530K15318J32131k58231K53078k63438m4825K98329
13916A667432k19749k63927L06484P139m2959o0185q653M29k12364N67699n38359
13905A202987K12605j52334k6873j02980M1721M6136j9635O12717m14347r051
13895A390946k28756J74775l20610L88498l37233K55789Q3099k37077M8376p047
13885A210760j96834L88591k38977k8512J52320m59397K92645N9859L1167J56467
$$ plain form
13875 1368089 1331720 1149963 934662 1478396 1184378 891145 1038042 1546877 1106807 1121328
13865 1121328 1052040 1094980 1367799 1011154 1069252 1336240 936702 1002368 1078558 1266975
13855 1266975 1080579 1122920 1286010 1007010 1253823 974812 920934 930125 1291534 679336
13845 679336 803223 1060769 1293751 726105 1006082 1454057 1088594 748374 1176945 1047035
13835 1047035 625646 1138382 1005646 1327334 896876 743917 1057011 1030715 730680 1094153
13825 1094153 766726 1106465 946416 668251 1014883 734539 238482 742066 1178477
13816 1178477 760964 1012308 770832 826800 903438 979535 468969 497103 1052275 777808
13806 777808 769630 785735 899255 552743 799756 869512 753938 853273 864818 870974 769258
$$ packed form
13875A368089l6369j81757k15301N43734k94018k93233J46897N08835m40070J4521
13865A121328o9288M2940K72819l56645N8098K66988l99538O5666P6190J88417
13855A266975j86396M2341J63090k79000K46813k79011n3878R191L61409o12198
13845F79336J23887K57546K32982n67646K79977M47975l65463l40220M28571j29910
13835A047035m21389N12736j32736L21688m30458j52959L13094k6296l00035L63473
13825A094153l27427L39739j60049k78165L46632k80344B38482N03584M36411
13816A178477m17513K51344k41476N5968P6638P6097D68969K8134N55172k74467
13806G77808q178J6105J13520l46512K47013O9756j15574R9335J1545O156j01716
$$ plain form
13795 769258 859451 719778 992585 670513 545881 716107 954456 699484 708554 918184
13785 918184 479639 815306 523965 665560 832508 641582 728851 1046814 736652 532741
13775 532741 523054 872178 908864 1004123 814293 662550 578426 516204 441331 898718 468080
13764 468080 929465 537303 1094020 750781 707032 598058 850956 740248 957606 714778
13754 714778 548836 460759 931817 760032 728733 901041 562231 284975 617180 376299
13744 376299 872289 767531 714875 545640 975247 407728 684712 538598 284258 780433
13734 780433 375139 500023 931918 649850 416734 782225 564595 628812 716696 799670
13724 799670 352250 609412 510174 689943 560045 793221 348003 653566 521947 659747
$$ packed form
13795G69258R0193j39673K72807l22072j24632J70226K38349k54972R070K09630
13785I18184m38545L35667k91341J41595J66948j90926Q7269L17963l10162k03911
13775E32741r687L49124L6686R5259j89830j51743q4124o2222p4873M57387m30638
13764D68080M61385l92162N56717l43239m3749j08974K52898j10708K17358k42828
13754G14778j65942q8077M71058j71785l1299J72308l38810k77256L32205k40881
13744C76299M95990j04758n2656j69235M29607D07728K76984j46114k54340M96175
13734G80433C75139J24884M31895k82068k33116L65491k17630O4217Q7884Q2974
13724G99670C52250K57162r9238J79769j29898K33176C48003L05563j31619J37800
$$ plain form
13714 659747 784182 536008 713507 722373 341563 600388 664899 614080 597458 479007
13704 479007 522122 694937 424208 1056276 794524 267906 586469 246352 647940 593717
13694 593717 531665 455022 637030 468721 478522 258759 189260 538859 396773 348203 467373
13683 467373 887294 588956 191973 504906 892517 231203 487956 361630 448853 748288
13673 748288 642397 453604 373099 537035 661269 274369 653898 508454 704849 624193
13663 624193 108823 546501 327583 531466 261438 341241 299068 401025 237881 605499
13653 605499 528196 155306 570248 381512 745670 887810 351949 630858 327265 197770
13643 197770 472635 392130 81809 425037 536234 346890 189867 777296 740806 367203
$$ packed form
13714F59747J24435k48174J77499Q866C41563K58825O4511n0819j6622j18451
13704D79007M3115J72815k70729O32068k61752B67906L18563B46352M01588n4223
13694E93717o2052p6643J82008j68309R801k19763o9499L49599j42086m8570J19170
13683D67373M19921k98338A91973L12933L87611B31203K56753j26326Q7223K99435
13673G48288j05891j88793q0505J63936J24234B74369L79529j45444J96395q0656
13663F24193A08823M37678k18918K03883B61438P9803m2173J01957j63144L67618
13653F05499p7303A55306M14942j88736L64158J42140C51949K78909l03593j29495
13643A97770K74865q0505H1809L43228J11197j89344j57023N87429l6490C67203
$$ plain form
13632 414366 290489 279148 460365 440311 571317 623453 235545 413775 185780 348318
13622 348318 601444 131169 511153 172193 254786 282143 403408 303146 475022 -114869
13611 423459 381807 589064 312685 413696 294213 479457 146760 331574 464468 615503
13601 615503 103874 169531 673774 395659 553891 189302 214837 522436 520337 437521
13591 437521 271366 617990 80239 367201 173885 136960 319792 377506 292749 376745
13581 376745 -3603 228464 106205 327758 367474 302473 442264 269967 173542 55467 402591
13570 402591 480187 647767 72840 251135 423222 214320 109557 228947 341633 246760
13560 246760 292906 259510 370749 294412 328984 259935 319370 218174 139672 -2644 189765
$$ packed form
13632D14366j23877j1341J81217k0054J31006N2136B35545J78230A85780J62538
13622C48318K53126A31169L79984A72193Q2593K7357J21265j00262J71876a14869
13611D23459m1652K07257k76379J01011j19483J85244A46760J84814J32894J51035
13601F15503A03874O5657N04243k78115J58232A89302K5535L07599k099q2816
13591D37521j66155L46624H0239K86962A73885l6925J82832N7714q4757Q3996
13581C76745c603B28464A06205K21553L9716o5001J39791j72297r6425E5467L47124
13570D02591P7596J67580G2840J78295J72087k08902j04763J19390J12686r4873
13560B46760M6146l3396J11239p6337L4572o9049N9435j01196p8502b644A89765
$$ plain form
13548 144298 386194 465998 177275 95543 322807 244708 666921 548273 420995 606529
13538 606529 188472 272456 168781 379328 -60810 444266 -111975 329826 501409 106312
13527 327148 619560 111663 210378 119430 40549 94319 621410 -16127 278579 107003
13516 120707 -75660 390772 716991 -60436 626159 278078 235155 32887 248640 262165
13506 262165 -42039 268805 105886 -237021 244705 57207 523668 -65787 262463 210764
13496 210764 440279 345935 284666 185447 297607 97238 238386 172464 281214 -32770 182582
13484 469161 415572 572227 50873 -123731 72578 198840 267906 206710 368945 354198 12327
13472 381436 -38194 167614 324780 123983 412556 -21844 283355 228601 164980 218408
$$ packed form
13548A44298K41896P9804A77275q1732K27264p8099M22213j18648j27278J85534
13538F06529A88472Q3984j03675K10547f0810D44266a11975C29826J71583A06312
13527C27148K92412A11663R8715r0948D0549N3770N27091a6127B78579A07003
13516A20707g5660C90772L26219f0436F26159B78078m2923C2887K15753J3525
13506B62165d2039B68805A05886b37021B44705E7207M66461f5787B62463n1699
13496B10764K29515r4344o1269r9219J12160I7238J41148o5922J08750c2770A82582
13484D69161n3589J56655E0873a23731G2578J26262O9066o1196J62235j4747A2327
13472C81436c8194A67614J57166A23983K88573b1844B83355n4754o3621N3428
$$ plain form
13462 218408 26665 411739 406073 442993 333850 496633 288253 279402 175763 225052 289602
13451 289602 211205 409480 183826 488072 295457 476895 191330 20470 149435 206583
13441 206583 210136 -27121 395274 -107285 534610 240780 316681 298729 271974 116565 160300
13430 160300 -177961 359657 29750 260547 247102 210984 214156 23377 124733 191651 538637
13419 538637 83116 557296 359116 130455 36379 181768 134722 97263 54238 -192290
13408 200299 397871 452195 218972 91193 260767 493352 189483 597435 441825 186899
13397 32165 194210 33939 7736 231657 39648 227692 272236 158025 219599 111723 221548
13386 221548 144309 381919 -173643 338158 -12084 -101440 75296 569277 243590 246012 305576
$$ packed form
13462B18408B6665L85074n666L6920j09143J62783k08380q851j03639M9289O4550
13451B89602p8397J98275A83826L04246j92615J81438A91330B0470J28965N7148
13441B06583L553b7121C95274a07285E34610B40780P5901j7952k6755A16565M3735
13430A60300a77961C59657B9750K30797j3445l6118L172B3377J01356O6918L46986
13419E38637H3116M74180j98180A30455C6379J45389m7046l7459m3025a92290
13408B00299J97572N4324B18972I1193J69574K32585A89483M07952j55610A86899
13397C2165J62045C3939G736K23921C9648J88044M4544j14211O1574j07876J09825
13386B21548p7239K37610a73643C38158a2084q9356G5296M93981B43590K422N9564
$$ plain form
13375 305576 116190 75194 199705 443417 404250 -17881 278338 100080 392509 102971
13364 -209785 168828 24904 -125573 349879 181754 302946 39502 118958 359364 222910
13354 222910 138047 239690 168079 208633 151121 121217 187909 55207 94333 365012 225189
13343 225189 67932 126280 58531 134830 305985 349464 474526 125015 497391 -1051 379800
13331 490401 252060 146845 250042 132338 464142 559384 357374 412626 -103315 322838
13320 417632 619594 284258 -34151 512340 195007 -6363 549677 440925 205431 172289
13310 172289 633694 148526 203087 279844 208280 190894 72999 141995 534582 232215 276472
13299 276472 55413 -79662 59543 -124318 397337 -107523 197396 315771 -360118 146905
$$ packed form
13375C05576A16190m0996J24511K43712l9167a7881B78338A00080K92429A02971
13364b09785A68828B4904a25573C49879j68125J21192C9502P9456K40406j36454
13354B22910q4863J01643p1611M0554n7512k9904O6692E5207L9126K70679j39823
13343B25189F7932N8348E8531P6299J71155M3479J25062A25015L72376a051C79800
13331D90401k38341j05215J03197j17704L31804R5242k02010N5252a03315C22838
13320D17632K01962B84258c4151E12340A95007f363E49677j08752B05431l3142
13310A72289M61405A48526N4561P6757p1564j7386G2999O8996L92587B32215M4257
13299B76472E5413g9662E9543a24318C97337a07523A97396J18375c60118A46905
$$ plain form
13288 365102 -274771 78262 302080 223958 -63798 99757 -37511 206590 156532 -54818 31697
13276 267198 -19077 257066 -183745 77205 307167 209028 462394 95096 249066 58665
13265 108106 361213 -80328 68416 262435 255186 -148605 270436 130136 182241 393500
13255 393500 111738 425666 421268 298646 365978 -132060 225000 316779 126776 -4995 127342
13243 -67938 81050 265740 -120412 -90280 -1330 624965 492170 198284 -75182 334091 21352
13231 159714 -91486 -38999 -11151 122034 -296486 19569 307 30981 -68587 30223 -25238
13219 -269620 236816 -14469 41715 -91814 -152791 182941 -105493 -83105 -59843 -133762 632689
13207 270023 -279510 -22759 160298 -75870 -97099 160610 -11884 -136595 -25711 -78129 13098
$$ packed form
13288C65102b74771G8262K23818p8122f3798I9757c7511B06590n0058e4818C1697
13276B67198a9077B57066a83745G7205K29962r8139K53366I5096J53970E8665
13265A08106K53107h0328F8416J94019p249a48605B70436A30136N2105K11259
13255C93500A11738L13928m398j22622O7332a32060B25000R1779A26776d995A27342
13243f7938H1050J84690a20412L0132a330F24965j32795A98284g5182C34091B1352
13231A59714i1486c8999a1151A22034b96486A9569C07L0674f8587C0223b5238
13219b69620B36816a4469D1715i1814o0977A82941a05493K2388K3262p3919F32689
13207B70023b79510b2759A60298g5870k1229A60610a1884j24711b5711n2418A3098
$$ plain form
13195 124309 -141137 -14473 -194171 -66062 108117 151180 377699 113616 477058 134740
13184 -45155 240327 -115589 95722 199485 8915 -22104 206190 38612 26339 -120385 58441
13172 188711 324415 -216745 27894 -142960 193949 169294 114643 249730 -47669 391442
13161 -250704 574099 -144492 19032 184431 162242 155864 196144 330535 214245 224557 212277
13150 212277 300567 -276347 74201 -31036 44206 -179497 -11112 -230210 177981 153269 -40478
13138 65720 161227 -82336 -73413 -106664 189024 13656 258335 -47360 421609 -3982 226663
13126 133812 -79686 -279708 157195 15225 246406 -13484 150498 231613 -96794 111324
13115 30790 -251795 317633 123327 68291 331325 185470 396402 -105595 -74005 523251
$$ packed form
13195A24309a41137a4473j79698f6062A08117M3063K26519A13616L63442A34740
13184d5155B40327a15589I5722J03763H915b2104B06190C8612j2273a20385E8441
13172A88711J35704b16745B7894a42960A93949k4655n4651J35087d7669C91442
13161b50704E74099a44492A9032J65399k2189o378M0280J34391j16290J0312j2280
13150B12277Q8290b76347G4201c1036D4206a79497a1112k19098A77981k4712d0478
13138F5720R5507h2336Q923l3251A89024A3656K44679d7360D21609c982B26663
13126A33812g9686k00022A57195A5225K31181a3484A50498Q1115i6794A11324
13115C0790b51795C17633A23327n5036K63034j45855K10932a05595L1590E23251
$$ plain form
13104 -65485 -86417 -242349 17819 133243 95921 143567 51739 73406 46126 242075 92634
13092 -220217 117569 103373 -161079 -339481 -54223 369397 134679 -36235 -177738 -32419
13081 155658 -569175 379400 155307 222607 7143 -2693 202888 164766 136136 97279 -71729
13069 302119 167237 349378 -191916 502527 34083 -19783 8046 50155 87086 -117725 237376
13057 285162 217524 29310 204741 153981 127642 304702 269730 111240 333561 -66490 105257
13045 15282 288158 5141 218462 -21592 -156375 24214 60232 58686 -232705 224319 -46030
13033 431358 -140547 319045 -4022 251882 -37022 -122245 -260097 456490 21099 -86113 99960
13021 222216 -22844 152456 376296 36940 428120 42844 243024 76102 -6695 -180157 87859
$$ packed form
13104f5485k0932j55932A7819J15424l7322M7646E1739K1667k7280J95949I2634
13092b20217A17569j4196a61079j78402e4223C69397A34679c6235j41503c2419
13081A55658e69175C79400A55307O7300G143b693B02888l8122k8630l8857g1729
13069C02119j34882J82141a91916E02527C4083a9783H046M2109L6931a17725B37376
13057B85162o7638B9310J75431n0760k6339J77060l4972A11240K22321f6490A05257
13045A5282K72876E141K13321b1592j34783B4214L6018j546b32705B24319d6030
13033D31358a40547C19045d022B51882c7022q5223j37852D56490B1099h6113I9960
13021B22216b2844A52456K23840C6940L91180D2844K00180G6102f695j73462H7859
$$ plain form
13009 4294 -55904 123250 187551 378780 430051 -168615 111761 -50027 235141 -31070 33540
12997 -36047 279764 280171 287821 4059 -180615 -9093 237762 6370 46773 154872 -155205 464685
12984 236780 -123424 114680 203850 134101 283164 24264 -175275 387008 335437 133202
12973 29714 174134 18412 266233 167830 -128438 -33204 -4272 -54271 -114038 -97867 -155129
12962 -155129 -24799 -18994 -68868 -13417 13467 -18702 -265808 -912 -233510 -273432 46832 256841
12950 256841 -5028 92475 -78551 122687 13526 186641 -113907 -95023 158530 -101506 -15616
12938 -58335 194278 -108357 127344 -32119 251269 9035 119143 -112462 21102 125391
12928 125391 -103108 -92190 -19210 -225246 321005 190400 44751 178516 165898 194703
$$ packed form
13009D294e5904A23250O4301J91229N1271a68615A11761e0027B35141c1070C3540
12997c6047B79764M07P650D059a80615i093B37762F370M0403J08099a55205D64685
12984B36780a23424A14680Q9170o9749J49063B4264a75275C87008n1571A33202
12973B9714J44420A8412K47821r8403a28438c3204d272m9999n9767J6171n7262
12962a55129b4799N805m9874a3417A3467a8702k47106i12k32598l9922D6832K10009
12950B56841e028I2475g8551A22687A3526J73115a13907J8884A58530a01506a5616
12938e8335A94278a08357A27344c2119B51269I035J10108a12462B1102J04289
12928A25391a03108J0918a9210k06036C21005j30605D4751J33765j2618K8805
$$ plain form
12918 194703 -272156 277472 83158 -122034 30489 5308 -121305 193375 172122 221296 96109
12906 -84334 107395 243355 75105 201079 -9633 35212 210824 26305 -19466 -380567 374939
12894 -174555 -268990 -5176 40350 146092 -15993 -219742 115449 -26293 121178 212959 -56986
12882 -100894 80804 -161737 -56032 146556 -382369 92929 -37300 -76912 -66088 -10215 -40409
12871 -40409 117188 174825 -13585 60826 220927 109941 9478 470149 -207317 198824 198873
12860 198873 -91882 -263557 -14521 -36077 143936 99160 -91634 246087 12876 472264 110330
12848 -36479 87418 -200142 1662 107726 69936 -385235 169722 -176752 -201766 425394 -29512
12836 131545 326257 -4658 -55610 24222 15974 167646 37095 -54381 -260699 535597 138371
$$ packed form
12918A94703b72156B77472H3158a22034C0489E308a21305A93375k1253M9174I6109
12906h4334A07395J35960G5105J25974i633C5212J75612B6305a9466l61101C74939
12894a74555r4435e176D0350J05742a5993k03749A15449b6293A21178R1781e6986
12882a00894H0804a61737e6032A46556c82369I2929c7300l9612J0824a0215l0194
12871d0409A17188N7637a3585F0826J60101A09941I478M60671b07317A98824M9
12860A98873i1882j71675a4521k1556A43936m4776i1634B46087A2876M59388A10330
12848c6479H7418b00142A662J06064l7790c85235A69722a76752k5014D25394b9512
12836A31545J94712d658n0952B4222q248J51672C7095e4381k06318E35597A38371
$$ plain form
12824 194451 -122764 102533 216973 -197366 -123355 65298 46366 567312 150580 -9673
12813 10295 -278478 76073 -187039 -34790 180604 -278611 45869 -8689 259439 148566 -78496
12801 -16305 -129440 -171490 201807 456 74005 260620 248439 -466984 -126112 318449 -373342
12789 -259024 -486824 -110128 16120 -89266 -73245 -344551 -241829 -204980 -56060 -152702 -208366
12778 -208366 109257 168310 73215 198512 82969 -25252 151684 262791 88880 61986 176524
12767 176524 171992 316108 -141698 27359 189326 -196173 225252 206758 234891 -184731
12756 -75492 63519 -137638 161042 30375 -161571 -149689 -175251 -59815 -15076 156551 448287
12745 448287 -56364 -57962 -81342 163770 -98076 80534 110205 26325 166555 157695 327042
$$ packed form
12824A94451a22764A02533J14440a97366P4011F5298j8932N20946A50580i673
12813A0295b78478G6073a87039c4790A80604b78611D5869h689B59439j10873g8496
12801a6305j13135m2050B01807D56P3549J86615j2181d66984a26112C18449c73342
12789b59024k27800a10128A6120h9266J6021k71306J02722L6849e6060r6642n5664
12778b08366A09257N9053G3215J25297H2969b5252A51684J11107H8880k6894J14538
12767A76524m532J44116a41698B7359J61967a96173B25252j8494K8133a84731
12756g5492F3519a37638A61042C0375a61571J1882k5562e9815a5076A56551K91736
12745D48287e6364j598k3380A63770i8076H0534K9671B6325J40230q860J69347
$$ plain form
12734 327042 229841 -190790 423158 -161011 -4114 203481 91265 -116777 -98755 428933
12723 126006 -71549 155204 245290 145667 -261106 -170268 -148717 77815 -310455 -219595 -77749
12711 -60424 65388 188051 -82442 346908 277311 215736 459917 265842 206817 485542 221540
12699 347081 225656 30897 27691 130059 63842 121592 -64102 159913 -326751 118350 -18247
12687 304579 176995 84245 184128 6399 -17149 -110342 76913 -118899 277202 164073 246754
12676 246754 94804 317385 23628 -257077 84938 112306 21723 -44210 41466 31980 -29237
12664 55771 -284805 43933 -66430 98889 99917 -824 144624 123681 -176462 -133112 189100
12652 -130738 194364 460039 393881 221563 -117751 104513 -20563 61529 -109836 34625
$$ packed form
12734C27042r7201a90790D23158a61011d114B03481I1265a16777J8022D28933
12723A26006g1549A55204R0086r9623b61106R0838K1551G7815c10455R0860g7749
12711f0424F5388J22663h2442C46908o9597o1575K44181j94075n9025K78725B21540
12699C47081j21425C0897l206J02368F3842N7750f4102A59913c26751A18350a8247
12687C04579j27584H4245R9883F399a7149r3193G6913a18899B77202j13129Q2681
12676B46754I4804K22581B3628b57077H4938K7368B1723d4210D1466r486b9237
12664E5771b84805D3933f6430I8889J028h24A44624k0943a76462M3350A89100
12652a30738A94364K65675o6158j72318a17751A04513b0563F1529a09836C4625
$$ plain form
12641 57088 -47327 93116 122568 309022 181989 -97860 221553 68819 151543 -24170 -221703
12630 -221703 84876 -148640 -260569 252513 191717 -164621 56603 102497 186340 253623 285721
12619 285721 486752 -170137 -42630 64270 -378932 289486 196229 99217 195900 164362 -28969
12607 -179133 66388 -300030 264549 180341 124756 -115598 5210 105726 28840 214481 238885
12596 238885 233521 -159036 154485 291537 -153704 28072 389126 -230934 -121263 232993
12585 -276475 -96744 -143112 108420 210625 -47490 -354966 -104129 109487 130204 112741
12575 112741 -170684 281132 181195 210091 67603 87589 242861 90423 -242196 -234523 -201061
12564 -201061 146245 64148 136469 335177 -37071 -198745 -88636 -174195 189978 -83153 226717
$$ packed form
12641E7088d7327I3116K9452J86454j27033i7860B21553F8819Q2724b4170j97533
12630b21703H4876a48640j11929B52513o0796a64621E6603M5894Q3843O7283L2098
12619B85721K01031a70137d2630F4270c78932B89486r3257r7012R6683l1538b8969
12607a79133F6388c00030B64549q4208n5585a15598E210J00516B8840J85641K4404
12596B38885n364a59036A54485J37052a53704B8072L61054b30934J09671B32993
12585b76475i6744m6368A08420J02205d7490l07476a04129A09487K0717j7463
12575A12741a70684B81132r9937K8896F7603J9986J55272I0423b42196P673L3462
12564b01061A46245F4148P2321J98708c7071j61674h8636q5559A89978h3153B26717
$$ plain form
12552 -175911 186060 64864 30065 -349304 302313 174003 199882 -54722 -235183 -129194
12542 -129194 38806 17970 -30399 -186926 -170947 -112176 -194552 -142130 -171155 -163717 -190220
12531 -190220 48097 110029 -187889 119704 -156551 -24964 -75567 -45642 -45249 -186494 -98316
12520 -98316 -175357 10021 40667 77599 340796 165795 -18128 123818 -306455 -18722 70593
12508 358922 246410 -183091 277028 -88993 73262 -148912 367569 -107695 220243 96672
12497 590605 -25690 -65371 281583 -327855 371365 32922 -15035 228167 -274293 -186026
12487 -186026 251176 42741 75327 -271945 -84712 -298836 199459 128024 389366 60681
12476 -338442 -8494 44727 52569 -24456 175032 -49060 -203112 -78902 184109 -240441 -178845
$$ packed form
12552a75911A86060F4864C0065c49304C02313j28310K5879e4722j80461J05989
12542a29194C8806A7970c0399j56527J5979N8771q2376N2422k9025P438k6503
12531a90220D8097O1932a87889A19704a56551b4964n0603K9925L93j41245Q8178
12520i8316p7041A0021L0646L6932K63197A65795a8128A23818c06455a8722G0593
12508C58922j12512a83091B77028h8993G3262a48912C67569a07695B20243I6672
12497E90605b5690l9681B81583c27855C71365C2922a5035B28167b74293Q8267
12487a86026B51176D2741L2586b71945h4712k14124A99459p1435K61342F0681
12476c38442h494D4727P842b4456A75032d9060j54052g8902A84109b40441O1596
$$ plain form
12465 -178845 -63362 40303 281550 61627 116678 189093 76248 -22748 -131646 -113324 -136488
12454 -136488 62744 36475 149566 -104661 131718 41787 -263857 248413 47389 54454 71276
12443 71276 -220805 -70680 198716 -21359 -86642 -171959 -93353 -74914 214788 -225335 84899
12431 14346 113370 405050 -4990 -18168 4967 -92337 -84495 209138 -195710 248486 -45384
12419 -12652 97841 107571 29550 14175 105693 -134343 226063 -253031 87510 -46587 -392719
12408 -392719 130385 -96139 50232 131672 6325 -66118 131773 55371 307363 -179483 -211027
12397 -211027 38609 -63312 -77352 257461 -2663 95203 -49794 174218 -190637 38131 -143836
12385 -174472 117246 264257 211388 5979 41997 140403 -93461 -72812 -86975 25149 160861
$$ packed form
12465a78845f3362D0303K41247F1627N5051P2415G6248b2748j08898J8322k3164
12454a36488F2744k6269J13091a04661A31718D1787b63857B48413D7389P065J6822
12443G1276b20805g0680A98716b1359o5283q5317P8606J8439B14788b25335H4899
12431A4346R9024K91680d990j3178D967i2337P842B09138a95710B48486d5384
12419a2652I7841R730B9550A4175R1518a34343B26063b53031H7510d6587l46132
12408c92719A30385i6139E0232Q1440F325f6118A31773E5371K51992a79483l1544
12397b11027C8609f3312j4040B57461b663I5203d9794A74218a90637C8131a43836
12385a74472A17246J47011n2869E979L6018R8406i3461K0649j4163B5149J35712
$$ plain form
12374 160861 -163191 -214116 218079 -77806 183547 69362 47222 -270123 222830 -199514
12363 -89615 257775 51781 -36043 282005 -33757 -277487 91595 -82375 98882 -31867 225359
12351 152285 -56073 -19632 -299695 52035 303300 -64560 -106002 13575 -156445 299786 88892
12339 72770 38480 192355 22389 165360 -253558 -148164 310953 301957 -281889 92066 -80627
12327 225082 71181 152867 -219980 133125 93170 -73697 43714 -169045 -294592 113058
12316 16520 -245119 -92352 -135281 20758 229187 -234186 244078 -313229 -140203 239950
12305 -207177 -57868 -167245 -142291 -140405 10624 124019 116194 67421 -56469 387701 376849
12294 376849 161500 -83670 174647 -22855 65983 -76859 -972 -62605 -204615 -116523 -233004
$$ packed form
12374A60861a63191n0925B18079g7806A83547F9362k2140b70123B22830a99514
12363h9615B57775E1781c6043B82005c3757k43730I1595h2375I8882c1867B25359
12351A52285e6073a9632k80063E2035K51265f4560m1442A3575a56445B99786H8892
12339G2770l4290J53875B2389J42971b53558J05394C10953q996b81889I2066h0627
12327B25082G1181Q1686b19980A33125l9955g3697D3714a69045j25547A13058
12316A6520b45119i2352m2929B0758K08429b34186B44078c13229a40203B39950
12305b07177e7868j09377K4954J886A0624J13395p825m8773e6469C87701j0852
12294C76849A61500h3670A74647b2855F5983g6859i72o1633j42010Q8092j16481
$$ plain form
12283 -233004 -9725 75924 283025 225098 -1026 30145 141214 115852 135986 -271051 53533
12271 -138823 245282 -68177 -123391 -47815 180660 -33741 187148 64033 149752 -37759 -46798
12260 -46798 147310 266964 165756 -17047 -6414 -10078 40250 52583 128173 -151824 279981
12248 108668 -128260 296190 243207 -233106 -266765 33043 141630 23952 9971 165026 214040
12237 214040 311083 165765 123507 215104 327463 408347 159650 -58878 219636 112300
12227 112300 -47819 17270 -32521 -70285 -23311 382690 381751 110620 491844 -161640 345824
12215 134367 271464 99889 133213 518637 -91496 247422 131528 251941 150903 92718
12205 92718 323993 113107 288301 165528 121869 1401 274490 180818 249957 93593 130540
$$ packed form
12283b33004i725G5924K07101n7927a026C0145J11069k5362K0134b71051E3533
12271a38823B45282f8177n5214d7815A80660c3741A87148F4033Q5719c7759r039
12260d6798A47310J19654j01208a7047f414l664D0250J2333P5590a51824B79981
12248A08668a28260B96190n2983b33106l3659C3043J08587B3952I971J55055M9014
12237B14040R7043j45318m2258R1597J12359Q0884A59650e8878B19636j07336
12227A12300d7819A7270c2521l7764b3311C82690r39A10620L81224a61640C45824
12215A34367J37097I9889L3324L85424i1496B47422j15894J20413j01038n8185
12205I2718K31275A13107J75194j22773m3659A401K73089r3672O9139I3593L6947
$$ plain form
12194 130540 248716 175083 379263 99051 194016 145989 224092 213777 407103 258279 -12509
12182 -328753 298102 -46343 396881 215729 146284 56775 357845 140120 334458 -4423
12171 187971 191634 242062 8034 109022 52754 310008 54016 31881 151578 302066 303381
12160 303381 339472 79439 145218 -8170 66896 -145172 70983 -41354 -8525 58486 135288 -8788
12147 43405 -97877 205565 70809 352463 -58376 -13901 289527 200208 -97631 181054 -89451
12135 141008 59926 125222 75217 -3440 310212 213411 -121235 -162101 -262735 -44647 279047
12123 -6549 -132460 -134633 -223605 -240859 183852 357583 146399 -280030 129960 -76992 -154221
12112 -154221 100130 -109472 -198826 77774 83910 -66128 -125438 -97611 1045 105978 51891
$$ packed form
12194A30540J18176p3633K04180I9051R4965m8027P8103j0315J93326j48824a2509
12182c28753B98102d6343C96881j81152o9445E6775L01070A40120J94338d423
12171A87971L663N0428H034J00988E2754K57254E4016k2135J19697J50488J315
12160C03381L6091G9439O5779h170F6896a45172G0983d1354h525E8486P6802h788
12147D3405i7877B05565G0809K81654e8376a3901B89527q9319i7631A81054h9451
12135A41008E9926O5296n0005c440C10212r6801a21235m0866j00634d4647B79047
12123f549j25911k173q8972j7254A83852J73731A46399b80030A29960g6992p7229
12112a54221A00130a09472q9354G7774O136f6128n9310K7827A045J04933E1891
$$ plain form
12100 -93032 -170422 102193 -76672 -105151 16588 -89429 -79311 -229640 22686 -217344 24935
12088 151724 188934 -230176 131919 15482 3846 -103320 56857 145054 -25859 224587 -41089
12076 78529 155801 585929 1839934 1294837 452273 86389 -6192 -33841 98523 -104172 323885
12064 81150 68393 -58537 -70768 -51492 74754 227036 98315 218704 -17782 18818 195429
12053 195429 176433 142361 -45494 -165068 -166674 -253617 -159649 -242466 237453 170916 91475
12042 91475 315552 -17185 80315 -76951 31030 -127735 125603 -115088 129926 -47453 327278
12030 173057 -66107 170976 -117694 36358 109561 60265 103222 -115961 -182575 -11764 -2581
12018 24308 111514 -111734 -44572 24713 177610 -28939 65251 146781 -391335 -15 -222338
$$ packed form
12100i3032p7390A02193g6672k8479A6588h9429J0118j50329B2686b17344B4935
12088A51724L7210b30176A31919A5482C846a03320E6857Q8197b5859B24587d1089
12076G8529P7272M30128J254005n45097D52273H6389f192k7649I8523a04172C23885
12064H1150j2757e8537j2231J9276G4754J52282I8315J20389a7782A8818J76611
12053A95429j8996l4072d5494j19574j606q6943R3968q2817B37453o6537p9441
12042I1475K24077a7185H0315g6951C1030a27735A25603a15088A29926d7453C27278
12030A73057f6107A70976a17694C6358P3203m9296M2957a15961o6614a1764b581
12018B4308Q7206a11734d4572B4713J52897b8939F5251Q1530c91335a5k22323
$$ plain form
12007 -222338 -197772 -71900 -208361 -13428 42296 -111078 -530173 302472 159499 -140784
11996 -194038 -172163 7450 -70229 171180 140811 -172688 -194568 -126713 -234161 -222628 -208978
11985 -208978 60907 86252 236595 22052 170513 -61248 -167024 -128056 134820 -227437
11974 217075 172226 310122 1878 39448 213082 -200465 4958 271100 -134008 -107974 -328583
11963 -328583 144089 102282 -1234 116622 -15406 -78615 74501 -246851 -142395 111596 -171342
11951 -123002 -160026 134378 -232168 170923 -4713 147659 -57863 -92042 -265220 -133897
11941 -133897 20675 -232727 36409 -159070 -139274 94589 -49464 370653 155542 -224356
11930 -249733 80430 -113334 138254 -72203 -28314 41657 -40053 3137 -99430 -45967 -33075
$$ packed form
12007b22338K4566g1900j36461a3428D2296a11078m19095C02472j42973a40784
11996a94038K1875G450g0229A71180l0369a72688k1880O7855j07448J1533J3650
11985b08978F0907K5345J50343B2052J48461f1248j05776L8968A34820b27437
11974B17075m4849J37896A878L7570J73634b00465D958K66142a34008K6034k20609
11963c28583A44089m1807a234A16622a5406o3209G4501b46851J04456A11596a71342
11951a23002l7024A34378b32168A70923d713A47659e7863l4179j73178J31323
11941a33897B0675b32727C6409a59070J9796I4589d9464C70653A55542b24356
11930b49733H0430a13334A38254g2203b8314D1657d0053C137i9430d5967J2892
$$ plain form
11919 -33075 40738 -9091 12130 80294 41065 -37193 281952 119758 -181182 164805 -89651
11907 -221833 133202 -133026 -112623 -511436 253371 59149 -100311 -103697 93433 -96024 104939
11895 16605 -27132 -329482 -70224 24966 -51437 24392 101166 -61746 90378 -134231 -80544
11884 -80544 126338 -23498 63613 -42693 6736 -45050 -3810 -155731 20897 -282793 -68230
11872 -44634 282243 -28228 -101112 -2869 -161191 -57029 -167552 -139748 -36050 19087 -378250
11860 1475 248525 205097 95235 -82686 -468554 70803 -38290 -190765 243933 62568 76781
11849 76781 -66456 123872 -364707 -64309 -319149 9817 -144130 109012 81477 -237676 83656
11837 88821 -305443 5082 -208272 -202744 -29722 -153701 -33151 -468305 -66289 165161 -137559
$$ packed form
11919c3075D0738i091A2130O8164l9229c7193B81952A19758a81182A64805h9651
11907b21833A33202a33026K0403l98813B53371E9149a00311l386I3433i6024A04939
11895A6605b7132l02350g0224B4966e1437B4392P6774f1746I0378a34231N3687
11884h0544A26338b3498F3613d2693F736d5050c810j51921B0897b82793f8230
11872d4634B82243b8228p2884b869j58322e7029j10523K7804c6050A9087c78250
11860A475K47050m3428I5235h2686l85868G0803c8290j52475B43933F2568J4213
11849G6781f6456A23872c64707f4309k54840I817a44130A09012k7535b37676H3656
11837H8821c05443E082b08272N528b9722j23979c3151m35154f6289A65161a37559
$$ plain form
11825 122733 200568 206789 -325781 -20486 -46526 -210825 -495985 -121171 154068 122607 17621
11813 -441958 392587 -102296 -207450 -138414 -153628 234774 177061 -565020 95862 -150107
11802 -154787 -381821 -27879 206966 -262140 14586 -95972 -264840 92626 -310454 -314797 135722
11790 32133 -114123 328042 129877 58794 -188052 -80711 143494 -271172 -66974 -136344
11780 -136344 228934 -78734 -263180 109758 321923 -13344 24716 81906 -355135 -175179
11769 -12573 -274926 80390 -70854 -61674 98414 -34972 26895 143575 -149234 45713 -5714
11757 173735 -75655 -365668 194544 -300678 52575 120454 -92535 155416 23290 89256 -127250
11745 63345 -250674 -133194 43895 -174504 -57962 -214059 -70861 -144904 48988 220718 -93380
$$ packed form
11825A22733P7835O221c25781b0486k6040j64299k85160a21171A54068l1461A7621
11813d41958C92587a02296j05154O9036j5214B34774n7713e65020I5862a50107
11802a54787k27034b7879B06966b62140A4586i5972j68868I2626c10454m343A35722
11790C2133a14123C28042A29877E8794a88052h0711A43494b71172f6974o9370
11780a36344B28934g8734j84446A09758K12165a3344B4716N7190c55135a75179
11769a2573k62353H0390g0854R180I8414c4972B6895J16680a49234D5713e714
11757A73735g5655k90013A94544c00678E2575O7879i2535A55416B3290O5966a27250
11745F3345b50674J17480D3895a74504e7962j56097g0861p4043D8988J71730i3380
$$ plain form
11733 -154977 6381 -115558 -145718 -165092 68259 188736 -76783 -1098 220300 266685 -328634
11721 87520 -172152 164924 130554 240296 315440 -206218 190403 168320 26039 -357074
11710 -87855 61918 172065 302470 209952 416828 -269309 -79699 -266675 398648 28297
11699 92311 -87209 411354 418976 -100972 287581 301065 -123882 -91597 -19802 -96556 164820
11687 -119082 72657 31899 21636 282596 12873 242834 -69900 244054 -176248 53816 43785
11676 43785 244679 -210719 113689 89321 -140321 265551 223245 -8659 285595 67999 -464942
11664 -156677 351632 -80497 35667 29021 -378551 356660 -82047 -863 204542 148648 -36779
11652 -52963 182188 42172 -4015 52649 -95607 40628 -198787 -138329 126829 -36786 -14458
$$ packed form
11733a54977F381a15558l0160j9374F8259J20477g6783a098B20300M6385c28634
11721H7520a72152A64924l4370J09742P5144b06218A90403k2083B6039c57074
11710h7855F1918J10147J30405r2518K06876b69309g9699j86976C98648B8297
11699I2311h7209D11354P622a00972B87581J3484a23882L2285a9802p6754A64820
11687a19082G2657C1899j0263K60960A2873K29961f9900B44054a76248E3816j0031
11676D3785K00894b10719A13689k4368a40321B65551m2306h659B85595F7999d64942
11664a56677C51632h0497C5667o646c78551C56660h2047h63B04542n5894c6779
11652e2963A82188D2172d015E2649i5607D0628a98787O0458A26829c6786a4458
$$ plain form
11640 248587 228950 434201 89193 211409 -70709 235349 -159357 141354 85447 -270226
11629 -105016 129042 537413 402009 186880 244951 123401 -71897 145485 -67945 144377
11618 -167596 56187 73683 9455 108753 -95220 -221198 250706 116330 200015 398915 -7461
11606 -281196 6074 -21782 -39591 258450 180005 -19333 281273 7037 162636 -4882 230270
11594 801 424345 252124 122058 -196758 98649 181905 389 251463 334321 190686 66731
11582 31953 220815 18430 -36408 49358 362419 176881 67036 62986 335091 -47703 452405
11570 125604 17838 95893 212033 74118 18698 104123 129787 -103015 56236 182554 7637
11558 77054 10076 -2976 -14843 101555 89535 -423317 -71941 -124769 12911 -19842 -213683
$$ packed form
11640B48587j9637K05251H9193J22216g0709B35349a59357A41354n5907b70226
11629a05016A29042M08371j35404A86880N8071j21550g1897A45485f7945A44377
11618a67596E6187J7496I455R9298i5220j25978B50706A16330Q3685J98900g461
11606b81196F074b1782j7809B58450p8445a9333B81273G037J55599d882B30270
11594H01M23544j72221A22058a96758I8649Q3256C89K51074Q2858j43635F6731
11582C1953J88862A8430c6408D9358L13061A76881F7036m050K72105d7703D52405
11570A25604A7838P8055J16140G4118A8698Q5425K5664a03015E6236J26318G637
11558G7054A0076b976j1867A01555j2020d23317g1941n2828A2911a9842j93841
$$ plain form
11547 -213683 -265739 28401 225448 117987 459749 142869 345340 281424 166681 395044
11537 395044 3559 -47986 -282711 29238 218190 226859 -110285 -223035 -63830 -31328 -299427
11526 -299427 -166615 169603 37507 6035 153094 -202063 174998 154697 -243742 -155771
11516 -155771 237196 84268 120595 487966 303658 138152 92977 77439 -69985 -7571 137982
11504 -71437 353227 15725 211436 35042 62672 -99118 -19660 -175635 -322360 129767 -185873
11492 355237 -148601 164921 396931 2695 -67954 50166 22893 24868 526165 11501 140275
11481 140275 138160 -41675 65241 360979 -308307 274364 536847 206759 98250 355122
11471 355122 112562 273763 160320 174046 485958 70592 -52893 28636 122862 14968 -127946
$$ packed form
11547b13683n2056B8401J97047j07461L41762A42869K02471o3916j14743K28363
11537C95044C559d7986k34725B9238J88952Q669a10285j12750f3830c1328k68099
11526b99427J32812A69603C7507F035J47059b02063A74998k0301b43742Q7971
11516a55771B37196H4268L6327L67371j84308A38152m5175j5538f9985g571A37982
11504g1437C53227A5725J95711C5042K7630i9118a9660j55975j46725A29767a85873
11492C55237a48601A64921K32010B695f7954E0166B2893J975N01297A1501J28774
11481A40275k115d1675F5241K95738c08307B74364K62483B06759I8250K56872
11471C55122A12562J61201j13443J3726L11912G0592e2893B8636R4226A4968a27946
$$ plain form
11459 285958 -32667 165928 142690 -83918 72023 207637 429669 197392 4457 -138396 535746
11447 -14888 292038 251385 137945 12709 -125401 -467354 -186172 192128 -85085 165566
11436 30226 -81482 71642 25656 103768 99567 238276 -240619 -34887 -134746 292511 263145
11425 263145 -37762 62802 -124895 135043 17032 -73875 195327 340966 -19863 24444 117614
11414 117614 39521 -413381 63654 136523 283811 -154588 -155819 35243 -48519 31071 65698
11403 65698 270833 313969 274914 -47674 5117 151482 -88907 -467548 125157 62500 122810
11392 122810 -373839 -30843 29997 -235799 24983 27434 -142631 -149092 -36136 -143986 -73387
11381 -73387 3883 284493 68428 173819 -173128 -5760 -197975 -229656 136731 152169 -71752
$$ packed form
11459B85958c2667A65928k3238h3918G2023J35614K22032A97392D457a38396E35746
11447a4888B92038m0653j13440A2709a25401l41953a86172A92128h5085A65566
11436C0226h1482G1642B5656P8112m201J38709b40619c4887r9859B92511k9366
11425B63145c7762F2802a24895A35043A7032g3875A95327J45639a9863B4444R3170
11414A17614C9521d13381F3654P2869J47288a54588j231C5243d8519C1071L4627
11403F5698K05135M3136l9055d7674E117J46365h8907l78641A25157F2500O0310
11392A22810c73839c0843B9997b35799B4983K451a42631o461c6136j07850P0599
11381g3387C883K80610F8428J05391a73128e760j92215l1681A36731J5438g1752
$$ plain form
11369 -206113 -23512 -336767 151729 114950 109502 -120485 -211860 -21951 -412599 -203263 129399
11357 292135 -89485 100187 245377 290518 -344336 -52781 -95498 -296769 -36514 10935 236346
11346 236346 -130261 -87318 289636 37773 -97873 115624 64391 74742 115132 212072 49790
11334 -72420 50418 26110 -81809 -48424 285728 -74139 208683 -177137 -65665 -141759 -107579
11323 -107579 -10742 157984 259092 -116149 -95553 328537 82800 -208668 33663 -100958
11312 143662 233149 24669 226099 -339427 45637 -222593 25209 -44665 96795 184059 318201
11301 318201 63557 47687 -172585 -63049 78898 178558 -27944 -307837 262813 258770 -38414
11289 -192104 -369482 -8854 -51424 -61800 -103528 42189 -138136 -117462 -313220 139514 42612
$$ packed form
11369b06113b3512l13255A51729l6779n448a20485r1375b1951l90648b03263A29399
11357B92135h9485A00187J45190M5141c44336e2781m2717k01271c6514A0935K25411
11346B36346a30261M2943B89636C7773i7873A15624n1233J0351M0390R6940D9790
11334g2420E0418k4308h1809L3385B85728g4139B08683a77137f5665p6094L4180
11323a07579a0742A57984J01108a16149K0596C28537H2800b08668C3663a00958
11312A43662Q9487B4669K01430c39427D5637b22593B5209d4665I6795Q7264J34142
11301C18201F3557j5870a72585f3049G8898R9660b7944k79893B62813m043c8414
11289a92104j77378h854m2570j0376m1728D2189a38136K0674j95758A39514D2612
$$ plain form
11277 83790 -374448 -171653 -744 -96380 -136839 -168178 418680 -234283 -206469 321671 -90624
11265 169262 -141796 40871 33043 74287 20387 164787 56932 -309574 -90287 -115135 -95793
11254 -95793 222466 -4158 115922 20458 -52302 202122 -4764 -229676 19227 -184035 24145
11242 -248707 234642 -85589 -91422 75098 81964 -60522 79666 85664 -125582 105275 49415
11230 185074 -70380 -445851 144105 87249 -220504 -72921 404 -133064 -338699 171971 31408
11218 284630 217972 192834 368305 -1514 -95957 -314227 -9371 -100829 -67695 96467 1311 255301
11206 255301 -108249 432905 -216665 -139511 -135803 -61062 -220988 -107278 49439 284875
11196 284875 304200 -273514 -58962 295102 66633 145755 102729 -112570 -289745 -132977
$$ packed form
11277H3790c74448a71653g44r5636m0459l1339D18680b34283K7814C21671i0624
11265A69262a41796D0871p828M1244B0387J44400E6932c09574i0287k4848J9342
11254i5793B22466d158A15922B0458e2302B02122d764k24912A9227a84035B4145
11242b48707B34642h5589n833G5098O866f0522G9666N998a25582A05275D9415
11230A85074g0380l75471A44105n6856b20504g2921D04a33064k05635A71971C1408
11218B84630o6658k5138J75471a514r4443k18270i371r1458L3134I6467A311K53990
11206B55301a08249D32905b16665P7154L708f1062j59926a07278D9439K35436
11196B84875J9325b73514e8962B95102F6633P9122m3026a12570j77175a32977
$$ plain form
11185 -148166 267863 347413 -83665 -78945 -81726 -78753 -7273 -231287 -35076 -218605 104741
11173 32568 -57641 239470 -143868 -79952 -68706 351363 -263690 258719 264379 -181757 124823
11161 358281 12140 -8462 -107180 -82380 -234920 107964 -98268 159864 104534 -127075 -65379
11150 -65379 -149158 -132896 92139 -306145 -59653 -7939 -133870 56471 289104 -24907 -137199
11139 -137199 -10047 -24532 358531 -59677 -132953 -530568 -113837 -92169 -73407 68428 19832
11127 -347025 78699 63268 -243673 -68525 50770 152955 77884 -214162 50979 144407 109002
11116 109002 -285303 227868 -4494 28764 166763 226389 -68020 416754 -146134 -21877 288873
11104 431351 183665 376024 197337 92226 44957 -5912 107684 123546 96076 388504 264011
$$ packed form
11185a48166B67863P9550h3665M720k781K973g273k24014c5076j83529A04741
11173C2568e7641B39470a43868O3916J1246C51363b63690B58719N660a81757A24823
11161C58281A2140h462r8718K4800j52540A07964i8268A59864n5330a27075O1696
11150f5379q3779J6262I2139c06145e9653g939j25931E6471K32633b4907j12292
11139a37199a0047j4485C58531e9677p3276l97615a13837K1668J8762F8428A9832
11127c47025G8699j5431b43673f8525E0770J02185p5071b14162E0979R3428l5405
11116A09002b85303B27868d494B8764J37999N9626f8020D16754a46134b1877B88873
11104D31351A83665J92359j78687I2226D4957e912A07684J5862k7470K92428j24493
$$ plain form
11093 264011 257571 180608 263271 218831 183534 168629 459139 241364 9849 -90070 15201
11081 295765 387270 136418 445631 126299 339436 -8723 423294 -269774 75111 250444
11071 250444 357330 310856 54503 289763 198330 275685 357669 359630 45479 161201 299429
11060 299429 377792 519355 507572 505542 370261 507195 636840 589773 282046 827655
11050 827655 366630 563827 661928 423171 728001 492216 768246 844164 293668 806835
11040 806835 437441 593218 446032 1109398 506011 573346 877362 798134 912890 506361
11030 506361 338138 681165 1081598 380066 382420 451702 717221 410530 720519 529315
11020 529315 377694 310612 698443 680933 771636 348747 424695 794110 645622 651501 764169
$$ packed form
11093B64011o440p6963Q2663m4440l5297j4905K90510k17775I849i0070A5201
11081B95765R1505A36418L09213A26299K13137h723D23294b69774G5111J75333
11071B50444J06886m6474E4503K35260r1433P7355Q1984J961D5479J15722J38228
11060B99429P8363J41563j1783k030j35281J36934J29645m7067B82046N45609
11050H27655C66630J97197R8101k38757L04830k35785K76030P5918B93668N13167
11040H06835l69394J55777j47186O63366E06011O7335L04016p9228J14756m06529
11030E06361j68223L43027M00433C80066K354O9282K65519l06691L09989j91204
11020E29315j51621o7082L87831j7510R0703C48747P5948L69415j48488N879J12668
$$ plain form
11009 764169 117968 574369 529406 800342 611710 310855 595642 635238 871347 587719
10999 587719 997445 876570 604292 902470 734757 661662 680330 587171 784724 484609
10989 484609 570090 496126 970999 1113799 872358 623463 661139 1013757 704553 1427501
10979 1427501 1174563 1160655 1235733 1512503 1743539 2174231 2045071 2536304 2249903 2374645
10969 2374645 2867230 2535564 2367199 2150164 1809918 1881505 1520318 1913193 1731382 1781914
10959 1781914 1878922 1910236 1997476 1999894 2323634 2237620 1731854 1686668 1498011 1481438 1341487
10948 1341487 1069072 915245 473966 272325 876931 455686 416969 134648 190469 152311
10938 152311 107261 306644 7108 -108335 197444 15344 236335 -158728 -166883 195884 173563
$$ packed form
11009G64169A17968M56401m4963K70936j88632l00855K84787L9596K36109k83628
10999E87719M09726j20875k72278K98178j67713p3095J8668r3159J97553l00115
10989D84609Q5481p3964M74873J42800k41441k48895L7676L52618l09204P22948
10979A427501k52938j3908P5078K76770K31036M30692j29160M91233k86401J24742
10969B374645M92585l31666j68365k17035l40246P1587l61187L92875j81811N0532
10959A781914R7008L1314Q7240K418L23740q6014n05766m5186j88657j6573j39951
10948A341487k72415j53827m41279k01641O04606m21245l8717A34648N5821l8158
10938A52311m5050J99383G108a08335A97444A5344K20991a58728q155A95884k2321
$$ plain form
10927 173563 67807 11867 101818 220226 451230 58063 69654 56052 107255 242878 100372
10915 477886 92125 199672 487995 -219514 -104980 47370 413727 106777 -66853 303837
10904 36605 112723 79749 -46828 213307 -123039 155556 -67138 410163 -172703 -74727 -201739
10893 -201739 102003 87410 -227815 -303128 -147585 -126064 -237 78041 -370531 -210349 -68959
10881 -62265 -461832 -141562 -34965 93928 279613 5454 -26820 171085 -68356 141039 265995
10870 265995 -24222 14086 -154273 -178287 161107 -195966 175136 -120796 151730 107491
10860 107491 -8803 -273883 123211 -279903 -46362 179239 -215493 -66780 -124166 183709
10849 -1518 27148 -25903 -187190 221117 -80474 -264354 -3427 -132946 -200304 -245675 -377381
$$ packed form
10927A73563F7807A1867Q9951J18408K31004E8063J1591j3602N1203J35623A00372
10915D77886I2125J07547K88323b19514a04980D7370L66357A06777f6853C03837
10904C6605P6118l2974d6828B13307a23039A55556f7138D10163a72703g4727j27012
10893b01739A02003j4593b27815p5313a47585K1521b37G8041c70531J60182f8959
10881f2265l99567a41562c4965I3928J85685E454b6820A71085f8356A41039J24956
10870B65995b4222A4086a54273k4014A61107a95966A75136a20796A51730m4239
10860A07491h803k65080A23211b79903d6362A79239b15493f6780n7386A83709
10849a518B7148b5903j61287B21117h0474j83880c427j29519o7358m5371j31706
$$ plain form
10838 -377381 126199 123045 99700 -14912 -24988 -258255 155207 216185 278892 -249875 -286692
10827 -286692 -16514 54088 107214 -129745 -281588 -161321 -101705 296721 139299 -200155
10816 -19767 -188813 -194015 -55406 -185477 -436266 -3255 -58725 90736 4228 -124210 -138816
10805 -138816 114862 55703 62696 41503 5587 159133 14279 88918 46940 64775 161783
10794 161783 -210746 -122265 -193243 65006 -174099 141543 -68848 290216 -161 -142386 -346252
10783 -346252 -101680 -277410 -54573 -36659 280399 -32839 212270 44485 83208 -329465
10772 115623 -44564 -42314 -446688 234194 -120572 273232 -229561 32607 95642 -25062 -291283
10761 -291283 -116221 -177182 -1369 -415659 227206 105285 -342363 -281469 216604 -195808
$$ packed form
10838c77381A26199l154k3345a4912j0076k33267A55207O0978O2707b49875l6817
10827b86692a6514E4088N3126a29745j51843J20267N9616B96721A39299b00155
10816a9767j69046n202e5406j30071k50789c255n5470I0736D228a24210j4606
10805a38816A14862E5703O993k1193E587J53546A4279P4639m1978J7835R7008
10794A61783b10746Q8481p0978F5006a74099A41543f8848B90216a61j42225k03866
10783c46252a01680j75730e4573J7914B80399c2839B12270D4485L8723c29465
10772A15623d4564K250m04374B34194a20572B73232b29561C2607O3035b5062k66221
10761b91283a16221o0961a369m14290B27206A05285c42363O0894B16604a95808
$$ plain form
10750 62209 22202 85499 -108319 55928 -138096 -61069 -257016 -79458 -286180 -152594 -72918
10738 -458732 -236299 -202404 -296350 106603 116261 -144105 -174441 80558 50406 -72306 128318
10726 -72065 -87049 -248015 -55233 72951 -176118 447033 -35573 -60919 97763 84839 158903
10715 158903 -271531 46727 -21188 17065 -72399 -209199 -184604 18135 -58893 43507 172326
10704 172326 51634 240549 292766 -304708 -127693 13634 -83571 -80547 -195001 -27956 -140937
10693 -140937 -67709 -327496 163555 32439 -59293 -158779 -72731 -75735 131400 -312031 -99845
10681 119884 -685208 -21676 40980 158907 -134909 -154918 -164612 -376755 -287457 -42037 -83285
10670 -83285 224405 71853 -216794 -71788 -82552 147064 -89734 146586 216585 -23508 24658
$$ packed form
10750F2209B2202O3297a08319E5928a38096f1069j95947g9458k06722J33586g2918
10738d58732K22433L3895r3946A06603R658a44105l0336H0558l0152g2306A28318
10726g2065j4984j60966e5233G2951a76118D47033c5573k5346I7763j2924P4064
10715A58903b71531D6727b1188A7065g2399j36800K4595A8135e8893D3507J28819
10704A72326E1634J88915N2217c04708a27693A3634h3571L024j14454b7956j12981
10693a40937f7709k59787A63555C2439e9293r9486g2731l004A31400c12031i9845
10681A19884f85208b1676D0980J17927a34909k0009r694k12143Q9298d2037m1248
10670h3285B24405G1853b16794g1788j0764A47064h9734A46586O9999b3508B4658
$$ plain form
10658 314071 -218144 -50294 -157976 -301935 -168614 -21387 -24375 -158598 4449 -69404 -26620
10646 -144423 -42844 464418 -61197 255124 -69072 -131393 -206865 -97437 -274158 -192278 -117381
10635 -117381 84865 96164 -12570 -258676 229200 -129952 -267194 -237809 -68461 -314468
10625 -314468 7214 -38430 149895 -95033 -169888 -195646 -179239 -123603 243442 -98597 -111139
10614 -111139 -177870 -87368 -413776 -136182 162414 -32754 -19052 354888 -228397 -219311 149108
10602 -320480 -27921 -344299 -285230 -99409 200581 -32233 -160 -114725 282001 44749 313443
10591 313443 -158299 110245 51660 -194530 109057 17981 -297121 312054 -144951 -108989
10581 -108989 -65849 -110811 117659 -98547 -11952 -101067 -57311 -16509 -235203 51035 -107786
$$ packed form
10658C14071b18144e0294j07682j43959J33321b1387k988j34223D449f9404b6620
10646a44423d2844D64418f1197B55124f9072o2321p5472i7437j76721Q1880P4897
10635a17381H4865J1299a2570k46106B29200a29952j37242K9385f8461k46007
10625c14468G214c8430A49895i5033p4855k5758J6407N5636B43442i8597j2542
10614a11139o6731h7368l26408a36182A62414c2754J3702C54888b28397R086A49108
10602c20480b7921l16378N9069i9409B00581c2233a60j14565B82001D4749K68694
10591C13443a58299A10245E1660a94530A09057A7981b97121C12054a44951L5962
10581a08989M3140m4962A17659i8547a1952q9115M3756a6509k18694E1035a07786
$$ plain form
10569 58328 -221163 -174531 47095 -280583 -23823 -49359 267128 -63319 -59673 85744 -219353
10557 26107 80207 -107708 -21117 -186444 -88259 -104709 233221 -171743 140431 -38160 -129065
10546 -129065 375098 54689 -5324 -27090 124471 -444221 -153354 -6849 59594 -266650 -25441
10534 -165068 230992 -17607 -288504 115612 -117592 566312 105794 -150796 -10392 67742
10523 349646 -117170 175395 -25509 -279634 31779 -89853 -183353 127421 -235773 -365704
10513 -365704 -34700 98574 55603 99045 -107191 -246069 -294401 -292164 4393 -38148 -204157
10502 -204157 204893 218928 -160676 -157316 574835 136558 277619 -82785 94734 10185 -101070
10490 -61054 -9090 -312126 203755 -264759 -69635 298606 270538 251650 133025 299534 292016
$$ packed form
10569E8328b21163M6632D7095b80583b3823k5536B67128f3319L646H5744b19353
10557B6107N4100a07708b1117j65327h8259j6450B33221a71743A40431c8160r0905
10546a29065C75098E4689e324k1766A24471d44221a53354f849E9594b66650b5441
10534a65068B30992a7607k70897A15612a17592E66312A05794a50796a0392F7742
10523C49646a17170A75395b5509k54125C1779h9853r3500A27421b35773j29931
10513c65704c4700I8574m2971M3442a07191j38878m8332K237D393c8148j66009
10502b04157B04893J4035a60676L360E74835A36558J41061h2785I4734A0185a01070
10490f1054i090l03036B03755b64759f9635B98606k8068j8888j18625J66509p518
$$ plain form
10479 292016 1014661 911899 427655 354013 147495 66996 75860 142990 210440 77385 -114105
10467 -53739 14851 96347 105484 213208 -25606 230086 99326 173114 -314818 -260739 -84338
10455 57599 -265362 341167 -26743 127292 173150 61947 -7511 -79922 167458 -79599 55127
10443 185161 436526 -276709 -145037 -177056 -346186 -197185 228067 36401 -77944 233753
10432 22327 -144230 -174676 -101362 -71965 -50997 47613 351836 -3288 -14515 107133 133080
10421 133080 -192479 19490 12295 423903 -167191 -199614 -39794 -115792 -179701 -103162 -12769
10409 44288 -23257 -296907 217996 192838 215404 -419996 183198 -242003 300610 -69011
10398 -32662 -172294 -239442 -34891 41106 77403 5976 192468 313726 -10082 -50125 -34087
$$ packed form
10479B92016P22645j02762D27655p3642A47495F6996Q864O7130O7450G7385a14105
10467e3739A4851Q1496R137J07724b5606B30086I9326P3788c14818N4079h4338
10455E7599b65362C41167b6743A27292M5858F1947g511p2411A67458g9599E5127
10443A85161K51365b76709J31672l2019j69130J49001B28067C6401g7944B33753
10432B2327a44230l0446P3314K9397K0968D7613L04223c288j1227A07133K5947
10421A33080a92479A9490p195M11608a67191l2423c9794p5998o3909P6539a2769
10409D4288b3257k73650B17996k5158K2566d19996A83198b42003C00610f9011
10398c2662j39632o7148c4891D1106L6297E976J86492J21258a0082m0043J6038
$$ plain form
10387 -34087 3047 182084 315782 -77132 57383 41365 -91010 157555 269875 -267593 330301
10375 194367 -35707 14243 16560 232932 161079 106422 240880 429084 389847 501934 314445
10364 314445 234659 606856 120868 205532 363826 384040 -169165 -12186 4922 -106663 138428
10352 95355 210070 -3547 648291 461232 271084 105231 54536 295600 352275 447196 565304
10341 565304 437545 393771 220893 306619 138614 -182982 208723 323139 69456 140417
10331 140417 80904 7709 211437 191803 -144866 -53412 21782 236911 374733 285158 7839
10319 -27340 315974 214518 -89498 7509 221811 67264 -334671 290675 256010 -10568 132955
10307 -163894 122303 -222631 30284 -59527 110428 -96528 -149105 -368051 -61358 141511
$$ packed form
10387c4087C047J79037J33698g7132E7383j6018i1010A57555J12320b67593C30301
10375A94367c5707A4243K317K16372p1853n4657J34458J88204l9237J12087j87489
10364C14445p9786L72197A20868Q4664J58294K0214a69165a2186D922a06663A38428
10352I5355J14715c547F48291j87059j90148A05231n0695K41064N6675R4921J18108
10341E65304j27759m3774j72878Q5726A38614a82982B08723J14416F9456P0961
10331A40417n9513G709K03728j9634a44866e3412B1782K15129J37822q9575G839
10319b7340C15974j01456h9498G509K14302F7264c34671B90675l4665a0568A32955
10307a63894A22303b22631C0284e9527A10428i6528n2577k18946f1358A41511
$$ plain form
10296 18642 -128153 39679 21699 207375 397323 -31568 109999 -94775 -228874 -222220 -3820
10284 -227044 23761 -266874 -193163 -56071 10745 -43370 -131281 -251972 -107960 -169729 -26890
10272 -209165 255188 -184158 -33138 80584 -1644 105079 26401 144080 -175542 150084
10261 38854 -92306 268652 331778 407893 275223 155830 224095 57298 5968 -7261 -124427
10250 -124427 61434 210294 -69854 -91512 616647 -53945 37084 99549 -246351 -164943 137135
10238 -135868 136138 213758 -63652 -135029 -101864 -139914 337359 1312 -45210 305064 -97374
10226 -69393 -116251 -237416 357288 -147928 121380 -31698 167410 -245095 270915 -8543
10215 238860 7363 95733 152453 -134577 -139424 42907 -422141 -204911 -330747 -225174 69537
$$ packed form
10296A8642a28153C9679j7980J85676J89948c1568A09999i4775j34099O654c820
10284b27044B3761b66874P3711e6071A0745d3370q7911j20691a07960o1769b6890
10272b09165B55188a84158c3138H0584a644A05079B6401J17679a75542A50084
10261C8854i2306B68652O3126P6115j32670j19393O8265E7298E968g261j17166
10250a24427F1434J48860f9854k1658F16647e3945C7084O2465b46351Q1408A37135
10238a35868A36138P7620f3652p1377L3165l8050C37359A312d5210C05064i7374
10226f9393m6858j21165C57288a47928A21380c1698A67410b45095B70915h543
10215B38860G363Q8370N6720a34577m847D2907d22141b04911j25836J05573F9537
$$ plain form
10203 126856 -205479 -58428 29433 -24384 -312132 34872 -53640 201888 38786 -28386 -2435
10191 -153003 -275696 85962 -298090 -105876 -279332 18089 -228747 22301 62054 111785
10181 111785 -92774 -250733 -58219 -346330 -279012 -302592 18413 -22956 18942 -295817 279475
10169 -385201 -85776 -105478 81829 -155841 36399 234157 -35699 -160578 -320715 -27638 43206
10157 66927 84747 -7766 -47507 -400944 -206676 39008 19049 132364 -85190 -151636 -228066
10146 -228066 -10587 -87218 -133961 -144086 133905 -111094 -410805 43840 -6472 145760 233847
10135 233847 -166380 -144576 -300364 22719 -97823 1234 60582 129546 122474 88312 66912
10124 66912 38011 29585 -46454 -218929 -455716 147139 -70620 -543129 219157 371393 -13013
$$ packed form
10203A26856b05479e8428B9433b4384k87748C4872e3640B01888C8786b8386b435
10191a53003j22693H5962b98090a05876j73456A8089b28747B2301L9753M9731
10181A11785i2774j57959e8219k88111O7318k3580A8413b2956A8942b95817B79475
10169c85201h5776j9702H1829a55841C6399J97758c5699j24879j60137b7638D3206
10157F6927J7820g766l9741l53437J94268C9008A9049J13315h5190o6446p6430
10146b28066a0587p6631m6743j0125A33905a11094k99711D3840f472A45760Q8087
10135B33847a66380K1804j55788B2719i7823A234N9348O8964p072l4162k1400
10124F6912k8901q426d6454j72475k36787A47139g0620m72509B19157J52236a3013
$$ plain form
10112 -275099 110389 -148681 -66828 -327959 -198864 -123493 190949 -15445 -252785 -324564
10102 -324564 -105970 53156 -181986 -293138 -128689 -108624 -209360 -145953 14745 -154191
10091 -65698 -93365 -363392 53426 141635 -52366 -490239 -8638 -205515 -256590 -270570 -84915
10079 281600 221776 -166468 -12512 -157189 44402 -148278 285715 -122584 -124900 51508 -139646
10067 151959 -248724 3114 286078 44470 -413718 166185 197943 -28837 -13209 -141450 -122190
10056 -122190 125016 362156 91955 179682 -146607 -74807 336165 62304 -188801 -88234
10045 -60230 -22347 128375 -233499 -38216 -155240 -36569 132170 92688 59030 -134168 104516
10033 -90286 -134618 21935 117704 -53733 -48629 98546 88447 14568 -112207 -340402 128518
$$ packed form
10112b75099A10389a48681f6828k61131J29095P5371A90949a5445k37340p1779
10102c24564a05970E3156a81986j11152a28689K0065j00736O3407A4745a54191
10091f5698k7667k70027E3426Q8209e2366m37873h638j96877n1075j3980h4915
10079B81600n9824a66468a2512j44677D4402a48278B85715a22584k316E1508a39646
10067A51959b48724C114K82964D4470d13718A66185L1758b8837a3209j28241J9260
10056a22190A25016K37140I1955Q7727a46607P1800C36165F2304a88801h8234
10045f0230b2347A28375b33499c8216j17024c6569A32170l9482l3658a34168A04516
10033i0286m4332B1935R5769e3733N104I8546j0099A4568a12207k28195A28518
$$ plain form
10021 -195037 -114172 -290730 -90328 -178026 -372972 -152562 -109161 -19607 -400128 -198317
10010 -119161 -168931 -245703 -321288 189133 -178325 -70197 -83607 -63705 -242558 -218514 77405
9998 178009 -15073 -246492 -347818 -414155 67698 -311731 -91994 158830 -319430 105518
9987 15598 -137115 -165577 111503 -96068 67999 28154 47072 -629 -275916 164865 -529102
9975 -181929 -272044 227187 -12154 231848 34187 -52593 -201549 -292185 -7074 -113113 -106954
9964 -106954 59430 -239577 5774 95107 -60535 218341 -121137 291430 -437906 -111621 48757
9952 -7376 -235631 -55976 200369 -194803 194180 -186164 -439 71447 167452 116972 -62334
9940 -87243 131366 -365096 -280225 -513785 -241829 -5909 45961 61289 148978 -116460 -108382
$$ packed form
10021a95037Q0865j76558i0328q7698j94946a52562M3401a9607l80521a98317
10010a19161m9770p6772p5585A89133a78325g0197j3410J9902j78853K4044G7405
9998A78009a5073k31419j01326o6337F7698c11731i1994A58830c19430A05518
9987A5598a37115k8462A11503i6068F7999B8154J8918f29k75287A64865e29102
9975a81929r0115B27187a2154B31848C4187e2593j48956r0636g074j06039O159
9964a06954E9430b39577E774Q9333f0535B18341a21137B91430d37906a11621D8757
9952g376k28255e5976B00369a94803A94180a86164d39G1447R6005n0480f2334
9940h7243A31366c65096Q4871k33560b41829e909D5961J5328Q7689a16460Q078
$$ plain form
9929 -108382 -413345 30877 -108756 -293417 -394866 -66177 -44963 -13772 -143572 57846 -320566
9917 84413 -79173 178332 -121683 -37258 -237450 -315149 -395119 -107312 42564 -27408 40749
9905 -83131 -60221 -399999 112485 -53145 33316 243444 4267 134272 119304 -70468 173095
9893 30945 21354 -148014 222065 -190047 -268101 111068 -184225 62360 -31067 72153 -185963
9881 233890 -18507 -214745 318065 52871 -16965 -167133 -155745 -217715 -140376 -21094 -180867
9870 -180867 -10984 11976 -333468 -78949 113086 12725 -103421 222933 -17854 -246138 211184
9858 45623 182426 -137577 -177720 49467 -54552 -286602 115227 94074 75671 -92830 50420
9846 -258085 -71078 -70798 14720 -241986 113 34013 122294 -269153 -39985 -281988 -30146 62847
$$ packed form
9929a08382l04963C0877a08756j84661j01449f6177K1214a3772j29800E7846c20566
9917H4413g9173A78332a21683c7258k00192p7699p9970a07312D2564b7408D0749
9905h3131K2910l39778A12485e3145C3316K10128D267J30005j4968g0468A73095
9893C0945r591a48014B22065a90047p8054A11068a84225F2360c1067G2153a85963
9881B33890a8507j96238C18065E2871a6965j50168J1388o1970P7339b1094j59773
9870a80867a0984A1976c33468g8949A13086A2725a03421B22933a7854k28284B11184
9858D5623J36803a37577m0143D9467e4552k32050A15227k1153j8403i2830E0420
9846b58085g1078K80A4720b41986A13L3900Q8281b69153c9985k42003c0146F2847
$$ plain form
9833 -269708 -141585 -203976 -231391 -23793 196139 -61792 -31089 -139160 203179 278039 -192450
9821 10952 -222885 62547 43591 -35391 -151026 -195609 -117388 -260813 -27262 -215378 107083
9809 243138 -206051 -35718 -114961 59616 141051 -102927 -151471 8665 -30519 -379630 -62116
9797 23921 -243541 -219754 24724 -15622 83565 220897 -259108 -176526 -141087 -118016 63078
9785 65506 -19146 126834 -258462 -296766 -254300 -311974 36659 -216827 -188138 -62501 -69092
9774 -69092 -13681 -254960 122039 -134810 -111215 -140568 -64856 96879 -331032 -79146 54771
9762 -123194 -247322 -194848 -85032 -13711 8782 -27635 -211040 205273 38460 2827 -34232
9750 258843 -119265 -167892 286098 -92360 -81381 -324310 -190839 -19292 -98722 -17765 -248700
$$ packed form
9833b69708J28123o2391k7415b3793A96139f1792L0703j08071B03179P4860a92450
9821A0952b22885F2547j8956c5391j15635m4583P8221j43425b7262j88116A07083
9809B43138b06051c5718p9243E9616Q1435a02927m8544H665c0519l49111f2116
9797B3921b43541K3787B4724a5622H3565J37332b59108Q2582L5439K3071F3078
9785F5506a9146A26834b58462l8304M2466n7674C6659b16827K8689f2501o591
9774f9092a3681k41279A22039a34810K3595k9353f4856I6879c31032g9146E4771
9762a23194j24128N2474h5032a3711H782b7635j83405B05273C8460B827c4232
9750B58843a19265m8627B86098i2360J0979k42929J33471a9292p9430a7765k30935
$$ plain form
9739 -248700 -216788 345693 17516 -4511 53421 55567 -248737 390627 -45651 659 193555 39129
9726 36275 -175817 115472 -211959 37313 -109642 -44025 -168783 -281057 49955 -243522
9715 27299 -99933 -247218 -336087 -136656 -271215 -322454 129758 -50349 -261451 -24463 -48167
9704 -48167 -175496 -126479 33987 105414 116326 -265626 178824 -25340 -172554 53715 -115892
9692 -126379 214341 -334068 -21707 -38712 12514 -215983 62749 412089 -107615 130560
9681 -131558 -190963 -54994 165058 -241240 -9893 -3577 -207120 -192637 -117673 -76885 295777
9669 -240080 -36523 -172049 -83686 -27056 114843 1470 13129 -245392 23191 243554 -48197
9657 -102215 51564 213555 3598 -119549 89601 231173 -168899 17507 39977 129345 56238
$$ packed form
9739b48700L1912C45693A7516d511E3421K146b48737C90627d5651F59J92896C9129
9726C6275a75817A15472b11959C7313a09642d4025j24758j12274D9955b43522
9715B7299i9933j47285q8869a36656j34559n1239A29758e0349k11102b4463k3704
9704d8167j27329M9017C3987P1427J0912b65626A78824b5340j47214E3715a15892
9692a26379B14341c34068b1707j7005A2514b15983F2749L49340a07615A30560
9681a31558n9405e4994A65058b41240i893c577k03543J4483P4964M0788B95777
9669b40080c6523j35526h3686b7056A14843A470J1659b45392B3191K20363d8197
9657a02215E1564J61991C598a19549H9601J41572a68899A7507K2470Q9368E6238
$$ plain form
9645 -172303 -307089 -55686 -273261 -336886 188332 -59174 -42276 -294293 94821 -129801 5003
9633 -315242 -35356 -73847 -26348 71558 -27141 282768 -130959 -19742 246708 -143874 -324294
9622 -324294 -74787 74417 -17310 -236242 -134996 -56986 -83345 -194598 -234755 174915 -353797
9610 7069 -141279 12101 151385 -148133 -51713 283481 74786 20917 -178168 178484 131921
9599 131921 58058 -191176 -269500 78596 -129385 16562 -74870 125182 -140590 -314430 107083
9587 -72137 160376 -77723 -252663 -206995 -177201 -1101 39028 217221 10710 -246978 77097
9575 213366 -391149 67709 194359 95802 -303041 -46620 51142 -226045 -72289 -338422 -198829
9564 -198829 -229247 -42182 -39121 -206448 -39598 129695 -205233 -141830 26906 -411778 -278844
$$ packed form
9645a72303j34786e5686k17575o3625A88332e9174J6898k52017I4821a29801E003
9633c15242c5356l8491b6348G1558b7141B82768a30959a9742B46708a43874j80420
9622c24294g4787G4417a7310k18932J01246e6986k6359j11253m0157A74915c53797
9610G069a41279A2101J39284a48133e1713B83481G4786B0917a78168A78484m6563
9599A31921E8058a91176p8324G8596a29385A6562g4870A25182a40590j73840A07083
9587g2137A60376g7723j74940M5668K9794a101C9028J78193A0710b46978G7097
9575B13366c91149F7709J26650I5802c03041d6620E1142b26045g2289k66133J39593
9564a98829l0418d2182L061j67327c9598A29695b05233O3403B6906d11778J32934
$$ plain form
9553 -278844 -248030 292754 -255161 280580 32533 -81306 -126581 98382 -88304 -151523 -131244
9542 -131244 -166865 -339232 -89 -279201 324356 -142703 -90103 -70783 79044 -103948 268816
9530 214415 -330262 -97387 -197295 -181795 -253862 107593 -65268 -98615 -119376 -215524 64959
9518 -135212 226752 -84346 62940 -35634 139626 45060 228003 232788 71131 229183 165431
9507 165431 -221691 53566 80968 -100759 -29933 -391432 52246 -250913 -362028 190779
9496 -251475 -153690 -220816 111564 -286022 -534535 -261768 -107839 -6623 297881 -194325
9485 -40405 256009 -97578 -284162 -396246 -253318 -162839 -109763 241313 -34079 137038 -292905
9473 76867 -100220 289764 -84256 363932 135401 -329982 -188117 -527012 91134 -475673
$$ packed form
9553b78844L0814B92754b55161B80580C2533h1306m5275I8382h8304o3219K0279
9542a31244l5621j72367h9k79112C24356a42703N2600J9320G9044a03948B68816
9530B14415c30262i7387r9908J5500p2067A07593f5268l3347k0761r6148F4959
9518a35212B26752h4346F2940c5634A39626D5060J82943M785G1131J58052o3752
9507A65431b21691E3566K7402a00759b9933l61499E2246b50913j11115A90779
9496b51475R7785o7126A11564b86022k48513b61768a07839f623B97881a94325
9485d0405B56009i7578j86584j12084J42928R0479N3076B41313c4079A37038b92905
9473G6867a00220B89764h4256C63932A35401c29982J41865l38895I1134d75673
$$ plain form
9462 -164050 20653 -170321 -232 2236 -41320 -131826 -290064 14227 -99422 184900 231691 160149
9450 160149 115818 -338344 -71831 -200145 130354 92721 -206834 172782 -222166 134691
9439 -66253 58480 271505 -56112 -69281 -50686 -357475 -255919 -6914 220453 -130711 200038
9427 146207 -301780 -252219 -171161 -25487 -15829 -287862 -121463 76878 -223905 -136894 -298217
9416 -298217 130087 -129065 -11093 16980 109898 -347044 -144900 243280 -52299 -74371 -259645
9405 -259645 101731 -6951 -41033 -63254 48086 -474 75349 -39866 55587 -71602 -149570 7279
9392 -195371 -89439 -2448 -28854 91362 147559 -128914 -145689 -159325 -142648 94416 39407 -74829
9379 -184527 95755 -178725 240149 95684 -231319 2086 -263679 -77909 153509 94519 -337251
$$ packed form
9462a64050B0653a70321b32B236d1320r0506j58238A4227i9422A84900M6791p1542
9450A60149m4331c38344g1831j28314A30354l7633b06834A72782b22166A34691
9439f6253E8480K13025e6112j3169J8595l06789J01556f914B20453a30711B00038
9427A46207c01780M9561Q1058b5487R658k72033a21463G6878b23905Q7011j61323
9416b98217A30087a29065a1093A6980R2918c47044a44900B43280e2299k2072j85274
9405b59645A01731f951l4082k2221D8086d74G5349c9866E5587g1602p7968G279
9392a95371h9439b448k6406I1362N6197a28914j6775j3636J6677I4416C9407g4829
9379a84527I5755a78725B40149I5684b31319B086b63679g7909A53509n8990c37251
$$ plain form
9367 -203762 -198384 131384 -321617 58016 -388924 378808 -163451 85873 -124142 -101728 164490
9355 -204753 -47968 -33753 -282000 -92666 -87526 -107633 -78881 115997 -404123 -198676 -76940
9343 -171919 74059 141833 -44063 -177674 3743 -625023 133788 -192014 -96073 -58420 -123702
9332 -123702 -79056 159682 128544 -47652 -182561 -145229 -170927 -233951 -108038 162183 -119012
9320 125009 103741 94494 -396745 -78969 77525 67618 378372 -495574 10808 -223687 -293484
9309 -293484 -192599 -164481 -107283 -298436 -67668 186228 74706 4646 -345576 -240615 -8302
9297 -482659 -379163 219380 -368655 -357978 -204354 -345264 -194419 -10635 -217032 -117271
9287 -117271 -115046 10613 -97054 -115271 107051 -128564 -8766 -68044 -54782 -216735 182937
$$ packed form
9367b03762N378A31384c21617E8016c88924C78808a63451H5873a24142K2414A64490
9355b04753d7968J4215k48247i2666N140k0107K8752A15997d04123a98676g6940
9343a71919G4059O7774d4063j33611C743f25023A33788a92014R5941L7653o5282
9332a23702M4646A59682l1138d7652j34909L7332k5698o3024a08038A62183a19012
9320A25009k1268r247c96745g8969G7525r907L10754d95574A0808b23687o9797
9309b93484J00885K8118N7198j91153f7668A86228G4706D646c45576J04961h302
9297d82659J03496B19380c68655J0677J53624j40910J50845a0635k06397R9761
9287a17271K225A0613i7054j8217A07051a28564h766n9278J3262j61953A82937
$$ plain form
9275 -42468 55846 -78503 -46060 81835 -132497 -144101 99280 50340 -16562 -25177 -41890 143111
9262 -267970 73849 185623 41860 218452 -26760 -346581 32985 -100315 127749 -51680 18242
9250 229441 -191744 -242903 -187258 -56514 -210109 37773 -144931 9507 21113 71318 -209707
9238 -108658 -211251 -111988 -112301 34031 -273742 213042 -359553 -43885 -10253 -259349 23541
9226 142775 153645 97914 220143 63720 -251701 -191482 30190 -133887 -415487 -64476 49847
9214 -34482 160466 414302 -293240 -407834 211066 -218533 -135572 -284494 -146025 168877
9203 -8247 -74591 -157493 78198 -754673 66398 -269977 202455 -9189 144847 -253389 -165479
9192 -165479 -147709 -119071 113887 7892 -318099 -78136 19608 42636 -216609 27613 39055
$$ packed form
9275d2468E5846g8503L2443H1835a32497j1604I9280m8940a6562q615j6713A43111
9262b67970G3849J11774D1860J76592b6760l19821C2985a00315A27749e1680A8242
9250B29441a91744n1159N5645e6514j53595C7773a44931I507J1606N0205b09707
9238a08658j02593R9263l13C4031b73742B13042c59553d3885a0253k49096B3541
9226A42775J0870n5731J22229F3720b51701O0219C0190a33887k81600f4476D9847
9214c4482A60466K53836b93240j14594B11066b18533Q2961j48922J38469A68877
9203h247o6344q2902G8198g54673F6398b69977B02455i189A44847b53389Q7910
9192a65479J7770K8638A13887G892c18099g8136A9608K3028b16609B7613J1442
$$ plain form
9181 39055 -88078 46587 -132799 -20244 99735 -314604 -68001 -313666 123187 -492350 -3378
9169 -4666 35450 199863 -120730 -17983 145343 -90051 -266106 -399092 -443980 -30085 6807
9157 -9363 -284136 -90054 -388755 -167302 -197991 58178 -26515 148518 -325910 39295 77556
9146 77556 -201697 167342 4220 -425402 -44535 19748 -281890 318806 -35869 -173385 -242157
9135 -242157 -78688 -20218 -210822 45830 -255733 -28221 276088 -130040 -381641 -140835
9124 -327036 122621 142899 -6971 -63237 -51650 -21806 -151299 -176167 -69598 -433196 91521
9112 -276606 254019 1816 -226623 -157380 -125966 180223 -242504 63551 -259596 90434 35193
9100 -25036 50007 -277682 -416648 -53374 -315285 322053 -233682 -480648 -71948 81715 -143775
$$ packed form
9181C9055h8078D6587a32799b0244I9735c14604f8001k45665A23187d92350c378
9169d666C5450J64413a20730a7983A45343i0051j76055j32986m4888c0085F807
9157i363k74773i0054k98701a67302l0689E8178b6515A48518c25910C9295L8261
9146G7556b01697A67342D220d25402d4535A9748b81890C18806c5869j37516o8772
9135b42157g8688b0218j90604D5830b55733b8221B76088a30040k51601a40835
9124c27036A22621K0278f971n6266J1587b1806j29493k4868f9598l63598I1521
9112b76606B54019A816b26623O9243L1414A80223b42504F3551b59596I0434C5193
9100b5036E0007b77682j38966e3374k61911C22053b33682k46966g1948H1715a43775
$$ plain form
9088 -59028 30717 183440 -48802 -230781 -154755 90072 -120621 -79936 18240 -96251 7588
9076 27437 31777 74725 66557 140488 111941 -36523 7685 -232778 -230832 389848 182980 -112821
9063 -454383 -50702 -30628 -3525 -49210 -224489 -29806 -67625 -250057 141096 161161 -171894
9051 -69117 -104738 -299728 -314427 -22697 68943 900 -201172 -350971 103862 79199 82247 145237
9039 145237 94058 -197846 -116427 68713 124603 102707 -28043 -175625 41365 316127 -343890
9027 505187 -252112 -114791 -100523 20357 -37278 -537266 -40864 -112682 213142 -141295 -113354
9016 -113354 94099 84733 -87491 -146534 -200466 155403 -175772 -213314 -209068 -264651 -69733 126285
9003 -43882 -287350 -30426 -31495 67018 81151 424077 -108897 -291054 -359882 -94641 21490
$$ packed form
9088e9028C0717J52723d8802j81979P6026I0072a20621M0685A8240i6251G588
9076B7437M340M2948q168P3931k8547c6523G685b32778J946C89848A82980a12821
9063d54383e0702K0074c525m5685j75279b9806l7819j82432A41096K0065a71894
9051f9117l5621j94990j4699b2697F8943I00b01172j49799A03862k4663L048O2990
9039A45237n1179a97846Q1419F8713N5890k1896b8043j47582D1365K74762c43890
9027E05187b52112a14791J4268B0357c7278m99988d0864p1818B13142a41295K7941
9016a13354I4099r366h7491n9043n3932A55403a75772l7542M246n5583f9733A26285
9003d3882k43468c0426j069F7018J4133L42926a08897j82157o8828i4641B1490
$$ plain form
8991 -43276 -116994 -107856 29547 62495 -150706 172976 -235450 -305153 -6061 154213 -6835 -249296
8979 -249296 183135 -783 -168091 13355 272502 120664 260179 -154158 -1673 -247530 65731
8967 260008 -40120 305698 -280007 121065 -131335 222791 -149863 89318 39217 51215
8957 51215 -287028 -2926 34877 -356890 -67379 -229863 44481 27761 75678 221947 24644
8945 95122 162011 -263127 -144476 -6731 42997 -255685 -190364 42738 -93606 204047 127617
8934 127617 239564 -11513 25828 6910 -276166 54922 -33278 -108824 428232 141353 377034
8923 377034 1252588 4647428 8716890 4278413 1826653 349442 301595 428985 14329
8913 -55361 -85082 415079 -262084 -219169 -26011 -6849 -119187 -83933 -81336 366527 89480
$$ packed form
8991d3276p3718R138B9547L2948a50706A72976b35450o9703f061A54213f835k42461
8979b49296A83135g83j67308A3355K59147A20664J39515a54158a673k45857F5731
8967B60008d0120C05698b80007A21065a31335B22791a49863H9318C9217J1998
8957E1215b87028b926C4877c56890f7379j62484D4481j6720M7917J46269B4644
8945I5122O6889b63127J18651f731D2997b55685O5321D2738i3606B04047p6430
8934A27617J11947a1513B5828F910b76166E4922c3278p5546D28232A41353K35681
8923C77034Q75554L394840M069462D278413A826653C49442m7847J27390A4329
8913e5361k9721D15079b62084M2915b6011f849j12338L5254K597C66527H9480
$$ plain form
8901 -31558 133200 -158191 -188332 -30013 -231549 -237865 23146 -137885 -112242 -460754 -51685
8889 209757 29739 -306682 -122798 -202318 -157007 -10982 -30837 -327979 -45056 74376 -191962
8877 18713 1068 -188856 -8317 -90757 271483 -8858 73549 84762 -58440 -20800 64125 -11772
8864 -201639 -223284 -23144 -228790 -183919 326564 -210917 54094 -76235 -129034 53935 -312271
8852 -57201 -36783 171651 -4583 -145255 63137 1239 -27898 -131307 -93054 -333560 130291
$$ packed form
8901c1558A33200a58191l0141c0013k01536o316B3146a37885K5643l48512e1685
8889B09757B9739c06682a22798p9520M5311a0982j9855k97142d5056G4376a91962
8877A8713A068a88856h317q2440B71483h858G3549J1213e8440b0800F4125a1772
8864b01639k1645b3144k05646M4871C26564b10917E4094g6235n2799E3935c12271
8852e7201K0418A71651d583j40672F3137A239b7898j03409L8253k40506A30291
$$ [...]
##END NTUPLES=NMR SPECTRUM
##END=
