##TITLE=AC1627_CENAH_8450474_PSb4FjsyFP
##JCAMPDX= 6.0         $$ Bruker NMR JCAMP-DX V2.0
##DATA TYPE= NMR SPECTRUM
##DATA CLASS= NTUPLES
##ORIGIN= BRUKER
##OWNER= Administrator
$$ 1.72 TOPSPIN		Version 2.1
$$ 2014-02-18 14:59:41.468 -0800  Administrator@X
$$ Compression mode = diff/dup
##.OBSERVE FREQUENCY= 400.02188249412
##.OBSERVE NUCLEUS= ^1H
##.ACQUISITION MODE= SIMULTANEOUS (DQD)
##.ACQUISITION SCHEME= undefined
##.AVERAGES= 64
##.DIGITISER RES= 22
##SPECTROMETER/DATA SYSTEM= spect
##.PULSE SEQUENCE= noesygpps1d.comp
##.SOLVENT NAME= COFFEE_meoh
##.SHIFT REFERENCE= INTERNAL, COFFEE_meoh, 1, 14.96114
##AUDIT TRAIL= $$ (NUMBER, WHEN, WHO, WHERE, PROCESS, VERSION, WHAT)
$$ ##TITLE= Audit trail, TOPSPIN		Version 2.1
$$ ##JCAMPDX= 5.01
$$ ##ORIGIN= Bruker BioSpin GmbH
$$ ##OWNER= Administrator
$$ $$ E:\/data/COFFEE/nmr/AC1627_CENAH_8450474_PSb4FjsyFP/12/pdata/1/auditp.txt
$$ ##AUDIT TRAIL=  $$ (NUMBER, WHEN, WHO, WHERE, PROCESS, VERSION, WHAT)
(   1,<2014-02-18 14:59:36.609 -0800>,<Administrator>,<X>,<go>,<TOPSPIN 2.1>,
      <created by zg
	started at 2014-02-18 14:48:07.201 -0800,
	POWCHK enabled, PULCHK disabled,
       configuration hash MD5:
       C8 4E 4E 5D D3 5C D8 9E 9F 52 82 E0 59 8A DE 15
       data hash MD5: 64K
       00 EC E1 7C D1 E1 48 A7 CF CC 6E 5C D9 37 0A 7A>)
(   2,<2014-02-18 14:59:39.546 -0800>,<Administrator>,<X>,<proc1d>,<TOPSPIN 2.1>,
      <Start of raw data processing
       efp LB = 0.3 FT_mod = 6 PKNL = 1 PHC0 = 0 PHC1 = 0 SI = 128K 
       data hash MD5: 128K
       30 A6 48 1D 81 1A 9E F6 9B 90 11 2D 19 4F 41 C8>)
(   3,<2014-02-18 14:59:40.515 -0800>,<Administrator>,<X>,<proc1d>,<TOPSPIN 2.1>,
      <pk PHC0 = -82.21619 PHC1 = 0 
       data hash MD5: 128K
       DF 2B 4A 3C 41 A4 F1 CD 39 0A 87 68 BD 69 1A B4>)
(   4,<2014-02-18 14:59:40.890 -0800>,<Administrator>,<X>,<proc1d>,<TOPSPIN 2.1>,
      <abs ABSG = 1 
       data hash MD5: 128K
       C1 2D A7 46 3B DC 2C B4 AE 81 B6 9B 1C 3D 59 26>)
(   5,<2014-02-18 14:59:40.999 -0800>,<Administrator>,<X>,<proc1d>,<TOPSPIN 2.1>,
      <abs ABSG = 2 
       data hash MD5: 128K
       6A A0 35 11 A3 4A 00 69 94 6D A2 14 32 35 41 18>)
(   6,<2014-02-18 14:59:41.093 -0800>,<Administrator>,<X>,<proc1d>,<TOPSPIN 2.1>,
      <abs ABSG = 3 
       data hash MD5: 128K
       6C 9B E5 BB 2B 80 7B 08 BE 97 1C CA 24 42 39 2D>)
(   7,<2014-02-18 14:59:41.202 -0800>,<Administrator>,<X>,<proc1d>,<TOPSPIN 2.1>,
      <abs ABSG = 4 
       data hash MD5: 128K
       9D DD 51 A5 47 BE CD B0 E8 CB EE 65 9E D7 39 69>)
(   8,<2014-02-18 14:59:41.281 -0800>,<Administrator>,<X>,<proc1d>,<TOPSPIN 2.1>,
      <abs ABSG = 5 
       data hash MD5: 128K
       21 22 12 4F 7F 7C 81 E6 98 1B EE 12 D5 9B 07 68>)
$$ ##END=
$$ 
$$ $$ hash MD5
$$ $$ 9E 7B 9B BE 7C D3 22 6F A6 BE C0 E9 F9 B1 5B AA
##$RELAX= 
##$RELAX= 
##$RELAX= 
##$RELAX= 
##$RELAX= 
##$RELAX= 
##$RELAX= 
##$RELAX= 
$$ Bruker specific parameters
$$ --------------------------
##$DU= <E:\>
##$EXPNO= 12
$$ [...]
##$TP07= 0
##$TPNAME0= <>
##$TPNAME1= <>
##$TPNAME2= <>
##$TPNAME3= <>
##$TPNAME4= <>
##$TPNAME5= <>
##$TPNAME6= <>
##$TPNAME7= <>
##$TPOAL= (0..7)
0.5 0.5 0.5 0.5 0.5 0.5 0.5 0.5
##$TPOFFS= (0..7)
0 0 0 0 0 0 0 0
##$TUNHIN= 0
##$TUNHOUT= 0
##$TUNXOUT= 0
##$USERA1= <user>
##$USERA2= <user>
##$USERA3= <user>
##$USERA4= <user>
##$USERA5= <user>
##$V9= 5
##$VALIST= <valist>
##$VCLIST= <CCCCCCCCCCCCCCC>
##$VD= 0
##$VDLIST= <DDDDDDDDDDDDDDD>
##$VPLIST= <PPPPPPPPPPPPPPP>
##$VTLIST= <TTTTTTTTTTTTTTT>
##$WBST= 2048
##$WBSW= 25
##$XGAIN= (0..3)
0 0 0 0
##$XL= 0
##$YL= 0
##$YMAX_a= 6103046
##$YMIN_a= -13339013
##$ZGOPTNS= <>
##$ZL1= 120
##$ZL2= 120
##$ZL3= 120
##$ZL4= 120
##$ABSF1= 14.96114
##$ABSF2= -5.597042
##$ABSG= 5
##$ABSL= 3
##$ALPHA= 0
##$AQORDER= 0
##$ASSFAC= 0
##$ASSFACI= 0
##$ASSFACX= 0
##$ASSWID= 0
##$AUNMP= <proc_prof1d_extract.lims>
##$AXLEFT= 0
##$AXNAME= <>
##$AXNUC= <1H>
##$AXRIGHT= 0
##$AXTYPE= 0
##$AXUNIT= <>
##$AZFE= 0.1
##$AZFW= 0.1
##$BCFW= 0
##$BC_mod= 0
##$BYTORDP= 0
##$COROFFS= 0
##$CY= 15
##$DATMOD= 1
##$DC= 0
##$DFILT= <>
##$DTYPP= 0
##$F1P= 0
##$F2P= 0
##$FCOR= 0.5
##$FTSIZE= 131072
##$FT_mod= 6
##$GAMMA= 0
##$GB= 0
##$INTBC= 1
##$INTSCL= 1
##$ISEN= 128
##$LB= 0.3
##$LEV0= 0
##$LPBIN= 0
##$MAXI= 10000
##$MC2= 0
##$MEAN= 0
##$ME_mod= 0
##$MI= 0
##$NCOEF= 0
##$NC_proc= -2
##$NLEV= 6
##$NOISF1= 0
##$NOISF2= 0
##$NSP= 0
##$NTH_PI= 0
##$NZP= 0
##$OFFSET= 14.96114
##$PC= 1
##$PHC0= -82.21619
##$PHC1= 0
##$PH_mod= 1
##$PKNL= yes
##$PPARMOD= 0
##$PPDIAG= 0
##$PPIPTYP= 0
##$PPMPNUM= 2147483647
##$PPRESOL= 1
##$PSCAL= 4
##$PSIGN= 0
##$PYNMP= <proc.py>
##$REVERSE= no
##$SF= 400.020009581345
##$SI= 131072
##$SIGF1= 0
##$SIGF2= 0
##$SINO= 400
##$SIOLD= 131072
##$SPECTYP= <>
##$SREGLST= <1H.CDCl3>
##$SSB= 0
##$STSI= 131072
##$STSR= 0
##$SW_p= 8223.68421052631
##$SYMM= 0
##$S_DEV= 0
##$TDeff= 65536
##$TDoff= 0
##$TI= <>
##$TILT= no
##$TM1= 0
##$TM2= 0
##$TOPLEV= 0
##$USERP1= <user>
##$USERP2= <user>
##$USERP3= <user>
##$USERP4= <user>
##$USERP5= <user>
##$WDW= 1
##$XDIM= 131072
##$YMAX_p= 436900740
##$YMIN_p= -10991
##$CURPLOT= <Network HP LaserJet P1505>
##$CURPRIN= <$Network HP LaserJet P1505>
##$DFORMAT= <normdp>
##$LAYOUT= <+/1D_H.xwp>
##$LFORMAT= <normlp>
##$PFORMAT= <normpl>
##$SURQMSG= 1
$$ End of Bruker specific parameters
$$ ---------------------------------
##NTUPLES= NMR SPECTRUM
##VAR_NAME=  FREQUENCY,     SPECTRUM/REAL,   SPECTRUM/IMAG
##SYMBOL=    X,             R,               I
##VAR_TYPE=  INDEPENDENT,   DEPENDENT,       DEPENDENT
##VAR_FORM=  AFFN,          ASDF,            ASDF
##VAR_DIM=   131072,        131072,          131072
##UNITS=     HZ,            ARBITRARY UNITS, ARBITRARY UNITS
##FACTOR=    0.0627417313425164, 1,          1
##FIRST=     8223.62146879497, 2049,         -61068
##LAST=      0,             3421,            -61271
##MIN=       0,             -10991,          0
##MAX=       8223.62146879497, 436900740,    0
$$ Real data points
##PAGE= N=1
##DATA TABLE= (X++(R..R)), XYDATA
$$ [...]
63892A095036l6075l3095l0784k9023k8025k8011k8328k7808k6153k4176k2536
63881G81022k0999j9255j7505j5801j3504j0175o437l278q12J582M172O697R092
63868F94799J1556J3950J5819J7268J9041K1407K3515K4303K3726K2688K1930
63857I10002K1406K0590J9013J6539J3462J0416P887N719L256J22l343o547r353
63844A009169j2080j4902j7575j9862k1943k4168k6542k8677l0196l1019l1308
63833G50897l1258l0975l0376k9295k7765k6135k4697k3321k1629j9528j7316
63822D68602j5323j3679j2446j1674j1261j0988j0694j0250r429q116o646n575
63810C42521n049m688m192l668l254k761k011j198p09o56r03j354k055k977l867
$$ y = [1095036, 1058961, 1025866, 995082, 966059, 938034, 910023, 881695, 853887, 827734, 803558, 781022, 760023, 740768, 723263, 707462, 693958, 683783, 677346, 674068, 673256, 674838, 679010, 685707, 694799, 706355, 720305, 736124, 753392, 772433, 793840, 817355, 841658, 865384, 888072, 910002, 931408, 951998, 971011, 987550, 1001012, 1011428, 1019315, 1025034, 1028290, 1028412, 1025069, 1018522, 1009169, 997089, 982187, 964612, 944750, 922807, 898639, 872097, 843420, 813224, 782205, 750897, 719639, 688664, 658288, 628993, 601228, 575093, 550396, 527075, 505446, 485918, 468602, 453279, 439600, 427154, 415480, 404219, 393231, 382537, 372287, 362858, 354742, 348096, 342521, 337472, 332784, 328592, 324924, 321670, 318909, 316898, 315700, 314991, 314335, 313432, 312078, 310023, 307046, 303179]
63795C03179m342m214l725l328l127k808k346k410l465m753m887l500j625m02
63781B58247q6l98r92j332r27j09J60l60p97n98m33r60j561j232j43O92Q59O63
63763B50693K33m61r65p73k32r2k58o8L65K35m43o36J21R89J166R61R86J112R11
63744B53844N55N45R85J582K071K225J843J120P09J020J718K213K275J997J509
63729B76211J083J134J772K590L136L359L414L399L496L953M657N000M491L307
63715C21002K056J256J060J147Q13l47j770k415k074j571j564j742j572j111o26
63700C12542o3N96J005J062J309K141L091L505L514L594L615L128K298J685J310
63685C44332P46K5l10p9K96M85N50N40M10L45N86R02Q42M57J31k20r57j728j622
$$ y = [303179, 298837, 294623, 290898, 287570, 284443, 281635, 279289, 276879, 273414, 268661, 263774, 260274, 258649, 258247, 258161, 257763, 256771, 255439, 254512, 254403, 254563, 254203, 253406, 252808, 252375, 251415, 249854, 248622, 248479, 249171, 250030, 250693, 250926, 250465, 249500, 248727, 248495, 248403, 248145, 248077, 248442, 248677, 248234, 247598, 247719, 248708, 249874, 250835, 251821, 252933, 253844, 254399, 254944, 255929, 257511, 259582, 261807, 263650, 264770, 265479, 266499, 268217, 270430, 272705, 274702, 276211, 277294, 278428, 280200, 282790, 285926, 289285, 292699, 296098, 299594, 303547, 308204, 313204, 317695, 321002, 323058, 324314, 325374, 326521, 327334, 326987, 325217, 322802, 320728, 319157, 317593, 315851, 314279, 313168, 312542, 312479, 313075, 314080, 315142, 316451, 318592, 321683, 325188, 328702, 332296, 335911, 339039, 341337, 343022, 344332, 345078, 345103, 344793, 344714, 345010, 345495, 346045, 346585, 346995, 347340, 347926, 348828, 349670, 350127, 350258, 350038, 349081, 347353, 345731]
63666C45731o02J66r0o64n52j3j25j198k433l037k978k702k663l108l873m373
63650C17486m183l629l374l477l299k400j095j6N47O41L97K0r0M18J471K576L286
63633C05279L548L604L599L476L297L437M141M960N109M558M319N221O768P791
63619C69107Q020Q314R349J0799J2066J3140J4356J5813J7498J9557K1859K3737
63607E43615K4700K5164K5792K6348K5931K4177K1461J7929J3349Q138L542L04
63595G60450k108m281n676n544m513m192n331p276r267j1298j3513j5632j7441
63582F54378j9204k0964k1899k1026j8476j5494j3218j1775j0579r140p370n340
63570D79893l139r58Q31J955K537K959L383L616L508L325L446L876M247M347M457
$$ y = [345731, 345129, 345295, 345205, 344541, 343989, 343976, 343851, 342653, 340220, 337183, 334205, 331503, 328840, 325732, 321859, 317486, 313303, 309674, 306300, 302823, 299524, 297124, 296029, 296013, 296560, 297201, 297598, 297618, 297528, 297946, 299417, 301993, 305279, 308827, 312431, 316030, 319506, 322803, 326240, 330381, 335341, 340450, 345008, 349327, 354548, 361316, 369107, 377127, 385441, 394790, 405589, 417655, 430795, 445151, 460964, 478462, 498019, 519878, 543615, 568315, 593479, 619271, 645619, 671550, 695727, 717188, 735117, 748466, 756604, 760146, 760450, 758342, 754061, 748385, 742841, 738328, 734136, 728805, 721529, 712262, 700964, 687451, 671819, 654378, 635174, 614210, 592311, 571285, 552809, 537315, 524097, 512322, 501743, 492603, 485233, 479893, 476754, 475796, 476627, 478582, 481119, 484078, 487461, 491077, 494585, 497910, 501356, 505232, 509479, 513826, 518283]
63555E18283N124O701R013J1449J3509J5381J7775K1116K5083K9010L2467L5137
63543G40048L6439L5587L2021K5684J7242Q270P24m365p448r391j0235r615p969
63530H46992o448n732n746o493q360j1395j5083j9001k3018k6628k8902k9414
63518F60772k8638k7134k5051k2708k0830j9656j8466j6618j4525j2925j1725
63507D42496j0303q630p341o766o577o322n848n212m574m080l573k614j189p3
63493C69394n4r43j829k179k163k016j642j008m43l34o12p23j11J198K544L290
63477C62369L472L484L290K491J230L06J23J42j89o56r12j245k009k800l053l022
63461C63021l345l894l949l329k517j748q65nM28N40Q98J571K094K480L374M875
$$ y = [518283, 523407, 530108, 539121, 550570, 564079, 579460, 597235, 618351, 643434, 672444, 704911, 740048, 776487, 812074, 844095, 869779, 887021, 895291, 896015, 891650, 884202, 874811, 864576, 854961, 846992, 840544, 834812, 829066, 822573, 814213, 802818, 787735, 768734, 745716, 719088, 690186, 660772, 632134, 605000, 579949, 557241, 536411, 516755, 498289, 481671, 467146, 454221, 442496, 432193, 423563, 416222, 409456, 402879, 396557, 390709, 385497, 380923, 376843, 373270, 370656, 369467, 369394, 369340, 368397, 366568, 364389, 362226, 360210, 358568, 357560, 357117, 356783, 356171, 355448, 355337, 356535, 359079, 362369, 365841, 369325, 372615, 375106, 376336, 376642, 376765, 376907, 376718, 376062, 375150, 373905, 371896, 369096, 366043, 363021, 359676, 355782, 351833, 348504, 345987, 344239, 343374, 343369, 343797, 344337, 345235, 346806, 348900, 351380, 354754, 359629]
63445C59629O126O514O566O988P536P585P423Q140J0250J3145J6016J8825K2012
63432D96755K5448K8038K8511K6509K2767J8272J3635R321O005M187L702M205
63420F87355N929R372J4219J9194K3204K6081K8024K8886K8370K6575K3885K0423
63408I41517J5956J0351M134j408m923o107o043o106o671p299p970r411j2101
63395I03919j5637j9277k2598k5337k7145k7910k7959k7611k6902k5926k4977
63384F32640k3969k2235j9359j5907j2823j0374q176o020m127k590j084O80K552
63371E09208M063M954N482O233P491Q834R591R785J0228J1558J3545J5642J7805
63358F34419K0327K3104K5615K7580K9165L0456L1029L0222K7652K3471J8279
$$ y = [359629, 365755, 372269, 378835, 385823, 393359, 400944, 408367, 416507, 426757, 439902, 455918, 474743, 496755, 522203, 550241, 578752, 605261, 628028, 646300, 659935, 669256, 675261, 679448, 683150, 687355, 693284, 702656, 716875, 736069, 759273, 785354, 813378, 842264, 870634, 897209, 921094, 941517, 957473, 967824, 971958, 970550, 965627, 959520, 953477, 947371, 940700, 933401, 925431, 916020, 903919, 888282, 869005, 846407, 821070, 793925, 766015, 738056, 710445, 683543, 657617, 632640, 608671, 586436, 567077, 551170, 538347, 527973, 519797, 513777, 509650, 507060, 505976, 506656, 509208, 513271, 518225, 523707, 529940, 537431, 546265, 555856, 565641, 575869, 587427, 600972, 616614, 634419, 654746, 677850, 703465, 731045, 760210, 790666, 821695, 851917, 879569, 903040, 921319]
63347I21319J2876P905L632L4k926n176o664p531q142q905j0007j1419j3231j5751
63333H56014j9015k2341k4826k6217k6873k6923k5980k3877k1124j8280j5396
63322F05162j2350r300o360l317l09J528Q63k423p075j1616j5148j7143j7320
63309E05192j5997j4090j2374j0919r425p787o145m620l313k355j734j185m91
63296D14757J30K26l66j317k180k808l293l570l379k757k288k545l249l514k962
63281C80885k292k352k971l200k549j504p41l87k03p1RJ00K21K40J71L69J105
63264C66830K072K626K512K090J859K066K746L773M756N216N060M709M539M490
63250D15344M394M369M624N090N660O594Q176J0107J1725J2808J3705J4709J5775
$$ y = [921319, 934195, 942100, 945732, 945766, 942840, 937664, 931000, 923469, 915327, 906422, 896415, 884996, 871765, 856014, 836999, 814658, 789832, 763615, 736742, 709819, 683839, 659962, 638838, 620558, 605162, 592812, 583512, 577152, 573835, 573526, 575054, 575917, 573494, 566419, 554803, 539655, 522512, 505192, 489195, 475105, 462731, 451812, 442387, 434600, 428455, 423835, 420522, 418167, 416433, 415248, 414757, 414887, 415113, 414747, 413430, 411250, 408442, 405149, 401579, 398200, 395443, 393155, 390610, 387361, 383847, 380885, 378593, 376241, 373270, 370070, 367521, 366017, 365276, 364889, 364686, 364615, 364624, 364724, 364945, 365185, 365356, 365725, 366830, 368902, 371528, 374040, 376130, 377989, 380055, 382801, 386574, 391330, 396546, 401606, 406315, 410854, 415344, 419738, 424107, 428731, 433821, 439481, 446075, 454251, 464358, 476083, 488891, 502596, 517305, 533080]
63237E33080J6976J8587K0651K2857K5116K7614L0190L2238L3557L4626L5669
63226H31161L6181L5849L5255L4937L4470L3376L2300L2218L2889L3318L3379
63215A205333L3792L4550L4768L4096L2908L0856K6668K0065J2571N602j245r049
63203A460915j7625k5707l2448l7810m1936m4989m7152m8099m6964m3623l9502
63192A035060l6125l3328k9872k5479k1066j7186j3419r541o131l565j210J799
63180H39937N431Q833J1259J2650J3472J4167J4718J4815J4472J4179J4184J4072
63168I92189J3495J2827J2480J1973J0476Q012N311K532q63m974r196j3181j7134
63155A023947k0872k3562k4916k5775k6888k7814k7686k6559k5205k3922k2260
$$ y = [533080, 550056, 568643, 589294, 612151, 637267, 664881, 695071, 727309, 760866, 795492, 831161, 867342, 903191, 938446, 973383, 1007853, 1041229, 1073529, 1105747, 1138636, 1171954, 1205333, 1239125, 1273675, 1308443, 1342539, 1375447, 1406303, 1432971, 1453036, 1465607, 1471209, 1469964, 1460915, 1443290, 1417583, 1385135, 1347325, 1305389, 1260400, 1213248, 1165149, 1118185, 1074562, 1035060, 998935, 965607, 935735, 910256, 889190, 872004, 858585, 849044, 842913, 839348, 838138, 839937, 845368, 854201, 865460, 878110, 891582, 905749, 920467, 935282, 949754, 963933, 978117, 992189, 1005684, 1018511, 1030991, 1042964, 1053440, 1061452, 1066763, 1069295, 1068432, 1063458, 1054262, 1041081, 1023947, 1003075, 979513, 954597, 928822, 901934, 874120, 846434, 819875, 794670, 770748, 748488]
63144G48488j9884j7173j4895j3512j2711j1539r335o610m655l992l757k941j711
63131F25773r19o90k93P13J932K796L306L889M866O172P399Q043P910P268O502
63116F84667N727M939M291L937L616K918J904J111Q55Q25N66Q1k03P2Q35J569
63100G17710J580N20j179k522k828k345j883j873j981j629p13K81P46M91r5l33
63084G03947J90J259K327L163L998M919N509N471N376O112P581Q708Q924Q971
63070G76455R744J0947J1652J1746J1990J2743J3630J4552J6182J9031K2606K5996
63058I57274K8913L1772L5051L8878M3068M7337N1622N6254O1475O6770P1156
63047A489570P4367P7190Q0261Q3048Q4591Q4844Q4617Q4293Q3395Q1625P9647
$$ y = [748488, 728604, 711431, 696536, 683024, 670313, 658774, 649439, 642829, 638174, 634182, 630425, 627484, 625773, 624854, 624164, 623871, 624584, 626516, 629312, 632618, 636507, 641373, 647545, 654944, 662987, 670897, 678165, 684667, 690394, 695333, 699624, 703561, 707177, 710095, 711999, 713110, 713965, 714790, 715356, 715437, 715234, 715306, 716141, 717710, 719290, 719810, 718631, 716109, 713281, 710936, 709053, 707180, 705199, 703570, 702857, 703138, 703884, 704375, 704280, 703947, 704137, 705396, 707723, 710886, 714884, 719803, 725312, 730783, 736159, 742271, 749852, 758560, 767484, 776455, 786199, 797146, 808798, 820544, 832534, 845277, 858907, 873459, 889641, 908672, 931278, 957274, 986187, 1017959, 1053010, 1091888, 1134956, 1182293, 1233915, 1290169, 1351644, 1418414, 1489570, 1563937, 1641127, 1721388, 1804436, 1889027, 1973871, 2058488, 2142781, 2226176, 2307801, 2387448]
63036B387448P8517P8515P8950P9003P8496P7749P6691P4339O9307O0881M9497
63025C189393L6212K1780O250j0743k9273m8471o6557q1846r3784j02813j09266
63014B710882j12913j13634j11923j08335j02907r5471q6303p6075o5494n5261
63004A782566m5997l7768l0025k2325j4843p817j119N112J0027J3113J5220J7565
62992A683709K0063K1745K2597K3690K5334K6487K6437K5845K5399K4532K2383
62981A948221J9156J5410J0683M130l831j1732j8899k5940l3256m0142m5744n0017
62969A768039n3200n5061n5305n4373n3113n1855n0271m8078m5447m2745m0197
62958A218394l7837l5620l3467l1425k9722k8521k7683k6858k5851k4715k3493
$$ y = [2387448, 2465965, 2544480, 2623430, 2702433, 2780929, 2858678, 2935369, 3009708, 3079015, 3139896, 3189393, 3225605, 3247385, 3253635, 3242892, 3213619, 3165148, 3098591, 3016745, 2922961, 2820148, 2710882, 2597969, 2484335, 2372412, 2264077, 2161170, 2065699, 1979396, 1903321, 1837827, 1782566, 1736569, 1698801, 1668776, 1646451, 1631608, 1623791, 1622672, 1627784, 1637811, 1650924, 1666144, 1683709, 1703772, 1725517, 1748114, 1771804, 1797138, 1823625, 1850062, 1875907, 1901306, 1925838, 1948221, 1967377, 1982787, 1993470, 1997600, 1993769, 1982037, 1963138, 1937198, 1903942, 1863800, 1818056, 1768039, 1714839, 1659778, 1604473, 1550100, 1496987, 1445132, 1394861, 1346783, 1301336, 1258591, 1218394, 1180557, 1144937, 1111470, 1080045, 1050323, 1021802, 994119, 967261, 941410, 916695, 893202]
62947H93202k2106k0559j9115j8086j7499j7014j6244j5064j3649j2277j1111
62936G10478j0130r196q216p211o159m873l225j536m47k36m00l07j1j02p09j291
62920F56429j462j564k041k703l067l184l553m303n022n430n702n994o093n822
62906F00489n379n030m656m055l468l390l856m267m040l215k258j486r03n21m94
62891E53471q33j251j468j546j623j503r21j99m2m71n15N43J960K291J211j36
62875E48968o61n51o36j124j448j124l30K66O5r96k285k948k740k194j921j868
62859E28473j493n03Q21J847K044J406N65L05P28J171J081O48L20O6l79q76j043
62842E35181r21r59j291j591j672j768k103k485k538k079j207k65K83K30r8k21
$$ y = [893202, 871096, 850537, 831422, 813336, 795837, 778823, 762579, 747515, 733866, 721589, 710478, 700348, 691152, 682936, 675725, 669566, 664693, 661468, 659932, 659485, 659249, 658849, 658542, 658531, 658429, 657720, 656429, 654967, 653403, 651362, 648659, 645592, 642408, 638855, 634552, 629530, 624100, 618398, 612404, 606311, 600489, 595110, 590080, 585424, 581369, 577901, 574511, 570655, 566388, 562348, 559133, 556875, 555389, 554486, 553965, 553471, 552638, 551387, 549919, 548373, 546750, 545247, 544326, 544127, 544085, 543614, 543099, 543642, 545602, 547893, 549104, 548968, 548307, 547756, 547120, 545996, 544548, 543424, 543094, 543360, 543425, 542429, 540144, 537196, 534456, 532262, 530341, 528473, 526980, 526477, 527298, 529145, 531189, 532595, 533160, 533465, 534193, 535364, 536445, 537093, 537413, 537479, 537100, 536224, 535181, 534260, 533301, 532010, 530419, 528747, 526979, 524876, 522391, 519853, 517774, 516567, 516302, 516585, 516815, 516717, 516496]
62826E16496j09n5J6N62J604K451K522K098J941K454L517M822O020O739O852O690
62810E64620O725P052P393P542P618P842Q218Q438Q157P476P099P777R549J1670
62796F77176J3291J4088J4319J4692J6052J8717K1938K4549K6369K8521L2133
62785I01845L7165M2934M9160N5952O3119P0296P7589Q5428R3763J02015J09918
62774A689184J17765J25611J32579J37292J38770J36840J31770J23614J11915
62765B845340R6297P7418N6934L6069J4614q031l1105n2690p1593q7992j02018
62754B773243j12826j19833j23886j26192j26617j24223j19212j13174j07233
62745A700047j01090r4281q7348q1033p5077o8770o2312n6632n1985m7601m2925
$$ y = [516496, 516387, 516332, 516348, 516910, 518514, 520965, 523487, 525585, 527526, 529980, 533497, 538319, 544339, 551078, 557930, 564620, 571345, 578397, 585790, 593332, 600950, 608792, 617010, 625448, 633605, 641081, 648180, 655957, 665506, 677176, 690467, 704555, 718874, 733566, 749618, 768335, 790273, 814822, 841191, 869712, 901845, 939010, 981944, 1031104, 1087056, 1150175, 1220471, 1298060, 1383488, 1477251, 1579266, 1689184, 1806949, 1932560, 2065139, 2202431, 2341201, 2478041, 2609811, 2733425, 2845340, 2941637, 3019055, 3075989, 3112058, 3126672, 3118641, 3087536, 3034846, 2963253, 2875261, 2773243, 2660417, 2540584, 2416698, 2290506, 2163889, 2039666, 1920454, 1807280, 1700047, 1598957, 1504676, 1417328, 1336295, 1261218, 1192448, 1130136, 1073504, 1021519, 973918, 930993]
62734I30993l8335l4298l0502k6480k2596j9724j8100j7021j5697j3915j1932
62723F82393j0140q895q189p454o098m302k831j965j097L92K368M402O416Q409
62709F53409R927J0594J1045J2637J6003K0281K4083K6938K9523L2655L6334L9890
62697I23319M2918M5875M9590N4309N9447O4195O8006P0419P0904O9253O5835
62686A584070O1110N5030M7183L7427K6087J3724R96j1408k3042l3851m3808n2580
62674A660938n9757o5133o8475o9414o8162o5906o3829o1814n8927n5019n0986
62663I73516m7387m3729l9508l5180l1521k8704k6508k4857k3494k1653j8898
62652F32077j5981j4130j3477j2951j1771j0390r682r773r978r564q301o470m642
$$ y = [930993, 892658, 858360, 827858, 801378, 778782, 759058, 740958, 723937, 708240, 694325, 682393, 672253, 663358, 655169, 647715, 641617, 637315, 634484, 632519, 631422, 631814, 634182, 638584, 645000, 653409, 663336, 673930, 684975, 697612, 713615, 733896, 757979, 784917, 814440, 847095, 883429, 923319, 966237, 1012112, 1061702, 1116011, 1175458, 1239653, 1307659, 1378078, 1448982, 1518235, 1584070, 1645180, 1700210, 1747393, 1784820, 1810907, 1824631, 1825627, 1814219, 1791177, 1757326, 1713518, 1660938, 1601181, 1536048, 1467573, 1398159, 1329997, 1264091, 1200262, 1138448, 1079521, 1024502, 973516, 926129, 882400, 842892, 807712, 776191, 747487, 720979, 696122, 672628, 650975, 632077, 616096, 601966, 588489, 575538, 563767, 553377, 543695, 533922, 523944, 514380, 506079, 499609, 494967]
62639D94967l320k553j957j189l45K38M13K92n2p04j651k538k877k563k035j831
62623D72295k000k012j308J05J539K159J768J074J127K297L949N231N973O587
62609D98784P278P766P852P848Q184Q945J0023J1492J3515J5980J8629K1562K5220
62596F63078K9688L4347L8546M2471M6978N2365N7776O2083O5082O7268O8543
62585A228225O7904O4599N9100N2356M4582L5307K4383J2304l73j3162k5146l5059
62573A515020m2272m7282n1020n3976n6199n7634n8080n7157n4760n1437m7964
62562I37239m4639m1229l7565l3871l0526k7641k4904k1919j8706j5836j3845
62551F26558j2636j1706j0844j0136r337p870n721l786k900k924l145l238l265
$$ y = [494967, 491647, 489094, 487137, 485948, 485603, 485841, 486254, 486546, 486494, 485790, 484139, 481601, 478724, 476161, 474126, 472295, 470295, 468283, 466975, 467080, 468619, 470778, 472546, 473620, 474747, 477044, 480993, 486224, 492197, 498784, 506062, 513828, 521680, 529528, 537712, 546657, 556680, 568172, 581687, 597667, 616296, 637858, 663078, 692766, 727113, 765659, 808130, 855108, 907473, 965249, 1027332, 1092414, 1159682, 1228225, 1296129, 1360728, 1419828, 1472184, 1516766, 1552073, 1576456, 1588760, 1588387, 1575225, 1550079, 1515020, 1472748, 1425466, 1374446, 1320470, 1264271, 1206637, 1148557, 1091400, 1036640, 985203, 937239, 892600, 851371, 813806, 779935, 749409, 721768, 696864, 674945, 656239, 640403, 626558, 613922, 602216, 591372, 581236, 571899, 564029, 558308, 554522, 551622, 548698, 545553, 542315, 539050]
62538E39050l142k719k273k338k954l589l803l581k999j985o29O93J732K697L951
62523E18111N559P261Q805J0153J1507J3172J5325J7815K0274K2457K4481K6686
62511G01606K9375L2645L6317L9910M2782M4430M4778M4113M2744M0659L7584
62500A136943L3373K8192K2284J5858R420M015N59j016j471j138L65L093O247
62487A256724R285J2912J8141K4582L0589L5144L8667M1682M3396M2268L7622
62476A591012L0193K1319J2118L264n132j3708k3442l4489m5505n4462o0318o3598
62464A357252o5367o6024o5461o3879o1682n8619n3908m7681m1515l6875l3415
62453G62826k9666k5071k0464j6581j3193j0027p560o112m877k727K82L073N077
$$ y = [539050, 535908, 533189, 530916, 528578, 525624, 522035, 518232, 514651, 511652, 509667, 509038, 509731, 511463, 514160, 518111, 523670, 530931, 539736, 549889, 561396, 574568, 589893, 607708, 627982, 650439, 674920, 701606, 730981, 763626, 799943, 839853, 882635, 927065, 971843, 1015956, 1058700, 1099359, 1136943, 1170316, 1198508, 1220792, 1236650, 1246070, 1250085, 1250644, 1249628, 1248157, 1247019, 1247384, 1250477, 1256724, 1266009, 1278921, 1297062, 1321644, 1352233, 1387377, 1426044, 1467726, 1511122, 1553390, 1591012, 1621205, 1642524, 1654642, 1657906, 1652774, 1639066, 1615624, 1581135, 1535630, 1481168, 1420850, 1357252, 1291885, 1225861, 1160400, 1096521, 1034839, 976220, 922312, 874631, 833116, 796241, 762826, 733160, 708089, 687625, 671044, 657851, 647824, 640264, 634152, 629275, 626548, 626830, 629903, 634980]
62440F34980O764Q560J0070J0803J0990J1087J0906R803P602M764J723j475m782
62427G21795p890j0449j2304j3457j4001j4186j4212j4011j3498j2989j2889j2945
62415E68964j2392j1052r650q730p933o856o023o130o753o744n739m468l530k794
62401D70170k089j628j429j102m61K32R90K232L803M640M120L120K930L494L674
62386D92696L020K399K747L875M847N164N201N614O501P266P346O964O833P179
62372E67652P533P538P450P497P402P021O996Q102J0244J2728J5297J8210K1447
62359G05117K4575K7494L0645L4280L8056M1517M4593M7318M9337M9950M8542
62348A141424M4987L9754L3635K7208K0651J4077P820K212k726p113j1031j4715
$$ y = [634980, 641744, 650304, 660374, 671177, 682167, 693254, 704160, 713963, 721565, 726329, 728052, 726577, 721795, 713905, 703456, 691152, 677695, 663694, 649508, 635296, 621285, 607787, 594798, 581909, 568964, 556572, 545520, 535870, 527140, 519207, 512351, 506328, 500198, 493445, 486701, 480962, 476494, 472964, 470170, 468081, 466453, 465024, 463922, 463461, 463693, 464683, 466915, 470718, 475358, 479478, 482598, 485528, 489022, 492696, 495716, 498115, 500862, 504737, 509584, 514748, 519949, 525563, 532064, 539330, 546676, 553640, 560473, 567652, 575185, 582723, 590173, 597670, 605072, 612093, 619089, 627191, 637435, 650163, 665460, 683670, 705117, 729692, 757186, 787831, 822111, 860167, 901684, 946277, 993595, 1042932, 1092882, 1141424, 1186411, 1226165, 1259800, 1287008, 1307659, 1321736, 1329556, 1331768, 1329042, 1321929, 1310898, 1296183]
62336A296183j8488k2106k4673k5716k5952k6269k6351k5261k3148k1268k0243
62325A036708j9372j8018j6703j6269j6767j7855j9598k2013k4239k5080k4379
62314H16415k3249k2783k2961k2909k1906k0008j7865j6109j4813j3532j1863
62303F08417r912q145o896o058n259m251l113k028r56K14J223J538J154Q71J345
62288E68144K203K655K682K862L217L142K582K302K671L050K921K857L563M637
62274F09488N201N382O102P487Q538Q630Q516R307J1084J3067J4767J6371J8170
62261G42110K0288K2937K6317L0067L3351L5941L8705M2498M6762M9925N1090
62250A139991N0707M9470M7291M3805L9158L3737K7482K0105J1822L315m844j2420
$$ y = [1296183, 1277695, 1255589, 1230916, 1205200, 1179248, 1152979, 1126628, 1101367, 1078219, 1056951, 1036708, 1017336, 999318, 982615, 966346, 949579, 931724, 912126, 890113, 865874, 840794, 816415, 793166, 770383, 747422, 724513, 702607, 682599, 664734, 648625, 633812, 620280, 608417, 598505, 590360, 583464, 577406, 572147, 567896, 564783, 562755, 561799, 562013, 563236, 564774, 565928, 566799, 568144, 570347, 573002, 575684, 578546, 581763, 584905, 587487, 589789, 592460, 595510, 598431, 601288, 604851, 609488, 614689, 620071, 626173, 633660, 642198, 650828, 659344, 668651, 679735, 692802, 707569, 723940, 742110, 762398, 785335, 811652, 841719, 875070, 911011, 949716, 992214, 1038976, 1088901, 1139991, 1190698, 1240168, 1287459, 1331264, 1370422, 1404159, 1431641, 1451746, 1463568, 1466883, 1462039, 1449619]
62238A449619j9365k5964l2700l9444m5074m8583n0296n1202n1358m9988m7050
62227I88595m3580m0276l6814l2973k9390k6580k4108k1408j8753j6642j4856
62216F83215j2915j0957r408q154o855n790n496n703n488m489l228k178j240k91
62202F01023L93O83J045K034L528M781N190M864M482M631N260N824N990N978O096
62187F61802O244O223O323P092Q472R620R793R143Q417P983P475O425N021M015
62173G64048L855M222M657N421P256J0310J3817J7101K0387K4193K8262L1731
62161I35260L4205L6061L7477L7729L5846L1757K6454K0972J5637J0356N410J375
62149A228539j716m697q432j2851j7097k0458k2810k4318k5115k5237k4513k2591
$$ y = [1449619, 1430254, 1404290, 1371590, 1332146, 1287072, 1238489, 1188193, 1136991, 1085633, 1035645, 988595, 945015, 904739, 867925, 834952, 805562, 778982, 754874, 733466, 714713, 698071, 683215, 670300, 659343, 649935, 641781, 634926, 629136, 623640, 617937, 612449, 607960, 604732, 602554, 601314, 601023, 601416, 602099, 603144, 605178, 608706, 613487, 618677, 623541, 628023, 632654, 637914, 643738, 649728, 655706, 661802, 668046, 674269, 680592, 687684, 696156, 705776, 715569, 724712, 733129, 741112, 748587, 755012, 760033, 764048, 767903, 772125, 776782, 782203, 789459, 799769, 813586, 830687, 851074, 875267, 903529, 935260, 969465, 1005526, 1043003, 1080732, 1116578, 1148335, 1174789, 1195761, 1211398, 1221754, 1227164, 1228539, 1226823, 1222126, 1213694, 1200843, 1183746, 1163288, 1140478, 1116160, 1091045, 1065808, 1041295, 1018704]
62137A018704j9473j5935j2939j0619q361n892l666k136j213p70j029k071l364
62124I31236m192m235l551k385j143j43Q85K510M621O331P152P642Q414R092Q817
62109I71051P260M625J158k649n811p501p769p105n786m169l105l274m402n837
62095I26686p418r013r697q566o168m052k915k218j558j293j552j747j478j072
62081H67939p08J07J679L375M398M861N515O728Q224R535J0392J0815J1165J1891
62067I55916J3008J4087J4864J5614J6732J8240J9884K1391K2410K2533K1555
62056A156234J9575J6707J2997Q731M548J045j646l891o351r660j3893j8382k2398
62043A143616k5886k9100l1698l2908l2611l1556l0378k9128k7895k7051k6400
$$ y = [1018704, 999231, 983296, 970357, 959738, 951377, 945485, 941819, 939683, 938470, 937700, 936671, 934600, 931236, 927044, 922809, 919258, 916873, 915730, 915587, 916472, 918982, 923603, 929934, 937086, 944728, 953142, 962234, 971051, 978311, 982936, 984094, 981445, 975634, 968133, 960364, 953259, 947473, 943304, 940199, 936925, 932523, 926686, 919268, 910255, 900558, 891992, 885824, 881772, 878857, 876639, 875081, 873788, 872236, 870489, 869011, 867939, 867231, 867338, 869017, 872392, 876790, 881651, 887166, 893894, 902118, 911653, 922045, 932860, 944025, 955916, 968924, 983011, 997875, 1013489, 1030221, 1048461, 1068345, 1089736, 1112146, 1134679, 1156234, 1175809, 1192516, 1205513, 1214244, 1218792, 1219837, 1218191, 1214300, 1207949, 1198289, 1184396, 1166014, 1143616, 1117730, 1088630, 1056932, 1024024, 991413, 959857, 929479, 900351, 872456, 845405, 819005]
62032H19005k4999k2450j9718j7988j7125j6086j4410j2525j0851r459q618q786
62020F35990r802j0664j0504r479q442p972p914p801p430o997o712o447n938n238
62006E24650m709m476m169l374k060n54P44J483J589J490J784K494L024L068L094
61991E24078L510L838L208J510n23k139l084l459l636m133n101n988o159n730
61977D96192n300n021m588m095m132m797n351n149m412l642k830j776p59l21n36
61962D43483r95j363j528j368r11p01j320k461k991k233q16J75M95Q07J649K890
61946D32812M084M936N312N217M944M938N405O214P242Q469R681J0431J0618J0661
61932E30964J0859J0908J0463R828R503R256Q315O481M427K835J732P98j96j432
$$ y = [819005, 794006, 771556, 751838, 733850, 716725, 700639, 686229, 673704, 662853, 653394, 644776, 635990, 626188, 615524, 605020, 595541, 587099, 579127, 571213, 563412, 555982, 548985, 542273, 535826, 529888, 524650, 519941, 515465, 511296, 507922, 505862, 505308, 506052, 507535, 509124, 510614, 512398, 514892, 517916, 520984, 524078, 527588, 531426, 534634, 536144, 535621, 533482, 530398, 526939, 523303, 519170, 514069, 508081, 501922, 496192, 490892, 485871, 481283, 477188, 473056, 468259, 462908, 457759, 453347, 449705, 446875, 445099, 444340, 444019, 443483, 442488, 441125, 439597, 438229, 437318, 436617, 435297, 432836, 429845, 427612, 426796, 426971, 427466, 428273, 429922, 432812, 436896, 441832, 447144, 452361, 457305, 462243, 467648, 473862, 481104, 489573, 499254, 509685, 520303, 530964, 541823, 552731, 563194, 573022, 582525, 591781, 600096, 606577, 611004, 613839, 615571, 616369, 616173, 614741]
61918F14741k956m280m611l828k772k172j697n75J244L095M585N933P438R041
61904F23186J0514J1591J1896J1133R409P174M856K786J321O01K02n27j649k597
61890F89896k969k986k981k870k420j731j162r96j465k797m891p110q799r907
61876F36812j0835j1675j2070j1823j1253j0689r948q610o744m982l864l285k676
61863E28358j682n15K76M16K43M70J628L660O002Q031R506J0700J2055J3647J5062
61848F07857J5926J6448J7135J7942J8134J7239J5732J4337J2981J1036Q465N963
61836G79195L815J404j729m919p037p698p257n970l892j469N87K102L548N128
61822G55808O345O680O288N694N077M140K459j51l356o278q144r061r821j0768
$$ y = [614741, 611785, 607505, 602894, 599066, 596294, 594122, 592425, 591850, 593094, 596189, 600774, 606707, 614145, 623186, 633700, 645291, 657187, 668320, 677729, 684903, 689759, 692545, 693866, 694467, 694669, 694142, 692493, 689896, 686927, 683941, 680960, 678090, 675670, 673939, 672777, 671781, 670316, 667519, 662628, 655518, 646719, 636812, 625977, 614302, 602232, 590409, 579156, 568467, 558519, 549909, 543165, 538183, 534319, 531034, 528358, 526676, 526161, 526437, 526853, 527096, 527566, 529194, 532854, 538856, 546887, 556393, 567093, 579148, 592795, 607857, 623783, 640231, 657366, 675308, 693442, 710681, 726413, 740750, 753731, 764767, 773232, 779195, 783010, 784414, 782685, 777766, 770729, 763031, 755774, 749804, 745912, 744443, 745030, 747132, 750680, 755808, 762153, 768833, 775121, 780815, 785892, 790032, 792491, 792340, 788984, 782706, 774562, 765501, 755680, 744912]
61808G44912j1324j0933r999r370r254r196q988q966r371r901j0101r852r287
61795F18370q487p437o198n010m209l968l997l664k664j473q99j132j526j385
61781E66321o88L3L12J37j69k50m4J32o2n37p50k94P00J794K676L240L483L578
61763E79612L954M918O235P389Q257R121R963J0207R478Q231P118O028M362K164
61749F77037K21j113k506m599o933q530r156r336r312q746p595o505o028n904
61735E90995n505m671l723k935k329j900j678j517j130l92M86J099J165P21J76
61720E68862L2M91J243J781J882J754J727J866J945J784J427R50J77j018k170
61705E82733k395j452k31J33m51j187j535j665j803j805j647j738k364l230l859
$$ y = [744912, 733588, 722655, 712656, 703286, 694032, 684836, 675848, 666882, 657511, 647610, 637509, 627657, 618370, 609883, 602446, 596248, 591238, 587029, 583061, 579064, 575400, 572736, 571263, 570364, 569232, 567706, 566321, 565633, 565666, 565978, 566115, 565946, 565696, 565652, 565784, 565722, 565185, 564435, 564141, 564841, 566635, 569311, 572551, 576034, 579612, 583566, 588484, 594719, 602108, 610365, 619486, 629449, 639656, 649134, 657365, 664483, 670511, 674873, 677037, 677258, 676145, 673639, 669040, 662107, 653577, 644421, 635085, 625773, 617027, 609432, 602927, 596899, 590995, 585490, 580819, 577096, 574161, 571832, 569932, 568254, 566737, 565607, 565215, 565701, 566800, 567965, 568686, 568862, 568894, 569385, 570628, 572409, 574291, 576045, 577772, 579638, 581583, 583367, 584794, 585744, 585921, 584903, 582733, 580338, 578886, 578655, 578788, 578337, 577150, 575615, 573950, 572147, 570342, 568695, 566957, 564593, 561363, 557504]
61690E57504m089l904l244k424k279l257m560m928m175l323l208l577l807l807
61676E06922l795l637l028k147j562j530j778k024k215k243j862j177p33p93q68
61661D77530m67L6l3l69J15J669L113L364K778K333K163J814J427J512J721J093
61645D99799k77r57p9J403K089J953J945K342K522K104J429Q01J03o53j034q02
61629E12688m17n54j271k015k305k329k737l899n379o270o107n323m662m360m082
61614D60978l605l182l221l702m129l942l099k234k190l210m575n215m725l742
61600D10207l267l591l987l505k082o86l51j198k527l551l867l472k758k346k489
61585C70530k677k281j434q16o37m48p4K0m91j246j748j940j917j570r58m99m06
$$ y = [557504, 553415, 549511, 546267, 543843, 541564, 538307, 533747, 528819, 524644, 521321, 518113, 514536, 510729, 506922, 503127, 499490, 496462, 494315, 492753, 491223, 489445, 487421, 485206, 482963, 481101, 479924, 479191, 478398, 477530, 477063, 477099, 477066, 476697, 476812, 478481, 481594, 484958, 487736, 490069, 492232, 494046, 495473, 496985, 498706, 499799, 499522, 498565, 498486, 499889, 501978, 503931, 505876, 508218, 510740, 512844, 514273, 515074, 515177, 514524, 513490, 512688, 512271, 511717, 510446, 508431, 506126, 503797, 501060, 497161, 491782, 485512, 479405, 474082, 469420, 465060, 460978, 457373, 454191, 450970, 447268, 443139, 439197, 436098, 433864, 431674, 428464, 423889, 418674, 413949, 410207, 406940, 403349, 399362, 395857, 393775, 393089, 392738, 391540, 389013, 385462, 381595, 378123, 375365, 373019, 370530, 367853, 365572, 364138, 363322, 362685, 362237, 362163, 362183, 361692, 360446, 358698, 356758, 354841, 353271, 352313, 351814, 351408]
61568C51408l41nL75N86R47J764K631K842K260J324O02O51J819L541M376L466
61552C78246J629L16r9j79q2M38R79O94l07q76m28K73L22j93p02r58q86k58Q55
61533C78784J768J874J312P13N61J004J820K317J758K90j072j644j793k164k646
61518C82882k660j999r73k7M11R3n88p29L1R17R87K78m75r22j200j252p95O8Q46
61499C74893J309J639J932K026J886J695J564J475J539J839K112K030J785J855
61485C99579K139J978J193N20O74J447K154K525K712K675K156J222L82M3O6r0
61469D21375q15j893k511j949m31Q84J036K28n62p64o21n11m03j28K22M76O91
61452D14324R87J201J016M68N8K62J026J796K082J915J743J842J962J727J249
$$ y = [351408, 351067, 351062, 351437, 352023, 352970, 354734, 357365, 360207, 362467, 363791, 364393, 365044, 366863, 370404, 374780, 378246, 379875, 380191, 380092, 379913, 379831, 380269, 381248, 381942, 381635, 380759, 380331, 380604, 380926, 380733, 380031, 379073, 378187, 377929, 378784, 380552, 382426, 383738, 384451, 385012, 386016, 387836, 390153, 391911, 392201, 391129, 389485, 387692, 385528, 382882, 380222, 378223, 377250, 377223, 377634, 377727, 377139, 376410, 376441, 377358, 378345, 378623, 378148, 377226, 376026, 374774, 373979, 374047, 374893, 376202, 377841, 379773, 381799, 383685, 385380, 386944, 388419, 389958, 391797, 393909, 395939, 397724, 399579, 401718, 403696, 404889, 405409, 406083, 407530, 409684, 412209, 414921, 417596, 419752, 420974, 421356, 421399, 421465, 421375, 420560, 418667, 416156, 414207, 413776, 414660, 415696, 415924, 415362, 414598, 413977, 413466, 413063, 412935, 413157, 413633, 414324, 415311, 416512, 417528, 417996, 418054, 418316, 419342, 421138, 423220, 425135, 426878, 428720, 430682, 432409, 433658]
61437D33658J034J198J234P70K04J87O36P55O5r71j481j068r2P50J008Q11O65
61420D39363Q67J134J000M76P5K13Q24J511J816J375K12j114j933k137k052j739
61404D39891r53J13O64K35o36j102r87p30o49p13q41j003j128j184j227j108m45
61387D28197P98J978K439K295K136K187K273K412K857L519L902L728L202K634
61373D64557K137J877K106K801L464L571L062K332J877J935K338K598K239J213
61359D98107L3m90K21J949L620M159L562K881L046L993N160O227P049P271O616
61344E53404N346M008K903K116J737J657J476J134J162J738K013J160k68j058
61330E78528j105j379k175k683k405j878j522r29J06Q65P46L32N47J315J937K388
$$ y = [433658, 434692, 435890, 437124, 437894, 438098, 438285, 438921, 439676, 439741, 438770, 437289, 436221, 436129, 436879, 437887, 438698, 439363, 440230, 441364, 442364, 442840, 442915, 443128, 443952, 445463, 447279, 448654, 448866, 447752, 445819, 443682, 441630, 439891, 438938, 439051, 439715, 439950, 439314, 438212, 437225, 436495, 435846, 435133, 434292, 433289, 432161, 430977, 429750, 428642, 428197, 428995, 430973, 433412, 435707, 437843, 440030, 442303, 444715, 447572, 451091, 454993, 458721, 461923, 464557, 466694, 468571, 470677, 473478, 476942, 480513, 483575, 485907, 487784, 489719, 492057, 494655, 496894, 498107, 498140, 497650, 497871, 499820, 503440, 507599, 511161, 514042, 517088, 521081, 526241, 532468, 539517, 546788, 553404, 558750, 562758, 565661, 567777, 569514, 571171, 572647, 573781, 574943, 576681, 578694, 579854, 579586, 578528, 577423, 576044, 573869, 571186, 568781, 566903, 565381, 564452, 564558, 565423, 566169, 566501, 567048, 568363, 570300, 572688]
61314E72688L347N070P000Q503R462J0083J0636J1461J2940J5179J7760J9823
61302G03952K0511J9581J7645J5495J3239J0400O836L078k93l086n212o596p637
61289G87913r140j1253j2991j3339j2491j1556j1279j1491j1501j0613q565n929
61277F57765l798k713k120j254j56O80J240J921K677K984K635K068J779J835K034
61262F67577K284K775L867N646P387P882O685M788L513L016K421J236r3j043j732
61247G16209k530l393l886l643k719j587q15n43l83o3J56Pj30K66R34J138R08
61230F99926J133K190L302L718L924M941O788Q387Q956Q859Q928R441J0085J0580
61216G91158J0908J0996J0564R495Q147P006O093N054L877L087L012L210L091
$$ y = [572688, 576035, 581105, 588105, 596608, 606070, 616153, 626789, 638250, 651190, 666369, 684129, 703952, 724463, 744044, 761689, 777184, 790423, 800823, 807659, 810737, 810444, 807358, 802146, 795550, 787913, 778773, 767520, 754529, 741190, 728699, 717143, 705864, 694373, 682872, 672259, 663694, 657765, 653967, 651254, 649134, 647880, 647724, 648404, 649644, 651565, 654242, 657226, 659861, 661929, 663708, 665543, 667577, 669861, 672636, 676503, 682149, 689536, 697418, 704103, 708891, 712404, 715420, 717841, 719077, 718984, 717941, 716209, 713679, 710286, 706400, 702757, 700038, 698451, 697636, 697093, 696710, 696647, 696803, 696810, 696680, 696946, 697880, 699018, 699926, 701059, 703249, 706551, 710269, 714193, 719134, 725922, 734309, 743265, 752124, 761052, 770493, 780578, 791158, 802066, 813062, 823626, 833121, 841268, 848274, 854367, 859421, 863298, 866385, 869397, 872607, 875698]
61203H75698K904L468M934O448P323Q045R592J2042J4429J6024J7118J8320J9422
61190A015767J9459J7798J4788J1296P977N125K827R75p97k760m809o691q503
61177A072452j0524j2678j4501j5711j6419j6707j6469j5896j5645j6161j7081
61166I04660j7712j7857j7841j7848j7722j7371j6929j6413j5547j4124j2301
61155G22995j0374q407o272m049k112p29K42J008J373R38j09r45j171j520k908
61140F87960n079o822p490p476p126o087m141j929k18J081K586M454O303P875
61126F63891R294J0872J2936J5564J8164J9758K0225K0754K2452K4894K6829K7947
61114H93580K8976L0136L0688L0205K9275K8480K7501K5876K3967K2366K0740
$$ y = [875698, 878602, 882070, 887004, 893452, 900775, 908820, 918412, 930454, 944883, 960907, 978025, 996345, 1015767, 1035226, 1053024, 1067812, 1079108, 1087085, 1092210, 1095037, 1096012, 1095215, 1092455, 1087646, 1080955, 1072452, 1061928, 1049250, 1034749, 1019038, 1002619, 985912, 969443, 953547, 937902, 921741, 904660, 886948, 869091, 851250, 833402, 815680, 798309, 781380, 764967, 749420, 735296, 722995, 712621, 704214, 697942, 693893, 691781, 691052, 691294, 692302, 693675, 694613, 694504, 693559, 692388, 690868, 687960, 682881, 676059, 668569, 661093, 653967, 647880, 643739, 641810, 641592, 642673, 645259, 649713, 656016, 663891, 673185, 684057, 696993, 712557, 730721, 750479, 770704, 791458, 813910, 838804, 865633, 893580, 922556, 952692, 983380, 1013585, 1042860, 1071340, 1098841, 1124717, 1148684, 1171050, 1191790]
61103A191790J8063J4029R536N624K336j096n162r527j3499j6846j9912k2987
61091A152349k5843k8062k9613l0723l1315l1013k9797k8350k7332k6569k5184
61080H38548k2626j9342j6386j4477j3503j2817j1835j0298q292o174m406l153
61068F95239k176j320r11j180j459o69J203K926L617L876M769O370Q032R573J1187
61053G39077J2598J3405J4097J5620J7805J9370J9841K0409K2183K4512K5905
61042I44822K6059K6059K6813K8158K9413L0175L0353L0015K9379K8729K8305
61031A258280K8368K9128L0355L1361L1807L2343L3836L6067L7905L8813L9472
61020A627735M0669M2233M3632M5086M7585N1967N8462O6872P6722Q7362R8408
$$ y = [1191790, 1209853, 1223882, 1233418, 1239042, 1241378, 1240282, 1235120, 1225593, 1212094, 1195248, 1175336, 1152349, 1126506, 1098444, 1068831, 1038108, 1006793, 975780, 945983, 917633, 890301, 863732, 838548, 815922, 796580, 780194, 765717, 752214, 739397, 727562, 717264, 708972, 702798, 698392, 695239, 693063, 691743, 690832, 689652, 688193, 687524, 688727, 691653, 695270, 699146, 703915, 710285, 718317, 727890, 739077, 751675, 765080, 779177, 794797, 812602, 831972, 851813, 872222, 894405, 918917, 944822, 970881, 996940, 1023753, 1051911, 1081324, 1111499, 1141852, 1171867, 1201246, 1229975, 1258280, 1286648, 1315776, 1346131, 1377492, 1409299, 1441642, 1475478, 1511545, 1549450, 1588263, 1627735, 1668404, 1710637, 1754269, 1799355, 1846940, 1898907, 1957369, 2024241, 2100963, 2188325, 2286733]
61009B286733J09984J22259J35286J49994J68980J95429K31386K78084L37838
61000D015973M14529N12247O34872P86615R70259J183933J422277J680512J948171
60991A3569388K187444K319449K251299J939570J437350Q76068L95297Q2619l6755
60982B5021729J7797J87085L64661M16088K39949j71050p24168j281476j727965
60973B2342650k006164k111956k074579j938075j746633j534472j323658j128029
60965H479084r56028q09956o86654n81977m94173m22455l64336l16348k76426
60956C570731k43872k17543j95567j76576j59975j45125j31257j18136j06021
60947B076659r5046q5300p7161p0937o6443o3422o1824o1083n9850n7298n4108
$$ y = [2286733, 2396717, 2518976, 2654262, 2804256, 2973236, 3168665, 3400051, 3678135, 4015973, 4430502, 4942749, 5577621, 6364236, 7334495, 8518428, 9940705, 11621217, 13569388, 15756832, 18076281, 20327580, 22267150, 23704500, 24580568, 24975865, 25058484, 25021729, 25039526, 25226611, 25591272, 26007360, 26247309, 26076259, 25352091, 24070615, 22342650, 20336486, 18224530, 16149951, 14211876, 12465243, 10930771, 9607113, 8479084, 7523056, 6713100, 6026446, 5444469, 4950296, 4527841, 4163505, 3847157, 3570731, 3326859, 3109316, 2913749, 2737173, 2577198, 2432073, 2300816, 2182680, 2076659, 1981613, 1896313, 1819152, 1748215, 1681772, 1618350, 1556526, 1495443, 1435593, 1378295, 1324187]
60936A324187n1298m8675m5548m2251l9613l7349l4461l1023k8135k6087k4005
60925I15742k1510j9252j7561j5875j4045j2826j2422j1772j0104q247p427p479
60913G57222p220o028m262k463j011k84m09q94j050p51m21m34p88j274j605j626
60897G26702j653k335l861n452o084n615m908m813n315n736n633n305n316n693
60883F58983n903n719n679o379p588q496q705q497q255q026p641o895n738m544
60869E60918l999m271m559m008k846k015j783j446m42R32J963K217J787J312J601
60854E45361K721L589L142J744P27O96J124J502J927K431K720K743K685K277J046
60839E76435n58j372j212j320k582m270n183n158m676l804k436j114o37j031j527
$$ y = [1324187, 1272889, 1224214, 1178666, 1136415, 1096802, 1059453, 1024992, 993969, 965834, 939747, 915742, 894232, 874980, 857419, 841544, 827499, 814673, 802251, 790479, 780375, 772128, 764701, 757222, 750002, 743974, 739712, 737249, 736238, 735954, 735545, 734651, 733601, 732850, 732429, 731995, 731207, 729933, 728328, 726702, 725049, 722714, 718853, 713401, 707317, 701702, 696794, 691981, 686666, 680930, 675297, 669992, 664676, 658983, 653080, 647361, 641682, 635303, 627715, 619219, 610514, 602017, 593762, 585736, 578095, 571200, 565462, 560918, 556919, 552648, 548089, 544081, 541235, 539220, 537437, 535991, 535549, 536481, 538444, 540661, 542448, 543760, 545361, 548082, 551671, 554813, 556557, 557284, 557980, 559104, 560606, 562533, 564964, 567684, 570427, 573112, 575389, 576435, 575877, 574505, 573293, 571973, 569391, 565121, 559938, 554780, 550104, 546300, 543864, 542750, 542113, 541082, 539555]
60824E39555j548j193q86q36q19m42J74J35j257l330m561m444l994m150m623m737
60808E03044m589m631m755m540m050l708l688l834l992m080m112m287m693m924
60794D43161m552l941l815l965l433k194j419j625j778r72J75P11Q55J141J092
60779D19441J47q61n97P32J646J532J195J294J520J523J649K255L036L367L002
60764D40881K280J915K418L426L844L104J954J478J731J939J646R73K7j140k143
60749D64333k549k454k196j732q74O2N07K90m39j647l107m149m440m634n382o069
60733D25520n623m237l201l119l374l317k929k188r52K97N93k65j324j703j456
60718C92722j054o70l42j14K04Q01J247Q31k51p88q5J128J754J736J827K380K965
$$ y = [539555, 538007, 536814, 535928, 535092, 534273, 533831, 534005, 534140, 532883, 529553, 524992, 520548, 516554, 512404, 507781, 503044, 498455, 493824, 489069, 484529, 480479, 476771, 473083, 469249, 465257, 461177, 457065, 452778, 448085, 443161, 438609, 434668, 430853, 426888, 423455, 421261, 419842, 418217, 416439, 415467, 415642, 416353, 417208, 418349, 419441, 419588, 418727, 418130, 418862, 420508, 422040, 423235, 424529, 426049, 427572, 429221, 431476, 434512, 437879, 440881, 443161, 445076, 447494, 450920, 454764, 457868, 459822, 461300, 463031, 464970, 466616, 467589, 467616, 466476, 464333, 461784, 459330, 457134, 455402, 454528, 454590, 455097, 455387, 454948, 453301, 450194, 446045, 441605, 436971, 431589, 425520, 419897, 415660, 412459, 409340, 405966, 402649, 399720, 397532, 396580, 396877, 397470, 397205, 395881, 394178, 392722, 391668, 390998, 390656, 390542, 390746, 391547, 392794, 393625, 393374, 392586, 392501, 393629, 395383, 397119, 398946, 401326, 404291]
60701D04291L034K565K004J757J737J536J148J169J950K873L082K706K611L058
60687D35521L409L266L016L044L118K894K454K038J779J831K229K449J850P28
60673D69626K25P99J524J406O93K63K17j53j297k906m384n268n351m826m226l915
60657D42427l693l170k293j282k30P91J474J552J228R99J085J338J601J794J686
60642D45307J037Mr37j615k401l511m433m445l588k658k171j825j235o67n60o69
60626D15633l36M33R27Q52P43R98J203Q97L78K48N61R67J304J468J102J39o97
60609D26820o19J09N58L95Q4r8l99q33r02m12P0n5o34j091j180j028o32L02J869
60590D22324L499M184L400J809P07O79J115J191Q61N58M28L71M47O87Q15P15Q42
$$ y = [404291, 407325, 409890, 411894, 413651, 415388, 416924, 418072, 419241, 421191, 424064, 427146, 429852, 432463, 435521, 438930, 442196, 445212, 448256, 451374, 454268, 456722, 458760, 460539, 462370, 464599, 467048, 468898, 469626, 469851, 470650, 472174, 473580, 474273, 474536, 474753, 474600, 473303, 470397, 466013, 460745, 455394, 450568, 446342, 442427, 438734, 435564, 433271, 431989, 431759, 432550, 434024, 435576, 436804, 437803, 438888, 440226, 441827, 443621, 445307, 446344, 446348, 445411, 443796, 441395, 437884, 433451, 429006, 425418, 422760, 420589, 418764, 417529, 416862, 416302, 415633, 415297, 415730, 416657, 417509, 418252, 419250, 420453, 421350, 421728, 421976, 422537, 423504, 424808, 426276, 427378, 427517, 426820, 426201, 426310, 426868, 427263, 427347, 427249, 426850, 426017, 425115, 424703, 424773, 424718, 424084, 422993, 421813, 420785, 420153, 420455, 422324, 425823, 430007, 433407, 435216, 435923, 436602, 437717, 438908, 439769, 440327, 440755, 441126, 441573, 442260, 443075, 443790, 444632]
60573D44632J540K308K480K388L005M549O245P547Q705R951J0941J1316J1334
60560E26941J1471J1751J1633J0470Q035M858J853n57k695m749o101o114n161
60547E61635m118l105j580M32K153L137L825M884O552Q708J1051J3207J5141J7317
60533F39239J9886K2008K2582K1403J8929J5327J0708N938K032j149m431p605
60521G64867r521r987j0190j0835j1179j0474r216q249p568o742n720m570l198
60508F57418j885j286j306p00J419M399P063R259J1690J4730J8163K1782K5616
60495G66362K9752L4326L9399M4541M8902N1911N3558N3797N2417M9602M5885
60484A270452M1169L4538K5568J5043L955p431j8912k9560l8392m5277n0488n3867
$$ y = [444632, 446172, 448480, 450960, 453348, 456353, 460902, 467147, 474694, 483399, 493350, 504291, 515607, 526941, 538412, 550163, 561796, 572266, 580301, 585159, 587012, 586455, 583760, 579011, 572910, 566796, 561635, 557517, 554412, 552832, 553264, 555417, 558554, 562379, 567263, 573815, 582523, 593574, 606781, 621922, 639239, 659125, 681133, 703715, 725118, 744047, 759374, 770082, 776020, 778052, 776903, 772472, 764867, 755346, 745359, 735169, 724334, 713155, 702681, 693465, 685216, 677648, 670906, 665186, 660616, 657418, 655533, 654247, 652941, 652241, 653660, 658059, 665122, 674381, 686071, 700801, 718964, 740746, 766362, 796114, 830440, 869839, 914380, 963282, 1015193, 1068751, 1122548, 1174965, 1224567, 1270452, 1311621, 1346159, 1371727, 1386770, 1390725, 1383294, 1364382, 1334822, 1296430, 1251153, 1200665, 1146798]
60472A146798n5157n4713n3192n0845m7727m4185m0544l6712l2633k8737k5411
60461F76942k2472j9697j7420j5962j4887j3510j1796j0194q884p851p294p260
60449E19715p144o282n004m324m606n022m513k949j269n40q48j201p49P1J41p42
60433D74734j626j839j701j598j314q08o28r68j115o31k44o82j349j173j52R04
60417D59810J732K579L218L099K372J777J541J294J010J124J639J939J674J264
60403D86072J277J741K231K323J886J185O90O43R75J615K519L268L295K709K317
60388E14746K481K678K571K689L391L983L717K944K419K067J516J236J891K975
60374E51304L287K636J953J793J803J613J273P40o5o83n50o9k22r75j150j43J176
$$ y = [1146798, 1091641, 1036928, 983736, 932891, 885164, 840979, 800435, 763723, 731090, 702353, 676942, 654470, 634773, 617353, 601391, 586504, 572994, 561198, 551004, 542120, 534269, 526975, 519715, 512571, 506289, 501285, 496961, 492355, 487333, 482820, 479871, 478602, 478062, 477214, 476013, 475264, 475335, 475476, 474734, 473108, 471269, 469568, 467970, 466656, 465848, 465220, 464252, 463137, 462506, 462262, 461580, 460231, 459058, 458906, 459810, 461542, 464121, 467339, 470438, 472810, 474587, 476128, 477422, 478432, 479556, 481195, 483134, 484808, 486072, 487349, 489090, 491321, 493644, 495530, 496715, 497405, 498048, 499023, 500638, 503157, 506425, 509720, 512429, 514746, 517227, 519905, 522476, 525165, 528556, 532539, 536256, 539200, 541619, 543686, 545202, 546438, 548329, 551304, 554591, 557227, 559180, 560973, 562776, 564389, 565662, 566402, 566337, 565654, 565104, 565035, 564813, 563838, 562688, 562545, 563721]
60357E63721J724J585J561K035K770L452L921M176M424M955N758O463O742O525
60343F19812N817M654L201J625r9j949l544m484m840n024n217n364n513n701n706
60328E87668n344m930m889n077m982m494l953l530l135k865k942l205l178k669
60314E32475j839o73J106L390N467O583O707O649P470R533J1993J3580J4029J4250
60300F30720J4900J5370J4714J2883J0415P490M032L23l275o783j0063j2243j2616
60287F65867j1727j0673r617q063o263n189n092n233n176n258n618n742n392n144
60273E71680n561o382o935o869o273n453m743m227l654k874k135j619j010q0O90
60258E14555P60M05J72n7n65q16j36R28J142M99K38R64J905K297K260J973J191
$$ y = [563721, 565445, 567030, 568591, 570626, 573396, 576848, 580769, 584945, 589369, 594324, 600082, 606545, 613287, 619812, 625629, 630283, 633484, 635109, 635010, 633061, 629517, 625033, 620193, 615169, 609952, 604588, 599075, 593374, 587668, 582324, 577394, 572505, 567428, 562446, 557952, 553999, 550469, 547334, 544469, 541527, 538322, 535144, 532475, 530636, 529963, 531069, 534459, 539926, 546509, 553216, 559865, 567335, 576868, 588861, 602441, 616470, 630720, 645620, 660990, 675704, 688587, 699002, 706492, 710524, 710847, 707572, 700789, 690726, 678483, 665867, 654140, 643467, 633850, 625787, 619524, 614335, 609243, 604010, 598834, 593576, 587958, 582216, 576824, 571680, 566119, 559737, 552802, 545933, 539660, 534207, 529464, 525237, 521583, 518709, 516574, 514955, 513945, 513865, 514555, 515315, 515720, 515892, 515835, 515270, 514454, 514318, 515246, 516388, 516887, 517125, 518089, 519994, 522291, 524551, 526524, 527715]
60241E27715K5p77r00r27j240j372q60j9O69J185J612J779J746J957K576L192
60225E36361L548L970M761N729O557P129P377P464Q083R727J1576J2109J1094
60212F35485R961R886J0466J0758J0608J0383J0217J0217J0601J1082J0801R489
60200G59954P964O990O316N451M541L820K908J437j66j285j986k622l172l633
60186G86517m532o201q006q959q872q230p344o332n581n461n722n856n834n871
60172F93716n709m790l196j767j186j291j394j093p20j024k283l752m324l769
60158F57418k887k375k101j613q47N8J086K124K774K805K459K141K097K460L126
60143F68725L482K925J889J641K685M112M935N386O190P228P711P375O750O359
$$ y = [527715, 527740, 526963, 526063, 525136, 523896, 522524, 521664, 521645, 522314, 523499, 525111, 526890, 528636, 530593, 533169, 536361, 539909, 543879, 548640, 554369, 560926, 568055, 575432, 582896, 590979, 600706, 612282, 624391, 635485, 645446, 655332, 665798, 676556, 687164, 697547, 707764, 717981, 728582, 739664, 750465, 759954, 767918, 774908, 781224, 786675, 791216, 795036, 797944, 799381, 799215, 797930, 795944, 793322, 790150, 786517, 781985, 775784, 767778, 758819, 749947, 741717, 734373, 728041, 722460, 716999, 711277, 705421, 699587, 693716, 688007, 683217, 680021, 678254, 677068, 675777, 674383, 673290, 672570, 671546, 669263, 665511, 661187, 657418, 654531, 652156, 650055, 648442, 647595, 647653, 648739, 650863, 653637, 656442, 658901, 661042, 663139, 665599, 668725, 672207, 675132, 677021, 678662, 681347, 685459, 690394, 695780, 701970, 709198, 716909, 724284, 731034, 737393]
60129G37393O232O152N945N487M750L844K977K484K787L915N153N624N321M922
60115H02986M663M152L374L006L273L346K443Q88m82j432k346l529m955o341p176
60100H01870p129o677o702p304p582o943n859m919l983k771j567q06n05n83j089
60085G37451j643j466n62j01q92k164k629k157j621j616k140l122m437n716o714
60070G00471p587q348q541p984p285p080p247p334p151o553n392m166l846m372
60056F07585m380l190k019k145k793k203j06K214L768M563M868N025N663O906
60042F23756P790P563P114P682Q634Q069N577K830J358J037J045R49M89n78j963
60027F81352l060l962n381p333q750q771p708o509n869o022o719p316p445p537
$$ y = [737393, 743625, 749777, 755722, 761209, 765959, 769803, 772780, 775264, 778051, 781966, 787119, 792743, 798064, 802986, 807649, 811801, 815175, 818181, 821454, 824800, 827243, 828131, 827649, 826217, 823871, 820342, 815387, 809046, 801870, 794741, 788064, 781362, 774058, 766476, 759533, 753674, 748755, 744772, 742001, 740434, 739628, 739123, 738540, 737451, 735808, 734342, 733780, 733679, 732787, 730623, 727994, 725837, 724216, 722600, 720460, 717338, 712901, 707185, 700471, 692884, 684536, 675995, 668011, 660726, 653646, 646399, 639065, 631914, 625361, 619969, 615803, 611957, 607585, 603205, 600015, 597996, 595851, 593058, 590855, 590749, 592963, 596731, 601294, 606162, 611187, 616850, 623756, 631546, 639109, 646223, 653905, 662539, 670608, 676185, 679015, 680373, 681410, 682455, 683404, 683893, 683315, 681352, 678292, 674330, 668949, 661616, 652866, 644095, 636387, 629878, 624009, 617987, 611268, 603952, 596507, 588970]
60013E88970q076q612q325p394o719o416n743m518l422k743j969r74m19n59o90
59998E22391l00K00M33Q00J653K550L009L334L988M804N362N654N743N362M435
59983E69418L559L309L364K924J746K63j072k104k847l478m271n254n978n974
59969E53605n328m590m210m128l880k998j465K73J738K717L068K664J882J613
59955E40961K162K577J950R58J016K044K466J614P02Q89J633J899J859K189K465
59940E67384J635k59j986k738k769k495j934j196p18n81l23L31J119J920L094
59925E60484M729O173O944P621R001J0690J1410J0722R551Q743Q004O702N014
59912F65788L523K320J324J019J808K887K856J575L58J25M30O18Q44J291J373
$$ y = [588970, 580894, 572282, 563957, 556563, 549844, 543428, 537685, 533167, 529745, 527002, 525033, 524059, 523640, 523081, 522391, 522091, 522291, 522724, 523524, 525177, 527727, 530736, 534070, 538058, 542862, 548224, 553878, 559621, 564983, 569418, 572977, 576286, 579650, 582574, 584320, 584583, 583511, 581407, 578560, 575082, 570811, 565557, 559579, 553605, 548277, 543687, 539477, 535349, 531469, 528471, 527006, 527279, 529017, 531734, 534802, 537466, 539348, 540961, 543123, 545700, 547650, 548608, 549624, 551668, 554134, 555748, 556450, 557339, 558972, 560871, 562730, 564919, 567384, 569019, 568760, 566774, 564036, 561267, 558772, 556838, 555642, 554924, 554343, 554020, 554351, 555470, 557390, 560484, 565213, 571386, 578330, 585951, 594952, 605642, 617052, 627774, 637325, 646068, 654072, 660774, 665788, 669311, 671631, 672955, 673974, 675782, 678669, 681525, 683100, 683458, 683583, 684013, 684631, 685475, 686766, 688139]
59897F88139O19l32m92K24J257K329L359L920L690L145K979L160L255L306L567
59882G22125L774L517L112L178L613L905M192M902N513M882K888P35o87j725k998
59867G60926m355n336n883o149o101n710n187m729m294l790l174k385j537j010
59853G01286r31p54J08J380K342K944L758M912N885O512P237Q221Q960R042Q591
59838G69493P632N739K806l02k352k777j983q29P6O93J154J005o77l987p473r467
59822G58751r774r339q630p405n848m729m279l900l321l053l455m158m721n132
59808F81007n295m822l680k461j638j065m30L33J142J800J888J230L90k6l53j285
59792F66735k482k887k486k481l394m229m048l294k881k947l129l305l353k934
$$ y = [688139, 688758, 688426, 687934, 688158, 689415, 691744, 695103, 699023, 702713, 705858, 708837, 711997, 715252, 718558, 722125, 725899, 729416, 732528, 735706, 739319, 743224, 747416, 752318, 757831, 762713, 765601, 766336, 765649, 763924, 760926, 756571, 751235, 745352, 739203, 733102, 727392, 722205, 717476, 713182, 709392, 706218, 703833, 702296, 701286, 700355, 699601, 699709, 701089, 703431, 706375, 710133, 715045, 720930, 727442, 734679, 742900, 751860, 760902, 769493, 777125, 782864, 785670, 785368, 783016, 780239, 778256, 777427, 777503, 778196, 779350, 780355, 779678, 775691, 768218, 758751, 748977, 739638, 731008, 723603, 717755, 713026, 708747, 704847, 701526, 698473, 695018, 690860, 686139, 681007, 675712, 670890, 667210, 664749, 663111, 662046, 661616, 661949, 663091, 664891, 666779, 668009, 668399, 668373, 668020, 666735, 664253, 661366, 658880, 656399, 653005, 648776, 644728, 641434, 638553, 635606, 632477, 629172, 625819, 622885]
59778F22885k102j567j759k220k355k130j655p33N99J714K161K189K178K124K092
59763F21421K454L237L951M484N408O895Q152Q539Q603R280J0670J2141J3108
59750G18343J3195J2239J0703R500Q908Q255P061N780M908M173L220K359J924
59737H10568J531O89m80j677k846l622l244j796o81q96j646j649j077j014j634
59722G90526k191k453k839l295l243k702k394k607k768k327j457p07m74p25r01
59707G59443k84J127K482L195L722M609N423N433M938M919N595O249O308N795
59693H18954M855L688K899K956L404L286K411J442P68J19o76j328j695k115k869
59678H36099l812m750n727o823p926q812r180q767p716o697o284o258n920m888
$$ y = [622885, 620783, 619216, 617457, 615237, 612882, 610752, 609097, 608364, 608963, 610677, 612838, 615027, 617205, 619329, 621421, 623875, 627112, 631063, 635547, 640955, 647850, 656002, 664541, 673144, 682424, 693094, 705235, 718343, 731538, 743777, 754480, 763980, 772888, 781143, 788204, 793984, 798892, 803065, 806285, 808644, 810568, 812099, 812788, 812308, 810631, 807785, 804163, 800919, 799123, 798442, 797546, 795900, 794251, 793174, 792160, 790526, 788335, 785882, 783043, 779748, 776505, 773803, 771409, 768802, 766034, 763707, 762250, 761543, 761069, 760344, 759443, 759159, 760286, 762768, 765963, 769685, 774294, 779717, 785150, 790088, 795007, 800602, 806851, 813159, 818954, 823809, 827497, 830396, 833352, 836756, 840042, 842453, 843895, 844663, 844782, 844106, 842778, 841083, 838968, 836099, 832287, 827537, 821810, 814987, 807061, 798249, 789069, 780302, 772586, 765889, 759605, 753347, 747427, 742539]
59664G42539l307j482K76J633K521L274M146M954N508O051O788P426P708P972
59650G96007Q510Q691P571N140K281m05k955n388p465r151j0656j1913j2564j2460
59636G55243j1743j0523r027p866p541p669p409o602n885n675n728n778o020o695
59622F51082p690q674r286r165q225o959o025n478m826l855k977k609k594k394
59608E70325j639l73R87J962K392K482K415K133J673J332J191Q47O3o36n74R0
59592E84670N37L93P7P1K91K69l05j241j994k209k165k307k368j627k71L72m75
59575E71718j865k377j916j397j218j116j103j384j514q42K72O82Q3n93n90j76
59559E56664J02J68Jo33j610k175j769o88M04J187J637J703J489J465K164L695
$$ y = [742539, 739232, 737750, 738026, 739659, 742180, 745454, 749600, 754554, 760062, 766113, 772901, 780327, 788035, 796007, 804517, 813208, 820779, 825919, 828200, 827795, 824840, 819452, 811987, 802836, 792180, 780267, 767703, 755243, 743500, 732977, 723950, 716084, 708543, 700874, 693465, 686863, 680978, 675303, 669575, 663797, 657777, 651082, 643392, 634718, 625432, 616267, 608042, 601083, 595058, 589580, 584754, 580899, 577922, 575313, 572719, 570325, 568686, 568313, 569300, 571262, 573654, 576136, 578551, 580684, 582357, 583689, 584880, 585727, 585790, 585154, 584580, 584670, 585207, 585600, 585677, 585748, 586039, 586308, 586003, 584762, 582768, 580559, 578394, 576087, 573719, 572092, 571821, 572193, 571718, 569853, 567476, 565560, 564163, 562945, 561829, 560726, 559342, 557828, 556986, 557258, 557940, 558023, 557430, 556840, 556664, 556766, 556934, 556935, 556302, 554692, 552517, 550748, 550060, 550464, 551651, 553288, 554991, 556480, 557945, 560109, 563804]
59543E63804N607P168P933Q273R260J1690J5273J9012K1990K3390K2241J8042
59531G33683J1699N060n34m731p317p858o437m031j722jR88J099M67m38j434k893
59515G15600m989p134q626r533j0347j0994j0872r963r193r248r527q844p082
59502E99248n377m596m321l848l362l309l199k205p29j0j43J07J145J755J198
59487E72354O73J474K951L630L500L615M041L960L481L665M671N350N009M262
59473F22636L812L542L265L293L682L764L015J804Q36L84M15R01J680K438L126
59458F58593L985M987N762O242O944Q250R736J0523J0109Q816P457O523N644M082
59444G57653J819l47k009l769o070q100q785q362p950p866p383o106m555l355
$$ y = [563804, 569411, 576579, 584512, 592785, 602045, 613735, 629008, 648020, 670010, 693400, 715641, 733683, 745382, 750442, 749908, 745177, 737860, 730002, 723565, 719534, 717812, 717811, 718799, 719898, 720365, 719927, 718493, 715600, 710611, 703477, 694851, 685318, 674971, 663977, 653105, 643142, 633949, 624701, 615174, 606330, 599248, 593871, 589275, 584954, 581106, 577744, 574435, 571236, 569031, 568302, 568292, 568149, 568256, 569401, 571156, 572354, 573027, 574501, 577452, 581082, 584582, 588197, 592238, 596198, 599679, 603344, 608015, 613365, 618374, 622636, 626448, 629990, 633255, 636548, 640230, 643994, 647009, 648813, 649649, 650033, 650448, 651349, 653029, 655467, 658593, 662578, 667565, 673327, 679569, 686513, 694763, 704499, 715022, 725131, 733947, 741404, 747927, 753571, 757653, 759472, 759125, 757116, 753347, 747277, 739177, 730392, 722030, 714080, 706214, 698831, 692725, 688170, 684815]
59430F84815k624k260k103j745p92O98K493M650P090R166J0429J1463J3104J5204
59416G49588J7116J8904K0931K2710K3604K4216K5407K5923K2878J5086M532n768
59404I65127j3881j8641j9175j5957j1004n861k81O038J1343J2746Q965J371p298
59391I13492j4569j9145k1104k1333k0437j8395j5256j1634q176n117k568p32
59379G55026M31J380K555M153O188Q201R110Q261O552N494N250M719L622L068
59365H24010L668M455M451M070M141M507M527M245M231M836O160Q090R955J0916
59351I02262J1249J2281J4481J6621J7566J7847J8507J9335J9395J8590J7558
59340A085692J6383J4525J1783Q495M998J511j748m853q096j1113j2767j2653
$$ y = [684815, 682191, 679931, 677828, 676083, 675291, 675989, 678482, 683132, 690222, 699388, 709817, 721280, 734384, 749588, 766704, 785608, 806539, 829249, 852853, 877069, 902476, 928399, 951277, 966363, 970895, 965127, 951246, 932605, 913430, 897473, 886469, 880608, 880327, 886365, 897708, 910454, 919419, 920790, 913492, 898923, 879778, 858674, 837341, 816904, 798509, 783253, 771619, 763443, 758326, 755758, 755026, 755457, 756837, 759392, 763545, 769733, 777934, 787044, 795305, 801857, 807351, 812601, 817320, 820942, 824010, 827678, 832133, 836584, 840654, 844795, 849302, 853829, 858074, 862305, 867141, 873301, 881391, 891346, 902262, 913511, 925792, 940273, 956894, 974460, 992307, 1010814, 1030149, 1049544, 1068134, 1085692, 1102075, 1116600, 1128383, 1136878, 1141876, 1143387, 1141639, 1136786, 1128690, 1117577, 1104810, 1092157]
59328A092157j2046j2460j3738j4528j4206j3421j2920j2772j2681j2357j1584
59317I49444j0459r475r001q969r345j0337j1695j2455j2052j1158j0675j0451
59305H23372r828q895q214p655o549m883l346k161p30J464M284P367J0426J2916
59291H07568J3871J2380Q114J629n542j1377j4543j5144j4172j2397j0107p555
59279G52725n059k708m32J749L901O369R374J2468J4813J6018J6385J6388J6145
59266H58136J5423J3966J1874R601P509N410K886l2k832n169p112q783j0150j1234
59252H79493j2005j2162j1510j0525r838r235p982o067m210k610q03J082K177
59239G95805K434L083M842O769P649P540P099O413N431M712M574M166K498n4k231
$$ y = [1092157, 1080111, 1067651, 1053913, 1039385, 1025179, 1011758, 998838, 986066, 973385, 961028, 949444, 938985, 929510, 920509, 911540, 902195, 891858, 880163, 867708, 855656, 844498, 833823, 823372, 813544, 804649, 796435, 788780, 782231, 777348, 774002, 771841, 771111, 772575, 776859, 784226, 794652, 807568, 821439, 833819, 841933, 843562, 838020, 826643, 812100, 796956, 782784, 770387, 760280, 752725, 747666, 744958, 744526, 746275, 750176, 756545, 765919, 778387, 793200, 809218, 825603, 841991, 858136, 873559, 887525, 899399, 909000, 916509, 921919, 924805, 924773, 921941, 916772, 909660, 900877, 890727, 879493, 867488, 855326, 843816, 833291, 823453, 814218, 806236, 800169, 795959, 793349, 792546, 793628, 795805, 798239, 801322, 806164, 812933, 820582, 828122, 835221, 841634, 847065, 851777, 856351, 860517, 863015, 862961, 860730]
59224H60730l460m154m853n870p303q647q900p856o701o466o557n892m842m774
59210G74455n929p028o999o073n070m472m367m564m625m214l434k545j612p42
59196G12781k57j12L37J446K702L539M164M861N267N224N646P333R327R811Q513
59181G80582P076O915P694Q079P285N663M321M203N128N872N607M919M903N648
59167H63895O367O596O488O186N726N294M819L493O26l155o327q102r009r975
59153H72922j1403j3052j4305j4605j4063j3430j3116j2740j2055j1671j2114
59142G30368j2780j2721j1924j0946r801q244o768o150o188n940n082m062l058
59129F26704j815m54N62J259K111L109L725L864M090M907O378Q343J0411J1891
$$ y = [860730, 857270, 853116, 848263, 842393, 835090, 826443, 817543, 809687, 802986, 796520, 789963, 784071, 779229, 774455, 768526, 761498, 754499, 748426, 743356, 738884, 734517, 729953, 725328, 721114, 717680, 715135, 713523, 712781, 712524, 712412, 712749, 714195, 716897, 720436, 724600, 729461, 734728, 739952, 745598, 752931, 762258, 772069, 780582, 787658, 794573, 802267, 810346, 817631, 823294, 827615, 831818, 836946, 842818, 848425, 853344, 858247, 863895, 870262, 876858, 883346, 889532, 895258, 900552, 905371, 908864, 909490, 906335, 900008, 891906, 882897, 872922, 861519, 848467, 834162, 819557, 805494, 792064, 778948, 766208, 754153, 742482, 730368, 717588, 704867, 692943, 681997, 672196, 663952, 657184, 651034, 644846, 638906, 633824, 629762, 626704, 624889, 624435, 624997, 626256, 628367, 631476, 635201, 639065, 643155, 648062, 654440, 662783, 673194, 685085]
59115F85085J2446J2604J2976J3284J2944J2215J1774J1385J0070P614M992L172
59103H10561K268J836J278j1k148m375n757o222o350o426o311n975n449m551l338
59088G59030k465k347k420k038j570j699k172k348k521l418m686n256n071n133
59074G15886n830o415o323n860n409m890m188l363k433j700j990l624n411n772
59060F52678m697l556l170l239l402l582l337k211q40m21r87j397j166r77j204
59045F18492j202m87M13P19K22q44j957k332j682q70q93j409j321n71k5J93Q49
59028F07295K052L095L903N239P207R001J0341J1700J2868J2837J1458R815Q475
59015G15286O791M460K264O74q94k711l981m157l801l452k768j546m03K70R99
$$ y = [685085, 697531, 710135, 723111, 736395, 749339, 761554, 773328, 784713, 794783, 802397, 807389, 810561, 812829, 814665, 815943, 815932, 813784, 809409, 803652, 797430, 791080, 784654, 778343, 772368, 766919, 762368, 759030, 756565, 754218, 751798, 749760, 748190, 746491, 744319, 741971, 739450, 736032, 731346, 726090, 721019, 715886, 710056, 703641, 697318, 691458, 686049, 681159, 676971, 673608, 671175, 669475, 667485, 663861, 658450, 652678, 647981, 644425, 641255, 638016, 634614, 631032, 627695, 625484, 624644, 624223, 623236, 621839, 620673, 619696, 618492, 617290, 616803, 617216, 617935, 618157, 617313, 615356, 613024, 611342, 610472, 609579, 608170, 606849, 606278, 606253, 606446, 607295, 609347, 612442, 616345, 621584, 628791, 637792, 648133, 659833, 672701, 685538, 696996, 706811, 715286, 722077, 726537, 728801, 729475, 728581, 725870, 721889, 717732, 713931, 710479, 707711, 706165, 705762, 706032, 707031]
59000G07031K185L373M158M764N142M688L550K958L482M074L719K906K541K393
58986G56964J735P26J30J94O61J413K401L386M292N397O818Q397J0198J2420J4622
58971H29754J6033J6707J7386J8053J7885J6886J6162J6122J5895J5043J4255
58960A010181J3651J2019Q843N470L072Q40k422o179r164j1489j4119j7004j9206
58947I74493k0379k0819k0491j9292j7818j6685j5427j3292j0713q870p959p003
58935G95745n334l324j718q52n73l69K35J087J496J133L68m67j450k391k681k294
58919G78611k001k097j828p89J48J74j39J79J007J654K124K823L603M124M684
58904G92277N788P326Q969J0811J2870J4635J5864J7156J8731J9460J8369J6527
$$ y = [707031, 709216, 712589, 716747, 721511, 726653, 731341, 734891, 737849, 741331, 745405, 749124, 752030, 754571, 756964, 758699, 759425, 759555, 759749, 760410, 761823, 764224, 767610, 771902, 777299, 784117, 792514, 802712, 815132, 829754, 845787, 862494, 879880, 897933, 915818, 932704, 948866, 964988, 980883, 995926, 1010181, 1023832, 1035851, 1044694, 1050164, 1053236, 1054076, 1051654, 1045475, 1036311, 1024822, 1010703, 993699, 974493, 954114, 933295, 912804, 893512, 875694, 859009, 843582, 830290, 819577, 810707, 802748, 795745, 790411, 787087, 785369, 784517, 783944, 783575, 783810, 784897, 786393, 787526, 787894, 787427, 785977, 783586, 780905, 778611, 776610, 774513, 772685, 771896, 772044, 772218, 772079, 772258, 773265, 774919, 777043, 779866, 783469, 787593, 792277, 798065, 805391, 814360, 825171, 838041, 852676, 868540, 885696, 904427, 923887, 942256, 958783]
58892I58783J6053J7544J9621K0941K1548K2087K2699K3001K2637K1599K0219
58881A186732J8657J6424J2850Q197L653q2l501p113j0379j2404j3109j3100j2886
58868A173939j2707j2585j2131j0885r203q108p992q322q793r708j0843j1285
58856A051377j0933j0865j1548j2065j1887j1916j2733j3320j2851j2295j2744
58845I18220j3487j3378j3014j3638j4754j4844j3854j3066j2879j2506j1694
58834G71106j0977j0311r051p321o031n347m460k917j086O96K380L647M154M285
58820G28767M759N585O285O797P248P177O179M998M751N262N313M485L458K569
58806H03633J348l84k061l289m311n290n903n940n669n564n976p035q396r311
$$ y = [958783, 974836, 992380, 1012001, 1032942, 1054490, 1076577, 1099276, 1122277, 1144914, 1166513, 1186732, 1205389, 1221813, 1234663, 1242860, 1246513, 1246431, 1242930, 1235817, 1225438, 1213034, 1199925, 1186825, 1173939, 1161232, 1148647, 1136516, 1125631, 1116428, 1108320, 1100328, 1092006, 1083213, 1073505, 1062662, 1051377, 1040444, 1029579, 1018031, 1005966, 994079, 982163, 969430, 956110, 943259, 930964, 918220, 904733, 891355, 878341, 864703, 849949, 835105, 821251, 808185, 795306, 782800, 771106, 760129, 749818, 740767, 733446, 727415, 722068, 717608, 714691, 713605, 714301, 716681, 720328, 724482, 728767, 733526, 739111, 745396, 752193, 759441, 766618, 772797, 777795, 782546, 787808, 793121, 797606, 801064, 803633, 804981, 804597, 802536, 799247, 794936, 789646, 783743, 777803, 772134, 766570, 760594, 753559, 745163, 735852]
58792G35852r363q806p884o384m372k625j566n06J218L036M083M651N617O928
58778G19879P780P884P504O685N417M174L216J810q24m169p095r299j1031j1899
58764G20032j1337r855q603p860p150o501o347o388n760m324k755j507o05k06
58750F40834m23q07q64p47n95J87K010M081N398O200P240Q329Q894R299J0134
58735F99170J0688R791P801O278N833N805N765N827N642M624L196K432K480K614
58721G77946K654L017L550L725L846M649N878O602O810P170P433O593M596K388
58707H46857L27j977m367o233p863j0130j2795j4704j5762j7047j8833k0092k0204
58694F97177j9603j8478j6460j3917j1977j0807r358p323n894n967o870p485p483
$$ y = [735852, 726489, 717683, 709799, 703415, 699043, 696418, 694852, 694346, 695564, 698600, 702683, 707334, 712951, 719879, 727659, 735543, 743047, 749732, 755149, 759323, 762539, 764349, 763525, 759356, 752261, 742962, 731931, 720032, 708695, 698840, 690237, 682377, 675227, 668726, 662379, 655991, 650231, 645907, 643152, 641645, 641040, 640834, 640411, 639604, 638740, 637993, 637398, 637585, 639595, 643676, 649074, 655274, 662514, 670843, 679737, 689036, 699170, 709858, 719649, 727450, 733728, 739561, 745366, 751131, 756958, 762600, 767224, 770420, 772852, 775332, 777946, 780600, 783617, 787167, 790892, 794738, 799387, 805265, 811867, 818677, 825847, 833280, 839873, 844469, 846857, 847184, 845207, 840840, 834607, 826744, 816614, 803819, 789115, 773353, 756306, 737473, 717381, 697177, 677574, 659096, 642636, 628719, 616742, 605935, 596577, 589254, 583360, 577393, 570523, 563038, 555555]
58681E55555o928n731m093k668j826j441j437j735j708p03Q54J940K442L203M612
58666E40336O287P960R587J0720J0889J0462R914Q653N923K438m18k617n024p256
58652F07854q027p494p210p580p454o502n927o269o396n425l970k771j655m64
58638E30710L54P35J250J939K162J949K081K583K582J969J567J446O61q86k064
58623E49038k375k470k397j180J183L061L399L072L309M215N494P106Q451Q380
58609E88286O834N121M083L282K476K237K522K257J080j6m12o89j078q00K13O57
58593F16053j48j003n66R41K632M246N801P182Q718J0922J3226J4336J4258J4303
58579G10901J4726J4195J2237J0201Q975P696N791M400M538N559O640Q335J1380
$$ y = [555555, 548627, 542896, 538803, 536135, 534309, 532868, 531431, 529696, 527988, 527285, 528139, 530079, 532521, 535724, 540336, 546623, 554583, 564170, 574890, 585779, 596241, 606155, 614808, 620731, 623169, 622751, 620134, 615110, 607854, 599827, 592333, 585123, 577543, 570089, 563587, 557660, 551391, 544995, 539570, 535600, 532829, 531174, 530710, 531064, 531799, 533049, 534988, 537150, 539099, 541180, 543763, 546345, 548314, 549881, 551327, 551988, 551102, 549038, 546663, 544193, 541796, 540616, 541799, 544860, 548259, 551331, 554640, 558855, 564349, 571455, 579906, 588286, 595120, 600241, 604324, 607606, 610082, 612319, 614841, 617098, 618178, 618162, 617750, 617061, 615983, 615183, 615396, 616053, 615905, 614902, 614336, 615277, 617909, 622155, 627956, 635138, 643856, 654778, 668004, 682340, 696598, 710901, 725627, 739822, 752059, 762260, 771235, 778931, 784722, 789122, 793660, 799219, 805859, 814194, 825574]
58566H25574J5438K0019K5205L0455L4252L6050L7017L7805L7206L4134K9323
58555A162478K3785J7237R576K311k932o244q373r160q361o876n794n219n101
58542A157327o135q732j2248j6168k0761k5668k9244l0492l0316k9827k8748k6582
58530H92406k3899k1307j8531j5619j3600j2769j1812r855p848o733n869m578
58518G39986l655l730l759k763j688j777k445k472k142k477l324l823l872l677
58504F98382k841j305j88l56j052j227j147j472j812j525q94l31N46J889K824
58489F89491K868L039M429O763R300J1890J4232J5586J6277J7921K1061K4149
58477H37006K5856K6615K6662K4625J9626J2995O425J02n874j0231j2387j3707
$$ y = [825574, 841012, 861031, 886236, 916691, 950943, 986993, 1024010, 1061815, 1099021, 1133155, 1162478, 1186263, 1203500, 1213076, 1215387, 1212455, 1206211, 1197838, 1188678, 1180317, 1173441, 1167647, 1162428, 1157327, 1151192, 1142460, 1130212, 1114044, 1093283, 1067615, 1038371, 1007879, 977563, 947736, 918988, 892406, 868507, 847200, 828669, 813050, 799450, 786681, 774869, 765014, 757166, 750433, 744564, 739986, 736331, 732601, 728842, 726079, 724391, 722614, 720169, 717697, 715555, 713078, 709754, 705931, 702059, 698382, 695541, 694236, 694048, 693692, 692640, 691413, 690266, 688794, 686982, 685457, 684563, 684232, 684778, 686667, 689491, 692359, 695398, 699827, 706590, 715890, 727780, 742012, 757598, 773875, 791796, 812857, 837006, 862862, 889477, 916139, 940764, 960390, 973385, 979810, 979912, 974038, 963807, 951420, 937713]
58465I37713j5148j5492j3685j0926q555n809j771K409N509Q522J2567J6281J7851
58452I29466J7982J8205J7738J4797R766M412r48o861j2349j5823j7559j8851
58440I39975j9450j8213j5543j2902j0592q135o005m873l927k071N6J309K344
58427H41973M592P754J0371J2015J3027J3060J1745R788P624M201r62n947q727
58414I20514r832j0694j0952r875q803r404j0682j0461q822p467o697n630m495
58401H06700m127m007l100j805r35J26K091L925M591N166O852Q466Q463P885Q475
58386H48766R479R216Q347Q433Q626O975L917J330p38l356n891o897o728o412
58372H75067n237k358P02K307L824P128J0751J2122J2097J3338J5530J6322J5798
$$ y = [937713, 922565, 907073, 893388, 882462, 873907, 868098, 866327, 868736, 874245, 882767, 895334, 911615, 929466, 947448, 965653, 983391, 998188, 1007954, 1012366, 1011418, 1004557, 992208, 976385, 958826, 939975, 920525, 902312, 886769, 873867, 863275, 855140, 849135, 844262, 840335, 838264, 838320, 839629, 841973, 846565, 854319, 864690, 876705, 889732, 902792, 914537, 924325, 931949, 936150, 935188, 929241, 920514, 910682, 899988, 889036, 879161, 870358, 860954, 850272, 839811, 830989, 823522, 816825, 811195, 806700, 802573, 798566, 795466, 793661, 792726, 792852, 794943, 798868, 803459, 808625, 815477, 823943, 832406, 840291, 848766, 858245, 867461, 875808, 884241, 892867, 899842, 903759, 905089, 904351, 900995, 895104, 888207, 881479, 875067, 869830, 867472, 868174, 870481, 874305, 881433, 892184, 904306, 916403, 929741, 945271, 961593, 977391]
58359I77391J5913J6411J5389J3127J1286R190N024K0k701k886k800k812j498
58346A051054N63J303J119K215M436N785O512Q562J1512J3219J4022J5999J8632
58333A154933J9583J9316K0360K2356K2397K0115J7865J6080J3001Q947O197M659
58321A345809K201q15j947j531k364m560n466m717m660n646n714m959n391o313
58307A293927m752p01K938N633R563J4698J8604K1202K4603K8151K8942K7217
58295A470025K6035K5650K3741K1043K0821K2674K2906K1229K1027K2765K3409
58284A721325K2738K3753K6329K7123K6309K7718L1462L3310L2257L1832L2952
58273B037108L2601L0665L0896L3730L5393L5424L7770M3047M7186M9308N3222
$$ y = [977391, 993304, 1009715, 1025104, 1038231, 1049517, 1058707, 1063731, 1063751, 1061050, 1058164, 1055364, 1052552, 1051054, 1051617, 1052920, 1054039, 1056254, 1060690, 1066475, 1072987, 1081549, 1093061, 1106280, 1120302, 1136301, 1154933, 1174516, 1193832, 1214192, 1236548, 1258945, 1279060, 1296925, 1313005, 1326006, 1334953, 1341150, 1345809, 1348010, 1347195, 1345248, 1343717, 1341353, 1336793, 1331327, 1326610, 1321950, 1316304, 1310590, 1305631, 1300240, 1293927, 1289175, 1288474, 1291412, 1297045, 1306608, 1321306, 1339910, 1361112, 1385715, 1413866, 1442808, 1470025, 1496060, 1521710, 1545451, 1566494, 1587315, 1609989, 1632895, 1654124, 1675151, 1697916, 1721325, 1744063, 1767816, 1794145, 1821268, 1847577, 1875295, 1906757, 1940067, 1972324, 2004156, 2037108, 2069709, 2100374, 2131270, 2165000, 2200393, 2235817, 2273587, 2316634, 2363820, 2413128, 2466350]
58262B466350N9553O4125O5855O8317P1771P1872O8279O6200O7241O7153O4837
58251C201553O4845O8494P1341P2140P5429Q2524Q8803R2566R7604J04576J09372
58240D129247J12355J19202J30072J38445J43324J51435J64495J75980J83773
58231E448328J93870K08004K20344K30269K45237K66736K87019L04160L25968
58222G729935L54418L81585M06198M37952M79598N21750N61806O10062O70237
58213A2153541P33220P97858Q77517R77409J087236J205836J349877J527682J730067
58204B2440243J959323K240281K590020L007609L510179M146910M961852N983501
58196E0839918P275053Q953382J1130411J3874775J7242933K1269902K5883425
$$ y = [2466350, 2525903, 2590028, 2655883, 2724200, 2795971, 2867843, 2936122, 3002322, 3069563, 3136716, 3201553, 3266398, 3334892, 3406233, 3478373, 3553802, 3636326, 3725129, 3817695, 3915299, 4019875, 4129247, 4241602, 4360804, 4490876, 4629321, 4772645, 4924080, 5088575, 5264555, 5448328, 5642198, 5850202, 6070546, 6300815, 6546052, 6812788, 7099807, 7403967, 7729935, 8084353, 8465938, 8872136, 9310088, 9789686, 10311436, 10873242, 11483304, 12153541, 12886761, 13684619, 14562136, 15539545, 16626781, 17832617, 19182494, 20710176, 22440243, 24399566, 26639847, 29229867, 32237476, 35747655, 39894565, 44856417, 50839918, 58114971, 67068353, 78198764, 92073539, 109316472, 130586374, 156469799]
58189A56469799L0895598L6078443M1006685M4578190M4842537L9837180K9047651
58182D22756083J4144657j785252j5796269k6118955l2225978l4456067l3708037
58175B92810182l1181774k8025178k5017773k2485456k0419333j8647911j6985443
58168A30047314j5332049j3687969j2093995j0582817r184025p932843o847582
58161E4386034n916316n119414m447164l885746l407922k991810k632991k327892
58153B3656779k062123j825188j620253j448664j299509j164127j046541r49794
58145A2240580q65277p85094p12448o50586n93347n35690m82624m38828l99589
58136F777097l60157l24479k96749k73516k51534k34494k24678k16485k05233
$$ y = [156469799, 187365397, 223443840, 264450525, 309028715, 353871252, 393708432, 422756083, 436900740, 435115488, 419319219, 393200264, 360974286, 326518219, 292810182, 261628408, 233603230, 208585457, 186100001, 165680668, 147032757, 130047314, 114715265, 101027296, 88933301, 78350484, 69166459, 61233616, 54386034, 48469718, 43350304, 38903140, 35017394, 31609472, 28617662, 25984671, 23656779, 21594656, 19769468, 18149215, 16700551, 15401042, 14236915, 13190374, 12240580, 11375303, 10590209, 9877761, 9227175, 8633828, 8098138, 7615514, 7176686, 6777097, 6416940, 6092461, 5795712, 5522196, 5270662, 5036168, 4811490, 4595005, 4389772]
58127D389772j94158j86232j77340j64239j51256j42396j34350j23758j13956
58118C002087j08114j02845r5053q8094q4862q1461p4262o6762o3155o1059n6891
58107B119529n2663n1189n0118m6773m3863m4390m5833m4923m3382m3549m3254
58096A609592m0497l8307l9365m0468l7923l3951l2125l0853k7170k2938k1401
58085A244594k1225j9615j8058j9345k1915k2560k2058k2958k4446k4391k3944
58074A004079k5206k6540k4938k0986j7233j3634q792l711k86K052M534N813M016
58061H79168M6m317r301j5026j9093j9685j8700j8609j8726j7806j7486j9463
58049G01002k1777k1547j9260j6984j4728j1922r964r870r750q031o577p249q110
$$ y = [4389772, 4195614, 4009382, 3832042, 3667803, 3516547, 3374151, 3239801, 3116043, 3002087, 2893973, 2791128, 2696075, 2607981, 2523119, 2441658, 2367396, 2300634, 2237479, 2176420, 2119529, 2066866, 2015677, 1965559, 1918786, 1874923, 1830533, 1784700, 1739777, 1696395, 1652846, 1609592, 1569095, 1530788, 1491423, 1450955, 1413032, 1379081, 1346956, 1316103, 1288933, 1265995, 1244594, 1223369, 1203754, 1185696, 1166351, 1144436, 1121876, 1099818, 1076860, 1052414, 1028023, 1004079, 978873, 952333, 927395, 906409, 889176, 875542, 866750, 863039, 862753, 864805, 869339, 875152, 879168, 879214, 874897, 865596, 850570, 831477, 811792, 793092, 774483, 755757, 737951, 720465, 701002, 679225, 657678, 638418, 621434, 606706, 594784, 584820, 574950, 565200, 557169, 550592, 543343, 535233]
58036E35233o839n102n522o872o550n529o303p911p638o090o056p462p862o955
58022D42542o523o568n480l546k675l042l228l166l802m498l761k022r66q30q28
58007C91607j178k105k217o54O20l68j990j467M55P97p66j958k146k886m657o218
57991C64869p116p880q087o868m933l592k414l93J440J393K37%M97O3r04m54J311
57974C27169K267J835J487J767J626Q16K81R7n38j300j026J8M48J20K9K07n2l81
57956C34870n1O1j321l190l388k072j367j838k073j601j472j794j318J77J466
57941C15089K098K903M169N346O595Q524J0499J1264J1053J1098J1268J0466Q920
57928D19292P744O481L693j77l126m719o278p959q447p783p689q547q749p670
$$ y = [535233, 528394, 523292, 517770, 510898, 504348, 498819, 492516, 484605, 476967, 470877, 464821, 457359, 449497, 442542, 436019, 429451, 423971, 420425, 417750, 414708, 411480, 408314, 404512, 400014, 396253, 394231, 393265, 392435, 391607, 390429, 388324, 386107, 385453, 386073, 385705, 383715, 382248, 382703, 383500, 382734, 380776, 378630, 375744, 371087, 364869, 357753, 349873, 341786, 334918, 329985, 326393, 323979, 323586, 325026, 326419, 326656, 326656, 327153, 327216, 326312, 325858, 327169, 329436, 331271, 332758, 334525, 336151, 336967, 337248, 337345, 336807, 335507, 334481, 334499, 334947, 335067, 335096, 335303, 335251, 334870, 334819, 334880, 333559, 330369, 326981, 324909, 323542, 321704, 319631, 318030, 316558, 314764, 313446, 313623, 315089, 317187, 320090, 324259, 329605, 336200, 344724, 355223, 366487, 377540, 388638, 399906, 410372, 419292, 427036, 433517, 437210, 437033, 433907, 429188, 422910, 414951, 406504, 398721, 391032, 382485, 373736, 366066]
57914C66066o749o751o381m634k461j021j12P68J424J806K370L027L079K537K032
57899C55000J423J29j133r64K71O81j74o34K59J469K065K557L341L669L046K036
57883C73041R26p89k973m429m612m301m095l725l261l414m109m343l886l560l447
57868C23023k586q84M52R52J533K520K869K178J664K198L056L578M422O044P424
57853C58443P571P100P099P449P316O456N139L579K150J356R90J31j496l082l978
57838D06223m453m838n001n027n326n776n756n307n051m888m143l153l067l753
57824C40684l599k052n99m82j037j271j491k217k862k753k363k363k417j983j476
57809C11719j537j966k302k753l686m813n697o406o971o895n997n028m709m676
$$ y = [366066, 359317, 352566, 346185, 341551, 339090, 338069, 337957, 338725, 340149, 341955, 344325, 347352, 350431, 352968, 355000, 356423, 356552, 355419, 354455, 354726, 355407, 355233, 354599, 354858, 356327, 358392, 360949, 364290, 367959, 371005, 373041, 373967, 373178, 370205, 365776, 361164, 356863, 352768, 349043, 345782, 342368, 338259, 333916, 330030, 326470, 323023, 320437, 319553, 320005, 320957, 322490, 325010, 327879, 330057, 331721, 333919, 336975, 340553, 344975, 351019, 358443, 366014, 373114, 380213, 387662, 394978, 401434, 406573, 410152, 412302, 413658, 414648, 414779, 413283, 410201, 406223, 401770, 396932, 391931, 386904, 381578, 375802, 370046, 364739, 359688, 354800, 350657, 347504, 344437, 340684, 337085, 335033, 334434, 333952, 332915, 331644, 330153, 327936, 325074, 322321, 319958, 317595, 315178, 313195, 311719, 310182, 308216, 305914, 303161, 299475, 294662, 288965, 282559, 275588, 268693, 262696, 257668, 252959, 248283]
57795B48283m020k464m19J533K847L236L130L359M084M598M419L968L864M281
57781B80699N150O311P276P549P339P257P373P298P069P008O780N778M294L162
57767C70343K279Q86q19j833k192l087m848o464p398q208q863q292o317m476l954
57752C06757m077l727k899j977q43L27O23j73q09k39R10J455J307J108J079J081
57736B99903J125J139R63R31J558K393K375J619J511K532L552L816M011M555M482
57721C36465L158J608R51Q36N65M37O60L10j287l223m339m904n633o194o018n616
57705C07776n699n923n817n925o647o920n657l688k691k817k951k775k895l311
57691B44060l280k637j950j538j300j261j338r64J48J326J984K701M334O589Q592
$$ y = [248283, 244263, 241799, 241380, 242913, 245760, 248996, 252126, 255485, 259569, 264167, 268586, 272554, 276418, 280699, 285849, 292160, 299436, 306985, 314324, 321581, 328954, 336252, 343321, 350329, 357109, 362887, 367181, 370343, 372622, 373508, 372689, 370856, 368664, 365577, 360729, 354265, 346867, 338659, 329796, 321504, 315187, 310711, 306757, 302680, 298953, 296054, 294077, 293234, 293561, 294184, 294011, 293202, 292963, 293873, 295328, 296635, 297743, 298822, 299903, 301028, 302167, 303130, 304061, 305619, 308012, 310387, 312006, 313517, 316049, 319601, 323417, 327428, 331983, 336465, 339623, 341231, 342182, 343018, 343583, 344020, 344680, 344990, 343703, 340480, 336141, 331237, 325604, 319410, 313392, 307776, 302077, 296154, 290337, 284412, 277765, 270845, 265188, 261500, 258809, 255992, 253041, 250266, 247371, 244060, 240780, 238143, 236193, 234655, 233355, 232094, 230756, 229792, 229940, 231266, 233250, 235951, 240285, 246874, 255466]
57676B55466J0299J2342J5078J8867K4629L2832M2433N2139O2207P3592Q5466
57665F85350R4607R7082Q9818P1477M3485J0325k2224m9515o8814p9004q0867
57654G91720p7031p0264o1979n2971m4640l8075l2662k7097k1395j6597j3007
57643C36002j0231q456q069q254p573n974m766m539m494l926l063k286j594j097
57629B61680r56q03j97L76j4j277k353k715k793k903k866k757k958l289l085k299
57613B30791j617j404j352j257j289j462j610j886k504l062k927k212j510r19
57599B05780k70Ko57j674j831j108q24j702k883l241k779k295k319k768l127k843
57583A75461j912r88n68m44m09r21k195l309l338k899l287m403m999m676m179
$$ y = [255466, 265765, 278107, 293185, 312052, 336681, 369513, 411946, 464085, 526292, 599884, 685350, 779957, 877039, 966857, 1038334, 1081819, 1092144, 1069920, 1020405, 951591, 872587, 791720, 714689, 644425, 582446, 529475, 484835, 446760, 414098, 387001, 365606, 349009, 336002, 325771, 317315, 309246, 300992, 293419, 287445, 282679, 278140, 273646, 269720, 266657, 264371, 262777, 261680, 260724, 259921, 259724, 260100, 260086, 258809, 256456, 253741, 250948, 248045, 245179, 242422, 239464, 236175, 233090, 230791, 229174, 227770, 226418, 225161, 223872, 222410, 220800, 218914, 216410, 213348, 210421, 208209, 206699, 205780, 205510, 205512, 204855, 203181, 201350, 200242, 199418, 197716, 194833, 191592, 188813, 186518, 184199, 181431, 178304, 175461, 173549, 172561, 171993, 171549, 171140, 170219, 168024, 164715, 161377, 158478, 155191, 150788, 145789, 141113, 136934]
57568A36934l760k876j711j405k250l059k890k247j949j887j585j071n66l8M28
57553A10068N26L28L31O01O54M78P86J884L037L428K995K092R70J8l02j17p3l55
57535A27349n08m38p23j508j981j503n59MQ8J06J79J07j72n49q47p91k10N49Q63
57516A19456O80N85R05J228J127Q12P76J136J637J947J830J341Q90Q23R38P84
57500A36895L28j03m39q55j332j731k167k672k706j822o77m73j378k338k526k150
57484A13854j661j105n33k99n17p61o10k01l5n52j771l074l581l177k776l048
57468I0153l377k874j857j315j353j343j247j538j959j687p15J53N37O15K08q06
57452G1595j446o25Q33R74l27j039j22R80P65j89n63k76P9M79R86J063M51q5J00
$$ y = [136934, 133174, 130298, 128587, 127182, 124932, 121873, 118983, 116736, 114787, 112900, 111315, 110244, 109678, 109640, 110068, 110594, 110922, 111253, 111854, 112508, 112986, 113772, 115656, 118693, 122121, 125116, 127208, 128178, 128196, 127894, 127777, 127704, 127349, 126841, 126403, 125680, 124172, 122191, 120688, 120129, 120133, 120221, 120327, 120506, 120613, 120441, 119892, 119045, 118254, 118044, 118593, 119456, 120136, 120721, 121626, 122854, 123981, 124793, 125569, 126705, 128342, 130289, 132119, 133460, 134350, 135173, 136111, 136895, 137223, 137120, 136681, 135826, 134494, 132763, 130596, 127924, 125218, 123396, 122719, 122246, 120868, 118530, 116004, 113854, 112193, 111088, 110555, 110256, 109739, 108978, 108368, 108167, 108132, 107580, 105809, 102735, 99154, 95977, 93201, 90153, 86776, 83902, 82045, 80730, 79377, 78034, 76787, 75249, 73290, 71603, 70888, 71041, 71578, 72193, 72401, 71595, 70149, 69524, 70357, 71331, 71004, 69965, 69843, 70823, 71588, 71399, 70836, 70560, 70639, 71118, 72104, 73167, 73618, 73533, 73633]
57433G3633N34N86N00O16N25j5k86K58R12Q00K93K36N26M81R8j51k66m85n31o1
57413G8203N08N20J16k6K74O51Q38P59L33l66r95j471k113k832k861j834n23J06
57395F9287k5m46r12j222r66j29O10Q12Q89J316J911K487L340M380M647L578K100
57378I1657J451J563J526J048M91p3q42j631k126k474k909l089k600j745j165
57363G9082j012j024j107j237j226j068j091j268j046k81L85O48J132K210L146
57348G6243L290L274L881M510L988K416J075P97J351K117K530K196J327P39Q11
57333A10545J003R30J068J643J830J089M21R87K209K574J799R19N77N39O01Q51
57317A29585J150J319J502J651J187P1n85l6Q01P76L78P46J572J712J188Q48N03
$$ y = [73633, 74167, 74753, 75253, 75869, 76394, 76379, 76093, 76351, 77263, 78063, 78356, 78592, 79118, 79599, 79697, 79546, 79280, 78795, 78264, 78203, 78711, 79231, 79347, 79321, 79595, 80246, 81084, 81843, 82176, 81810, 80815, 79344, 77231, 74399, 71538, 69704, 69181, 69287, 69262, 68816, 67904, 66682, 65716, 65587, 66197, 67009, 67898, 69214, 71125, 73612, 76952, 81332, 85979, 89557, 91657, 93108, 94671, 96197, 97245, 97736, 97663, 96821, 95190, 93064, 90590, 87681, 84592, 81992, 80247, 79082, 78070, 77046, 75939, 74702, 73476, 72408, 71317, 70049, 69003, 68722, 69107, 69755, 70887, 73097, 76243, 79533, 82807, 86688, 91198, 95186, 97602, 98677, 99474, 100825, 102942, 105472, 107668, 108995, 109734, 110545, 111548, 112478, 113546, 115189, 117019, 118108, 118529, 119516, 121725, 124299, 126098, 127017, 127594, 128133, 128734, 129585, 130735, 132054, 133556, 135207, 136394, 136465, 135880, 135844, 136645, 137421, 137799, 138545, 140117, 141829, 143017, 143865, 144368]
57300A44368n65j620j082Q17K000J514O16M61N06q1r61j460j626j649j255m72
57284A39511j21q95k498m197n565o472o889p021p112p096o957p136p856q304p530
57269E3862n923m676l966k810p92J353K944M015M557M260L255K169J291N15M1
57254F0095J50L79L5n44m82Oj81j163j900j992k170k685k717j935j246j390j893
57237D0367k039j808j355n56L69P86N75K93J21l45j001j135o64l84o23q37q69
57220C0895j352k441l339l581l615l681l315k424j640j119k47R51J461R60N46
57205H059J170K513M089O127Q588J0562J1440J1643J1586J1116J0561J0889J2016
57192A20359J2376J1161R607R016Q878Q170P246P042P351P325O949O676O255N108
$$ y = [144368, 143803, 142183, 141101, 141918, 143918, 145432, 146048, 146509, 147015, 146934, 145973, 144513, 142887, 141238, 139983, 139511, 139390, 138495, 135997, 131800, 126235, 119763, 112874, 105853, 98741, 91645, 84688, 77552, 69696, 61392, 53862, 47939, 43263, 39297, 36487, 35695, 37048, 39992, 44007, 48564, 52824, 56079, 58248, 59539, 60054, 60095, 60245, 60624, 60659, 60115, 59633, 59639, 59458, 58295, 56395, 54403, 52233, 49548, 46831, 44896, 43650, 42260, 40367, 38328, 36520, 35165, 34609, 34978, 35764, 36339, 36632, 36753, 36408, 35407, 34272, 33608, 33224, 32601, 31764, 30895, 29543, 27102, 23763, 20182, 16567, 12886, 9571, 7147, 5507, 4388, 4141, 5092, 6553, 7513, 8059, 9229, 11742, 15831, 21958, 30546, 41108, 52548, 64191, 75777, 86893, 97454, 108343, 120359, 132735, 143896, 153503, 162519, 171397, 179567, 186813, 193855, 201206, 208531, 215480, 222156, 228411, 233519]
57178B33519L348J464n48k795m671n130l377J172Q765J8674K9446M0113N0127
57165C70107N7976O1573O0889N8657N7401N7063N6569N6228N7194N9739O3468
57154A016864O8282P3857P9139Q3429Q7028Q9800R0326Q7732Q3095P7858P2060
57143A909470O5404N8711N2817M7250M1415L5878L1035K5937K0081J4995J2244
57132B315237J1124J0237J0025J1784J5309J9584K4712L1017L7304M2119M5858
57121B574310M9480N2276N3022N2315N1478N0294M8189M6537M7260N0230N4704
57110C130095O2107P4566R1704J11842J35232J62989J93966K26168K60403K99415
57100D748487L44862L99131M68899N62668O85761Q41728J036847J277687J565160
$$ y = [233519, 236867, 238331, 237783, 234988, 230317, 225187, 221810, 222982, 231747, 250421, 279867, 319980, 370107, 428083, 489656, 550545, 609202, 666603, 723666, 780235, 836463, 893657, 953396, 1016864, 1085146, 1159003, 1238142, 1321571, 1408599, 1498399, 1588725, 1676457, 1759552, 1837410, 1909470, 1974874, 2033585, 2086402, 2133652, 2175067, 2210945, 2241980, 2267917, 2287998, 2302993, 2315237, 2326361, 2336598, 2346623, 2358407, 2373716, 2393300, 2418012, 2449029, 2486333, 2528452, 2574310, 2623790, 2676066, 2729088, 2781403, 2832881, 2883175, 2931364, 2977901, 3025161, 3075391, 3130095, 3192202, 3266768, 3358472, 3470314, 3605546, 3768535, 3962501, 4188669, 4449072, 4748487, 5093349, 5492480, 5961379, 6524047, 7209808, 8051536, 9088383, 10366070, 11931230]
57091A1931230J895969K267598K674950L103961L536593L960310M364075M730463
57083C8465149N047283N320017N537299N605206N347032M618429L440519K006475
57075G5387409N52815p68047j905838k853990l607364m163211m528679m714692
57067E3398403m732679m602610m357251m034479l668868l290292k923212k582556
57059B3206456k272722j993083j743463j524453j335773j176098j042919r31794
57051A1186151q37495p56652o88149o30737n81811n38826n00367m65388m32727
57042E753999m01732l72168l43337l14504k86293k60361k37392k16519j96974
57033C124719j78969j62638j47347j32565j18496j05230r2106p8383o3932m8892
$$ y = [11931230, 13827199, 16094797, 18769747, 21873708, 25410301, 29370611, 33734686, 38465149, 43512432, 48832449, 54369748, 59974954, 65321986, 69940415, 73380934, 75387409, 75940224, 75172177, 73266339, 70412349, 66804985, 62641774, 58113095, 53398403, 48665724, 44063114, 39705863, 35671384, 32002516, 28712224, 25789012, 23206456, 20933734, 18940651, 17197188, 15672735, 14336962, 13160864, 12117945, 11186151, 10348656, 9592004, 8903855, 8273118, 7691307, 7152481, 6652114, 6186726, 5753999, 5352267, 4980099, 4636762, 4322258, 4035965, 3775604, 3538212, 3321693, 3124719, 2945750, 2783112, 2635765, 2503200, 2384704, 2279474, 2187368, 2108985, 2045053, 1996161]
57023A996161l3180j6513J219J9040L3312L7821K7507L292k7558n6310p7633r0264
57011A816894r5065r3750q8456q1116p3015o5166n8393n2702m7320m1983l7490
57000A082438l4462l2201k9538k6230k2881j9945j7529j5674j4263j2872j1304
56989H45539r781q213n952k853K27K638M821O941P492M626j508q994j6349k3078
56975G95556k8365l0984l0954k9782k8525k6747k4014k1131j8929j6735j3134
56964E26256p835j820M077R922J6078K2456K8388L2914L5167L4713L1513K5555
56952G57384J6905O288m685j4164k0880k4481k5544k5284k4752k3997k2365j9646
56940E74779j6451j3341j0163o514k369K170P254J3011J9157K5036K9712L1737
$$ y = [1996161, 1962981, 1946468, 1947687, 1966727, 2000039, 2037860, 2065367, 2068659, 2041101, 1984791, 1907158, 1816894, 1721829, 1628079, 1539623, 1458507, 1385492, 1320326, 1261933, 1209231, 1161911, 1119928, 1082438, 1047976, 1015775, 986237, 960007, 937126, 917181, 899652, 883978, 869715, 856843, 845539, 835758, 827545, 821593, 818740, 818967, 821605, 826426, 833367, 840859, 845485, 843977, 834983, 818634, 795556, 767191, 736207, 705253, 675471, 646946, 620199, 596185, 575054, 556125, 539390, 526256, 518421, 516601, 520678, 530600, 546678, 569134, 597522, 630436, 665603, 700316, 731829, 757384, 774289, 780577, 775892, 761728, 740848, 716367, 690823, 665539, 640787, 616790, 594425, 574779, 558328, 544987, 534824, 528310, 525941, 528111, 535365, 548376, 567533, 592569, 622281, 654018]
56928F54018K9349K1591R312m960j8150k7893l3389l5360l5056l3320l0732k8101
56916D67309k5958k3855k1112j8156j6088j4870j3332j1189r636r276q915p432
56904B87490n663n136n785o284o083n784n845o046o089n761m660k589lK650N765
56889B30177R862J4528J8923K2951K6857K9885L0433K7697K2391J5962R755M716
56877D64137J078j604l484l892k407N0K171L874N899Q261J0425J2844J6834K2748
56863E36934K9591L6568M3869N1402N7794O0931N8823N0036L4602J5049m436k0479
56851I50684l1870l8732m1473m0803l7759l3132k7342k0874j4086o639J971J1312
56839F71257K0538K9951M0790N3331O6467P9205R0775R8530R7605Q4286N9346
$$ y = [654018, 683367, 704958, 714270, 709310, 691160, 663267, 629878, 594518, 559462, 526142, 495410, 467309, 441351, 417496, 396384, 378228, 362140, 347270, 333938, 322749, 313113, 303837, 294922, 287490, 281827, 276691, 270906, 264622, 258539, 252755, 246910, 240864, 234775, 229014, 224354, 221765, 221762, 224412, 230177, 240039, 254567, 273490, 296441, 323298, 353183, 383616, 411313, 433704, 449666, 459421, 464137, 465215, 463611, 460127, 456235, 453828, 453878, 456049, 459923, 465822, 474083, 484508, 497352, 514186, 536934, 566525, 603093, 646962, 698364, 756158, 817089, 875912, 925948, 960550, 975599, 971163, 950684, 918814, 880082, 838609, 797806, 760047, 726915, 699573, 678699, 664613, 657974, 659945, 671257, 691795, 721746, 762536, 815867, 882334, 961539, 1052314, 1150844, 1248449, 1332735, 1392081]
56828A392081K7444n741l5212n7257p0479p6233p6970p4157o8292o0191n1159
56817H43834m1994l2726k3247j3584l629O781J7640K8863M0331N1406O0608O5974
56805A000257O5490N7405M1148J8630o041k8765m7169o0174o7093o8068o4634
56794H40986n8758n1600m3765l6186k9680k3993j8187j1831n163J689Q760J5706
56782E87978K1990K7429L1713L3431L0548K2247R890l942j6908k7483l4935l9233
56770F42725m0841m0328l8235l5137l1540k7675k3620j9715j6589j4690j3787
56759C40568j3024j1584r418p309o036n518n058m293l522l109l054l188l346l216
56745B58893k558j714j321j368j121l15K53k23j402k226k213j765j408j165o92
$$ y = [1392081, 1419525, 1413784, 1378572, 1321315, 1250836, 1174603, 1097633, 1023476, 955184, 894993, 843834, 801840, 769114, 745867, 732283, 728654, 735435, 753075, 781938, 822269, 873675, 934283, 1000257, 1065747, 1123152, 1164300, 1182930, 1176889, 1148124, 1100955, 1040781, 973688, 905620, 840986, 782228, 730628, 686863, 650677, 620997, 597004, 578817, 566986, 561823, 563512, 572272, 587978, 609968, 637397, 669110, 702541, 733089, 755336, 765226, 761284, 744376, 716893, 681958, 642725, 601884, 561556, 523321, 488184, 456644, 428969, 405349, 385634, 369045, 354355, 340568, 327544, 315960, 306542, 299233, 293197, 287679, 282621, 278328, 274806, 271697, 268643, 265455, 262109, 258893, 256335, 254621, 253300, 251932, 250811, 250496, 250749, 250526, 249124, 246898, 244685, 242920, 241512, 240347, 239655]
56730B39655J97J100J200J38j326j955j362j88R29J881K505K356J485P01O08R35
56714B48859J239J627K253K679K363J451N73J59K72P70J297J464J373J428J507
56699B69314R55k80j271j411j303j677k125j813q65j19K51Q31J764K331J948R88
56683B67518K81J49J73j31o61q23l17M80J100J562J941J809R11K6J24P94P22k07
56665B75451o52j1N57J8r21j067n46k48k51j5M62P20P43Q88J153J280J233J037
56647B79831N63k3j68J81K61l32r04q01m88p03j224j396j263j218j122p18m14
56630B70062o80j202j451j573j810j708r78m19q13j471j217l76l46j433k470k595
56614B49520k119j502p00K10P37P32O58Q58J058Q39J55o91j283j366j097p87l11
$$ y = [239655, 239852, 240952, 242152, 242290, 240964, 239009, 237647, 237459, 238388, 240269, 242774, 245130, 246615, 247316, 247924, 248859, 250098, 251725, 253978, 256657, 259020, 260471, 261044, 261203, 261475, 262245, 263542, 265006, 266379, 267807, 269314, 270269, 269989, 268718, 267307, 266004, 264327, 262202, 260389, 259524, 259405, 259656, 260487, 262251, 264582, 266530, 267518, 267799, 267948, 268121, 267990, 267329, 266506, 266189, 266669, 267769, 269331, 271272, 273081, 273992, 274018, 274142, 274936, 275658, 275451, 274799, 274788, 275345, 275363, 274442, 273375, 272829, 272581, 272330, 272315, 272777, 273497, 274240, 275128, 276281, 277561, 278794, 279831, 280394, 280371, 280203, 280384, 280645, 280313, 279409, 278608, 278120, 277417, 276193, 274797, 273534, 272316, 271194, 270476, 270062, 269382, 268180, 266729, 265156, 263346, 261638, 260660, 260241, 259428, 257957, 256740, 256364, 256018, 254585, 252115, 249520, 247401, 245899, 245199, 245409, 246146, 246878, 247536, 248394, 249452, 250291, 250446, 249755, 248472, 247106, 246009, 245222, 244911]
56597B44911O42J569J317k06j463j212o5O86Q91J000P40k41j051m05J447K983
56581B51543L334K774J733N71M9O08J424J293L69k02MN18J192K144K822K589K105
56564B74870K668M199N404N929O811Q578J0345J1117J0758R403P111M342J734
56551C63269p69l479n692o185n101m008l839m037l975l891l964l715k911k081
56537C09622j607j231p67n04n50o59q41j315j797j726j222q82o49K6R45J316J107
56520B99266J028J087N81l86q30n94o94j546k247k164j884k032k298k223j867
56505B83197j261k47P23P97Q2l80l27o35j547k034j536r58j089j316q17Q0O63
56488B73395R37J081P31k23r13n35N33J366J636J551J223P36L40R7j36j65L68
$$ y = [244911, 245553, 247122, 248439, 248233, 246770, 245558, 245493, 246179, 247070, 248070, 248810, 248569, 247518, 247113, 248560, 251543, 254877, 257651, 259384, 259955, 260004, 260612, 262036, 263329, 263698, 263496, 263500, 264018, 265210, 267354, 270176, 272765, 274870, 277538, 281737, 287141, 293070, 299881, 308459, 318804, 329921, 340679, 350082, 357193, 361535, 363269, 362500, 359021, 353329, 347144, 342043, 338035, 334196, 330159, 326184, 322293, 318329, 314614, 311703, 309622, 308015, 306784, 306017, 305513, 304963, 304304, 303463, 302148, 300351, 298625, 297403, 296521, 295872, 295898, 296843, 298159, 299266, 300294, 301381, 301962, 301576, 300746, 300152, 299458, 297912, 295665, 293501, 291617, 289585, 287287, 285064, 283197, 281936, 281689, 282412, 283209, 283291, 282911, 282584, 281949, 280402, 278368, 276832, 275874, 274785, 273469, 272652, 272732, 273395, 274332, 275413, 276144, 275921, 275008, 274473, 275006, 276372, 278008, 279559, 280782, 281518, 281858, 281955, 281819, 281654, 282022]
56471B82022J082J082K49n94j013j378j659j214j94J65n87j209o27M64Q07M09
56455B77805J32K61M94P77J271J806K045J886J373O80L74R22J792J891J131N20
56439B95160N03L90j34k85L68R51O34p7l27k90o37j366j938k028j507l16J073
56422B90174J775J551J081Q05L81l69q52o11j3M68P69Q04M19R2O22J719K106J396
56404C02317O69O60O71k7r29j167o22M30J705K473J979P55K48P06Q63K28p8N11
56386C11392R02N25P06K350L907L446J541K86L88R02J172J388J592J533J253R63
56370C34246O90O93J416K432K476J294L37P06J624J946J910K117K019R56k93m62
56354C54107L35J025J232J280J239J061J100J463J493Q04L8j94j92j65N37K100
$$ y = [282022, 283104, 284186, 284435, 283841, 282828, 281450, 279791, 278577, 278383, 278548, 277961, 276752, 276125, 276589, 277396, 277805, 277937, 278198, 278692, 279469, 280740, 282546, 284591, 286477, 287850, 288530, 288904, 289826, 291618, 293509, 294640, 295160, 295663, 296053, 295919, 295634, 296002, 296953, 297587, 297510, 297183, 296893, 296256, 294890, 292952, 290924, 289417, 289101, 290174, 291949, 293500, 294581, 295386, 295767, 295398, 294546, 293935, 293922, 294390, 295159, 295963, 296382, 296474, 297096, 298815, 300921, 302317, 302986, 303646, 304317, 304290, 303361, 302194, 301572, 302002, 303707, 306180, 308159, 308914, 309162, 309868, 310731, 310959, 310881, 311392, 312294, 312819, 313525, 315875, 319782, 323228, 324769, 325055, 325443, 326345, 327517, 328905, 330497, 332030, 333283, 334246, 334936, 335629, 337045, 339477, 341953, 343247, 343584, 344290, 345914, 347860, 349770, 351887, 353906, 354862, 354569, 354107, 354442, 355467, 356699, 357979, 359218, 360279, 361379, 362842, 364335, 365139, 365177, 364983, 364791, 364626, 365163, 367263]
56338C67263L321L212K494K341K637K686K632K884L115L080L411M355M857M184
56324D12472L365L520L920L317K125J606J702J442P99M77M35K17J36O44J169R86
56308D38332O91J274K399K972K898K937L304L733M286N005N403N416N936P244
56294D91830P977P059N598N356O312P379Q390R675J0582J0346R719R946J0788
56281F00957J1242J1490J2315J3299J3457J3106J3354J4208J4869J5395J6358
56270G50050J7485J8234J9150K1011K3286K5047K6759K9377L2422L4840L7217
56259A034878M1174M6994N3649O0821O9109P8571Q8739R9791J12119J25255J38683
56248A949783J53129J69284J85819K00349K11965K21225K28221K32198K32497
$$ y = [367263, 370584, 373796, 376290, 378631, 381268, 383954, 386586, 389470, 392585, 395665, 399076, 403431, 408288, 412472, 415837, 419357, 423277, 426594, 428719, 430325, 432027, 433469, 434268, 434745, 435180, 435397, 435533, 436177, 437346, 438332, 439023, 440297, 442696, 445668, 448566, 451503, 454807, 458540, 462826, 467831, 473234, 478650, 484586, 491830, 499807, 506866, 512464, 517820, 524132, 531511, 539901, 549576, 560158, 570504, 580223, 590169, 600957, 612199, 623689, 636004, 649303, 662760, 675866, 689220, 703428, 718297, 733692, 750050, 767535, 785769, 804919, 825930, 849216, 874263, 901022, 930399, 962821, 997661, 1034878, 1076052, 1123046, 1176695, 1237516, 1306625, 1385196, 1473935, 1573726, 1685845, 1811100, 1949783, 2102912, 2272196, 2458015, 2658364, 2870329, 3091554, 3319775, 3551973, 3784470]
56239C784470K28297K18123K01265J78942J52584J21816Q6010M6863P547k9998
56229D995919o5109r6755j23861j46615j65545j79951j89095j94013j96226j95600
56219C443149j91449j84748j77125j68679j58944j48906j39727j30685j20803
56210B022083j11371j04160r8182r1178q3392p6867p1667o6017n9704n4241m9854
56199A155450m5256m0282l6020l2464k8784k5556k3980k3114k0772j6990j3854
56188H48378j2111j0748r660r736j0335r624p554n827m948m019l219l658m777
56175G52162m696l215j829r47K81J591J888J623K181L260L609L747M933O167N548
56160G76303L940L769M771M800M298N853R413J2257J3828J6328K0086K2774K3979
$$ y = [3784470, 4012767, 4230890, 4432155, 4611097, 4763681, 4885497, 4971507, 5018370, 5025917, 4995919, 4930810, 4834055, 4710194, 4563579, 4398034, 4218083, 4028988, 3834975, 3638749, 3443149, 3251700, 3066952, 2889827, 2721148, 2562204, 2413298, 2273571, 2142886, 2022083, 1910712, 1806552, 1708370, 1617192, 1533800, 1456933, 1385266, 1319249, 1259545, 1205304, 1155450, 1110194, 1069912, 1033892, 1001428, 972644, 947088, 923108, 899994, 879222, 862232, 848378, 836267, 825519, 815859, 806123, 795788, 786164, 778610, 772783, 767835, 763816, 760597, 756939, 752162, 747466, 744251, 742422, 741475, 741756, 743347, 745235, 746858, 749039, 752299, 755908, 759655, 764588, 770755, 776303, 780243, 784012, 788783, 793583, 797881, 803734, 813147, 825404, 839232, 855560, 875646, 898420, 922399]
56147I22399K6295L0856L5751M0057M5498N2933O0740O7973P5656Q3864R0873
56136A532895R6136J00700J03673J01979R4822Q5110P5427O5903N6893N0073M5675
56125B409286M1727L6989L1535K4190J3284O17r315j5062j9424k4401k9236l4448
56113B425742m3097n6160p0514q3033r3076r9761j01105r7460r1911q5666p6926
56102A527033o5658n5259m7736m1307l4463k8440k3951j9511j4738j1424r760
56091A174786p454m077k068j952j028J642L478L369L713N623O761N997N514O212
56077A200516N731L315J793K438K560O49q60l51K46K2J516O040J1206J5499K0445
56062A270765K5898K8545K7637K6864K7825K7205K3276J9421J7979J6389J2969
$$ y = [922399, 948694, 979550, 1015301, 1055358, 1100856, 1153789, 1214529, 1282502, 1358158, 1442022, 1532895, 1629031, 1729731, 1833404, 1935383, 2030205, 2115315, 2190742, 2256645, 2313538, 2363611, 2409286, 2451013, 2488002, 2519537, 2543727, 2557011, 2557628, 2548313, 2533251, 2513827, 2489426, 2460190, 2425742, 2382645, 2326485, 2255971, 2172938, 2079862, 1980101, 1878996, 1781536, 1689625, 1603959, 1527033, 1461375, 1406116, 1358380, 1317073, 1282610, 1254170, 1230219, 1210708, 1195970, 1184546, 1174786, 1167332, 1163255, 1161187, 1159235, 1158207, 1159849, 1163327, 1166696, 1170409, 1176032, 1182793, 1188790, 1194304, 1200516, 1206247, 1209562, 1211355, 1213793, 1216353, 1217002, 1216142, 1215791, 1216037, 1216059, 1217575, 1223615, 1234821, 1250320, 1270765, 1296663, 1325208, 1352845, 1379709, 1407534, 1434739, 1458015, 1477436, 1495415, 1511804, 1524773]
56051A524773J0744J1713J2916J2114J1890J4198J6347J6346J6831J9656K2121
56040A689649K2503K3613K6841K8517K6536K4709K6118K8073K8029K8427L1049
56029A984064L2830L2097L2746L7234M1682M2875M3693M6593M8558M7891M8992
56018B439255N4525N9790O0824O1234O4855O8757O9910P1597P6605Q1226Q2575
56007C191153Q4550Q9965R4506R5332R7473J04513J11342J13843J17016J25425
55997D225118J34530J40023J46513J57965J69006J75184J82355J95919K10574
55988E737187K21009K32631K50901K70580K86679L05214L31403L58682L81795
55979H376081M08581M45757M85976N22939N65574O21964O83787P43304Q10728
$$ y = [1524773, 1535517, 1547230, 1560146, 1572260, 1584150, 1598348, 1614695, 1631041, 1647872, 1667528, 1689649, 1712152, 1735765, 1762606, 1791123, 1817659, 1842368, 1868486, 1896559, 1924588, 1953015, 1984064, 2016894, 2048991, 2081737, 2118971, 2160653, 2203528, 2247221, 2293814, 2342372, 2390263, 2439255, 2493780, 2553570, 2614394, 2675628, 2740483, 2809240, 2879150, 2950747, 3027352, 3108578, 3191153, 3275703, 3365668, 3460174, 3555506, 3652979, 3757492, 3868834, 3982677, 4099693, 4225118, 4359648, 4499671, 4646184, 4804149, 4973155, 5148339, 5330694, 5526613, 5737187, 5958196, 6190827, 6441728, 6712308, 6998987, 7304201, 7635604, 7994286, 8376081, 8784662, 9230419, 9716395, 10239334, 10804908, 11426872, 12110659, 12853963, 13664691]
55970A3664691Q97095R95930J101163J226148J384064J567831J772636K019153
55962B4628711K330050K705714L152148L710420M429067N336462O479228P959567
55954F0731367R891233J2345624J5375257J9028971K3269719K7925696L2776954
55947B01344821L7518775M1351252M2618074L9296930L0343935J6739302J173026
55940D10386115j3339456k4692451l2043031l5535027l5906078l4136638l1134711
55933B03598723k7564512k3876933k0392833j7303606j4656153j2416013j0544835
55926G6843838r003063p725863o648458n741315m990904m365483l828325l366231
55918C1174196k977182k644560k348109k086216j864040j671647j494541j334008
$$ y = [13664691, 14561786, 15557716, 16658879, 17885027, 19269091, 20836922, 22609558, 24628711, 26958761, 29664475, 32816623, 36527043, 40956110, 46292572, 52771800, 60731367, 70622600, 82968224, 98343481, 117372452, 140642171, 168567867, 201344821, 238863596, 280214848, 322832922, 362129852, 392473787, 409213089, 410386115, 397046659, 372354208, 340311177, 304776150, 268870072, 234733434, 203598723, 176034211, 152157278, 131764445, 114460839, 99804686, 87388673, 76843838, 67840775, 60114912, 53466454, 47725139, 42734235, 38368752, 34540427, 31174196, 28197014, 25552454, 23204345, 21118129, 19254089, 17582442, 16087901, 14753893]
55910A4753893j197257j078129r66032q63652p78268p04959o34905n71150n20245
55901G439296m77001m32852l91098l59033l32728l04030k75338k53537k36012
55892D377667k16287j97123j84828j76230j64038j49895j39994j32801j22816
55883B893655j11716j04470r8729q9040p7410o9348o3609n6010m9323m9134n3561
55872B071305n6672n8515o2379o5849o4171n9323n6544n4953n0407m4611m2418
55861A455463m2840m1385l8769l8852m0364l9025l5717l4478l4450l1746k7451
55850A050386k5955k6941k6414k4204k3349k3537k2001j9618j9534k1124k1455
55839G96254k1095k2388k3820k2265j8987j7341j6469j3314q885o193m021R05
$$ y = [14753893, 13556636, 12478507, 11512475, 10648823, 9870555, 9165596, 8530691, 7959541, 7439296, 6962295, 6529443, 6138345, 5779312, 5446584, 5142554, 4867216, 4613679, 4377667, 4161380, 3964257, 3779429, 3603199, 3439161, 3289266, 3149272, 3016471, 2893655, 2781939, 2677469, 2578740, 2489700, 2412290, 2342942, 2279333, 2223323, 2174000, 2124866, 2071305, 2014633, 1956118, 1893739, 1827890, 1763719, 1704396, 1647852, 1592899, 1542492, 1497881, 1455463, 1412623, 1371238, 1332469, 1293617, 1253253, 1214228, 1178511, 1144033, 1109583, 1077837, 1050386, 1024431, 997490, 971076, 946872, 923523, 899986, 877985, 858367, 838833, 817709, 796254, 775159, 752771, 728951, 706686, 687699, 670358, 653889, 640575, 631690, 625497, 621476, 622381]
55827F22381P330J1286J2748J4075J3684Q039j279r062j3992j8511k2326k2513
55815F01860j9523j6886j5362j3002j0357r920j0855r901p142n438m706k117K342
55802D78993N737P310Q745R794Q623N992M260K832o29n201p933r147j1430j4111
55788D83835j4079j1565r811r316p682m853l280l083k266j543l627p638r500q180
55774C87412o487n482l245M17L125M479O511Q973Q873N531J603j556n102q793
55760C96259j0556j0599j1377j2805j2115r231p558q373r133q578q811j0805j2276
55747B64042j1839j1132j1068r906o944m455l954l830k509q64J05J014K048K014
55733B02722Q34K08O03M03r43j884j771j957k882l165k624k951m309m459k636
$$ y = [622381, 629711, 640997, 653745, 667820, 681504, 689543, 688264, 679202, 665210, 646699, 624373, 601860, 582337, 565451, 550089, 537087, 526730, 516810, 505955, 496054, 488912, 483474, 478768, 476651, 478993, 484730, 492040, 500785, 510579, 519202, 525194, 529454, 532286, 531657, 526456, 518523, 509376, 497946, 483835, 469756, 458191, 448380, 439064, 431382, 426529, 423249, 420166, 417900, 416357, 412730, 405092, 395592, 387412, 380925, 375443, 372198, 372615, 375740, 380219, 386730, 395703, 404576, 410107, 411710, 410154, 405052, 396259, 385703, 375104, 363727, 350922, 338807, 329576, 322018, 313645, 304512, 295934, 287123, 276318, 264042, 252203, 241071, 230003, 220097, 213153, 208698, 204744, 200914, 198405, 197541, 197646, 198660, 200708, 202722, 203556, 203764, 204367, 204770, 203827, 201943, 200172, 198215, 195333, 192168, 189544, 186593, 182284, 177825, 175189]
55718A75189j081j273j690q97N3J05L46J841L638M625N229N849N693M576L772
55703B05975L857L599K143L34j098k666m479n519n419n074m780l820k457k098
55689A78498k805k933j865p79j29J163L240M617M844N395O907P967P629O805O164
55674B24718M944K901J207L63n92j862k143j057p0o3j71P0j83r22o57R43K114
55657B29540J845J336J535J570Q46M21Q70R93j5j186j888l111n284o955p126o951
55641B06440p581q228p828o896o209n401m218l524l684l579k488j436j408j734
55627A42226j492r84p53n70l64o53j276j331r76j456k675k977k104j947l239m064
55611A15365l092j797j719j845p76N43N30l04m80q3j13m38k78J82K67R4Pk65q06
$$ y = [175189, 174108, 172835, 171145, 170248, 170301, 170406, 170752, 172593, 176231, 180856, 186085, 191934, 197627, 202203, 205975, 209832, 213431, 215574, 215908, 214810, 212144, 207665, 202146, 196727, 191653, 186873, 183053, 180596, 178498, 175693, 172760, 170895, 170116, 169987, 171150, 174390, 179007, 183851, 189246, 196153, 204120, 211749, 218554, 224718, 229662, 232563, 233770, 234133, 233541, 231679, 229536, 228479, 228409, 228346, 228175, 228245, 228062, 227140, 226483, 227426, 229540, 231385, 232721, 234256, 235826, 236672, 237093, 237963, 238956, 238941, 237755, 235867, 232756, 227472, 220517, 213391, 206440, 198859, 190631, 182803, 175907, 169698, 164297, 160079, 156555, 152871, 149292, 146804, 145368, 143960, 142226, 140734, 139750, 138997, 138427, 138063, 137410, 136134, 134803, 133827, 132371, 129696, 126719, 124615, 122668, 119429, 115365, 112273, 110476, 108757, 106912, 106136, 106679, 107209, 106905, 106425, 106342, 106229, 105791, 105513, 105695, 105962, 106056, 106063, 105798, 104992]
55592A04992r86p44j065k116k458j318k4J87R9P45J355Q41q5j72K34Q9l49k02
55574I9023K81L18J16K84N56M54M46J016J495J156O71J017J750J794J242R72J076
55557A13667R27L43l75j039j386r47J17Q41Q36Q82J438J729J173N58P19J222J385
55540A22090J516K061K541K434K017J460K61j364j900n84J169J693J214P51J25
55525A35484j299k919l572l324l138l345l590l709l576k814j651j152j631j841
55511I7923r05P9k47j276j417n42J34P3k47n69j031j392j215o86l10o9L31P42
55493H9376Q49P30N47J86k69m03k13k09l28J94J302J743R12j11k50O3lk37j07
55474I3772J15qk18k05j93j88K48P22l9k118l682l376k027r24j1R83J247L59l71
$$ y = [104992, 104006, 103262, 102197, 100081, 97623, 96305, 96281, 96468, 96567, 97312, 98667, 99508, 99423, 99251, 99485, 99574, 99225, 99023, 99304, 99622, 99738, 100022, 100578, 101032, 101478, 102494, 103989, 105145, 105816, 106833, 108583, 110377, 111619, 112591, 113667, 114594, 114937, 114562, 113523, 112137, 111190, 111307, 112148, 112984, 113866, 115304, 117033, 118206, 118764, 119483, 120705, 122090, 123606, 125667, 128208, 130642, 132659, 134119, 134380, 133016, 131116, 130532, 131701, 133394, 134608, 135359, 135484, 134185, 131266, 127694, 124370, 121232, 117887, 114297, 110588, 107012, 104198, 102547, 101395, 99764, 97923, 97018, 97097, 96850, 95574, 94157, 93615, 93749, 93822, 93575, 93006, 91975, 90583, 89368, 88682, 88372, 88303, 88634, 89376, 90225, 90955, 91502, 91688, 91419, 91016, 90803, 90594, 90266, 90460, 91762, 93505, 94417, 94306, 94056, 94119, 94116, 93879, 93772, 93887, 93879, 93661, 93456, 93263, 93075, 93323, 94045, 94006, 91888, 88206, 84830, 82803, 81879, 81868, 82851, 84098, 84457, 84086]
55455H4086K27J161Q59k85p56l33O9J51J90m6p35j007p5J290J736J187M67q4l70
55436H7732J55J481K292J676P02P32J193O69o29j310j047o29l48J4Q1o13j464
55419I0687j546j057o55p0J110K050J684N40r0j83n84j168j182q63j012j333r48
55402H5380j77j20p11q87n04l85o19l79N10J184R73l7j388k286j787p6J165Q30
55384H0686k0L5M30j23j056p85N13J257J194J516K293K157P82l78l20K87O15P74
55366H9857R64Q74M37L6l44j025j668j534p90l63m90n54l49k53j86L40J090J235
55348H7277P30L61L86K76j76n36o01n87m36Q6O72P82N47M94N92M15l9n02r69j307
55328H7465r54J21R08Q09O04R38R76Rq01q7J346J730J080O78O44J76m01j78K09
$$ y = [84086, 84313, 85474, 86333, 86048, 85292, 84959, 85028, 85179, 85369, 85323, 84588, 83581, 83506, 84796, 86532, 87719, 88186, 88102, 87732, 87887, 89368, 91660, 93336, 94038, 94770, 95963, 96632, 96003, 94693, 93646, 93017, 92669, 92683, 92764, 92151, 90687, 89141, 88084, 87429, 87359, 88469, 90519, 92203, 92743, 92653, 92470, 91886, 90718, 89536, 88673, 87661, 86328, 85380, 85203, 85083, 84372, 83485, 82981, 82596, 81977, 81598, 82108, 83292, 84265, 84228, 82840, 80554, 78767, 78691, 79856, 80686, 80666, 80701, 81131, 81008, 79952, 79167, 79680, 80937, 82131, 83647, 85940, 88097, 88879, 88501, 88181, 88468, 89083, 89857, 90821, 91695, 92132, 92168, 91824, 90799, 89131, 87597, 86807, 86444, 85954, 85400, 85051, 84798, 84612, 84952, 86042, 87277, 88007, 88368, 88754, 89030, 88854, 88318, 87717, 87130, 86694, 86780, 87452, 88234, 88781, 89275, 89867, 90282, 90243, 89741, 88772, 87465, 86511, 86632, 87540, 88349, 88953, 89891, 90867, 90876, 90075, 89988, 91334, 93064, 94144, 94822, 95466, 95642, 95241, 95063, 95272]
55309I5272o09k119k461j425n15r2R88K678L266K108O28n2m12r00r75m82j73k68
55291I4457j64L8m89j436j314J02J146O97m28j065j087o84P6N53l4j006q01N33
55273H9094J218N93M4N29J150J029P17P71O43j8m85k86mj5J55N78N61J22J90P74
55253I7360O68l09p31K6O98M72L68J116J566O73n83q75n88o74p88k16M74K85n53
55234I8389j173j455j619j302k76O95Q28M46J28l31j118j497p99M18J171J315
55218I3820J164P18P9j87R7K65o6l49k14j78n91r15p89o53n99J23J547K340J706
55199I7318P28O13Q77N38n0k3L18N2p46j252j177p86k15L74N91N53R52J708J654
55180A02027L69q53q92l79k82k21M27R44L61p16j058p02m66k67M48J223J149N00
$$ y = [95272, 94663, 92544, 90083, 88658, 88143, 88051, 89039, 91717, 94983, 97091, 97719, 97667, 97255, 96355, 95380, 94898, 94725, 94457, 94293, 94331, 93842, 92406, 91092, 91194, 92340, 93037, 92609, 91544, 90457, 89773, 89849, 90402, 90368, 89362, 88561, 89094, 90312, 90905, 90949, 91478, 92628, 93657, 94374, 95145, 95788, 95770, 95285, 94999, 94995, 94980, 95135, 95713, 96274, 96396, 96586, 97360, 98028, 97719, 96988, 97014, 97712, 98184, 98552, 99668, 101234, 101907, 101324, 100449, 99861, 99187, 98399, 98183, 98657, 98942, 98389, 97216, 95761, 94142, 92840, 92564, 93259, 94087, 94533, 94661, 94330, 93212, 91715, 90916, 91334, 92505, 93820, 94984, 95702, 95781, 95594, 95691, 95956, 95890, 95541, 95327, 95149, 94558, 93643, 92854, 92201, 91602, 91725, 93272, 95612, 97318, 98046, 98659, 99536, 100074, 100024, 100001, 100319, 100371, 99625, 98373, 97196, 96410, 96195, 96569, 97160, 97713, 98665, 100373, 102027, 102396, 101543, 100651, 100272, 99990, 99769, 100196, 101140, 101501, 100785, 99727, 99025, 98559, 98292, 98740, 99963, 101112, 101612]
55162A01612L24P13Q54N49L46M21M56M54O07O36K43p7K98R95J107M92k31n97m44
55143A08758K69J023Q01n56j735j621p29j23J89O08O24l78j675j972j209k62M80
55126A02492J051J004J25n66J4J168J293K15q61j418j929k311j728j49J387K259
55110A02046K688K597J470l50j534j383n51J32O16J050J289J314J381J459J169
55095A13393N42J90M85J076J396J168M97j53j82M45R63P29J04j65lJ75K96M67
55077A21423L96j22n16j02Q01J296J212J059R38M68l10q24p60l47N7J42l05r41
55059A23565r60k57Q5o88j708j679q24l90p06r79p70l94l7L38L96k12r53r90m63
55040A12374j35l4L34P36M24l98o81j20N47Q50R95R42L50m76p50m99n12q32o44
$$ y = [101612, 101936, 102649, 103503, 104052, 104398, 104819, 105275, 105729, 106336, 106972, 107215, 107138, 107436, 108431, 109538, 110030, 109799, 109202, 108758, 109027, 110050, 110851, 110295, 108560, 106939, 106210, 106087, 106276, 106884, 107508, 107130, 105455, 103483, 102274, 102012, 102492, 103543, 104547, 104672, 104106, 104120, 105288, 106581, 106796, 105935, 104517, 102588, 100277, 98549, 98400, 99787, 102046, 104734, 107331, 108801, 108451, 106917, 105534, 104983, 105115, 105731, 106781, 108070, 109384, 110765, 112224, 113393, 113935, 114125, 114610, 115686, 117082, 118250, 118747, 118594, 118412, 118857, 119820, 120549, 120653, 120488, 120485, 120660, 120956, 121423, 121819, 121697, 121181, 121079, 121880, 123176, 124388, 125447, 126385, 126853, 126543, 125719, 124959, 124612, 124669, 124811, 124506, 123565, 122605, 122348, 122433, 121745, 120037, 118358, 117534, 117144, 116438, 115459, 114689, 114295, 114258, 114596, 114992, 114780, 113827, 112837, 112374, 112239, 112205, 112539, 113275, 113699, 113301, 112620, 112500, 113047, 113897, 114892, 115834, 116184, 115708, 114958, 114459, 113947, 113115, 112471]
55021A12471K16Q27O98M11L74R7o68j153o70L91J199J465J346J013P43P73Q19
55004A20352M13j07J88J280J895J228J73J11J104J968J735M85r86j865j843j275
54988A24856p53m58j51K95O35O16K43j84j80N85J716K260J845J148Q27N98L7m38
54970A33497l02k6k84o31k79L13L7r37j402j129r98j125o26M30O84k85r86k02
54952A25749J238J878J624J305J163R12N92L77K7o51j205j076l88L38Q02R31P40
54935A34356N64Q81J536J810J523J395J908K623L058L413L956M494N023O073P693
54920A80306Q943R128Q821Q774Q432O636L381l1k491l926m809n600o565p622q250
54905A95127q016p105o080n280m675m088l309k214j072l89k75l34k97k96l32j03
$$ y = [112471, 112687, 113514, 114212, 114623, 114997, 115094, 114426, 113273, 112603, 112994, 114193, 115658, 117004, 118017, 118760, 119533, 120352, 120765, 120658, 120846, 122126, 124021, 125249, 125422, 125533, 126637, 128605, 130340, 130825, 129839, 127974, 126131, 124856, 124103, 123645, 123494, 123789, 124424, 125040, 125283, 125099, 124919, 125504, 127220, 129480, 131325, 132473, 133300, 133898, 133935, 133497, 133195, 133169, 132885, 132254, 131975, 132288, 132325, 131388, 129986, 128857, 127859, 126734, 126108, 126538, 127222, 126937, 125951, 125749, 126987, 128865, 130489, 131794, 132957, 133869, 134461, 134838, 134865, 134214, 133009, 131933, 131545, 131883, 132685, 133616, 134356, 134920, 135801, 137337, 139147, 140670, 142065, 143973, 146596, 149654, 153067, 157023, 161517, 166540, 172613, 180306, 189249, 198377, 207198, 215972, 224404, 231040, 234421, 234390, 231899, 227973, 223164, 217564, 210999, 203377, 195127, 187111, 180006, 173926, 168646, 163971, 159883, 156574, 154360, 153288, 152899, 152624, 152290, 151993, 151697, 151365, 151262]
54889A51262L54M96J60kM79J141J510K134L802O135P868Q439Q443Q509Q436P640
54873B16806N980L901K020O15n96k075l769n106n891o647p633q133p429o120n535
54858A70388n891o042n192l860k784j812o03K39j78j564k586k584k227k261k409
54843A30634k128j687j703k006j824r86j41K53M02N23M98L11K17J98J6q6M69J394
54825A24354J505L93p57q07k34j11l80k76R1o5p15r37l73L79P87Q66O10o5p41
54806A23524p36p5N80R76J374J637J249M14J40Q50J736J903J424R61Q71J058J232
54789A39118J084N55j3l78p83j356j435m10J074J764J557J499K087K734L060L505
54773A53662M263M802M839M835N117N447N861O865Q294R003Q315O918N669M425
$$ y = [151262, 151616, 152112, 152272, 152270, 152749, 153890, 155400, 157534, 161336, 167471, 175339, 183778, 192221, 200730, 209166, 216806, 222786, 226687, 228707, 229322, 228726, 226651, 222882, 217776, 211885, 205238, 197605, 189472, 182043, 175923, 170388, 164497, 158455, 153263, 149403, 146619, 144807, 144204, 144443, 144265, 142701, 140115, 137531, 135304, 133043, 130634, 128506, 126819, 125116, 123110, 121286, 120300, 120159, 120412, 120814, 121337, 121835, 122146, 122363, 122561, 122577, 122491, 122960, 124354, 125859, 126252, 125495, 124688, 124454, 124343, 123963, 123687, 123778, 123713, 122998, 122061, 121688, 122067, 122854, 123720, 124330, 124265, 123524, 122788, 122713, 123293, 124269, 125643, 127280, 128529, 128943, 129083, 129933, 131669, 133572, 134996, 135957, 136828, 137886, 139118, 140202, 140757, 140744, 140366, 139583, 138227, 136792, 136382, 137456, 139220, 140777, 142276, 144363, 147097, 150157, 153662, 157925, 162727, 167566, 172401, 177518, 182965, 188826, 195691, 203985, 212988, 221303, 228221, 233890, 238315]
54759B38315K619K86k225m768o996q172q055p429p117o982o485n602m651l769
54745A68969l109k978l276l319k678j657n76O64J873K256J484L97l0J93N52J007
54729A59772J748K559L148L678M410N241O082P181Q495R338R209Q338O936M606
54715B40741J202k357m996o687p985q872q904q135p069n999n009m392m308m314
54701A62916l803k718j408j45P06O18l68j244j105k77K22J8m75q62j038r35n92
54684A49510l81n85j007j344j615j827j681j069m62k89l67l97m63o47o90n11m69
54667A35706o12l83K93M98l05j209j133m85l80p89o66L11J322J663J409Q21Rp68
54649A35302j168j117o63K46J312J750J316Q86J160J379M95q64j081K6Q70M06
$$ y = [238315, 240934, 241220, 238995, 234227, 227231, 219059, 211004, 203575, 196458, 189476, 182991, 177389, 172738, 168969, 165860, 162882, 159606, 156287, 153609, 151952, 151376, 152040, 153913, 156169, 157653, 158050, 158020, 158213, 158765, 159772, 161520, 164079, 167227, 170905, 175315, 180556, 186638, 193819, 202314, 211652, 220861, 229199, 236135, 240741, 241943, 239586, 234590, 227903, 219918, 211046, 202142, 194007, 186938, 180939, 175930, 171538, 167230, 162916, 159113, 156395, 154987, 154842, 155548, 156166, 155798, 154554, 153449, 153172, 153394, 153412, 152937, 152075, 151037, 150102, 149510, 149129, 148544, 147537, 146193, 144578, 142751, 141070, 140001, 139539, 139250, 138883, 138486, 138023, 137376, 136686, 136175, 135706, 135094, 134711, 135004, 135502, 135197, 133988, 132855, 132370, 131990, 131201, 130535, 130846, 132168, 133831, 135240, 136061, 136070, 135302, 134134, 133017, 132354, 132600, 133912, 135662, 136978, 137864, 139024, 140403, 140898, 140034, 138953, 138979, 139849, 140255]
54633A40255n71q67n35l96o97r32o28J18P50P51K02k70l28l78p79j051n26N34
54615A34652J206J099O25K01p8j07J24K37r7n04l79J99O62Q39R37R09O60N78R58
54596A42721J194N77l75n14Q0J80n95j194q60k27j57n02o36m25o7L47O03L85k4
54577A40511K42J391K328J925M59p61r26m11j29n71j379j673r59K94J201J416
54561A42958J196O97j23r31j068m27L20N60L29Nm3M75J473K177J811P13P9L83
54543A50584Q90R05O75O76P91P26N87N02K13l52o82l84J35K38r5m66p55j014j076
54524A52098p95m84n03o88o83o45j006j630j830j292m49K05P52J460K091J962
54508A48563Q21o01j119k91J040J584R23j54n86j43N17O24Q0n42o84m48m02q02
$$ y = [140255, 139684, 138817, 138282, 137886, 137189, 136257, 135629, 135747, 136497, 137248, 137450, 137180, 136852, 136474, 135695, 134644, 134118, 134652, 135858, 136957, 137582, 137783, 137705, 137598, 137722, 137959, 137862, 137358, 136979, 137178, 137840, 138679, 139616, 140525, 141185, 141763, 142721, 143915, 144492, 144117, 143603, 143683, 143863, 143268, 142074, 141214, 140987, 140830, 140328, 139692, 139267, 139200, 139547, 140150, 140535, 140511, 140753, 142144, 144472, 146397, 146856, 146095, 145169, 144758, 144629, 144058, 142679, 141006, 140047, 140341, 141542, 142958, 144154, 144851, 144728, 143797, 142729, 142302, 142622, 143182, 143511, 143516, 143473, 143948, 145421, 147598, 149409, 150122, 150201, 150584, 151474, 152379, 153054, 153730, 154521, 155247, 155834, 156336, 156549, 156197, 155515, 155131, 155266, 155504, 155409, 154943, 154188, 153174, 152098, 151303, 150819, 150316, 149628, 148945, 148300, 147294, 145664, 143834, 142542, 142093, 142298, 143050, 144510, 146601, 148563, 149384, 148783, 147664, 147373, 148413, 149997, 150920, 150766, 150180, 150037, 150554, 151178, 151258, 150716, 150032, 149584, 149182, 148380]
54490A48380j286j463j444j445j257n85L20R13J146J402J674J434M95n36r15n05
54474A46328L12J114J608J693J559J538J687J726J502J257J272J400J215N44k78
54459A64477p38o70m00k75j81J60N02J43j024k070k064j196l59L2K76O24Q92Q37
54441A58966M13k90r71j138n79K42O54N19J33l02p13q49n44oN41J236K045K331
54423A61688J658O70L17M93M26O6O3M07L54k21n25k27L0j27j14N45J354J682J642
54404A70181J493R84l2r23r99m25J99P39J376J922J956J478Q38K31l00n89m96
54387A77633k43j92m09o80q23p79n78l82l94n73o35m10J9N53J141J558J564J336
54369A77706J320J536J508J059P23J162K449M055N193N258M366L493L461L875
$$ y = [148380, 147094, 145631, 144187, 142742, 141485, 140900, 141220, 142133, 143279, 144681, 146355, 147789, 148284, 147748, 146833, 146328, 146640, 147754, 149362, 151055, 152614, 154152, 155839, 157565, 159067, 160324, 161596, 162996, 164211, 164755, 164477, 163739, 163069, 162669, 162394, 162213, 162373, 162875, 163018, 161994, 159924, 157860, 156664, 156305, 156337, 156613, 157237, 158129, 158966, 159379, 159089, 158118, 156980, 156401, 156643, 157297, 157816, 157949, 157647, 156934, 156085, 155541, 155535, 156076, 157312, 159357, 161688, 163346, 164016, 164333, 164826, 165252, 165318, 165381, 165788, 166142, 165921, 165396, 165169, 165199, 165072, 164958, 165503, 166857, 168539, 170181, 171674, 172658, 172626, 171703, 170704, 170279, 170478, 171217, 172593, 174515, 176471, 177949, 178787, 179018, 178718, 178129, 177633, 177390, 177198, 176789, 176109, 175286, 174507, 173929, 173547, 173153, 172580, 171945, 171535, 171554, 172107, 173248, 174806, 176370, 177706, 179026, 180562, 182070, 183129, 183852, 185014, 187463, 191518, 196711, 201969, 206335, 209828, 213289, 217164]
54355B17164L689K728J816J267M15j010k151k379k412l160m185m415l906l710
54341A99751m142m301l461k066j005n02k09P3J67m8l84n64n47m56k92m3k5o52
54323A81294j647j969j112j9N5o90r08o4Q77R51L53k71p18r20o09O4K56m70j328
54304A73125j308n47l1k15o54q22o62l66j29l8mJ55L52K44k31o33o20l82k28j23
54284A66883R0L79P09J132J442J237O01K41N33R88J000O63L78J95N7J64N71Q18
54266A78081N63J66P4Q8j82m76j70Q06J910K598K555J676M40j19N43J647J945
54249A92145J222L43KP3Q9j90p81j495j917j733j091m72k47n19j111j547j348
54232A81423o39o8R5K83P67J061O76j10p42j115j233p67L25J243J237O81M85P88
$$ y = [217164, 220853, 223581, 225397, 226664, 227079, 226069, 223918, 221539, 219127, 215967, 211782, 207367, 203461, 199751, 195609, 191308, 187847, 185781, 184776, 184274, 184065, 184138, 184305, 184257, 183873, 183309, 182762, 182306, 182014, 181971, 181946, 181294, 179647, 177678, 176566, 176547, 176602, 175912, 175004, 174940, 175817, 176768, 177121, 176850, 176132, 175212, 174603, 174667, 174923, 174453, 173125, 171817, 171270, 171239, 171024, 170370, 169548, 168886, 168520, 168391, 168353, 168349, 168504, 168856, 169100, 168869, 168236, 167616, 167234, 167006, 166883, 166973, 167352, 168061, 169193, 170635, 171872, 172473, 172714, 173247, 174235, 175235, 175898, 176276, 176471, 176528, 176692, 177263, 178081, 178644, 178810, 178884, 178972, 178790, 178314, 178144, 178950, 180860, 183458, 186013, 187689, 188129, 188010, 188553, 190200, 192145, 193367, 193710, 193712, 193785, 193874, 193684, 192903, 191408, 189491, 187758, 186667, 186195, 185948, 185429, 184318, 182771, 181423, 180784, 180716, 180811, 181094, 181861, 182922, 183598, 183488, 182746, 181631, 180398, 179631, 179956, 181199, 182436, 183117, 183602, 184390]
54214A84390R93P78K57m90j235j336n88J2n68j732j919q79j1l12j163j493j124
54197A73580m45L30J066J475J514J476J422J035L09k37k63k7J92M38O11L31l17
54180A82490n46J13J056J415J203J082J286J409J109N86K06N8m2k37m48n25n35
54163A89680p03r22o58L22J325J399M83o18j312j649j676j169k53M28N52N45P58
54146A86532P93K00o46r69o49j96N8J76J77j2j87kM33N84K18k80n15n59o10n61
54126A83985k12K94O07O08M33J90m2k9M19J042J337J282J435K017K382J812N75
54109A98135l58n47m13m28m99l61oM58J012J486J562J276J138J502K042K218J998
54092B10215J805K000K615L367L668K992J514J40m36m93p61j424k076k400k448
$$ y = [184390, 185383, 186161, 186418, 185928, 184693, 183357, 182769, 182781, 182213, 180481, 178562, 177683, 177672, 177360, 176197, 174704, 173580, 173135, 173465, 174531, 176006, 177520, 178996, 180418, 181453, 181762, 181525, 181262, 181235, 181427, 181865, 182476, 182807, 182490, 181944, 182057, 183113, 184528, 185731, 186813, 188099, 189508, 190617, 191203, 191409, 191467, 191425, 191188, 190740, 190215, 189680, 188977, 188055, 187397, 187719, 189044, 190443, 190926, 190308, 188996, 187347, 185671, 184502, 184249, 184677, 185229, 185774, 186532, 187325, 187525, 186879, 185910, 185261, 185065, 185123, 185299, 185476, 185464, 185277, 185275, 185708, 186292, 186510, 186230, 185715, 185156, 184546, 183985, 183773, 184067, 184674, 185282, 185715, 185905, 185863, 185834, 186253, 187295, 188632, 189914, 191349, 193366, 195748, 197560, 198135, 197777, 197230, 196817, 196389, 195890, 195529, 195523, 195981, 196993, 198479, 200041, 201317, 202455, 203957, 205999, 208217, 210215, 212020, 214020, 216635, 220002, 223670, 226662, 228176, 228316, 227880, 227387, 226626, 225202, 223126, 220726, 218278]
54077B18278k289j872j206l92M62J149J290P08j45m92mR04J517J444Q60K93J37
54060B20642L32N72Q19J335K182K972L272L038K557K185K136K216J834P34l12
54045B46514j56J194K406K486J905J730K260L075L851M547N121N620O254P035
54031B93842P655P993Q221Q177P331N800M612M371M420L979L303K935K617J963
54017C67219J483J716J958J133m95j765k469l367m536n149m975m842n256n782
54003C34873o122o674p545p985p332n925m617l875l676l737l706l503l434l581
53989B63161l356k354j277j112j642j871j631j630j938j837j256r92j172r64k16
53974B39913M8o05j092n35K93K44m83q95o67l8R33J965K137R91m10o14M02J496
$$ y = [218278, 215989, 214117, 212911, 212519, 212981, 214130, 215420, 216128, 215983, 215491, 215487, 216391, 217908, 219352, 220212, 220505, 220642, 220974, 221546, 222365, 223700, 225882, 228854, 232126, 235164, 237721, 239906, 242042, 244258, 246092, 246826, 246514, 246358, 247552, 249958, 252444, 254349, 256079, 258339, 261414, 265265, 269812, 274933, 280553, 286807, 293842, 301497, 309490, 317711, 325888, 333219, 339019, 343631, 348002, 352422, 356401, 359704, 362639, 365256, 367219, 368702, 370418, 372376, 373509, 373014, 371249, 368780, 365413, 360877, 355728, 350753, 345911, 340655, 334873, 328751, 322077, 314532, 306547, 299215, 293290, 288673, 284798, 281122, 277385, 273679, 270176, 266742, 263161, 259805, 257451, 256174, 255062, 253420, 251549, 249918, 248288, 246350, 244513, 243257, 242265, 241093, 240129, 239913, 239961, 239356, 238264, 237729, 238022, 238266, 237783, 236888, 236221, 236183, 237116, 239081, 241218, 242209, 241799, 241185, 241587, 243083]
53956B43083K031K279K431K345K258K784M004N268O114O844Q048R922J2044J3501
53942C22956J3353J1425Q637O131M201K412O71m20l58N23J316J372P44k8m27k66
53926C72242L34J058J459J266R10J346K923M742N715N935O292O989P482P795Q701
53911D35189J0261J1394J1348J0632R872Q761O974N195M185L511K205K75j456
53898E18346k558l171l308k997k827l401m357m858m993n744p478r419j0741j1392
53884D41102j1579j1238j0402r511q978q764q609q381q041p594p234p143p049
53871C26579o416n236m269m194m836n472n614n223m344l034j680j026j550k893
53857B70792m073m338l716k730j793j049n77m51o64j142j778k265k128j327o04
$$ y = [243083, 245114, 247393, 249824, 252169, 254427, 257211, 261215, 266483, 272597, 279441, 287489, 297411, 309455, 322956, 336309, 347734, 356371, 362502, 366703, 369115, 369786, 369366, 369008, 369531, 370847, 372219, 372963, 372935, 372508, 372242, 372576, 373634, 375093, 376359, 377269, 378615, 381538, 386280, 391995, 397930, 404222, 411211, 418693, 426488, 435189, 445450, 456844, 468192, 478824, 488696, 497457, 504431, 509626, 513811, 517322, 519527, 519802, 518346, 515788, 512617, 509309, 506312, 503485, 500084, 495727, 490869, 485876, 480132, 472654, 463235, 452494, 441102, 429523, 418285, 407883, 398372, 389394, 380630, 372021, 363640, 355599, 348005, 340771, 333628, 326579, 320163, 314927, 310658, 306464, 301628, 296156, 290542, 285319, 280975, 277941, 276261, 275235, 273685, 270792, 266719, 262381, 258665, 255935, 254142, 253093, 252516, 252065, 251401, 250259, 248481, 246216, 244088, 242761, 242157]
53842B42157o63j128r80r8M45p9r09q08K83J230J142L10l03j40M71O89O4r38j431
53823B39314j090l43L35Q82J357J672J807J871J794J412J006J172J932K535K472
53808B58128K189K397L178M104M806N104N047N180O128P593Q396Q009P354P379
53794C34992P631P107N917M990M478L668K463J770K113K679K319R60l97q74n80
53779C79236m35j256l002m891o258p068p572p881q008p973p604o650n396m634
53765C00608m603m478l546k389k189l095m016l967k975j737r47r89j708k470k767
53750B58732k691k532k243j705j239j237j506j584j478j542j739j688j345j024
53736B35179p65k57N67J352J738J602R81J32m77o40o23n88j93O72J270R41K56
$$ y = [242157, 241494, 240366, 239386, 239288, 239733, 239654, 238745, 237937, 238220, 239450, 240592, 240902, 240599, 240459, 240930, 241619, 241683, 240745, 239314, 238224, 237881, 238216, 239098, 240455, 242127, 243934, 245805, 247599, 249011, 250017, 251189, 253121, 255656, 258128, 260317, 262714, 265892, 269996, 274802, 279906, 284953, 290133, 296261, 303854, 312250, 320259, 327613, 334992, 342623, 349730, 355647, 360637, 365115, 368783, 371246, 373016, 375129, 377808, 380127, 381087, 380690, 379816, 379236, 378801, 377545, 374543, 369652, 363394, 356326, 348754, 340873, 332865, 324892, 317288, 310638, 305242, 300608, 296005, 291527, 287981, 285592, 283403, 280308, 276292, 272325, 269350, 267613, 266666, 265677, 263969, 261499, 258732, 256041, 253509, 251266, 249561, 248322, 247085, 245579, 243995, 242517, 240975, 239236, 237548, 236203, 235179, 234414, 234157, 234724, 236076, 237814, 239416, 240397, 240529, 240052, 239412, 238789, 238201, 238008, 238680, 239950, 240891, 241147]
53719B41147K75R10J137P89Q86J883K783K552J577R91J090J210Q49L06K05P44
53703B59334J477J766J540J485K250L605M727N192N207M917M119K809J499P29
53689C00656N70P46R21Q31M19j6q8K61P09Q85N90m7m48k2Q84J024k53j985k806
53670C02831k637k300j908q77O09J491J366R28O73K86k90l66L18R45P79J77j70
53653C01855k19j25L44J188J631J092J42l07l05m94q39o29L50J449J936J665R90
53636C09724M92O26J271J747J641J323J286J398J329J316J763K413K558K060J487
53621C32434J310J541K102K984L959M651M956N011M826M352L891L892M342M765
53607C85016M843M635M134L195K008J122Q64J029J324J686K030K104J802J349
$$ y = [241147, 241422, 242332, 243469, 244258, 245144, 247027, 249810, 252362, 253939, 254930, 256020, 257230, 258079, 258385, 258590, 259334, 260811, 262577, 264117, 265602, 267852, 271457, 276184, 281376, 286583, 291500, 295619, 298428, 299927, 300656, 301226, 301972, 302893, 303724, 304143, 304127, 304039, 304300, 305009, 305894, 306484, 306437, 305989, 305967, 306851, 307875, 307622, 305637, 302831, 300194, 297894, 295986, 295109, 295718, 297209, 298575, 299503, 300176, 300462, 300172, 299806, 300124, 301069, 301848, 302025, 301855, 301636, 301511, 301855, 303043, 304674, 305766, 305908, 305601, 305296, 304802, 303963, 303334, 303684, 305133, 307069, 308734, 309724, 310216, 310842, 312113, 313860, 315501, 316824, 318110, 319508, 320837, 322153, 323916, 326329, 328887, 330947, 332434, 333744, 335285, 337387, 340371, 344330, 348981, 353937, 358948, 363774, 368126, 372017, 375909, 380251, 385016, 389859, 394494, 398628, 401823, 403831, 404953, 405817, 406846, 408170, 409856, 411886, 413990, 415792, 417141]
53593D17141R40N41J89J15L30M49K61J10L14N24J67o39j208j284j350j823k446
53576D12331k758k658k247j479m51K88K39l99r87j282j526j749j605j025m68k54
53560C93970j15K67O58O78M21L16M56N69M99L99M58P26J101J322J138O89N16R02
53542D04970J439J555J217Q16O22Q02J629L071M397M799M416M209M746N713O494
53527D50895O778O575O269O602P975R621J0240R617Q939R245J0257J1101J1581
53514E65695J2152J3114J4391J5757J6900J7508J7764J8344J9524K0646K1005
53503G52800K0859K0971K1402K1508K0985K0148J9230J8184J7342J7405J8306
53492I69140J8819J7935J6206J4950J4459J3947J3182J3119J4369J6012J6779
$$ y = [417141, 418081, 418622, 418811, 418926, 419256, 419705, 419966, 420076, 420390, 420914, 421081, 420442, 419234, 417950, 416600, 414777, 412331, 409573, 406915, 404668, 403189, 402738, 403026, 403265, 402866, 401879, 400597, 399071, 397322, 395717, 394692, 394224, 393970, 393855, 394122, 394780, 395458, 395879, 396195, 396651, 397220, 397719, 398118, 398576, 399302, 400403, 401725, 402863, 403552, 404068, 404970, 406409, 407964, 409181, 409997, 410619, 411421, 413050, 416121, 420518, 425317, 429733, 433942, 438688, 444401, 450895, 457673, 464248, 470517, 477119, 485094, 494715, 504955, 514572, 523511, 532756, 543013, 554114, 565695, 577847, 590961, 605352, 621109, 638009, 655517, 673281, 691625, 711149, 731795, 752800, 773659, 794630, 816032, 837540, 858525, 878673, 897903, 916087, 933429, 950834, 969140, 987959, 1005894, 1022100, 1037050, 1051509, 1065456, 1078638, 1091757, 1106126, 1122138, 1138917]
53481A138917J6806J7228J8219J8685J7981J6885J6307J5995J5172J3763J2183
53470A318141J0426Q273O037M200K513L40k222m422o045p597r158j0017r760r033
53456A291676q726q998r532j0241j1252j2443j3500j4291j4891j5414j5845j5981
53444A140562j5526j4505j3511j3115j3131j2889j2215j1506j0777r369o923m135
53432A002960k113j315j332j379q01N37K086L195L894M692N582N929N618N522
53418A033075O403P939R429J0855J2552J4240J5254J5629J6211J7560J9224K0371
53406A198742K0783K1092K2127K4079K6306K7904K8554K8791K9488L1177L3758
53395A492801L6615L9051M0818M2216M3534M4589M5134M5453M6065M6970M7688
$$ y = [1138917, 1155723, 1172951, 1191170, 1209855, 1227836, 1244721, 1261028, 1277023, 1292195, 1305958, 1318141, 1328567, 1336840, 1342877, 1347077, 1349590, 1349930, 1347708, 1343286, 1337241, 1329644, 1320486, 1310469, 1300709, 1291676, 1282950, 1273952, 1264420, 1254179, 1242927, 1230484, 1216984, 1202693, 1187802, 1172388, 1156543, 1140562, 1125036, 1110531, 1097020, 1083905, 1070774, 1057885, 1045670, 1034164, 1023387, 1014018, 1007095, 1002960, 1000847, 999532, 998200, 996821, 996020, 996557, 998643, 1001838, 1005732, 1010424, 1016006, 1021935, 1027553, 1033075, 1039478, 1047417, 1056846, 1067701, 1080253, 1094493, 1109747, 1125376, 1141587, 1159147, 1178371, 1198742, 1219525, 1240617, 1262744, 1286823, 1313129, 1341033, 1369587, 1398378, 1427866, 1459043, 1492801, 1529416, 1568467, 1609285, 1651501, 1695035, 1739624, 1784758, 1830211, 1876276, 1923246, 1970934]
53384A970934M7956M7802M7109M5742M4026M2358M0448L7770L4796L2608L1160
53373B422709K9066K5554K1471J7786J4177R980N499J336k870p889j3595j9225
53361B503999k4490k9412l3493l6167l7844l9431m0907m1386m0622l9412l8408
53350B102427l7479l6462l5618l4925l3713l1554k9141k7760k8037k9339l0357
53339A748042l0188k9072k7972k7310k6350k4290k1604j9597j8635j7625j5526
53328A489873j2763j0638r724r455r272r529j0868j2997j4739j5426j5705j6426
53316A342331j7264j7198j6122j4967j4159j3120j1635j0551j0370j0107q611
53305A198227o325m636l973l646l206k723j925k83J913L765N186P062R644J1891
$$ y = [1970934, 2018890, 2066692, 2113801, 2159543, 2203569, 2245927, 2286375, 2324145, 2358941, 2391549, 2422709, 2451775, 2477329, 2498800, 2516586, 2530763, 2540743, 2546242, 2547578, 2544708, 2536819, 2523224, 2503999, 2479509, 2450097, 2416604, 2380437, 2342593, 2303162, 2262255, 2220869, 2180247, 2140835, 2102427, 2064948, 2028486, 1992868, 1957943, 1924230, 1892676, 1863535, 1835775, 1807738, 1778399, 1748042, 1717854, 1688782, 1660810, 1633500, 1607150, 1582860, 1561256, 1541659, 1523024, 1505399, 1489873, 1477110, 1466472, 1456748, 1447293, 1438021, 1428492, 1417624, 1404627, 1389888, 1374462, 1358757, 1342331, 1325067, 1307869, 1291747, 1276780, 1262621, 1249501, 1237866, 1227315, 1216945, 1206838, 1198227, 1191902, 1187266, 1183293, 1179647, 1176441, 1173718, 1171793, 1171510, 1173423, 1177188, 1182374, 1189436, 1199080, 1210971]
53291A210971J3030J3842J5543J7970J9792K0326K0239K0398K0644K0220J9008
53280A411983J7721J6780J5580J3439J0852R006P968O383L325m07l463n679p735
53267A495753r753j1274j2332j3507j4971j6382j7667j9095k0515k1378k1581
53256A317298k1578k1663k1839k2331k3369k4398k4433k3336k1947k0810j9684
53245A071910j8519j7968j8424j9275j9652j9374j8678j7691j6627j5953j5806
53234H73943j5642j4907j3713j2513j1444j0388r289q123o870n862n676o404p340
53221G45772p826q091q816j0195j1796j3132j4026j4568j5007j5525j5915j5692
53209E95183j4693j3419j2526j2166j1942j1360j0281r122q587q926r538r684
$$ y = [1210971, 1224001, 1237843, 1253386, 1271356, 1291148, 1311474, 1331713, 1352111, 1372755, 1392975, 1411983, 1429704, 1446484, 1462064, 1475503, 1486355, 1495361, 1503329, 1509712, 1513037, 1512630, 1509167, 1503488, 1495753, 1486000, 1474726, 1462394, 1448887, 1433916, 1417534, 1399867, 1380772, 1360257, 1338879, 1317298, 1295720, 1274057, 1252218, 1229887, 1206518, 1182120, 1157687, 1134351, 1112404, 1091594, 1071910, 1053391, 1035423, 1016999, 997724, 978072, 958698, 940020, 922329, 905702, 889749, 873943, 858301, 843394, 829681, 817168, 805724, 795336, 786047, 777924, 771054, 765192, 759516, 753112, 745772, 737946, 729855, 721039, 710844, 699048, 685916, 671890, 657322, 642315, 626790, 610875, 595183, 580490, 567071, 554545, 542379, 530437, 519077, 508796, 499674, 491087, 482161, 472623, 462939]
53197D62939r446r431r630r304q245p315p316p923q245p927p207o284n290m593
53183C54783m549n020n469n484m992m172l342k817k632k592k606k685k655k326
53169C03442j987k130k533k336j337m43m25q60r26o60o14q31r31q94r68j047q86
53152B83634p48j033j493j512j153j036j229j127n77k70o43j107q48P0Q41Q62
53136B72631K25m62n17K88J377J799J263N09M77J281K217K547K092J193L78m6
53120B87252j35q2J39O58J284J583J453J287J331J304R19M01Q5k35j004k023k492
53103B91725k041j209o87n38m20k74l17n19n33k28N4j41q19j535j861j803j743
53086B77111j888j900j284k17M00mq71j221r07o34p20n50M49J828K612K401J602
$$ y = [462939, 453493, 444062, 434432, 425128, 416883, 409568, 402252, 394329, 386084, 378157, 370950, 364666, 359376, 354783, 350234, 345214, 339745, 334261, 329269, 325097, 321755, 318938, 316306, 313714, 311108, 308423, 305768, 303442, 301455, 299325, 296792, 294456, 293119, 292676, 292251, 291391, 290465, 289805, 289191, 288360, 287429, 286535, 285567, 284520, 283634, 282886, 281853, 280360, 278848, 277695, 276659, 275430, 274303, 273726, 273456, 272813, 271706, 270858, 270928, 271769, 272631, 272856, 272394, 271877, 272165, 273542, 275341, 276604, 277113, 277590, 278871, 281088, 283635, 285727, 286920, 287298, 287252, 287117, 287035, 287174, 287832, 289116, 290699, 292152, 293439, 294770, 296074, 296993, 297394, 297479, 297244, 296240, 294217, 291725, 289684, 288475, 287788, 287250, 286830, 286556, 286239, 285720, 285187, 284959, 285013, 284872, 284053, 282518, 280657, 278854, 277111, 275223, 273323, 272039, 271822, 272222, 272218, 271347, 270126, 269219, 268585, 267865, 267315, 267764, 269592, 272204, 274605, 276207]
53069B76207P03j70j024j717k033j854j296p45o54j082j513j361o42L8J88p3k50
53052B62722q5J81K39K58P25J603K122J734R85P91J123J208Q87P27P14M7j223
53035B74758j656m53J040J037j94r47o29j53LM70J471K075J557M64k87n22m88
53018B77546k13K52N21M45M32Q11J286J405J161Q03M66L12N17Q78R39P37Q71J446
53000B90615J683R73j91q88q98o12k90OJ13l6j38N9K65P1l47l85J62Q87J322J416
52980B93787J478J816K398K823K778K492K436K589K473J926J302Q34L12l44q17
52965C18283r96j223j615j661r65R8Q58J112R84N29j34p26j197j772k283k110
52949C07182j229o45j077j905k100j696j437j462j277q39o82r60j231j191j010
$$ y = [276207, 276910, 276740, 275716, 273999, 271966, 270112, 268816, 268071, 267417, 266335, 264822, 263461, 262819, 262857, 263045, 262972, 262722, 262637, 262818, 263057, 263315, 264040, 265643, 267765, 269499, 270484, 271275, 272398, 273606, 274493, 275220, 275934, 275981, 274758, 273102, 272649, 273689, 274726, 274532, 273585, 272956, 272803, 272806, 273276, 274747, 276822, 278379, 278843, 278556, 278034, 277546, 277333, 277585, 278106, 278551, 278983, 279794, 281080, 282485, 283646, 284449, 284915, 285227, 285744, 286622, 287561, 288298, 289169, 290615, 292298, 293271, 293080, 292192, 291294, 290682, 290392, 290398, 290511, 290475, 290337, 290396, 290661, 290732, 290385, 290000, 290162, 291049, 292371, 293787, 295265, 297081, 299479, 302302, 305080, 307572, 310008, 312597, 315070, 316996, 318298, 319132, 319444, 319100, 318283, 317287, 316064, 314449, 312788, 311823, 311921, 312779, 313891, 314875, 315404, 315270, 314544, 313347, 311575, 309292, 307182, 305953, 305308, 304231, 302326, 300226, 298530, 297093, 295631, 294354, 293515, 292833, 291873, 290642, 289451, 288441]
52934B88441q56o64m69m62p03j061j378j425r94l23q5m52p06l02J57p3m76Q3J468
52915B79720K226J579L96j10J90O56Q62P59M14J9j76k04l75p33r03o67l32l28
52897B82993p26j249j510j156j81Q67J339J174Q78Q06Q95J048J254J320R79L89
52881B89120M5L0j11o31j168j285r92m58K74J092J663J870K097K721L543M006
52865C01816L884L534L405L457L104J909K97o84n95k73p96k121l265l672l692
52850C06308l786l989m287m717m907m223k775j588j324j458j210p38p49j309j811
52835B67437j915j815j639j179l74M34Q42P58L85N1N8M31Q00P15J23o32j145j183
52817B62152p18J2N47O41O44J114K029K707K634K107J811J946K048J589M96r38
$$ y = [288441, 287585, 286921, 286452, 285990, 285287, 284226, 282848, 281423, 280429, 280106, 280021, 279569, 278863, 278561, 278718, 278645, 278169, 278252, 279720, 281946, 283525, 283921, 283811, 284001, 284657, 285519, 286278, 286692, 286711, 286535, 286331, 285956, 285223, 284320, 283653, 283321, 282993, 282267, 281018, 279508, 278352, 278171, 279038, 280377, 281551, 282429, 283235, 284130, 285178, 286432, 287752, 288731, 289120, 289165, 289195, 289084, 288453, 287285, 286000, 285008, 284550, 284824, 285916, 287579, 289449, 291546, 294267, 297810, 301816, 305700, 309234, 312639, 316096, 319200, 321109, 321406, 320722, 320127, 319854, 319058, 316937, 313672, 310000, 306308, 302522, 298533, 294246, 289529, 284622, 280399, 277624, 276036, 274712, 273254, 272044, 271306, 270557, 269248, 267437, 265522, 263707, 262068, 260889, 260515, 260949, 261791, 262549, 262934, 262985, 263043, 263474, 264274, 264989, 265112, 264480, 263335, 262152, 261434, 261446, 261993, 262634, 263278, 264392, 266421, 269128, 271762, 273869, 275680, 277626, 279674, 281263, 281759, 280821]
52801B80821k369l445l780l211k104j192r05r52o65K30J228J514Q08k21o03j39
52785B65015L75J74m47n42J68R38J012N17N6j41k01j42J90P37J197J296R39K05
52767B71346n54q45n32j04r3m14n39k48J72L74K90L4k39l51k04R2L25L61J94k7
52747B69038K0N77J397J875J788J613J830K304K632K700K545K044J235O45P22
52732B92965J177J355J102P17L18j28l37J01J039J803J969J610R61J66o02j226
52716C02990j743k082j940j318p54n58k87L49N90l75j860k286j325k53q9m26m63
52699B88170j44K13O04J091J435J412J099O13P7j76O9K94k08j117j359p33k66
52682B91074n80j016r07p18j080j613j543r84o47p74j076j380j602j424p46o7
$$ y = [280821, 278452, 275007, 271227, 268016, 265912, 264720, 263815, 262863, 262198, 262428, 263656, 265170, 265978, 265757, 265154, 265015, 265390, 265564, 265117, 264575, 264743, 265681, 266693, 267210, 267266, 267125, 266924, 266782, 266972, 267709, 268906, 270202, 271141, 271346, 270792, 269947, 269415, 269311, 269218, 268804, 268265, 268017, 268189, 268563, 268853, 268887, 268648, 268297, 268093, 268185, 268510, 268871, 269065, 269038, 269058, 269635, 271032, 272907, 274695, 276308, 278138, 280442, 283074, 285774, 288319, 290363, 291598, 292243, 292965, 294142, 295497, 296599, 297316, 297634, 297506, 297169, 297270, 298309, 300112, 302081, 303691, 304652, 304818, 304216, 302990, 301247, 299165, 297225, 295907, 295153, 294595, 294308, 294657, 295247, 294872, 293012, 290726, 289401, 289148, 289059, 288633, 288170, 288026, 288239, 288843, 289934, 291369, 292781, 293880, 294493, 294570, 294394, 294463, 294757, 294549, 293432, 292073, 291340, 291074, 290494, 289478, 288571, 287853, 286773, 285160, 283617, 282633, 281986, 281212, 280136, 278756, 277154, 275730, 274984, 274917]
52666B74917J55J72M40Q02Q57P60R16J156R17J96l54j81P16J953K952L197K744
52649B92315K260K125J887J073J09k28lj3n93j233j377j059o06j52L99J137J894
52632B97935K245J940J461J660K771M140N122N579N314L830J211j482l388m738
52618C23600n901o342n556m322l799l820l359k368j713j500q79K15P09J42n07
52603B84600l68N2r2n82o45j90K58M07L57K32K13N99J341J872J764J218O10J4
52585B91660m57l55M68J349J484Q83J45m35r40j300j268q96n34l16n4L62P51Q75
52567B91422O29O8n06o08m1O88P65m7j121j600j209m54j22n03j083j034j77P42
52549B85809Q29j7j100j698j604j103o40n06o19o34m16k73n09q76p65K0J017J676
$$ y = [274917, 275072, 275244, 275684, 276486, 277343, 278103, 279019, 280175, 281092, 281288, 280934, 280753, 281469, 283422, 286374, 289571, 292315, 294575, 296700, 298587, 299660, 299769, 299541, 299538, 299525, 298932, 297699, 296322, 295263, 294657, 294505, 294904, 296041, 297935, 300180, 302120, 303581, 305241, 308012, 312152, 317274, 322853, 328167, 331997, 333208, 331726, 328338, 323600, 317699, 311357, 305801, 301479, 297680, 293860, 290501, 288133, 286420, 284920, 284041, 284256, 284965, 285107, 284600, 284232, 284284, 284192, 283610, 282965, 282775, 283033, 283440, 283797, 284029, 284242, 284841, 286182, 288054, 289818, 291036, 291646, 291660, 291203, 290848, 291316, 292665, 294149, 295032, 295177, 294742, 293802, 292502, 291234, 290338, 289804, 289488, 289434, 289796, 290547, 291422, 292051, 292119, 291613, 291005, 290964, 291652, 292417, 292370, 291249, 289649, 288440, 287986, 287864, 287361, 286278, 285244, 285067, 285809, 286638, 286621, 285521, 283823, 282219, 281116, 280476, 279970, 279351, 278717, 278301, 278028, 277519, 276643, 275878, 275898, 276915, 278591]
52531B78591J921J934J726J174M76J95O67J536K030J773J129P78J034J669K233
52516B98866K450K376K334K645L289L856M041M087M492N227N548M703K695K28
52502C46837j927l379m141m451m524m380l936l328k949k998l177l037k531j925
52488C00154j271l66O52J095M71p52j515j256l30O14J288J680J711J334Q38P09
52472C05056J122J765K167K166K016K167K782L451L496K821K228K545L525M005
52458C41312L221J627K06o50j358k423l777m821n017m453l818l664l744l350k264
52443C07027j006r8M34O70M03m10j158j132m04K68M09K46J70J73J8l19o10o43
52425C04038m13l6M14R24J360J418J004N66O56J129J224O29L0J95R49J544J788
$$ y = [278591, 280512, 282446, 284172, 285346, 285822, 286017, 286684, 288220, 290250, 292023, 293152, 293930, 294964, 296633, 298866, 301316, 303692, 306026, 308671, 311960, 315816, 319857, 323944, 328436, 333663, 339211, 343914, 346609, 346837, 344910, 341531, 337390, 332939, 328415, 324035, 320099, 316771, 313822, 310824, 307647, 304610, 302079, 300154, 298883, 298517, 299169, 300264, 300735, 299983, 298468, 297212, 296882, 297496, 298784, 300464, 302175, 303509, 304347, 305056, 306178, 307943, 310110, 312276, 314292, 316459, 319241, 322692, 326188, 329009, 331237, 333782, 337307, 341312, 344533, 346160, 346366, 345716, 344358, 341935, 338158, 333337, 328320, 323867, 320049, 316385, 312641, 309291, 307027, 306021, 305923, 306357, 307027, 307430, 307020, 305862, 304730, 304326, 304594, 305003, 305249, 305419, 305592, 305610, 305291, 304681, 304038, 303625, 303589, 304003, 304927, 306287, 307705, 308709, 309275, 309931, 311060, 312284, 312913, 312943, 313138, 314087, 315631, 317419]
52408C17419K221L253M722O307P908R474J0792J1586J1526J0159P253L360l28
52395D05652k905m377n305o098o755p023o618n495m039k875k336k203k051j703
52381C45869j266q42m00J56Q71J724K671L654M539N094N189N053N128N480N595
52366C88515M875L371J729N59l5l94r40j757k371k154j138j46J71J46M80J073
52350C91984J103K94n72o61k2Q03J619K548L359L500K866K158K192L072M179M926
52334D23348N268N512N871O449P374Q636R843J0623J1255J2493J4478J6301J7036
52321E54487J6844J6633J6805J6901J6454J5722J5451J6139J7625J9228K0350
52310G42639K1054K1913K3179K4367K4937K5120K5594K6565K7526K7922K7653
$$ y = [317419, 319640, 322893, 327615, 333922, 341830, 351304, 362096, 373682, 385208, 395367, 402620, 405980, 405652, 402747, 398370, 393065, 386967, 380212, 373189, 366571, 361076, 357037, 354162, 351826, 349623, 347572, 345869, 344603, 343761, 343361, 343517, 344388, 346112, 348783, 352437, 356976, 362070, 367259, 372312, 377440, 382920, 388515, 393390, 396761, 398490, 399049, 399014, 398620, 397680, 395923, 393552, 391398, 390260, 390114, 390285, 390431, 390911, 391984, 393087, 393381, 392809, 392148, 392126, 392929, 394548, 397096, 400455, 403955, 406821, 408979, 411171, 414243, 418422, 423348, 428616, 434128, 439999, 446448, 453822, 462458, 472301, 482924, 494179, 506672, 521150, 537451, 554487, 571331, 587964, 604769, 621670, 638124, 653846, 669297, 685436, 703061, 722289, 742639, 763693, 785606, 808785, 833152, 858089, 883209, 908803, 935368, 962894, 990816, 1018469]
52299A018469K6956K6163K5488K4761K3507K1484J8938J6081J2794R255O288M350
52287A234534K549k37l560n809o460o721p578q410q252p493p389q301r235r018
52273A148620p410n170l370k504j996q15J275L463M981N972P010Q322R834J1482
52259A179694J3039J4109J4827J6067J8361K0961K2575K2861K2544K2268K1887
52248A389193K0835J8695J5421J1480P709M701K344K29j736l457n124p015r024
52235A444251j0838j2489j4205j5871j7229j8471j9949k1266k1436k0208j8622
52224A253667j7812j7772j7704j7218j6579j5947j4975j3384j1556j0237r708
52213A090775r481q835p487n676l792k195j189p88m37M76J725K334J904J322J656
$$ y = [1018469, 1045425, 1071588, 1097076, 1121837, 1145344, 1166828, 1185766, 1201847, 1214641, 1223896, 1230184, 1234534, 1237083, 1236846, 1233286, 1227477, 1221017, 1214296, 1206718, 1198308, 1190056, 1182563, 1175174, 1166873, 1157638, 1148620, 1141210, 1136040, 1132670, 1130166, 1128170, 1127355, 1128630, 1132093, 1137074, 1143046, 1150056, 1158378, 1168212, 1179694, 1192733, 1206842, 1221669, 1237736, 1256097, 1277058, 1299633, 1322494, 1345038, 1367306, 1389193, 1410028, 1428723, 1444144, 1455624, 1463333, 1468034, 1470378, 1470607, 1468871, 1465414, 1460290, 1453275, 1444251, 1433413, 1420924, 1406719, 1390848, 1373619, 1355148, 1335199, 1313933, 1292497, 1272289, 1253667, 1235855, 1218083, 1200379, 1183161, 1166582, 1150635, 1135660, 1122276, 1110720, 1100483, 1090775, 1081294, 1072459, 1064972, 1059296, 1055504, 1053309, 1052120, 1051332, 1050895, 1051371, 1053096, 1055430, 1057334, 1058656, 1060312]
52198A060312K735L569L848M237N178O259O999P498P883P786O943N794M856L772
52184A137669J727j296m264o258p337q078q758r301r661r844r751r371q978q780
52170A037719q434p384n698m112l079k162o61J478L713N559O746O964O034M374
52156A041057K801J735J008M24O7q2l03o63p43k23O99J744K978M330N038M351
52140A064218K685J446J492K229K465J810R57Q55J888L764N948Q120J0273J2502
52126A120652J4751J6899J9027K1373K3977K6456K8290K9263K9582K9617K9599
52115A389486K9569K9429K9019K8261K7328K6577K6097K5469K4269K2798K1946
52104A680248K2140K2821K3157K2887K2099K0606J8186J5229J2446R900O914K984
$$ y = [1060312, 1063047, 1066616, 1070464, 1074701, 1079879, 1086138, 1093137, 1100635, 1108518, 1116304, 1123247, 1129041, 1133897, 1137669, 1139396, 1138100, 1133836, 1127578, 1120241, 1112163, 1103405, 1094104, 1084443, 1074599, 1064848, 1055477, 1046499, 1037719, 1029285, 1021901, 1016203, 1012091, 1009012, 1006850, 1006189, 1007667, 1011380, 1016939, 1023685, 1030649, 1036683, 1041057, 1043858, 1045593, 1046601, 1047025, 1047092, 1047010, 1046707, 1046044, 1045301, 1045078, 1045777, 1047521, 1050499, 1054829, 1059867, 1064218, 1066903, 1068349, 1069841, 1072070, 1074535, 1076345, 1077302, 1078157, 1080045, 1083809, 1089757, 1097877, 1108150, 1120652, 1135403, 1152302, 1171329, 1192702, 1216679, 1243135, 1271425, 1300688, 1330270, 1359887, 1389486, 1419055, 1448484, 1477503, 1505764, 1533092, 1559669, 1585766, 1611235, 1635504, 1658302, 1680248, 1702388, 1725209, 1748366, 1771253, 1793352, 1813958, 1832144, 1847373, 1859819, 1869719, 1876633, 1879617]
52092A879617j678o534j1072j4731j7248j9128k1131k3054k3833k3191k2279k2125
52080A673613k2268k1709k0487j9391j8530j7259j5337j3250j1390r728q213o826
52068A489225n132k554Q47M408P645J0455J2701J4325J5834J7859K0136K1737
$$ y = [1879617, 1877939, 1871405, 1860333, 1845602, 1828354, 1809226, 1788095, 1765041, 1741208, 1718017, 1695738, 1673613, 1651345, 1629636, 1609149, 1589758, 1571228, 1553969, 1538632, 1525382, 1513992, 1504264, 1496051, 1489225, 1484093, 1481539, 1482386, 1486794, 1494439, 1504894, 1517595, 1531920, 1547754, 1565613, 1585749, 1607486]
$$ [...]
##END NTUPLES=NMR SPECTRUM
##END=
