##TITLE=AC1628_CENAH_8450567_f5dI6OPRq1
##JCAMPDX= 6.0         $$ Bruker NMR JCAMP-DX V2.0
##DATA TYPE= NMR SPECTRUM
##DATA CLASS= NTUPLES
##ORIGIN= BRUKER
##OWNER= Administrator
$$ 1.72 TOPSPIN		Version 2.1
$$ 2014-02-18 15:19:28.234 -0800  Administrator@X
$$ Compression mode = diff/dup
##.OBSERVE FREQUENCY= 400.02188249412
##.OBSERVE NUCLEUS= ^1H
##.ACQUISITION MODE= SIMULTANEOUS (DQD)
##.ACQUISITION SCHEME= undefined
##.AVERAGES= 8
##.DIGITISER RES= 22
##SPECTROMETER/DATA SYSTEM= spect
##.PULSE SEQUENCE= zg30
##.SOLVENT NAME= COFFEE_meoh
##.SHIFT REFERENCE= INTERNAL, COFFEE_meoh, 1, 14.98509
##AUDIT TRAIL= $$ (NUMBER, WHEN, WHO, WHERE, PROCESS, VERSION, WHAT)
$$ ##TITLE= Audit trail, TOPSPIN		Version 2.1
$$ ##JCAMPDX= 5.01
$$ ##ORIGIN= Bruker BioSpin GmbH
$$ ##OWNER= Administrator
$$ $$ E:\/data/COFFEE/nmr/AC1628_CENAH_8450567_f5dI6OPRq1/10/pdata/1/auditp.txt
$$ ##AUDIT TRAIL=  $$ (NUMBER, WHEN, WHO, WHERE, PROCESS, VERSION, WHAT)
(   1,<2014-02-18 15:19:21.624 -0800>,<Administrator>,<X>,<go>,<TOPSPIN 2.1>,
      <created by zg
	started at 2014-02-18 15:18:15.968 -0800,
	POWCHK enabled, PULCHK disabled,
       configuration hash MD5:
       C8 4E 4E 5D D3 5C D8 9E 9F 52 82 E0 59 8A DE 15
       data hash MD5: 64K
       08 EB B5 4F 58 8E 30 87 E1 64 73 CC A7 A8 7A 92>)
(   2,<2014-02-18 15:19:24.484 -0800>,<Administrator>,<X>,<proc1d>,<TOPSPIN 2.1>,
      <Start of raw data processing
       efp LB = 0 FT_mod = 6 PKNL = 1 PHC0 = 0 PHC1 = 0 SI = 32K 
       data hash MD5: 32K
       54 18 2A 03 9C E9 84 35 3D 45 93 ED 8D B8 30 79>)
(   3,<2014-02-18 15:19:24.781 -0800>,<Administrator>,<X>,<proc1d>,<TOPSPIN 2.1>,
      <pk PHC0 = 96.94336 PHC1 = 0 
       data hash MD5: 32K
       68 98 97 D4 80 1B 6F 79 79 E1 9D B0 47 23 3C 3E>)
(   4,<2014-02-18 15:19:24.859 -0800>,<Administrator>,<X>,<proc1d>,<TOPSPIN 2.1>,
      <abs ABSG = 1 
       data hash MD5: 32K
       83 58 2A 0A 4C 3A D3 02 88 78 E1 F3 0E BB 18 41>)
(   5,<2014-02-18 15:19:24.921 -0800>,<Administrator>,<X>,<proc1d>,<TOPSPIN 2.1>,
      <abs ABSG = 2 
       data hash MD5: 32K
       53 53 D1 26 E1 95 42 67 9D AC 0B 2A D5 6C 00 49>)
(   6,<2014-02-18 15:19:24.984 -0800>,<Administrator>,<X>,<proc1d>,<TOPSPIN 2.1>,
      <abs ABSG = 3 
       data hash MD5: 32K
       56 62 AD 48 04 00 E1 10 78 DA 9B 5C D2 F9 6A EE>)
(   7,<2014-02-18 15:19:25.046 -0800>,<Administrator>,<X>,<proc1d>,<TOPSPIN 2.1>,
      <abs ABSG = 4 
       data hash MD5: 32K
       83 7F F0 6D 14 7A B3 80 E0 BE E6 56 F6 8A 57 B0>)
(   8,<2014-02-18 15:19:25.109 -0800>,<Administrator>,<X>,<proc1d>,<TOPSPIN 2.1>,
      <abs ABSG = 5 
       data hash MD5: 32K
       FB 07 02 E5 ED CE 24 CB 76 E7 31 93 92 73 07 88>)
$$ ##END=
$$ 
$$ $$ hash MD5
$$ $$ 51 B5 81 CF 9D 60 3D 7C 48 A3 A3 E5 69 42 97 1E
##$RELAX= 
##$RELAX= 
##$RELAX= 
##$RELAX= 
##$RELAX= 
##$RELAX= 
##$RELAX= 
$$ Bruker specific parameters
$$ --------------------------
##$DU= <E:\>
##$EXPNO= 10
##$NAME= <AC1628_CENAH_8450567_f5dI6OPRq1>
##$PROCNO= 1
$$ [...]
150 150 150 150 150 150 150 150
##$TP07= 0
##$TPNAME0= <>
##$TPNAME1= <>
##$TPNAME2= <>
##$TPNAME3= <>
##$TPNAME4= <>
##$TPNAME5= <>
##$TPNAME6= <>
##$TPNAME7= <>
##$TPOAL= (0..7)
0.5 0.5 0.5 0.5 0.5 0.5 0.5 0.5
##$TPOFFS= (0..7)
0 0 0 0 0 0 0 0
##$TUNHIN= 0
##$TUNHOUT= 0
##$TUNXOUT= 0
##$USERA1= <user>
##$USERA2= <user>
##$USERA3= <user>
##$USERA4= <user>
##$USERA5= <user>
##$V9= 5
##$VALIST= <valist>
##$VCLIST= <CCCCCCCCCCCCCCC>
##$VD= 0
##$VDLIST= <DDDDDDDDDDDDDDD>
##$VPLIST= <PPPPPPPPPPPPPPP>
##$VTLIST= <TTTTTTTTTTTTTTT>
##$WBST= 2048
##$WBSW= 25
##$XGAIN= (0..3)
0 0 0 0
##$XL= 0
##$YL= 0
##$YMAX_a= 655629
##$YMIN_a= -557468
##$ZGOPTNS= <>
##$ZL1= 120
##$ZL2= 120
##$ZL3= 120
##$ZL4= 120
##$ABSF1= 14.98509
##$ABSF2= -5.573092
##$ABSG= 5
##$ABSL= 3
##$ALPHA= 0
##$AQORDER= 0
##$ASSFAC= 0
##$ASSFACI= 0
##$ASSFACX= 0
##$ASSWID= 0
##$AUNMP= <proc_prof1d_extract_pilot.lims>
##$AXLEFT= 0
##$AXNAME= <>
##$AXNUC= <1H>
##$AXRIGHT= 0
##$AXTYPE= 0
##$AXUNIT= <>
##$AZFE= 0.1
##$AZFW= 0.1
##$BCFW= 0
##$BC_mod= 0
##$BYTORDP= 0
##$COROFFS= 0
##$CY= 15
##$DATMOD= 1
##$DC= 0
##$DFILT= <>
##$DTYPP= 0
##$F1P= 0
##$F2P= 0
##$FCOR= 0.5
##$FTSIZE= 32768
##$FT_mod= 6
##$GAMMA= 0
##$GB= 0
##$INTBC= 1
##$INTSCL= 1
##$ISEN= 128
##$LB= 0
##$LEV0= 0
##$LPBIN= 0
##$MAXI= 10000
##$MC2= 0
##$MEAN= 0
##$ME_mod= 0
##$MI= 0
##$NCOEF= 0
##$NC_proc= -8
##$NLEV= 6
##$NOISF1= 0
##$NOISF2= 0
##$NSP= 0
##$NTH_PI= 0
##$NZP= 0
##$OFFSET= 14.98509
##$PC= 1
##$PHC0= 96.94336
##$PHC1= 0
##$PH_mod= 1
##$PKNL= yes
##$PPARMOD= 0
##$PPDIAG= 0
##$PPIPTYP= 0
##$PPMPNUM= 2147483647
##$PPRESOL= 1
##$PSCAL= 4
##$PSIGN= 0
##$PYNMP= <proc.py>
##$REVERSE= no
##$SF= 400.02
##$SI= 32768
##$SIGF1= 0
##$SIGF2= 0
##$SINO= 400
##$SIOLD= 32768
##$SPECTYP= <>
##$SREGLST= <1H.CDCl3>
##$SSB= 0
##$STSI= 32768
##$STSR= 0
##$SW_p= 8223.68421052631
##$SYMM= 0
##$S_DEV= 0
##$TDeff= 65536
##$TDoff= 0
##$TI= <>
##$TILT= no
##$TM1= 0
##$TM2= 0
##$TOPLEV= 0
##$USERP1= <user>
##$USERP2= <user>
##$USERP3= <user>
##$USERP4= <user>
##$USERP5= <user>
##$WDW= 1
##$XDIM= 32768
##$YMAX_p= 475410925
##$YMIN_p= -812912
##$CURPLOT= <Network HP LaserJet P1505>
##$CURPRIN= <$Network HP LaserJet P1505>
##$DFORMAT= <normdp>
##$LAYOUT= <+/1D_H.xwp>
##$LFORMAT= <normlp>
##$PFORMAT= <normpl>
##$SURQMSG= 1
$$ End of Bruker specific parameters
$$ ---------------------------------
##NTUPLES= NMR SPECTRUM
##VAR_NAME=  FREQUENCY,     SPECTRUM/REAL,   SPECTRUM/IMAG
##SYMBOL=    X,             R,               I
##VAR_TYPE=  INDEPENDENT,   DEPENDENT,       DEPENDENT
##VAR_FORM=  AFFN,          ASDF,            ASDF
##VAR_DIM=   32768,         32768,           32768
##UNITS=     HZ,            ARBITRARY UNITS, ARBITRARY UNITS
##FACTOR=    0.250966925370066, 1,           1
##FIRST=     8223.43324360094, -145316,      -175469
##LAST=      0,             45978,           -150175
##MIN=       0,             -812912,         0
##MAX=       8223.43324360094, 475410925,    0
$$ Real data points
##PAGE= N=1
##DATA TABLE= (X++(R..R)), XYDATA
$$ [...]
19558a72549d2988j25282j2304b6040k00719a12240l2948m6417L1181I8812a07325
$$ -172549 -42988 -168270 -180574 -26040 -226759 -112240 -145188 -191605 -160424 98812 -107325
19546a78773L9536A52851o7014e9080A162d5795B52010h9284n9507m4640b8237
$$ -178773 -139237 152851 85837 -59080 1162 -45795 252010 -89284 -148791 -193431 -28237
19534B11192I2731l2488h6675q6736A55137l6325h0703L2864O341A8356a2830
$$ 211192 92731 60243 -86675 -173411 155137 118812 -80703 -47839 -41498 18356 -12830
19522a19111e1965E5741h1564K8177A32722c49497h521l32155a25110j7115E3024
$$ -119111 -51965 55741 -81564 -53387 132722 -349497 -8521 -340676 -125110 -142225 53024
19510D2832O2069a17848A82847n6968J6432k787a14780d1502o9982k74035K9459
$$ 42832 104901 -117848 182847 125879 142311 139524 -114780 -41502 -111484 -385519 -356060
19499c56060J72998i0468G0309J01977J25383b7815H2320b67481a30982D0988
$$ -356060 -183062 -90468 70309 172286 297669 -27815 82320 -267481 -130982 40988
19488a33593B4344b98346C06774A26840a36341A67660c9408j65936c0365j01553
$$ -133593 24344 -298346 306774 126840 -136341 167660 -39408 -205344 -30365 -131918
19478a31918B25342m5885a14108m2372M2914H5290a48614c0448C25937A5399b04509
$$ -131918 225342 179457 -114108 -156480 -113566 85290 -148614 -30448 325937 15399 -204509
19466c0934C90145A9106a76481i3r0131m7112B18138r1736l3280d5494F7281f6615
$$ -30934 390145 19106 -176481 -93 -90224 -137336 218138 126402 93122 -45494 67281 -66615
19453G4535c82571B51935c83944f182A58793b45446A2720b53257a0606B37969
$$ 74535 -382571 251935 -383944 -6182 158793 -245446 12720 -253257 -10606 237969
19442I0391b17797A24214b27736l1878A14923b802l04888a11369A30844c16723
$$ 90391 -217797 124214 -227736 -259614 114923 -2802 -307690 -111369 130844 -316723
19431c72171H4425b4771j70222k3894m4563b7081A1416h7658A14053b5593r54
$$ -372171 84425 -24771 -194993 -218887 -263450 -27081 11416 -87658 114053 -25593 -26547
19420b6547o7413l1143I8565b11385F4212a91448h3450C79866b3877l4649n5185
$$ -26547 -93960 -125103 98565 -211385 64212 -191448 -83450 379866 -23877 -58526 -113711
19409a13711H9398c14970m1622L7553J14112c6179k37056l482B46520i8488k4487
$$ -113711 89398 -314970 -356592 -319039 -204927 -36179 -273235 -276717 246520 -98488 -122975
19398a22975q430q5994n8603Q8665C10730E6918P3759d22060a43837L7990A44776
$$ -122975 -131405 -217399 -276002 -187337 310730 56918 130677 -422060 -143837 -105847 144776
19386a8359k09521b7050j11991c2486J2841n9445n5576r2972g7418g253k8550
$$ -18359 -227880 -27050 -139041 -32486 -19645 -79090 -134666 -227638 -77418 -7253 -35803
19375c5803j27141R756j91425J32674d8754B11758g918C54719A1616b94814A06476
$$ -35803 -162944 -153188 -344613 -211939 -48754 211758 -7918 354719 11616 -294814 106476
19363A2328a55540B62241d0173k08641O1632G523f8560k96305B1111c7967B96044
$$ 12328 -155540 262241 -40173 -248814 -187182 7523 -68560 -364865 21111 -37967 296044
19351E6483K72416a5476k1224j12480A23137e4566F5077M1315J29226f6918A69506
$$ 56483 328899 -15476 -36700 -149180 123137 -54566 65077 106392 235618 -66918 169506
19339b16520o1631A11341c11362J49355k09244D852c12611B09263A8467K45132
$$ -216520 -278151 111341 -311362 -162007 -371251 4852 -312611 209263 18467 263599
19329B63599a63220L3879B54061e5263l64192A81437O0307b42699L3063R8652
$$ 263599 -163220 -129341 254061 -55263 -419455 181437 241744 -242699 -209636 -110984
19319a10984C1264d15901b7688j24316A27968E0670f831q8295F9211a92905r151
$$ -110984 31264 -415901 -27688 -152004 127968 50670 -6831 -95126 69211 -192905 -202056
19308b02056r0288c5832k50475a21418e0965D35524i715j76233c8403j23511e1113
$$ -202056 -292344 -35832 -286307 -121418 -50965 435524 -9715 -185948 -38403 -161914 -51113
19296b02880j50240i5329a1810A10412p30O0625b06356A52170a46739e771j69775
$$ -202880 -353120 -95329 -11810 110412 109682 170307 -206356 152170 -146739 -5771 -175546
19285a75546A4761R460b08322a02183j34250B507e49297A60732d4722j93726A53654
$$ -175546 14761 24221 -208322 -102183 -236433 2507 -549297 160732 -44722 -238448 153654
19273a23339p049j07372c7181A28943b21677P3474C9547i5382A00644b10292P3011
$$ -123339 -130388 -237760 -37181 128943 -221677 -148203 39547 -95382 100644 -210292 -137281
19262a37281B5600P4918h0581B37779b35136j8589J11032m5416j41472F990a85211
$$ -137281 25600 100518 -80581 237779 -235136 -253725 -142693 -188109 -329581 6990 -185211
19250a28097l91970J59644C04456Q8745B332J06803j9201a85568A67869a28135
$$ -128097 -520067 -360423 304456 393201 2332 109135 89934 -185568 167869 -128135
19239a11023q7221b6197E323a32496O1533D9771d8514j46329C70086c64408E9920
$$ -111023 -198244 -26197 5323 -132496 -70963 49771 -48514 -194843 370086 -364408 59920
19227A3587K86588b34728R6598e2028n4393M5624k35376J01364N7382B78220g4177
$$ 13587 300175 -234728 -138130 -52028 -106421 -60797 -296173 -194809 -137427 278220 -74177
19215b57459n0357j6382A28789a73427m7693a5653j90923j96081a1438j29658
$$ -257459 -307816 -324198 128789 -173427 -221120 -15653 -206576 -402657 -11438 -141096
19205a41096Q637r6024B5603b3278I7244m3820c35606A17977b43108R6682j61569
$$ -141096 -132459 -228483 25603 -23278 97244 53424 -335606 117977 -243108 -146426 -307995
19194c07995h2198o3348b0210A40192B8326A0927K29955j15674a90905a3933r9898
$$ -307995 -82198 -145546 -20210 140192 28326 10927 240882 125208 -190905 -13933 -113831
19183a13831M2548D3985A7162J50391P6354e692b351A15957J0552d0847k62591
$$ -113831 -71283 43985 17162 167553 243907 -5692 -2351 115957 126509 -40847 -303438
19172c03438f6006b1058j28412C0352Q6755a50036A06224a99086l5747J03206
$$ -303438 -66006 -21058 -149470 30352 117107 -150036 106224 -199086 -234833 -131627
19162a31627N0973L2056j49869B16315f4149F9032J6460a38760M5026m2811I8527
$$ -131627 -80654 -48598 -198467 216315 -64149 69032 85492 -138760 -93734 -136545 98527
19150h3875J308A77531c21651A578g8526A97264N0680F0379Q07a26391I8951b73191
$$ -83875 -82567 177531 -321651 1578 -78526 197264 247944 60379 61186 -126391 98951 -273191
19137b45304J18016A46304o6274b08717J5171B67679b38108G0899J4702L5856
$$ -245304 -127288 146304 80030 -208717 -193546 267679 -238108 70899 85601 121457
19127A21457B3058d7276A34379C0699b6670l65922B20957a35271r2843J02890
$$ 121457 23058 -47276 134379 30699 -26670 -392592 220957 -135271 -228114 -125224
19117a25224A33649L2077b71881A71294E792J84960c7114k17301H088a08144F4002
$$ -125224 133649 165726 -271881 171294 5792 190752 -37114 -254415 8088 -108144 64002
19105H0192a80442J8482P7367a6249D1892J04965F3024g0733B51849b17577B22342
$$ 80192 -180442 -161960 -84593 -16249 41892 146857 63024 -70733 251849 -217577 222342
19093b21387G5865K4548N2671c4424l02207A33334c15836H9598c9700A09335a53352
$$ -221387 75865 100413 153084 -34424 -336631 133334 -315836 89598 -39700 109335 -153352
19081a83395k11199J94109R7989A83700a26900q7022G8443b62571a21933B03543
$$ -183395 -394594 -200485 -102496 183700 -126900 -213922 78443 -262571 -121933 203543
19070G6551g9359j04676I7028a68729j14007J33244C4789K5065L264d38484a56661
$$ 76551 -79359 -184035 97028 -168729 -282736 -149492 34789 59854 63118 -438484 -156661
19058c95015Q6568j43843K10029f5709o907B21011o7376c44315J33991j7292C50942
$$ -395015 -308447 -452290 -242261 -65709 -72616 221011 153635 -344315 -210324 -227616 350942
19046A14176K95575A40298a9104A1172h8383j44357J01590A9563b28124f8210
$$ 114176 409751 140298 -19104 11172 -88383 -232740 -131150 19563 -228124 -68210
19035h8977o0714A61340i3171A58426o9391J3995A4118J66940j379b15360A25627
$$ -88977 -149691 161340 -93171 158426 89035 103030 14118 181058 179679 -215360 125627
19023F0059M6401d5749D99827a74475G8635N32718A95688a92038C36108j67289
$$ 60059 106460 -45749 499827 -174475 78635 611353 195688 -192038 336108 168819
19013A68819i2173E107b592A11944c85168A66586d5690j69475g8370D5438P4265
$$ 168819 -92173 5107 -2592 111944 -385168 166586 -45690 -215165 -78370 45438 119703
19002A19703f4620G0982a481B24064A8620M3668b32411o7788M3947h5340c9119
$$ 119703 -64620 70982 -1481 224064 18620 62288 -232411 -300199 -256252 -85340 -39119
18990c21966h9568J5761q6530m2298g7526k64855E1290a0272j77972D5214N0227
$$ -321966 -89568 -73807 -160337 -202635 -77526 -342381 51290 -10272 -188244 45214 95441
18979I5441K86762i2601d6166D5458B0732a12391d6643r2671M8024F697a17138
$$ 95441 382203 -92601 -46166 45458 20732 -112391 -46643 -139314 -91290 6697 -117138
18967A97667c05167B73843b92603j77162a68589j02633h9030c7491j19624O3358
$$ 197667 -305167 273843 -292603 -469765 -168589 -271222 -89030 -37491 -157115 -93757
18957i3757k0250r9955I9476a10169K0065B19746B4946f2021j02252C94457c1578
$$ -93757 -114007 -213962 99476 -110169 -90104 219746 24946 -62021 -164273 394457 -31578
18945h6997B800L244K1765J08669d33179a59612e6055B17365a95034A04659m743
$$ -86997 2800 6044 27809 136478 -433179 -159612 -56055 217365 -195034 104659 99916
18934I9916e2124j47E3828a242k20585G1148J04920a2152I1100c3850q7801G1489
$$ 99916 -52124 -52271 53828 -1242 -221827 71148 176068 -12152 91100 -33850 -121651 71489
18921A55864a33070j70606J11801P0387a7765g670j6206B9443N547j5092a55414
$$ 155864 -133070 -303676 -191875 -121488 -17765 -7670 -23876 29443 34990 19898 -155414
18909D3703J24269d0853a5669o4902j93355A9493K5915j7015N9684g3655q221
$$ 43703 167972 -40853 -15669 -80571 -273926 19493 45408 28393 88077 -73655 -81876
18898h1876A02298O0979G927J8164d0467j93998A90245k4841F6949h8041A30883
$$ -81876 102298 163277 7927 26091 -40467 -234465 190245 165404 66949 -88041 130883
18886a5551k6250A11070E5142k2615A1493L423e6133D6782J4209c703l3942j48914
$$ -15551 -41801 111070 55142 32527 11493 14916 -56133 46782 60991 -3703 -37645 -186559
18874a86559d9503l8154m9324H6824a48161A00639k999Q6256D3314a75506h1358
$$ -186559 -49503 -87657 -136981 86824 -148161 100639 97640 183896 43314 -175506 -81358
18862B11413e4831B72196a53930A16093a08587j13906d5222l0263m26166a32929
$$ 211413 -54831 272196 -153930 116093 -108587 -222493 -45222 -75485 -501651 -132929
18851c20354a20240c3732B31361a27944d0348J2832B2554b27325A07253a0987
$$ -320354 -120240 -33732 231361 -127944 -40348 -27516 22554 -227325 107253 -10987
18840b22354b7070o5283H7950k5815a86567K2727e1054o2301k16236c823A36268
$$ -222354 -27070 -92353 87950 62135 -186567 -163840 -51054 -113355 -329591 -3823 136268
18828a22014A67609J773a35857B28699L3953c7053k00312J12896j39563B40489
$$ -122014 167609 169382 -135857 228699 262652 -37053 -237365 -124469 -264032 240489
18817E5833d4075o8278F2520J30134a47317A9705N01327D353K88898L7667g0838
$$ 55833 -44075 -112353 62520 192654 -147317 19705 521032 4353 293251 330918 -70838
18805C18377c31263C1830L6054a4932e735A76775a54853B58448d04360D5444e5251
$$ 318377 -331263 31830 67884 -14932 -5735 176775 -154853 258448 -404360 45444 -55251
18793b04445I40J31987J6824n3114a93547g963k00292A23305R4831i4030B04669
$$ -204445 940 132927 149751 96637 -193547 -7963 -208255 123305 218136 -94030 204669
18781a23829q6057o4403j9630a35768N2710M0212j47953A26444c99972J15280
$$ -123829 -209886 -274289 -293919 -135768 -83058 -42846 -190799 126444 -399972 -284692
18771b84692C20618g954C4201a30739m4375N6519E9121b55178A05445b98593A14587
$$ -284692 320618 -7954 34201 -130739 -175114 -118595 59121 -255178 105445 -298593 114587
18759e13193E9877g5418j83239a03801d3340j74688E0635J11357b22822m5284
$$ -513193 59877 -75418 -258657 -103801 -43340 -218028 50635 161992 -222822 -268106
18749b68106b3423B8002a16884p3536a8340j24284j12046N3994h1535B81602b3014
$$ -268106 -23423 28002 -116884 -190420 -18340 -142624 -254670 -200676 -81535 281602 -23014
18737B379O1759K72024F3163c27833J10209J05127B06670p8929a79844A53398
$$ 2379 64138 336162 63163 -327833 -217624 -112497 206670 127741 -179844 153398
18726A9348M9274N19125A18061a35152G6817J89794i9714p8343G6064C2567c92428
$$ 19348 68622 587747 118061 -135152 76817 266611 -99714 -178057 76064 32567 -392428
18714B10528A1231b48783b9231E7774K2111j1511a08633A04312r122a24360K5902
$$ 210528 11231 -248783 -29231 57774 79885 68374 -108633 104312 95190 -124360 -98458
18703i8458B25438A2733J82071F0720b33400H9568b55260f0998I5336b57100C6397
$$ -98458 225438 12733 194804 60720 -233400 89568 -255260 -60998 95336 -257100 36397
18691B464K20730F6671a40908O1274J3957n2352l9728A38497k8982A364n82a02759
$$ 2464 223194 66671 -140908 -79634 -65677 -118029 -157757 138497 109515 1364 782 -102759
18678a29821M9261F2524a42937p1437A4813a43998j97802A25239E1260a62017
$$ -129821 -80560 62524 -142937 -214374 14813 -143998 -341800 125239 51260 -162017
18667a08064A07977E3002i4219k13620A7047J93598c69494A7595e0255A30872
$$ -108064 107977 53002 -94219 -307839 17047 210645 -369494 17595 -50255 130872
18656b50034i0597C6833a79601j44537J30122C0934b11790A27364l8801a11638
$$ -250034 -90597 36833 -179601 -324138 -194016 30934 -211790 127364 88563 -111638
18645b19290k27398f1649j97284A22614a52187A66347h4526o2793p6839k31947
$$ -219290 -446688 -61649 -258933 122614 -152187 166347 -84526 -147319 -224158 -456105
18635d56105g5809l05696G92N807a13564H3629d70021d9090B64291a01430o4259
$$ -456105 -75809 -381505 792 6599 -113564 83629 -470021 -49090 264291 -101430 -165689
18624a65689e7986n796k6323L8274b0627j76831A57368a34454j80887i5036D25281
$$ -165689 -57986 -63782 -90105 -51831 -20627 -197458 157368 -134454 -315341 -95036 425281
18612D4385c30501a12630j8539A33240i6874B87423d12068a5906l32782H2225
$$ 44385 -330501 -112630 -131169 133240 -96874 287423 -412068 -15906 -348688 82225
18601G1860h3952A6782e7856o5686D51162b07476h0822l7796k9886A19107b77753
$$ 71860 -83952 16782 -57856 -123542 451162 -207476 -80822 -118618 -148504 119107 -277753
18589e9933j6422m5126M4170a9739F0875R9003D47L49009A2313K6498a32574b8530
$$ -59933 -76355 -121481 -77311 -19739 60875 159878 447 349456 12313 38811 -132574 -28530
18576A84365e4055i816l76424a54038f5579m7331E7180Q7081a43142R337B4776
$$ 184365 -54055 -9816 -386240 -154038 -65579 -112910 57180 144261 -143142 -133805 24776
18564A71233e9666A36968n7020a33915d8581j35164D8586a96441K713H7772C373
$$ 171233 -59666 136968 79948 -133915 -48581 -183745 48586 -196441 -193728 87772 3373
18552b47529j17580C3858P049a83510F8621J20444b40153r520b9482a2878A39562
$$ -247529 -365109 33858 40907 -183510 68621 189065 -240153 -249673 -29482 -12878 139562
18540a02997B5443c48622i7727A64936a7301A2856C345R9773a3373A08034a50527
$$ -102997 25443 -348622 -97727 164936 -17301 12856 3345 103118 -13373 108034 -150527
18528b82660l17g6079e682I7439J41209m9166a60040q2451e7524p2277q2615f2512
$$ -282660 -282977 -76079 -5682 97439 238648 189482 -160040 -242491 -57524 -129801 -212416 -62512
18515b05316f4840k82127A05597d80674A24819c3110j16457d7607B41020m7194
$$ -205316 -64840 -346967 105597 -480674 124819 -33110 -149567 -47607 241020 193826
18505A93826g9118b0057j87407n5479M5096c0557r1577k97061A00191D7418b77493
$$ 193826 -79118 -20057 -207464 -262943 -217847 -30557 -122134 -419195 100191 47418 -277493
18493b94218a1308B30607j4034O9070a05101b164j18647l1521o5329R1041a4142
$$ -294218 -11308 230607 216573 285643 -105101 -2164 -120811 -152332 -217661 -126620 -14142
18481b30178i0103j4566K6559K5697f313C98019j91286a41200k65219a3692l81808
$$ -230178 -90103 -104669 -78110 -52413 -6313 398019 206733 -141200 -406419 -13692 -395500
18470c95500J20948O7962o0258H2346a67022A08873i4048G8163c3889q3941c4394
$$ -395500 -274552 -206590 -266848 82346 -167022 108873 -94048 78163 -33889 -117830 -34394
18458c04738K5899J13336f2487A74159n0245C4254d9634l08511a60666L0783I5608
$$ -304738 -278839 -165503 -62487 174159 123914 34254 -49634 -358145 -160666 -129883 95608
18446C5109K21494a05492m6561G633b2344o6532o5983D3846a47344a6935m86570
$$ 35109 256603 -105492 -152053 7633 -22344 -88876 -154859 43846 -147344 -16935 -503505
18435e03505F7273a00843L7824I0819h8401J068C805b79298C1843c355j3014o9598
$$ -503505 67273 -100843 -63019 90819 -88401 -87333 3805 -279298 31843 -3355 -16369 -85967
18423h5967B7934a19747m237P684D3563a15119b6558q6135A66362D1109a03478
$$ -85967 27934 -119747 -123984 -116300 43563 -115119 -26558 -112693 166362 41109 -103478
18411a94652L3032k16367B26849a84985C13829l0456c04940B02961A2556K73482
$$ -194652 -161620 -377987 226849 -184985 313829 283373 -304940 202961 12556 286038
18401B86038Q8074e9447E5328M7731F509N5530j3710b15049b4913j44528Q0575
$$ 286038 374112 -59447 55328 103059 6509 62039 48329 -215049 -24913 -169441 -88866
18390h8866Q578j5166E0050A134K79322a71978D3564J30990N0376b31716B92161
$$ -88866 -80288 -95454 50050 1134 280456 -171978 43564 174554 224930 -231716 292161
18378d5628A96158n3603a75051D115b0174B41790a44456A7744J09774N9541b14364
$$ -45628 196158 142555 -175051 4115 -20174 241790 -144456 17744 127518 187059 -214364
18366F9600b46740A14746K20157A16794b0820A17877g0814F5047d99021b2696
$$ 69600 -246740 114746 334903 116794 -20820 117877 -70814 65047 -499021 -22696
18355F4730Q1616m5461J42388h9833j2472M2735A51536K83852b5847E7861b57934
$$ 64730 146346 100885 243273 -89833 -102305 -59570 151536 435388 -25847 57861 -257934
18343d05626F867f0099q0711j53210B5042f1044a2291l57740h0874A24304D6293
$$ -405626 6867 -60099 -140810 -294020 25042 -61044 -12291 -370031 -80874 124304 46293
18331A6968a54364j77407c5549j47253B30956B3771c66995h505l80219A19898
$$ 16968 -154364 -331771 -35549 -182802 230956 23771 -366995 -8505 -388724 119898
18320b01500O451f4414a5165F0324J35671D9948J14671c48299a72879a052A19356
$$ -201500 -195049 -64414 -15165 60324 195995 49948 164619 -348299 -172879 -1052 119356
18308C4521O1305c6318k18841A64964h9797l3996I3441c00924A03756a44782C1250
$$ 34521 95826 -36318 -255159 164964 -89797 -123793 93441 -300924 103756 -144782 31250
18296b69549B74791b76688A32703b30167B02206a1705o395j30252m0423i557k34012
$$ -269549 274791 -276688 132703 -230167 202206 -11705 -18100 -148352 -188775 -9557 -243569
18285b43569h4661G1889b95193C5711J1642a18694M8188j43023L0355b7037q2733
$$ -243569 -84661 71889 -295193 35711 47353 -118694 -70506 -213529 -183174 -27037 -109770
18274a09770C4117g2586k53913f4295j38831A99676d0948j95363D4068a47056
$$ -109770 34117 -72586 -326499 -64295 -203126 199676 -40948 -236311 44068 -147056
18263I6055c01584C26288C833g4486k6846M0297n3019B51376a04614A26138f0224
$$ 96055 -301584 326288 3833 -74486 -101332 -61035 -114054 251376 -104614 126138 -60224
18251A46907A3148b41908F5810a72640M6422p8818c6459j02651k33572J48979
$$ 146907 13148 -241908 65810 -172640 -126218 -205036 -36459 -139110 -372682 -223703
18241b23703A0074b26848L1212j27969a21824b1878l43756j14037b14389q6591
$$ -223703 10074 -226848 -195636 -323605 -121824 -21878 -365634 -479671 -214389 -300980
18231c00980b5613k39092F1773a13751A72890b26784A9619Q7694K33835D4697
$$ -300980 -25613 -264705 61773 -113751 172890 -226784 19619 107313 341148 44697
18220a41801O4107o4589A9274M5601K8816C7151M10335a05655j03755A42783f8981
$$ -141801 -77694 -142283 19274 64875 93691 37151 447486 -105655 -209410 142783 -68981
18208a11732J0855A03513b10108n7350J30880p9571R7019B24567a68168G8656
$$ -111732 -100877 103513 -210108 -267458 -136578 -216149 -119130 224567 -168168 78656
18197B46842c33248B76162b7113r7508r2176A79252a43844A10455i0439b446k6755
$$ 246842 -333248 276162 -27113 -124621 -216797 179252 -143844 110455 -90439 -2446 -29201
18186b9201A84491a33598k29423c7796A35446a34479A11806K06211a41603K8122
$$ -29201 184491 -133598 -363021 -37796 135446 -134479 111806 318017 -141603 -113481
18176a13481j77371B5962b2145m432A20637a49726p1483G7827A8320a86564B5287
$$ -113481 -290852 25962 -22145 -26577 120637 -149726 -221209 77827 18320 -186564 25287
18164a90316k684A4756b03172M7247G0523P3106e3912J1524j22739I6940J58218
$$ -190316 -193000 14756 -203172 -155925 70523 143629 -53912 -42388 -165127 96940 255158
18153B55158A00888a26397e509k81894j07248B21266D3499K50328h8065A85702
$$ 255158 100888 -126397 -5509 -287403 -394651 221266 43499 293827 -88065 185702
18142A8720J2735K35884D2868b39476d481k67612A7580J3367c97336a45759j80287
$$ 18720 31455 267339 42868 -239476 -4481 -272093 17580 30947 -397336 -145759 -326046
18131c26046A77347R6988e3883j66991a04426A00094J4904i317F1596k8850b45751
$$ -326046 177347 274335 -53883 -220874 -104426 100094 114998 -9317 61596 32746 -245751
18119c46084e9406A16093a08747A1709C831R3060Q367m357a49794f4237I5545
$$ -346084 -59406 116093 -108747 11709 3831 96891 105258 100901 -149794 -64237 95545
18107E3314F750J45855a90662K8153q3424m8838J32688A1628d36785a40558c4341
$$ 53314 6750 152605 -190662 -162509 -245933 -294771 -162083 11628 -436785 -140558 -34341
18095a9073j22672a0742j57674k160K785E92064A9230J56905C3542K4022c3729
$$ -19073 -141745 -10742 -168416 -170576 -167791 592064 19230 176135 33542 57564 -33729
18083a8663B43725b50871E4374K50695r4780n4547A2585i3896L0145B98675e42032
$$ -18663 243725 -250871 54374 305069 210289 155742 12585 -93896 -63751 298675 -542032
18071e3266C231L1876b30837B19254j8034a44242F4635a55025E716b97706f3412
$$ -53266 3231 35107 -230837 219254 201220 -144242 64635 -155025 5716 -297706 -63412
18059b48636I6835C4316a8514G7987a76627E7248c68319D4137J01612E5588a41446
$$ -248636 96835 34316 -18514 77987 -176627 57248 -368319 44137 145749 55588 -141446
18047a25282K1015H0687J61794J35844b90784e0367r9295l75356g7217C0144K8196
$$ -125282 -104267 80687 242481 378325 -290784 -50367 -149662 -525018 -77217 30144 58340
18036E8340a20960d4599A47917b7280m8587D27717j85585f4685k03893N7195A14618
$$ 58340 -120960 -44599 147917 -27280 -75867 427717 242132 -64685 -268578 -211383 114618
18024d1167C395K47918I3005d4062A99544r6599h3498A61967I725e2774G1953
$$ -41167 3395 251313 93005 -44062 199544 102945 -83498 161967 9725 -52774 71953
18012a27267q1605e7667A11326C5606K11694a3845j26929G450b62000H8102f423
$$ -127267 -208872 -57667 111326 35606 247300 -13845 -140774 7450 -262000 88102 -6423
18000a41031K1190C35835i131j61683A47141a39227F9186a5688j81211E1943a08058
$$ -141031 -119841 335835 -9131 -170814 147141 -139227 69186 -15688 -196899 51943 -108058
17988A80385K22052e905A0910a71485M5605A15761f7244B01935G1531J6733K5472
$$ 180385 402437 -5905 10910 -171485 -125880 115761 -67244 201935 71531 88264 113736
17977A13736M3997g8088c0358B75266B5274e6672B6505Q3679i6472k48289a32629
$$ 113736 157733 -78088 -30358 275266 25274 -56672 26505 110184 -96472 -344761 -132629
17965i8833F5113N2921a71290C1048J26007a77028l5827k1027g4978A52789R031
$$ -98833 65113 118034 -171290 31048 157055 -177028 -212855 -233882 -74978 152789 161820
17954A61820a5457l86918B88110j1087c46983j56253K02223C5050b707k226j93912
$$ 161820 -15457 -402375 288110 277023 -346983 -503236 -301013 35050 -2707 -4933 -198845
17943a98845H5578a53311A01832a82256h0788Q93I9230a1867m6748A96898a72803
$$ -198845 85578 -153311 101832 -182256 -80788 -79895 99230 -11867 -58615 196898 -172803
17931b29951A7170a9221B13434a01771L0684l7367E2660j3685a15756k9037B10083
$$ -229951 17170 -19221 213434 -101771 -71087 -108454 52660 38975 -115756 -144793 210083
17919A14030f45954b3553J899a834A46658b14003J1072B66667j11223g7291D97049
$$ 114030 -645954 -23553 -21654 -1834 146658 -214003 -202931 266667 155444 -77291 497049
17907A889a11027j84521j3802E7100d70044c0058B56166c33453L5319K8961f3641
$$ 1889 -111027 -295548 -309350 57100 -470044 -30058 256166 -333453 -298134 -269173 -63641
17895a85089f2654B55725A9671e6246c042C9594a44919B59393A05331D5989K1055
$$ -185089 -62654 255725 19671 -56246 -3042 39594 -144919 259393 105331 45989 67044
17884F7044b35321q8141A00968J65695e6406G5046r888a06113M8694a2077j69416
$$ 67044 -235321 -323462 100968 266663 -56406 75046 65158 -106113 -57419 -12077 -181493
17873a81493j0815h2360k2691j32156I5256Q4923p2238d8705A62266F0940i6203
$$ -181493 -192308 -82360 -105051 -237207 95256 180179 107941 -48705 162266 60940 -96203
17861B34190n3748P3990h3977A37305a45113B58828b80962C15645A07943g4621
$$ 234190 180442 254432 -83977 137305 -145113 258828 -280962 315645 107943 -74621
17850h4089B66846a61306c3214o0565C543J15273a11788d280n5767j33123A72653
$$ -84089 266846 -161306 -33214 -93779 3543 118816 -111788 -4280 -60047 -193170 172653
17838B70399D8281J86296n0949o5750a74248b370H8392J83266f7860B73534c5430
$$ 270399 48281 234577 183628 117878 -174248 -2370 88392 271658 -67860 273534 -35430
17826b39804d0907j77701A77380E178a80293B31927i7233B6185M1907K6692B3143
$$ -239804 -40907 -218608 177380 5178 -180293 231927 -97233 26185 68092 94784 23143
17814c31948a52809F1028Q4797c0596B97758i0293A6864h9522k55972J65913M3737
$$ -331948 -152809 61028 145825 -30596 297758 -90293 16864 -89522 -345494 -179581 -135844
17803a35844j15488J05193j36583E6469b01895a3664C17394k4894j02293m6742
$$ -135844 -251332 -146139 -282722 56469 -201895 -13664 317394 292500 190207 143465
17793A43465D9272K32736D3501L0930h1626e158m5074j68601j63845a0555I0290
$$ 143465 49272 282008 43501 74431 -81626 -5158 -50232 -218833 -382678 -10555 90290
17781a35085j33443a7356j58287I6185f3448A89340D4863b2840j20687O4150I105
$$ -135085 -268528 -17356 -175643 96185 -63448 189340 44863 -22840 -143527 -79377 9105
17769E282J3966J21776a90123o1383C76953F9555J1044a04284B0740L39785j16826
$$ 5282 19248 141024 -190123 -251506 376953 69555 80599 -104284 20740 360525 243699
17758B43699a92909A55937B7917a37050j5823C787c99006a77973Q4115E8195b8435
$$ 243699 -192909 155937 27917 -137050 -152873 3787 -399006 -177973 -93858 58195 -28435
17746B57218J7279i4908j31739O4312c0556k82454d2867E289R022a69624P0467
$$ 257218 274497 -94908 -226647 -162335 -30556 -313010 -42867 5289 14311 -169624 -99157
17735i9157o9985B50910a69153j63119a45840n9085F2055A0770Q3714c25172a17162
$$ -99157 -169142 250910 -169153 -332272 -145840 -204925 62055 10770 94484 -325172 -117162
17723I5479b39023D0391d63691A12940h7921B70973b622A04509e1051B31851b5989
$$ 95479 -239023 40391 -463691 112940 -87921 270973 -2622 104509 -51051 231851 -25989
17711A85876H2724a67312I3515a56951F422J17728N6934b12759B18530B9244a82685
$$ 185876 82724 -167312 93515 -156951 6422 124150 181084 -212759 218530 29244 -182685
17699i163r6013H4821d206G746M50738A1914L57029g0833E651a81592b7959D0057
$$ -9163 -105176 84821 -4206 7746 458484 11914 368943 -70833 5651 -181592 -27959 40057
17686C1402q489b5403B13601o4134c02375C47741i0276A29167b13099O8009p2638
$$ 31402 22913 -25403 213601 149467 -302375 347741 -90276 129167 -213099 -145090 -217728
17675b17728P2292C652g5667j03807I3600N8050B2848J49614l7576a33081b4821
$$ -217728 -145436 3652 -75667 -179474 93600 151650 22848 172462 134886 -133081 -24821
17663b9626A50539o4327f1948C05863G0168g0947c657I0817g9130A1659c14712
$$ -29626 150539 86212 -61948 305863 70168 -70947 -3657 90817 -79130 11659 -314712
17651d193I2752L5078I520a67080N6253E34256b5990m47022C2662b66063J08684
$$ -4193 92752 127830 9520 -167080 -110827 534256 -25990 -473012 32662 -266063 -157379
17640a57379f7986G9078L9971g9305l7256e2459A98206a9880j02510A85817h0922
$$ -157379 -67986 79078 119049 -79305 -116561 -52459 198206 -19880 -122390 185817 -80922
17628f1816A26419E901a00156K5952m9581C10270l9219b5672a2015m705k72458
$$ -61816 126419 5901 -100156 -74204 -123785 310270 271051 -25672 -12015 -16720 -289178
17617b89178c2906A72312d918r7389m1100d2381j50504c7318j6786J8522j45849
$$ -289178 -32906 172312 -4918 -102307 -143407 -42381 -192885 -37318 -54104 -35582 -181431
17606a81431K1466F2043J03571q880E2045M04051C2968Q072a62824B09567A1044
$$ -181431 -159965 62043 165614 156734 52045 456096 32968 41040 -162824 209567 11044
17594a49861K0653B18028l7697K17771H9447L6374K58856B3266f1252B14020G7087
$$ -149861 -129208 218028 180331 398102 89447 125821 384677 23266 -61252 214020 77087
17582E60J09728M01760H7159J46724c549r2804o8392f4140B49435a35267c4085
$$ 560 110288 512048 87159 233883 -3549 -96353 -164745 -64140 249435 -135267 -34085
17570a22402F9050b55528L0293K4544C02660d0782A78648L5809C0241D127b07004
$$ -122402 69050 -255528 -225235 -200691 302660 -40782 178648 214457 30241 4127 -207004
17558b53449F3724a85797R0148G8416a21198C26868a3816E9520h5249n0987B40552
$$ -253449 63724 -185797 -95649 78416 -121198 326868 -13816 59520 -85249 -136236 240552
17546A81974c32574B24049b30181J13495G9278j7022J85323b00871c9897q2315
$$ 181974 -332574 224049 -230181 -116686 79278 62256 247579 -200871 -39897 -122212
17536a22212I0195L15523A79856g5710B13178m4762A7798b9506J136A31754o4293
$$ -122212 90195 405718 179856 -75710 213178 168416 17798 -29506 -28370 131754 67461
17525F7461A0648O779J20360R4428c4582p3515G2761K78359j21880b15271i9291
$$ 67461 10648 17427 137787 232215 -34582 -108097 72761 351120 229240 -215271 -99291
17513B90354A8776a92533A03762J0907h7347B21490h6578B682J62132a55067C99007
$$ 290354 18776 -192533 103762 114669 -87347 221490 -86578 2682 164814 -155067 399007
17501D06391c7151B14556D8665J33586a81040C26613q1599j9b3863A28421i5826
$$ 406391 -37151 214556 48665 182251 -181040 326613 245014 244995 -23863 128421 -95826
17489B06909a8739A778K82994d722E3590K29325p3304I6313c570A43144J39054
$$ 206909 -18739 1778 284772 -4722 53590 282915 209611 96313 -3570 143144 282198
17478B82198H6170K8712R48G599a19532B53129k407E1491J49623O3197K3711L5824
$$ 282198 86170 114882 115830 7599 -119532 253129 250722 51491 201114 264311 288022 323846
17466C23846A52703m5517J36277I7199J25106a12331A15941L61614B30096d992
$$ 323846 152703 107186 243463 97199 222305 -112331 115941 477555 230096 -4992
17455E5585K62582a81487A27940L80661j14201b56214B98797H0444J49542P0115
$$ 55585 318167 -181487 127940 508601 394400 -256214 298797 80444 229986 300101
17445C00101F1939J34343L75105j21968p2795G9169J59416L2761h2405B17614
$$ 300101 61939 196282 571387 449419 376624 79169 238585 271346 -82405 217614
17434A86976F7434L70254A27917j4691a98659A71969p272O9163l0279D5511i1332
$$ 186976 67434 437688 127917 113226 -198659 171969 164697 233860 203581 45511 -91332
17422g8923D02288m6217j48373D2485N91187B46454d954E5257M47942f7810D48469
$$ -78923 402288 356071 207698 42485 633672 246454 -4954 55257 503199 -67810 448469
17410A56799J00963c8587G5630K25387p6967J4381J53664c0943A39247M5461B7084
$$ 156799 257762 -38587 75630 301017 224050 238431 392095 -30943 139247 184708 27084
17398A15144K75434A24163J6138K1155G1388K78573k7497K4572H0406i0408A41091
$$ 115144 390578 124163 140301 161456 71388 349961 322464 347036 80406 -90408 141091
17386a73030C8528J20852B6635J60317J54583a24235A34072J34909n4290K76945
$$ -173030 38528 159380 26635 186952 341535 -124235 134072 268981 214691 491636
17376D91636k25777j19200N1061G4448J10353j7873a12378j61478A1631J94132
$$ 491636 265859 146659 197720 74448 184801 166928 -112378 -273856 11631 205763
17366B05763k7408a04569E1274N2777g4610A8388R077J74056E6200K93179I7523
$$ 205763 178355 -104569 51274 104051 -74610 18388 27465 201521 56200 349379 97523
17354A4103j287N6564k4334N0115q334J12012J79765b83048B08959K49239E7318
$$ 14103 12816 69380 45046 95161 86827 198839 378604 -283048 208959 458198 57318
17342e327B82795n62J8326E62J13225P9690E404K47506g5290B75547F3667d7945
$$ -5327 282795 282233 300559 562 113787 193477 5404 252910 -75290 275547 63667 -47945
17329A95114P9265a13283A35428b38316d2539B78935L2109a24702A89383Q329
$$ 195114 274379 -113283 135428 -238316 -42539 278935 311044 -124702 189383 197712
17319A97712P9546j7141j18286J31647P7946K4527j47107h7065J4341C22927G2272
$$ 197712 277258 260117 141831 273478 351424 375951 228844 -87065 -72724 322927 72272
17307B84467m2322a70994e591F2490J0779h165j17508B85613G3138K78716C7366
$$ 284467 242145 -170994 -5591 62490 73269 -8165 -125673 285613 73138 351854 37366
17295B83742n4944N6372I5058d387D21013d2566A63120J55034j16254F1654O4663
$$ 283742 228798 285170 95058 -4387 421013 -42566 163120 318154 201900 61654 126317
17284A26317L019K65367b5913A92335m9649b031o0453B54303J283q6413K74119
$$ 126317 129336 394703 -25913 192335 142686 -2031 -62484 254303 255586 169173 443292
17273D43292q4008A45215h4201B64572g2378J8015C92356A24829L3626m5794R0019
$$ 443292 359284 145215 -84201 264572 -72378 -54363 392356 124829 158455 112661 202680
17262B02680F2963a91285F2790N5644L2904J96631C2427L01485L5483j72816P8768
$$ 202680 62963 -191285 62790 118434 151338 347969 32427 333912 369395 196579 275347
17251B75347a44785I4148a74489A71329G642L59916A70641M5568k3304K22685
$$ 275347 -144785 94148 -174489 171329 7642 367558 170641 216209 192905 415590
17241D15590B3780P3535M04086q2544A05266K16142e4692B63545A22977J34832
$$ 415590 23780 97315 501401 418857 105266 321408 -54692 263545 122977 257809
17231B57809r6901N1391C511L22915A58283K97983d2542A597J5106J39874j947
$$ 257809 160908 212299 3511 326426 158283 456266 -42542 1597 16703 156577 154630
17220A54630P4310K76517B01759J95047N9308o7010M4181I5732J41881B2992g8811
$$ 154630 228940 505457 201759 396806 456114 389104 433285 95732 237613 22992 -78811
17208F9756k0034J38139L41784B57776K71857j32184I7028a02047C28864P1276
$$ 69756 49722 187861 529645 257776 529633 397449 97028 -102047 328864 400140
17198D00140A76318J50580d9655B55616Q5791a25013C51352J34204k26908a3846
$$ 400140 176318 326898 -49655 255616 341407 -125013 351352 485556 258648 -13846
17187a2967A55066J34354A0375L76208K96286k86064A53199K15699a19804D69001
$$ -12967 155066 289420 10375 386583 682869 396805 153199 368898 -119804 469001
17176B14096A00004l3559L32568J73337n1178A19673R6449K31556A72804K74617
$$ 214096 100004 66445 399013 572350 521172 119673 216122 447678 172804 447421
17166D47421a06689D594R9549L0113J98159I9737M81202k64463f5210A97933K62552
$$ 447421 -106689 4594 104143 134256 332415 99737 580939 316476 -65210 197933 460485
17155D60485j34510A54091K09284I8541M04526K3934j79541a54910I16720A33013
$$ 460485 325975 154091 363375 98541 503067 527001 347460 -154910 916720 133013
17144C35389R6648R1162q2108q0264A47357K74859K6905A34231J61269J74648
$$ 335389 432037 523199 441091 360827 147357 422216 449121 134231 295500 470148
17134D70148p2720p8789A50179L42029j6797m9719B01759l2375J41922A43884
$$ 470148 397428 318639 150179 492208 475411 425692 201759 169384 311306 143884
17123B82312K72239k74786Q0233j60737N5247M0167J89009j23959j48176K89429
$$ 282312 554551 279765 359998 199261 254508 294675 483684 359725 211549 500978
17113E00978j39889L02873k85372o8849p6515E0858K67139m8233A17832L02485
$$ 500978 361089 663962 378590 309741 233226 50858 317997 269764 117832 420317
17103D20317A88658K54878A7475L93360A99694K48299l7637K06505k69115q6005
$$ 420317 188658 443536 17475 410835 199694 447993 410356 616861 347746 261741
17093B61741K38143P2676j63416j55834P3888o192K66651B13766J68609O9493
$$ 261741 499884 572560 409144 253310 327198 321006 587657 213766 382375 451868
17083D51868L5011A61870K31910j25869K45139H9362M68191j7381K30569k91444
$$ 451868 486879 161870 393780 267911 513050 89362 557553 540172 770741 479297
17073D79297K16414l10032K51904n0686j31225j5927K26363k19178J20510j56277
$$ 479297 695711 385679 637583 586897 455672 439745 666108 446930 567440 411163
17063D11163K3685r4046N78857k52551m3499A34513K36059J84493j64538R0744
$$ 411163 434848 340802 919659 667108 623609 134513 370572 555065 390527 481271
17053D81271J09219k40134J75441K37138l06807L25712B86306L54175j27986K34051
$$ 481271 590490 350356 525797 762935 456128 781840 286306 640481 512495 746546
17043G46546j07507p7070n5011L0130n3261L82754O2715j47086j8884C45080Q7677
$$ 746546 639039 561969 506958 537088 483827 866581 929296 782210 763326 345080 432757
17032D32757A28203N29121j49152K67183O9515C35957L93425k85859O7398K22623
$$ 432757 128203 657324 508172 775355 844870 335957 729382 443523 510921 733544
17022G33544l52150J52150K33269k09861J01129j69831J38700j95989j17486L48280
$$ 733544 381394 533544 766813 556952 658081 488250 626950 430961 313475 661755
17012F61755J5184C11145K80899M3924p8209M61053m38732j6553K34682Q0645
$$ 661755 676939 311145 592044 635968 557759 1018812 580080 563527 798209 878854
17002H78854q0282R617L3467j66757R6751p1466l4659j80943M9888J48886J8126
$$ 878854 798572 808189 841656 674899 771650 700184 665525 484582 534470 683356 701482
16991G01482K82822J03732m55031K16656k32108J78934k8401k28412N48235j06662
$$ 701482 984304 1088036 633005 849661 617553 796487 768086 539674 1087909 981247
16981I81247J45409k06920J36077k12039J29352m82034M63773J03796m9161o368
$$ 981247 1126656 919736 1055813 843774 973126 491092 954865 1058661 1009500 1003132
16971A003132j98971K54285j3757j06118J18748m44609J50403M31921j240O1273
$$ 1003132 804161 1058446 1044689 938571 1057319 612710 763113 1195034 1193794 1255067
16961A255067k30705l00096K29028O1562p3788L4538L25637l15469L37742l85458
$$ 1255067 1024362 724266 953294 1014856 941068 975606 1301243 985774 1323516 938058
16951I38058M44651k36949L3502J99259l12114K6290j78075M48146k35558p6494
$$ 938058 1382709 1145760 1179262 1378521 1066407 1092697 914622 1362768 1127210 1050716
16941A050716J36533K70039j10245k48746K33723j82353K56551q9821J47343j3130
$$ 1050716 1187249 1457288 1347043 1098297 1332020 1149667 1406218 1316397 1463740 1450610
16931A450610j32583l5937l60639N14568l6556l3755O4611q2162L0713M2144j85139
$$ 1450610 1318027 1282090 921451 1436019 1399463 1365708 1430319 1348157 1378870 1421014 1235875
16920A235875M04682l00449p2043P1872P9016O8582j97351L73728k30198K18799
$$ 1235875 1640557 1340108 1268065 1339937 1418953 1487535 1290184 1663912 1433714 1652513
16910A652513k33740P5966O9003m04799M45758M24283l86615Q6339K38764j21010
$$ 1652513 1418773 1494739 1563742 1158943 1604701 2028984 1642369 1728708 1967472 1846462
16900A846462j41764k86933L56921J45696l11487J99902J93597J9482j63520j07281
$$ 1846462 1704698 1417765 1774686 1920382 1608895 1808797 2002394 2021876 1858356 1751075
16890A751075m962K21663j70050M42672k12638P7370j20185L32763l13815O91236
$$ 1751075 1746113 1967776 1797726 2240398 2027760 2105130 1984945 2317708 2003893 2695129
16880B695129m18616k02727k17575N13312j55989L54188Q9491j46202l0785k22667
$$ 2695129 2276513 2073786 1856211 2369523 2213534 2567722 2657213 2511011 2480226 2257559
16870B257559L65838j54474j86359N29698l15119j57463K2776N27753l57277M76046
$$ 2257559 2623397 2468923 2282564 2812262 2497143 2339680 2362456 2890209 2532932 3008978
16860C008978m01829O9686L42271m0330l3222k26463P9060p103L85275K07356
$$ 3008978 2607149 2676835 3019106 2978776 2945554 2719091 2798151 2791048 3176323 3383679
16850C383679o2652J44262n2475k17913L31114J16271m21461l0285M55005Q3573
$$ 3383679 3321027 3465289 3412814 3194901 3526015 3642286 3220825 3190540 3645545 3729118
16840C729118L2673M5696l43480M58009l07830J15619L02492L09394p859K50745
$$ 3729118 3761791 3807487 3464007 3922016 3614186 3729805 4032297 4341691 4333832 4584577
16830D584577j89796R8088Q6318J31981Q1452j2649L89086P345j35990k61965
$$ 4584577 4394781 4492869 4579187 4711168 4792620 4779971 5169057 5176402 5040412 4778447
16820D778447K55277L36598J53739J08740O7264m7869K06122K8112L20915j28917
$$ 4778447 5033724 5370322 5524061 5632801 5700065 5652196 5858318 5886430 6207345 6078428
16810F078428M83688k93959K37695N05778J66866J33431n816M13118o9017J95116
$$ 6078428 6562116 6268157 6505852 7011630 7178496 7311927 7306111 7719229 7650212 7845328
16800G845328J27992q2112L06210L66133J55701N45955L0193K91275P1940q6977
$$ 7845328 7973320 7891208 8197418 8563551 8719252 9265207 9295400 9586675 9658615 9571638
16790I571638N45979M09715K73581L26992P1238L17052L62325Q6574O11166K72713
$$ 9571638 10117617 10527332 10800913 11127905 11199143 11516195 11878520 11965094 12576260 12848973
16780A2848973N19879K63192P92584J06009O84132J46250O40896M99607L16197
$$ 12848973 13368852 13632044 14424628 14530637 15214769 15361019 16001915 16501522 16817719
16771A6817719N29152P64501J213950l0254Q52896R02546O61709P05509J061553
$$ 16817719 17346871 18111372 19325322 19295068 20147964 21050510 21712219 22417728 23479281
16762B3479281P29660R54928J147423J267295J136002J372012J081747J210661
$$ 23479281 24208941 25163869 26311292 27578587 28714589 30086601 31168348 32379009
16754C2379009J412458J273632J770369K142094J367465K496929J994838K199607
$$ 32379009 33791467 35065099 36835468 38977562 40345027 42841956 44836794 47036401
16746D7036401K339682K587419K838230K973123L104481L207896L437018M419139
$$ 47036401 49376083 51963502 54801732 57774855 60879336 64087232 67524250 71943389
16738G1943389M204576M259864M910037M836659N818602N711851N822848O670791
$$ 71943389 76147965 80407829 85317866 90154525 95973127 101684978 107507826 114178617
16730A14178617O338097P078219P289239P527143O985069P775966P434335O392068
$$ 114178617 120516714 127594933 134884172 142411315 149396384 157172350 164606685 170998753
16722A70998753O509948N628626N135627L817466K509259J493045n8181p80148
$$ 170998753 177508701 183137327 188272954 192090420 194599679 196092724 196034543 195254395
16714A95254395k691040l597242m595443n501481o244658o939154p341395p795102
$$ 195254395 192563355 188966113 184370670 178869189 172624531 165685377 158343982 150548880
16706A50548880p478557p255160p823675o804645p066954o358210o609911n842588
$$ 150548880 143070323 135815163 127991488 121186843 114119889 107761679 101151768 95309180
16698I5309180n652604n286991m877995m702401m361662l997596l849689l661090
$$ 95309180 89656576 84369585 79491590 74789189 70427527 66429931 62580242 58919152
16690E8919152k917947k652894l076436k845556k415526k098767k092869k079482
$$ 58919152 56001205 53348311 50271875 47426319 45010793 42912026 40819157 38739675
16682C8739675j700636j718081j839963j368444j400377j281905j126403j302353
$$ 38739675 37039039 35320958 33480995 32112551 30712174 29430269 28303866 27001513
16674B7001513j358140o98318j061287j181263l90605r64891o72005j320462k49898
$$ 27001513 25643373 24945055 23883768 22702505 22311900 21347009 20675004 19354542 19104644
16665A9104644p16497p12794q30397j65447q60564k41037n76525m46129m37243
$$ 19104644 18388147 17675353 16844956 16679509 15818945 15577908 15001383 14555254 14118011
16656A4118011l76364m66765p41917k37823m62425L161k47594q54932J16004p13099
$$ 14118011 13741647 13274882 12532965 12295142 11832717 11835878 11588284 10733352 10849356 10136257
16646A0136257j05847l18568k51442l92799J28560o33745O7808m26426j11823
$$ 10136257 10030410 9711842 9460400 9067601 9196161 8562416 8630224 8203798 8091975
16637H091975j08504m51613j88933P418l61488J8017p8904l69851K78104k67627
$$ 8091975 7983471 7531858 7342925 7350343 6988855 7006872 6927968 6558117 6836221 6568594
16627F568594m1377n49622j88696J29724l41319k58250P2616k58978J87147k56433
$$ 6568594 6527217 5977595 5788899 5918623 5577304 5319054 5391670 5132692 5319839 5063406
16617E063406Q5029m41357J90074k59479q7432j69737J6804J3801o462n13438
$$ 5063406 5148435 4707078 4897152 4637673 4550241 4380504 4397308 4411109 4404647 3891209
16607C891209K90043o16l62653k14946J2891L62924n02529M1039Q5966j29470
$$ 3891209 4181252 4180636 3817983 3603037 3615928 3978852 3476323 3517362 3603328 3473858
16597C473858j17816k17921J68488l47893J57657L53285m57141K1959n8145q6400
$$ 3473858 3356042 3138121 3306609 2958716 3116373 3469658 3012517 3034476 2976331 2889931
16587B889931l15403R8778l21819L07773K77377j66580k20681j74424P4890O7737
$$ 2889931 2574528 2673306 2351487 2659260 2936637 2770057 2549376 2374952 2449842 2517579
16577B517579k11135K73725l18445J1907q0675r2216K52872l80847l00024L54935
$$ 2517579 2306444 2580169 2261724 2273631 2192956 2100740 2353612 1972765 1672741 2027676
16567B027676m4314J95899p5146R1027m78348p043K69895k88865J09712j4056
$$ 2027676 1983362 2179261 2104115 2195142 1716794 1709751 1979646 1690781 1800493 1786437
16557A786437J59666K19925n54626L64666j94749k67875J37542k56568k9980K49733
$$ 1786437 1946103 2166028 1611402 1976068 1781319 1513444 1650986 1394418 1364438 1614171
16547A614171k6911K56297m89751K67745k2620l81125K80108k12847M8550K28682
$$ 1614171 1587260 1843557 1353806 1621551 1598931 1217806 1497914 1285067 1333617 1562299
16537A562299l43701L39819q8564m1743l3622j18777J10072J51675n29691K55122
$$ 1562299 1218598 1558417 1469853 1428110 1394488 1275711 1385783 1537458 1007767 1262889
16527A262889O4806k1625L0482J01476l96154L14062j79376m17084J47462M36997
$$ 1262889 1327695 1306070 1336552 1438028 1041874 1355936 1176560 759476 906938 1343935
16517A343935l57883p6883K34294N5843j96198m41278O51715j34720K72792m01674
$$ 1343935 986052 909169 1143463 1199306 1003108 561830 1213545 1078825 1351617 949943
16507I49943P452k37940L24227k11600j84595J91253J50861n3947j59260L30803
$$ 949943 957395 719455 1043682 832082 647487 838740 989601 935654 776394 1107197
16497A107197l92579Q5936n7728k31604M29626j66531N7269q7633J97113j70973
$$ 1107197 714618 800554 742826 511222 940848 774317 831586 743953 941066 770093
16487G70093K52725L2109k03288k85461K14554j50677n8453K46673Q5627k93839
$$ 770093 1022818 1054927 851639 566178 780732 630055 571602 818275 903902 610063
16477F10063K31888j56828l36083K03548J92906M4336M9631m6338r7240k03031
$$ 610063 841951 685123 349040 552588 745494 789830 839461 793123 695883 492852
16467D92852K7009J52206q0552K13483k32666J43160M9215j29325j30797r5477
$$ 492852 519861 672067 591515 804998 572332 715492 764707 635382 504585 409108
16457D09108n5096J84351J48986m5294K90970C81091M06619l01405j48138A16710
$$ 409108 354012 538363 687349 642055 933025 381091 787710 486305 338167 116710
16446F79279k72298j07566K82531B42771R2297J01132l8981A37930O56851J09654
$$ 679279 406981 299415 581946 242771 335068 436200 397219 137930 794781 904435
16436I04435l49851o221K22356l10927j78838P3491m2548k0753M45433B59667
$$ 904435 554584 548363 770719 459792 280954 354445 311897 291144 736577 259667
16425H79577B60927J03668E6353J84467N71576k36762A54573K45283J72049p4162
$$ 879577 260927 364595 56353 240820 812396 575634 154573 399856 571905 497743
16415D97743A87017M09485k37076L5115J12131M6837L2815O4189k28895L6870
$$ 497743 187017 596502 359426 394541 506672 553509 586324 650513 421618 458488
16405D58488k01798J35145A60297M91121j72172p5451I4734J62196Q6328L12640
$$ 458488 256690 391835 160297 651418 479246 403795 94734 256930 343258 655898
16395F55898C22606K9218Q0378r1738M7897K6547k06552L9162K6361o2189J46402
$$ 655898 322606 351824 432202 340464 388361 414908 208356 247518 273879 211690 358092
16384C58092k1581j02747J70281K37529B29381r6459D5086J72634j06078J02766
$$ 358092 336511 233764 404045 641574 229381 132922 45086 217720 111642 214408
16374B14408K24181A79026J37843A23120J93787H0056J46775F0928P3877K78027
$$ 214408 438589 179026 316869 123120 316907 80056 226831 60928 134805 412832
16364D12832q3020A10648M87577j16863m0755K79258B27407m6188R5757Q7861
$$ 412832 329812 110648 598225 481362 440607 719865 227407 181219 276976 364837
16354C64837g7329a3287D18135f976D02646n7027h1969C96522A91652q2105K25471
$$ 364837 -77329 -13287 418135 -6976 402646 345619 -81969 396522 191652 109547 335018
16343C35018J82304A10653C8036b12924B06717j2698m598J45478a2522A08860
$$ 335018 517322 110653 38036 -212924 206717 194019 189421 334899 -12522 108860
16332A8959K61161D4486O2711J71765L62C3438L34734j6728A3089K138K18076
$$ 18959 280120 44486 107197 278962 279324 33438 368172 351444 13089 15227 233303
16321B33303J00000B2759J88449r9728L4981J79771q0789K47302k15755b08120
$$ 233303 333303 22759 211208 111480 146461 326232 245443 492745 276990 -208120
16310E7103K31459H3355d5440E5183K22041G9237K21582a97370g3468I8131L81734
$$ 57103 288562 83355 -45440 55183 277224 79237 300819 -197370 -73468 98131 479865
16299D79865e1673k6112D59882m5682A68113a67285A62691q799k5687O3076G6395
$$ 479865 -51673 -77785 459882 414200 168113 -167285 162691 153892 128205 191281 76395
16287a65627B2150L45817j60111R2354a19333B21326J68825A63274o0760B1556
$$ -165627 22150 367967 207856 300210 -119333 221326 390151 163274 102514 21556
16276A71080B1815J61400a37230D50811C0322a03726b1358A02809f0598l5056
$$ 171080 21815 183215 -137230 450811 30322 -103726 -21358 102809 -60598 -95654
16266i5654A89480L9932q2580K83983j81951F3648a72304G7470N8022b59008d6331
$$ -95654 189480 229412 146832 430815 248864 63648 -172304 77470 135492 -259008 -46331
16254b5690B25090C4351d1553A38122a33040C52838I6927a57270l7685C33384
$$ -25690 225090 34351 -41553 138122 -133040 352838 96927 -157270 -194955 333384
16243c4642k5888A88062d963C7603J28199O3863k9039b55965C173M06665A99533
$$ -34642 -60530 188062 -4963 37603 165802 229665 200626 -255965 3173 409838 199533
16231e3721D11990F1617J37450B3167R7857N9746L64971A15204a76599A35605
$$ -53721 411990 61617 199067 23167 121024 180770 545741 115204 -176599 135605
16220a6032A53368k3417e2968j41046A05376L29582a05568B65686F2332b71960
$$ -16032 153368 129951 -52968 -194014 105376 434958 -105568 265686 62332 -271960
16209i2451o2263A38155a8266B3114O7971J19840D1247K2831b17258D8158b22208
$$ -92451 -154714 138155 -18266 23114 91085 210925 41247 64078 -217258 48158 -222208
16197I9744B1746c7447k68336A44511d11158a33787D02772A32083c2496n4309
$$ 99744 21746 -37447 -305783 144511 -411158 -133787 402772 132083 -32496 -86805
16187h6805I2479M9000a66077C18810K0088E3472J42291a69486D04929M9893A75037
$$ -86805 92479 141479 -166077 318810 338898 53472 195763 -169486 404929 454822 175037
16175A98009F0237g8499j25505b3023C06912k742j27806a07623A97353H2568c89824
$$ 198009 60237 -78499 -204004 -23023 306912 304170 176364 -107623 197353 82568 -389824
16163a60681A42387c5344f031G2630a54945N0371j44042Q9756j08908g8332b8292
$$ -160681 142387 -35344 -6031 72630 -154945 -104574 -248616 -158860 -267768 -78332 -28292
16151b9859l2806B62664G928M3104A9197a44658o0182P4150M7828B099J81485
$$ -29859 -62665 262664 7928 51032 19197 -144658 -204840 -130690 -82862 2099 183584
16140A83584F205g5303A51558A5307a00040A19145f7438H7330e8945C884a30645
$$ 183584 6205 -75303 151558 15307 -100040 119145 -67438 87330 -58945 3884 -130645
16128b05549C77810b53217e1055j596B1620J58285H1331a09567e4689l31412J17745
$$ -205549 377810 -253217 -51055 -52651 21620 179905 81331 -109567 -54689 -386101 -268356
16117b68356D6974J7059d9153j43979g9866c8299B94146G5599J16470c1288C0061
$$ -268356 46974 64033 -49153 -193132 -79866 -38299 294146 75599 192069 -31288 30061
16105I8551F685c9471B73279p005f8614A2062Q4235b35956C52333j09177r1689
$$ 98551 6685 -39471 273279 266274 -68614 12062 96297 -235956 352333 243156 151467
16094A51467a6408A54648a60082H9245a22845A80976a06067b6714A13949h66r3573
$$ 151467 -16408 154648 -160082 89245 -122845 180976 -106067 -26714 113949 -866 -94439
16083i4439a3153B70793a75654A48173B1427J76648e33271f1861E4273a21921
$$ -94439 -13153 270793 -175654 148173 21427 198075 -533271 -61861 54273 -121921
16072A48259a2447j36542A5586O0027K7359a1607o9935b0623j41331L6983E9981
$$ 148259 -12447 -148989 15586 75613 102972 -11607 -81542 -20623 -161954 -124971 59981
16060a25489A15679a9109r0396j78801D8303K68341q7351b26417b9831j32096
$$ -125489 115679 -19109 -109505 -288306 48303 316644 229293 -226417 -29831 -161927
16050a61927E4442L2520a2279k60312C62602d3442C4332c21058D4271b08226A9914
$$ -161927 54442 86962 -12279 -272591 362602 -43442 34332 -321058 44271 -208226 19914
16038D4155K98655q416A43920b41162A69899g4301n5112j81924a31213B37461
$$ 44155 342810 334394 143920 -241162 169899 -74301 -129413 -311337 -131213 237461
16027B09771r5299b10592h0802j01123b7758A73465l0493D2617b3310A14509m5966
$$ 209771 114472 -210592 -80802 -181925 -27758 173465 142972 42617 -23310 114509 68543
16016F8543L9979a30398A46212L5712o5422b36168i5304j892n7951B03361b6925
$$ 68543 108522 -130398 146212 181924 116502 -236168 -95304 -97196 -155147 203361 -26925
16004b84513J02611f4347J6657A35254c34606C6808e4230B20798g3566c6321C16233
$$ -284513 -181902 -64347 -47690 135254 -334606 36808 -54230 220798 -73566 -36321 316233
15992e27175a24834j43740a33975n2677j91907A26274c6495B53166N251p5615
$$ -527175 -124834 -268574 -133975 -186652 -378559 126274 -36495 253166 258417 182802
15982A82802J32012J98012B55636B5973J5265g44j54343K6255n7186q431A91918
$$ 182802 314814 512826 255636 25973 41238 -744 -155087 -128832 -186018 -194449 191918
15970a53725P4137A62703i841k76934A12741L8637C2346f336B51133a45368F6386
$$ -153725 -79588 162703 -9841 -286775 112741 151378 32346 -6336 251133 -145368 66386
15958H9415a17647q853C2179a84536O1052j94888a46189j207m5324P4455k49572
$$ 89415 -117647 -126500 32179 -184536 -123484 -318372 -146189 -147396 -192720 -118265 -367837
15947c67837A84741a89437o1696C8502L7366i4849k03773f0415F8872A6382a5366
$$ -367837 184741 -189437 -251133 38502 75868 -94849 -298622 -60415 68872 16382 -15366
15935f8277k10571h6317D80617h7597n717E6551c5299a1156C19448j57078b95704
$$ -68277 -278848 -86317 480617 -87597 -93314 56551 -35299 -11156 319448 162370 -295704
15923a76006A31119P3341g6905A15627c08031N2820A34398L8692J41154a79630
$$ -176006 131119 204460 -76905 115627 -308031 -255211 134398 173090 314244 -179630
15912A0188c23628H7202R274a08427k93609a30908A22535a81804r1402A76718
$$ 10188 -323628 87202 96476 -108427 -402036 -130908 122535 -181804 -273206 176718
15901B22740d37250J84059A50483B6112a84023g7750j8763C16210c9158G3885
$$ 222740 -437250 -253191 150483 26112 -184023 -77750 -96513 316210 -39158 73885
15890H8788c74601a1434j51904g2005C3754a12669n3953C11659c3043F8573i0791
$$ 88788 -374601 -11434 -163338 -72005 33754 -112669 -166622 311659 -33043 68573 -90791
15878e619j96297n5332r2688c7367j08168A06869d10678A46554d6462A63778A1317
$$ -5619 -201916 -257248 -349936 -37367 -145535 106869 -410678 146554 -46462 163778 11317
15866H5338e022j1127A24743b14207Q2871C6095a90929j4505c2880B29627b44398
$$ 85338 -5022 -16149 124743 -214207 -131336 36095 -190929 -205434 -32880 229627 -244398
15854a87311Q9356r0911L6742F1388h8461b4559E3871d210C85a9343B58031p8293
$$ -187311 -97955 -188866 -152124 61388 -88461 -24559 53871 -4210 385 -19343 258031 179738
15842A79738h899j6561j070o9980B28751B7408J85383b3773q6962K5730D0607
$$ 179738 -8899 -25460 -26530 -96510 228751 27408 212791 -23773 -110735 -85005 40607
15830f8702j61635G2009K13755a62151j6355E0458J20481c9974J0622k22553B97413
$$ -68702 -230337 72009 285764 -162151 -178506 50458 170939 -39974 -29352 -251905 297413
15818a02738l62461L4685A38762b67007f9175L3301k1930k6560a4461m21492f4610
$$ -102738 -465199 -430514 138762 -267007 -69175 -35874 -57804 -84364 -14461 -435953 -64610
15806G0223j5155J08363a80537L4265j98081b4089A52322a36462j20170j45640
$$ 70223 55068 163431 -180537 -146272 -344353 -24089 152322 -136462 -256632 -402272
15796d02272b2309A47906C2906a35487j98969a44981A17011Q2099b5619l1347
$$ -402272 -22309 147906 32906 -135487 -334456 -144981 117011 199110 -25619 -56966
15786e6966r234B33572r0079A9518a37971D30956b82260A63722b08590j8856g9523
$$ -56966 -66200 233572 143493 19518 -137971 430956 -282260 163722 -208590 -227446 -79523
15774b13436q5871A23916j9878B7587K08265a31060b991k15068f4834j58967G2342
$$ -213436 -299307 123916 104038 27587 235852 -131060 -2991 -218059 -64834 -223801 72342
15762i6777J2276L2273A83070G2303a45728I9788P4762P9804D3316a48717B48177
$$ -96777 -84501 -52228 183070 72303 -145728 99788 174550 254354 43316 -148717 248177
15750h9044H4232d5196j08948d7803G3334a11555D1165b94951J16199J6552m4598
$$ -89044 84232 -45196 -154144 -47803 73334 -111555 41165 -294951 -178752 -162200 -206798
15739b06798D0452a82341e2786k73851E9399b43941r04A25601a74615j38902J15218
$$ -206798 40452 -182341 -52786 -326637 59399 -243941 -244845 125601 -174615 -313517 -198299
15728a98299h2730j5097p9201B34142H7710b79027a10676A39477A9234p303J51667
$$ -198299 -82730 -97827 -177028 234142 87710 -279027 -110676 139477 19234 11931 163598
15717A63598i6655R778A13770M8089j3141n0815n132n287b28558g9057B06842
$$ 163598 -96655 -86877 113770 161859 148718 97903 92771 87484 -228558 -79057 206842
15705a15214c0706D6572e2042A45258J00158a51154E3557a27417l3311A557a45218
$$ -115214 -30706 46572 -52042 145258 245416 -151154 53557 -127417 -160728 1557 -145218
15693e4781D3424a42578f288H5857a20832M1889r639b4851F175b19233A36722
$$ -54781 43424 -142578 -6288 85857 -120832 -78943 -88582 -24851 6175 -219233 136722
15681D18884c42450c9762C42188e4479E2654J6161L8500A3773m444J34689J00622
$$ 418884 -342450 -39762 342188 -54479 52654 68815 107315 13773 9329 144018 244640
15670B44640j13204g440A84646g4180A94246E0890f8960k78655A3106b441m6737
$$ 244640 131436 -7440 184646 -74180 194246 50890 -68960 -347615 13106 -2441 -49178
15659d9178j47383i2510L0912l5171I2164b4120j94717g5807p9089H6485c16840
$$ -49178 -196561 -92510 -61598 -96769 92164 -24120 -218837 -75807 -154896 86485 -316840
15647H3710R1697a15000B0844b51737C02581b55777D6476g2323k78280K0497A864
$$ 83710 175407 -115000 20844 -251737 302581 -255777 46476 -72323 -350603 -330106 1864
15635A2713a07380B86693f3823B1680L3515f0765j65036j66041a89838D01295
$$ 12713 -107380 286693 -63823 21680 55195 -60765 -225801 -391842 -189838 401295
15624A70681d388A17833R7950b42743d1l35412m8649A58227d1146G3590a59806
$$ 170681 -4388 117833 215783 -242743 -41 -335453 -384102 158227 -41146 73590 -159806
15612e4775j61609j14435H1641b1761H016c0146I6046a78161J7046g3050k4819
$$ -54775 -216384 -330819 81641 -21761 8016 -30146 96046 -178161 -161115 -73050 -97869
15601i7869a3124D7839c88013A16304d9467A0904A625J95805D9609P8009j5077
$$ -97869 -13124 47839 -388013 116304 -49467 10904 1625 197430 49609 127618 112541
15590A12541O8619Q2643j28982L9639l4451m0349A7242a6234A4725g8023l25374
$$ 112541 181160 263803 134821 174460 140009 99660 17242 -16234 14725 -78023 -403397
15579d03397A76994b37423i1758J5357C9209c5452G2661J14046b19223c1162F0372
$$ -403397 176994 -237423 -91758 -76401 39209 -35452 72661 186707 -219223 -31162 60372
15567c47559A5495c38383A02335e7065G6210F264M61813A44543C8276b87081R6963
$$ -347559 15495 -338383 102335 -57065 76210 6264 468077 144543 38276 -287081 -190118
15556a90118G934b72325C6410g4056A22258a12739l3769e9280j58384i3529A28164
$$ -190118 7934 -272325 36410 -74056 122258 -112739 -146508 -59280 -217664 -93529 128164
15544A20194c01607b7252D9075c78055J00615R8996E145a96475B4281a57878O9807
$$ 120194 -301607 -27252 49075 -378055 -277440 -178444 5145 -196475 24281 -157878 -88071
15533h8071A60015J517j7043j9674c17832A28167n6588a58594B39833H6315B3582
$$ -88071 160015 161532 144489 124815 -317832 128167 71579 -158594 239833 86315 23582
15521A27849a94148g441j55901B6290K73267A43088H956b07221j33488g5598A4429
$$ 127849 -194148 -7441 -163342 26290 299557 143088 8956 -207221 -340709 -75598 14429
15509G5562P0088A6012L00316J3227b25110g8145G4871a68865A33341f8725L2293
$$ 75562 145650 16012 316328 329555 -225110 -78145 74871 -168865 133341 -68725 -36432
15498c6432j09772C91513r2779a04669F5972a53975d8058B60223C3720b35963
$$ -36432 -146204 391513 298734 -104669 65972 -153975 -48058 260223 33720 -235963
15487A57155D1852L9386a4151j36449d9811j25094d0699j80081F0572L65834C9921
$$ 157155 41852 81238 -14151 -150600 -49811 -174905 -40699 -220780 60572 426406 39921
15475C16115a91481E0886N4753m6387P2217g6487r0390A9814K43759h2459n718
$$ 316115 -191481 50886 105639 59252 131469 -76487 -166877 19814 263573 -82459 -88177
15464h8177H5255b16769g6798l1280J3469H4531a03535E6491a16469o2775A45999
$$ -88177 85255 -216769 -76798 -108078 -94609 84531 -103535 56491 -116469 -179244 145999
15452a78972A43279Q0675d2538m8796A52074a88793B33973a36267q4004J2927
$$ -178972 143279 223954 -42538 -91334 152074 -188793 233973 -136267 -220271 -207344
15442b07344O433h5826A74638D1022E122b53099A2425J10278L37130A77609c1897
$$ -207344 -200911 -85826 174638 41022 5122 -253099 12425 122703 459833 177609 -31897
15430F9165e7877A10124K5915g3066F4906M9734a9353l3175D2660a14846c4158
$$ 69165 -57877 110124 136039 -73066 64906 114640 -19353 -52528 42660 -114846 -34158
15418a42382B6376O23b62178A07004a75499A17584h0823A03877g6328L382K274
$$ -142382 26376 26999 -262178 107004 -175499 117584 -80823 103877 -76328 -72946 -70672
15407g0672j52214D5476d967r9729C06213a84664d169B70701c5172C6668a23479
$$ -70672 -222886 45476 -4967 -104696 306213 -184664 -4169 270701 -35172 36668 -123479
15395c1952A80974G8310O2302d1280j43609H0739a47516b1069A55949A5700e8488
$$ -31952 180974 78310 140612 -41280 -184889 80739 -147516 -21069 155949 15700 -58488
15383I4202a08523A41696b00857g9609m024m0526e6073j57215D6389e8225j18678
$$ 94202 -108523 141696 -200857 -79609 -83633 -124159 -56073 -213288 46389 -58225 -176903
15372a76903g8143A59543b00691P9529B69980j14374a7160A90023q4054j4184
$$ -176903 -78143 159543 -200691 -121162 269980 155606 -17160 190023 105969 91785
15362I1785m5596K55200k9228i4236f189B6957k749J8828o379K86588I8472d4112
$$ 91785 46189 301389 272161 -94236 -6189 26957 24208 43036 36657 323245 98472 -44112
15349I497h7354j76635C0935g6039B32171b98160E6864K1769L3531b18790g0273
$$ 9497 -87354 -263989 30935 -76039 232171 -298160 56864 78633 112164 -218790 -70273
15337B1282d8760q5959A07262a35146l15413d3738j22680B41482E646g4827j83588
$$ 21282 -48760 -134719 107262 -135146 -450559 -43738 -166418 241482 5646 -74827 -258415
15326b58415i0979B45590q8027e62898B88061O8570j61382l2305a72498H2380
$$ -258415 -90979 245590 157563 -562898 288061 356631 195249 162944 -172498 82380
15315A08346J6022K15432A26674f3478G56O7775M0733M278g7511A88350J4828
$$ 108346 124368 339800 126674 -63478 756 68531 109264 113542 -77511 188350 203178
15304B03178K4240i1060n1242j77134B0051J36853a25929B7573l723K45136h823
$$ 203178 227418 -91060 -142302 -319436 20051 156904 -125929 27573 23850 268986 -8823
15292d8766G1648a69755C36900A50696J0014e6228n4426A65398F2126i2359j80907
$$ -48766 71648 -169755 336900 150696 160710 -56228 -110654 165398 62126 -92359 -273266
15281b73266D8111K43946b62947J31344c2401A01362J07329e0733G7329R1363
$$ -273266 48111 292057 -262947 -131603 -32401 101362 208691 -50733 77329 168692
15271A68692N6396B7728L59350r8939h4143r6200F1147R1511M5031I5030b40970
$$ 168692 225088 27728 387078 288139 -84143 -180343 61147 152658 197689 95030 -240970
15259h638B27340g4608D8755b37652a14490B63700P213j21803M26893A99446J98325
$$ -8638 227340 -74608 48755 -237652 -114490 263700 270913 149110 576003 199446 397771
15248C97771K71007J16699N70302k48799M77732G37676k75372F197b3457E9186
$$ 397771 668778 785477 1355779 1106980 1584712 737676 462304 6197 -23457 59186
15237b02943C4410a91641f9874B34339A16457i3747B31992h2404B05012F8852
$$ -202943 34410 -191641 -69874 234339 116457 -93747 231992 -82404 205012 68852
15226b30270A82564d5479I07N14388a92985C13328F6460a39678B8746j716A2125
$$ -230270 182564 -45479 907 515295 -192985 313328 66460 -139678 28746 27030 12125
15214B77302r6483a86544R331A04674b33308M9299B2547L5780j8252M8706L6269
$$ 277302 180819 -186544 -177213 104674 -233308 -184009 22547 58327 40075 88781 125050
15203A25050a44229N2268m5671A19658n5421K02106A16983c0277k04577Q4782
$$ 125050 -144229 -91961 -137632 119658 64237 266343 116983 -30277 -234854 -150072
15193a50072a9529B64154O1655A28077R5225A05316l4974a71691A8000a41108
$$ -150072 -19529 264154 325809 128077 223302 105316 70342 -171691 18000 -141108
15182f9555B43221d741j5872m2604K7111H3460P7525a43876L7352A3225N7982
$$ -69555 243221 -4741 -20613 -63217 -36106 83460 160985 -143876 -106524 13225 71207
15171G1207b75349B55529N2917a27844A63937J11907j13674c08914q8299J80224
$$ 71207 -275349 255529 308446 -127844 163937 275844 162170 -308914 -397213 -216989
15161b16989I4077N09564A78310a64994C4091K85534n5318N2820b2781k256D30662
$$ -216989 94077 603641 178310 -164994 34091 319625 264307 317127 -22781 -25037 430662
15149B92618f0404B02412P7547A1942L3033J75786b8562C29837A48951M8389b02522
$$ 292618 -60404 202412 279959 11942 44975 220761 -28562 329837 148951 197340 -202522
15137B85551a27149C9139K56623H3980a3808E75538B7273P7543i1465C19655b6699
$$ 285551 -127149 39139 295762 83980 -13808 575538 27273 104816 -91465 319655 -26699
15125d328B13211g3692B78121K6704r7100M4980n8813l3828J39082b295C6920
$$ -4328 213211 -73692 278121 304825 207725 252705 193892 160064 299146 -2295 36920
15113A658K5420h4572c8790A65290j8578F1993F581a29282C30830q9940J96181
$$ 1658 27078 -84572 -38790 165290 146712 61993 6581 -129282 330830 240890 437071
15102D37071F2719L10221F9513K617h1719G4644L4126L01783j24928m6475R1527
$$ 437071 62719 372940 69513 72130 -81719 74644 108770 410553 285625 239150 330677
15091C30677A40289c85047F1654g5276g430j69573A93582J29444A57258e9519
$$ 330677 140289 -385047 61654 -75276 -7430 -177003 193582 323026 157258 -59519
15080C69195A45216K03664a20882D3631g9753A067J46153A3550J1056J35263J76894
$$ 369195 145216 348880 -120882 43631 -79753 1067 147220 13550 24606 159869 336763
15069C36763J8530A30211B3613i349B83769A38267M8865G6893J6899k0012K87261
$$ 336763 355293 130211 23613 -9349 283769 138267 187132 76893 93792 73780 361041
15058C61041b8222A30194R9314J54742A35352O7096O3161q8724K2119j4857J61585
$$ 361041 -28222 130194 229508 384250 135352 202448 265609 176885 199004 184147 345732
15047C45732J12456A38576B4027b37038A99940a58865B20970G8528h1538C51821
$$ 345732 458188 138576 24027 -237038 199940 -158865 220970 78528 -81538 351821
15036D1528J71487L63767e2576B56722F1102L10200p4247q8274r5740O0984K93933
$$ 41528 213015 576782 -52576 256722 61102 371302 297055 208781 113041 174025 467958
15025D67958j43932A4708N4853J50672n9762N3941L79664a4138A38297g0279A73219
$$ 467958 324026 14708 69561 220233 160471 214412 594076 -14138 138297 -70279 173219
15013A37541K90652B08626j7174K64226A74460Q3216k9634m6475n4609R0585K16879
$$ 137541 428193 208626 191452 455678 174460 257676 228042 181567 126958 217543 434422
15002D34422p3419A43457n3087R9363n2698b2031A89222m8688E4360K22860J05361
$$ 434422 361003 143457 90370 189733 137035 -22031 189222 140534 54360 277220 382581
14991C82581a36646A21285J56526a35164B95983m9192p645R7501A50240F2387
$$ 382581 -136646 121285 277811 -135164 295983 246791 239146 336647 150240 62387
14980H4368P5941K23684a37658A70406o7475M89672j56735I3969K35220F726N39692
$$ 84368 160309 383993 -137658 170406 102931 592603 435868 93969 329189 6726 546418
14969E46418B32293J13503M7661j51795m176l9093D9684Q8173J18323p7074l1105
$$ 546418 232293 345796 393457 241662 237486 198393 49684 137857 256180 179106 148001
14958A48001o7876J66977J80605q6956J29320a8077D18352A82406G0045j5615
$$ 148001 80125 247102 427707 340751 470071 -18077 418352 182406 70045 54430
14948E4430P3755q125L95554a09555C78641P7397A21239Q1554J60863L5445A03529
$$ 54430 128185 120060 515614 -109555 378641 456038 121239 202793 363656 399101 103529
14936B37756l111K23102j11134r0983q6999j1826M3902c0446B79868b8566A97927
$$ 237756 234645 457747 346613 255630 168631 156805 200707 -30446 279868 -28566 197927
14924D15241e9490D98541j68211A03158J99411A34432E2998d4895B90197R0911
$$ 415241 -59490 498541 330330 103158 302569 134432 52998 -44895 290197 381108
14914C81108B21L80578k6995j7579j32275J98691I7582L03054A38966K48385j42870
$$ 381108 221 380799 353804 336225 203950 402641 97582 400636 138966 387351 244481
14903B44481J06608A50051L6685J89631A09222D5443J15345K34306j25948J61185
$$ 244481 351089 150051 186736 376367 109222 45443 160788 395094 269146 430331
14893D30331K9768k4708j91231B4048J76724L4371n406A7365L57699A83909m2458
$$ 430331 460099 435391 244160 24048 200772 235143 229737 17365 375064 183909 141451
14882A41451L26820j25249k5829O6296J76399k2992n7896k06455M2651b31920
$$ 141451 468271 343022 317193 383489 559888 536896 479000 272545 315196 -231920
14871B67099d1706A80131K57757K90096B38216r8573P6792q1823P2177K26001
$$ 267099 -41706 180131 437888 727984 238216 139643 216435 134612 206789 432790
14861D32790J90156j83606j4240j84148L44536l7492j6211k15016j27360M24451
$$ 432790 622946 439340 425100 240952 585488 547996 531785 316769 189409 613860
14851F13860B01326J45537k9986J06207A78061j9330m1368L08128O9470J21975
$$ 613860 201326 346863 316877 423084 178061 158731 117363 425491 494961 616936
14841F16936j03401r6611J17510k11662J87958k22385J82283j9538J59446B41875
$$ 616936 513535 416924 534434 322772 510730 288345 470628 451090 610536 241875
14830E25035J49809k2619j63321j52251Q6028J26243P4848j15416k28156j2026
$$ 525035 674844 652225 488904 336653 422681 548924 623772 508356 280200 268174
14820B68174K09990q0990K19394J08401A29658M31193J54756n8418J91264J37954
$$ 268174 478164 397174 616568 724969 129658 560851 715607 657189 848453 986407
14810I86407A50721J36879L27973p1492K4955j59092m4503A53797L5087Q587M26169
$$ 986407 150721 287600 615573 544081 569036 409944 365441 153797 188884 197471 623640
14799F23640j25788q4852P8689k26946M89421k93812q9166N7841k1249j51011
$$ 623640 497852 413000 491689 264743 754164 460352 371186 429027 407778 256767
14789B56767M81188j15206k52193J85528K10503j7590k00880J17166C13415L44906
$$ 256767 737955 622749 370556 556084 766587 748997 548117 665283 313415 658321
14779F58321M6424Q2417l70967r1477L32598k03281l8423p9041L55979O0626Q9633
$$ 658321 704745 787162 416195 324718 657316 454035 415612 336571 692550 753176 842809
14768H42809m10854L39275j72145L3366n4821k51100J97406j13403L15276l56650
$$ 842809 431955 771230 599085 632451 577630 326530 523936 410533 725809 369159
14758C69159L23634m1447j30018j8785L8116j46894M35400l22956k6566L96047
$$ 369159 692793 651346 521328 502543 540659 393765 829165 506209 479643 875690
14748H75690k60563j92010P007J06672L53252k02376J12257l06107K60027l05795
$$ 875690 615127 423117 430124 536796 890048 687672 799929 493822 753849 448054
14738D48054j673R1679K2841L79764D58811J09819L27168l37322J17039N8630
$$ 448054 446381 538060 560901 940665 458811 568630 895798 558476 675515 734145
14728G34145J38395l15348N22211m68110L20641j84767L1584l79010L49784K02528
$$ 734145 872540 557192 1079403 611293 931934 747167 778751 399741 749525 952053
14718I52053k69318L62138j16360R8734j64019l10849M14187j72621j06906K15261
$$ 952053 682735 1044873 928513 1027247 863228 552379 966566 793945 687039 902300
14708I02300K53141l38477k54202J20067K4008K06868D31344M76267o6396k14228
$$ 902300 1155441 816964 562762 682829 706837 913705 431344 907611 841215 626987
14698F26987L51872j65339p8815P591M38135j81782m5297J29861k99086m0426
$$ 626987 978859 813520 734705 742296 1180431 998649 953352 1083213 784127 743701
14688G43701J94568o6406K45229k16535L3047l0335J80056n0062K23991n99225
$$ 743701 938269 871863 1117092 900557 933604 903269 1083325 1033263 1257254 658029
14678F58029L21343k94004J88209K69663E47157P52498l26641K09442j34908n384
$$ 658029 979372 685368 873577 1143240 547157 1299655 973014 1182456 1047548 1042164
14668A042164L0496L4057j16472J07718k94650L29050o7151j87219L86468l34312
$$ 1042164 1072660 1106717 990245 1097963 803313 1132363 1065212 877993 1264461 930149
14658I30149k52531J56762O9314O6483J16153l47499K54735j47551L89233J58280
$$ 930149 677618 834380 903694 970177 1086330 738831 993566 846015 1235248 1393528
14648A393528k66883K58030j62776L26858j20066k33342K3497Q7098k17493K41298
$$ 1393528 1126645 1384675 1221899 1548757 1428691 1195349 1218846 1305944 1088451 1329749
14638A329749K04924k68850q8767r1877K30279j29579k9447N6183P2822L33962
$$ 1329749 1534673 1265823 1177056 1085179 1315458 1185879 1156432 1212615 1285437 1619399
14628A619399n6734m92107K86899J24789k11071o4377M24565j28123r3048L9796
$$ 1619399 1562665 1070558 1357457 1482246 1271175 1206798 1631363 1503240 1410192 1449988
14618A449988M9795j92413l1688M59660l23309M8357N7502J13442k01117j67062
$$ 1449988 1499783 1307370 1275682 1735342 1412033 1460390 1517892 1631334 1430217 1263155
14608A263155K76076p7717K65202l24721J90964k55383M2979K27188n5582r4506
$$ 1263155 1539231 1461514 1726716 1401995 1592959 1337576 1380555 1607743 1552161 1457655
14598A457655K948J36737J9144m0678K62939n07716K54101L54911j17970k19738
$$ 1457655 1460603 1597340 1616484 1575806 1838745 1331029 1585130 1940041 1822071 1602333
14588A602333L75007k42247k4940K52940l66517K65039L12945k98727n9203o7541
$$ 1602333 1977340 1735093 1710153 1963093 1596576 1861615 2174560 1875833 1816630 1749089
14578A749089M0940J27445L99648l95531n2825K42315K24698l4708j39478N7321
$$ 1749089 1790029 1917474 2317122 1921591 1868766 2111081 2335779 2301071 2161593 2218914
14568B218914m8991K02441l07645L33760n565k03601L22901l89776M06189p5707
$$ 2218914 2169923 2372364 2064719 2398479 2392914 2189313 2512214 2122438 2528627 2452920
14558B452920L17260K5963O1373j7998K15588N88928L82807K62454J440797J307517
$$ 2452920 2770180 2796143 2857516 2839518 3055106 3644034 4026841 4289295 5730092 7037609
14548G037609L648042J0281556J9429266O106143B2026352j1012925n269106k291634
$$ 7037609 10685651 20967207 40396473 46502616 22026352 11013427 5744321 3452687
14540C452687o45266l79027p13272L36247o7739j18701L02167J42534m16968J50314
$$ 3452687 2807421 2428394 1715122 2051369 1983630 1864929 2167096 2309630 1892662 2042976
14530B042976p4539J11500k01661M75103l45162L16481J35872l16101J78521O2679
$$ 2042976 1968437 2079937 1878276 2353379 2008217 2324698 2460570 2144469 2322990 2385669
14520B385669O103j68670M57693m43760J75643N82924m32300j9667j12990K00462
$$ 2385669 2391772 2223102 2680795 2237035 2412678 2995602 2563302 2543635 2430645 2631107
14510B631107J44485j47351J45999L6474k0768K98042k64250K21428K745Q5050
$$ 2631107 2775592 2628241 2774240 2810714 2789946 3087988 2823738 3045166 3047911 3132961
14500C132961l05306O22508m62396J57951l13663M13737l64995K11574K51026
$$ 3132961 2827655 3450163 2987767 3145718 2832055 3245792 2880797 3092371 3343397
14491C343397k68980M07268K13133m6768k76949L61012m05368K06164j46167N90885
$$ 3343397 3074417 3481685 3694818 3648050 3371101 3732113 3326745 3532909 3386742 3977627
14481C977627j91491j14989R4921K01876R6382l92515M72053l6485K54073j44974
$$ 3977627 3786136 3671147 3766068 3967944 4064326 3671811 4143864 4107379 4361452 4216478
14471D216478k3504o9364M63858o30295M16895l0265J38379j709K750J33914j40526
$$ 4216478 4192974 4123610 4587468 3957173 4374068 4343803 4482182 4480473 4483223 4617137 4476611
14460D476611l8780L70504K5958L76685m9508j01185M73323n04755J45893K83982
$$ 4476611 4437831 4808335 4834293 5210978 5161470 5060285 5533608 5028853 5174746 5458728
14450E458728n10103K94045K09113p1201m9464K74126J83131r9959j22534L32689
$$ 5458728 4948625 5242670 5451783 5380582 5331118 5605244 5788375 5688416 5565882 5898571
14440E898571K9477J29707k4726K96613J75011k97354K25054K28680J18564k74852
$$ 5898571 5928048 6057755 6033029 6329642 6504653 6207299 6432353 6661033 6779597 6504745
14430F504745J22614L60542J23595J71351K2170l08523K09714k40260P77759J78378
$$ 6504745 6627359 6987901 7111496 7282847 7305017 6996494 7206208 6965948 7743707 7922085
14420G922085n76298J45445N08748K59088O4571k42117L64404M08521m16568L38757
$$ 7922085 7345787 7491232 7999980 8259068 8323639 8081522 8445926 8854447 8437879 8776636
14410H776636N3353P4028J8174J65504J65617J48873N08153o9319J36548J24555
$$ 8776636 8829989 8904017 8922191 9087695 9253312 9402185 9910338 9841019 9977567 10102122
14400A0102122L72602j56526L36341p5432J78812l9521P05721k27387J66644O24878
$$ 10102122 10474724 10318198 10654539 10579107 10757919 10718398 11424119 11196732 11363376 11988254
14390A1988254k7015R7111K79643L37150Q6149K48116M99506K17503m5995N69813
$$ 11988254 11961239 12058350 12337993 12675143 12761292 13009408 13508914 13726417 13680422 14250235
14380A4250235M5601K16722K19442J81774O93590K73547J92398M08724M24269
$$ 14250235 14295836 14512558 14732000 14913774 15607364 15880911 16073309 16482033 16906302
14371A6906302K35841M84751L77477L52869l49502P80518M34560L82460L70650
$$ 16906302 17142143 17626894 18004371 18357240 18007738 18788256 19222816 19605276 19975926
14362A9975926M03303M74146O49921J45938K66594O10056Q83890L42826P98069
$$ 19975926 20379229 20853375 21503296 21649234 21915828 22525884 23409774 23752600 24550669
14353B4550669K39424M88858O65307O57115O01290R02342O05820L87075J171615
$$ 24550669 24790093 25278951 25944258 26601373 27202663 28105005 28710825 29097900 30269515
14344C0269515J078091K33713J479717L54471J437294L04582J245737R81678J467546
$$ 30269515 31347606 31581319 33061036 33415507 34852801 35157383 36403120 37384798 38852344
14335C8852344R30873J396920P12393J332160J376291J338971J737134J413694
$$ 38852344 39783217 41180137 41892530 43224690 44600981 45939952 47677086 49090780
14327D9090780J693475J742697J603331J712721K124926K177262J818253K480405
$$ 49090780 50784255 52526952 54130283 55843004 57967930 60145192 61963445 64443850
14319F4443850K324725J987663K901635K810604K895619K999121L378549L263453
$$ 64443850 66768575 68756238 71657873 74468477 77364096 80363217 83741766 87005219
14311H7005219L367924L959407M047601M104162M460785M951266M895108N548559
$$ 87005219 90373143 94332550 98380151 102484313 106945098 111896364 116791472 122340031
14303A22340031N330579N672422O549469P033383P160473P447960P967580Q843538
$$ 122340031 127670610 133343032 139892501 146925884 154086357 161534317 169501897 178345435
14295A78345435Q939267R418233J0324588J0989752J1104352J2328194J2602847
$$ 178345435 187284702 196702935 207027523 218017275 229121627 241449821 254052668
14288B54052668J3295019J3404428J4428450J4655718J5307870J5472558J6142615
$$ 254052668 267347687 280752115 295180565 309836283 325144153 340616711 356759326
14281C56759326J5852270J5822369J5655966J5051692J3938792J2866557J1194732
$$ 356759326 372611596 388433965 404089931 419141623 433080415 445946972 457141704
14274D57141704R334885O479321K455015n48487k013993j802850k145058n142914
$$ 457141704 466476589 472955910 475410925 474862438 472848445 471045595 468900537 463757623
14266D63757623q344806q428295r997228j1072913j2642235j3700158j5317471
$$ 463757623 455412817 446984522 436987294 425914381 413272146 399571988 384254517
14259C84254517j5919203j6354359j6389599j6226563j5501467j4839904j3848415
$$ 384254517 368335314 351980955 335591356 319364793 303863326 289023422 275175007
14252B75175007j3990379j3608731j2355154j2058339j1452380j0378866j0213045
$$ 275175007 261184628 247575897 235220743 223162404 211710024 201331158 191118113
14245A91118113r298294q586471q433524p699677p623668o834150o793086n677969
$$ 191118113 181819819 173233348 164799824 157100147 149476479 142642329 135849243 130171274
14237A30171274n757997n473089n113322m882226m577961m193817l602814m030827
$$ 130171274 124413277 118940188 113826866 108944640 104366679 100172862 96570048 92539221
14229I2539221l701135l284896l298426l437593k750121k901533k559608k703418
$$ 92539221 88838086 85553190 82254764 78817171 76067050 73165517 70605909 67902491
14221F7902491k132227k164322j995199k154600j862075j545997k620196q21079
$$ 67902491 65770264 63605942 61610743 59456143 57594068 56048071 53427875 52606796
14213E2606796j494872j774072j733985j350173j412379j153128m58231j342635
$$ 52606796 51111924 49337852 47603867 46253694 44841315 43688187 43229956 41887321
14205D1887321j456742j636891j074341o51274r68356l16867j017665j221875
$$ 41887321 40430579 38793688 37719347 37068073 36099717 35782850 34765185 33543310
14197C3543310j178449p51675m16705j044578n24647p47021p09254p78098p38861
$$ 33543310 32364861 31613186 31196481 30151903 29627256 28880235 28170981 27392883 26654022
14188B6654022n71249n74140p76865n28543j40211r51346k49621o96405l62207
$$ 26654022 26082773 25508633 24731768 24203225 24063014 23111668 22862047 22165642 21803435
14179B1803435n58249l7084j098136n0340l55311n08913l93322l96221o67070
$$ 21803435 21245186 21208102 20109966 20059626 19704315 19195402 18802080 18405859 17738789
14170A7738789L90411q31542m25839p0873l79435o0699j18577q87558J1830l70980
$$ 17738789 18129200 17297658 16871819 16800946 16421511 16360812 16242235 15354677 15366507 14995527
14160A4995527m38179J28347m65251j12708j55308n62434j03598m9319m84776
$$ 14995527 14557348 14685695 14220444 14107736 13952428 13389994 13286396 13237077 12752301
14151A2752301j91724j95134J19758m21350m14383L7424k07037p4675j31838R55
$$ 12752301 12560577 12365443 12485201 12063851 11649468 11686892 11479855 11405180 11273342 11274297
14141A1274297l72641m14166K60172k29141m69058k16002r2062l82277J09680
$$ 11274297 10901656 10487490 10747662 10518521 10049463 9833461 9741399 9359122 9468802
14132I468802k08476l458j42660l2697j36321j38355o2271k03712j19880j69624
$$ 9468802 9260326 9256868 9114208 9081511 8945190 8806835 8744564 8540852 8420972 8251348
14122H251348k31378K32921k36338J97570m48545k06783K33245n8840o39132M4054
$$ 8251348 8019970 8252891 8016553 8214123 7765578 7558795 7792040 7733200 7094068 7138122
14112G138122P9906J23845m52998J60838M0917k84643P9407j79465m67889L82768
$$ 7138122 7218028 7341873 6888875 7049713 7090630 6805987 6885394 6705929 6238040 6620808
14102F620808L9060l56427K73448m60639j53808M5184j34818l95408K57993P7313
$$ 6620808 6659868 6303441 6576889 6116250 5962442 6007626 5872808 5477400 5735393 5812706
14092E812706k31961j68143K17023k59353R0952j41487k7345j23014o693J72618
$$ 5812706 5580745 5412602 5629625 5370272 5461224 5319737 5292392 5169378 5162685 5335303
14082E335303o14395M26681j39986K0038n71082L86361r2695l3760l14352L32956
$$ 5335303 4720908 5147589 5007603 5027641 4456559 4842920 4750225 4716465 4402113 4735069
14072D735069l12783N4027m8976L647m9176k77617J26252q4182J74880O1261l88116
$$ 4735069 4422286 4476313 4427337 4430984 4381808 4104191 4230443 4146261 4321141 4382402 3994286
14061C994286R3919L0148k25282K73254K93936n38625P5696J32794K32276m81937
$$ 3994286 4088205 4118353 3893071 4166325 4460261 3921636 3997332 4130126 4362402 3880465
14051C880465J26519l53731J38043J5577l32090q5273j82505L46889k54515j80684
$$ 3880465 4006984 3653253 3791296 3806873 3474783 3389510 3207005 3553894 3299379 3118695
14041C118695M43778k50743m6011k05218Q562M73913m39423J54488n07511N89171
$$ 3118695 3562473 3311730 3265719 3060501 3069063 3542976 3103553 3258041 2750530 3339701
14031C339701j37940p1933j98014Q8945J01355q1889J7645k90355j12397L32727
$$ 3339701 3201761 3129828 2931814 3020759 3122114 3040225 3057870 2767515 2655118 2987845
14021B987845k30360l55832M63730l33900J78314J58736k59079q6382K38779j25235
$$ 2987845 2757485 2401653 2865383 2531483 2709797 2868533 2609454 2523072 2761851 2636616
14011B636616j51987K95877n28502L50097l14688M89866j88739k02649k43248
$$ 2636616 2484629 2780506 2252004 2602101 2287413 2777279 2588540 2385891 2142643
14002B142643K39178j69104k38431p8694J69653j83531L87563l02434J67269O6714
$$ 2142643 2381821 2212717 1974286 1895592 2065245 1881714 2269277 1966843 2134112 2200826
13992B200826j37686J55757K32774O93158K519710P645017J9567661J6088123
$$ 2200826 2063140 2218897 2451671 3144829 5664539 13309556 32877217 48965340
13984D8965340k1314809j3816603m987611k262112j282893j115337l89834J05991
$$ 48965340 27650531 13833928 8846317 6584205 5301312 4185975 3796141 3902132
13976C902132l77779o30691J97522o02113p135K73591m97783K51912j54631Q4648
$$ 3902132 3524353 2893662 3091184 2489071 2481936 2755527 2257744 2509656 2355025 2439673
13966B439673j36106j78871j4880j4008L9444m6466K4640R4610l61276K07239
$$ 2439673 2303567 2124696 2109816 2095808 2135252 2088786 2113426 2208036 1846760 2053999
13956B053999r5375K33698j79372j12376j87256j85744P95777l84140j12949q557
$$ 2053999 1958624 2192322 2012950 1900574 1713318 1527574 2323351 1939211 1826262 1817705
13946A817705J10275p831Q4907q8870k11021M62042k95382j44330J171J53213
$$ 1817705 1927980 1920149 2005056 1916186 1705165 2167207 1871825 1727495 1728666 1881879
13936A881879K0179k32903j19641K62557r3560n8459K28630k60264k2180N06315
$$ 1881879 1902058 1669155 1549514 1812071 1718511 1660052 1888682 1628418 1606238 2112553
13926B112553k60046k85221J40115j03970J5734j8098m8555K55223q9475m29926
$$ 2112553 1852507 1567286 1707401 1603431 1619165 1601067 1552512 1807735 1718260 1288334
13916A288334M1189M94257m39684J11546J53225q7962j59928l6162O9527l1114
$$ 1288334 1329523 1823780 1384096 1495642 1648867 1560905 1400977 1364815 1434342 1403228
13906A403228K68246k07895l45013K40027n6265M4155J3122R6382j45964k4003
$$ 1403228 1671474 1463579 1118566 1358593 1302328 1346483 1359605 1455987 1310023 1286020
13896A286020K64621o23853N91317k41214K23671k92854J44923j6771J97934k54409
$$ 1286020 1550641 926788 1518105 1276891 1500562 1207708 1352631 1335860 1533794 1279385
13886A279385o5950J34098J6635k43643R9095J00136p0163P6779q1091j39355
$$ 1279385 1213435 1347533 1364168 1120525 1219620 1319756 1249593 1326372 1245281 1105926
13876A105926L5453j17843J84278J19436p328K51683l34636K37167n28305j73517
$$ 1105926 1141379 1023536 1207814 1327250 1319922 1571605 1236969 1474136 945831 772314
13866G72314N31900k04392R8424l7069k17142J75964j45826J76432j6804j4689
$$ 772314 1304214 1099822 1198246 1161177 944035 1119999 974173 1150605 1133801 1119112
13856A119112j4090k36292K74829j27823k1495L2398L15071k0399k47165o0699
$$ 1119112 1105022 868730 1143559 1015736 994241 1026639 1341710 1321311 1074146 1013447
13846A013447L50734m70767J06813K02480q9643J31188k62188K44707l3067l06173
$$ 1013447 1364181 893414 1000227 1202707 1113064 1244252 982064 1226771 1193704 887531
13836H87531M33096l38951n2736j73134J86445L3902l5571k59054J91725P7083
$$ 887531 1320627 981676 928940 755806 942251 976153 940582 681528 873253 950336
13826I50336J84917k86452L64525j69513J21928k91116P1717O6926r0983j11064
$$ 950336 1135253 848801 1213326 1043813 1165741 874625 946342 1013268 922285 811221
13816H11221K44404j59224D00511L16641J25076j16251J69536K0973J43926j51481
$$ 811221 1055625 896401 400511 717152 842228 725977 895513 916486 1060412 908931
13806I08931k67264r8685J57850N23757k87976n3733q3737J1645k34550J69248
$$ 908931 641667 542982 700832 1224589 936613 882880 799143 810788 576238 745486
13796G45486J71885p0113k64498K27145N1966k05715Q5126J04218k02909K40618
$$ 745486 917371 847258 582760 809905 861871 656156 741282 845500 642591 883209
13786H83209k22336k03610P07560n66739R8110K1531K8436K6358l21818P8571
$$ 883209 660873 457263 1164823 598084 696194 717725 746161 772519 450701 529272
13776E29272L62574j81927K41699j40870o4675J91571D39011L50021k23138j85332
$$ 529272 891846 709919 951618 810748 746073 937644 439011 789032 565894 380562
13766C80562R0236K81098k94746K27833M41786m11857O7943j57047L30467m3095
$$ 380562 470798 751896 457150 684983 1126769 714912 782855 625808 956275 913180
13756I13180j14840J21084j49609M20049E23884M56435j91948l05155K76365k35207
$$ 913180 798340 919424 769815 1189864 523884 980319 788371 483216 759581 524374
13746E24374L68744k49699J11085L34879C67433M57804j74405N643q3800O7485
$$ 524374 893118 643419 754504 1089383 367433 825237 650832 656475 572675 640160
13736F40160o3456P9267m6110q8319J05967J05152j49784J61787m604j80277k7365
$$ 640160 576704 655971 609861 521542 627509 732661 582877 744664 740060 559783 532418
13725E32418J83879n4209n682L2298J28687l60788K73009j22209j5822R3874k26324
$$ 532418 716297 662088 656406 688704 817391 456603 729612 607403 591581 685455 459131
13714D59131A41677L93967Q6387K67722j49187k36036J4423K2239Q4081l8751
$$ 459131 141677 535644 622031 889753 740566 504530 518953 541192 625273 586522
13704E86522k44380A11220M05456M9323K6527J8856l7173l7800K5361O4558j16796
$$ 586522 342142 111220 516676 565999 592526 611382 574209 536409 561770 626328 509532
13693E09532K70266C26175M1944J38275M8478J75018j91330j51043K5770J71673
$$ 509532 779798 326175 368119 506394 554872 729890 538560 387517 413287 584960
13683E84960n2194j93492L56580l17573J36562P7190B74080M35671C23536K30451
$$ 584960 532766 339274 695854 378281 514843 592033 274080 709751 323536 553987
13673E53987j07888j28817M98053k99516l4824B32110L55535m3350J68518l28766
$$ 553987 446099 317282 815335 515819 480995 232110 587645 544295 712813 384047
13663C84047o8679O4369j49555K44224j38062K4007J23270J38546k78527L50254
$$ 384047 315368 379737 230182 474406 336344 360351 483621 622167 343640 693894
13653F93894j38721K0421j59106l3123L48737A15852K41967K10976m3101k58851
$$ 693894 555173 575594 416488 383365 732102 115852 357819 568795 525694 266843
13643B66843L3744j18598M86409J56425l44908A76526K87738A79029K21072J44348
$$ 266843 300587 181989 668398 824823 479915 176526 464264 179029 400101 544449
13633E44449k05802r0556J43518J10550J37753j66142A93698M59653k59420j93723
$$ 544449 338647 248091 391609 502159 639912 473770 193698 653351 393931 200208
13623B00208J60975J94228m3712o6690j14621j06956L92754R3252l20800k7792
$$ 200208 361183 555411 511699 445009 330388 223432 616186 709438 388638 360846
13613C60846L7492R2201R2194B63566M03879B77246K18322m3367k1104j11669
$$ 360846 398338 490539 582733 263566 667445 277246 495568 452201 431097 319428
13603C19428J62042r7443L8998j48467J14355N4648H1741L08030A6711L68667
$$ 319428 481470 384027 423025 274558 388913 443561 81741 389771 16711 385378
13593C85378o383J23269O7877k41490j62261M79930o4362O3885k83078j2133Q6111
$$ 385378 378995 502264 570141 328651 166390 646320 581958 645843 362765 350632 436743
13582D36743P7935R5521B28574K16894k1150p4661H5470N0023N2027K12144L1622
$$ 436743 514678 610199 228574 445468 424318 349657 85470 135493 187520 399664 431286
13571D31286j78536q7793J92507j02918K47667F1707O02001A61266J76335r7797
$$ 431286 252750 164957 357464 254546 502213 61707 663708 161266 337601 239804
13561B39804J8622J72179A41853o2199M01902l9042P8584m5870j02907L05607
$$ 239804 258426 430605 141853 79654 481556 442514 521098 475228 372321 677928
13551F77928A11137K31600Q1632K4762A5426L90275o5348J27738E9834K95290
$$ 677928 111137 342737 424369 449131 15426 405701 340353 468091 59834 355124
13541C55124P9598J21379k26273j32828L38194A99429I8169L53437j12498J27987
$$ 355124 434722 556101 329828 197000 535194 199429 98169 451606 339108 467095
13531D67095q6357n8270j7834J19533j62267j04804J54411b4852C70478o0226
$$ 467095 380738 322468 304634 424167 261900 157096 311507 -24852 370478 310252
13521C10252A07088L07339B00002l68J40893D2635K48098A11123Q3715I4132L31679
$$ 310252 107088 414427 200002 199634 340527 42635 290733 111123 194838 94132 425811
13510D25811G7552J23422H7110K64907K8152K30781D8295K98809m8219A10021
$$ 425811 77552 200974 87110 352017 380169 610950 48295 347104 298885 110021
13499C22644k1313n4746h3523D10680p0857K6600J20362k27193n183L1526j30071
$$ 322644 301331 246585 -83523 410680 339823 366423 486785 259592 254409 285935 155864
13488A55864K26486K71138B87046j4389m647J21081r3885q8944a7395E1077M68576
$$ 155864 382350 653488 287046 272657 268010 389091 295206 206262 -17395 51077 519653
13477E19653B44988J19680j53071N8393J68723A46684L0197m3349K00340e5183
$$ 519653 244988 364668 211597 269990 438713 146684 176881 133532 333872 -55183
13466B96687r3284R9056M55471j08127l17923J31339K1156d8958A70993j0676
$$ 296687 203403 302459 757930 649803 331880 463219 484375 -48958 170993 160317
13456A60317K86796b3303B09662j01965k6025J67578J12831j24148J24376P9610
$$ 160317 447113 -23303 209662 107697 81672 249250 362081 237933 362309 441919
13446D41919r7728b53353B01316J85282n1513C8367L88985r4699K5988D2256K15877
$$ 441919 344191 -253353 201316 386598 335085 38367 427352 332653 358641 42256 258133
13435B58133J5044K97049B27980a3453C89072I9014J8787M5797L02953A11687
$$ 258133 273177 570226 227980 -13453 389072 99014 117801 163598 466551 111687
13424B98138A08166e108r4749H738L25888j19437j3310m4888g7487A40291A4194
$$ 298138 108166 -5108 -99857 8738 334626 215189 201879 156991 -77487 140291 14194
13412C14349J0106A19283J07473i2798A8671J05281J76446d3193B63903N334n0017
$$ 314349 324455 119283 226756 -92798 18671 123952 300398 -43193 263903 269237 219220
13401B19220o4532L01399j87555n8083n7340L08710A43957o9137N4731n0300K9440
$$ 219220 154688 456087 268532 210449 153109 461819 143957 74820 129551 79251 108691
13390A08691N7885E3288M29039A84224J20270a33523H1227b1013D55095M5494
$$ 108691 166576 53288 482327 184224 304494 -133523 81227 -21013 455095 500589
13380E00589m1187L8238A95471G0549K2468L20262l8835A47917l9833k6252L19627
$$ 500589 459402 497640 195471 70549 93017 413279 374444 147917 108084 81832 401459
13369D01459q8474H0782M41771j83490J6496j37241i6258B49800m1958q3959e2665
$$ 401459 312985 80782 522553 339063 355559 218318 -96258 249800 207842 123883 -52665
13357B43616O0063C5453R1792K263K09083k6140A12987e0600B93208A05222K32093
$$ 243616 303679 35453 127245 129508 338591 312451 112987 -50600 293208 105222 337315
13346C37315n0048m2650J14899L3402R7337B36078H2594K17226a51416A7574J68167
$$ 337315 287267 244617 359516 392918 490255 236078 82594 299820 -151416 17574 185741
13335A85741K21380A16032k6365c07068B65183j26757a8814B22568a32857K7502
$$ 185741 407121 116032 89667 -307068 265183 138426 -18814 222568 -132857 -105355
13325a05355D0436O3416K26647K32554A64018E140L24650a40668B61618K06326
$$ -105355 40436 103852 330499 563053 164018 5140 329790 -140668 261618 467944
13315D67944G4683b6506A70962J12362j11916M1828K33403A18826L9784r476b9574
$$ 467944 74683 -26506 170962 283324 171408 213236 446639 118826 158610 149134 -29574
13303a34750B80162A36487K22276O3329F3661P6236O6010o627q642J51309b53735
$$ -134750 280162 136487 358763 422092 63661 139897 205907 199280 190638 341947 -253735
13291A66250J10485F8362A0576a4630A79260a66056C17612E856b25668B04902
$$ 166250 276735 68362 10576 -14630 179260 -166056 317612 5856 -225668 204902
13280A13405J98374O5814b4802D60269I5916b49814C86048f5529B07622m70j5390
$$ 113405 311779 377593 -24802 460269 95916 -249814 386048 -65529 207622 207152 191762
13269A91762L5778A5674g2027B09081f535A04697b8435j00528A3203L29927j5598
$$ 191762 227540 15674 -72027 209081 -6535 104697 -28435 -128963 13203 343130 327532
13258C27532J80668A01289D6697K77735E1392J28752J95011b31191C80583A41916
$$ 327532 508200 101289 46697 324432 51392 180144 375155 -231191 380583 141916
13247B60071o4010J3187L89242a17017A83257q3005e4054E3193K27709E8892K78561
$$ 260071 196061 209248 598490 -117017 183257 100252 -54054 53193 280902 58892 337453
13236C37453e4348E14850A66347n471a77846B20716G3985L5402M0880J10928a53950
$$ 337453 -54348 514850 166347 160876 -177846 220716 73985 109387 150267 261195 -153950
13224A67292J70277J27350A10067J29702j07123O6478J44332C289J45085J53991
$$ 167292 337569 464919 110067 239769 132646 199124 343456 3289 148374 302365
13214C02365B0030c590B91088I8594B3111K6316M1808I734M0356i4585A87394
$$ 302365 20030 -3590 291088 98594 23111 49427 91235 9734 50090 -94585 187394
13202A99899p4422a3800j72182i30A85548a98563A49409c8484O118b956A66514
$$ 199899 125477 -13800 -185982 -930 185548 -198563 149409 -38484 -32366 -2956 166514
13190A16373a95175K5005B24119r1729K154j2702k6944a74855D29920a01021O85
$$ 116373 -195175 -170170 224119 132390 134544 121842 94898 -174855 429920 -101021 -100336
13179a00336A97395J19429d8560F63920a39915r1249A37530J2504a49880A68868
$$ -100336 197395 316824 -48560 663920 -139915 -231164 137530 150034 -149880 168868
13168C74291A8900K00201H9355k8132L05236A56483L6605J3427P766o288m525
$$ 374291 18900 219101 89355 61223 366459 156483 193088 206515 214281 207993 203468
13157B03468f5806G7687b11971B11738C7566K02401a58048B80828n3267a5847
$$ 203468 -65806 77687 -211971 211738 37566 239967 -158048 280828 227561 -15847
13146D2559L62136G529i3878A54579A1594l403L67215a70692N3720A09246m0237
$$ 42559 404695 7529 -93878 154579 11594 8191 375406 -170692 -116972 109246 69009
13135F9009P2981J8009a57329C16419f7794C9621M2928L8132e6308k6752B14323
$$ 69009 141990 159999 -157329 316419 -67794 39621 82549 120681 -56308 -83060 214323
13123A64860Q1473P9938k8025j33202J96433b54913F2536J80791H7139C7676L45192
$$ 164860 246333 326271 298246 165044 361477 -254913 62536 243327 87139 37676 382868
13112C82868A46061J72863L7368P3884j51162d8135A12627a41088f3288A69838
$$ 382868 146061 318924 356292 430176 279014 -48135 112627 -141088 -63288 169838
13101a18302L0400G5043Q1349E8434P711L34271j92451D0846M1272a19787K9157
$$ -118302 -87902 75043 156392 58434 66145 400416 207965 40846 82118 -119787 -90630
13090i0630A07771N8969a3855j54837A86684C4022J46434D7285J8009f7308A63920
$$ -90630 107771 166740 -13855 -168692 186684 34022 180456 47285 65294 -67308 163920
13078A82794J19440h9163B73235b6832q9909N6150C05648N8669G0375J11005f461
$$ 182794 302234 -89163 273235 -26832 -116741 -60591 305648 364317 70375 181380 -6461
13066G4043h6447C80136q6146E6919J13912c079A79511m89J46296a40053B86297
$$ 74043 -86447 380136 293990 56919 170831 -3079 179511 179022 325318 -140053 286297
13054e426D10687j50631o4192G9000Q9327n768b65772H5202C8938N3380J07643
$$ -5426 410687 260056 195864 79000 168327 162559 -265772 85202 38938 92318 199961
13043A99961J14158b15022A43580m5081g1025B6107A2016N5086J73692I3333a51308
$$ 199961 314119 -215022 143580 98499 -71025 26107 12016 67102 240794 93333 -151308
13031c579E7541k5807K48773b8403G3038J01643p1045m6761L48385A37579N5982
$$ -3579 57541 31734 280507 -28403 73038 174681 103636 56875 405260 137579 193561
13020A93561J12177q1867e0080B87065J17857j08159p3999J43839j5929M2448
$$ 193561 305738 223871 -50080 287065 404922 296763 222764 366603 350674 393122
13010C93122A54375m4517J15210r0090l89K88190E5738J521L5107b2755A90726
$$ 393122 154375 109858 225068 134978 134589 422779 55738 57259 92366 -22755 190726
12998c55544G7170B770N5942K40685j25937K74654B4470a9788A671P5383a45394
$$ -355544 77170 2770 58712 299397 173460 448114 24470 -19788 1671 77054 -145394
12986B7879R5433b96340G7183k8588K48900j24626J7762J54043j13759M2994d2549
$$ 27879 123312 -296340 77183 48595 297495 172869 190631 344674 230915 273909 -42549
12974d39757g0585G9539a27730A66550E8670Q4643K2960P8778A20066b21346f7027
$$ -439757 -70585 79539 -127730 166550 58670 143313 166273 245051 120066 -221346 -67027
12962b17009J5191G256f947j80679A11934J9460m8303L6888N6188b02950I9722
$$ -217009 -201818 7256 -6947 -187626 111934 131394 83091 119979 176167 -202950 99722
12950E3667K98174j67968n7300d3721l0470A50854N7592I0334a62399k0734C6728
$$ 53667 351841 183873 126573 -43721 -74191 150854 208446 90334 -162399 -183133 36728
12938b56993B18023f3352j51427e5421B32543J19809G3900c1047F4868a13618
$$ -256993 218023 -63352 -214779 -55421 232543 352352 73900 -31047 64868 -113618
12927B22164e093A96649l1189G2889j7242b15136f046A464b81082J12717j63961
$$ 222164 -5093 196649 165460 72889 55647 -215136 -6046 1464 -281082 -168365 -332326
12916c32326C13298p0210e7235C01913a42133C60101j57035a00787J8362B58378
$$ -332326 313298 243088 -57235 301913 -142133 360101 203066 -100787 -82425 258378
12905i7069B47835g6278C64357j45575B6018O3191Q0534H2251Q362i0916C03546
$$ -97069 247835 -76278 364357 218782 26018 89209 169743 82251 90613 -90916 303546
12893H5847b45797F6298p358b886m5499j66562A03527D313i0667A81409i0519
$$ 85847 -245797 66298 58940 -2886 -48385 -214947 103527 4313 -90667 181409 -90519
12881B23836g4720G7174M2431K79697F3471A9973a92611L6642A0590F81d23327
$$ 223836 -74720 77174 119605 399302 63471 19973 -192611 -155969 10590 681 -423327
12869a79541b7054B41883K9313j4278D2181K4035b64374k7633A30248k4479g3201
$$ -179541 -27054 241883 271196 256918 42181 66216 -264374 -292007 130248 105769 -73201
12857C1569g7706D4224a28774B73533q5841A6564R2779b361I1372j0194K8854
$$ 31569 -77706 44224 -128774 273533 187692 16564 109343 -2361 91372 81178 110032
12846A10032d8863A55079a7121C19771B8912J80210h4348A69860O1320F9209B667
$$ 110032 -48863 155079 -17121 319771 28912 209122 -84348 169860 231180 69209 2667
12834B51511j5296H6317a76548A56551b02007a1296m4327G5248c34910B0523J33007
$$ 251511 236215 86317 -176548 156551 -202007 -11296 -55623 75248 -334910 20523 153530
12823A53530a25232r6252F1992N2667m3157a34688I6563b03652n1125a12390B08117
$$ 153530 -125232 -221484 61992 114659 71502 -134688 96563 -203652 -254777 -112390 208117
12811I3527a07575C3020J75346I9319J05940a6324j46156D0105M11335A39507
$$ 93527 -107575 33020 208366 99319 205259 -16324 -162480 40105 451440 139507
12800A6444d1929m8093A81935c10145K9226C21566D1652f7373B14052c6306j14652
$$ 16444 -41929 -90022 181935 -310145 -280919 321566 41652 -67373 214052 -36306 -150958
12789a50958B3429R8133a00128F605J92233C6008P0402d41181b09624A25865A1432
$$ -150958 23429 121562 -100128 6605 198838 36008 106410 -441181 -209624 125865 11432
12777C2193K621e2157k65001a1667j68229a8208o6976o0447d8572j01466B23640
$$ 32193 34814 -52157 -317158 -11667 -179896 -18208 -85184 -145631 -48572 -150038 223640
12765a82444g5292J5965B67930P4801a10733B37108h9640A60914C9038O9965a95213
$$ -182444 -75292 -59327 267930 342731 -110733 237108 -89640 160914 39038 109003 -195213
12753A37005O3361F3173e033k2883r112I4386l0541f7089c0333F8498i2935p206
$$ 137005 200366 63173 -5033 -27916 -37028 94386 63845 -67089 -30333 68498 -92935 -100141
12741a00141j84155A04242a5650r2477A29280L8689o328g8014D78963I376L02775
$$ -100141 -284296 104242 -15650 -108127 129280 167969 161641 -78014 478963 9376 312151
12730C12151q3965L5390M6594q1995G9404j5513N4224J57781c68912a291A65718
$$ 312151 228186 263576 310170 228175 79404 63891 118115 275896 -368912 -1291 165718
12718a39501n1197C71347o2275c5934A49148i4866j800C76715j69444J12645j36211
$$ -139501 -190698 371347 309072 -35934 149148 -94866 -96666 376715 207271 319916 183705
12707A83705R040C3224M24730a60577F81190A22114K75480G0229c02064h1805
$$ 183705 192745 33224 457954 -160577 681190 122114 397594 70229 -302064 -81805
12696B58062d3888A93696I3136b00532A14863a3489D9265B3738b36570e4487D71743
$$ 258062 -43888 193696 93136 -200532 114863 -13489 49265 23738 -236570 -54487 471743
12684B32317k1270K9259q1187K7823J32835B0194M97678A42108k8926J85812r8649
$$ 232317 211047 240306 159119 186942 319777 20194 517872 142108 113182 298994 200345
12673B00345J43509A70071J7144D2284i1160l4635A52223B3299i1773H9266K0775
$$ 200345 343854 170071 187215 42284 -91160 -125795 152223 23299 -91773 89266 110041
12662A10041b11907c9596A62881L2132c27163A00880K36674j7779j52572d11463
$$ 110041 -211907 -39596 162881 195013 -327163 100880 337554 319775 167203 -411463
12651b62762A1711J48416c05650B22636i3436A30089H260a11668A28765a13299
$$ -262762 11711 160127 -305650 222636 -93436 130089 8260 -111668 128765 -113299
12640f0560I248J99072a37804L923C86663j23119A09320k8084A6169J26610K7507
$$ -60560 9248 208320 -137804 -133881 386663 263544 109320 81236 16169 142779 170286
12629A70286K6141K60618k01579I0505J81338a13396B02365q0103J91906J37707
$$ 170286 196427 457045 255466 90505 271843 -113396 202365 122262 314168 451875
12619D51875A54547a19473B70238f6673J3046A83022H4918k0830J86004a12533
$$ 451875 154547 -119473 270238 -66673 -53627 183022 84918 64088 250092 -112533
12608F2058Q0663P0658b9096H6764a22504B50026L19706C8268O3197J4223l9434
$$ 62058 142721 213379 -29096 86764 -122504 250026 569732 38268 101465 115688 76254
12597G6254B0609g7290j09315P4219d2850B75707a5827A12711P6623J42584j64591
$$ 76254 20609 -77290 -186605 -112386 -42850 275707 -15827 112711 189334 331918 167327
12586A67327a41945B14643E7814M1706j4111c13524A4334J43367a90093B9730
$$ 167327 -141945 214643 57814 99520 85409 -313524 14334 157701 -190093 29730
12575B08095F7412h7151A4969K9735N7715J31703b4047A71710c20234a36593d1284
$$ 208095 67412 -87151 14969 44704 102419 234122 -24047 171710 -320234 -136593 -41284
12563A77495n7860a85100A15205a54888N8742G3724A8664J83943J38526A15667
$$ 177495 119635 -185100 115205 -154888 -96146 73724 18664 202607 341133 115667
12552a00049B5603p991a11366p7176e6967B49709b58433K3662F303R8826J00632
$$ -100049 25603 17612 -111366 -188542 -56967 249709 -258433 -234771 6303 105129 205761
12541B05761j0260c01912H6455a63608I6786K46200c7123A24730a72555A90434
$$ 205761 195501 -301912 86455 -163608 96786 342986 -37123 124730 -172555 190434
12530b900C51113A48465L030b9668p6969B7965L31320H6160a05695B32771p9156
$$ -2900 351113 148465 151495 -29668 -106637 27965 359285 86160 -105695 232771 153615
12519A53615f1903A08762a09061A30350f2981l7386A52965a84377C30167j41684
$$ 153615 -61903 108762 -109061 130350 -62981 -100367 152965 -184377 330167 188483
12509A88483E015a68132A3735K9278J21437J386L5526L9072k7635p1445A9421
$$ 188483 5015 -168132 13735 43013 164450 165836 201362 240434 212799 141354 19421
12497D73090i51r3585b2636D43104a73905f6032j1478C42304j62587J65047j51073
$$ 473090 -951 -94536 -22636 443104 -173905 -66032 -77510 342304 179717 344764 193691
12486A93691g6839A27044a9253L950A19021D8751K39001A26939C8365g8612F796
$$ 193691 -76839 127044 -19253 -15303 119021 48751 287752 126939 38365 -78612 6796
12474a61014F812J68965H5748k2117a71516I2873a56693A56750A8537R7674a22854
$$ -161014 6812 175777 85748 63631 -171516 92873 -156693 156750 18537 116211 -122854
12462d7876B56520H6287f5439j70078A59958f5893b2160P856A87172k7679b05878
$$ -47876 256520 86287 -65439 -235517 159958 -65893 -22160 -14304 187172 159493 -205878
12450A3733J77972A0087g5008k32431g6855c7033j95363J6874A5226h3890A26692
$$ 13733 191705 10087 -75008 -307439 -76855 -37033 -232396 -215522 15226 -83890 126692
12438A53279a93394c8227j159k55445C0318M9591R0084K1429p8463l7391J2951
$$ 153279 -193394 -38227 -39386 -294831 30318 79909 169993 191422 112959 75568 88519
12427H8519K082b26109j01225E256K1400O8399J0844K91294C9739K71529A26680
$$ 88519 90601 -226109 -327334 5256 26656 95055 105899 397193 39739 311268 126680
12415B60818a21259I3776K11131b71186a29346C7775b36512B4130a0835A47974
$$ 260818 -121259 93776 304907 -271186 -129346 37775 -236512 24130 -10835 147974
12404d9413A73694d14403A46219J12641g3172k1798C0597a35950L6939B72812
$$ -49413 173694 -414403 146219 258860 -73172 -94970 30597 -135950 -99011 272812
12393f0078p7733A3985Q6236R4620c6626A00287J24474B369c52939E4197a74708
$$ -60078 -137811 13985 100221 194841 -36626 100287 224761 2369 -352939 54197 -174708
12381b09392r1333A87716a24899B2247J79680B0486a96497A49438a68058O5121
$$ -209392 -300725 187716 -124899 22247 201927 20486 -196497 149438 -168058 -102937
12371a02937A45057B1225K16498a8195H7183d2217A16194D8469A1339J82608r408
$$ -102937 145057 21225 237723 -18195 87183 -42217 116194 48469 11339 193947 184539
12360A84539d1664k88358b9634A70374J18834D3617a1676j33723K5731C02374
$$ 184539 -41664 -330022 -29634 170374 289208 43617 -11676 -145399 -119668 302374
12349I8175a79519k31488c1846B4449a63850k6460D63462i3774k71731H8503J84631
$$ 98175 -179519 -411007 -31846 24449 -163850 -190310 463462 -93774 -365505 88503 273134
12338B73134D9533a24003q4839d6192B9469N8408p578O7919b22783e6883H1648
$$ 273134 49533 -124003 -208842 -46192 29469 87877 80299 148218 -222783 -56883 81648
12326a6110C22300G4268b89438g5492c5270l20649A13679J29028a4547C45920
$$ -16110 322300 74268 -289438 -75492 -35270 -355919 113679 242707 -14547 345920
12315A6011N2578a26271a8989o4478A40284d1463I3266a0447H999J48330J10193
$$ 16011 68589 -126271 -18989 -83467 140284 -41463 93266 -10447 8999 157329 267522
12304B67522o7297f7598k7867k3601B07081F4280k9419L40442j09545a89014A2324
$$ 267522 200225 -67598 -95465 -119066 207081 64280 34861 375303 265758 -189014 12324
12292g9846A30439e5895I5665d7599B35848J50111C2281J02989J87h2948H1350
$$ -79846 130439 -55895 95665 -47599 235848 385959 32281 135270 135457 -82948 81350
12280B03130n7472m4730R9563M9364o2585K73218k06884J25082A63667a61539
$$ 203130 145658 100928 200491 249855 187270 460488 253604 378686 163667 -161539
12269B69678a41885E8451J08816E9862J11812H3807J14780L23494A14158K28336
$$ 269678 -141885 58451 167267 59862 171674 83807 198587 522081 114158 342494
12259C42494a05432h446n5131A91148D6536A291L5024N1910K25152g783D62907
$$ 342494 -105432 -8446 -63577 191148 46536 1291 36315 88225 313377 -7783 462907
12247E96837G8528c66894a76301g5621F4836j4350a58490J3757O9666H3593M1608
$$ 596837 78528 -366894 -176301 -75621 64836 50486 -158490 -144733 -75067 83593 125201
12236A25201M02336A56616K8318P6144b66545P3956A58104J03438J41932j60138
$$ 125201 527537 156616 184934 261078 -266545 -192589 158104 261542 403474 243336
12226B43336J08245L088I375L63484j14165B9436J54556l96p4010d1975B17143
$$ 243336 351581 354669 9375 372859 258694 29436 183992 183596 109586 -41975 217143
12214A59894M28882B01091K38887a80277c6545r7310C69305J25941A94773K3893
$$ 159894 588776 201091 439978 -180277 -36545 -133855 369305 495246 194773 218666
12204B18666h1443B40041f0596F937M07170A16887L98468I073L75829j51255l8984
$$ 218666 -81443 240041 -60596 6937 414107 116887 515355 9073 384902 233647 194663
12193A94663m012J83053b30304g1434C70921M455A11641N0792b62643A59439J82545
$$ 194663 190651 373704 -230304 -71434 370921 375376 111641 162433 -262643 159439 341984
12182C41984h8172j5562D21022C8238K8931k8823J72879p0135J33961A25899J59704
$$ 341984 -88172 -103734 421022 38238 67169 38346 211225 141090 275051 125899 285603
12171B85603j11438b55281F8585E960J10150J24973q3636K25437j74258B4336
$$ 285603 174165 -255281 68585 5960 116110 241083 157447 382884 208626 24336
12160B21022K42442a48795G8177a24701A18192J43748j01984G0482N8201n6513
$$ 221022 463464 -148795 78177 -124701 118192 261940 159956 70482 128683 72170
12150G2170b5011D2125a85099A77098B7553c6633G7098O3946J77359h3434l4177
$$ 72170 -25011 42125 -185099 177098 27553 -36633 77098 141044 318403 -83434 -117611
12139a17611C3132K30140A11302j6818L3024a07439d184A81006L0268b62188D3920
$$ -117611 33132 263272 111302 94484 127508 -107439 -4184 181006 211274 -262188 43920
12127a21447C1199c9910H4134h5860A3475g23E2950B2907J08991K39101a60645
$$ -121447 31199 -39910 84134 -85860 13475 -723 52950 22907 131898 370999 -160645
12115a3378j99911R5845A52769g4818b1488B38946H0780a73577a4044l4656j7571
$$ -13378 -213289 -117444 152769 -74818 -21488 238946 80780 -173577 -14044 -48700 -66271
12104f6271k1369k85894g9800L5964A45323b132k90857K1803F5016B5587b69917
$$ -66271 -87640 -373534 -79800 -43836 145323 -2132 -292989 -271186 65016 25587 -269917
12092a05320G0279J37467r0439c18421d2278E1929b022I6316m738a58823O8972
$$ -105320 70279 207746 117307 -318421 -42278 51929 -2022 96316 91578 -158823 -89851
12081h9851C67285c6543q9911B019K71452J082021O52354o50566C90675h1314
$$ -89851 367285 -36543 -126454 2019 273471 1355492 2007846 1357280 390675 -81314
12070A80859k7723F5588C0635a26002A33510C7553L0064B4867e1702j00457d3270
$$ 180859 153136 65588 30635 -126002 133510 37553 67617 24867 -51702 -152159 -43270
12058h721B6034K13389a76254B82707o3754p0636B6351d8245a7162H1416L6136
$$ -8721 26034 239423 -176254 282707 218953 148317 26351 -48245 -17162 81416 117552
12047A17552a97985A09533a06872j64141G4500a32744B67681B7072J61480B2824
$$ 117552 -197985 109533 -106872 -271013 74500 -132744 267681 27072 188552 22824
12036h3743L4897G4000K062L7201n1535a00207B460a24772e4133r6382J9119j87152
$$ -83743 -48846 74000 76062 113263 61728 -100207 2460 -124772 -54133 -150515 -131396 -318548
12024c18548c2841E8013B1634K95620j24331K0730h2702q016d2561E7355a98336
$$ -318548 -32841 58013 21634 317254 192923 213653 -82702 -90718 -42561 57355 -198336
12012c1057B97330b60129A02511a94693B71614a55922H5831m1702a5019f184B69840
$$ -31057 297330 -260129 102511 -194693 271614 -155922 85831 44129 -15019 -6184 269840
12000g0845L674B59562a94741f3916j06146B5053Q8199c8702l24969F1948J19659
$$ -70845 -67171 259562 -194741 -63916 -170062 25053 113252 -38702 -363671 61948 181607
11989A81607E5307O5373a05529j53176b0297A20023a34462q4589c7457j7643G4810
$$ 181607 55307 120680 -105529 -258705 -20297 120023 -134462 -219051 -37457 -55100 74810
11977A58433g6735c2283F64209B38919r2809c76391h2297J4369o3998k5497A18273
$$ 158433 -76735 -32283 664209 238919 146110 -376391 -82297 -67928 -131926 -157423 118273
11965d1716C64649b4434G3685h2921k14934N7004p2589B52437O127J10890d02862
$$ -41716 364649 -24434 73685 -82921 -297855 -240851 -313440 252437 258564 369454 -402862
11953B8137a04916H7824c3811B7677j3679e3611j64712Q4636D5081M68424a9220
$$ 28137 -104916 87824 -33811 27677 13998 -53611 -218323 -133687 45081 513505 -19220
11941A15909D9070J64123G9734a73836P5804A24166g6452j35066g8830L0971A07828
$$ 115909 49070 213193 79734 -173836 -98032 124166 -76452 -211518 -78830 -47859 107828
11929a33159K4141B06370J5084g3985n29841A26525f2759l8814D41076A84697
$$ -133159 -109018 206370 221454 -73985 -603826 126525 -62759 -101573 441076 184697
11918B91996B6864a27653M0557k59385D1510b45865O3752c3490A17996J18512
$$ 291996 26864 -127653 -87096 -346481 41510 -245865 -182113 -33490 117996 236508
11908B36508d28289g8970F4274a09036A03245k3277l364g1287L5632L839A63887
$$ 236508 -428289 -78970 64274 -109036 103245 79968 76604 -71287 -35655 -31816 163887
11896a5272q9340B93581j39948d09085a17447O067G640b8250k23938J10590n882
$$ -15272 -104612 293581 153633 -409085 -117447 -111380 7640 -28250 -252188 -141598 -147480
11885a47480N0387K126a6918j31680k47554a89044A31865A0566b04919A91757
$$ -147480 -97093 -94967 -16918 -148598 -396152 -189044 131865 10566 -204919 191757
11874a79704G8752a05320D2141a9391k04438n5377A03452K19704c39160i0774
$$ -179704 78752 -105320 42141 -19391 -223829 -279206 103452 323156 -339160 -90774
11863i4654L4687J8482G3558h1944F9326Q2863f1645D5508B2029J71355e9029
$$ -94654 -59967 -41485 73558 -81944 69326 152189 -61645 45508 22029 193384 -59029
11851a79801E7279J04094j3057J03475c40028e494C25000h0191j01979j36546
$$ -179801 57279 161373 148316 251791 -340028 -5494 325000 -80191 -182170 -318716
11841c18716F0823f2118K6789k10062j03870H5606K75603e81966A32022i4648
$$ -318716 60823 -62118 -35329 -245391 -349261 85606 361209 -581966 132022 -94648
11830b02545B965K43405E680A369a18940d7478j05060j17289d8581j39271I3290
$$ -202545 2965 246370 5680 1369 -118940 -47478 -152538 -269827 -48581 -187852 93290
11818c68108J68752B9507c68797a4229f009j57732j25196l0676C07940a98247
$$ -368108 -199356 29507 -368797 -14229 -6009 -163741 -288937 -319613 307940 -198247
11807a91394K4848A8422a68171i815A40740n713c8701K373B13684l4733B5090
$$ -191394 -166546 18422 -168171 -9815 140740 135027 -38701 -36328 213684 178951 25090
11795a53094K4539G7043M6862a38817E495J12307i5319B769O6493k6391c5978
$$ -153094 -128555 77043 123905 -138817 5495 117802 -95319 2769 69262 42871 -35978
11783a17130A11746L22501P2951I0679a33585e91j05j3966D72690I389e2443j16
$$ -117130 111746 434247 507198 90679 -133585 -591 -696 -14662 472690 9389 -52443 -52559
11771e2559j57779I7622N047K44O954g4288A0394a74192k4801B5895f9149l469
$$ -52559 -210338 97622 102669 102913 109867 -74288 10394 -174192 -198993 25895 -69149 -72618
11759g2618D08860A9257c38318A5262K75746D9125K9074L8981O7084a87344O0040
$$ -72618 408860 19257 -338318 15262 291008 49125 78199 117180 184264 -187344 -127304
11748a27304m9683B35097Q6445G2922K65321K1849b52909B4618b17184C29363
$$ -127304 -176987 235097 321542 72922 338243 360092 -252909 24618 -217184 329363
11737B6632i93D45242E1380l890K19956c0088j24637j63468b2351E998i9078A8934
$$ 26632 -993 445242 51380 47490 267446 -30088 -154725 -318193 -22351 5998 -99078 18934
11724d00334A53777n7944h9413A37531F5919R6226B7735J88105E267K56254B3547
$$ -400334 153777 95833 -89413 137531 65919 162145 27735 215840 5267 261521 23547
11712g2829D9612L59126j64237r1372J50981a44657A88087g8086L6742A53357
$$ -72829 49612 408738 244501 153129 304110 -144657 188087 -78086 -41344 153357
11701B45022A22463J53284d554A5615J9712r285j790A1248J41603k9359L1548
$$ 245022 122463 275747 -4554 15615 35327 26042 24252 11248 152851 123492 155040
11690A55040D934K25616o7563d1008C19791j38665b81566f7134a2342j9987A09918
$$ 155040 4934 230550 162987 -41008 319791 181126 -281566 -67134 -12342 -32329 109918
11678A37732n1259L2470Q8307g1365B76787C2989B757P8892k2979g5337B6550
$$ 137732 86473 118943 207250 -71365 276787 32989 2757 81649 58670 -75337 26550
11666B05586a37274b0225p0956I3457b10883H4129R260J68601h4578E01491H5458
$$ 205586 -137274 -20225 -91181 93457 -210883 84129 93389 261990 -84578 501491 85458
11654A89531H7416A7938M5475k2189K3443A3934Q5938i2319A6099J54112a74853
$$ 189531 87416 17938 63413 41224 64667 13934 99872 -92319 16099 170211 -174853
11642a01600d6542p7097A21433c50069F3751h291k60530f8984B16008a88034A50855
$$ -101600 -46542 -123639 121433 -350069 63751 -8291 -268821 -68984 216008 -188034 150855
11630d2885A47474b45098h3485d720F9657b9394C4823h5361A82257j9258f2778
$$ -42885 147474 -245098 -83485 -4720 69657 -29394 34823 -85361 182257 162999 -62778
11618D0240J02635e5648k67563A07098a87658A23018D0429a35207B35364c457
$$ 40240 142875 -55648 -323211 107098 -187658 123018 40429 -135207 235364 -3457
11607I1853d7668B51659e0719j18148O2907K5695A44224J15216a80587H4189J15677
$$ 91853 -47668 251659 -50719 -168867 -105960 -80265 144224 259440 -180587 84189 199866
11596A99866j6809k1478K08004b76096B93105a66156e4765C6438M48765H9135
$$ 199866 183057 161579 369583 -276096 293105 -166156 -54765 36438 485203 89135
11585h5281E16011G1985K41849B7182g2422B47867j11394L6349O504b3519B59234
$$ -85281 516011 71985 313834 27182 -72422 247867 136473 172822 179326 -23519 259234
11573B6900g0728G4890a0382G9355l8997r07a64874Q1917B85896c8536A85194
$$ 26900 -70728 74890 -10382 79355 40358 39451 -164874 -82957 285896 -38536 185194
11561B28035b58257A11325c13372A57272K02727b6771A32103e66393b7387A2467
$$ 228035 -258257 111325 -313372 157272 359999 -26771 132103 -566393 -27387 12467
11550D7836d1461B30280E5752K96030j09591J80141a55372C03223j17432b05196
$$ 47836 -41461 230280 55752 351782 242191 422332 -155372 303223 185791 -205196
11539D19670a7161o0888A84344H7437J1340J81479M37128A33321J07143N3674
$$ 419670 -17161 -78049 184344 87437 98777 280256 717384 133321 240464 294138
11529B94138F5142K96941j60915l3311L33720A12930N62562a46568a3393A85595
$$ 294138 65142 362083 201168 167857 501577 112930 675492 -146568 -13393 185595
11518A38493a00233B38690g45G6028M0457M7166a5081B07605a78310B73582a66185
$$ 138493 -100233 238690 -745 76028 116485 163651 -15081 207605 -178310 273582 -166185
11506D26005C199b23534D58382g1821B9885J48267J28916n6308a82350A45420
$$ 426005 3199 -223534 458382 -71821 29885 178152 307068 250760 -182350 145420
11495E0462K30134A18782L13737a48238G6256K06132j40549b08790B3930J75889
$$ 50462 280596 118782 432519 -148238 76256 282388 141839 -208790 23930 199819
11485A99819B6435K30251A12265j2153O7469K3989m0683a98269c2004B05532l6066
$$ 199819 26435 256686 112265 100112 167581 191570 150887 -198269 -32004 205532 169466
11474A69466f1393B81617j02298P5164Q3840J69192B04649Q3836c4387D36164
$$ 169466 -61393 281617 179319 254483 338323 507515 204649 288485 -34387 436164
11463c4463H7927a67956D21373a32047A45636K28298M7963a10684B76129I2535
$$ -34463 87927 -167956 421373 -132047 145636 373934 421897 -110684 276129 92535
11452a52855D34499c51092a23761B67368a0918A47690J13458j22000J06837G5262
$$ -152855 434499 -351092 -123761 267368 -10918 147690 261148 139148 245985 75262
11441B27246i082l5715D24458D0911J12584f9211A97680q514b27555R1965R911
$$ 227246 -9082 -44797 424458 40911 153495 -69211 197680 189166 -227555 -135590 -125679
11430a25679H4875J04835q8390J41116E6643a7305k72882A23107c14747G6678
$$ -125679 84875 189710 101320 242436 56643 -17305 -290187 123107 -314747 76678
11419a01139c5698R890l389A12152L9021K08530b61756E9157J1027d5526m915
$$ -101139 -35698 -25808 -29197 112152 151173 359703 -261756 59157 70184 -45526 -50441
11408e0441A79644J4817P9317G8907c1555B01008f7357B92833b23346A5866a97346
$$ -50441 179644 194461 273778 78907 -31555 201008 -67357 292833 -223346 15866 -197346
11396A47600D316J28002c07412A19727a15154C2334J54269J32207j0686I5069
$$ 147600 4316 132318 -307412 119727 -115154 32334 186603 318810 308124 95069
11385b33160H2395Q0562f7C4850b16517Q3891p3097c7157C87686I798a99358O8532
$$ -233160 82395 162957 -67 34850 -216517 -132626 -205723 -37157 387686 9798 -199358 -130826
11373a30826i134A09941K092c28030H7877l9399J32162a06338a4796M06r1835
$$ -130826 -9134 109941 112033 -328030 87877 48478 180640 -106338 -14796 -14390 -106225
11362a06225G0753b24134B42288c85640D19331m5927c226k34041I0390J36766
$$ -106225 70753 -224134 242288 -385640 419331 373404 -3226 -237267 90390 227156
11352B27156b2317p7594H4320L0318c9712A99862R4624b9036B72064A7307b21094
$$ 227156 -22317 -99911 84320 114638 -39712 199862 294486 -29036 272064 17307 -221094
11340B17744a36246f2230F3141L16444A17357a02492d4465j75842j06844A25749
$$ 217744 -136246 -62230 63141 379585 117357 -102492 -44465 -220307 -327151 125749
11329B14194C3107L3322b80641C7446g6484C4407a44032I7747J24748o5634a77206
$$ 214194 33107 66429 -280641 37446 -76484 34407 -144032 97747 222495 156861 -177206
11317E0860b31490b16A89033b29978K1888K1276D2169K12145F6440B0654d47867
$$ 50860 -231490 -216 189033 -229978 -208090 -186814 42169 254314 66440 20654 -447867
11305a71893e9936I5084a13983l7440H8857a41960A29822h0882D8487B086f38632
$$ -171893 -59936 95084 -113983 -151423 88857 -141960 129822 -80882 48487 2086 -638632
11293C3921c9737p2279j45136L0033h1877G3036a97863Q1446D4209b08474H6110
$$ 33921 -39737 -112016 -257152 -227119 -81877 73036 -197863 -116417 44209 -208474 86110
11281e0981r485H0060b5976l1359q7560B15365a19421j3885p3321B35508q6942
$$ -50981 -60466 80060 -25976 -57335 -144895 215365 -119421 -133306 -206627 235508 148566
11270A48566c1990j46579N8870b3467r0728K1513k77404J03333A39721L82698
$$ 148566 -31990 -178569 -119699 -23467 -114195 -92682 -370086 -266753 139721 522419
11260E22419c4056l75076e1168C59232a9329q147l9448j9280L3501j78805L3789
$$ 522419 -34056 -409132 -51168 359232 -19329 -27476 -66924 -86204 -52703 -231508 -197719
11249a97719B93825A06812J63016e0083m9617I0904a16022m7278P6926B71643
$$ -197719 293825 106812 269828 -50083 -99700 90904 -116022 -163300 -86374 271643
11238i4726B32683B1796b52602P2481A13154a84555J8306A1374a53337j09803
$$ -94726 232683 21796 -252602 -180121 113154 -184555 -166249 11374 -153337 -263140
11228b63140A73571K1812D2989L6971b12926Q5935J1056C11995a04475F7855b08831
$$ -263140 173571 195383 42989 79960 -212926 -126991 -115935 311995 -104475 67855 -208831
11216b52182E2479h6796c8081A92980c70332a62356K4240m2565i590l8446a2562
$$ -252182 52479 -86796 -38081 192980 -370332 -162356 -138116 -180681 -9590 -48036 -12562
11204h9400m1010k3859j8994C5280a1260F4213c5605A02414d26230C96133e06485
$$ -89400 -130410 -154269 -173263 35280 -11260 64213 -35605 102414 -426230 396133 -506485
11192a00284j56789f5168o9216R788F843a97251N127A43434N7558O1673H1828
$$ -100284 -257073 -65168 -134384 -124596 6843 -197251 -192124 143434 200992 262665 81828
11180A10265k0504d5280A65928o8499M9820a08223j9110a5961o5664A02196a77405
$$ 110265 89761 -45280 165928 97429 147249 -108223 -127333 -15961 -81625 102196 -177405
11168A70331D9210b11528a1001j10034r2017l4858b046A97780n5146e1734a4319
$$ 170331 49210 -211528 -11001 -121035 -213052 -247910 -2046 197780 142634 -51734 -14319
11156i0208L5016b13k63153f3964C28102b7536o0367B74673E3398p514a34391
$$ -90208 -55192 -213 -263366 -63964 328102 -27536 -87903 274673 53398 45884 -134391
11144h83m9575A17938c5593k31965a26665L8709A63180A9325K6315g7460A54853
$$ -883 -50458 117938 -35593 -267558 -126665 -87956 163180 19325 45640 -77460 154853
11132i0782D3860a65074G2575b22422C49151q8128j14944K6901A4011O5471l1407
$$ -90782 43860 -165074 72575 -222422 349151 261023 146079 172980 14011 79482 48075
11121D8075K46255q5421b06420B92967j31379e7018C4555b5216q9305C82867A77853
$$ 48075 294330 208909 -206420 292967 161588 -57018 34555 -25216 -114521 382867 177853
11109b6323k40708D8614J77456P9833C2343b2496A00276J73622M0771q4145k5290
$$ -26323 -267031 48614 226070 305903 32343 -22496 100276 273898 314669 230524 205234
11098B05234F6660K68551A42884E1997J47125p1046C1584m619N2503P9104K05103
$$ 205234 66660 335211 142884 51997 199122 128076 31584 26965 79468 158572 363675
11087C63675h1774C73571A7139K93990N0321G9850J05740K1728q6843J3342L97024
$$ 363675 -81774 373571 17139 311129 361450 79850 185590 207318 120475 133817 530841
11076E30841j54444A55506E608P35009B17210o8507K62579J35545B31652o8042
$$ 530841 376397 155506 5608 740617 217210 148703 411282 546827 231652 163610
11066A63610L35426f985B97617L7841r5758K00207J18197O224j56867j15914L34511
$$ 163610 499036 -6985 297617 335458 239700 439907 558104 564328 407461 291547 626058
11055F26058k73195L91753k82701K39890K61779j18240j47108r1230q0732J75481
$$ 626058 352863 744616 461915 701805 963584 845344 698236 607006 526274 701755
11045G01755J43410o4679J45579j95787P0374j53613N1727k75970K48199J1371
$$ 701755 845165 780486 926065 730278 800652 647039 698766 422796 670995 682366
11035F82366O9637J01445j74436R4975m3185J68904l28960J07145K40416j43024
$$ 682366 752003 853448 679012 773987 730802 899706 570746 677891 918307 775283
11025G75283n7198J37270q2327r287O8689l73498J87760K19937D24059L19906
$$ 775283 718085 855355 773028 763741 832430 458932 646692 866629 424059 743965
11015G43965B69639L38512K27781j58002j05326o6400j64632j49910O95892j80453
$$ 743965 269639 608151 835932 677930 572604 506204 341572 191662 887554 707101
11005G07101K05653C02996L94086L29428C85691J93424J14180O7859o4436r7694
$$ 707101 912754 302996 697082 1026510 385691 579115 693295 761154 696718 599024
10995E99024J97131M1047j20080J90223P6617m57885j699K84780J7149K2658L72307
$$ 599024 796155 837202 717122 907345 983962 526077 524378 809158 826307 848965 1221272
10984A221272j30145r9405K59402J61207m33775M61545K09770R9532k44173M94954
$$ 1221272 1091127 991722 1251124 1412331 978556 1440101 1649871 1749403 1505230 2000184
10974B000184K1407L69123q2181N92885j79857l70772N6670n0755m2198J40961
$$ 2000184 2021591 2390714 2308533 2901418 2721561 2350789 2407459 2356704 2314506 2455467
10964B455467n67548J29418L05784k8214k20329J04815j06038K33164j10J764
$$ 2455467 1887919 2017337 2323121 2294907 2074578 2179393 2073355 2306519 2306409 2308173
10954B308173o9901j88894l39775k38136l37122Q1014p3709E68327m247j05801
$$ 2308173 2238272 2049378 1709603 1471467 1134345 1215359 1141650 568327 564080 458279
10944D58279J29572Q9936B28345L27260j97866A76208J39572n8358A6356b96790
$$ 458279 587851 677787 228345 555605 357739 176208 315780 257422 16356 -296790
10933A03972K5235J59886a54042j3205A04022C8724K1711J14626J23326i7991
$$ 103972 129207 289093 -154042 -167247 104022 38724 60435 175061 298387 -97991
10922D4484O5444b06946F3517D914J20704K15625Q8547j61401H0621a78312a1708
$$ 44484 109928 -206946 63517 4914 125618 341243 429790 268389 80621 -178312 -11708
10910b20756K9402A27038d7141A25242O2594e1219D8337L03939F1181f416j31558
$$ -220756 -191354 127038 -47141 125242 187836 -51219 48337 352276 61181 -6416 -137974
10899a37974C5669J14004m641b99742o10B53468g857m9153G1805b72756d8956
$$ -137974 35669 149673 145032 -299742 -300352 253468 -7857 -57010 71805 -272756 -48956
10887g632A7134M3760a31422C3912F694M8806a92593I7647B5688J08750g4941
$$ -7632 17134 60894 -131422 33912 6694 55500 -192593 97647 25688 134438 -74941
10875c4445q668j98880a12368n4574D8249a73877E0798c79560a03174N1010l9301
$$ -34445 -43113 -241993 -112368 -166942 48249 -173877 50798 -379560 -103174 -52164 -91465
10864i1465C6735J01027A2497Q4944J43831c7778k9062B20339L33658a12444A25668
$$ -91465 36735 137762 12497 97441 241272 -37778 -66840 220339 553997 -112444 125668
10852a23191I4632j274j7660a97744A4620K27066d2378j15863p8467C00087b29143
$$ -123191 94632 93358 75698 -197744 14620 241686 -42378 -158241 -236708 300087 -229143
10840f7356L0403I574c86628a10857B10828r6926k2969a15174N4363K1285B10496
$$ -67356 -36953 9574 -386628 -110857 210828 113902 90933 -115174 -60811 -39526 210496
10828A1461J52447c05190c5194k02353i763A58362n2292b8577k1155D6085O2743
$$ 11461 163908 -305190 -35194 -237547 -9763 158362 106070 -28577 -49732 46085 108828
10817A08828M008g6353A38376E0511h9312j06751a7011A54481d00458f1379D5415
$$ 108828 112836 -76353 138376 50511 -89312 -196063 -17011 154481 -400458 -61379 45415
10805h7067A04652a18910C14897I3064g7079A56259l1577E3622d37217h8003p8791
$$ -87067 104652 -118910 314897 93064 -77079 156259 124682 53622 -437217 -88003 -166794
10794a66794l42656f2454B1402d5960l90070e7632p535A25877a60702A31175j7465
$$ -166794 -509450 -62454 21402 -45960 -436030 -57632 -65167 125877 -160702 131175 113710
10783A13710b37970f5992j12585b4826A24157j7919c78628J45080P3622J4765
$$ 113710 -237970 -65992 -178577 -24826 124157 106238 -378628 -233548 -159926 -145161
10773a45161A15135b6501R261p5809A06781a88099B96151c97213j2496C5469P4677
$$ -145161 115135 -26501 -17240 -93049 106781 -188099 296151 -397213 -409709 35469 110146
10762A10146a39318j84564J33351B52449p7140E9258a34599D1915f5331E8638
$$ 110146 -139318 -323882 -190531 252449 175309 59258 -134599 41915 -65331 58638
10751a13070I292i4115L1291a3249j23502A03024i8686D6290J33358a10360A04285
$$ -113070 9292 -94115 -62824 -13249 -136751 103024 -98686 46290 179648 -110360 104285
10739b77338Q692a19686q3721j3046A58874i3195A28405Q1692b57080A97341D0113
$$ -277338 -268646 -119686 -203407 -216453 158874 -93195 128405 210097 -257080 197341 40113
10727a98719B16141b70814J33158H6157j6684a98145C446b28897b8833k7491F436
$$ -198719 216141 -270814 -137656 86157 69473 -198145 3446 -228897 -28833 -56324 6436
10715c3137j00262I0737h8701j83915B40053b8023C6909L3191f2870B48223G3753
$$ -33137 -133399 90737 -88701 -272616 240053 -28023 36909 70100 -62870 248223 73753
10703a70317B96268A8023K6245L6294a08754p0987B78541c6495B04014i013l40174
$$ -170317 296268 18023 44268 80562 -108754 -179741 278541 -36495 204014 -9013 -349187
10692c49187A22815a05368A13876h1227B30966O954j06910b02527A31983n2477
$$ -349187 122815 -105368 113876 -81227 230966 237920 131010 -202527 131983 79506
10682G9506M2265a01363j23648f9604B4677J83036d39293A1068N5796m71e3322
$$ 79506 121771 -101363 -225011 -69604 24677 207713 -439293 11068 66864 66393 -53322
10670E3232A5555M09376c43460a13732G868L9293b22216J01385j30270i0556j91334
$$ 53232 15555 424931 -343460 -113732 7868 47161 -222216 -120831 -251101 -90556 -281890
10659b81890G2606a80132N797j01344N6982Q1778B39963A1914c29179f1377B67985
$$ -281890 72606 -180132 -174335 -275679 -218697 -136919 239963 11914 -329179 -61377 267985
10647H039c78916a7391G7239b70997J09717E2723L8931q5a12049L0138A92880
$$ 8039 -378916 -17391 77239 -270997 -161280 52723 91654 91569 -112049 -81911 192880
10635H499b13448e162A17288k8149e0758G9334i2417F651R5289i6990C2598R8307
$$ 8499 -213448 -5162 117288 89139 -50758 79334 -92417 6651 101940 -96990 32598 130905
10623A30905b08917f8892k89594F2601H094K46362E4233K10070a6105l20447d3519
$$ 130905 -208917 -68892 -358486 62601 8094 254456 54233 264303 -16105 -336552 -43519
10611G3518j9431a1089l64311B99658b0088k23743A95237i6630c7511J1374B05104
$$ 73518 54087 -11089 -375400 299658 -20088 -243831 195237 -96630 -37511 -26137 205104
10599h593k24886b2387k7474H6629N05l2671c86705b423A41944A7347b75983a36905
$$ -8593 -233479 -22387 -49861 86629 87134 54463 -386705 -2423 141944 17347 -275983 -136905
10586g2450E4795J49351a50457e3042B2162L46349j11165d3431m8284M4228A64423
$$ -72450 54795 204146 -150457 -53042 22162 368511 257346 -43431 -91715 -47487 164423
10574A09919c2141p2569k60624a9763k31789f6023l46252B4460O7724b56194C371
$$ 109919 -32141 -104710 -365334 -19763 -251552 -66023 -412275 24460 92184 -256194 3371
10562A30521O8936p6288n8443f624n757o7248j90586F0495h1136D2004a49318
$$ 130521 199457 123169 64726 -6624 -12381 -79629 -270215 60495 -81136 42004 -149318
10550a38816A46944a50139e9840l318l32560J65167B15170a76591e4316a1200
$$ -138816 146944 -150139 -59840 -63158 -395718 -230551 215170 -176591 -54316 -11200
10539a4518D7031d4473r4357B2221a80159o9534N5426A49057b38189I189a37519
$$ -14518 47031 -44473 -138830 22221 -180159 -249693 -194267 149057 -238189 9189 -137519
10527F3730a32930K9086B18882b15840Q9077B02759b51517E4976o246c0352j09204
$$ 63730 -132930 -103844 218882 -215840 -126763 202759 -251517 54976 48730 -30352 -139556
10516a39556N0633n5948D20956C9369a24221b3379k21318e3782j41619C13140
$$ -139556 -88923 -144871 420956 39369 -124221 -23379 -244697 -53782 -195401 313140
10505d9770l7209B31484B9318h3984L1941F4821e1272B88927a34598C37746a34814
$$ -49770 -86979 231484 29318 -83984 -52043 64821 -51272 288927 -134598 337746 -134814
10493a80266A23547e9952D5243c41290P6766j09792C0090Q7576a3924A30321J83506
$$ -180266 123547 -59952 45243 -341290 -264524 -374316 30090 117666 -13924 130321 313827
10482C13827l9065K87461L32378A89024N17664l52019m4008a20439C52414b17917
$$ 313827 274762 562223 894601 189024 706688 354669 310661 -120439 352414 -217917
10471H2541c40812D754d7866l14023J45624F7470e5944A2860L040b546n2280O947
$$ 82541 -340812 4754 -47866 -361889 -216265 67470 -55944 12860 15900 -2546 -54826 -47879
10459d7879N719D7335b82565b9493h532A35092m2228P422J05533a02938j80808
$$ -47879 -42160 47335 -282565 -29493 -8532 135092 92864 100286 205819 -102938 -283746
10448b83746a3825B9825J26587b84707H0696J63636A01706e8356a5086m5852J9575
$$ -283746 -13825 29825 156412 -284707 80696 244332 101706 -58356 -15086 -60938 -41363
10437d1363j41882r7146Q4927B81163J8050a91259k2976A36725O4295Q942C4184
$$ -41363 -183245 -280391 -195464 281163 299213 -191259 -214235 136725 201020 209962 34184
10425c70707B44910G5962a85197c7795a1594C3398a8943j57779h6847j43377D23360
$$ -370707 244910 75962 -185197 -37795 -11594 33398 -18943 -176722 -86847 -230224 423360
10413f2028j57575B52482c24137a50689j45569Q5290B4015N8141M1000o013c14491
$$ -62028 -219603 252482 -324137 -150689 -296258 -210968 24015 82156 123156 117143 -314491
10401A48662a51812N2843A33573a01807K1913A35173J65723l3208A11796E2803
$$ 148662 -151812 -98969 133573 -101807 -79894 135173 300896 267688 111796 52803
10390B30929c24941A56898B2240K61457j26173I528J34194Q1838A997J68437k1097
$$ 230929 -324941 156898 22240 283697 157524 9528 143722 225560 1997 170434 149337
10379A49337F2899k7904K79990A42720J48240a31542A06994J53834C7021L04781
$$ 149337 62899 34995 314985 142720 290960 -131542 106994 260828 37021 341802
10369C41802B2339L00938L56964C32082K21628j17364A84558K83296A70479K32879
$$ 341802 22339 323277 680241 332082 553710 436346 184558 467854 170479 403358
10359D03358a0970B27350j6745m8818A8598L14452a45465D65030N6251j39732
$$ 403358 -10970 227350 210605 161787 18598 333050 -145465 465030 521281 381549
10349C81549J58736p8155A19821K81989j25728J49378J47889J8404L1806A45191
$$ 381549 540285 462130 119821 401810 276082 425460 573349 591753 623559 145191
10338D6036J7320R0157K02379a63351C88942B9706J89567j1639a85686G846c75029
$$ 46036 63356 153513 355892 -163351 388942 29706 219273 207634 -185686 7846 -375029
10326F8932J1481L11236K6218D7967K72568A8910J51673b4629B78710e7876j82262
$$ 68932 80413 391649 417867 47967 320535 18910 170583 -24629 278710 -57876 -240138
10315b40138a8384B01035A0941f0083E6838f2140A01589m4447d3773A66813o8514
$$ -240138 -18384 201035 10941 -60083 56838 -62140 101589 57142 -43773 166813 98299
10304I8299d9833a7579r7499b1361B33579e5331A84619b30723L4100H866O9450
$$ 98299 -49833 -17579 -115078 -21361 233579 -55331 184619 -230723 -196623 8866 78316
10293G8316I004J24268o5012d66798A49778B5114d59839J85027g7122c7751D0506
$$ 78316 9004 133272 68260 -466798 149778 25114 -459839 -274812 -77122 -37751 40506
10281b54876h560j67973H398b14162B84039H0253a42763N759E3658d60173H4743
$$ -254876 -8560 -176533 8398 -214162 284039 80253 -142763 -137004 53658 -460173 84743
10269B69175I1338Q2296d2888j67563o5091L3137C35571a78980B71348K08364
$$ 269175 91338 173634 -42888 -210451 -275542 -242405 335571 -178980 271348 479712
10259D79712H1182M39205L8667j15251J6506A69116G0755j3619K86654j30846
$$ 479712 81182 520387 559054 443803 460309 169116 70755 57136 343790 212944
10249B12944e10711A3763f7965J4751j57505A88164F7368q261c20495a56577A68274
$$ 212944 -510711 13763 -67965 -53214 -210719 188164 67368 59107 -320495 -156577 168274
10237a45088j1609g2570A30724a55656k11962J33621h3723I0285b6452A35614
$$ -145088 -156697 -72570 130724 -155656 -367618 -233997 -83723 90285 -26452 135614
10226a00480A14193a07477i105p490j33745e8016J8665B28778q5539e0558j57497
$$ -100480 114193 -107477 -9105 -16595 -150340 -58016 -39351 228778 143239 -50558 -208055
10215b08055A38361c8587F7686c34347a61760A79461r886G2079a16821l9042P3290
$$ -208055 138361 -38587 67686 -334347 -161760 179461 169575 72079 -116821 -155863 -82573
10204h2573j42815J12187A64319L6990b1142j24555H2069b00760N8603c1772k55140
$$ -82573 -225388 -113201 164319 201309 -21142 -145697 82069 -200760 -142157 -31772 -286912
10193b86912B492b47479B2674b55995F447i4310a4445C9090J53430p2241C3268
$$ -286912 2492 -247479 22674 -255995 6447 -94310 -14445 39090 192520 120279 33268
10181a73758G50a1085D7127i8036d8708A05885a09935j75412a30005A09672b81485
$$ -173758 750 -11085 47127 -98036 -48708 105885 -109935 -285347 -130005 109672 -281485
10169B0073c5468q3031a1935k86906a03879a9587A6779b09889D1809P8716A2650
$$ 20073 -35468 -118499 -11935 -298841 -103879 -19587 16779 -209889 41809 120525 12650
10157a18053a851A50816P3898J75872a05349b31m61870a51878A58469a04113d5232
$$ -118053 -1851 150816 224714 400586 -105349 -231 -462101 -151878 158469 -104113 -45232
10145a4740k9120A91074A8397K01461a96673b3862j79517i9889j44813b7426C4374
$$ -14740 -43860 191074 18397 219858 -196673 -23862 -203379 -99889 -244702 -27426 34374
10133a7836C38694A56724F8507a30992m9480o1076A22176n2796c87568A87844
$$ -17836 338694 156724 68507 -130992 -180472 -241548 122176 69380 -387568 187844
10122f59905a18150b8798j13492b2761p9605A15709m5003f3002E6261J60568D2776
$$ -659905 -118150 -28798 -142290 -22761 -102366 115709 70706 -63002 56261 216829 42776
10110c33557B0094J34878J88364b37678F1386f095j24526N3258m99497a78135
$$ -333557 20094 154972 343336 -237678 61386 -6095 -130621 -77363 -576860 -178135
10099a9162j1511m6854l9056k2692k5183k5851K4796k0828j5067g7842B08488
$$ -19162 -30673 -77527 -116583 -139275 -164458 -190309 -165513 -186341 -201408 -77842 208488
10087b93802i0444k48156M4472a13325A38856f1270B05299I298J31146l8606l9198
$$ -293802 -90444 -338600 -294128 -113325 138856 -61270 205299 9298 140444 101838 62640
10076F2640a58518C8598P3313b74478A50732E3253a4223A52264n7812l2849b52951
$$ 62640 -158518 38598 111911 -274478 150732 53253 -14223 152264 94452 61603 -252951
10064a05231l4911D5156J03657P577B4304b18822B44803C2061a01432o1186F0439
$$ -105231 -140142 45156 148813 156390 24304 -218822 244803 32061 -101432 -162618 60439
10052i3973j0002k0693I4543c1787q0640R976E38a72275d5424C02064q9164d7147
$$ -93973 -103975 -124668 94543 -31787 -112427 -102451 538 -172275 -45424 302064 212900 -47147
10039A22820g3384A8545K02918b38859a9270D6437K24802a01749A56076a37634
$$ 122820 -73384 18545 221463 -238859 -19270 46437 271239 -101749 156076 -137634
10028a79884e1665k15628J31967C8343N3445d424A72097a69887A68222a99675
$$ -179884 -51665 -267293 -135326 38343 91788 -4424 172097 -169887 168222 -199675
10017c6430p4768d5982a8924I7047a78536p5735a264j40385j31262a05910j86511
$$ -36430 -111198 -45982 -18924 97047 -178536 -254271 -1264 -141649 -272911 -105910 -292421
10006b92421d15j06279A82590a84290I0798a47534A01325m7721a62820j53276
$$ -292421 -415 -106694 182590 -184290 90798 -147534 101325 53604 -162820 -316096
9996c16096k2272I2072C3053J4349o617b45981j50789J61117K723D5468c35654
$$ -316096 -338368 92072 33053 47402 40785 -245981 -396770 -235653 -232930 45468 -335654
9984b62105M2111A21317J68041a31893l910J0772Q216j44425J06337n9545B65554
$$ -262105 -219994 121317 289358 -131893 -135803 -125031 -116815 -261240 -154903 -214448 265554
9972c05451f4761r1651B4722f382j0620n8207H3680i4638j3675A40137E5267a47933
$$ -305451 -64761 -156412 24722 -6382 -17002 -75209 83680 -94638 -108313 140137 55267 -147933
9959h526j85694H4103a64925l5480c6015j57830d93A36031a92668k3113C5377
$$ -8526 -194220 84103 -164925 -200405 -36015 -193845 -493 136031 -192668 -215781 35377
9947b07623L8875o7379G4244H512e20227J62530f5830j37596i6760d758n9743
$$ -207623 -168748 -236127 74244 8512 -520227 -357697 -65830 -203426 -96760 -4758 -64501
9936f4501k9760M1706j45621f48j67711B7444i3298c9985j47159j08842F376J56942
$$ -64501 -94261 -52555 -198176 -648 -168359 27444 -93298 -39985 -187144 -295986 6376 163318
9924A63318a22621F0898Q7764D4548a69436G4367c45295C58970c50488B15721
$$ 163318 -122621 60898 148662 44548 -169436 74367 -345295 358970 -350488 215721
9913H5561l1313b15428J6122p2323J34055f7541B14090q2034c9467D6062j8123
$$ 85561 54248 -215428 -199306 -271629 -137574 -67541 214090 132056 -39467 46062 27939
9902B7939g3373J8200A5846e0924j43824q9316f4666a886n41630E7420M7015b31619
$$ 27939 -73373 -55173 15846 -50924 -194748 -284064 -64666 -1886 -543516 57420 104435 -231619
9889b22746A76606A2621a41472A00418j5390a44557q8421a1920l16909A28819
$$ -222746 176606 12621 -141472 100418 85028 -144557 -232978 -11920 -328829 128819
9878a15682c3770j84616A6367J60143c51347E0311f8537B44731b18724p1724B2227
$$ -115682 -33770 -218386 16367 176510 -351347 50311 -68537 244731 -218724 -290448 22227
9866a3025k28377P8417k2917B87553c37783g072l6m2880A93248a54074D4491E131
$$ -13025 -241402 -162985 -185902 287553 -337783 -7072 -7108 -49988 193248 -154074 44491 5131
9853A71695B681R8396a32498H4691b17783a4855r9202B69195I9183g0075o2677
$$ 171695 2681 101077 -132498 84691 -217783 -14855 -114057 269195 99183 -70075 -132752
9842a32752k05320a09352l97205K45414a23158j22757B38543d3228A65463c30159
$$ -132752 -338072 -109352 -506557 -261143 -123158 -245915 238543 -43228 165463 -330159
9831c2244E1944a85142A4687a89502H5119a20450j44445Q0777A59223e2985k70977
$$ -32244 51944 -185142 14687 -189502 85119 -120450 -264895 -184118 159223 -52985 -323962
9820c23962L6483d7043k04221a05686G9191a55417c9995l5552A30313i5122b5964
$$ -323962 -287479 -47043 -251264 -105686 79191 -155417 -39995 -75547 130313 -95122 -25964
9808a61258C51172a66388D55849d6043M212p5316k82288A09235D3938i2843B07560
$$ -161258 351172 -166388 455849 -46043 -41831 -117147 -399435 109235 43938 -92843 207560
9796d20062A17979m3943a86632J9994B59025q4254i0833G6796h1590j84862R3149
$$ -420062 117979 74036 -186632 -166638 259025 174771 -90833 76796 -81590 -266452 -173303
9785a73303D1335a37485j67909D388K26896I2836a11735j47584e2563G4571K48682
$$ -173303 41335 -137485 -305394 4388 231284 92836 -111735 -259319 -52563 74571 323253
9774C23253a70049H494b40999A04091f2408B4188a93900p3273d2936j11260j56232
$$ 323253 -170049 8494 -240999 104091 -62408 24188 -193900 -267173 -42936 -154196 -310428
9763c10428A64967J25955C5358b03036N2622H1817h409k67484A00602c1710l00322
$$ -310428 164967 290922 35358 -203036 -150414 81817 -8409 -275893 100602 -31710 -332032
9752c32032B21111b69940l6547Q7114e0312k89959b5079r1112F5957b5546B2225
$$ -332032 221111 -269940 -306487 -219373 -50312 -340271 -25079 -116191 65957 -25546 22225
9740b98481J11185g6064k32973h5435q8538k2874G1656h7548A03026g4074j99226
$$ -298481 -187296 -76064 -309037 -85435 -173973 -196847 71656 -87548 103026 -74074 -273300
9729b73300a05040J3936A37865o8587M7318B3548a59119m6401k3307B66853A5536
$$ -273300 -105040 -91104 137865 69278 116596 23548 -159119 -205520 -228827 266853 15536
9717I1162A3298J13854b03977c6423G8453d3481A79405c4426j45358k04916f9939
$$ 91162 13298 127152 -203977 -36423 78453 -43481 179405 -34426 -179784 -384700 -69939
9705A11397a46371j24335c7640J3546k48721e0480A91819B7143L2568B03a33153
$$ 111397 -146371 -270706 -37640 -24094 -272815 -50480 191819 27143 59711 203 -133153
9693H0378b72093R5063g1784l37447B274e9463k82855B02011I3808C263J04552
$$ 80378 -272093 -177030 -71784 -409231 2274 -59463 -342318 202011 93808 3263 107815
9682A07815a33098n1292j37752a15745K0813j08815b5625A58340a69384M4454
$$ 107815 -133098 -184390 -322142 -115745 -94932 -203747 -25625 158340 -169384 -124930
9672a24930M2319l9883A07792d477l5145k01430d4035l5047H6907A4817b03588
$$ -124930 -82611 -122494 107792 -4477 -39622 -241052 -44035 -79082 86907 14817 -203588
9660a84739e5191A769a69074k7802B7769a35205e5058E49956b56203J15458j87998
$$ -184739 -55191 1769 -169074 -196876 27769 -135205 -55058 549956 -256203 -140745 -328743
9649c28743i4590q3279m3337p4676r127f4991D9611a2761A50804f4212q3433B54316
$$ -328743 -94590 -177869 -221206 -295882 -305009 -64991 49611 -12761 150804 -64212 -147645 254316
9636i4773B41202a12650G0984I236b53726e9017r8900n30A40392a97331B45686
$$ -94773 241202 -112650 70984 9236 -253726 -59017 -157917 -158447 140392 -197331 245686
9624h4393J1793J4773O805B48035g6246B4740a15734A91585r3109a19750I9929
$$ -84393 -72600 -57827 -51022 248035 -76246 24740 -115734 191585 98476 -119750 99929
9612c7051a5019j43132k7144i832F8269J04150p9012a23707o0821n2974p9657
$$ -37051 -15019 -158151 -185295 -9832 68269 172419 93407 -123707 -184528 -237502 -317159
9601c17159a58257A18776d56904J02819A44269h0300J8817B17452j0930b31219
$$ -317159 -158257 118776 -456904 -354085 144269 -80300 -61483 217452 206522 -231219
9590e5885j98356i210k43207D796P7227M8497c42061B93084K3396b52017a15516
$$ -55885 -254241 -9210 -252417 4796 82023 130520 -342061 293084 316480 -252017 -115516
9578i9382P601a2501G9799g5201A87661H731a83650B4206b93291i1995G8188a55096
$$ -99382 -91781 -12501 79799 -75201 187661 8731 -183650 24206 -293291 -91995 78188 -155096
9565a32357j34714O4094m6215h6783r2320j97459A97693J22926a44770m2869h420
$$ -132357 -267071 -202977 -249192 -86783 -179103 -376562 197693 320619 -144770 -187639 -8420
9553B3333a38682c1300A98081c5754E5228b34684E2586J63937o9843c65730a69996
$$ 23333 -138682 -31300 198081 -35754 55228 -234684 52586 216523 146680 -365730 -169996
9541b9451k88848a48616C8071a54665d9285A40333a51293A29769b96324I0758
$$ -29451 -318299 -148616 38071 -154665 -49285 140333 -151293 129769 -296324 90758
9530C2515j2737K17670a05112I5056a28646l35146d9553F8398a97665A02517D1965
$$ 32515 19778 237448 -105112 95056 -128646 -463792 -49553 68398 -197665 102517 41965
9518a8151A25222J6017a7364k83187B06829D9664f6609c971j6175A76856p1002
$$ -18151 125222 141239 -17364 -300551 206829 49664 -66609 -3971 -20146 176856 105854
9507A05854O8981h7772b8503p2726k275E354J714a86252e9334A13906b02399A2265
$$ 105854 174835 -87772 -28503 -101229 -103504 5354 7068 -186252 -59334 113906 -202399 12265
9494G1948A2380f2209C70879G6870c98432J49640B95292b06934L7113k0492P9774
$$ 71948 12380 -62209 370879 76870 -398432 -248792 295292 -206934 -169821 -190313 -110539
9483a10539q2822R4505q3260f6863j11801K9732a0415p4610j2983A67423q2483
$$ -110539 -193361 -98856 -182116 -66863 -178664 -148932 -10415 -85025 -98008 167423 84940
9472H4940L33223F6468b75236q4863J53259P6617j92813B36683C3335J06810a75798
$$ 84940 418163 66468 -275236 -360099 -206840 -130223 -323036 236683 33335 140145 -175798
9460b94962N1711P7670A05698a63803J805A62355R8538a78518h8951L0620j52052
$$ -294962 -243251 -165581 105698 -163803 -161998 162355 260893 -178518 -88951 -58331 -210383
9449b10383j07306a09734M5151E0932c01439f676j64190f9363k15676c1937j00308
$$ -210383 -317689 -109734 -64583 50932 -301439 -6676 -170866 -69363 -285039 -31937 -132245
9438a32245D67255a63851A98549q2633e5676a8305k36647d7806A42655d32507
$$ -132245 467255 -163851 198549 115916 -55676 -18305 -254952 -47806 142655 -432507
9427a0258k31671E8586J82459E9787a06157l3423H1314l7374i8986K9635A28339
$$ -10258 -241929 58586 241045 59787 -106157 -139580 81314 43940 -98986 -69351 128339
9415G5077d35151C5401A4017d19045e3500A62920a80336k99759e7285e286j81286
$$ 75077 -435151 35401 14017 -419045 -53500 162920 -180336 -480095 -57285 -5286 -186572
9404a86572A85733b19570H6777i4032A51306c42722J56638a0629p8337k8225B29052
$$ -186572 185733 -219570 86777 -94032 151306 -342722 -186084 -10629 -88966 -117191 229052
9392g4879k57006a02501A78705m243h6303d2000a0865G0411K0482d35932a7186
$$ -74879 -331885 -102501 178705 174462 -86303 -42000 -10865 70411 90893 -435932 -17186
9380A06230d02922A68473n1761a35497c7751j28534k20320h8069j46218F4796
$$ 106230 -402922 168473 116712 -135497 -37751 -166285 -386605 -88069 -234287 64796
9369a59866b6384l21168A00525J04874k5746b52270a7999k50575a564m9523J4688
$$ -159866 -26384 -347552 100525 205399 179653 -252270 -17999 -268574 -1564 -51087 -36399
9358c6399A31371e4752j22350k56232Q1336Q8454Q3059B57304H8776h282B01237
$$ -36399 131371 -54752 -177102 -433334 -351998 -263544 -180485 257304 88776 -8282 201237
9346b12085K3053A05602a43952G9984a02471o627A2960a8083D0188b1199j01074
$$ -212085 -189032 105602 -143952 79984 -102471 -109098 12960 -18083 40188 -21199 -122273
9335a22273l95458a71669b2847b218j79335h7454L2383F2230c29963c9861j6268
$$ -122273 -517731 -171669 -22847 -2218 -181553 -87454 -55071 62230 -329963 -39861 -56129
9324e6129D02673b04877q2702A85480L564b3031m590E3938O1838M9129J80027
$$ -56129 402673 -204877 -287579 185480 189044 -23031 -27621 53938 115776 164905 344932
9313C44932a08774r9629q4959G7547c3407B00425a66805j20646d981k48864C28220
$$ 344932 -108774 -208403 -293362 77547 -33407 200425 -166805 -287451 -4981 -253845 328220
9301b83715J32977B42097b08914o7645C78150A1337a41687q0425L3237l20198
$$ -283715 -150738 242097 -208914 -276559 378150 11337 -141687 -222112 -188875 -509073
9291e09073K43442g3870j81508J4770d5139m5633j09527D6737j2176d17928c0616
$$ -509073 -265631 -73870 -255378 -240608 -45139 -90772 -200299 46737 34561 -417928 -30616
9279a92112g7039A32284a88359B41768b66621i4128K572m83l40214c8325j44237
$$ -192112 -77039 132284 -188359 241768 -266621 -94128 -91556 -92039 -432253 -38325 -182562
9268a82562c0765q3946A14569b08692B24524q7381c15175B719d78582J48402m877
$$ -182562 -30765 -114711 114569 -208692 224524 137143 -315175 2719 -478582 -330180 -335057
9257c35057J22431R9971H4264A8822K9104a83445M458f4220B07234a13410G701
$$ -335057 -212626 -112655 84264 18822 47926 -183445 -178987 -64220 207234 -113410 7701
9245d26242i4969j9632G1349h8500j27560R5958A51355c8504A74246a80203b6929
$$ -426242 -94969 -114601 71349 -88500 -216060 -120102 151355 -38504 174246 -180203 -26929
9233A60132h5718C21836a32187M1415l1302q882j04772A24807h8657A22633a98926
$$ 160132 -85718 321836 -132187 -90772 -122074 -130956 -235728 124807 -88657 122633 -198926
9221A79720a85242p8364B3669b56530a7932k71040I658b4962j23773A65920b03250
$$ 179720 -185242 -263606 23669 -256530 -17932 -288972 9658 -24962 -148735 165920 -203250
9209b74237j74742b17728h7536A36302i2238H8733a71986j25062B35719a95192
$$ -274237 -448979 -217728 -87536 136302 -92238 88733 -171986 -297048 235719 -195192
9198b45027a10809c1096A19628a10314A6864a70696j136O3014H4831b69392A47788
$$ -245027 -110809 -31096 119628 -110314 16864 -170696 -171832 -108818 84831 -269392 147788
9186a67799r7030a16632A75739c13255A20989a90756e8860j5707j61828B95384
$$ -167799 -264829 -116632 175739 -313255 120989 -190756 -58860 -74567 -236395 295384
9175i5268j23441A47931b76423C107c4956A58773c63852J61079f3395C13004b8689
$$ -95268 -218709 147931 -276423 3107 -34956 158773 -363852 -202773 -63395 313004 -28689
9163A20564b52531g7868F442k285a69495c4606J4503C4414a78280M0358A73645
$$ 120564 -252531 -77868 6442 4157 -169495 -34606 -20103 34414 -178280 -137922 173645
9151B0031a81224j1932d1132j50374H6761b40366J6368a2617B6151E036g2995
$$ 20031 -181224 -193156 -41132 -191506 86761 -240366 -223998 -12617 26151 5036 -72995
9139A74828a55468A30910J98114e4741m0660M6004p9216j16023E8361b00872G3262
$$ 174828 -155468 130910 329024 -54741 -95401 -49397 -128613 -244636 58361 -200872 73262
9127a7970H6285a96420b295j76149Q7922D8131a11216G261h403j75151A38919
$$ -17970 86285 -196420 -2295 -178444 -90522 48131 -111216 7261 -8403 -183554 138919
9115a38387A75504b36062B17209A5739n614K57273e7871k12502a13823b5921A29433
$$ -138387 175504 -236062 217209 15739 10125 267398 -57871 -270373 -113823 -25921 129433
9103a0473k15744F6010a30649A08647k0492a06284D56g6118A12943a73317k7623
$$ -10473 -226217 66010 -130649 108647 88155 -106284 456 -76118 112943 -173317 -200940
9092b00940J4334A06946b3850q8283j08176L2067b0444G764L03367G1186g0212
$$ -200940 -186606 106946 -23850 -112133 -220309 -188242 -20444 7764 311131 71186 -70212
9080a9043j70552A3736a33532A57302n4871J54696A00918B4365a52854K9569J2694
$$ -19043 -189595 13736 -133532 157302 102431 257127 100918 24365 -152854 -123285 -110591
9069a10591k83187a09540G5021k462P0615J43226b9540B76168d95236b04192D8038
$$ -110591 -393778 -109540 75021 72559 143174 286400 -29540 276168 -495236 -204192 48038
9057b9515q3920a1900A17335c8677j45585l55664b2261A80551c1456A61121d8090
$$ -29515 -113435 -11900 117335 -38677 -184262 -539926 -22261 180551 -31456 161121 -48090
9045a77456G8950a09903n496E6593k3905J20080c69461N8580a52151A15813a7741
$$ -177456 78950 -109903 -115399 56593 32688 152768 -369461 -310881 -152151 115813 -17741
9033a14467f888j18795j4195e1592j39349r2314H6426a89300B0775b1548p8763
$$ -114467 -6888 -125683 -139878 -51592 -190941 -283255 86426 -189300 20775 -21548 -100311
9022a00311r379n0131j5535B40826h4659m571G6752b76699c7129r9118a6695A06035
$$ -100311 -109690 -159821 -175356 240826 -84659 -89230 76752 -276699 -37129 -136247 -16695 106035
9009a9988A66531e11613E7629b58975a2607k62617O0762L7023E7596c96960c0393
$$ -19988 166531 -511613 57629 -258975 -12607 -275224 -214462 -177439 57596 -396960 -30393
8997e8155j33243R1897B42016a8380C31592i1305F4244a24615m3007g5210k34283
$$ -58155 -191398 -99501 242016 -18380 331592 -91305 64244 -124615 -167622 -75210 -309493
8986c09493B6753a2378j54042o0620A05133B1510J00558a32453A34359l1274b25642
$$ -309493 26753 -12378 -166420 -227040 105133 21510 122068 -132453 134359 103085 -225642
8974b89591A53038j18G1657b14144j442B31073h84A31118l6618J81314a72942
$$ -289591 153038 152920 71657 -214144 -215586 231073 -884 131118 94500 275814 -172942
8962A43107N243d36552h7086d1890q4297C33394j50598k0756b34217g3965A86263
$$ 143107 148350 -436552 -87086 -41890 -126187 333394 182796 162040 -234217 -73965 186263
8950b32764k23023e975p9029B6123J03982b20720P1518k8702I9387b00221A73286
$$ -232764 -455787 -5975 -85004 26123 130105 -220720 -149202 -177904 99387 -200221 173286
8938A13845a35525I5902C372K78757r0684K5532c55539a65033A10929C1016b51674
$$ 113845 -135525 95902 3372 282129 191445 216977 -355539 -165033 110929 31016 -251674
8926A52209n6642K46526r2356J561988L717013M663410C482995I78933k26397
$$ 152209 95567 342093 249737 1811725 5528738 10192148 3482995 978933 752536
8917G52536n6078A52827a8846j85444A10174a30282G8727f8388A35684L6013a4382
$$ 752536 696458 152827 -18846 -204290 110174 -130282 78727 -68388 135684 171697 -14382
8905e5228J5239A86350a97162j02303A48102B6835M1242J76741A17366a52101
$$ -55228 -39989 186350 -197162 -299465 148102 26835 68077 244818 117366 -152101
8894c37013c0947q3840A13405k2568b56289h9894A24450b5683j86881d9339j4137
$$ -337013 -30947 -114787 113405 90837 -256289 -89894 124450 -25683 -212564 -49339 -63476
8883f3476j00837I8848L5311m5426N9736l0370a16485M0468p8273C0016b19361
$$ -63476 -164313 98848 134159 88733 148469 118099 -116485 -76017 -154290 30016 -219361
8871c24518J04499r6299D9006b80075B27263k9849h9343j8890M4750A7030g9918
$$ -324518 -220019 -316318 49006 -280075 227263 197414 -89343 -108233 -63483 17030 -79918
$$ [...]
##END NTUPLES=NMR SPECTRUM
##END=
