##TITLE=AC1629_CENAH_8450611_OBMjHVTgJl
##JCAMPDX= 6.0         $$ Bruker NMR JCAMP-DX V2.0
##DATA TYPE= NMR SPECTRUM
##DATA CLASS= NTUPLES
##ORIGIN= BRUKER
##OWNER= Administrator
$$ 1.72 TOPSPIN		Version 2.1
$$ 2014-02-18 15:52:01.532 -0800  Administrator@X
$$ Compression mode = diff/dup
##.OBSERVE FREQUENCY= 400.02188249412
##.OBSERVE NUCLEUS= ^1H
##.ACQUISITION MODE= SIMULTANEOUS (DQD)
##.ACQUISITION SCHEME= undefined
##.AVERAGES= 8
##.DIGITISER RES= 22
##SPECTROMETER/DATA SYSTEM= spect
##.PULSE SEQUENCE= zg30
##.SOLVENT NAME= COFFEE_meoh
##.SHIFT REFERENCE= INTERNAL, COFFEE_meoh, 1, 14.98509
##AUDIT TRAIL= $$ (NUMBER, WHEN, WHO, WHERE, PROCESS, VERSION, WHAT)
$$ ##TITLE= Audit trail, TOPSPIN		Version 2.1
$$ ##JCAMPDX= 5.01
$$ ##ORIGIN= Bruker BioSpin GmbH
$$ ##OWNER= Administrator
$$ $$ E:\/data/COFFEE/nmr/AC1629_CENAH_8450611_OBMjHVTgJl/10/pdata/1/auditp.txt
$$ ##AUDIT TRAIL=  $$ (NUMBER, WHEN, WHO, WHERE, PROCESS, VERSION, WHAT)
(   1,<2014-02-18 15:51:54.985 -0800>,<Administrator>,<X>,<go>,<TOPSPIN 2.1>,
      <created by zg
	started at 2014-02-18 15:50:48.501 -0800,
	POWCHK enabled, PULCHK disabled,
       configuration hash MD5:
       C8 4E 4E 5D D3 5C D8 9E 9F 52 82 E0 59 8A DE 15
       data hash MD5: 64K
       5D C5 12 F5 2C 1D 12 B0 10 21 4F 80 3C 7C 6B AC>)
(   2,<2014-02-18 15:51:57.892 -0800>,<Administrator>,<X>,<proc1d>,<TOPSPIN 2.1>,
      <Start of raw data processing
       efp LB = 0 FT_mod = 6 PKNL = 1 PHC0 = 0 PHC1 = 0 SI = 32K 
       data hash MD5: 32K
       98 08 4C AB D1 F2 5A A1 50 B6 2E 36 E3 DB 1E 97>)
(   3,<2014-02-18 15:51:58.189 -0800>,<Administrator>,<X>,<proc1d>,<TOPSPIN 2.1>,
      <pk PHC0 = 96.48743 PHC1 = 0 
       data hash MD5: 32K
       12 B6 F2 DD 4D 0B 82 CD 7D 74 6F 97 AF 90 AA F9>)
(   4,<2014-02-18 15:51:58.267 -0800>,<Administrator>,<X>,<proc1d>,<TOPSPIN 2.1>,
      <abs ABSG = 1 
       data hash MD5: 32K
       F5 28 E3 21 E7 6C C7 0D 66 5A 37 6B 14 6C 14 15>)
(   5,<2014-02-18 15:51:58.329 -0800>,<Administrator>,<X>,<proc1d>,<TOPSPIN 2.1>,
      <abs ABSG = 2 
       data hash MD5: 32K
       65 AD BE 88 97 1C 12 DF 89 DB 7A 0F DF D6 23 A0>)
(   6,<2014-02-18 15:51:58.392 -0800>,<Administrator>,<X>,<proc1d>,<TOPSPIN 2.1>,
      <abs ABSG = 3 
       data hash MD5: 32K
       04 4E 44 31 D1 29 50 E3 15 89 60 B4 36 CB 54 C3>)
(   7,<2014-02-18 15:51:58.439 -0800>,<Administrator>,<X>,<proc1d>,<TOPSPIN 2.1>,
      <abs ABSG = 4 
       data hash MD5: 32K
       D8 60 34 1E A3 12 9D 7E AD E6 33 7A 7B DE 97 E7>)
(   8,<2014-02-18 15:51:58.485 -0800>,<Administrator>,<X>,<proc1d>,<TOPSPIN 2.1>,
      <abs ABSG = 5 
       data hash MD5: 32K
       E2 8A 16 FC 46 67 E9 BA 53 74 96 1B 23 11 13 8F>)
$$ ##END=
$$ 
$$ $$ hash MD5
$$ $$ C9 D9 06 64 D8 8A FC 18 64 B9 0A 27 5C 58 66 D1
##$RELAX= 
##$RELAX= 
##$RELAX= 
##$RELAX= 
##$RELAX= 
##$RELAX= 
##$RELAX= 
$$ Bruker specific parameters
$$ --------------------------
##$DU= <E:\>
##$EXPNO= 10
##$NAME= <AC1629_CENAH_8450611_OBMjHVTgJl>
##$PROCNO= 1
$$ [...]
150 150 150 150 150 150 150 150
##$TP07= 0
##$TPNAME0= <>
##$TPNAME1= <>
##$TPNAME2= <>
##$TPNAME3= <>
##$TPNAME4= <>
##$TPNAME5= <>
##$TPNAME6= <>
##$TPNAME7= <>
##$TPOAL= (0..7)
0.5 0.5 0.5 0.5 0.5 0.5 0.5 0.5
##$TPOFFS= (0..7)
0 0 0 0 0 0 0 0
##$TUNHIN= 0
##$TUNHOUT= 0
##$TUNXOUT= 0
##$USERA1= <user>
##$USERA2= <user>
##$USERA3= <user>
##$USERA4= <user>
##$USERA5= <user>
##$V9= 5
##$VALIST= <valist>
##$VCLIST= <CCCCCCCCCCCCCCC>
##$VD= 0
##$VDLIST= <DDDDDDDDDDDDDDD>
##$VPLIST= <PPPPPPPPPPPPPPP>
##$VTLIST= <TTTTTTTTTTTTTTT>
##$WBST= 2048
##$WBSW= 25
##$XGAIN= (0..3)
0 0 0 0
##$XL= 0
##$YL= 0
##$YMAX_a= 645941
##$YMIN_a= -548985
##$ZGOPTNS= <>
##$ZL1= 120
##$ZL2= 120
##$ZL3= 120
##$ZL4= 120
##$ABSF1= 14.98509
##$ABSF2= -5.573092
##$ABSG= 5
##$ABSL= 3
##$ALPHA= 0
##$AQORDER= 0
##$ASSFAC= 0
##$ASSFACI= 0
##$ASSFACX= 0
##$ASSWID= 0
##$AUNMP= <proc_prof1d_extract_pilot.lims>
##$AXLEFT= 0
##$AXNAME= <>
##$AXNUC= <1H>
##$AXRIGHT= 0
##$AXTYPE= 0
##$AXUNIT= <>
##$AZFE= 0.1
##$AZFW= 0.1
##$BCFW= 0
##$BC_mod= 0
##$BYTORDP= 0
##$COROFFS= 0
##$CY= 15
##$DATMOD= 1
##$DC= 0
##$DFILT= <>
##$DTYPP= 0
##$F1P= 0
##$F2P= 0
##$FCOR= 0.5
##$FTSIZE= 32768
##$FT_mod= 6
##$GAMMA= 0
##$GB= 0
##$INTBC= 1
##$INTSCL= 1
##$ISEN= 128
##$LB= 0
##$LEV0= 0
##$LPBIN= 0
##$MAXI= 10000
##$MC2= 0
##$MEAN= 0
##$ME_mod= 0
##$MI= 0
##$NCOEF= 0
##$NC_proc= -8
##$NLEV= 6
##$NOISF1= 0
##$NOISF2= 0
##$NSP= 0
##$NTH_PI= 0
##$NZP= 0
##$OFFSET= 14.98509
##$PC= 1
##$PHC0= 96.48743
##$PHC1= 0
##$PH_mod= 1
##$PKNL= yes
##$PPARMOD= 0
##$PPDIAG= 0
##$PPIPTYP= 0
##$PPMPNUM= 2147483647
##$PPRESOL= 1
##$PSCAL= 4
##$PSIGN= 0
##$PYNMP= <proc.py>
##$REVERSE= no
##$SF= 400.02
##$SI= 32768
##$SIGF1= 0
##$SIGF2= 0
##$SINO= 400
##$SIOLD= 32768
##$SPECTYP= <>
##$SREGLST= <1H.CDCl3>
##$SSB= 0
##$STSI= 32768
##$STSR= 0
##$SW_p= 8223.68421052631
##$SYMM= 0
##$S_DEV= 0
##$TDeff= 65536
##$TDoff= 0
##$TI= <>
##$TILT= no
##$TM1= 0
##$TM2= 0
##$TOPLEV= 0
##$USERP1= <user>
##$USERP2= <user>
##$USERP3= <user>
##$USERP4= <user>
##$USERP5= <user>
##$WDW= 1
##$XDIM= 32768
##$YMAX_p= 468240609
##$YMIN_p= -713394
##$CURPLOT= <Network HP LaserJet P1505>
##$CURPRIN= <$Network HP LaserJet P1505>
##$DFORMAT= <normdp>
##$LAYOUT= <+/1D_H.xwp>
##$LFORMAT= <normlp>
##$PFORMAT= <normpl>
##$SURQMSG= 1
$$ End of Bruker specific parameters
$$ ---------------------------------
##NTUPLES= NMR SPECTRUM
##VAR_NAME=  FREQUENCY,     SPECTRUM/REAL,   SPECTRUM/IMAG
##SYMBOL=    X,             R,               I
##VAR_TYPE=  INDEPENDENT,   DEPENDENT,       DEPENDENT
##VAR_FORM=  AFFN,          ASDF,            ASDF
##VAR_DIM=   32768,         32768,           32768
##UNITS=     HZ,            ARBITRARY UNITS, ARBITRARY UNITS
##FACTOR=    0.250966925370066, 1,           1
##FIRST=     8223.43324360094, -16575,       -222969
##LAST=      0,             58483,           62451
##MIN=       0,             -713394,         0
##MAX=       8223.43324360094, 468240609,    0
$$ Real data points
##PAGE= N=1
##DATA TABLE= (X++(R..R)), XYDATA
$$ [...]
23819 -99081 72736 -240989 -102378 -261764 17041 -213 100929 19248 40667 70218 13993
23807 69611 -100794 199997 -26794 -265717 249717 115606 -138275 87403 -56418 -257585
23797 -257585 197678 21042 403865 -104085 -90510 120607 -32444 -291318 235432 -416159
23786 215253 -69458 84149 -121547 276157 36865 -213468 3829 -13032 17250 -24129 -149015
23775 -149015 -180430 -155106 -195336 263743 304877 -64304 36865 -13311 26075 57386 10807
23763 -281488 50102 169110 273453 41388 -260636 335710 -251824 18600 11976 -180558
23752 28880 -134808 -407561 -53682 118938 35975 -371035 125726 -254106 146145 -80812
23741 -65018 135103 15339 97444 193919 196127 191473 98589 -92216 -90693 -22600 -283207 -158208
23729 -158208 82426 -99609 -166203 70339 258771 135689 149505 -74707 18635 -37614 -56726
23718 -56726 -53565 263016 -154553 42069 20160 -58101 225175 80211 -471487 134908 -14944
23706 46852 63157 40047 129004 -223658 -119801 69826 -7898 -193389 -421083 -19091 76406
23694 -171330 -252876 146653 -75995 -60280 -148861 23726 -267281 289109 166626 165364 110270
23683 110270 -32884 203290 176296 21695 25057 -97648 143030 -118626 199182 156667 78232
23671 142220 11535 -58621 16930 -22094 25798 175403 229938 -350174 -347890 181008 -173636
23659 193605 240530 -334139 -8825 3087 -289266 -145322 -139232 -188701 168296 -88933 -90347
23648 -90347 47224 -127738 -51540 -101914 61994 192973 -28074 77028 -304514 76028 -19883
23636 -153292 106403 37814 -303178 -251648 -121206 -17615 -318822 374734 127940 177075
23626 177075 -495021 265029 113307 116126 260513 268897 -237286 -77680 165107 42827 159519
23615 159519 -224860 -48131 -166523 -128055 24395 -15834 -14824 119001 5222 -249813 -194337
23604 -194337 149926 -87583 63785 -295335 22470 434569 78977 50233 -32113 -50883 94593
23592 -111579 216821 -157412 -76856 -96002 388489 330200 35900 -179425 -21660 317368
23581 -190729 -210915 -23184 5371 -226378 28024 80851 -514368 -51069 -4495 158056 -28087
23569 -447736 -298928 46701 -315899 -6068 -127670 -124209 -149275 -239105 261300 100767 -232283
23557 -91015 102660 22571 -110011 -295522 254187 275061 -19682 325671 147891 -70314
23546 236320 61116 15972 -100145 -182428 88031 136756 -144424 267537 174300 -247644 112593
23534 56762 100222 25634 -384438 115732 70060 -104047 8354 47653 97754 45960 16099
23522 132598 236613 -330383 -126690 -138792 52664 110504 135178 -179293 -99519 -46205 167931
23510 -58743 -303840 67896 11295 -178226 -103730 -240183 -148809 126798 114638 -34288 -104384
23499 -104384 -257457 -64268 132678 -359781 24174 166746 -23619 63953 12781 -129107
23488 -207994 127782 -53990 -181736 73820 -33853 149703 -93816 23695 2053 -22824 -62026
23477 -62026 -205533 46242 -349975 88326 -53921 -389604 -87952 -133776 115657 189792 -106963
23465 -77916 22056 -242616 91070 83703 -27914 156932 114005 -106503 171214 -106207 255606
23453 161152 -216065 -71537 237968 30849 -133701 219146 -142799 -200947 174929 -98176
23442 45680 54961 -248829 210637 -115460 -127620 -86254 306686 -8997 -178882 -134917 -145668
23431 -145668 -140865 -259108 127952 262631 -127017 2559 -121608 -142017 -150044 -56877 258733
23419 38136 68539 -50856 -108645 -74170 63651 70108 12663 -233060 48352 -38098 -318672
23408 -318672 364588 114305 27085 -197664 -158195 187147 98774 -539662 -314058 -81114
23397 -165205 -112952 -185268 246218 -143134 136263 -52932 -231555 121126 38366 36820 226916
23386 226916 -231875 84766 281592 -70007 89142 29289 -115451 -148030 -125592 -59527 99720
23374 89695 177184 4804 -180279 262195 70593 269664 -56500 21214 -38561 142027 158663
23363 158663 227724 2856 83107 -36454 -20754 63484 -205184 -243900 -288715 17411 -39092
23351 -208975 277528 -80372 120742 9153 -293615 98712 104603 -468362 83753 275645 -29060
23339 -307210 462606 82619 405984 89286 -176181 -139888 -39108 15695 243950 194333 -150077
23327 -33002 5864 -558675 -182985 25711 128673 -150181 -158359 242426 156397 81918 -190178
23315 221255 115494 -126799 22661 71142 -118297 -94115 162437 -97122 1438 -244527 -182120
23304 -182120 -6377 81737 39492 -15949 -42516 -190781 -258051 -2143 -255610 36299 53885
23293 53885 167945 234572 -96939 56197 66852 -153852 -46673 -169735 58691 14643 -162664
23281 -226583 -94815 -54470 202152 90121 30804 -85240 -231468 -340675 -35720 150082 21290
23269 -46550 -181205 -89242 -135905 -7288 337203 -27712 333295 -91623 -89762 -33212 26974
23257 210147 27046 -35276 -184542 54145 -129152 -107355 -154234 -44142 -9460 -563887 174358
23245 -66490 106882 182221 -324741 189677 40839 113206 -150851 -128081 -249048 -29343 -32028
23234 -32028 24774 -9359 71372 -131733 -115341 -218434 212886 205660 -186826 18850 -21096
23222 -287290 -264038 -252446 -275148 394821 -218162 535834 85306 -143042 -520518 90934
23211 240545 -432 -97358 -78090 -25550 -56661 84390 93197 -81737 -383634 20842 -112127 -110508
23199 -110508 -144709 -171431 166399 -60572 -12313 257659 -219453 -102280 214604 56102
23188 -238980 86503 -26310 157 -108934 -231161 -592546 395466 -21002 27850 -200284 -153684
23177 -153684 -175590 -44776 135223 164653 110237 318385 109098 191640 87386 -122775 219283
23165 -230995 96751 163246 69166 185513 -439327 69254 -165982 55034 53619 -145500 119161
23153 -440293 97634 101010 121887 55053 201210 236933 29244 18666 -246126 -106236 95577
23141 67568 -137098 -12078 14495 -191991 -206781 -125512 -144331 -68780 275716 -179024 205147
23129 -11577 -338501 207466 16217 215488 103712 183481 122786 204236 7890 -235978 18685
23117 -71524 -112919 221611 182483 -274277 65689 -36602 -63255 -278273 -347734 186548 178867
23106 178867 -6074 218450 -279397 201412 -107395 112741 48251 9499 -98317 -199649 -9491
23094 139256 -91506 158017 35595 219642 -261185 134623 -695 -310923 -102621 -79139 -31281
23082 -109790 -149354 -16922 -101408 164983 -116704 370072 240364 262505 -135444 -170315
23072 -170315 91769 -4284 164501 405951 215496 118888 -239326 -53200 -133051 -63609 -4049
23060 118283 183941 34850 254399 53836 -20473 134800 -314704 -644 168707 302268 133930
23048 -134132 343531 -167426 -25839 -225011 2037 177403 -50422 -44663 85942 -278073 228877
23036 -171489 -85908 43404 248860 -126912 168053 84073 -65159 -42768 215143 165690 -188178
23024 282606 215762 9391 12032 152434 287363 -35391 -227243 -143360 -108465 37474 -28536
23012 -193999 -223438 110220 -171309 176797 -289825 -63834 92090 -56630 100258 -161982
23001 273243 -11937 -83923 66924 209119 42569 -158683 267948 1304 228823 -142600 176714
22989 81139 -319496 -151973 -191421 -94949 239281 -2517 43265 -34738 112225 90236 -98165
22977 64588 -245229 214269 -144287 207221 -5806 75467 91787 -184293 -94504 -191390 -137593
22966 -137593 279631 -82776 -76752 -193859 138620 198960 45752 -112253 253716 -69661 -58187
22955 -58187 -292137 371065 220253 140181 -251847 -58105 -72882 133225 -7374 110487 83506
22944 83506 306789 -362119 -292540 -229143 128503 -399592 -37362 -76566 -74626 113580 378076
22933 378076 71917 92103 -107306 -22615 5465 -181959 152271 -237951 -37279 -163712 -142054
22922 -142054 -184645 -238545 59305 -3047 -181372 -249605 43847 -5329 -424640 25512 -179682
22910 -337964 260976 -125749 -128425 180906 -88119 109309 -198310 288653 -193054 -124386
22900 -124386 -43544 -171846 -103714 382677 -8803 67493 -80877 252111 -167719 -120204 48556
22888 -5183 -60428 -246118 -255408 -153944 -165229 17520 279347 188105 -100803 -31630 182234
22876 -127738 -341469 133280 -61174 55023 348254 115887 -141697 123642 5595 -53808
22865 -70235 -80970 -42290 -41085 -119391 81441 -96216 -52763 -8523 -2488 -192299 -190066 -236848
22853 -236848 -82127 -63100 332854 171988 -95390 47483 -7473 -44100 187544 -124974 116720
22841 -275789 268305 -175434 -243457 -84782 91333 -131675 -105348 -74079 -37440 -259822 -18990
22829 -23340 -315133 -264830 137121 158450 102107 -183063 180227 -188825 113875 -258718
22818 -89463 -335308 -121241 -4843 -279112 346319 -25923 104118 -70119 42823 -243123 -255810
22807 -255810 -326351 -200416 -262429 -349605 130672 178448 271506 -102324 89211 -52231 -251424
22796 -251424 -40702 69104 106189 -82538 103918 -127649 60236 28579 -140373 -9656 -97088
22785 -97088 -11204 -149015 -90082 21630 -420581 -117121 -51811 169401 163826 -157647 25913
22773 133462 -222789 347218 -170056 -38936 -177890 -43904 88292 -338036 -99880 319772
22762 116563 -67202 -70796 -20811 19102 -392102 211210 71495 -141033 -25745 115559 139744
22751 139744 -93187 88766 -76989 -43341 211535 140054 -10094 -121816 -20189 201042 -92194
22739 120887 -48229 -89507 60239 -301738 243117 -297517 263640 109774 -108238 76065
22728 137721 -552988 2923 -42264 -144182 -119986 -364169 -106010 312100 -178258 148753
22717 264652 -287625 258871 -198471 -114153 -296502 129137 -116179 190780 29435 173504
22707 173504 84499 -174845 -206458 -360737 -17187 121363 14597 415538 -196843 -197400 -62525
22695 -94265 -414929 13002 -339831 -39720 -178790 -132507 67749 5180 234438 -308141 12221
22683 181445 41281 -317156 41147 -109016 140502 -192708 -152630 6997 112448 -170482
22672 -293958 -158398 137015 5421 23227 -1582 -315045 251599 294083 105002 -91909 -143143
22661 -143143 283270 56432 322616 79401 -127147 6879 893 -134373 9086 153822 -79107
22649 140256 -130527 24643 117825 -1807 116504 -34597 -208379 -65076 -316675 -32865 3167
22637 -226167 68664 -272091 -79527 -47538 449184 -141579 -454857 81361 264097 264286 179083
22626 179083 -52346 -123924 -138370 -216131 -152435 53859 -21531 68807 135413 -103495 140551
22614 -15160 195936 42459 -20142 -45408 -536926 186828 82142 62297 58045 -186607 -249592
22603 -249592 23748 -374631 57244 -185476 54570 92449 228048 55562 -92563 203310 52425
22591 -41578 -91780 -164862 60316 -99926 294563 -135775 77010 -128134 -11107 13959 -5638
22579 86053 -269822 -52742 -79906 -26761 -98607 -75632 -247776 153544 66603 -97349 216167
22567 -277884 31790 -244198 166638 163506 213516 -27418 -54300 -264440 10921 -48862 -1543
22555 -93845 130897 159067 23273 -145086 -6216 -32729 -9440 -156246 117862 165223 30221
22543 212092 -225535 159950 -223125 1822 11376 232596 -90931 -245495 98612 -91345 13577
22531 277954 -179723 -334794 128117 -138923 -308302 46978 343998 -173298 39252 -434
22520 72289 -36675 114933 -282448 -33462 34341 -28580 16823 -161538 389699 1991 -32247
22508 389367 -28994 50488 -209661 219055 -42984 -50531 77061 27989 35053 -50396 -139078
22497 -139078 120359 -195824 5539 66382 50591 44562 -127774 -126814 118042 -97512 -91693 -339176
22485 -339176 88136 -65624 -144339 -241397 211155 -29755 365695 214336 52662 119517 -15461
22473 80707 -387286 -150497 -110741 -379615 -184527 138380 -44098 8409 -31298 210477 -71601
22461 104238 54957 225910 -251563 97811 -96398 -309673 3912 33058 13968 -29012 -219780
22450 -219780 51647 -312210 212314 -249052 341111 -397832 -51279 -231200 -276957 50751
22439 -66544 -167144 32442 -26471 77433 -59295 -129089 -321075 -128798 -33165 -19976 182052
22427 -427445 -29759 200623 -159991 -96583 394946 -255003 61906 14306 109351 4617 251371
22416 251371 29982 -144987 -110850 130572 -73314 -445560 20694 69078 -79948 -88691 -207958
22405 -207958 95139 309337 -713394 -229107 -202985 -176075 120599 28892 157478 -159354
22394 -104281 -208642 127501 198338 -67893 213141 5968 281598 74403 -38335 13955 -28885
22382 -92572 100941 -119109 163479 -122154 -176073 -3288 -264648 -32438 -50792 123419 -26323
22370 -209464 -143746 -44410 54675 220858 54137 -260722 66862 19438 -200705 -187764 -66460
22358 -153392 -15694 -72594 -490935 -352453 -30275 -271493 -230130 151787 75824 100276 -17281
22346 -196067 60845 341759 -5141 16066 128276 81950 -37457 70077 -101007 -134330 -220205
22335 -220205 -202937 -262586 173143 82099 -164595 -173124 48906 -521870 -133962 -308204 -108682
22323 266502 -40707 158504 -250306 -232054 99010 76362 -218103 -79042 77042 -40697 -250774
22312 -250774 -106834 33585 -36338 241029 -117219 85063 121073 239347 -158670 -211155
22302 -211155 -249649 121891 245369 3640 -113720 21801 51308 93468 -170931 231911 -125251
22290 -22739 86995 -28101 235322 -24727 180914 89675 149580 188602 -194237 -90174 -1102
22278 -96295 -27800 -154291 102639 -112551 -90048 -8433 103338 -5604 -310066 74425 75850
22267 75850 74296 -361195 -34981 -170425 -62105 -53668 -287850 169460 -348382 -39934 69610
22255 -130771 -127970 67157 258993 -217942 193511 142144 148464 13121 -306502 -137568 -81123
22244 -81123 -83149 -248268 118837 131433 -252697 -49093 68622 93080 -218909 -78271 46586
22232 219174 196749 158316 -153978 60814 -212270 27609 58401 -20631 56741 -208158 -68522
22220 154927 117635 71442 -63733 92891 -49884 87780 -55384 -238959 -78303 -492508 19958
22208 101770 120154 -36730 -202846 -108803 128495 -378824 9539 12304 131533 12346 28487
22197 28487 124965 -445378 -150849 -184962 40082 123659 257524 152438 -129108 -37391 84923
22185 -247132 -182550 179425 113110 -128744 -55147 -25598 4230 -101853 47992 10022 -302965
22173 -2657 330966 5390 231399 -24479 -142842 -343551 176517 -228608 214747 -179171
22162 -281038 -95972 144312 193095 -146313 146706 -70719 -236111 167535 -217146 143063
22151 60017 -109641 262447 -183560 -56410 -225333 289705 -179809 -183842 124485 367788
22141 367788 -100630 -37349 100581 150762 -76133 -124443 -44979 -15455 -158292 -168692 -194885
22130 -194885 205570 115728 -287399 -59596 -348109 -169346 -149878 -215009 -263160 21161 -99246
22118 -351383 -75682 -103341 -141551 98392 88469 -177369 -207925 58216 -179609 -94588 -5157
22106 -75475 -228251 -218171 15713 -70320 -112043 -108565 -146236 -147777 -125446 26807 -190444 42779
22093 -5287 -84861 58269 -307087 -94817 76485 -344708 44574 80225 59266 80659 -213428
22081 -153202 -126809 165780 -139315 146949 56767 -280537 -71982 -114591 -394589 -139873
22070 236158 185528 -308211 -47096 182236 168572 -266479 -84918 -269503 -18280 -305204
22060 -305204 -205267 170871 -95213 -27452 145594 237429 -1341 -112954 -49343 212180 -38185
22048 -4683 -95830 143273 -86831 -378526 111937 63721 -249035 -259408 165603 93197 161090
22037 161090 116200 -223766 -86972 -49650 -150985 75557 -53812 -120918 -133351 -77477 -166858
22026 -166858 -186438 -62379 35068 -65685 199138 217154 111519 -377315 -137551 -85711 -180897
22015 -180897 -130395 97467 22706 147750 -310464 -221913 -120171 262660 98583 -56999 -54407
22004 -54407 111630 -378471 146792 -51026 101159 123767 125791 -84410 -92627 -327463 172836
21992 191668 92702 -636401 -85570 -378668 5793 280800 -209980 10616 -44561 -15831 -200264
21981 -200264 63969 108333 -204302 141328 -89847 -25505 125977 -49126 -134410 -46453 -233419
21970 -233419 -159340 -127035 -64201 136922 34424 -133488 -349267 -152321 -90148 -144396 -205320
21959 -205320 184326 -90339 -123465 383276 -104597 -103864 31438 -320528 21639 -230808 -496
21947 -31789 -189445 -53427 405257 -259984 -288518 -268964 124420 211542 144227 -164390 -291690
21936 -291690 58093 -62370 -162136 -326906 275708 -266291 437978 32863 1009 -150826 -279367
21925 -279367 -145827 382548 62764 9115 250164 -117120 70501 23666 139296 -71907 -8964
21913 257086 -149705 -70449 199813 -63770 57855 -295628 -298072 -106086 -304502 -188323
21903 -188323 -103392 56594 -316017 105805 -285180 440998 302258 67970 -212652 -386440
21893 -386440 -186741 -306134 -60549 -237333 94954 -45285 243226 -108618 -179795 -74176
21882 205374 154464 -6377 -60379 65676 -74852 349300 -73331 -131130 -51857 61924 -87553
21870 -213829 360451 67428 -54011 136113 -122091 -284046 -265239 57955 106194 183222 -16732
21858 -301168 -94724 -37893 164886 172186 -229753 153604 -142597 -147888 -356131 -54225 -165913
21847 -165913 242699 72189 70626 2443 68767 54868 -306408 -156497 -230227 372916 314584
21836 314584 -67452 -158331 200256 -145831 -16962 148080 17505 90316 42853 -203520 -18285
21824 -37857 -82485 35020 -154721 55295 183184 -298897 -115148 258288 -211801 -40559
21813 -183032 -149488 -62942 -51788 -279527 10518 32992 4711 19926 166849 -40046 -156423
21802 -156423 237176 -100863 -79460 -156546 122735 53897 172424 -323987 -131710 -77682
21792 -77682 66806 -59831 -283921 332829 -125426 -253108 -315751 -34296 -26499 -164963 235662
21780 -6780 7467 -60165 -170454 54647 72046 110842 136510 -395831 -100106 251250 -204094
21768 166255 -227784 93422 -31966 203174 116090 7847 130775 401827 -257949 -127296
21757 -217623 -273222 96931 -112218 -198983 63999 -25893 216398 12492 2635 -43800 280546
21745 -13007 -98880 -64166 -133102 -212795 110251 -314706 -159955 -140550 -164786 -366782 -315856
21734 -315856 182287 -87601 -47994 35446 -84229 -317415 2039 -68772 -268093 207891 97096
21722 -297556 -1528 23244 223045 -99238 55268 -107173 -26803 -26375 47542 -454316 -60594
21710 5715 -357150 -153100 166265 -109704 -130303 134029 450898 -129061 129955 278965
21700 278965 -36492 99749 -252606 49761 -50256 53381 -401462 -200458 -133317 25265 201484
21689 201484 -237342 136878 -228790 -2823 -295310 223331 -15977 -39329 -91005 -194627
21679 -194627 20441 -72255 11923 -224353 125424 -158203 -64426 254504 123801 -5466 -405149
21668 -405149 -34323 -16498 -20557 -69885 -215853 92324 -23399 -33343 127258 -268141 363762
21656 30373 -213821 -99134 -245625 211399 184187 111545 -221685 -64770 -69115 -293946 -267019
21645 -267019 -37812 -132711 73108 -95054 -147956 -395333 104586 54165 -317112 105590 69261
21634 69261 -236795 -83012 -274563 226028 37506 -169029 29668 -25798 -162289 165066
21623 152210 -293806 -69616 -367659 76479 -53452 153263 -97951 -85371 196913 -152096
21612 91429 66676 23917 -142003 -43921 56280 -188518 73738 168767 220199 25826 -137589
21600 -62433 -362843 -116067 -166815 111 -233876 -138620 -53102 -70462 52700 118063 48424
21588 178283 -20667 166358 -93330 -11112 -160568 -124495 71360 64637 -175993 58512 -160416
21576 -339022 289653 17350 -40052 20287 27783 24080 212932 -149141 -202612 375247 -194579
21564 -208417 51047 -115607 207031 76500 -56491 -113864 307326 25761 148505 -284695
21553 -44089 4371 -56298 84443 84663 20295 -227838 -15181 -152646 48206 -17972 -106674 -69755
21541 -69755 -132525 -120061 -247110 -435502 301008 -249161 -272642 18115 192443 70922 169996
21530 169996 -117819 -167056 -109955 -116893 156678 -269121 89979 61734 337391 149950 153121
21519 153121 -218035 92141 -34418 46494 -68373 -56692 -297182 -313912 -92559 -109660 -91515
21508 -91515 57177 43727 329122 -124129 -40829 -287692 52654 11053 -222020 171692 117916
21497 117916 -111381 -96183 -131005 -355465 -232381 -172848 -49555 -230601 -85336 -392870
21487 -392870 -46986 -151727 40396 -42887 111895 -274776 140152 -322962 -213205 -252688
21477 -252688 -106682 -197619 41172 58686 137477 12067 -3790 245287 -266779 15579 42608
21466 42608 75304 140659 101761 -56214 -53033 -141090 -14289 151781 262252 -13765 225596
21454 150989 156724 -180084 -419620 -2286 -29682 -126212 -142848 -221541 -355182 222779 76354
21442 -313674 196976 222220 164091 180581 71377 39697 520664 465551 -47555 163964 27414
21430 55626 -12797 86845 52746 -125762 -165124 -29688 -87313 -114804 -54372 -198458 -280604
21419 -280604 390287 -246743 140804 395423 176588 2503 77847 25833 110573 105023 240004
21408 240004 -16013 95218 -304786 -433092 111593 -158251 -674 34072 -196609 70932 -224517
21396 -302636 128754 1118 99579 -252032 -297209 56391 141408 11976 239076 -128265 -1401
21384 -44560 -337964 -13860 149315 -25912 276977 -169862 -63950 -317755 -75739 376479
21373 -75106 -54809 -258128 -71003 -235069 66540 -24166 9403 39150 -244610 -73407 -3828
21361 254650 -475021 31693 -120329 281340 216389 193457 175642 -145529 -106568 -239378
21351 -239378 -187883 -131029 -112882 157126 -252218 -405427 143046 147686 28735 223076 34333
21339 -256843 -137758 -19922 -208486 -333166 -144493 -88834 247987 -52995 -158627 115225
21328 44788 -149134 -125654 -141341 102865 120520 109751 -226284 -58615 -218508 -401760 -234085
21317 -234085 -40773 -162162 -178704 -233633 -12536 110319 37784 101278 -183089 -166972 24556
21305 61375 -246086 49503 -169849 152629 174193 12531 -97974 -247116 150740 -206379
21294 -133927 -112767 -173932 115917 22385 120171 53705 -24828 104617 -340273 -256013 155061
21282 166482 -50152 -133902 -235678 -104197 56432 -40208 -174758 178108 -35473 14531 -90150
21270 -445384 194031 17632 73856 -2931 31265 53663 -169268 -239506 -145587 -22120 -64495
21259 -64495 -132267 95006 -24646 -117563 53770 -416902 118299 -127737 -164757 55609 -189878
21247 -37845 -114299 -114434 317504 -198554 64206 -59465 -266124 -113829 -129317 -97519 -178285
21236 -178285 330558 -479278 -104381 -120733 178469 -30737 -88211 -11610 -202917 133720
21225 5595 -261863 -7331 -158338 230405 -205527 -285502 98020 -52451 -123792 37205 86229
21214 86229 -212521 6379 109024 112772 21707 -41922 71925 83319 240961 47983 -216860
21202 254509 -439633 57979 -291159 -140700 32508 -82234 -67781 -262455 97177 284442
21192 284442 -171533 -283053 -182937 39874 -199629 -132509 82466 211827 273137 303020
21182 303020 63968 114999 -9706 25896 -94760 61402 -41488 -146592 -170284 141232 210948
21171 210948 -229943 48287 -83937 -389191 22395 -178226 -91627 -284292 -233458 212544
21160 97914 -172318 135490 -179268 135375 282499 106907 35259 142772 168717 30740
21149 -130360 126428 -62141 104739 149684 -573816 -311315 -389605 256446 -202753 -290453
21139 -290453 328284 142093 -160223 157987 -100066 8226 233137 200649 -27497 -128268
21129 -128268 -110898 12647 -301581 168754 186264 -133085 -386905 143524 -41152 258469
21118 -211237 -401720 -218724 57706 37427 37969 205880 216457 -287936 -139577 -58890 -259833
21107 -259833 -253412 32939 -282684 -127770 58755 -258390 161280 37835 6200 260192 236776
21096 236776 -226468 64364 119678 -156032 -122548 -89812 -125361 -185862 -201709 -102219 -42428
21084 145544 -11881 157170 -36781 -179448 11427 16522 -218344 158114 39762 -32880 -225812
21073 -225812 -156631 -436565 -309081 -200163 -92517 172766 65825 252338 -46641 145781
21062 202869 -380115 307784 -178002 352472 82490 114799 -39656 -372448 38915 -402678
21051 -158085 184499 -214623 59409 68980 70561 -64503 -368433 124060 -16834 74285 259834
21040 259834 76636 333598 173884 -282512 102354 56715 145078 -43268 -3379 -82679 -58469
21029 -58469 126408 -171290 -88726 -10105 -37998 -286598 -137559 103889 -213519 -155073
21019 -155073 -37024 229251 -58756 64261 209192 -256179 12991 63896 -325552 44464 -378019
21007 -87019 211905 -211727 -63728 -78263 109616 -252864 524943 152954 -43255 -55351
20997 -55351 -241635 67374 -262134 20362 -244720 -168508 -7498 -270293 9532 -141121 -180279
20986 -180279 198112 199133 113266 -201342 -75469 -170777 -188115 194196 -81569 -118079 -106636
20975 -106636 143667 -118991 -25725 -207695 4697 -91166 -258450 -153567 96261 -307162
20964 -102561 75130 198404 -60236 -273064 -1576 -90662 -359615 4084 -190877 -134706 -207778
20953 -207778 -196232 191781 183638 201408 16391 98673 -146711 -83307 -228657 -115152 -77408
20942 -77408 -49208 91681 1928 -270437 106475 67427 208910 -260123 -112747 114927 61771
20931 61771 260046 -227475 504 -199235 -101359 -539270 44868 320993 -164555 -175323 -226225
20920 -226225 197898 -84295 58763 -197190 -72055 97385 -438476 -171739 -30286 -510482
20910 -510482 -138576 34845 -442180 -220354 18296 158052 -57529 177194 -192791 74366
20899 -71853 15141 47485 -85079 -74564 163985 70424 -137280 23160 -250348 -135829 -84722
20888 -84722 170763 -166775 -171742 56935 8185 -156312 -119449 -143264 -72417 97810 -75613
20876 -93075 -300390 -194717 33489 116716 -348282 57708 -137034 -60837 -222545 -38092 154206
20864 -363727 375483 95136 -274487 130761 193014 94514 -311381 308944 -82676 -5341 -174970
20853 -174970 -39529 -110817 -436125 -22678 -210117 -167676 -84080 -76024 11866 -227864 301252
20841 -80894 111529 -85033 433283 -221327 172298 -177078 36324 -36286 96430 63680 -63902
20829 -416007 238167 -283055 -397141 88961 -254571 -54597 241200 108138 -4645 44505
20818 31718 -304673 -104875 -174953 -103328 98828 915 -47636 -109895 -352741 -53738 293028
20806 125203 -79561 22744 159811 -114059 119730 3096 -181887 -23682 93016 -141759 -20434
20794 167803 61871 186174 -57122 224224 -270683 -90842 -61268 15487 -235890 73642 -38401
20782 -267614 -422998 -22512 17354 -14272 271586 -285616 -91153 208876 -30186 -3896 167360
20770 -417857 -51590 22316 -3665 -265699 207282 -155425 -143107 -226504 -203108 43079 -19712
20758 204650 -268655 117312 -86559 252592 -295925 -173035 181293 -182442 -181264 -206704
20748 -206704 66257 -245688 -11907 -120273 38415 52480 -99956 -234577 -42012 -134457 -45068
20736 -224061 -197401 108573 68133 343735 -71360 260846 235993 -129727 -18229 -93612 -127235
20725 -127235 -279652 -400808 -221533 159481 297120 72829 -443107 67909 -145955 116001
20714 -253135 37925 -133726 -160732 10925 -200888 -162960 -270629 -249340 -56393 -197201 108916
20702 215766 -33196 160446 -314800 -185931 -237800 16401 -228907 -92357 -60664 -90628 -115735
20691 -115735 -125621 152260 -178099 -168443 -265838 24180 -210384 69217 361989 -242362 87637
20679 153110 -58500 -359817 -187350 -4181 -182695 -235955 -311575 -200781 -190265 -161370 1587
20667 -44445 41569 181017 26561 31802 -212348 191875 82007 -146834 -245060 -15769 -57849
20656 -57849 8812 267528 -127087 18668 -252660 223280 -52035 -209746 -105199 85886 -128922
20644 -98652 -22084 -94381 -211329 -58484 73535 -140690 25986 -40408 115985 -312203 -201556
20633 -201556 78159 120547 -42510 139981 120148 28880 -131572 72266 41525 -188229 -86350
20621 -209934 -290279 -150368 3383 -261618 31157 -184298 47335 -127454 -75435 15955 -273934
20609 -164356 -127632 -18630 57732 427211 -10033 368446 -91907 -253846 -85462 -197123 150455
20597 -228987 8919 160795 -117765 -267616 -49391 -95168 -30604 -23991 202722 -3244 144119
20585 80491 68275 443184 166607 -49675 -129939 -103036 36892 46219 -18284 -9677 -183991
20574 -183991 42808 224743 118304 -55121 -40750 -339131 -121828 101366 68117 -165679
20563 188954 -39346 -43312 -16848 -3374 -314517 -58121 -177523 168350 -266235 -24698 -277750
20552 -277750 72113 163780 -335544 -168495 -56921 -377150 28325 -50734 -335230 -162743
20541 118632 -297626 -81755 162538 -83933 -105721 -369877 -261416 -224626 49286 -300398
20530 -305764 -9472 100689 -72193 416047 -423187 84796 203262 63969 105317 62167 182970
20519 182970 69984 3739 -39687 58446 -327093 -55544 -11016 -208355 267146 318534 -140852
20507 134828 131827 144648 -228403 -230382 60252 86875 379140 236351 -77210 68970 156183
20496 156183 -263680 -223353 7174 -79892 505371 -8256 310726 -285179 -308702 -200709 -75459
20484 16632 -74417 -137024 74765 -124627 -328656 -132528 -33959 122088 -214264 16140 146610
20473 146610 76137 -282523 -95500 -144015 140747 98423 -66745 -56169 -11339 -122021 80875
20461 464471 54179 112252 -82503 -28773 200783 -291986 65197 -266113 -309598 -152805 -19824
20449 -22436 -70086 33753 74962 -7589 -26480 -17645 75580 36087 240523 251561 -37625 20320
20436 -213620 -167378 139005 -210517 224506 -79464 -28981 117642 136139 138111 -84660 -168139
20425 -168139 -152871 -130892 -199600 -167482 209484 -427635 -126607 131148 -175732 220190
20414 -184442 -128451 -424161 -310622 -130252 592 -224520 -96604 -99239 71058 17913 185454
20403 185454 -265175 62499 -92801 -5606 -15714 95119 -299785 -26016 -131132 4394 -163281
20391 -49095 -70613 -43907 -76495 63394 -122739 -58069 235089 105259 -103210 -173079 120144
20379 -205781 102811 84282 -349917 -19391 138804 115515 -117287 -343728 170519 274722
20369 274722 -328907 857 122905 -133703 21134 -69661 -147420 157580 88093 -272950 -193945
20358 -193945 141570 -92848 -243211 -18498 -130132 -137918 -98331 -178542 -66588 19390 8132
20346 161693 -147618 -191776 191745 -303825 -51773 -63880 -186525 -31195 160958 100121
20336 100121 -132849 -20095 -187001 -202424 -24008 -108341 193165 175688 -143575 -291284
20326 -291284 5916 -6302 -98834 -223035 -1631 -79326 153343 116968 -276251 143250 68594
20314 -55182 -173030 255371 -251662 208103 -100883 -76720 142223 -203479 -114502 -92474
20304 -92474 97661 -224964 107100 293745 -226837 66400 6571 138267 191878 139152 115370
20293 115370 -283076 68375 -488615 -80884 -35308 92944 -199129 -64965 -338180 -425594 -58966
20281 120180 -76580 -245540 -111283 -104217 -77507 220310 -46316 -305171 434291 57025 -174742
20269 -366674 -161825 -156700 42214 -214874 -121465 -186432 8977 -23834 -164490 -207147 -57255
20257 -68444 -188448 -105408 -30668 -295241 -261369 191912 195242 -141635 -77286 -146340 265479
20245 41371 -401576 -35002 -228624 -146705 248454 -83643 -167901 -37503 -104319 -163063 51275
20233 -376851 -180642 12763 -145766 31011 -75750 -97770 -166199 -223419 230913 -51524 23243
20221 -147907 5964 -375194 -25690 -338144 -362695 -36882 97706 101773 92791 -98451 -270215
20210 -270215 -91393 -60349 -6979 60682 21580 286418 -32969 6438 12549 62602 -359944 -267539
20198 -267539 396127 -180208 178823 -466722 -41017 -42384 20002 112125 -196056 49006 -191389
20186 165790 -276108 -178721 86872 -33536 -252053 -298033 84806 -320087 -252478 -99791 -230521
20175 -230521 99745 -166654 167087 -219923 -11501 -32314 -420005 173422 -320264 188036
20164 88078 112984 106329 -155132 266187 -63964 67958 -36955 206643 -167939 4320 199086
20153 199086 -260388 -42344 85518 -311170 -75916 -153151 -274912 105703 48088 -21207 62277
20141 150801 3135 -172290 33911 -143305 -94626 -12381 12176 -149899 190110 -168484 136302
20129 -92261 -22888 -69755 244911 -101618 98294 -165170 -64656 -11489 17813 -196449 152359
20117 16727 -269640 -209643 -289353 -88175 -8003 -8327 -149216 -72376 159891 -24856 -143562
20106 -143562 79508 65999 -427937 145542 -63087 133659 122008 -88189 245118 50779 24924
20094 -40716 275899 304494 -173695 -166596 -37409 46930 -285155 8038 157890 -21967 -119685
20083 -119685 -13411 -18763 55270 60733 109348 -189279 -115195 6346 -81097 -223569 70696 -25633
20070 -209701 53151 -199566 26782 197758 -102131 64261 257908 198511 -102865 -44559
20059 -328021 -202293 487019 -80888 -369849 -463606 -260871 -124194 -93207 -39046 -221165
20049 -221165 -23846 -233135 -130485 -124243 -114967 -90585 -208071 127692 -296600 -404078 -242347
20038 -242347 -69106 -83272 -19494 99987 -248874 -233577 102756 -184219 73380 -46785 -100649
20027 -100649 184618 -46724 -258012 42835 -90462 128173 -17427 177986 -189902 -65910
20016 70627 -13320 -359762 94925 -148735 124993 -7148 26123 -47114 -159453 19420 3049
20004 -201275 -151760 -139262 -139150 50734 -333038 -111233 150802 15180 153397 57597 148709
19993 148709 24661 -232511 -138901 3964 -101312 -111261 75968 141421 24223 301633 -176846
19981 -127393 -329378 23516 -233282 22017 -128918 -243830 213518 -44800 -161678 -150105
19971 -150105 -29575 -111173 -86526 -54791 -63965 220387 132393 -183916 47040 298111 -189007
19959 -153515 -316363 94183 -155996 -118339 -119975 -38549 -131688 -107996 -259268 -268889 109907
19947 49916 41194 70942 41063 -387449 85533 -6901 150879 -163904 -196906 -69231 163726
19935 -66558 167027 58064 16151 -161748 -167348 -142725 -28161 51294 176668 -122368 -52578
19923 -189057 -275607 255534 166915 -328315 2822 150379 -278376 -31313 -109067 -253365 -371813
19912 -371813 28872 41731 14082 -156941 -255634 18785 -112145 118031 353906 159487
19901 155859 -273656 -280859 -34584 -425763 26220 -264923 -1026 112336 -2351 -169157 63707
19889 -12464 306848 24600 178761 -68359 -136027 304479 246525 -5037 -162836 -140359 175662
19877 91942 383742 -259355 3164 161431 -203483 7220 -221515 -75545 -57967 -241182 -113737
19865 -362769 -366811 141395 62581 -296077 -102793 -229975 167054 138220 -447400 -36665
19854 -57810 -83740 -183641 9008 -324239 316020 28474 -100733 137019 -72456 76675 -106956
19842 -114117 37731 -375174 -44624 49620 -200295 -61550 -71641 -80085 99501 33105 -228658
19830 -82605 -136823 -377123 -153073 130974 -49756 151481 -239260 -306374 32363 -174867
19819 -240590 -300313 -120488 -156467 32871 78123 -297366 23409 -72192 -96614 -133757 -161997
19808 -161997 19389 -128867 136095 -381809 -136350 -208854 75938 -136734 -1385 -205480
19798 -205480 -24496 20854 -275686 -62782 -113746 -110740 -309687 -322019 116909 145383 74944
19787 74944 -164865 -111124 -135953 209392 -24467 -257510 -341081 -27918 121461 -236779 -203386
19776 -203386 190280 185367 -10471 -20673 -174918 19179 -272561 60319 -74815 105745 -10636
19764 -62482 -373327 -110557 -237296 -273305 -403341 123645 -279100 -187631 -149124 -121137
19754 -121137 -313495 11252 143623 -24939 -77214 -99753 -71038 -56188 -271501 -5213 191703
19742 88350 6986 -210969 -76848 -162842 -99725 -27994 -65870 139464 185125 237631 120516
19731 120516 186701 -326749 -30175 -107935 109386 -40699 -257450 10924 269684 160268
19721 160268 168684 281198 82115 -173882 -95225 -118540 -21609 -190375 6163 -423585 -153981
19709 -10057 -177960 109765 -234745 -286422 -6183 -19317 -112597 357547 147581 -208029 -120030
19698 -120030 114262 -135883 -67215 -166831 -81543 -56802 254826 26283 -11730 -74914 -135375
19687 -135375 -134518 -163007 158832 -8192 -57779 45866 -185904 -46833 126409 -109597 113991
19675 191688 -108060 -115581 204299 365119 -225683 100816 -222340 212202 90210 13522
19664 51702 113023 -140565 105092 -117300 -234857 35030 -214399 4738 -206114 297390
19653 136817 -202572 260151 -163527 92738 -238569 -239254 -60893 303693 -51437 -304579 162556
19641 -199569 -64313 -62314 -91457 96379 9079 159196 58353 86028 -111920 -238160 -53565
19629 118625 -1538 -58253 -503821 30820 -242713 -10358 -69915 128363 219739 52278 -111968
19617 -65956 132516 35882 145639 112253 -112239 -182354 -140742 4913 -174601 -30564 -20113
19606 -20113 -211933 -166572 167876 -249247 -37904 206756 15004 -70813 -20984 -230327 337554
19594 -287781 -342633 -114610 -77003 24742 -123262 145691 17761 200951 53656 -461923
19583 -280909 240441 -110045 -18113 -35801 -201882 33598 -101912 5160 114708 -21175 -168271
19572 -168271 149777 162687 20806 60471 -310780 104214 271502 -280515 -73513 -119640
19562 -119640 -31687 -97112 -78317 61037 52023 -25913 21416 174996 -2323 7159 -198639 1450
19549 34296 -49690 -514262 -87971 -120085 -112575 179802 191286 -37970 -377441 -187980 165687
19537 18491 -128486 -26518 -96332 -3763 138786 -92896 -183955 141681 -322261 38789 -262191
19525 -221972 -395 18854 -88939 -74224 -389344 -683 -237532 -70630 -54236 -272470 -64099 -49190
19513 -49190 2422 52 373245 -235456 271499 -118723 -43094 198815 65434 -84958 -60532
19502 -60532 86913 -170090 -311065 -229380 -151199 -41241 116195 -9370 34543 -117719 17929
19490 -214602 -13982 6306 1480 -154971 -120118 -75566 -103823 47128 206757 -59536 -103906
19479 -103906 307692 -84042 -268066 84337 -260232 91338 -90727 -204221 -344228 40280
19468 -98435 -299342 -202224 54764 11546 70202 40818 82304 -105813 68409 -221399 194445
19456 -114032 37696 142597 -318311 -46567 -74758 -168222 -174840 58861 -535135 -533787 -47226
19444 -82992 -6211 -255067 -342664 -241398 -269905 -118040 20294 -180531 50615 34402 -60055
19432 43184 119220 -408150 81033 213979 -4377 -98682 181222 -257555 -129980 -136781 259717
19420 -293869 -99181 -84500 193817 -130169 -77111 -357219 -337130 261804 -188199 -74464
19409 -307598 -33284 31955 -87311 -129094 -146069 -367705 127949 -92714 -481971 -100850 149340
19397 -251302 -218910 -6050 -316955 -15220 17119 -94678 59220 368366 -328230 39877 214016
19386 214016 -247008 -132467 178052 -111373 298976 -181244 6133 -236685 59058 31221
19376 31221 434439 267238 121743 134574 -88355 34963 -60460 83940 -142674 -189861 -228794
19365 -228794 56516 -27795 164911 76650 -147971 72094 18772 -194613 163535 -21720 -1269
19353 -161465 -96932 -182362 10761 211373 -115899 -231772 16911 -317210 -163261 -108000
19343 -108000 384642 65182 -218941 22628 4364 244228 -206606 -167981 6998 66357 29274
19331 -10613 -133379 -61273 -216258 -29379 -181279 32854 5537 -23830 40043 48790 97150
19320 97150 71994 51032 -15555 5663 256882 -176903 17522 179332 -260932 -157376 -55269
19308 -313353 -49798 -146719 -301450 116200 -169549 -146403 -145813 -336384 -182975 74656 -178478
19296 52792 24417 -25092 -257986 -331002 -322772 -123780 -193154 66922 -51753 3730 -35151 -240405
19284 -240405 72261 -62505 -137797 -22883 -347205 -124093 -107294 -184851 -32170 -150691 -139601
19273 -139601 141695 268942 43350 35272 -103408 12471 -252171 -57302 87039 -264827 59407
19261 -322815 -100414 -51847 155374 -25436 75748 -49466 -243336 -191606 -14631 206333 -141062
19249 20438 91114 -174292 -72375 -136625 -25629 -344105 -237677 39403 147284 147152 -31203
19237 -25737 -43813 20052 -52699 -124281 31332 -169727 73229 -15918 1236 404227 48789
19225 -139862 -82947 -74758 343046 -321659 244263 42558 -155975 -162491 18344 288954 -27704
19213 66330 236 218767 5077 -278940 -80072 180962 189317 -308223 4262 -2432 96957 -341863
19200 26770 -294132 -77031 -127331 83626 29722 -383650 35036 73163 159234 -21444 46612
19188 -331595 184204 -201509 134380 -184122 -319271 -253149 91378 -448454 126403 89173
19178 89173 20018 -126109 84801 -114015 63052 2114 -98248 -103415 -172676 -204823 126069
19166 -170402 -134121 -153627 17843 -214947 41821 -91749 -286916 -254876 -287151 37253 -157518
19154 99003 -198513 15655 200556 -5798 -20397 -36610 -76843 31261 -287 255133 92296 -100253
19141 -307209 263130 -132478 -134257 -35447 -333503 77848 -218638 -19933 -109595 -139447 -38991
19129 421301 71675 221679 -150732 -105064 52789 -359307 224750 112178 -217490 44568
19118 38522 -154320 -75120 -312062 -186086 36134 408963 -75662 -195306 -493818 -177404
19107 -57070 -144944 -143905 -86832 -6420 -282805 -254974 -58255 92190 110325 -96903 -202034 -242051
19095 -242051 -297731 -56522 -384645 -125127 79757 174470 -99758 -225743 -61457 172580 -23050
19083 101181 -39293 89482 -184273 -20161 -246427 -246107 188905 1565 -400966 -262589 113088
19071 -106314 -227948 111091 -52555 -79784 -158136 -85783 122926 -123761 -67184 -24489 -349799
19060 -349799 -274909 313353 -291184 -90153 65907 -148502 -19982 160446 -245555 -233482
19050 -233482 -3030 -251705 231679 -186593 -31089 -166882 23979 -52941 125321 -82574 -245001
19039 -245001 -63639 -260298 244131 -210588 80089 36259 303497 -261661 -181010 -306046
19029 -306046 95419 27997 100072 19903 130933 203071 213928 140604 -24192 137208 -15913
19017 165264 42455 215549 243764 79857 -101799 -193774 135289 -166354 222926 -33133
19006 -58358 -167855 338111 137495 -36821 -183308 -212257 137058 -170931 -241127 -103273
18995 -275169 -59730 27079 -186678 95990 66436 177505 165205 160654 -284092 111642 -58395
18983 -188555 63057 -250975 -218713 -189088 298716 132758 -120257 -219146 -27431 -349759
18973 -349759 -63357 -48477 -318100 16303 -187681 -74009 -102403 -52914 206629 57710 146833
18962 146833 -87143 -111234 33085 -171157 71566 -114435 -46090 84173 -65830 -201878 358152
18950 6004 80848 -219936 -179326 -237372 72098 -151842 -7083 33348 -189670 -238612 -13617
18938 -49276 -256948 173784 -211798 -194388 -248819 -14447 -179016 -187881 -71815 -383253 83836
18926 -30739 264579 34805 -19290 61772 -17535 -320016 257291 112822 113768 -289933 202355
18914 -49722 135257 -156578 -86287 -37414 -322136 -265821 287087 4391 -485756 -87718 -339784
18903 -339784 -109603 -33967 -42830 87638 130034 62005 -229100 -287137 83118 112363 -161752
18891 45494 -229755 122614 -201135 94932 -26352 242706 -47833 -286427 -234695 -56006 165225
18879 -13168 180033 56924 44894 54055 266376 -42299 49210 -1482 106837 -6258 -153502
18868 -153502 -36716 215015 -214705 14110 -168430 28291 -157657 34992 120511 -128594
18857 -102031 -178924 -200689 61087 -144874 -21826 -224989 86002 171742 -353799 284938 -62688
18845 58716 -29040 -47436 -203419 -207321 136364 258369 -210846 139382 113038 173781 -544327
18833 -274530 -123594 91952 -285091 -83952 -119878 -233297 -39957 92513 7195 -94088 -188092
18822 -188092 320747 93018 132373 -51916 52815 -13630 -60160 319559 -118571 -27342 -16119
18811 -16119 348878 54843 196493 -36761 283120 116199 267247 46349 -56922 -318420
18801 -318420 -246385 -8271 62618 238208 96267 133236 -161542 6126 206647 -15396 24503
18789 226467 134381 -34245 13033 -30706 50906 75605 -69763 -286221 163953 222239 -64955
18777 -46265 -382845 -79813 -112714 -175151 295725 -13226 232395 -233000 -95207 -112165 -391176
18766 -391176 86598 58375 -129994 -255057 -104505 191116 49357 16055 79111 -81218 -85192
18755 -85192 -383792 -138006 46005 -253068 -580240 -17409 -42262 -180718 -478810 87052
18744 -279327 -532880 111452 260496 5580 -39726 -301377 -242663 -86371 -83764 32044 46503
18733 46503 -92718 28153 54138 -313178 188785 89038 -204486 -97369 -175781 229777 -213418
18721 -22938 191570 -744 -120 -304998 127739 310037 -59148 23707 -154674 -325135 -96456
18709 239045 -186304 -41191 -179362 -292757 93173 126775 -273881 86417 339975 -214412
18698 -85041 -184110 65116 -371840 -322232 -294494 -293540 4983 22061 -70389 -21610 191358 -135857
18685 40286 132129 -144018 -267478 -239884 -146542 61284 -22729 -339357 -218648 95153 96659
18674 96659 -114322 219021 -89451 -307342 -91675 -190418 262266 -256524 -206524 -51671 -538261
18663 -538261 15064 -208084 142012 110896 -186304 -332577 -310176 52274 146088 -192647
18652 -19592 -70648 -147656 -19063 -44396 -207636 -420400 344824 8443 31150 -141121 -37770
18640 113053 126270 -267104 185074 -51859 -74631 -204838 137180 -255548 -97089 110430
18629 34463 -26305 24292 -5929 -4420 44338 -187783 -44449 163760 -287172 -145805 -114929
18618 -114929 -152606 74262 -100880 -164980 59895 80663 -113903 71159 54974 -277727 -195704
18607 -195704 -303247 -465709 -140784 -120107 56788 53827 1722 -34646 -43610 -93067 -175712
18596 -175712 149673 -172964 80741 3518 104723 -186795 -117368 -222180 72369 -369962
18585 -86577 -163761 34440 157293 -106190 -362542 50305 -186637 191744 -12887 223986
18574 27474 203777 179531 -121250 -147623 -77315 39266 191845 20440 -368403 188610 223111
18563 223111 -276102 -86020 -76315 -10162 41161 126622 181672 152474 -67554 -22336 -237740
18552 -237740 -322129 28794 -203432 -61667 278595 127942 -11768 -88344 -208906 9934 325576
18541 325576 -356054 145864 -128700 -78590 -261244 -248486 213073 72012 128221 -121840
18530 239577 135999 -11695 255796 -86008 64501 228218 -122011 12913 405418 -219098
18519 118241 -163663 -334597 -81315 -360449 53608 -228916 -183725 -166198 -82316 216123
18508 -276964 -125769 -80150 -313949 -14262 -31761 25048 -281697 -366616 -140231 -49822 -99199
18497 -99199 -53048 -224004 -133364 134920 -245505 -374771 -206216 -249331 291566 -468582
18486 -239429 -304714 -221113 217697 -605107 304662 137387 155033 -122660 -273562 -95732
18475 71410 -269736 7645 -43035 -223656 -91891 316235 -23102 -126075 -87847 236145 -156982
18463 269371 -9535 -237040 -422307 -329864 -133559 185037 56308 -35404 -203278 -294834 260788
18451 -34363 -183022 -224899 -102164 9211 -153109 158388 -110000 -182304 182825 -258507
18440 101532 204908 273444 -114990 87738 -153111 -160008 69141 -93047 -136355 76384 -204793
18428 63629 -170818 -70328 143978 72819 -4026 -70107 252462 -58256 217824 -206531 -276060
18417 -276060 202730 -63991 103460 -56077 78726 113809 188498 -286645 58980 -385711 139250
18405 105384 -245293 -235818 127972 142129 19126 -6145 26899 134063 -385562 223762 -77459
18393 -33553 -115953 68862 -63856 -93228 -142682 -87652 285911 64286 167850 -283723 -39605
18381 -212554 -101142 -47678 -231548 261712 -194481 -240849 331910 -383325 44633 45722
18371 45722 44624 144028 -517338 -39553 59026 -140991 82018 205602 -106014 226529 -226291
18359 200242 62850 255464 361804 -295915 63448 -171597 -4206 111410 61422 32773 -30095
18347 128074 -26817 163391 47782 -218431 131825 158223 293062 -190799 59535 14194
18336 34524 -80017 9057 -146069 -44047 -215087 -128694 163309 -230150 -211709 280164 -1495
18324 -21859 101063 555 13091 -183274 155813 -74830 -82312 -222660 92795 -233618 -85314
18312 -5201 -76190 66827 191300 -578 25544 103008 35889 19369 48783 -209526 -229831 43660
18299 177987 82981 -247750 -199170 -15071 -145421 -219916 -90623 326386 678 -195465 140295
18287 -52641 -256715 265592 127826 -228036 -397574 138347 251857 122641 -230203 -151851
18277 -151851 -75634 -205739 80497 -126531 20368 114747 83895 -85008 -19091 -185826 -256482
18266 -256482 52163 -7513 -150371 -140063 -181017 112754 -129277 117830 51296 -72727 -14846
18254 5698 -306341 -340647 -92287 11632 72722 -38617 56556 -7990 100403 65675 139783 -67139
18241 89917 163260 -329710 -35272 -216021 -18715 -499933 -163387 -120405 -452470 1958 -287606
18229 319908 100328 -221834 -225587 204533 -93806 -65735 90592 -116524 -200834 -135438 -76926
18218 -76926 341191 144831 318069 80088 -330010 -275078 -21516 -324559 -233988 -113 18477
18206 130841 28557 23696 -24423 -35240 -98493 -254947 -51358 -289619 -317235 -126315 159072
18194 -191511 252471 -36194 -11062 -113277 -136199 73879 -223 -84480 75280 -212322 34914
18182 145135 -247270 49009 644 -183014 -188094 -141137 -161880 -265149 -57352 269914 -118210
18170 48209 32367 62089 221960 -159959 -266145 -223745 178800 -45871 -35423 -40673 -102539
18159 -102539 -96841 310661 -259998 115564 -12822 -217855 155405 -75141 8325 -50838 27669
18147 -124428 -202921 -250681 27511 50131 -95452 -376508 -64946 84551 74878 130497 105260
18136 105260 -178792 39723 95465 -103719 96873 -236144 8483 -298275 -107203 142660
18125 64218 -208411 113382 -233180 246079 73078 348040 -18756 263671 58318 180644
18115 180644 152723 -66995 24593 -353084 68725 89939 -46123 -75414 126121 -287660 -65173
18103 11944 -82090 -314707 203259 71412 -207699 -40058 107902 7097 -76546 150727 -151925
18091 209322 -262832 242478 -95912 120697 -118509 -133787 -181504 -231395 -258125 -28888 29422
18079 -178838 294357 127653 -166579 103100 152816 44684 27572 -196528 -17260 -137103
18069 -137103 178841 -106340 -205742 -28491 -51540 151127 -138954 -109692 -8305 -100987 103987
18057 422793 6387 -212 182734 -182581 -20774 -165987 6620 -362929 -7220 -306596 63952
18045 -255530 -193106 151714 -313252 -81962 108155 38200 264254 136201 -74194 146548
18034 44353 -105609 -195141 137950 292389 -265990 -36820 153239 209771 165273 158743 285074
18023 285074 5238 -235836 157890 -234 -58178 209611 -88404 -127259 -162228 105395 61412
18012 61412 -63543 23178 -71186 354937 -232237 24600 -12071 -89800 -37859 -520185 -416337
18001 -416337 -291643 -232572 65672 189260 -307146 3916 -105575 -81012 88776 -66657 -127199
17990 -127199 180646 68400 -84137 234115 -268279 53692 -183757 22927 -49111 196243
17979 -7211 -11208 239843 -193164 218461 5005 263370 119710 -113109 -421906 22905 -27995
17967 20270 -282741 343711 72306 14591 20058 192080 55421 -163630 -135212 243773 -326061
17955 430333 -207712 201508 -97383 47336 93742 -157188 155835 -74877 4772 38437 153526
17944 153526 -301356 41156 -174949 234417 180224 131557 73043 -41046 -9117 2952 -62871
17932 166155 310732 90537 -355422 29188 -162521 -150928 -319818 -98348 -244309 27528
17921 -57231 134690 -401713 -162768 -189138 101685 88606 -50995 219736 -405435 -527955
17911 -527955 161834 163255 -170612 108304 108130 71597 27392 334068 116645 -300649 -308511
17900 -308511 29493 58340 -80530 205829 -148209 71496 52091 118578 163682 -72912 -140410
17889 -140410 73336 -252537 -35849 275064 -279407 226161 222068 337803 -40765 177977
17878 95060 121851 -67692 -41478 -88533 -61461 -154463 -396709 272476 -118714 -158240 -116939
17867 -116939 61188 227472 183625 -155335 -320328 -229334 -382658 95992 47375 -346300
17856 -110520 -164310 -187056 -173268 -58495 105564 91133 270738 233857 -463313 162371 -14391
17844 -66952 140150 -217325 -227794 -30725 26531 -25214 -315582 -126445 -162793 -83109 -60182
17833 -60182 -167833 66558 397396 1517 44415 49448 184426 54011 -124524 212054 152214
17822 152214 -23884 -482685 16639 -53941 92847 197063 -167353 -98573 69369 -156569 -59496
17810 141988 8417 239278 67194 -68051 -81171 259071 246358 98664 -12993 -87970 -123244
17799 -123244 -486081 138823 -39316 -199847 -142951 -2686 -91664 -109469 -17236 -138078 120205
17787 2098 143488 91083 26378 94773 -140944 -236435 132982 40729 3061 -89563 -200541
17776 -200541 57501 170859 -35609 -121700 229847 -74647 10348 122651 9162 245664 -42087
17764 -35340 131944 -161823 106768 -70838 -500028 133811 86817 -297380 -4223 323348
17753 137640 -35780 44533 -240936 31081 310968 -42194 342960 152014 -204760 -311718
17743 -311718 190855 -176429 -7534 -117470 -182783 -144566 -212760 67918 372791 -362228 -238738
17732 -238738 245993 -549982 -414752 -129047 277391 79737 138615 -129467 38742 318835
17722 318835 -175078 -354099 -20249 -156670 220923 147647 34193 230502 69546 120122
17712 120122 -164885 -134399 -249763 52909 99600 -95908 -142820 161388 -213953 -291911 -347256
17701 -347256 -140622 -45022 -71764 450142 -15320 -158770 150620 -186859 -50836 -104255
17691 -104255 -34203 14390 154017 247570 106178 -156742 321120 -159590 174613 -103452
17680 25050 37625 247612 101895 225471 7219 119717 106548 118929 -36633 314472 259834
17669 259834 -57443 310595 -152631 204227 -23053 139575 -13768 187879 282003 -333545
17658 -309724 64750 112639 106709 -258317 -4450 22840 -3932 -25540 -121126 68317 88068 -23580
17645 360573 370963 85087 -157624 -63082 -25980 210645 256977 178681 149033 -321537 279507
17633 -160140 112137 85582 -64934 130354 -20035 -36900 -371971 -99123 380319 11246 162456
17622 162456 306249 -227645 -100972 -192320 -52771 111604 89119 119648 -112523 -126164
17612 -126164 -4295 -44543 -199674 -290073 -211696 -159259 -100393 -58687 -73806 136715 183188
17601 183188 -92925 78606 88199 128265 34773 -548355 10134 -40742 34259 -193465 83254
17589 106953 73157 6305 129242 188274 305347 -137788 258439 -33731 106150 -39918 -145629
17578 -145629 186988 39708 -249719 -366024 356596 308848 70662 -213823 313028 174453
17568 174453 333091 -108932 9756 58223 235367 -96652 192241 181091 -194542 -56534 -23537
17556 110911 -154468 -7163 64345 243781 -64347 98200 -106735 -42292 -179432 377354 209512
17545 209512 11902 222511 3589 384642 298423 373784 218276 163840 39632 277031 19738
17533 319854 -64506 -697 -27811 100848 192669 266342 118715 -79244 374063 15815 111309
17522 111309 47013 -223406 133174 130625 408030 135739 -99223 163720 201369 56532 23731
17510 45837 153203 230790 -160686 -212186 96410 14649 10966 189434 72108 22915 392 -231783
17497 -58020 346624 166050 462794 148676 111879 -2041 358253 12551 223741 25171 -120248
17485 -56335 206680 269995 340944 255304 -64932 207187 455570 234349 105975 89481 261494
17474 261494 -172625 -122087 260570 -358712 134171 -75767 205945 67049 -9965 20116 39318
17463 39318 242052 132345 170908 -184911 -24490 124154 374079 298650 287724 131655
17452 -129382 262842 163281 289890 481390 357467 475266 292269 218865 191599 225438
17442 225438 325152 116 18531 475544 341546 103465 322067 86512 102092 -70225 176495
17430 -28807 273406 402913 790207 223202 477620 140377 53229 1545 299392 38753
17419 299109 34661 -71625 -22801 149370 449872 236767 54256 126290 26077 201260 184882
17408 184882 161735 238182 403986 115366 -96529 202772 114817 388391 352423 -257618
17397 330215 -28288 252592 -214640 -3021 -37241 141847 130578 119895 500484 141842 -64383
17385 334998 105832 121334 750279 276191 50639 248738 302427 8580 3165 382587 -188848
17373 231133 730675 52908 87681 280429 196689 67521 -85412 -50390 150747 140625 162678
17362 162678 -9317 100223 485078 50643 -29621 324351 35206 3537 251352 313326 110584
17350 141031 61225 325830 129606 390995 138732 -106948 95597 410930 26477 379064
17340 379064 49170 208978 5601 35853 -26809 -31797 -49630 185553 241972 243727 303798 191957
17328 191957 206122 -47905 64994 63922 123520 311694 -141787 449677 283398 -94189 323089
17316 197478 81639 178647 -31498 -37278 -88537 261878 63149 290171 233533 53098 307526
17305 307526 200432 246592 60325 111783 -369463 233243 137423 -32277 193432 190363 -108436
17293 189624 79933 -282970 296936 -160222 126949 -58052 56654 177841 331751 155816
17282 211197 600754 34520 -2256 71782 -102915 137177 145923 241306 154008 221968 294693
17271 294693 137062 -30039 -155602 104721 25537 232737 152385 -19102 78596 121687 -145614
17259 335719 216097 63419 123640 300595 84269 245043 -212612 330300 -142115 223538
17248 -95645 -19426 244597 445882 -196872 377826 270561 304561 -116467 105077 148726
17238 148726 197883 379854 390269 285062 95039 116324 161635 389482 300605 399737 242837
17227 242837 -17398 62481 -1995 273075 1582 376580 199785 308806 166681 552541 270672
17215 -38951 235086 251502 578675 200004 224765 209421 164086 32609 32366 343300 130091
17203 229302 165529 167248 32920 312470 174846 237507 324536 344296 434830 373362 185556
17191 190488 251283 234000 261030 307251 121914 89138 472629 81223 218426 456693 564485
17180 564485 163906 281843 188878 267601 360398 552275 157465 195197 271897 328922 126200
17168 402463 343751 80932 309068 134246 156020 254694 287643 335786 460320 552867 393363
17157 393363 307410 129860 268314 260396 554104 194971 464705 345921 -4718 236287
17146 -7197 67268 -12713 320788 413645 266683 291875 302995 436222 72747 714340 567540
17135 567540 280784 562358 34789 424928 258368 226487 200864 322527 364976 -137044
17124 380844 160161 233808 202470 485821 338153 534533 247072 284693 232555 290007
17114 290007 240273 409274 306032 703306 470637 929362 498127 403813 493460 494514
17104 494514 356219 307644 557985 475274 417380 74128 268418 350105 277616 826364 176155
17092 519149 197158 339733 582614 610313 594695 540977 370807 549277 103600 617742
17082 617742 526277 302900 559779 307449 607521 557433 286466 278119 383568 579015
17072 579015 328897 528793 477876 617419 155870 516822 449859 -34744 630582 471282
17062 471282 488583 608871 555115 753715 494237 449259 535707 478157 640727 760955
17052 760955 364166 603241 625642 241840 362720 607508 169773 403420 174027 545337
17042 545337 257207 120532 466715 796251 900761 571574 545903 585088 595362 500559
17032 500559 383757 597196 611897 938147 675538 804430 721320 423953 681392 262469
17021 295492 595609 762994 725553 527654 934293 714617 560393 636115 442006 588328
17011 588328 552060 864175 557407 506033 545401 340766 779686 741998 773315 844361 685159
17000 685159 663073 506378 596350 898069 729469 863840 745572 504104 770939 1091790
16990 1091790 516081 766008 766998 532368 826281 1089018 761314 944317 973995 890691
16980 890691 897016 598817 543103 897640 425549 1051295 945006 999873 919470 917771 847004
16969 847004 972652 1080002 726649 787814 690430 1088495 1059355 795358 818175 664435
16959 664435 1021200 1010281 1235351 719660 1250184 1000172 1016188 1061497 893395 1036810
16949 1036810 1297183 1163474 1145230 1267427 1048088 1314120 1105065 927520 1217356 1213942
16939 1213942 1257166 1197642 1115171 1422943 1156443 1190475 1209151 1485202 1447069 1358093 1342412
16928 1342412 1352395 1193120 1375033 1521373 1188970 1622568 1642626 1175302 1332256 1347359
16918 1347359 1709055 1457907 1217523 1541692 1697639 1554787 1720568 1437105 1217801
16909 1217801 1518398 1657934 1618022 1717606 2059978 1680589 1602486 1814431 1837590 1467670
16899 1467670 1519881 1687572 1685290 1572944 1612373 1734824 1686451 1862125 1635501 1928212
16889 1928212 1928922 1707712 1971786 2100013 2094619 1947902 2045936 2113267 2111327 2175425 2168444
16878 2168444 2204826 2178606 2371531 2568903 2347775 2628970 2247288 2427894 2960900 2687584
16868 2687584 2524538 2418573 2581718 2376661 2749989 2791649 2577613 2966085 2844707 2963281
16858 2963281 2825271 2931192 2681568 2902985 3108826 2989971 3225918 3421026 3538741
16849 3538741 3401156 2884749 3488989 3146100 3797064 3616190 3741161 3875152 3815465 3731718
16839 3731718 3888661 4196998 4008350 3896364 4207825 3976955 4369876 4197437 4321507
16830 4321507 4590719 4823187 4453190 4794135 4755581 4859706 4833008 4988386 5061666 5074340
16820 5074340 5420721 5418857 5377495 5632552 5496988 5691135 6049727 5805437 6344133 6259487
16810 6259487 6364726 6399972 6798147 6772543 6899596 6893107 7279515 7399927 7775117 7770306
16800 7770306 7757202 8237345 7991561 8555419 8677021 9224052 9398786 9415233 9378120 9787178
16790 9787178 10063655 10516383 10409370 11106939 11375646 11621759 11762207 12219000 12831909
16781 12831909 12985663 13324817 13762620 14420853 14395540 15124531 15218032 16041297 16679549 17313850
16771 17313850 17579514 18355616 19045009 19715834 20097809 21418356 21992856 22478348 23757311
16762 23757311 24835300 25222850 26624933 27722569 28909978 30076713 31165450 33089479
16754 33089479 34330479 35755540 37885751 39449615 41340743 43097361 45492955 47769885
16746 47769885 50378178 52735769 56215898 58687384 62163470 65376400 69569073 73030842
16738 73030842 77934738 82110356 87158528 92176851 97464038 103563618 109679390 116131410
16730 116131410 122717929 129775864 136646467 144312858 151290023 158418640 165292141 171764851
16722 171764851 177781940 182843290 187156091 190106020 192032469 193107002 192122481 190567402
16714 190567402 187524546 183665632 178117271 172531591 166035256 159479388 152062665 144527550
16706 144527550 137215932 130248252 122879707 115895679 109108451 102902036 96766119 91029809
16698 91029809 85653785 80845970 75972185 71654034 67644936 63560158 60224555 56989406
16690 56989406 53901146 51187117 48385821 45734163 43246955 41441894 39241783 37495068
16682 37495068 36023216 33948435 32631406 31036902 29587210 28615312 27072478 25874967
16674 25874967 25089159 24243527 23319279 22109610 21362912 20592738 19639479 19248863 18191128
16665 18191128 17982427 17427269 16516575 15663985 15559769 14879658 14520752 13759184 13648226
16656 13648226 13031475 12733001 12682430 11879130 11346164 11414015 10771944 10657003 10236883 9842040
16646 9842040 9966645 9498784 9223688 9276395 8759005 8870587 8144672 8178691 7789551 7691778
16636 7691778 7545441 7359502 7406697 6681741 6776549 6593060 6416821 6377981 6225963 5976357
16626 5976357 5803988 5683177 5613275 5467900 5614228 5640357 5080949 5144669 4933681 4814980
16616 4814980 4865771 4685274 4497795 4750705 4504468 4574987 4158027 4351652 4352703 4021222
16606 4021222 3927130 3755277 3759273 3552923 3678072 3527390 3314010 3079032 3045539 3020565
16596 3020565 3140629 3318157 2994789 3149991 2928386 3107798 2874955 2986921 2771124
16587 2771124 2697194 2643703 2541408 2686132 2719074 2691251 2454926 2145655 2471305 2232540
16577 2232540 2072113 2438669 2619615 2001598 2039708 2343103 1924404 2036301 2204635 1941382
16567 1941382 1961110 2021696 1556474 1863889 2049188 1755297 1964317 1759201 1583910 1904114
16557 1904114 1679411 1767771 1979979 1573760 1770754 1680859 1820346 1458925 1589648 1338897
16547 1338897 1630505 1467941 1362567 1573665 1491622 1237083 1713422 1224041 1292958 1550027
16537 1550027 1521494 1157899 1078590 1262650 1171949 1127581 1332161 1179675 1190590 1336081
16527 1336081 1568049 1291848 1367023 1097338 1238044 950626 885618 935102 1111055 938570
16517 938570 1151777 919380 1180109 1213898 1105863 817017 775231 943514 649404 998782
16507 998782 1157317 1248058 1230755 816697 1028900 834936 1035469 627493 673688 630997
16497 630997 860433 851295 783117 853509 1007718 693665 635033 849995 937317 722648 855200
16486 855200 567237 688921 523552 525569 501247 907722 994789 414124 601978 705589
16476 705589 804186 689663 738341 802943 667242 404717 696834 635911 522249 836004
16466 836004 1005676 611120 574743 529414 618101 630433 410961 741086 627458 609859
16456 609859 593804 389128 536344 399310 911915 357247 407094 651722 484065 506834
16446 506834 466566 419809 406500 590301 456281 276039 26681 760160 449424 461604
16436 461604 639369 455042 468562 510022 720525 653259 594995 332922 515590 438834
16426 438834 87034 450112 242128 406126 352712 475645 492464 294739 474337 159000
16415 673972 487750 332646 410423 379348 323662 157114 314566 521732 418941 472090
16405 472090 53093 215841 561821 328265 478961 228028 327334 96489 533947 228839
16394 333989 308863 604834 158801 212776 437389 236697 376320 656522 259223 25485
16383 265599 447424 166483 84833 634547 299382 93580 297164 104918 324268 65283
16372 652281 584712 421993 172335 169463 190710 309825 391227 391024 239751 323964 280300
16361 280300 277772 528973 89361 47320 721984 576774 46981 468427 188188 232122 65433
16349 642387 43558 294458 61603 231130 250157 340998 30416 396056 243995 105477
16338 116772 565487 321714 180424 -67593 238445 454926 31184 81854 -67358 -286872
16328 -286872 144879 378024 182398 275615 817641 82611 37041 188077 174854 2953 436234
16317 436234 231091 -271206 17979 202343 212088 162281 59596 -51783 522045 -291601 -52033
16305 118010 -281241 684817 206626 238724 47532 -232636 55563 -88567 17371 357071
16295 357071 -230751 123315 37610 440733 150231 229000 -154553 107053 219759 82785
16284 64407 234604 61819 -171018 238626 189202 305550 555045 -241813 196301 176830
16274 176830 96022 39729 336863 19772 -64554 -152269 55507 86153 229616 28433 134144
16263 134144 47070 56112 -217251 141863 126798 -264874 -120041 150509 -68848 336840
16252 94105 19787 62966 221874 275575 -51833 -60903 236491 -355768 101184 -317262 -81559
16240 351752 247046 -49031 64458 63573 1314 83783 -63409 -95870 -141224 167203 -170048
16228 -49368 -75630 -203620 -81515 -2295 116711 224199 -82941 87555 -27163 345042 -138869
16216 83509 -50500 34022 -186784 -52533 -18830 77725 -379936 -272607 -21409 52978 -24521
16204 119030 212423 148434 -177152 -121366 41506 -122846 144787 -103636 230717 -47503
16193 364721 -350214 -100404 282851 151817 366956 -31003 287699 389337 55455 -149411
16182 144876 -196989 149433 278808 233752 260337 387332 35699 -40659 89216 83479 156223
16171 156223 -30659 79791 167663 -67307 -135014 -126603 94393 172630 71868 -370 293750 115763
16158 -98358 18187 -13803 7156 -59124 -132274 161576 46875 104049 7098 129345 -153557
16146 -45276 -87823 -91141 -12642 -272769 -104554 -107196 139011 195989 4373 222440 -179567
16134 -20036 88665 12107 53923 20841 190047 29823 -41879 -254435 421150 160234 -93745
16122 129487 -115777 -89759 -187568 -714 -79315 30260 -301195 -129580 86229 61140 199361
16111 199361 160345 -20841 66206 -161559 -1329 175958 -23581 300814 169282 426373 85806
16099 199384 487171 280475 -22804 -150238 -46820 -88197 188904 -48267 -197582 167867
16088 -142259 -101182 194230 108803 -21951 -67451 -262562 142453 -231098 -53237 137063
16077 84365 -211570 74018 -277310 -161136 -229865 -52147 43418 -148889 23817 244502 125295
16066 125295 25931 89240 -15448 -271200 212859 -238336 -187046 165794 85155 -127627
16055 -23790 23715 -71865 216370 385889 100600 -161259 367787 -165089 -48853 85985
16044 -177995 -188457 -30656 -40251 -34510 102827 -202652 -3044 242905 -313491 184449 32507
16032 -280490 -283877 -34722 -78704 54784 -105721 74128 -130362 -156131 -117922 -151976 -415849
16021 -415849 -334389 137667 -199682 -166051 -93966 223942 -270356 -9088 71836 53600 -165214
16009 48055 -188593 298621 -137538 86326 -339079 337029 -237741 -158294 160230 -304519
15998 94252 110870 -68253 -97611 -363913 -21580 79455 270402 -389025 -34706 165268 273703
15987 273703 -2084 68398 416835 554548 451812 255073 391246 267692 256667 -156619
15976 59513 -131719 -67241 -84239 -79929 25742 -201210 -52237 502400 -36322 76942 188088
15965 188088 72033 185137 -169251 -230317 412379 -127031 8045 -192628 91207 -229584
15954 -227124 221029 -145010 -147088 -11139 52834 -98929 -339933 -181190 -67363 -74441 -8601
15942 -179452 23810 -289480 249498 106490 -33492 -47143 -349046 109010 67004 -46114
15931 106891 -212467 209706 -313548 -277878 -216977 -105442 -49548 -472586 -332843 -193765
15921 -193765 -127745 -238520 -8298 -25764 64390 -490991 -54009 -428451 203898 -214636 -218504
15910 -218504 -202952 -331401 65362 133579 -269133 -445063 -178150 -57011 -144152 32399 -80572
15898 172473 177741 -32480 -170913 -380363 -162742 -337503 -164395 -126968 -171205 -162570 -525994
15887 -525994 -219213 -125450 -198222 212539 127493 -78095 -143702 -362988 49006 -88355 191383
15875 -108049 155313 102425 -16884 -136908 -28318 -162683 93059 -125378 131828 84208
15865 84208 86255 -104081 -144499 -15245 -61614 51034 -138865 203358 -8576 -263098 196412
15853 -199180 132984 103653 14849 210037 3099 66928 -69939 -352141 78945 -129061 -3627
15841 -84431 -284824 -85489 42909 193250 72256 35742 150254 -867 64321 -209124 -162019
15830 -162019 -255870 -42673 -120149 -96545 -76274 81769 -40343 -46524 -201105 -75016 -495948
15819 -495948 88855 -272452 -150929 -156653 -241892 -320272 -162724 -181704 -454843 198052 -24225
15807 -34756 29048 -331268 -7599 39963 47423 -3419 113775 -25379 238890 -93326 -200794
15796 -200794 -129180 -380339 -185013 140882 101585 -263450 46853 12375 127681 -232790
15785 126852 -37553 101199 127537 -150469 -111483 40997 92244 340037 203480 -255269
15774 -318770 -187200 337316 -320854 420459 82096 -19853 -90030 -47908 146121 -118495
15763 254334 196828 68564 -131598 -79805 49640 -149149 201573 -16971 188669 156263 55242
15751 -78402 98847 -131281 -47029 70806 59170 -21073 283162 56253 392325 107582 207437
15740 207437 53939 -424857 170939 389319 156303 172046 -3655 55246 -156468 -298514
15730 -298514 -301049 33756 -387910 -263360 78431 -133392 156406 234203 -38271 338082 -37653
15718 -70910 79825 50919 -230812 286305 -125470 -410383 -222552 47449 -76410 -58858 -117391
15707 -117391 -63315 -146236 94304 53404 -91193 -215892 -241959 -94510 -78574 109967 254060
15696 254060 272260 -279739 -233573 194274 299191 145022 341695 107446 -190763 272685
15685 27953 -137124 112221 -4044 -83196 125247 66972 -98206 171237 -148836 -51106 -103594
15674 -103594 68514 -276927 23634 -105907 81140 -272326 -64317 111657 -94618 -90126 833
15662 207373 231958 126995 67499 327254 227370 -181806 -164949 -107977 -382078 -411014 -78180
15650 -270280 -69437 124080 -15572 -122314 485898 -64765 56846 -109798 120044 -178572
15639 -7991 -325496 5780 208359 115661 114961 231965 162048 -218788 -181628 -108003 162324
15627 187420 -75497 -178453 -76373 -240533 42604 97660 173350 -172617 109804 140105 106071
15616 106071 -118007 -369804 -158564 -120321 -63053 -195451 -94034 8999 -274075 -316528 -23196
15604 76307 -253364 -198669 -850 121157 -146043 -356511 -133721 -64483 100125 -229547 -6275
15592 157979 -308030 205328 274942 -186627 166078 43328 -101702 293546 92592 -131082
15581 75956 -15907 -86761 -97590 41034 84343 -402005 90172 -74876 301113 -263367 -87033
15569 138193 75639 191634 65776 -19269 -310709 -102338 -11349 94701 -150314 -93570 78557
15557 -41263 -102306 94548 117459 -283274 -254224 173905 105472 -52422 -72029 -34807 -13498
15545 -44414 -262379 6826 -190520 -297103 118958 -16618 60335 285272 316525 348391 33161
15533 16676 -21162 -115822 -221878 -78078 -221953 -157255 23875 -197448 4932 265166 72438
15521 50444 37182 26706 -95412 -13048 -119599 -299187 -82054 93076 -50280 29651 103403
15510 103403 -64398 188865 173575 -42650 -77234 28830 10111 -20795 124660 116648 -124012
15498 -242990 -104334 -163558 -296274 -124033 77917 80543 90345 385118 -26105 -106455 -101299
15487 -101299 -73023 11043 77415 -447483 105884 -266647 88447 304359 69058 126704 78010
15476 78010 203699 -208585 -362775 -56939 -247092 55817 178414 -79879 65502 118068 10407
15464 -177279 121213 21943 250378 38477 -76178 -60386 188542 115646 51198 300835 237918
15453 237918 273931 -82259 -98575 -11281 212371 -240616 206213 -154327 45186 -12350 -109369
15442 -109369 349416 -214706 -286727 156110 39219 -28954 283211 86696 -68584 35927 369868
15431 369868 -132503 7915 -92570 18427 13538 -195344 -31314 112695 211368 -271188 -32059
15419 -20234 -137989 28353 -61696 39896 -161840 134066 221434 162507 -33322 -25220 93795
15407 -990 -115955 -8515 79567 -106633 202983 177009 -233349 -79333 126860 252179 -446472
15395 -165946 -386718 -459296 -137199 -57634 -113142 -76070 -384427 -154672 -142537 43293 268441
15384 268441 -15923 -153907 -96478 -164936 -39088 -220655 -137491 -124562 -284073 114628 -94282
15372 -210197 176151 -164522 191164 -135681 -204094 -173335 125568 129432 -32719 264611
15361 39515 46054 -141409 -68666 81080 -79280 404111 -59216 45463 175307 -183333 -11059
15349 -81134 -7487 52183 5760 -256391 170829 248356 248531 205239 286095 34719 40420 -128206
15336 -246755 -134826 65264 231929 -31724 -38348 -36160 446548 104992 -296245 232988 -24839
15324 116217 -268120 -275999 88257 -185203 30516 28177 -71838 -145687 -96249 123300 -130342
15312 -36956 -77495 -122629 -223710 -94927 294323 -166929 92760 154387 37323 120736 -945
15300 156247 60238 -243440 44380 345283 192321 63204 198756 125656 -406634 118584
15289 -129706 -92107 -231693 86757 -134936 178905 108486 103627 -253044 -26851 63434 310079
15278 310079 -99481 281924 58733 -43407 -43081 69491 63063 272084 -81623 -263616 -165536
15267 -165536 186571 345525 303889 149339 94230 123691 132129 99039 166076 7598 -69599
15255 259197 140198 144074 -94565 280238 -158930 -40184 86878 686223 1337686 1323759 1345865
15244 1345865 1178557 597386 236259 -22214 71873 -31626 -25039 -200108 -83560 50242 215173
15233 215173 28861 130601 330894 161402 -120768 483507 168261 -74447 196920 20471
15222 -129677 -288790 346301 -132013 209058 190725 89797 187994 -150064 69457 82557
15212 82557 -37329 156027 -7374 116804 -167499 217194 -155564 41014 194106 245759 238226
15201 238226 253360 102485 -11640 -126796 -19630 136333 393765 -244601 -36447 -8792 212299
15189 -82785 304058 -191863 110039 102990 11477 337496 207740 -86733 210110 440368
15179 440368 33563 33659 86476 307129 3246 -174516 -208986 4913 -18833 624166 144258 260668
15167 260668 303962 108336 320859 84271 -143945 146449 127253 -10309 109310 -125164
15156 458492 -76333 -138665 -210444 55161 109170 242644 -138072 232810 -178471 -90412 -70779
15145 -70779 505378 -60647 120464 -162549 149890 202932 65225 -66918 290517 -414992
15134 103687 209306 290693 238215 397984 16610 36810 -135300 110493 215079 181843
15124 181843 376387 140819 130415 -61745 155868 160056 -225487 206873 -87455 -122885 179784
15112 203328 -36959 30426 82960 -99158 283161 -67131 -80345 -114309 280278 512933 -82697
15100 -23156 -98162 -164789 250145 -8853 189988 340315 -242732 156260 49036 -25151 -289698
15089 -289698 180587 275495 168295 224526 16849 429346 172809 116867 -9607 -120898 138186
15077 249927 -129178 139580 415970 180613 259848 -12756 347228 139477 259056 251464
15067 251464 290300 460151 238389 331097 32848 32981 197298 227163 62576 67734 -15340
15055 313056 -37133 79266 173094 -54269 11521 -155278 179317 -81125 -149006 118456 220793
15044 220793 82790 432300 73593 376774 343939 109779 449765 262833 134558 240840
15034 240840 79743 32412 69450 332802 -101268 288112 148637 8734 359351 -162527
15023 304547 327215 140445 482318 230103 267193 134169 175382 156959 96656 -146209
15012 237469 157305 547066 202347 165004 358066 134960 194610 132513 5282 285321 -98809
15000 139523 411506 420631 -37947 -167267 439912 89188 365492 97691 -56226 400918 -149539
14988 354438 135161 119055 170794 -117144 -70699 -23545 241438 91187 409675 102021
14977 177817 -33711 1976 316797 9196 249042 -198946 376852 430086 158650 170875 -224143
14965 264920 193187 41743 589300 244563 363025 442630 322532 381035 -7436 652461 160394
14953 380690 -7321 100050 159838 590738 41949 205404 258652 244286 121361 83278 190168
14942 190168 147486 511288 202845 426192 114329 298714 693959 595283 213059 336462
14932 336462 95955 156773 -66786 279739 258029 294395 127828 173442 180351 132580 455724
14921 455724 280273 40599 607730 394286 423380 14571 308725 -361179 440451 273174
14911 273174 407350 336356 384767 339839 128845 187570 400276 136095 293221 269962
14901 269962 683983 182473 157006 190381 105315 393998 276928 301302 299661 403143 128701
14889 249293 475942 488900 507402 348611 96306 718857 141169 615662 216447 -57419
14878 404486 303485 352957 440141 416876 100608 320745 439526 368558 260195 359644
14868 359644 376713 275402 282105 614130 406157 114748 126755 284116 203553 146023 460779
14857 460779 178973 179623 611872 485888 596869 492304 285933 845442 159899 322373
14847 322373 712872 812883 628162 388262 232748 142620 485323 387413 333868 137657
14836 185338 314313 513434 562517 212537 664854 314889 277239 673976 470176 317394
14826 317394 327821 333414 445313 473552 79112 706062 406053 624528 320224 238622 427776
14815 427776 661889 339576 362098 532965 464393 629453 410901 599471 266271 498919
14805 498919 408021 428417 87178 274982 124093 653386 383085 396079 908241 414513
14794 639772 586530 638444 610345 696910 200493 819900 436772 548929 319254 314140 618210
14783 618210 402941 376751 318086 370788 387086 601264 461272 421184 622235 506453
14773 506453 623649 752730 562009 466726 683091 535284 902939 493439 522450 842660
14763 842660 423971 568287 324655 643395 803662 732276 578658 240558 310563 513266
14753 513266 678687 758643 719551 642763 547703 493412 539242 500469 593191 752234 602767
14742 602767 295448 614446 516622 554936 561014 1186759 741820 475475 809438 433068
14732 433068 887841 527890 996718 763313 697068 737060 832548 878541 1090249 563360
14722 563360 779711 705301 1216158 623639 596059 893725 948013 645620 641361 872262
14712 872262 787016 747304 848232 790389 732404 765214 747514 651925 817705 687346 831365
14701 831365 537445 1091743 770376 872305 674088 829746 722672 1004299 886689 1012558
14691 1012558 621192 763547 877647 1032908 1118766 1112820 1033288 1109377 787187 980933
14681 980933 919754 1109464 1126980 1262532 802411 661147 510444 1282408 822865 1086923
14671 1086923 575023 837645 1094719 822417 547251 905288 866642 1243780 1199901 1267227
14661 1267227 1231669 1068090 1063433 1182394 1079906 972064 1257253 853003 996211 1212194
14651 1212194 970694 1057663 825100 926059 1247765 1063265 1444427 999967 1113909 1056674
14641 1056674 1249829 1271149 1308520 1231969 865289 1317358 1067842 1096930 1063913 1135109
14631 1135109 1088782 1459497 1481908 1226190 1235093 1414579 1484252 1468551 1066833 1429221
14621 1429221 1675078 1226718 1392295 1435715 1477215 1520206 1422045 1198513 1390515 1487684
14611 1487684 1540407 1233335 1648122 1396515 1709709 1666174 1547792 1663727 1312976 1785555
14601 1785555 1283587 1455481 1610453 1435997 1634111 1552066 1818456 1504342 1555843 1790926
14591 1790926 1984454 1516644 1936056 1624638 1977197 1674079 2008147 1708015 1768648 1652230
14581 1652230 1937173 1837511 2053335 1552337 1918116 2178012 1778378 1834013 2134667 1831556
14571 1831556 1938569 2223734 2033481 2243407 2275415 2334098 2080427 2592449 2442127 2551071
14561 2551071 2389836 2447819 2734192 2939395 2699046 3001102 3303112 3110837 3659523 3932555
14551 3932555 4363435 5169570 6405154 10512769 20818723 40481562 43875817 22437512
14543 22437512 11386509 5832670 3281711 2771446 2348053 2504077 1866759 1577474 1561375
14534 1561375 1866629 2055986 1483066 2168825 2210656 2151950 2220181 2238326 2251714 2227019
14524 2227019 2442610 2222796 2425547 2502150 2293700 2585074 2408662 2482151 2536082 2348695
14514 2348695 2766149 2537344 2776469 3081107 2540839 2807991 2865969 2766517 3062084 2979062
14504 2979062 2941347 2746855 2863123 2850186 3052619 3233978 3108885 3113857 3174748 3058469
14494 3058469 3175231 3364801 3408472 3093762 3034358 3352807 3623037 3512734 3489284 3635959
14484 3635959 3354765 3700457 3816251 3440237 3778511 3685699 3752670 3927169 4210706 3969553
14474 3969553 4148248 3888424 4020552 4125354 4251571 4168528 3916340 4232854 4168858 4492283
14464 4492283 4469275 4787493 4626917 4296013 4738083 4687833 4849063 4832847 4907166 4850447
14454 4850447 5070842 4866287 5061346 5229498 5032657 5244417 5236510 5408969 5557346 5560823
14444 5560823 5516556 6000391 5816445 5721498 5961338 6073389 6070787 6447389 6440612 6264268
14434 6264268 6522816 6493166 6811132 6343433 6812160 6774093 6682383 7064879 7130387 7232211
14424 7232211 7019585 7687805 7488205 7816828 7968770 7846234 7919052 8003459 8323752 8251401
14414 8251401 8390647 8336949 8643406 8799710 8867244 8926293 9177700 9335183 9525788 9309995
14404 9309995 9663008 9994187 10056103 10616463 10026366 10446701 10650881 10876275 10818900 10964876
14394 10964876 11249829 11254470 11546251 11821715 12079789 12458568 12402396 12543130 12818026 13121670
14384 13121670 13299863 13620470 13596074 13791635 14206292 14352326 14705348 14639126 15484623 15947963
14374 15947963 16036932 16464405 16876820 16909092 17191969 17692703 17914675 18079399 18844908 18764377
14364 18764377 19413957 20318125 20261347 20722632 21114461 21742123 22214622 22719794 23365231
14355 23365231 23880303 24130446 24791841 25180922 25786264 26465686 27210596 28023813 28730113
14346 28730113 29495510 29872203 30823748 31598182 32549614 33468183 34370528 35554455 36123015
14337 36123015 37626376 38561105 39598240 40707744 41915403 43383680 44749567 45793691
14329 45793691 47580745 48733984 50374485 52014235 53782715 55592123 57628475 59748560
14321 59748560 62161952 63948164 66223320 68951796 71532003 74054006 76586802 79943237
14313 79943237 83213868 86437523 90158013 93844674 97734418 101836906 106579722 111300633
14305 111300633 116043136 121455083 127049432 132927153 139471994 146204288 153043342 160668973
14297 160668973 168676709 177205625 186092247 196022572 206290073 217182384 228103221
14290 228103221 240263664 252837769 265713388 279662839 293673757 308474322 323356289
14283 323356289 338283788 354191734 369357952 384764134 399434073 413492078 426469174
14276 426469174 438489686 449187290 458130034 464930915 468240609 467589495 463538775 461920522
14268 461920522 458598224 454374903 448447716 439321165 429195646 417550798 405009523
14261 405009523 390727386 375658908 359518330 343892299 328012411 312353972 297228234
14254 297228234 283020765 269087520 255421641 242604098 230284732 218660748 207890894
14247 207890894 197423268 187642384 178355334 169781531 161871462 154186941 146737870 140217754
14239 140217754 133735022 127842496 122924405 117172124 112086400 107385025 102760497 98924783
14231 98924783 95022383 91390302 87697291 84254320 80917356 77973332 75254212 72844468
14223 72844468 69653632 67341258 64676990 62774036 60942657 58681648 57031934 54880218
14215 54880218 53046352 51854425 50544945 48712533 47085458 45696008 44283331 43069817
14207 43069817 42607696 41442255 40017759 38892043 37543711 36343646 35774734 35338261
14199 35338261 34138305 32972599 32188175 31336884 30260796 30095544 29577277 28121449 27800489
14190 27800489 27125927 26269038 25720489 24970081 24313123 24369968 23430799 22978840 22604388
14181 22604388 21904244 21449477 21001205 20906235 20130834 19653196 19307129 18815871 18729738 18182056
14171 18182056 18370590 17664735 17089992 16497223 16393056 16131448 16155073 15537925 15423347
14162 15423347 15294315 14963088 14390138 14180064 14008224 13749206 13552401 13345099 13067338
14153 13067338 12886705 12488907 12145713 12252847 11858879 11765386 12008565 11346968 11309754 11182924
14143 11182924 10825830 10689847 10632845 10649324 10021150 9964537 10081242 9886716 9622543 9458771
14133 9458771 9279740 8939448 9001798 8836929 8926517 8927926 8696186 8523006 8300474 8119068
14123 8119068 8189566 7794579 7921389 7923017 7881861 7486520 7601733 7403232 7429532 7473742
14113 7473742 6868764 6867202 6708798 7079941 6945536 6648149 6685292 6601778 6607208 6499884
14103 6499884 6307250 6136736 6140908 5899795 5861127 6045177 5823146 5828895 5870328 5774558 5787687
14092 5787687 5489028 5754502 5949787 5722979 5122212 5394379 5458003 5237092 5411376 4937286
14082 4937286 5108704 5255733 4934894 4598748 5029607 4785403 4693200 4543972 4562540 4856927
14072 4856927 4291457 4682567 4763962 4073233 4528934 4254828 4461200 4338265 4008196 4450516
14062 4450516 4044927 4047980 4033314 3863105 4286856 4231799 4146179 4118309 3690996 3659051 3461703
14051 3461703 3771802 3966270 3643358 3763499 3561360 3338723 3843023 3060770 3797799
14042 3797799 3516494 3311198 3309082 3103387 3143022 3194664 2714525 2906458 3048227 3143076
14032 3143076 3204996 3107404 3114002 3139482 2958074 3015178 2966647 2797310 2667526 2781339 2653243
14021 2653243 2786641 2906452 2609416 2809101 2477748 2573770 2421846 2497633 2665034 2436057
14011 2436057 2603895 2346703 2254009 2341900 2420079 2221172 2129708 2194428 2268570 2097303
14001 2097303 2141418 2224104 2241090 2256449 2492791 2125194 2062599 2092660 1960924 1897892 2322675
13990 2322675 2378637 2939856 5481566 13194438 33255212 45764252 27208866 14603248
13982 14603248 9019149 6411551 5118303 4019844 4135480 3521311 3177973 2915005 2926368
13973 2926368 2912330 2346739 2476485 2360299 2283376 2138935 2302553 2558983 2253667 2268789
13963 2268789 2361998 2272263 2186980 2143793 2070750 2098072 1782451 2026091 2240549 2268415 2295570
13952 2295570 1724599 1972816 2001510 2045953 1970729 2062854 1925549 1823467 2123094 1801003
13942 1801003 1941507 2147452 1628432 1746081 1885943 1822506 1882097 1780741 1492137 1599486
13932 1599486 1323144 1733764 1801622 1697425 1715813 1428638 1647765 1698343 1637166 1546759
13922 1546759 1434720 1735573 1652316 1235688 1495732 1606431 1552287 1542772 1311500 1698465
13912 1698465 1395799 1180286 1477667 1470792 1438408 1491671 1262632 1636719 1551356 1286978
13902 1286978 1379639 1739022 1360293 1227534 1379740 972394 1097851 1405327 1562874 1350440
13892 1350440 1093341 1482892 1165433 1234527 1274496 1231965 1696851 1265597 1429174 1332834
13882 1332834 1204462 806525 1197392 1220063 1317448 1247174 1546252 1194846 1203229 1221695
13872 1221695 1157862 1011376 1165158 1093427 1085746 1266152 1236004 928387 1072293 1013558
13862 1013558 1424161 1012208 1113398 1133639 1091060 968572 1123982 1019034 916999 1134860
13852 1134860 1020765 1158605 1042019 744426 1057125 1014922 835189 796348 965544 1022472
13842 1022472 1203532 1119082 1284724 1022038 1170036 1013290 939460 915855 933403 975412
13832 975412 865240 887786 790096 1157532 692876 653493 619100 802420 727154 1070323
13822 1070323 1266720 940859 772975 917607 811903 740269 769517 1135720 854456 635866
13812 635866 623673 850211 1000139 855268 923175 903076 761981 740519 955326 974302
13802 974302 767964 920783 712535 845927 810311 930617 966565 857191 985734 807517
13792 807517 553903 943276 933176 729190 471555 517689 651669 386138 633386 859684
13782 859684 1018047 771559 978116 568095 732665 975856 860782 785175 1063005 738617
13772 738617 468415 753065 943302 515899 727174 799422 779794 798140 304248 653382
13762 653382 505989 1052664 975607 715206 1050872 625070 1028169 602002 513635 637858
13752 637858 758935 809052 913054 754355 719689 894678 519968 635467 430258 784934
13742 784934 377710 277454 851676 563239 697515 488673 405372 865678 468871 540014
13732 540014 707147 795171 962748 497334 815114 421381 724542 483227 684101 511090
13722 511090 306857 731825 707543 583628 660601 799238 822058 420708 417551 796733
13712 796733 711895 510676 116457 319613 579093 479361 370673 363826 797887 616171
13702 616171 562698 574052 375516 687896 657198 677078 452835 328695 807162 464969
13692 464969 637352 737055 592951 548646 321459 562106 537516 448354 493909 402163 460799
13681 460799 832271 28498 377004 326157 450562 589866 696070 529711 662749 384889
13671 384889 555021 536811 574345 514859 393492 575991 586501 693644 382184 602898
13661 602898 513813 365902 446062 586808 425955 515775 612641 489021 404354 589434
13651 589434 11873 721200 465455 373302 169718 349513 430036 384745 504846 388841
13641 388841 94011 369139 277846 498957 311539 553321 463997 656773 447199 471825
13631 471825 500051 429050 266236 390425 466937 325939 183352 556786 240515 182581
13621 182581 514028 516012 211218 312385 531303 563544 405676 306706 531409 330304
13611 330304 648086 450814 300720 417673 515929 440715 228441 512684 302077 232546
13601 232546 225569 209189 434672 413740 323756 167472 373982 372110 15874 244876 144437
13590 144437 413171 204623 232847 211530 298797 402848 28149 350108 499884 598564
13580 598564 519590 473667 387785 321486 288974 577487 683451 135249 -193058 587731
13569 305968 470024 387852 -57437 225897 265157 299135 179587 210716 373073 413190 432541
13558 432541 612056 416442 367899 697250 297463 250741 305047 240509 418414 394186
13548 394186 534597 74472 273177 500443 91797 98686 312733 -116042 103933 240754
13538 240754 278327 326133 26348 34078 173980 523840 385804 143088 28120 182224 295374
13527 295374 490823 296988 162563 328507 355677 374867 313466 479441 160846 405409
13517 405409 -71697 431735 546529 298416 621723 339405 15264 -22167 294429 509547
13507 509547 322136 199900 180379 576307 280044 359636 605514 465162 138648 363194
13497 363194 594144 263452 261620 167497 92213 410367 294973 30938 287080 388061
13487 388061 348434 214837 47289 70981 280035 272421 452349 153640 182899 108744 214499
13476 214499 -26715 249719 -47060 266903 404919 272686 342413 393374 347511 77078 173347
13465 173347 -328825 321833 381764 382115 369675 187182 174419 380129 148314 66919 154826
13454 154826 154868 146397 422166 132409 213810 243267 509328 229017 271806 309395 108770
13442 144619 48186 106837 461154 329007 249615 169612 198826 296801 117115 292509 -1889
13430 237202 456484 321147 66591 98135 234490 407140 639149 368753 30560 297886
13420 297886 239337 117366 340845 103281 507755 70075 176936 230710 184479 143392
13410 143392 214223 122079 168759 257657 -100554 72088 388086 261863 301092 508390 363551
13399 363551 105156 316654 -9918 131430 289554 249222 400246 -47152 265184 448753
13389 448753 325033 19211 64376 387320 206801 -98780 253203 102588 97106 276205
13379 276205 375639 146078 131848 426970 196417 304977 200549 255249 360987 381929
13369 381929 198929 278478 407633 204338 89770 -23472 496062 267536 253270 159002
13359 159002 207805 383667 436295 445035 135982 104261 -61844 260354 219367 -137028 225268
13347 242701 234173 61978 216619 276803 329661 36543 550900 54874 55748 3661 288933 466404
13335 466404 13202 361430 266769 355192 426520 -23360 279936 -23288 321157 74485 161219
13324 161219 189497 -47910 -23989 564629 376069 446755 104985 143438 114025 265996 30531
13312 329494 300012 42180 163639 375882 361971 118951 295390 169507 404 154934 145365
13301 145365 216647 321609 456234 -146601 186212 355032 146522 304729 118410 151073
13291 151073 -100070 -64864 191266 -142506 -162265 41108 183590 -220216 69409 -119505
13280 4803 178930 309399 70277 234260 -49031 303755 50628 72374 -150544 80712 17862
13268 66425 -109746 228287 36150 267510 259934 280459 118654 -13832 137221 76453 -178253
13256 183887 7572 89309 -20489 328272 326088 80780 -8400 -31236 206178 -65158 -35054 -3474
13243 47412 79060 307467 92851 295955 77870 60383 -227543 322597 318846 -82075 216388
13231 151785 230838 302289 263081 -41380 150955 161618 144953 636812 117137 62030 125758
13220 125758 202437 68811 -154669 261796 -90571 130127 378797 3632 -238813 13310 130559
13209 130559 -61236 116392 -58052 44010 116766 -32622 139977 -122715 52628 66428 75002
13198 75002 341719 -52242 -147605 186088 400178 183980 534962 245997 175603 323706
13188 323706 73323 276694 143437 -59821 167552 280112 3406 -125400 247083 16428
13177 705267 68745 -31395 166170 26874 181251 49483 -37698 20197 -188773 -13788 485623
13165 17040 70765 -96967 243625 -56023 280503 212787 191866 153978 57013 154499 216477
13154 216477 133556 170850 -39685 62055 99940 327911 16179 32081 -118430 73436 113473
13143 113473 -55505 64968 -63738 315603 -126226 -160675 -134091 -61886 -45819 -195065 35684
13131 143312 1973 -151176 287191 86104 242066 247216 290880 118748 115551 -41079 252815
13119 87566 -142 50661 216706 168170 158071 -261215 81173 175093 543624 -37995 95080
13107 -314629 -21864 -42282 310159 -165952 -15375 331579 -150023 -66615 186267 279407
13097 279407 472594 187146 229439 315132 165624 -112900 361122 132445 87175 117230
13087 117230 251420 -21961 35688 16860 367643 95591 209291 203218 -38737 112621 156510
13076 156510 -164628 162098 21441 -14624 -154860 -186635 31106 116998 -370776 64392 121107
13065 121107 209507 -54578 402257 124404 -21954 -53765 -126242 177616 -183774 -29184 309387
13053 99017 104047 -4362 29711 254738 83431 274662 82133 -118738 81938 -292296 237744
13041 92288 207929 133881 101332 48656 -96048 140637 88616 115712 90797 107811 394207
13030 394207 83340 399501 267345 172245 44391 345109 -54612 310790 244831 -22664 -95356
13019 -95356 164858 29857 73271 280147 263895 58899 72001 -74771 205807 -83052 -77859
13008 -77859 13508 226202 142003 3870 353173 384568 328833 -100372 -104704 141725 156651
12997 156651 -38403 199250 -25441 328609 -119166 132946 370564 -184419 223327 72183
12986 206355 120631 27498 -180023 -14725 -54205 -230268 -126370 -62823 217957 -98577 -81715
12975 -81715 17793 177981 237363 268693 145447 -24966 -114113 -382857 176259 155066 -98283
12963 5489 389526 -61756 153902 224646 7548 -137249 167175 -54006 153907 102178 54481
12952 54481 -170610 -103359 218662 -1874 196373 -245878 -60243 348601 -217097 117170
12941 26607 79698 -8097 33485 -12368 1648 93920 235750 -237109 -156454 127963 211848
12930 211848 58867 17706 148031 -124908 161702 -62277 -210177 -105054 164359 145876
12920 145876 279672 93141 151715 45666 -11684 268380 184830 273536 17886 197431 77233
12908 47797 245834 -1601 -28390 2666 -100705 -164161 -79357 133452 125878 159115 59181 198267
12896 198267 46288 84561 -9519 -54101 41113 126051 14400 -263392 -179569 -93590 20249
12884 -1461 -32505 -383384 -198992 250271 -38192 -41168 149541 31337 104962 54677 -161173
12872 -33210 -264304 108950 97249 23912 -48110 -156221 -135870 -24567 -391288 173275 -185417
12860 64388 56890 121048 153791 241577 70095 282724 -79315 132037 263990 -129954 117407
12848 499922 254948 -22676 416815 125906 243613 86056 -48739 87815 150396 -13134 -127588
12837 -127588 244030 -15168 181802 -21368 132284 63234 90945 -85041 -9862 -261569 565339
12825 242620 20696 29172 -210061 -112405 -155651 -131928 1464 -178600 -242743 26294 204286
12814 204286 -337341 -165972 -258405 -83926 -124714 149359 82124 -43086 353208 -110734
12803 124304 -169454 -299557 -331932 -3862 84952 -182969 192279 66048 -27770 -156341 371367
12791 -91352 472903 27260 166752 -128584 -630 25314 39536 -23518 120365 56631 119975
12780 119975 -169154 -57613 288845 -172701 -238743 218 70025 -330616 -148394 366961 -198376
12768 40240 -211865 -106299 -66513 -118453 90321 -289983 201289 -48949 -19932 -72402 -183019
12757 -183019 -103924 318275 -150859 91122 232853 8813 -72474 187986 -286754 -156958
12747 -156958 -109132 121669 -34783 170833 45164 96812 5212 144224 306186 -82094 286253
12735 448612 -27403 180060 199853 -187946 462261 23681 206171 -113137 105804 -30058
12724 -31248 -25927 46617 -44539 -195081 40071 -43344 -155674 109148 -24807 -1800 294487
12712 10460 15161 216901 248913 130535 394166 150893 215940 276991 357881 210637 134505
12701 134505 282817 112367 29101 234437 -33569 118180 93997 157210 168253 -5249 -17184
12690 -17184 -188169 -154827 -53911 455108 64288 37294 -64951 318560 -1991 141815 197925
12679 197925 319437 -145731 188959 281148 161321 179687 291843 -11421 292359 374321
12669 374321 63311 204545 134398 -127028 423068 -148850 -4589 -77880 -1722 -22298 -81146
12658 -81146 39623 -65376 170954 461634 119415 165687 -185737 5002 36421 -110875 188669
12646 -281329 16930 380678 -248279 15270 -90799 35526 -1236 19226 39215 51963 263089
12635 263089 2945 290404 -15338 1749 -33997 365738 296818 242848 313087 -91515 331666
12623 32801 170462 31138 -169167 26462 7419 -124608 -9019 -331479 238835 266511 -156636
12611 41801 55433 -97586 -361819 47293 -90468 237579 -162916 56110 -206839 80427 183222
12600 183222 162911 79836 93763 -100390 63183 219932 -193259 -10263 250035 295100 119712
12588 376518 -14440 45633 310553 292221 219080 126474 -91002 330970 -124477 -184193 153295
12576 -248220 133747 249092 223439 81926 240818 -88099 68663 -44742 213286 -167085
12565 -13745 -132794 -24047 67787 -92005 -192887 46521 360062 19165 135848 235228 100868
12553 -8013 297671 -97345 -13133 242837 -135715 190743 -96417 -132713 132346 175653 248559
12542 248559 -28109 -24344 253875 -231814 31848 -370380 -75706 167337 -70149 -31379 -155965
12531 -155965 169637 59508 -139505 -179424 -67925 150390 -173086 -115467 -242132 21978
12520 70566 89881 46774 178112 294328 -160023 214749 -299463 145243 152049 94973 99677
12509 99677 -55881 -50255 -89385 214750 21505 -58277 8423 -48701 -40334 -115953 182292 22272
12496 -307518 -118769 71795 -148044 374539 39518 -104941 -356489 -1149 236450 89735
12485 14005 -31181 -8612 128852 -481361 64722 -216547 -59184 -59205 -215454 74352 -34267 61768
12472 -59999 -94846 -31484 -96161 191267 39326 -111448 101759 -59435 138104 56926 47759
12461 47759 44261 89571 -494205 398366 -28123 -20283 39236 -134029 56466 -107614 -154922
12450 -154922 41471 -50184 333372 101766 -109548 -178185 87689 -45660 13982 -88425 -106067
12439 -106067 368171 85064 -3561 297610 167113 83631 -46493 -181098 -65634 -198220 142349
12427 -5717 284515 159595 -340500 -55419 -140966 -32829 -55678 301276 -237742 172671 -258368
12415 418098 -62999 -23908 23382 34028 2953 215253 128371 359868 87383 -100761 -216232
12404 -216232 -121840 -60911 -191751 -108540 83734 112308 -124778 153148 55253 35387 16860
12392 -109440 -499912 -12795 197217 1642 -128126 -440005 66997 -29169 -281199 -12102 117955
12380 207028 90126 -230994 153016 72459 229102 228613 -328679 -106479 -180768 -69506 -47792
12369 -47792 119681 -221557 -354480 -48409 344126 8487 54622 355683 -49970 -78712 -210015
12358 -210015 376037 201646 143030 182118 260754 -21388 43264 -310965 14417 360431 -117678
12346 -208223 297299 152022 -23199 -45673 225431 -44683 50864 64156 188514 229952 343752
12335 343752 -104057 -58403 88163 105014 286731 -145077 -249284 128106 129610 -42926 197640
12323 112759 -322358 -298435 83646 -37378 186837 -6879 -50253 263769 165568 -598012 267359
12311 124354 7467 219397 -169852 137556 35263 147834 407065 81508 302218 64395
12300 73102 288446 139803 63340 117398 29930 334165 -6647 42310 67774 -97448 13710
12288 131474 50938 -47352 180213 49396 162980 -9678 -32415 -3013 166794 62171 103664
12277 103664 177605 108855 212784 109774 206411 160557 -80800 13708 164600 160250 304329
12266 304329 -97202 117891 -18855 41320 -307468 366655 475397 50764 328966 1382 62592
12255 62592 -2323 93238 -193495 161421 30744 366421 -272292 9932 101879 -49250 211642
12243 103471 316086 -83833 -104010 -167446 252543 -349411 271882 36457 451423 -70770
12232 151883 135487 95461 76409 102294 79004 145952 245401 310356 176593 389384 50898
12220 -72262 260105 18571 347445 209242 392263 114376 55171 42600 62814 285931
12210 285931 186484 149172 29151 55951 263440 139635 -22002 6836 190347 -102134 -244094
12199 -244094 65316 -94658 261071 -85442 295672 -252529 55410 414142 373320 311274 -34135
12187 282018 -85543 12959 323122 -103769 277046 -286909 282486 147308 -266684 300610
12176 39069 -59963 54003 217510 177383 80339 127042 1535 7054 -7102 6128 401853 255712
12164 255712 177678 289161 -57618 -225311 381456 164882 -77677 290004 83129 -91286
12153 57392 -18178 265488 -57441 100191 -14231 216945 155684 -73355 -58475 209138 85786
12141 -218590 410373 307747 -182433 191954 -42115 -72407 146548 -18322 267405 150159
12131 150159 279487 -156205 215921 -109282 168116 87991 84422 365350 288997 47511
12120 320602 158992 -73548 -38964 -253323 -155858 191129 -66619 -68793 61422 -286512 508959
12108 -48139 -105038 -209247 -67421 324327 -65620 109369 380914 352103 13042 30870 29100
12097 29100 194152 374220 175206 -26187 26943 -106318 -298780 -69218 -91590 -71035 -57996
12086 -57996 -210518 119748 253921 156003 -43564 -145099 40890 -22765 114362 291977
12076 291977 1720621 1518933 361647 227836 152015 -206786 83925 219694 319924 -128935
12065 150249 54432 251754 251807 114101 -21572 -58474 53006 -274020 -21338 79357 -122873
12053 83187 27312 229721 81083 218398 62030 -273927 -33615 -86488 -291905 -266138 -154792
12042 -154792 79418 199378 122797 -336011 -2248 4433 92655 -231262 284156 50243 8606
12030 -377459 -310511 -194015 513767 -90573 255725 -182163 -27611 62702 79278 -77850 183543
12018 -269420 -81129 -138007 -102983 -279461 -206787 -225882 15614 -137218 -68776 126843 -159309
12006 -169122 32446 -150859 297986 145727 -122603 336034 -53657 -213261 -8594 -18514 3649
11994 -115885 159534 -237200 26791 -301608 -80692 14862 151934 -31744 -201106 288807
11983 19551 -242321 58794 29945 108679 -269624 -7300 113347 361495 -161545 -149517 -60379
11971 -56274 170819 -232596 -31184 -133624 -14822 1236 380346 140635 -686 -114327 -271466
11960 -271466 -98082 68702 1829 188741 -318647 229088 6074 206843 -164583 -13218 -74880
11949 -74880 92639 202238 -195744 245409 121236 309878 -89418 66335 139572 213426 -92028
11937 53022 -121645 256938 -79676 -40513 241541 -13065 96878 81773 85169 85487 165182 165072
11925 165072 173112 32311 -68251 161212 100519 104085 -293950 -42842 126562 147738 136267
11914 136267 -21368 -29589 -211714 16485 179463 142769 168319 79413 157560 92382 -47028
11902 170134 -208261 -18678 -87019 -173610 -37576 45811 -217648 6595 60844 -104623 -33676
11890 -173001 2985 9036 -96883 -190482 113017 -83315 -114650 221404 38486 55018 -180778
11878 78243 333202 219504 -361452 -291789 -171522 54024 -130427 289114 -75485 56004
11867 107376 -222576 14528 -204010 -112172 116024 -251928 180335 212168 -72743 -307449
11857 -307449 -103596 -333043 -456 -28662 126202 -12735 -27114 72114 -33129 86304 283313
11846 283313 13248 263601 55047 14889 -19297 239153 33700 244722 -36211 -132897 -152950
11835 -152950 -221346 -389871 -75656 29045 165533 -290170 80265 43255 236330 -192349
11824 -15161 -24809 60475 -46816 -170928 -216117 -475648 -164906 -120491 -287489 -253544 -119432
11812 121887 -95612 454090 285911 -235518 -174293 -33779 168905 -47267 -61018 187786
11801 30977 -130541 -324256 207774 -222473 -222070 134131 -17450 -92910 83983 102682 -107232
11789 56809 11944 521701 258236 -18261 111078 16535 -134509 -117925 -182054 80266 -87815
11777 201599 71438 137500 -177735 -19795 -53352 24183 26702 117562 -256777 31712 168463
11766 168463 -114639 -230439 170511 33012 192540 115985 -313925 221602 -120319 5744
11755 14134 -72062 -148157 49315 -23940 56767 283071 -168440 -315428 51772 -35310 113911
11743 57770 46317 -11733 -250685 -78729 -95283 -6387 8254 499655 -250601 -93161 -10267
11731 75817 285571 -36084 -135176 -202245 87990 38887 -299638 10615 86544 160489 244103
11720 244103 188728 -253458 340875 -213730 183327 -87318 229415 128580 87993 -39993
11709 181075 -117541 -141948 87101 -144251 -215044 -8190 -102605 162717 -154769 28311 -26113
11697 96635 449757 -100704 15207 220955 -124053 60191 -83656 351905 131780 385704
11687 385704 243618 181882 1860 294839 -130414 -133387 353083 316120 -141043 82801 -86912
11675 284679 -115297 256827 -128769 -168591 -195104 -91342 3355 -100425 -15479 -66142 11162
11663 -139319 215953 17380 -38706 245784 -199813 -60928 -64538 -6253 130495 -257361 -75485
11651 -142224 174393 93647 13932 -202706 317934 -85887 -57709 -60745 -24928 -3253 -168745
11640 -168745 234853 310768 -26856 24416 -172826 265172 -16266 70033 285605 -166761
11629 17764 -177760 -218091 211898 404856 162978 -296158 71472 310112 91414 200075
11619 200075 125287 -394863 -87454 115256 -96227 38866 -130350 333979 80403 158064 -81679
11607 64213 20677 127395 -95488 50843 139897 -7525 76027 69086 152245 170512 -100765 -133777
11595 -133777 68072 440493 104386 250629 138646 -183284 116672 323466 2644 -128061
11584 133623 129540 20273 306137 136283 -156687 -6100 194376 35946 92377 -258757 3256
11572 -55731 278706 173711 206823 97746 113567 -219777 58164 16463 106111 158701 192592
11561 192592 101879 -41379 375923 8079 -161904 240430 151333 173153 254235 321773 223695
11550 223695 122962 -36912 205365 94202 379834 -81797 -303643 294088 -26516 -84436
11540 -84436 226082 233839 175459 127386 82418 188384 -127125 243459 55339 291239 82339
11528 -60294 174792 159166 101003 -19606 -311003 25479 320871 118040 29726 -40639 128327
11516 -34100 138976 37206 131690 399975 375618 168221 110059 -10075 65919 -158273 525842
11504 202766 448817 48919 501427 79262 52293 374104 140857 465223 65808 -152064
11493 59753 141163 -69535 20050 -16216 238976 35876 124595 167121 189511 156039 35160
11481 137446 84757 53059 -292836 564274 230972 -48768 55267 144028 -76654 525290 331655
11470 331655 77709 140521 170433 8485 161515 203933 23656 478070 293968 59557 65227
11459 65227 -52170 -203954 78908 -63074 -100140 -42551 -323762 -67697 -18842 121046 -45964
11447 82722 84051 177051 270297 -111641 301344 458297 119689 101178 -96045 103089 -58990
11435 288036 92627 163066 -83688 26302 -129795 -120808 24645 155826 36653 -30518 -258353
11424 -258353 171668 141379 10801 265150 -113991 -4145 449434 138835 -27437 -119754 141847
11412 113321 -106737 -66784 50821 -116395 -60396 -217245 443945 -195932 -85020 -385299
11402 -385299 102767 -23793 126575 11326 -84326 136782 214224 299861 307641 -56047 192963
11390 33260 19289 29428 -210971 42345 130635 -18288 151943 -83078 4228 -117267 187369
11378 40542 349433 -355864 143610 165822 81521 -83955 -13638 -200733 -180201 109372 -27469
11366 -42170 98313 -79859 -120999 127347 108082 -323086 -172573 135155 66453 -171113 82844
11354 32127 -74938 -118697 65971 -28018 116754 228059 -227416 -54925 317411 194449 217886
11343 217886 -163158 -69294 118808 63335 209791 57224 72894 112324 191811 -129023 -133782
11332 -133782 -201643 -48126 142511 -147404 -527306 31181 8488 -43625 -85385 -47636 -109390
11321 -109390 185919 197357 -301279 -105642 -87107 -28791 -110841 71522 -39271 139058 494783
11310 494783 66042 466160 -54830 -90551 -19662 -207800 -126665 -88618 170627 177515 7906
11298 316602 29013 -230481 -217018 -63489 66878 42446 -267318 205640 -299704 138941
11287 70238 -157515 -404844 206339 93564 232248 -252746 -33140 -110855 -119827 31540 83533
11276 83533 -58023 -279919 -50122 36006 -82319 -23562 110693 160926 279347 -44859 -360568
11265 -360568 146286 -65730 -228136 -190899 -152843 187562 -32000 203179 210977 -70640 -365332
11254 -365332 -37479 44867 255656 3773 75566 -391941 5006 212595 -135099 168841 -24288
11242 -122632 -14291 -69987 5560 187269 -149321 -72786 136619 108664 -235535 -77405 187614
11230 -216169 -63002 170620 -36454 -203276 164300 84629 -28612 -131235 -21543 29104 344082
11219 344082 57859 -173735 66620 -118198 342166 133976 -423456 -187584 -386093 169954
11208 -164013 236590 -63603 138499 48421 -297474 -138760 -175207 -71580 -127334 -285277
11198 -285277 84151 -233407 -194958 -237571 -138091 306062 207293 -58604 -33590 4066 -107385
11186 -362613 -151123 -107359 -69550 147196 -218957 -81668 3468 303273 17691 -131214 -347935
11175 -347935 47174 -148716 -324642 -187671 35011 -139815 -42373 -248125 -73413 -144008
11165 -144008 -117697 -276208 131111 -89470 2183 -84441 147919 -174818 183083 181558 1298
11153 271211 67969 76518 -87437 -201250 25521 169731 -53730 240026 -109087 187987 76755
11141 76016 8169 -56467 166595 -283972 -93915 44539 161791 24848 166182 346834 57087
11129 -161322 133345 221273 -101293 -258379 -128708 25807 -172658 159150 242922 -125441
11118 -227370 -158512 366437 -221409 -142193 -89615 -107133 5205 -64174 86565 256983 432452
11107 432452 101155 -165701 156371 466846 139894 144240 464343 239553 -34294 -164937
11097 -164937 -22809 395205 177216 -177842 258909 191655 -8780 252815 65560 36704 -107676
11085 161033 554879 49683 57721 -88887 69573 340497 327975 83857 319996 -2653 560128
11073 -50510 437544 324524 460910 189719 458433 222672 604617 592287 49163 300459
11063 300459 458724 461529 574374 502687 496289 610590 246961 436852 389103 899551 809334
11052 809334 719534 870112 857485 631165 563687 525080 501994 670836 607006 647558 936767
11041 936767 919614 296452 632025 508554 543040 610614 676115 598283 926033 758079
11031 758079 559713 783513 581630 620382 808001 772480 614842 723135 763288 454134
11021 454134 646515 610599 478578 546980 513077 838111 852668 668936 489179 756335
11011 756335 701907 8720 402883 456909 499913 431854 213966 631667 645765 682741 481794
11000 481794 528212 302171 450239 302260 504509 662266 687452 850905 666146 675610
10990 675610 683635 719727 852517 759266 1011783 971866 725695 1072014 1209092 1285445 1227136
10979 1227136 1371390 1250064 1682102 1746505 1922795 2219960 2268912 2696404 2714572 2788232
10969 2788232 2905087 2626179 2189746 1978594 1850518 1929173 1912068 1845029 2023954 2428130
10959 2428130 2053803 2256806 1934407 2057942 2086464 1812995 2099904 1759070 2027903 1035562
10949 1035562 1118168 787567 759136 666542 692798 303380 214827 316795 631335 340896
10939 340896 229851 466089 395131 303895 206274 366760 161584 -85357 -28257 175951
10928 258852 309966 191264 105892 114339 487961 -7755 -78297 63319 167023 -177846 -29109
10916 -164266 -154516 315728 -56369 104597 76862 -270579 339276 27483 -3464 -238540 -47151
10904 15801 -111927 341576 -171926 -119495 233742 -15166 -187956 -153635 41591 -295160
10893 88145 161216 -113329 -92653 166995 -126312 -163578 290347 -230608 159354 109718
10883 109718 198180 18881 -215082 -47757 -51183 -116284 -115618 108658 71741 205429 -219239
10871 292155 -209344 133812 66904 -96629 -273632 -228422 391046 -33701 -137459 -124023
10861 -124023 -103684 -128937 180657 -90188 -360046 -125275 134261 -6288 -12055 -143280 -20363
10849 -3534 -109867 -88667 -67519 338901 -92803 -181449 258859 117439 -169561 155487 64468
10837 34392 93655 79039 -282121 280257 -60052 -293240 -42193 -45460 59838 -228291 -368143
10826 -368143 -226451 188299 -112342 -98188 198121 -55632 -40415 -130687 -220587 -352053
10816 -352053 -75135 -321620 412891 -270181 -149047 -224258 -212966 -27308 147046 203795
10806 203795 165302 99866 63180 -48159 -127140 32287 164212 2849 141277 -28814 -163984
10795 -163984 -160592 -93425 -121763 78223 -48796 -81349 203945 191376 225032 -212638 -49883
10783 -61260 184873 -325381 -2401 -166048 -376178 -378490 -95373 23545 59637 -5434 -207908
10772 -207908 -133356 309166 123027 -29726 -215850 -63218 -77559 -168171 -207342 -135121 182095
10760 330468 -23467 181988 59149 -183650 -100527 -71322 -108535 -163979 -98465 -172948 -54979
10748 30284 261391 -23383 86492 -236926 -315089 -396510 212353 245878 107846 -239926 -137027
10737 -137027 -130362 74645 -257707 -333468 89130 93154 -208973 -142604 -23584 -195874 -130236
10726 -130236 -140883 399480 86613 -47062 -86204 149440 -86917 -219985 -139844 -54371 -305755
10715 -305755 -91726 14420 89199 144499 -79382 -86588 -153815 165913 72635 8756 -252191
10703 295970 297595 33360 304597 -188711 211672 -118524 -186734 -111804 -147614 596 -158671
10691 397022 338209 44407 33656 72450 152596 -107922 200244 -182259 -46086 -134285 -80650
10680 -80650 -208508 240331 -146729 -168110 -37573 271835 -134351 -6405 175038 82770 -175760
10668 -238416 148645 -157884 82732 -203556 -285396 157343 42111 390010 -120683 -144901
10658 -144901 300879 -52433 171404 -95642 44848 -20122 -104750 -148416 54080 238468 -299558
10646 187714 115772 -32466 234474 257264 93527 84275 -200135 -249951 -121918 -54547 -405543
10635 -405543 92822 -140584 113111 60591 -77133 -103300 199350 -38796 -342994 -166451
10624 -308540 -26803 -112801 -160347 -95241 56856 116742 -131922 -92061 -103572 -13951 98968
10612 82908 -414429 269925 129385 -95727 196840 99743 -96058 190944 -62823 -169352
10602 -169352 324031 -168642 113001 -582130 26236 -401028 -238216 160841 -166403 -38336
10591 -222775 8664 139275 -167567 -13925 -179728 -212365 -8960 -55044 194552 4390 73186
10580 73186 -337761 89713 83392 -168182 -25352 -333857 116794 -41871 -171257 -81921 -134560
10569 -134560 101278 -83942 -219702 -310059 36082 238145 246952 273704 -102831 103630 -126375
10557 -366545 81704 109042 722 245281 2184 31380 -246344 25401 -155731 -75135 99521
10545 326730 210368 -206029 -320479 -284895 205820 -119754 101262 -29011 -23501 -277219
10535 -277219 -34051 13028 -120859 -64664 -216938 49882 -169796 -188396 -62054 -164602 -28535
10523 -350540 -196176 -61485 -196974 -55955 -90804 -106250 145387 -178686 248797 15427
10512 -96494 -84858 228859 -105626 -52678 -48094 -226211 -44207 -7117 11596 22418 72129
10501 72129 75435 31039 204047 172 239475 13260 -158107 23893 64249 -184612 373751
10489 -155678 84838 -97504 188584 -212290 -11240 -30773 -10084 635939 508581 765698
10479 765698 344946 557800 554425 256267 173605 -151382 91483 -136564 -171318 18728 224789
10468 224789 -140694 250151 80810 -85781 90810 -85398 82631 45731 -5910 -41406 70074
10456 197251 -13997 -301684 20443 -209059 -146864 88022 -120258 -57919 -52503 -37878 -82422
10445 -82422 15166 -222045 -124536 262697 -68598 -342494 -125462 80151 -17893 -61013 197631
10433 31363 286604 107105 -358344 261187 320731 30157 -196968 167318 -385261 117492
10422 -82940 27454 -386531 235486 -57967 -240637 -183610 229181 -161151 -328682 -5912 89649
10410 -283429 23715 72551 121742 45479 22051 222678 76976 -12738 407855 240952 45180
10398 -31192 -43645 32388 -6590 -201915 18936 135425 609384 159603 295940 -7900 37090
10386 -105936 32417 63981 126191 -247458 -97930 128496 -44922 13814 222112 190473 199564
10375 199564 294131 240743 106405 127638 197528 86012 41932 152043 530365 53928 210854
10364 210854 320148 403510 250947 419007 334539 361489 289350 173706 62446 153640 147896
10353 147896 347890 247216 214752 588552 497301 410226 -10347 363040 372734 76919 416282
10342 416282 458333 515952 -121044 545679 391556 147792 187886 337753 83671 -66564
10331 155904 252665 283847 347757 114824 -46164 316329 412426 554868 207814 199690 74017
10319 38724 498959 171604 62090 211496 585063 -215033 -422569 303561 -173738 -223483
10309 -223483 4256 -32573 -163391 29225 -121112 -185478 4070 -62880 112121 64038 -37551
10297 185156 24455 99323 198817 -20698 30464 -95183 22492 -36935 -29397 89300 -236363
10285 -107856 11124 27249 -10677 31361 -198719 122208 4875 9828 92211 -91065 -63504
10274 -63504 67881 206877 393354 172491 -125524 39006 127863 274818 -118782 -97436
10264 -97436 54380 12494 -73036 126967 80837 39084 539096 47400 197396 645932 228676
10252 -5457 15787 206919 -31765 -262986 -159606 -221645 -88508 -176034 -96336 -318989 -45898
10240 104461 -92654 248429 -151251 -40853 45299 42509 -44442 -297821 -276843 43448 -148603
10228 277224 65100 -153998 -232727 98540 160938 -87070 117706 185260 110236 -351025 -174683
10216 111120 140437 -12729 -171749 134312 124469 -12390 74457 102405 -257613 241808 60182
10204 152348 68807 110150 341980 -34670 -42688 -114334 -5301 -134440 -56930 -77862 -174042
10193 -174042 -71086 -168132 -136325 -150459 99703 -201912 215065 -185939 -81456 -57023 -142407
10182 -142407 82591 92309 -104587 -18508 -197898 -160304 -284140 126337 -113417 -497331
10172 -497331 -201163 100422 126282 124615 371474 -117918 -13181 80722 -185969 -244307 -11623
10160 -13552 18764 -281770 -40082 24782 -111767 13952 91892 164188 -96567 -217599 164753
10148 -371416 4557 -154796 -190043 142223 -155856 217463 -152318 -50740 2935 241475 43618
10136 -159160 199416 -54000 -25725 117616 -151265 -194170 -88815 -366961 -298465 268641
10125 7545 -130233 13467 -120135 -207666 -301434 -90165 -227839 273878 -121684 -43135 29813
10113 -318095 -29482 358473 -184846 -76137 -403788 -136702 -73527 -69931 -26441 -14952 -71055
10102 -71055 21091 20508 107239 65975 -352476 84362 3117 -187247 107557 -234554 -20892
10090 -64490 -336419 282397 -126584 -261969 -260754 -15896 -163882 -83324 -465813 88463 151115
10079 151115 -264879 -85435 -50210 -76192 616 -62402 -18756 -4365 84024 -357823 35051 -128364
10066 68610 -115378 -28321 -90936 44218 -88428 120539 -119664 -125859 -23093 163817 -148282
10054 -83247 -115889 13994 -70875 -116583 224790 -38176 -39513 83526 -28007 5492 87408 -130661
10041 -57655 -274936 -258664 82067 -12627 75906 106843 218771 -57900 -9499 33059 -138424
10029 -351630 -51579 -135085 261518 -149389 -92941 49759 -27956 -208408 -116114 -351942 -163577
10017 70265 130008 -287496 20390 -69809 -55653 29121 116800 -286503 -118729 208657 27783
10005 101140 -237560 -87260 284119 -297794 -469765 125032 122327 -293771 9916 -99050 -169928
9994 -169928 -244347 192178 79322 89544 41511 129820 -125231 87371 -138089 168035 -160855
9982 82343 131675 164275 -432801 -293575 314405 23251 177267 -245814 214908 -102211
9971 311943 259974 -258180 199836 -372478 354197 -372971 -140097 99259 -293622 121958
9960 -378844 -225998 141110 -116070 -118890 -120763 -84801 -258020 -162079 -179770 24738 -42634
9948 -295166 -190985 -12597 88067 -60016 -313674 15015 -40544 182338 -4354 -93783 -91249
9937 -91249 -119939 -235843 -433775 -62699 74575 25153 263067 -78228 -241109 -48118 -161588
9926 -161588 29957 296666 -6689 47036 236647 122036 -22856 -84027 229757 38292 193477
9915 193477 -184220 -275220 -173073 5201 -19979 31217 77294 147962 -266879 -95695 -300052
9904 -300052 308035 174249 160146 -796 73596 -110510 -59579 116130 -83536 463393 -123623
9892 -163063 14958 -64352 -19328 170799 -72970 -203737 -124810 -108469 -59542 163300 -125850
9880 199319 -46608 -32087 146264 62815 -227013 -80528 -246239 -175867 3588 40609 362839
9869 362839 -86576 -284357 -66964 -319009 -201694 -34889 -65558 -56284 -429545 114555 -147724
9857 -308228 21721 -13002 -75697 -255941 -146771 -348081 95819 -199266 -21918 20396 -232486
9845 -183387 135789 -3831 -130309 -84470 -217878 -103955 -157823 6003 -158615 -126720 154604
9833 -214404 95239 154687 -309356 38001 6341 -3006 63808 -22598 -94506 -6676 73032 53768
9821 53768 -45472 320435 -52742 108217 17112 -65213 -77395 -141897 -132363 7583 -9492 -47534
9809 -47534 -168378 -63590 -326002 159038 54518 -135711 33836 -352319 -114654 110359
9798 -291349 91645 -330829 -329330 -145313 -349376 -179384 54735 169509 185958 -247359 -252059
9787 -252059 4935 63144 141540 -241121 -268949 -36308 32011 -229408 434922 6827 -202476
9775 -246876 -118082 -47565 -60703 116884 -97693 -470962 -83523 121298 23216 -25355 -336872
9764 -336872 -51640 126949 -49439 -306254 -272517 -178761 127834 -436879 -121373 -340803
9754 -340803 21512 -98825 140311 -192326 -205395 208333 -195615 143632 503334 -159071
9743 26861 -321758 -312900 28532 6540 -403822 -40097 -106524 -172369 -180852 -161599 -117809 1860
9730 312366 -217719 72781 124910 -553292 419301 -205183 -183758 -75543 213349 -378625
9719 -206267 217606 -610861 -378251 -449567 211261 22882 34629 -14333 110841 -263768
9708 121586 -365899 404964 -333929 -445736 -140860 53093 -76551 -15030 -70687 189549
9697 405701 90099 -66193 -262662 -76156 -284062 -27919 4476 -178811 -293058 130208 -302045
9685 -158941 -258724 75935 -44300 -46084 -489537 -249471 -120289 192107 -109304 -208127 328731
9673 -21466 -210307 315388 -121599 134605 86533 -45239 -143486 -226689 -156328 3516 -158654
9661 14008 -365075 -111954 -261924 112823 -88001 19215 54623 143745 392832 -170293 -39098
9649 -66803 149575 -204057 50673 -136137 50626 -115210 -137798 -199789 47454 14949 -177417
9637 14926 -91043 60263 -93327 -68118 -139809 116783 -312694 -168621 165505 -271938 -145108
9626 -145108 -121258 80974 -259617 141060 194511 -228419 21352 -332640 -80725 -501239 -382918
9615 -382918 -186098 212050 -88091 214154 42964 -108140 -82967 -16058 -334283 21109 -75056
9603 -52989 15634 435812 207930 23234 -253338 53370 55812 -94275 13954 -166244 -78304
9591 36550 13089 128639 -180813 -133364 9447 38258 53726 154454 -238186 -289793 53992
9579 92730 -102769 15645 -95991 -111390 163225 12605 -131156 -58716 -313809 -166311 126525
9567 78928 -133430 262249 13274 49147 -217526 -131939 -58275 -92856 -38662 -163598 -218768
9556 -218768 -86882 -44124 -162111 -97876 -132487 -322509 203750 -215717 62147 -67694 -264310
9545 -264310 -149438 210911 -50971 175 -4331 212045 -126761 220473 -232813 287788 15631
9533 56307 125219 33977 -65782 -69488 159992 -61127 -101870 -4708 -34722 -120218 -178613 7802
9520 -40908 159455 138205 -153044 -212186 77211 -479109 -164551 -135617 -151844 -24188 76106
9508 5909 36884 -223396 34867 45671 -159894 -11645 54580 -282829 -109494 -220797 32406
9496 31105 33571 328258 -243714 -119706 -42729 -58383 -142474 -235389 -374478 177280 -133481
9484 83477 -395497 29970 -3973 325397 -289397 -52960 206909 -213702 16263 -39471 -4919
9472 -196344 -60709 27665 -193113 84294 47014 3049 -400339 -171440 -76676 130756 -47055
9460 -472977 117158 -304072 -190890 -209100 190306 27971 -108902 89667 -207628 -14200
9449 107562 -115823 -123495 -75558 -263908 -33690 211394 -159513 -22620 -163919 -191427 -146873
9438 -146873 -190908 -63670 -212752 -192218 -102068 -289715 -264621 -155655 -23356 141025 -40543
9426 1029 77510 24518 -661485 19365 -24134 -233886 139261 26713 43889 -17758 97086
9414 156836 -99795 -166437 -374844 4463 -3830 275383 67605 63085 -425511 -510095 62867 -418215
9401 -43074 117372 5758 -93477 -165616 -320063 -219322 -186221 -59818 -100205 -69573 55977
9389 -91140 -276555 -442762 -177017 288630 -66818 -70756 211019 174587 -158515 -142120 128947
9377 -17934 290177 -45608 -130067 -168451 -91482 -30512 120981 -17642 31483 10827 -157210
9365 -173112 -217942 30066 3217 -57551 -190365 -140187 102254 73822 -127139 -197983 -213747
9354 -213747 -255579 -200422 -6805 -12567 -111777 131212 84882 2930 -30562 -216393 -276238 -47935
9341 -81178 -59772 -280266 -187183 69416 -249128 -298898 -316621 -63633 480529 -186165 337388
9329 198396 -247751 -49764 -295182 -205512 -90716 -170590 -109106 -136966 -37054 -337464 -86139
9317 80909 -32693 -281558 174139 117622 54478 216 9440 -270781 -367915 -73048 -119095 66595
9304 -2147 130859 212443 184283 48470 -70919 33933 208439 -557 -110921 -118923 -98820 182170
9291 296392 -85495 -125907 -43315 -19798 338139 30713 -162857 193938 -50701 -354119 49532
9279 160789 -183184 31487 208530 -320494 -135623 85399 93014 360126 -72709 35923 14553
9267 -55528 99978 -224345 213157 81086 201439 -387689 -154235 -159902 -312613 -258874 -200100
9256 -200100 -367207 -540780 77263 106239 -269532 -100308 -58916 196017 -30474 215996
9245 -55682 88142 130600 324041 -298694 -110286 182636 146016 -43673 -257640 -81079 -182433
9234 -182433 -194639 -92277 179147 -84072 -180638 -430592 51168 31023 -475685 -786 89064
9222 -314488 -152187 -287194 196128 -10221 13881 -59277 66344 3635 -131901 -288384 -38907
9210 -631077 -144093 30748 -57575 -122244 -141541 52465 62251 -332723 163710 -66599 -19915
9198 73825 -124581 228088 -156315 -168945 214026 51301 -106188 108097 -138023 104625
9187 -68656 -208617 -21347 -136964 120825 -75344 -427032 270155 -263872 -296985 25820 -12657
9175 -295889 21675 -51394 -330591 96638 88970 77008 -9265 123271 -207522 -317848 -173608
9164 -173608 -223258 -74152 -73484 68530 -137919 -1261 -349511 -6629 -93464 120643 -188926 17620
9151 -52401 23761 166007 182896 -23863 -165141 -169662 3934 -350070 -135202 2210 122913
9140 122913 -296564 142617 52530 111113 -65306 51721 -107942 -77743 274875 225622 -60838
9128 -344014 -339892 10382 -448114 48076 139780 144605 -185191 -8230 -507634 148342 -220652
9116 -44421 284535 7165 -83963 -183265 -134741 73579 -74569 -121670 -93477 -171815 206404 83372
9103 -132312 -384750 -76619 -177249 -98343 -209416 113000 111021 73657 39199 -316901 165642
9091 -338497 -170750 -202137 -66606 181112 -8669 -134795 -267393 106342 -352951 78878 -323699
9079 -150504 -282660 76754 -362833 68796 -125818 -45826 -45226 -103420 199772 175198 -21240
9067 161524 -58164 -259058 -139858 -55389 -172424 -203656 37310 235312 -58718 -239465 45105
9055 -246222 -327188 -91486 92146 269035 382258 -94832 -151868 -311854 -324668 -108983 -133794
9044 -133794 147917 -95597 192684 -82233 113066 126750 -138438 71237 -62585 -291936 -264639
9033 -264639 -37882 312389 -63142 -292739 -63757 1486 -238588 20000 -148180 -99204 -114923
9022 -114923 -464326 -59040 -35142 171931 2916 94509 43691 -714 -248267 -35726 -149893
9011 -149893 63326 -15107 279697 50089 58462 144464 14688 -336397 -61861 62566 13493
8999 288112 -122067 142793 -291089 119341 137879 -169876 -193713 30938 -59098 12757 -143682
8987 -61495 390674 -415438 -218362 -49958 -281333 40698 -131251 -56540 -95088 -129120 281434
8975 182070 -206327 -62498 251528 -612 160735 -245153 130620 55998 152586 -79078 -196359
8964 -196359 -149409 -273318 -166160 -200136 -188040 -328105 -112378 -84128 20382 185385 30331
8952 -188748 -67819 24728 -109801 188589 -152917 -102288 -23441 -131774 -238886 -66398 -276343
8941 -276343 12730 -24809 -60265 -167370 -246029 20010 37037 186394 -33583 -352410 141347
8929 -128416 -305454 -67517 359073 19482 501829 59831 1119693 5445682 9529839 3653908
8918 1320832 610014 318504 118879 214470 278900 -17223 44386 76468 -124448 57492 -32481
8906 35471 -126242 68716 -209630 -145208 -287908 -75468 136832 -76833 -327280 141186 22943
8894 -170622 -107593 39162 164467 -139106 311095 -290322 123482 -95464 46308 991 51365
8883 51365 -182185 -113563 -150260 219519 -214233 -97180 -129313 -127145 -240602 218588 -175612
8871 4849 43678 -67915 -107409 -304519 -98072 79983 -156645 880 -334454 -5132 -234446 -156969
8859 -156969 246863 -222846 -24429 32637 -44936 49399 94580 -7541 21406 -195967 110239
8847 -256041 -148597 -11335 73937 222976 -106270 -18707 145363 -63198 -203388 239892
8836 -100396 -255153 -177673 -44796 -98209 102784 -72292 -13802 -171457 -145548 -296291 -171372
8825 -171372 -142268 -126206 -220432 -185103 -42358 -47188 -24162 -4953 -113825 -19090 -21819 254884
8812 21891 48286 -111333 -21521 -76206 30721 208969 -55292 -128207 -105454 -92876 255246
8800 -51471 292282 57613 83143 -5175 -268225 86381 -17303 -146886 190913 432045 -422668
8788 290368 -266399 -306551 398400 -221 77150 -88311 319604 54880 -154553 -108349 -379430
8777 -379430 22597 -368837 -51615 119883 -20429 147734 -353529 -166967 -146769 -346217
8767 -346217 -32621 -16493 116405 -34497 60560 -183914 66377 179554 110933 -12539 53215
8755 88289 -81623 -261618 -19393 111145 -330823 176929 -98682 -121339 55047 -317445 -140159
8743 139489 -217103 -146772 85449 199347 -309282 -149969 -150444 -573913 -129105 -222890 38164
8731 -18832 62760 -2869 232099 148917 130104 161637 32781 -175951 151780 -14906 -166328
8720 -166328 192603 -163774 1420 -14093 -236929 228084 74277 208967 154754 109205 -127171
8708 28582 -61002 105012 -1177 142104 -384745 -103500 -240015 -84926 -69448 -86054 -317978
8697 -317978 -276048 378875 -21743 -205339 95247 -225472 -279853 221307 -195045 143691
8686 108402 -168277 -221764 114587 12589 7354 -101509 -256095 -251400 -262143 -276458 375728
8674 285139 -123779 -142006 -239010 -204993 -83473 -442363 -324077 -212186 -304002 -44345 -49310
8663 -49310 309392 134664 -33347 147740 127381 84116 33566 21732 173492 -115508 -205234
8652 -205234 -262598 -363784 -145761 -101680 -250476 -231783 -381120 35146 -90318 103614 -431826
8640 -29128 -315711 -40015 352605 -37459 -31521 -89686 -142048 25151 -298092 54973 213050
8629 213050 -109884 -212246 -49950 -192614 -341871 -402352 -26236 -146314 123765 79261
8619 79261 189384 18371 -277576 -44561 -199178 -361464 -171471 -286260 -249309 -14411 -53635
8608 -53635 294523 -386950 -337747 10958 -52670 -140092 -122674 261891 -333335 39366 -134650
8596 -206696 -156574 108178 -3918 -206443 315599 40064 13049 -209851 -188039 141982 49562
8584 -135456 55431 277325 -86560 -82909 -100364 -148470 -67463 -181195 -103898 -311065 224368
8572 -56821 43072 68683 -117491 114027 -235087 -474873 -109132 -253281 -77447 -319593
8562 -319593 73522 -339211 35627 -47089 -60583 7205 -256559 21150 87281 190265 -54859
8550 297142 196642 -143313 -65878 -186713 -149215 -288617 335302 -402034 47931 -169973
8539 -349910 -2489 42615 -189524 56311 43758 118833 -211061 192252 139706 74654 -133106
8527 -54689 -191608 -136242 245986 -9362 198000 -226275 -6495 2990 -206315 -121163 -215422
8516 -215422 71354 174189 257811 -331018 48938 9319 42771 -147515 39182 -37535 370010
8504 184731 -197926 -137144 -104612 67129 -282822 81219 -280126 -68115 -162713 23949 -13429
8492 269227 87100 -158817 -50204 374471 -117691 256286 -298263 -99358 124204 -13645
8481 250997 -30170 -352161 -126164 280050 -94595 -190527 57905 -96612 322649 -50460 108760
8469 -92180 40716 269040 154244 -179202 268912 -18123 -216943 78070 78473 61401 -168141
8457 130669 24031 -62565 81327 117315 170291 -463177 1058 88738 -319338 -350630 -210784
8446 -210784 -304714 -275688 -259345 287875 8674 -79881 164981 -71097 39394 -70648 97066
8434 315209 -213308 -334522 -133393 -125153 -103416 -72013 292121 -121533 -343013 -204233
8424 -204233 -308206 68067 233757 195117 -239679 -126426 -146836 82510 -44755 -43008 -367184
8413 -367184 33079 -69881 -230989 91583 -99092 38193 -43302 -281808 -188621 -123133 6743
8401 -131988 71399 -57038 314877 275205 -93581 -114970 -245373 157056 -146120 181154 43729
8389 -181609 -54535 -112767 -191458 -38937 -21950 -210629 54348 -120403 67276 36347 -167624
8377 183352 145149 -8813 -421166 173900 -74501 -139065 -6260 91970 125873 -191578 42291
8365 -28146 -70762 -374841 -9072 365528 -104308 5863 -199743 82809 33432 -277449 -241074
8354 -241074 -170335 -87938 -199456 -64746 44356 -129584 -346862 97699 -7444 40624 -22092
8342 153575 -94080 -173359 31930 14539 -135780 164106 104489 315708 -257242 230247 -156078
8330 138417 41547 -269433 50698 -132191 -213250 29693 -110450 -71466 -82985 174376 157132
8319 157132 6120 -84773 157958 -208869 22147 -32260 145840 29093 -362137 -409594 14797
8307 -225449 -27417 231682 -334626 -69971 -311621 74200 138273 -94261 107295 -274051 -65374
8295 28404 -133604 344198 -254064 202538 59209 50327 -28508 -87574 -377637 -188670 78370
8283 -206385 191110 -17793 7544 -314355 40932 543911 -396830 -126399 -39655 -216801 171525
8271 -175947 23127 -164482 -203915 288270 -123827 -164294 -202112 -241014 -99577 141285 96420
8260 96420 -118867 7258 -248036 -357959 104548 -16533 331419 -251507 -225342 -17403 -93135
8249 -93135 -229898 -204443 46776 -373750 22171 -81570 -115691 119757 -9205 -33331 -11870
8237 -172166 -31194 72193 -70906 -25616 -362798 -143072 141610 190748 -52247 204934 -168395
8225 -78638 -10220 -208285 -36562 -196731 97252 158875 -15769 61441 -100931 86552 -46820
8213 -57437 -143158 -50603 133657 -248676 -273807 124125 -263652 166298 -301329 -185414
8203 -185414 253569 -55691 -103271 148181 119002 -58759 -16664 87220 -102542 189798 -22632
8191 131432 165961 -65082 -47282 -340287 -121689 56518 41430 85912 -52359 137063 90837
8180 90837 -19774 -91662 -86789 -46676 -327388 -48344 -51918 -360578 117844 169966 -486896
8168 -181121 115601 5209 168728 -80970 -342058 -16518 -85164 272226 -13143 -193256 61715
8156 143240 -23520 114949 80175 -18150 61737 148146 -57449 -66998 -71398 232883 -148592
8144 -72115 -28885 13908 -20908 -24635 -159410 27731 133589 -496813 -94266 -163250 145457
8132 47746 -20577 -202969 230850 -173307 -60964 -254925 -30914 32162 6170 -267893 -63612
8120 22574 -243823 93287 -374145 -72127 -77328 111594 66219 207965 -100502 -108791 -223458
8109 -223458 19262 246738 -31045 -23849 85533 18313 -200472 -41548 19220 189378 -215350
8097 -131058 -73368 241922 25832 201928 39595 -22003 -121541 112098 148207 183071 -125050
8085 -242821 -113330 97171 -33407 570074 523920 -54630 38486 153595 11241 -169343 1613
8073 112733 -95555 -111210 259729 289414 -275850 -48898 -242680 279325 119637 -13734 -162151
8062 -162151 73001 -184316 192619 42236 -371420 91885 20948 -38943 -43111 -66345 -54828
8051 -54828 195610 -1511 13550 -135455 -285079 -346343 104721 -87001 -117656 -41843 -283264
8040 -283264 130741 101340 -48339 -49583 271119 -303357 -165728 84992 -43459 423328 -109503
8028 -24402 58270 -298379 -180418 -184683 158463 -101653 167411 -47389 -215706 -220789 -215023
8017 -215023 -292146 -96716 -346117 348404 -338789 -236922 -167414 247588 150227 21905 31970
8006 31970 -160279 207610 139159 -73355 199109 62786 -245261 -178518 -292823 -212784 207465
7994 227249 13591 -20922 1297 216735 -278474 265284 -163655 105809 -176616 -193314 39227
7982 -261952 -399122 42436 43716 -267685 -22541 111651 -192217 -243686 -291724 -109803 25131
7970 16994 42794 -68276 49428 -57058 46698 -144254 141629 -147565 145365 -147676 -135758
7959 -135758 369778 -92856 114953 -120505 -157053 -295319 56642 -141276 108599 121048
7949 121048 40085 42471 13740 -57344 -39608 123429 -60835 146594 40177 -153619 -54164
7937 27388 34466 131786 -203387 -104807 110937 -56710 18798 -363326 131565 16658 149320
7926 149320 49200 206028 -157528 3516 -56720 181715 -334790 -440633 47135 -294265 113602
7914 120340 -53122 36812 -51957 17902 -76144 18867 238530 -42373 316539 -72717 -84119
7903 -84119 74803 11626 -230203 -287851 -223262 58017 71411 -148118 -170990 -146072 -44222
7891 -188313 147233 11577 -178319 -100592 158408 83979 -77722 85855 30162 152806 -24611
7879 40927 -205505 -311668 -116171 138753 -61038 195339 -102921 -197399 351391 -227783
7868 1146 253733 -152819 212890 129894 -150019 11361 262210 -33970 -43618 86817 -438195
7856 -166864 -99873 -263322 -225303 236187 3521 -22282 -225281 59956 -24084 -137297 35980
7844 78914 175144 27752 222456 38482 155042 -370784 -19367 -312006 247344 -8919 57303
7832 53074 -426586 -84917 117251 -123209 144103 -40550 -373756 -373053 -2390 -64088 -316186
7821 -316186 74058 -131981 -164488 375430 -120794 -59411 119582 -60270 331686 -76592 35182
7809 201504 34647 -45899 193 -17810 -211448 178772 -7899 -70925 384866 -105113 -108519 -170311
7797 -170311 242024 -7863 -246648 -189069 -117832 -226741 -268748 31313 223365 -166296 -102813
7786 -102813 73906 1916 -230731 80206 80321 -277196 55624 92369 131983 -96992 -376811 77211
7773 -222227 -31418 -238693 137676 -187995 -227243 8473 5301 34060 -18812 -245781 42321
7761 83886 26322 162529 360650 -73179 81704 -112871 -9700 80733 200727 110115 -85416
7749 42456 299319 110264 -52956 -336781 77603 178263 89072 -175761 -89380 -82615 -9944
7737 37419 -105426 -173554 48545 69400 -14348 26719 321490 21807 -14116 -226082 461014
7725 -297863 258056 -6834 -224298 234416 -345927 357394 -313442 -167221 -263768 -77482
7714 -78191 59620 84316 1851 -91326 356829 132593 -191642 -43276 -52831 -98071 -61180 117212
7701 136434 224094 -161917 97937 -67377 -124403 -179750 8277 227605 -147097 -79560 -213041
7690 -213041 -87779 31291 -130453 -165726 -38526 -247702 173882 5788 225019 -175671 -193580
7679 -193580 -213134 -153411 278528 -66878 -48976 416402 192764 198172 -33354 -52471 -54566
7668 -54566 38289 -39071 106768 -185388 168063 -82591 -168425 -60148 23737 -268418 209270
7656 -88685 47825 78760 -308541 -25244 265777 -422422 -191730 58645 -69924 -186289 168825
7644 -56294 81258 306066 110974 -101024 -202181 -94326 211322 479344 68423 181009
7634 181009 269469 -4822 -141980 -302419 -41904 217432 57520 -507709 114596 -156332 44256
7622 -71032 -53260 62329 -149408 -137584 -280905 -114001 -71608 -4247 87190 47031 -31427
7610 209331 -23770 -164077 -175063 229510 160757 -25623 304379 -115129 14481 168630 -8809
7598 -36388 -28488 -31643 101108 199977 224101 -61210 -293426 -113451 113160 -336105 133059
7586 58787 -29919 145637 36738 -348761 -57549 -292693 -23742 -223114 -302255 -204256 75680
7574 -148202 -91327 -346545 -8030 96160 -136501 30913 28762 233218 -239580 -118843 -146218
7563 -146218 74655 2850 57448 -119957 150200 -200066 -217615 16386 -230651 14484 231738
7552 231738 223405 -234963 -308881 -34429 39536 -94835 43485 -358426 165219 -59623 -29352
7540 250143 168961 23051 308463 -134516 -2014 4438 -88686 14613 -118485 10872 -51353
7528 42315 -206722 -186072 -10032 -111658 -181222 -90449 65176 105196 -12856 113124 -238403
7516 99486 -16241 122817 -93803 -137203 -151120 -258194 -125883 -193100 63208 22971 -49443
7504 6735 16570 1714 -378371 67847 -313919 60757 -347124 -575658 234444 187759 76381
7492 4694 476361 -345079 228313 -2455 -199445 -358126 203377 -31520 -139394 -175647 -45226
7480 -46229 -7652 208616 -20607 231830 165070 -3861 191860 -21978 37303 -114764 191263
7468 142936 112407 91707 -95116 139803 326004 -131630 -94583 -308209 33390 202174 159326
7457 159326 -142657 138198 -118374 -129343 -93813 296162 -37198 17223 -11228 72510 -313081
7445 -85352 -138514 176581 206794 -232179 -40292 -164333 -221355 -170282 -247824 132129 166873
7434 166873 52953 -390925 109692 5827 -102580 7027 -140744 -108365 -11511 106308 77800
7423 77800 167529 -209772 -20331 -108310 -71831 176401 171989 -293479 -11433 158104 262738
7412 262738 16727 2644 71731 145385 -192965 -311156 190876 -143126 -104297 -58315 92699
7400 -276256 -55691 219612 -254680 43897 -169580 -98194 3080 -202849 15402 -61925 180598
7388 151302 -246525 55258 -86494 -76320 -124101 -34147 -166030 -61755 -5045 -188671 84431
7376 -265540 85596 54177 -324125 235986 -17664 -59855 73383 44971 -146536 -71099 -193481
7365 -193481 153643 -119994 68103 224381 -319783 -227564 40200 282714 -91179 104253
7354 302617 -62025 35680 83799 -167983 -199390 -68498 1461 -228701 -102183 158090 123638
7343 123638 -164021 10336 -75669 117600 -215952 -237314 -110509 -7127 250049 -237262 -196110
7332 -196110 73728 -272914 -175777 -117451 -244641 -193639 -364548 -170590 -46410 166812 -61145
7320 -122220 97376 -35487 -116260 -285073 -276378 -45065 -112345 84162 -157646 -93632 -280616
7309 -280616 -274178 -309330 28394 -9567 93577 -12861 27900 -174153 62271 10543 54431 -174444
7296 -357269 98448 -75902 -56705 100673 -368289 -366067 79252 65554 -132821 277869 -188613
7284 25061 113502 55164 13311 -557259 101173 96427 -119235 48443 9254 -266787 118344
7272 58372 -141940 -87798 347122 -186960 -81417 -381891 61574 13346 2203 115558 2980
7260 147092 63681 25112 15779 60450 9050 -68101 -67966 -248826 -48246 211079 -352981 247432
7247 25348 54917 149532 -3945 37916 -34367 -113297 -128595 -161599 -101929 223390 -133593 -32062
7234 -141571 -104420 110372 -334730 60233 120470 -86047 257880 270482 389369 261593 181624
7223 181624 58185 38801 41664 90693 -277556 142095 22225 141667 -156716 -12377 112252
7211 46262 61363 -211439 -17228 72524 139328 -144130 -107338 193174 71965 18571 -317832
7199 74272 -23726 109029 -196842 -114746 -249898 -131550 58604 -54010 -25493 -134978 108313
7187 90793 -204669 -47892 318021 -149851 2896 -164025 -242461 -264969 -421430 -24084 -205441
7176 -205441 4042 25110 -101810 56872 -98004 -513819 121051 -237291 -35414 -58074 -149216
7165 -149216 -6 -195409 -168711 -93979 -428288 -149015 38962 -57076 -78010 -100073 -29296 -295176
7153 -295176 51027 70045 -166319 61650 -148379 39565 -67021 94486 169050 -370718 1659
7141 -133712 196223 -80554 65202 -79197 -7840 -1386 -233483 -16139 77068 -42950 -210767
7130 -210767 291852 129153 -270954 177947 -87082 138796 121828 331757 330442 -178739
7119 45135 27016 -216960 343901 -199824 173982 -158641 -5792 -17732 -50179 -18165 249047
7107 111627 178653 248560 256990 -360447 174507 -291628 365721 155819 -116566 114917
7096 -442542 228583 137971 119751 -254000 -268982 -108348 -282336 267518 -84954 -107519 -69241
7085 -69241 33825 108447 283127 -250109 130240 314908 -73715 -133142 296855 -29221 -25320
7074 -25320 -29023 20689 230283 -123213 311869 1545 227922 -68049 -31820 -43340 123667
7062 162858 118508 -99314 275418 -166155 -36881 59669 336810 30035 -45415 485116 -80274
7050 -70167 -96178 225227 -155932 -112551 -174050 -297859 201467 -112017 -12431 91520 -132080
7038 69731 -308670 322321 15687 -30805 -13362 -153580 16109 44275 -126286 -3906 82639
7026 -221337 23538 99459 -210995 -72432 245890 118273 12597 87133 -177605 -136626 299386
7014 -276957 249932 -126903 -18709 -236831 44460 71495 -37456 -116683 28927 -199759 -198964
7003 -198964 -74116 -308537 -164137 9286 -360868 -69023 252398 46104 -26709 69920 81494
6992 81494 88838 159456 130807 -122157 47466 -23591 21142 -219659 77655 26800 112921 33271
6979 -103797 -225022 132080 28279 177190 -75023 -439581 -81537 -210851 -63849 -217860
6969 -217860 -95085 233115 -99601 -166982 -30303 -59276 6523 -365549 58585 26415 -325688
6957 -95849 42825 -95472 -289583 94287 -68704 -44031 -148156 2489 -57883 63369 214337
6946 214337 -38188 131287 -115930 29813 24331 -251783 -22484 343649 231582 -302366 -67970
6934 -101715 262396 88922 -23305 79441 282626 38258 -208330 -188536 28179 96811 253035
6923 253035 -23897 84002 301172 18784 -95793 -40628 -253618 139762 -196095 -168453 58839
6911 -22868 169072 56325 -274329 13945 -6655 172651 -29860 42787 -258606 -107135 -244250
6900 -244250 -96639 -204689 60974 -240531 -61051 -340294 -13169 218520 66427 41167 -225542
6888 -67690 -133174 62919 -293694 230125 -252647 -157723 -116690 93483 46589 -292678 -105600
6876 41884 -76563 -34768 -78297 -13586 110197 169026 -209417 90646 -122096 93445 178964
6865 178964 -162130 153252 -113739 229033 62498 -232396 236506 299699 -52211 -34570
6855 -34570 -59666 -11675 -54281 7989 -215907 -132181 296870 -298331 109455 38141 -92992
6843 42058 -130698 91828 141215 61886 41955 -303806 -154325 -141756 -154263 -121159 -26504
6831 -44883 -96716 -94272 -28655 171550 -86855 374940 56492 -428408 -176032 212959 -207511
6819 -148677 14674 -180388 136849 136030 -22636 93004 380350 -229449 -492698 -326746 48028
6807 -385426 -209792 -116012 -201879 292809 -188051 10151 147188 -142920 -223401 74425 197320
6796 197320 -278276 -92101 -47383 -155289 -129841 -59732 142183 90957 -78916 -267835 5527
6784 56325 -197934 9307 249155 -83100 -33457 75545 37708 -21682 -149626 -337824 -121033
6772 8144 292789 23288 -324759 -87710 256039 -141318 172136 -120989 161645 -100992
6761 -50124 -79202 -28547 33546 -24257 -104587 -803 -59311 -134900 -196200 31101 -145336 -189372
6749 -189372 30382 78210 -202212 -26536 -46351 -3637 -20417 10499 -13266 -78607 49816 -211965
6736 25871 -9132 -79 82181 21410 23103 59529 199186 135361 50811 -140059 58273 -6051 -383453
6723 -383453 -146443 -101434 241245 -321391 -24455 401544 -354871 132186 -12747 -218627
6713 -218627 -288888 -206656 -33591 359084 -15594 52422 -121651 920 6638 -45861 55264 34969
6701 34969 -51048 9413 -309414 -249376 184346 -145284 -56467 197649 -94220 -92086 153083
6689 50427 124791 186901 97698 -356424 -227560 227429 -159869 222683 -64530 114349 -9164
6677 -175084 -40785 -212591 18990 -185067 -322658 27571 171746 108151 -119919 3279 -145159
6665 -205252 202685 61895 316839 -49560 86703 228938 -109103 -128834 -87806 -275786 -39599
6653 -263541 -284077 -83079 103130 123630 -11229 -28362 63925 -107730 65428 -197734 -177593
6642 -177593 -149392 189879 60463 -61964 198763 93897 -10937 -148225 66570 300368 -137985
6630 2714 -52485 89338 141697 273053 -426455 -220253 -200965 223243 149842 402308 163062
6618 -182401 -103764 -134308 86595 -38810 -188259 94358 121081 21285 165515 150420 210541
6607 210541 -145551 -302845 -347051 7900 296936 200553 -120345 -205748 -60870 51075 -210853
6595 123850 -113279 3039 168441 -1919 -39295 10352 180617 62338 -261980 -86064 31819
6583 35900 -52332 -34367 -35671 391088 -237745 -47004 150171 -193180 142836 -37726 241135
6571 -114944 -178749 -36765 195371 273911 -63501 -176912 77407 -108948 300253 64762 255159
6560 255159 96809 -399489 -195102 223415 103632 -25154 153087 -40514 -247145 -323913
6550 -323913 -79278 34485 440089 -133234 659 -67410 198252 -72932 194567 -165017 -160425
6539 -160425 94056 48238 -265503 124067 127828 -314363 -77485 -11839 121639 204648 62075
6527 -309342 -170032 314369 34124 74929 -117321 -133396 -98227 307182 349799 9259 -203505
6515 -78425 -78558 -137563 39788 -195281 84185 81683 15396 -29720 -20995 237114 -50912 -216797
6503 -216797 -140087 -302927 190908 -137109 -17 146223 -224586 -222148 72255 155067 -241803
6491 255172 -23705 196555 -41818 -85313 -51111 -26957 24713 -172846 -158100 -38154 8374
6479 -67442 179667 -94686 -10490 54053 -37015 -132353 -194421 -108185 468062 -239626 185122
6467 -19624 90620 170520 -120918 79622 184003 206218 -125123 -305505 119964 -246958 51445
6455 58248 -121404 -429865 326943 39009 180904 -20410 122104 -177948 -256272 223716
6444 -62579 -213277 -63741 366629 -79224 351864 185034 -76558 -73697 110473 -245293 39880
6432 159682 190272 -74894 -226506 73886 -115322 228914 74102 104692 -318751 50817 34626
6421 34626 104316 -204387 95686 -69815 159433 -190357 126079 -60761 -98491 -88647 -291007
6410 -291007 -236515 -49271 -182644 38304 -176137 -181750 -134470 7277 -457914 333945 324866
6399 324866 -89511 -64274 315537 36873 -177130 -63163 -91798 364534 309221 729 20344
6388 20344 -16506 -181572 -180756 13716 -39063 -140774 49996 189800 36884 81076 123515 -51001
6375 -95653 281077 233311 81745 103834 260107 -159261 93912 43333 534336 48850 285668
6364 285668 -72824 -122481 227170 87088 175824 -6863 -307207 328027 -308649 -111954 -48028
6352 -162833 -53027 -344457 60002 105579 30928 92755 -118721 -46987 -151845 -235940 -22622
6340 202143 80047 -279646 -45333 200227 -126583 -135086 334237 -101183 121104 -376127
6329 -257164 12900 145377 3058 -138887 -485069 125167 114713 189511 -182159 -51766 229459
6317 -153897 -98776 -173218 -2265 102920 111648 -169326 23691 234183 95666 191711 79139
6305 42551 207075 -179400 -90677 180800 134155 41106 -224845 220015 -151573 -168933 17327
6293 61313 -126951 -192210 227461 136348 -27252 -185305 61549 48229 -94320 134822 2688
6281 -113808 320791 132229 113388 41766 -130824 152598 -86583 -123454 -13439 -64871 -15771
6269 -304594 383135 -216823 149637 385692 3186 -39425 109279 -93555 -426113 -173877
6258 -1991 167339 -108638 11859 198874 252227 313093 -145557 118475 -4053 -327151 140013
6246 -158512 -204691 -82561 -196648 -301705 -100334 -138274 -162384 -28847 47110 -348129 -269522
6235 -269522 -86971 -188067 268122 -150292 -21632 27583 70397 33239 -78807 107705 24966
6223 75993 -55292 348477 81774 11657 -6934 -30517 -1838 206677 -31534 -246212 39124 207815
6211 207815 53847 -287780 -228792 245957 -120911 50380 141693 -176953 -163288 345679 258615
6200 258615 -29314 -67413 -103344 161751 -186233 176790 -184514 34295 -60783 63579 -15397
6188 89150 46868 184374 -126008 -80176 -2255 -276622 -96488 20812 354938 15541 255627
6177 255627 -87555 -220223 178818 -130623 -105496 6782 78510 -231466 15120 -132698 -138987
6166 -138987 -44425 65382 -46191 -35978 96379 -395558 69768 -5172 276578 236573 214440
6155 214440 65269 6997 -347123 -31112 74393 -114135 -350455 63253 3523 21973 -37230
6143 -122578 -107893 -45397 442876 47349 -33804 -111637 -221521 -227849 -48896 -274489 190418
6131 -71598 -18390 148535 -479409 -374599 -245060 610441 223831 5677 -80119 106524 -49741
6119 143792 -57557 -63009 -221779 85893 -225004 -64863 145026 164823 -138945 109713 -221945
6107 -356738 -80355 -246543 -18703 -191325 -88303 46156 70056 326585 137204 -92083 146260
6095 72116 -170191 202969 -63656 113381 199682 32082 71294 295309 41339 5641 78256
6084 78256 222336 98248 -150251 -54548 369736 -23970 368120 67169 166595 -312252 133438
6072 -179842 75178 -98489 302378 -162064 20794 111682 267955 -204182 144231 99157 -42852
6060 -161455 -45401 40900 -100327 82398 30391 87924 -270900 74681 -36621 262885 -146525
6048 -4554 -113241 -24887 -332119 -81949 185713 -35809 110455 -431168 24570 11858 -331833
6036 -64684 147433 -25788 -72678 -270452 -49711 123299 -414079 1544 40842 -13429 -112899
6025 -112899 -51959 -313058 136671 14402 55413 -56477 -166878 351427 263196 -132060 447786
6013 140418 128732 375950 -67775 -273232 -20702 58554 149529 -42296 225864 333302 283424
6002 283424 39984 86344 -245509 -222582 -63655 -83540 -200641 41220 -113143 121978 -284409
5990 92250 -10345 -51326 -221258 -129392 -70323 63610 288906 -148471 -204734 -44642 -153436
5979 -153436 131949 245171 86813 151687 31543 -216669 99492 -132748 89572 -276038 92069
5967 143545 164333 -11783 -247231 5868 38726 -53927 -99485 69934 -229753 -198290 206909
5955 111554 -16509 237929 161696 21637 16322 -34156 112586 122453 36606 121739 266222
5944 266222 136339 183667 373773 -136700 256523 -242692 -343387 90082 -120199 127373
5933 -36283 -378118 96891 208627 76036 -54372 -175615 80164 225193 62412 217833 -66011
5921 30835 -798 199728 213649 388764 -216639 -334404 -268869 203485 50104 -144886 212483
5909 -386258 69887 75659 94060 -103700 42654 236622 154373 32605 195286 1081 21121
5898 21121 -225791 271284 -120122 -134925 35855 -5590 201472 153483 34819 286578 -29754
5886 183166 -77964 55938 -149918 -53096 130065 193897 -375464 -22197 6659 -142650 51219
5874 204158 -232977 58712 -101035 -197008 -216079 122420 -229501 -132323 -397901 -341360 82553
5862 -278263 -8528 34804 222436 64148 236816 -116761 4996 -116275 142556 -130928 61136
5850 170474 -65111 20676 -144622 260327 102160 -20766 -185757 155032 -52174 31871 -113963
5838 -43182 -34764 265564 127623 -144647 -202 106513 -78904 23772 316638 -388215 -357138
5827 -357138 -151881 -38011 10692 -340507 -23494 16363 182561 -389147 330216 -230270
5816 -63540 120589 182722 185124 -41106 -78209 -105317 -155571 209505 -233951 -171484 107287
5804 133518 143927 -91851 10328 142608 -213531 -48821 50755 -85864 -162853 -315405 -151217
5792 157654 -26720 -131431 80591 87001 151603 -70285 235509 -106793 -29728 -100251 34046
5780 -165436 26836 88718 89362 -112034 -130742 -54101 -81303 31843 28515 31375 -87071 6275
5767 133646 -348131 -142204 -62065 -221416 7229 163075 278892 -124603 -93650 183934
5756 -353835 258210 -507906 -100181 -132178 50017 -93669 75495 60218 177094 179350 -174824
5744 93246 -46094 -45737 6048 5239 236619 176555 120758 -109646 -55562 171135 247042 24177
5731 -73393 -136286 15969 90352 143329 130568 3928 -127941 -55284 148827 522756 184425
5719 -182118 5202 68571 23589 -115153 100956 196468 326538 -106699 136306 -15622 -178458
5708 -178458 -216440 -35639 70886 149555 -9943 -104810 3895 61807 180301 -85478 -316969 16988
5695 -6643 -341815 41450 -198541 -219083 -155552 288505 144832 137204 130499 -333723 237454
5683 -20026 -31016 146010 4872 72515 -42190 -16263 -242714 56433 260188 -206725 28809
5671 360914 -154415 73645 -117939 -75081 -275240 106535 208582 369617 -137906 -143764
5661 -143764 200125 -47428 107809 167341 95491 -87891 54192 -38585 392006 -64318 138367
5649 183105 -146790 -2017 -91262 14278 -205406 167991 -178048 156142 206974 -258918 108340
5637 60475 289385 -330645 -186498 -89526 -680 186971 -180516 -117707 -232004 -148398 -46088
5625 245361 -157336 -57695 54502 45539 218116 140552 -112369 -50063 -194325 222197 -69897
5613 -144273 257796 -128650 -5644 -23274 53594 242729 383879 117107 -133431 -357969
5603 -357969 -58694 276367 124875 -183918 -301498 -85320 56040 -129183 -136185 -243528 177172
5591 26353 -219563 -125364 9424 -164875 193909 -21167 -13564 -55800 169194 383654 243203
5580 243203 23085 -319862 280814 -22105 144373 -120137 -344943 -36651 -171815 67039
5569 -42502 -30237 8322 91584 -88483 131011 -374157 215104 73231 226777 1065 101617
5558 101617 71458 83776 -183133 -44426 -154182 -179952 -393752 38564 201199 65239 154939
5547 154939 62086 281656 98321 20047 136033 -175428 287579 60492 102482 -194575 -69607
5535 -119764 47565 -331214 172399 152192 -289438 -380252 16087 -207000 -77076 253103 61533
5523 111680 -22595 -95045 -21890 210914 341367 -308905 185986 334819 72110 -138241
5512 -176300 -263780 -119737 131821 -115485 221042 -362704 -135503 -17532 284275 -266064
5501 -30728 -72170 29955 -33069 -149219 -209498 -327236 227070 232567 -4031 -16879 -41643 174879
5488 -109764 113638 -236659 77660 7887 -209989 252822 150659 137016 -154999 222771
5477 88046 -220613 -300452 -13616 -196311 305364 6044 -203035 -240678 -37050 -352945 90828
5465 124482 -12339 -316866 279457 122641 -58906 -156630 -162219 -114579 148278 91514 208502
5454 208502 119892 -46067 140734 72621 106872 67787 -11166 -27931 88313 -100850 323841
5442 -52763 -77445 -32424 -78346 -78329 33956 111138 -13760 102360 -242425 186443 159762 -142766
5429 96135 194426 -5641 -355294 93688 -54004 -249828 364402 170885 -4459 -223196 -75148
5417 193448 -408552 72031 -76760 -163032 32168 -128650 111685 -18507 -172536 168353 -63503
5405 338154 6044 -153185 -25927 123248 165822 -103646 -76106 42845 -281886 -18474 88331
5393 -22184 108762 -51949 -1589 -272747 242145 -101204 139053 79699 -178625 119535 -72026
5381 -8165 171010 -253272 -257080 271556 22464 133269 -56643 74916 -106322 7611 -133069
5369 -136675 -88922 181721 28766 -123541 93463 209255 143975 -137666 47484 37163 -100423
5357 38797 250910 -215353 -49909 123625 -105777 -45216 219121 -308188 164239 -35950
5346 -33810 22607 273767 -127669 -116852 -79200 -235352 -205990 293753 67982 17260 209258
5335 209258 202578 113819 403994 -207449 23950 100745 87720 165527 -144134 -224057 160485
5323 -49409 -197273 477494 -89481 144131 -455312 -5805 21451 -241314 372514 -9091 -93224
5312 -93224 -72582 103192 -261935 -143327 -322860 -331426 495731 -15621 5252 -486114 137657
5300 89130 207803 65101 104227 106252 85038 -66251 -50834 -11594 50202 -132649 -309951
5289 -309951 133117 -215419 3873 27771 -181318 242254 -353170 189162 -61410 -134533 -223394
5278 -223394 228129 -161344 23146 -29148 -91212 29258 -90691 -179974 93207 101170 -35805
5266 17832 -104854 -186714 131807 -80793 487999 -124241 155470 59802 -27270 51483 158612
5255 158612 50965 -74492 -109510 -15189 108368 12940 320374 -44611 330446 -421449 -31010
5243 156085 -172074 -72618 170859 -176921 -240893 -99175 117139 -25514 -76083 4338 201541
5232 201541 461712 -203081 124471 351383 191896 -35836 -171118 392313 99591 49257
5221 -102776 -125669 -24209 123705 56474 -294458 10351 -21504 -224306 180892 -361 156260
5209 -159941 -257729 -256397 -85922 96373 67805 -14710 -309602 -103514 60020 -178838 -113317
5198 -113317 -59542 23275 50669 172101 -21789 -63186 8831 -116179 306542 -35393 -29086
5187 -29086 -28185 -105720 -205768 141189 47461 77922 -215953 -337046 -79142 226770 -161216
5175 -131245 26013 198433 77301 -156466 -120446 -471063 -107692 299567 -28550 -165257
5165 -165257 -78958 121581 323125 148475 330542 -193258 -301681 160567 214615 -76563
5154 23721 134607 -235277 139666 273415 -27908 -291201 4710 167321 388522 -120673
5143 -103995 -299128 -78751 173461 -146016 11200 232230 24977 -19173 -81966 120254 90490
5132 90490 73690 -56088 -671124 -157452 222024 -15734 -47119 38744 170913 81400 -233740
5120 -81208 -262896 28945 -255293 -67530 205218 155800 220884 342396 -181473 -156382 -23170
5108 -169409 -148984 69581 25730 73490 -169954 -9324 124663 171306 310067 -136258 193630
5096 37397 -11785 231584 61703 130371 167898 67975 -125547 215747 -248071 -68825 298469
5084 -11859 76578 -22967 -15124 189838 39590 61752 -97888 37273 -97988 -237902 232850
5072 -127350 -367530 -340606 118196 116928 184176 45173 96068 51620 -76230 -19894 258671
5060 180536 -148681 187842 -131263 21746 -307106 279631 -74037 332269 -25203 -56209
5050 -56209 -138004 29195 -22035 -164214 -326218 87422 202181 -47653 -61559 158436 44534
5038 174336 -136185 164542 256892 -95229 141129 -52389 355803 142396 192994 -81100 -116705
5027 -116705 -51522 -23070 74079 -170407 -97708 76570 -155915 -45626 120687 -279422 117747
5015 142576 -182168 -159614 -19146 -13330 138176 329012 -234626 -44971 147987 180313 -212493
5003 -32285 389689 24506 105100 -71207 371617 -7426 87559 189263 -25742 -24514 12004 83864
4991 83864 -134308 -288376 14494 -393457 -37638 131359 19133 277 -171283 13844 -38530
4979 -3192 -31270 147364 -271748 203990 -213939 -268318 115582 -294951 -19136 -32631 -27217
4968 -27217 -173918 -217761 161791 -103461 215741 139586 75187 299293 2978 -115127 -61804
4957 -61804 94819 -21486 123218 -254511 90966 -43766 -340514 -94841 9376 -87346 -27028
4945 -200897 66955 -136323 -155550 -9955 450033 -102939 207582 128318 -276150 -128999 9773
4933 130245 170569 -86284 -108884 287111 13746 13493 7746 -106773 98244 84194 -73145 14215
4920 -167172 -149443 -77676 -13973 185024 -55788 68487 -130209 297243 88830 -284862 304201
4908 216168 -27602 -181157 -17655 486 -330848 231091 173880 213539 140571 -291278 -72741
4896 366295 13298 45969 -233466 18066 207262 197095 69572 212466 -415616 51218 -73564
4884 -45182 -125928 -102867 125444 -227773 35052 -289629 139075 119801 180279 72759 -52023
4872 111859 17009 63796 239237 203867 -202321 -177497 237718 243272 159301 -8069 20558
4860 153509 -193662 -170355 78295 159059 -282821 -97200 94113 32443 -207754 226425 -77365
4848 220695 -191659 -123332 -26009 13596 203539 -361241 240306 70072 40732 4043 106365
4837 106365 67745 190973 -287945 241607 -119263 -127990 34075 41017 -96258 127356 -231523
4825 66594 -221289 50267 -152299 84155 222483 229231 -145107 -181909 233592 -38469 -139641
4814 -139641 -66241 -367677 -5777 203715 -158671 -313106 -165324 43317 -213117 88274 9370
4802 9505 44646 35119 -136032 145110 265962 -78079 -201328 96649 255232 1799 -65982
4790 -148219 48520 57723 -248737 -22328 308847 -174501 -76691 -125273 219983 8127 114301
4779 114301 12610 98153 5487 -15562 95731 -165056 -82809 -108359 -116735 27614 -181870 239477
4766 -356017 -86413 115803 70519 -102131 -26895 107420 -61309 134820 -69234 -522074 36746
4754 -5408 -88905 263097 -128256 94579 -81841 67473 -446437 94921 37951 72814 2511 20550
4742 20550 -40973 91340 -167288 -329577 -149643 -199743 -6822 -225830 76758 102495 -269727
4730 253502 -226942 -17310 135686 260317 -63489 322301 127681 37813 58790 44341 -103454
4718 119468 -25142 -17830 -109585 148626 238966 72656 41966 -191523 157517 94393 160508
4707 160508 142421 -49853 102788 241777 -291489 8241 332893 32650 -345175 -57823 -140065
4696 -140065 -116937 272084 -147786 292163 266203 -15568 281678 223588 201612 87457 -132340
4684 -1969 17419 293229 -572124 369703 67340 18709 -121359 12382 135936 104426 -99065
4672 260295 80783 -69887 10727 32455 -53540 188061 343115 -47655 163196 32125 -124930
4660 324349 -88287 60772 -67564 266889 113189 -250481 -139432 235062 -34149 -166733
4650 -166733 -1060 -56362 -265716 111747 40994 -283971 -208735 50056 143522 43054 137876
4639 137876 -112204 36716 143804 141099 -148384 228774 -96029 -163556 4411 212251 79629
4627 -115183 156520 41295 24292 -121573 419394 -232785 -310920 -397278 -34627 20049 -283199
4615 -209931 -112467 46438 68627 -134373 -160879 -143372 -152944 60104 -53492 14995 -101192
4603 62601 184010 3137 461639 -65809 -42105 -131974 20584 -274522 235101 104717 -199161
4591 -109406 -34456 284520 -149684 201704 -225877 208273 249132 -184883 -91312 8847 205387
4580 205387 -5533 88318 -116068 399338 5017 352343 -220938 -301732 -147490 -303865 195107
4568 123882 107203 -178988 -253165 -80136 115319 -145021 57968 -142134 8597 -317704 102959
4556 101352 92292 118216 -40695 48300 178357 -217573 148337 48595 -44265 305397 373022
4545 373022 -67106 -271386 -141646 155454 11201 217936 -38157 280357 46694 -358850
4534 -273606 -44872 -234423 120344 -327950 -176310 -167080 -80629 -138035 -209316 -199831 178544
4522 -229755 -75288 61165 49567 -162040 -198141 -234726 -208206 -225573 -259475 313267 -231212
4510 57713 114097 -93492 416080 -89452 110159 195886 200593 -24430 119996 252243 -131900
4498 271621 414585 -112732 49136 202559 -263431 -20634 77115 -59118 -155600 -103615 176818
$$ [...]
##END NTUPLES=NMR SPECTRUM
##END=
