##TITLE=AC1630_CENAH_8450699_BVz0JcE8hV
##JCAMPDX= 6.0         $$ Bruker NMR JCAMP-DX V2.0
##DATA TYPE= NMR SPECTRUM
##DATA CLASS= NTUPLES
##ORIGIN= BRUKER
##OWNER= Administrator
$$ 1.72 TOPSPIN		Version 2.1
$$ 2014-02-18 16:24:44.798 -0800  Administrator@X
$$ Compression mode = diff/dup
##.OBSERVE FREQUENCY= 400.02188249412
##.OBSERVE NUCLEUS= ^1H
##.ACQUISITION MODE= SIMULTANEOUS (DQD)
##.ACQUISITION SCHEME= undefined
##.AVERAGES= 8
##.DIGITISER RES= 22
##SPECTROMETER/DATA SYSTEM= spect
##.PULSE SEQUENCE= zg30
##.SOLVENT NAME= COFFEE_meoh
##.SHIFT REFERENCE= INTERNAL, COFFEE_meoh, 1, 14.98509
##AUDIT TRAIL= $$ (NUMBER, WHEN, WHO, WHERE, PROCESS, VERSION, WHAT)
$$ ##TITLE= Audit trail, TOPSPIN		Version 2.1
$$ ##JCAMPDX= 5.01
$$ ##ORIGIN= Bruker BioSpin GmbH
$$ ##OWNER= Administrator
$$ $$ E:\/data/COFFEE/nmr/AC1630_CENAH_8450699_BVz0JcE8hV/10/pdata/1/auditp.txt
$$ ##AUDIT TRAIL=  $$ (NUMBER, WHEN, WHO, WHERE, PROCESS, VERSION, WHAT)
(   1,<2014-02-18 16:24:38.360 -0800>,<Administrator>,<X>,<go>,<TOPSPIN 2.1>,
      <created by zg
	started at 2014-02-18 16:23:32.610 -0800,
	POWCHK enabled, PULCHK disabled,
       configuration hash MD5:
       C8 4E 4E 5D D3 5C D8 9E 9F 52 82 E0 59 8A DE 15
       data hash MD5: 64K
       AE 05 CF 75 0D EA 18 FD DF 11 F1 56 B4 F0 C0 E5>)
(   2,<2014-02-18 16:24:41.189 -0800>,<Administrator>,<X>,<proc1d>,<TOPSPIN 2.1>,
      <Start of raw data processing
       efp LB = 0 FT_mod = 6 PKNL = 1 PHC0 = 0 PHC1 = 0 SI = 32K 
       data hash MD5: 32K
       41 C2 C0 07 4F 96 E9 22 43 A0 77 66 C1 7C 2E F6>)
(   3,<2014-02-18 16:24:41.454 -0800>,<Administrator>,<X>,<proc1d>,<TOPSPIN 2.1>,
      <pk PHC0 = 95.95459 PHC1 = 0 
       data hash MD5: 32K
       38 46 9F C6 43 01 1A C4 44 ED F4 87 63 C4 31 0B>)
(   4,<2014-02-18 16:24:41.532 -0800>,<Administrator>,<X>,<proc1d>,<TOPSPIN 2.1>,
      <abs ABSG = 1 
       data hash MD5: 32K
       ED 49 70 44 E7 1B AE 76 4D 39 F6 AE 5D DC 63 13>)
(   5,<2014-02-18 16:24:41.579 -0800>,<Administrator>,<X>,<proc1d>,<TOPSPIN 2.1>,
      <abs ABSG = 2 
       data hash MD5: 32K
       43 5F E6 6A 04 78 05 0D 2F 8F 3C C7 F2 55 52 0C>)
(   6,<2014-02-18 16:24:41.657 -0800>,<Administrator>,<X>,<proc1d>,<TOPSPIN 2.1>,
      <abs ABSG = 3 
       data hash MD5: 32K
       97 8C E4 F7 B9 1B 5E EB 97 36 74 B3 48 FE 7A CE>)
(   7,<2014-02-18 16:24:41.704 -0800>,<Administrator>,<X>,<proc1d>,<TOPSPIN 2.1>,
      <abs ABSG = 4 
       data hash MD5: 32K
       E4 51 AD 4F 94 6A B9 0B F7 23 28 17 66 9E 64 39>)
(   8,<2014-02-18 16:24:41.767 -0800>,<Administrator>,<X>,<proc1d>,<TOPSPIN 2.1>,
      <abs ABSG = 5 
       data hash MD5: 32K
       CA E7 33 D8 E0 78 97 D3 5E C9 20 1C 46 15 17 CB>)
$$ ##END=
$$ 
$$ $$ hash MD5
$$ $$ A6 3B A0 4E 91 3D 02 0A E4 0F 31 78 29 51 D3 5A
##$RELAX= 
##$RELAX= 
##$RELAX= 
##$RELAX= 
##$RELAX= 
##$RELAX= 
##$RELAX= 
$$ Bruker specific parameters
$$ --------------------------
##$DU= <E:\>
##$EXPNO= 10
##$NAME= <AC1630_CENAH_8450699_BVz0JcE8hV>
##$PROCNO= 1
$$ [...]
150 150 150 150 150 150 150 150
##$TP07= 0
##$TPNAME0= <>
##$TPNAME1= <>
##$TPNAME2= <>
##$TPNAME3= <>
##$TPNAME4= <>
##$TPNAME5= <>
##$TPNAME6= <>
##$TPNAME7= <>
##$TPOAL= (0..7)
0.5 0.5 0.5 0.5 0.5 0.5 0.5 0.5
##$TPOFFS= (0..7)
0 0 0 0 0 0 0 0
##$TUNHIN= 0
##$TUNHOUT= 0
##$TUNXOUT= 0
##$USERA1= <user>
##$USERA2= <user>
##$USERA3= <user>
##$USERA4= <user>
##$USERA5= <user>
##$V9= 5
##$VALIST= <valist>
##$VCLIST= <CCCCCCCCCCCCCCC>
##$VD= 0
##$VDLIST= <DDDDDDDDDDDDDDD>
##$VPLIST= <PPPPPPPPPPPPPPP>
##$VTLIST= <TTTTTTTTTTTTTTT>
##$WBST= 2048
##$WBSW= 25
##$XGAIN= (0..3)
0 0 0 0
##$XL= 0
##$YL= 0
##$YMAX_a= 614507
##$YMIN_a= -523009
##$ZGOPTNS= <>
##$ZL1= 120
##$ZL2= 120
##$ZL3= 120
##$ZL4= 120
##$ABSF1= 14.98509
##$ABSF2= -5.573092
##$ABSG= 5
##$ABSL= 3
##$ALPHA= 0
##$AQORDER= 0
##$ASSFAC= 0
##$ASSFACI= 0
##$ASSFACX= 0
##$ASSWID= 0
##$AUNMP= <proc_prof1d_extract_pilot.lims>
##$AXLEFT= 0
##$AXNAME= <>
##$AXNUC= <1H>
##$AXRIGHT= 0
##$AXTYPE= 0
##$AXUNIT= <>
##$AZFE= 0.1
##$AZFW= 0.1
##$BCFW= 0
##$BC_mod= 0
##$BYTORDP= 0
##$COROFFS= 0
##$CY= 15
##$DATMOD= 1
##$DC= 0
##$DFILT= <>
##$DTYPP= 0
##$F1P= 0
##$F2P= 0
##$FCOR= 0.5
##$FTSIZE= 32768
##$FT_mod= 6
##$GAMMA= 0
##$GB= 0
##$INTBC= 1
##$INTSCL= 1
##$ISEN= 128
##$LB= 0
##$LEV0= 0
##$LPBIN= 0
##$MAXI= 10000
##$MC2= 0
##$MEAN= 0
##$ME_mod= 0
##$MI= 0
##$NCOEF= 0
##$NC_proc= -8
##$NLEV= 6
##$NOISF1= 0
##$NOISF2= 0
##$NSP= 0
##$NTH_PI= 0
##$NZP= 0
##$OFFSET= 14.98509
##$PC= 1
##$PHC0= 95.95459
##$PHC1= 0
##$PH_mod= 1
##$PKNL= yes
##$PPARMOD= 0
##$PPDIAG= 0
##$PPIPTYP= 0
##$PPMPNUM= 2147483647
##$PPRESOL= 1
##$PSCAL= 4
##$PSIGN= 0
##$PYNMP= <proc.py>
##$REVERSE= no
##$SF= 400.02
##$SI= 32768
##$SIGF1= 0
##$SIGF2= 0
##$SINO= 400
##$SIOLD= 32768
##$SPECTYP= <>
##$SREGLST= <1H.CDCl3>
##$SSB= 0
##$STSI= 32768
##$STSR= 0
##$SW_p= 8223.68421052631
##$SYMM= 0
##$S_DEV= 0
##$TDeff= 65536
##$TDoff= 0
##$TI= <>
##$TILT= no
##$TM1= 0
##$TM2= 0
##$TOPLEV= 0
##$USERP1= <user>
##$USERP2= <user>
##$USERP3= <user>
##$USERP4= <user>
##$USERP5= <user>
##$WDW= 1
##$XDIM= 32768
##$YMAX_p= 476883332
##$YMIN_p= -727806
##$CURPLOT= <Network HP LaserJet P1505>
##$CURPRIN= <$Network HP LaserJet P1505>
##$DFORMAT= <normdp>
##$LAYOUT= <+/1D_H.xwp>
##$LFORMAT= <normlp>
##$PFORMAT= <normpl>
##$SURQMSG= 1
$$ End of Bruker specific parameters
$$ ---------------------------------
##NTUPLES= NMR SPECTRUM
##VAR_NAME=  FREQUENCY,     SPECTRUM/REAL,   SPECTRUM/IMAG
##SYMBOL=    X,             R,               I
##VAR_TYPE=  INDEPENDENT,   DEPENDENT,       DEPENDENT
##VAR_FORM=  AFFN,          ASDF,            ASDF
##VAR_DIM=   32768,         32768,           32768
##UNITS=     HZ,            ARBITRARY UNITS, ARBITRARY UNITS
##FACTOR=    0.250966925370066, 1,           1
##FIRST=     8223.43324360094, -413259,      66637
##LAST=      0,             162619,          -152821
##MIN=       0,             -727806,         0
##MAX=       8223.43324360094, 476883332,    0
$$ Real data points
##PAGE= N=1
##DATA TABLE= (X++(R..R)), XYDATA
$$ [...]
19571B51975B2021a88300B64100g0600A45215n5255Q6546g4919p0178o8854C7702
19559e0338c591B79496G1421c59278G4948b98060A04589o512b05179k1128a1089
19547d5651k0405k42804I5875B3361a180k41829c7315D7504c1122B14995J69372
19536C84367b88752g1949C704J54743a6577j76573j32244J24192m5730P9289K7461
19525a40182F0758k1361b78378J36844j10485j6209A45376f9490j47872a04473
19514a47050n8527A3914a12745k9657c9362k3635H7884a36458k70159j31077E7139
19502a14388I5348m1024b42158G0009K12133e35768J32184J51893Q4763b645D0089
19490h3772A72564a13432j16104N0776E3692a26176j15376c906B10079c99694
$$ y = [251975, 22021, -188300, 264100, -70600, 145215, 89960, 176506, -74919, -145097, -213951, 37702, -50338, -3591, 279496, 71421, -359278, 74948, -298060, 104589, 98077, -205179, -226307, -11089, -45651, -66056, -308860, 95875, 23361, -1180, -243009, -37315, 47504, -31122, 214995, 384367, -288752, -71949, 3704, 158447, -16577, -193150, -325394, -201202, -246932, -167643, -140182, 60758, 39397, -278378, -141534, -252019, -268228, 145376, -69490, -217362, -104473, -147050, -205577, 13914, -112745, -142402, -39362, -62997, 87884, -136458, -406617, -537694, 57139, -114388, 95348, 54324, -242158, 70009, 282142, -535768, -403584, -251691, -166928, -2645, 40089, -83772, 172564, -113432, -229536, -178760, 53692, -126176, -241552, -3906, 210079, -399694]
19479c8991m0177j46285A11251g4205j72216A89102a76943l5303A54619k0565
19469A34054j1424b44322G1462a79730e5293A9500a20738m836r8273i7174k9373
19458a26547C5037J06321c20593i2437m518H9632b84088l8356A996a00960B2788
19446C35665C1224L7129a89629o0376o1388C5968g1611I1415A0926Q3948a88950
19434a0128j34358A69262l8056D9815a9319A39918a06818l5729J3829I259d3386
19422c7924j87665E0788P0611a08012J0046C4824c16496D6442b20062E9526a92288
19410c7896A89613p9617c0419j0767G8922J23341e4105q0164J4743b9751B84272
19398d40303C7447a24109k50189a63425R579F3413e3696k18193f213j36023d6675
$$ y = [-38991, -79168, -225453, 111251, -74205, -246421, 189102, -176943, -212246, 154619, 134054, 122630, -244322, 71462, -179730, -55293, 19500, -120738, -125574, -223847, -97174, -126547, 35037, 141358, -320593, -92437, -96955, 89632, -284088, -322444, 1996, -100960, 22788, 335665, 31224, 68353, -189629, -250005, -311393, 35968, -71611, 91415, 10926, 94874, -188950, -10128, -144486, 169262, 131206, 49815, -19319, 139918, -106818, -142547, -128718, 9259, -43386, -37924, -225589, 50788, 121399, -108012, -97966, 34824, -316496, 46442, -220062, 59526, -192288, -37896, 189613, 109996, -30419, -41186, 78922, 202263, -54105, -134269, -119526, -29751, 284272, -440303, 37447, -124109, -374298, -163425, -153846, 63413, -53696, -271889, -6213, -142236, -46675]
19386a19176A16286a45101C0311a03171n7237g0323k38250J50059j13193i5176
19375B45816b50849c9327l16085A51934m3609Q8280c12106J55611e5158B0383
19364b27652k21861a43442f3596m6777i354l75763a09873Q070E3122M87684a33404
19352B67806A0396N6178k414K3952b97741a39628l251b3811G567K10187a69237
19340b36764N727A58147b76295R1149B6633b31589a02176q0815B1211c46079J03128
19329b42951P4146l2583j56519E1594b93844L7743p419d7237I2964b10748A28417
19317d63786A37144e23j1678A17547M6128A4256b80587A47253F492f014k91610
19306b97624c9730m1653j0122l0734D2722J2480h0826j03354o2885B4459h9853
$$ y = [-119176, 116286, -145101, 30311, -103171, -160408, -70323, -308573, -158514, -271707, -95176, 245816, -250849, -39327, -355412, 151934, 108325, 196605, -312106, -156495, -55158, 20383, -227652, -449513, -143442, -63596, -110373, -9354, -385117, -109873, -101803, 53122, 540806, -133404, 267806, 10396, 66574, 64160, 88112, -297741, -139628, -142879, -23811, 7567, 217754, -169237, -236764, -231037, 158147, -276295, -185146, 26633, -231589, -102176, -182991, 21211, -346079, -242951, -168805, -201388, -357907, 51594, -293844, -256101, -263520, -47237, 92964, -210748, 128417, -463786, 137144, -523, -12201, 117547, 163675, 14256, -280587, 147253, 6492, -6014, -297624, -39730, -81383, -91505, -122239, 42722, 55202, -80826, -184180, -247065, 24459, -89853]
19294c8108l1027j10795e5777j75818R0416B2718A752e9256j3372b0301p2151
19283i2452C73520a68425A20600b11199A23130b41975a02987J0396c9242A37833
19272F7457K80796A47168g27806i787A9246P694a41999j3509C31989g5832A44708
19260a2379o2995E4959h8980A12502b80327c7656A3484N4667a07815E679J70264
19249A75943n2158e4752q8971J8553A66666c04632J24787h5448C4186c0607C28730
19237a13545r6475A93942r687i740B8019c88619B08980f9952i751l58246J19655
19226b48342A7928J26147a35517A73004F9037J31584b16891C131K70182c76778
19215a39121j08864r0882o3896f4663A29060J80612j17404c8471k58193j23737
$$ y = [-38108, -69135, -179930, -55777, -231595, -141179, 22718, 1752, -59256, -72628, -20301, -92452, 373520, -168425, 120600, -211199, 123130, -241975, -102987, -92591, -39242, 137833, 67457, 348253, 147168, -727806, -9787, 19246, 26940, -141999, -155508, 331989, -75832, 144708, -12379, -75374, 54959, -88980, 112502, -280327, -37656, 13484, 68151, -107815, 5679, 175943, 123785, -54752, -143723, -125170, 166666, -304632, -179845, -85448, 34186, -30607, 328730, -113545, -210020, 193942, 184255, -9740, 28019, -388619, 208980, -69952, -9751, -367997, -248342, 17928, 144075, -135517, 173004, 69037, 200621, -216891, 3131, 273313, -376778, -139121, -247985, -338867, -402763, -64663, 129060, 309672, 192268, -38471, -296664, -420401]
19205d20401A56983N509J17019I6627c3525A39811d6805o1085L6504A08305h3747
19193A41119a33469d4640k8615J2084O53a156j80161f207G8162b24372p5009A85145
19180D7019J54258a86989E1125J84801C6673a71801q1960L5149e0066j94501D453
19168A18536a58487g7630A01056B8870b9980A84110g1089p8021J3323A62323f5870
19156b56666m4659D9463M241b31063J8705R3567H0036l5919a13333j9217c3702
19144a4015A62165F6818j570R0958f1506j37789Q9342j56603j28317I6164h2438
19132a95649A66352f1760j01016d2861n7795A4287o178a59689q5971C3429N2598
19121H6027d45045a35837L6127C9689d26796I8767a81827j60597D9884c1029j51329
$$ y = [-420401, 156983, 162492, 279511, 96627, -33525, 139811, -46805, -107890, -71386, 108305, -83747, 141119, -133469, -44640, -73255, -61171, -60518, -1156, -181317, -6207, 78162, -224372, -299381, 185145, 47019, 201277, -186989, 51125, 235926, 36673, -171801, -253761, -218612, -50066, -244567, 4453, 118536, -158487, -77630, 101056, 28870, -29980, 184110, -71089, -149110, -135787, 162323, -65870, -256666, -301325, 49463, 53704, -231063, -212358, -118791, 80036, 44117, -113333, -132550, -33702, -14015, 162165, 66818, 65248, 156206, -61506, -199295, -109953, -266556, -394873, 96164, -82438, -195649, 166352, -61760, -162776, -42861, -100656, 14287, 8109, -159689, -245660, 33429, 86027, -445045, -135837, -99710, 39689, -426796, 98767, -181827, -342424, 49884, -31029, -182358]
19110a82358f5173D5653b3161A08425a37908C29539a41062L272A13386a15966
19099D3447f1253m1517A00477b14856C3778g1274j28242A88939a43864q4254C3867
19087a95784j13917a11350L8940r4170n123Q0820d2750k33623j22550E3504b12200
19075a3044k3514j23870e4256B37260a41778A64863p4806a879I6939e1470q8811
19064a40281f1836l73919a3518j78545A15899b36381A44533k8257a04539B6551
19053C0134c50127k1436I4000a22092l5780m1601B1367c30593A55341b81038a27272
19041a37255A25451D1404b83456a9952G0107K05916b51755I4041b72004B0846
19030B56050a31540G8169L3984k7952H928J87199J09616a9141A88101m4257a4232
$$ y = [-182358, -65173, 45653, -23161, 108425, -137908, 329539, -141062, -137790, 113386, -115966, 43447, -61253, -102770, 100477, -214856, 33778, -71274, -199516, 188939, -143864, -228118, 33867, -195784, -309701, -111350, -72410, -166580, -171703, -90883, -42750, -276373, -398923, 53504, -212200, -13044, -36558, -160428, -54256, 237260, -141778, 164863, 90057, -1879, 96939, -51470, -140281, -61836, -435755, -13518, -192063, 115899, -236381, 144533, 116276, -104539, 26551, 30134, -350127, -371563, 94000, -122092, -157872, -199473, 21367, -330593, 155341, -281038, -127272, -137255, 125451, 41404, -283456, -19952, 70107, 276023, -251755, 94041, -272004, 20846, 256050, -131540, 78169, 112153, 84201, 8928, 196127, 305743, -19141, 188101, 143844, -14232]
19018d7972j28837I4249c7503p5973F6225L6617a62819q9133H5649b51739C0521
19006A99373i1933I5933a44651p2922E1549a20854r0080H6407B4986O7968f6245
18994a45407b3609J0325I0399b12023k5423E6325e3243q4366j6521B3381R6465
18983A19846K46041a21563l22626J91927A6978J2678a21615b4913k87156B43885
18972d8038I3825K85353a5296B06762c12805C2481b79842b7118A62466F8889a77786
18960B26440R5703d82078b39346j63444e266D0028K53322a75372L8931i369F2047
18948d2314j22904l0797I2921d6503D2837j1783J42295i0204m8393o558K7878
18937a17277L3345p8113j05848l9369j21834P9586D5802i3431D92989a35017B41559
$$ y = [-47972, -176809, 94249, -37503, -113476, 66225, 102842, -162819, -251952, 85649, -251739, 30521, 199373, -91933, 95933, -144651, -217573, 51549, -120854, -210934, 86407, 24986, 92954, -66245, -145407, -23609, -13284, 90399, -212023, -237446, 56325, -53243, -137609, -154130, 23381, 119846, 365887, -121563, -444189, -252262, 16978, 29656, -121615, -24913, -312069, 243885, -48038, 93825, 379178, -15296, 206762, -312805, 32481, -279842, -27118, 162466, 68889, -177786, 226440, 322143, -482078, -239346, -402790, -5266, 40028, 293350, -175372, -136441, -9369, 62047, -42314, -165218, -196015, 92921, -46503, 42837, 31054, 173349, -90204, -138597, -145155, -117277, -83932, -162045, -267893, -307262, -429096, -349510, 45802, -93431, 492989, -135017, 241559]
18925e4335A00757d2103i844H0754f3616B21238q8117b57535A50889f2876j20780
18914a83656j18932R5691n8958B16604a47309E01568a96291C559b83389C08347
18903b67137A9412a68085P4107q1025e9666b0598D9334c77856a26758D168d0156
18891a08513D8113f8377l2111G0550J7694c21440j765J6682A58800i5012l53082
18880d48094b9654k59846f7789J2525j1406K6548j01205j71235e9219B08602a15958
18868G8580H504e6443k84405J17085B00399A1972O9757a53263Q196o818F6793
18856b35483f6230n148p4502A29982j1935l5993b1586l9238o7989j92079b8883
18844f6991o1993B7425i0679A57695d95890K11182A74420b59056i242D9940N157
$$ y = [-54335, 100757, -42103, -9844, 80754, -63616, 221238, 133121, -257535, 150889, -62876, -183656, -302588, -206897, -265855, 216604, -147309, 501568, -196291, 3559, -283389, 308347, -267137, 19412, -168085, -93978, -175003, -59666, -20598, 49334, -377856, -126758, 4168, -40156, -108513, 48113, -68377, -100488, 70550, 88244, -321440, -323205, -306523, 158800, -95012, -448094, -29654, -289500, -67789, -55264, -66670, -40122, -141327, -312562, -59219, 208602, -115958, 78580, 8504, -56443, -340848, -223763, 200399, 11972, 81729, -153263, -145067, -151885, 66793, -235483, -66230, -71378, -145880, 129982, 118047, 82054, -21586, -60824, -128813, -320892, -28883, -66991, -128984, 27425, -90679, 157695, -495890, -284708, 174420, -259056, -9242, 49940, 55097]
18833E5097c53169G0375b62382I1767d78857A4277M1537J66252a47234B1548d24730
18821A32083B1117b29284B2996a39776A58966E3162a47696B34590B6481L49105
18811C75586F1278a51184j06255A76048q1160C03K14944A5618b11464I9500f5790
18799B58860b50928d0254I135a73055N0484M1359C07109a24715L3079B17057N078
18788B22135a16527n1026K719e968l71076A33924q856g6235l5373e1812n8883
18777a10695j66500e6322o6264e0464j7880K0272b206B4244P0007a80770b7682
18765g9194M83C2505f496o7596H1148R8459C1617b4536r2447c1296k08791B70201
18752B16087F0278k2339a74687e111A02838A0114L3315J6119i5265A626b7044
$$ y = [55097, -353169, 70375, -262382, 91767, -478857, 14277, 55814, 222066, -147234, 21548, -424730, 132083, 21117, -229284, 22996, -139776, 158966, 53162, -147696, 234590, 26481, 375586, 61278, -151184, -257439, 176048, 94888, 303, 215247, 15618, -211464, 99500, -65790, 258860, -250928, -40254, 9135, -173055, -122571, -81212, 307109, -124715, -91636, 217057, 222135, -116527, -167553, -164834, -5968, -377044, 133924, 125068, -76235, -111608, -51812, -110695, -277195, -56322, -122586, -50464, -68344, -48072, -2206, 24244, 94251, -180770, -27682, -79194, -78711, 32505, -6496, -74092, 81148, 179607, 31617, -24536, -116983, -31296, -240087, 270201, 216087, 60278, 37939, -174687, -5111, 102838, 10114, 43429, 59548, -95265, 1626, -27044]
18740a21107l3278j5961n70b9299I5078K07861a2958B334b6170j1790m31744B945
18727b69861A61533J63592F3141d4507j71740j02119A57145K23034j62903j05783
18717A11493a49415C6142c04312H8855b16441G6477a90486A17825c6893A03455
18706A4887a13934c4806J2088k28030J5262J01925K188m6195q9782d0070j75039
18695b15109k13276a56115A43298n229a66014A20493g2259A44245b00421B05386
18684b15205R5830N5671Q791A96035q4979c12983c7290j17227F7312A786a52518
18672F3592a78277a8169p4695k23607a00641A9771J38416a57915A3350a10012
18661a72752d765A67912g0477A02648a42804b7268j8114j72154E5528p181B460
$$ y = [-121107, -154385, -170346, -170916, -29299, 95078, 302939, -12958, 2334, -26170, -37960, -469704, 2945, -269861, 161533, 325125, 63141, -44507, -216247, -318366, 157145, 380179, 217276, 111493, -149415, 36142, -304312, 88855, -216441, 76477, -190486, 117825, -36893, 103455, 14887, -113934, -34806, -22718, -250748, -235486, -133561, -131373, -177568, -267350, -40070, -215109, -428385, -156115, 143298, 138069, -166014, 120493, -72259, 144245, -200421, 205386, -215205, -119375, -63704, -54913, 196035, 111056, -312983, -37290, -154517, 67312, 1786, -152518, 63592, -178277, -18169, -92864, -316471, -100641, 19771, 158187, -157915, 13350, -110012, -172752, -4765, 167912, -70477, 102648, -142804, -27268, -45382, -217536, 55528, 48347, 2460]
18649A07031a23097D23869F5483a11443j1971C02057f5877B8177b19289q1859
18639c01148d1435q0587a8689p5850M4000A13073R0592g5918j46270J10742j09136
18628b20582f115l6410B9666L9305a1075j84574k64304A2923b23876l78430a07509
18616B49177E622c43973k01378J80309J75934B71809j34665b15985n3314d1873
18605D0269A8946h0739j43337F3242b82750D5826J22055a19193B45146A0739i52
18593a4633r8604B92453j19110E1894b35235A65037b71240E1606a34730A6223
18582A58375a7299A75865m8656B7060L3991B165K86573d51036a66999E4849P7974
18571A32823J03686A13241i4816B79100a20891k05464a03498k6797M5297A15518
$$ y = [107031, -123097, 423869, 65483, -111443, -123414, 302057, -65877, 28177, -219289, -301148, -41435, -122022, -18689, -94539, -50539, 113073, 203665, -75918, -222188, -111446, -220582, -6115, -42525, 29666, 68971, -11075, -195649, -459953, 12923, -223876, -602306, -107509, 249177, 5622, -343973, -545351, -365042, -189108, 271809, 137144, -215985, -269299, -41873, 40269, 18946, -80739, -224076, 63242, -282750, 45826, 167881, -119193, 245146, 10739, -952, -14633, -113237, 292453, 173343, 51894, -235235, 165037, -271240, 51606, -134730, 16223, 158375, -17299, 175865, 127209, 27060, 61051, 2165, 288738, -451036, -166999, 54849, 132823, 236509, 113241, -94816, 279100, -120891, -326355, -103498, -130295, -84998, 115518]
18560a16167j06510j07545E9150J24251p8755D2246K07585b71634c4234C0269
18549c16027a56418J3567O6609k49722h5918M497J7073B41569C4656b95256g0160
18537a83104c627j4773B06941e9990r9414M715F9134a9088A63343a18498c6922
18525a09990m6086q594G8572C0301a50500J0795d6159A20257c51094A0872M6191
18514E7063i1541L3305k5506L4017j02677c4477B01865n9583l151a91236j6969
18503b08205C9812B183R8707K5560a59056c018q5103b732C10159b57591a16973
18491f3849B83779d5102D647N129P5673b14162j0332C3766o800e2938B44755G4433
18478b58010j6658F2919c35740g1581B03863i7309E0225K31694q9748a69732O3539
$$ y = [-116167, -222677, -330222, 59150, 183401, 104646, 42246, 249831, -271634, -34234, 30269, -316027, -156418, -142851, -76242, -325964, -85918, -81421, -64348, 241569, 34656, -295256, -70160, -183104, -3627, -18400, 206941, -59990, -159404, -154689, 69134, -19088, 163343, -118498, -36922, -109990, -156076, -164670, 78572, 30301, -150500, -139705, -46159, 120257, -351094, 10872, 57063, -91541, -58236, -83742, -49725, -152402, -34477, 201865, 142282, 139131, -191236, -208205, 39812, 2183, 100890, 126450, -159056, -3018, -88121, -2732, 310159, -257591, -116973, -63849, 283779, -45102, 4647, 9776, 85449, -214162, -224494, 33766, 26966, -52938, 244755, 74433, -258010, -274668, 62919, -335740, -71581, 203863, -97309, 50225, 281919, 192171, -169732, -106193]
18467a06193j0152L1856o7616e7585E0908g8936K1848H79c75914a22520A87780
18455A82343a28205d54F9947b4176E9181a1118B7558M1200a03905j44317B2294
18443A73335D7772a94344d0856B24596b41010B5213a29072A05Q6799L1090b05556
18431B01443e1822B00704b18330A70199d22789a43990G0727c87045J51694J15178
18421a20173e1481k59795J00095A10193a64778C9836J9970f3649j80414f9517
18410d24244f5696A0262K3384J59239m7335b14441A46562l5561l2979f3098H9915
18398D74250g6018A31394P9167b37778i6403j27891e7661k28023R2016M2236m2467
18387a93899n8288A19814a98426I0782l2687J64209a06750A74667a55083M013
$$ y = [-106193, -116345, -84489, -152105, -57585, 50908, -78936, -57088, 879, -375914, -122520, 187780, 182343, -128205, -454, 69947, -24176, 59181, -11118, 27558, 68758, -103905, -248222, 22294, 173335, 47772, -194344, -40856, 224596, -241010, 25213, -129072, 105, 86904, 117994, -205556, 201443, -51822, 200704, -218330, 170199, -422789, -143990, 70727, -387045, -235351, -120173, -51481, -311276, -211181, 110193, -164778, 39836, 59806, -63649, -244063, -69517, -424244, -65696, 10262, 33646, 192885, 145550, -214441, 146562, 111001, 78022, -63098, 89915, 474250, -76018, 131394, 210561, -237778, -96403, -224294, -57661, -285684, -193668, -151432, -193899, -252187, 119814, -198426, 90782, 58095, 222304, -106750, 174667, -155083, -151070]
18377a51070A23528a26405o4331m6508r7528a32655B5733G611a10946G6867J76750
18366B53617k0257a21334I3316L26023d8366j33425A08981n1035d4211o3201j71499
18355b78911f8291j36258L4392a7920B16456d18077a44064c210A61268p5694J5826
18344A01400b47298f6100B19171d6883G8866i1736l16680J57001A18397L3888
18334A52285J6028J01903D4548c7594B78703H1758c69625J47105o0857A02028
18323A18162C0707k472L04527A13680c32854a16864k41191j0458H6555f6316A26886
18311e1880m05425f8212o6511J256C03646B1340N745O3289e4167k25668L2517
18300b47318i8915n518A08649a0883A13277c05561J9302i1399o9703B5750J1837
$$ y = [-151070, 123528, -126405, -190736, -237244, -334772, -132655, 25733, 7611, -110946, 76867, 253617, 233360, -121334, 93316, 419339, -48366, -181791, 108981, 57946, -44211, -107412, -278911, -68291, -204549, -170157, -17920, 216456, -418077, -144064, -3210, 161268, 85574, 101400, -247298, -66100, 219171, -46883, 78866, -91736, -408416, -251415, 118397, 152285, 168313, 270216, 44548, -37594, 278703, 81758, -369625, -222520, -283377, 102028, 118162, 30707, 28235, 332762, 113680, -332854, -116864, -358055, -368513, 86555, -66316, 126886, -51880, -457305, -68212, -134723, -133467, 303646, 21340, 27085, 90374, -54167, -279835, -247318, -98915, -104433, 108649, -10883, 113277, -305561, -286259, -91399, -161102, 25750, 37587]
18289C7587a14861L7566B96600b34969a09845p3473Q0626A0744Q5804d0554l2750
18278g3304j54594D1017J23110a62673g2422j74161A57648K9139a19936k06989
18268c26925A59703b72860f8548G628J45377b03614d7687A39127F6476b88886
18257e91268c5005A37722h5846j29440a4509o4943n2752E813h5815j26626O4819
18246a47622j23800f7746j63882B8651a1534n4737j08757j96448a15189K1258
18236i3931n3138k58789I4362P1529F3190J63395c01945p4912d0357j27140n9275
18225b26772E8408J5449B0457a762B26244b45631A88100a17261e0348k11993a27739
18213c9997p9560q0106f5206o0881b4208C4020b57920D2154a00784e158j03901
$$ y = [37587, -114861, -77295, 296600, -234969, -109845, -183318, -102692, 10744, 96548, -40554, -73304, -227898, 41017, 164127, -162673, -72422, -246583, 157648, 186787, -119936, -326925, 159703, -272860, -68548, 7628, 153005, -203614, -47687, 139127, 66476, -288886, -591268, -35005, 137722, -85846, -215286, -14509, -79452, -132204, 5813, -85815, -212441, -147622, -271422, -67746, -231628, 28651, -11534, -66271, -175028, -371476, -115189, -93931, -147069, -405858, 94362, 165891, 63190, 226585, -301945, -376857, -40357, -167497, -226772, 58408, 73857, 20457, -1762, 226244, -245631, 188100, -117261, -50348, -262341, -127739, -39997, -119557, -199663, -65206, -126087, -24208, 34020, -257920, 42154, -100784, -5158, -109059]
18202a09059j05220m9257R1177j78769b6435p5509A01357b17177G2708c0613j87222
18191b17835B21478a87959a4258H0968b93663g8015k0334b1612k9190J1260A09821
18179b04100N1440A2758M3921b64746J05841C021h9136A28932b03622q0719C9250
18167i5415C4799d49041J65322k22476a25461B65158C7655a7901A95200b35752
18156g9961j60469A05323L4556R9419f7967A6974R8875J93496b42397o1024A6988
18144A45884a05792B29515j9983c90649A11159c06244L7054m5626n271B85886
18133b77438J24869O8919F0707J37075a5589B32224g0025B76788a2195k22159
18123b34354c6812C62450d425B98475b57929L9869B71176h9769j17623j41581
$$ y = [-109059, -214279, -263536, -172359, -351128, -26435, -101944, 101357, -217177, 72708, -30613, -217835, 221478, -187959, -14258, 80968, -293663, -78015, -98349, -21612, -50802, -39542, 109821, -204100, -152660, 12758, 56679, -264746, -158905, 3021, -89136, 128932, -203622, -284341, 39250, -95415, 34799, -449041, -283719, -506195, -125461, 265158, 37655, -17901, 195200, -235752, -79961, -240430, 105323, 139879, 239298, -67967, 16974, 115849, 309345, -242397, -303421, 16988, 145884, -105792, 229515, 209532, -390649, 111159, -306244, -269190, -314816, -320087, 285886, -277438, -152569, -83650, 60707, 197782, -15589, 232224, -70025, 276788, -12195, -234354, -36812, 362450, -4425, 298475, -257929, -218060, 271176, -89769, -207392, -348973]
18113c48973A22471i7051n9852A57032d18766i0642F0160c35718a30398D7807
18102a09035B4867N4191Q6682c6268k2485A31959a74280d7424A61928J0349B266
18090c793A03993a90441b0670C3164f1522a0456k67880K1757A60243B8921H699
18078a05731o7481O6148h540I8942J76005b3469G0972a91728B75046c47004E1551
18066d70178b8507k11896a06210C4639b9590p9432j84526J05221g1687K8562k34883
18055b78008O2750E2356J8882A8197i2705D1754f7227B5843M154a13528B09006
18043A3150L5547a64646B39427b50984h6879B36574b80788D15995a70087g6739
18032b14848C21931d4870A09173b03522j27598D3927J642K6440b59593F8090a39407
$$ y = [-348973, 122471, -97051, -156903, 157032, -418766, -90642, 60160, -335718, -130398, 47807, -109035, 24867, 79058, 165740, -36268, -58753, 131959, -174280, -47424, 161928, 172277, 2266, -3793, 103993, -190441, -20670, 33164, -61522, -10456, -278336, -256579, 160243, 28921, 8699, -105731, -173212, -107064, -8540, 98942, 274947, -23469, 70972, -191728, 275046, -347004, 51551, -470178, -28507, -240403, -106210, 34639, -29590, -109022, -293548, -188327, -71687, -43125, -278008, -215258, 52356, 71238, 18197, -92705, 41754, -67227, 25843, 29997, -113528, 209006, 13150, 48697, -164646, 239427, -250984, -86879, 236574, -280788, 415995, -170087, -76739, -214848, 321931, -44870, 109173, -203522, -331120, 43927, 45569, 72009, -259593, 68090, -139407]
18020a30003b1772a528q448j52570F2049b24580G1013K8558L2361a83846G9038
18008i6025c4719A112L9266J84773d16446a27299c2529C8783b40452h7512A51991
17996i3196L4387j08542A52412p1371l1289J6789c10394B37183D9085a03105R721
17985i3384B14389a43276A2257h0327c5311L395l4769r5176l66409J85171A37203
17973c79075C89458b88709B2872N2450A0655a55427j00964J08977A85129a87142
17962c91303E342a39600j38825M4169a05047K1002l4100A5688J54912d7557j38676
17951a86233G1324O1761b3987O144A74200i9359b313j2035B8830N0969p388b9052
17938A19458b00005g2746a6815B69088j02887f8667j97391g4358k40701D0770
$$ y = [-130003, -21772, -1528, -9976, -162546, 62049, -224580, 71013, 99571, 131932, -183846, 79038, -96025, -34719, 1112, 40378, 225151, -416446, -127299, -32529, 38783, -240452, -87512, 151991, -93196, -58809, -167351, 152412, 81041, 49752, 66541, -310394, 237183, 49085, -103105, -93384, 214389, -143276, 12257, -80327, -35311, -31916, -66685, -161861, -528270, -343099, 137203, -379075, 389458, -288709, 22872, 75322, 10655, -155427, -256391, -147414, 185129, -187142, -391303, 5342, -139600, -278425, -234256, -105047, -84045, -118145, 15688, 170600, -47557, -186233, 71324, 133085, -23987, -17843, 174200, -99359, -2313, -14348, 28830, 79799, 72411, -29052, 119458, -200005, -72746, -16815, 269088, 166201, -68667, -266058, -74358, -315059, 40770]
17927F8987l0032L51056B8763J47031c6849A21657g7876H5340a90218A02552b57821
17915g3970k18507E1781i5160B4003a595I8878a32986n3634h4494b7273k36793
17904b64066e0922A38696j8029O8441C960a19271m3509M6763A5511J0192h9618
17892D4872b06641I8805R4666E9672a26730K5938D0936d0390Q858p3580K9863
17881g5249D1148J69176J25321f1645j00498B97406c50471J46894f2562r1494
17871a54056k00176A11657b42132a14921e6179j65980i6424A35330b86458L6582
17861b49876A11864J35525A3047J8090a40602G1860a44655l41479a77099J4829
17851a62270R847B9034b4690A06026b81631d1650A6930J93515l1680a84024h6389
$$ y = [68987, 38955, 390011, 28763, 175794, -36849, 121657, -77876, 85340, -190218, 102552, -257821, -73970, -292477, 51781, -95160, 24003, -1595, 98878, -132986, -186620, -84494, -27273, -264066, -50922, 138696, 120667, 189108, 3960, -119271, -162780, -116017, 15511, 25703, -89618, 44872, -206641, 98805, 193471, 59672, -126730, -100792, 40936, -40390, -31532, -105112, -75249, 41148, 210324, 335645, -61645, -162143, 297406, -350471, -203577, -62562, -154056, -354232, 111657, -242132, -114921, -56179, -222159, -96424, 135330, -286458, -249876, 111864, 247389, 13047, 31137, -140602, 71860, -144655, -486134, -177099, -162270, -152423, 29034, -24690, 106026, -281631, -41650, 16930, 210445, 178765, -184024, -86389]
17839b24162C628b11382h3188I5023a80206I973e24411I7f8650B555M43874a24079
17826b885C64313a70949k03987A19995e9820M448q4306D07474a65315j7794j13582
17815b96691h9608J4024q7927e8274A93978C8156J19345a60512M4167C03449I126
17803a65370k10438a45744B80083a87064C6665L7821A8697h1224A64958B2807
17792g4172j74957e0439l787l44295f8390r283A68423J66519c22480A12160L0906
17781A43066n2228a76259A8121J41544E7688a049B35418c52722j25899a38356
17770I5853B458d41198F4300B9203h2249B00842Q8898a34838J2384j44391b4236
17758A48618a44978A03598E517c08535G1017e4158A31712e5638r1547C08426a49723
$$ y = [-224162, 3628, -211382, -83188, 95023, -180206, 9973, -524411, 97, -68650, 2555, 446429, -124079, -2885, 364313, -170949, -374936, 119995, -59820, -55372, -139678, 407474, -165315, -183109, -296691, -89608, -75584, -163511, -58274, 193978, 38156, 157501, -160512, -116345, 303449, 9126, -165370, -375808, -145744, 280083, -187064, 36665, 74486, 18697, -81224, 164958, 22807, -74172, -249129, -50439, -54226, -398521, -68390, -77673, 168423, 334942, -322480, 112160, 143066, 90838, -176259, 18121, 159665, 57688, -1049, 235418, -352722, -478621, -138356, 95853, 2458, -441198, 64300, 29203, -82249, 200842, 289740, -134838, -122454, -266845, -24236, 148618, -144978, 103598, 5517, -308535, 71017, -54158, 131712, -55638, -147185, 308426, -149723]
17746a12185j3922d2356A6514K33027j8966d776p448C7155G515a94845A27341
17734f4661A67133a3326j44105a5110l86332a8874j17447B4027c02448R8552h4268
17722i6975b7009A17999b1484C59743J21914c52297B94348a44578j39324d7485
17711b46892A62923c37022N03r481A09325d90424B80394l450E4304a06398C00511
17699I4005j303Q6573a00644n3166A45766D7399f5575a7517A34909g9786A83113
17687B77135A7958L4998J24614A3413b351j26537d4274r4166j12000h9525B61290
17675E8007a9433D18081H7209a82886A51277d24062a18910J5517j3566C24857
17664a38349p3635d4313E131a16056I5055G32e146k06800o1855G3310a06679I8269
$$ y = [-112185, -126107, -42356, 16514, 249541, 230575, -4776, -12224, 37155, 7515, -194845, 127341, -64661, 167133, -13326, -157431, -15110, -401442, -18874, -136321, 24027, -302448, -203896, -84268, -96975, -27009, 117999, -21484, 359743, 481657, -352297, 294348, -144578, -283902, -47485, -246892, 162923, -337022, -336519, -346000, 109325, -490424, 280394, 276944, 54304, -106398, 300511, 94005, 92702, 179275, -100644, -153810, 145766, 47399, -65575, -17517, 134909, -79786, 183113, 277135, 17958, 52956, 177570, 13413, -2351, -128888, -44274, -138440, -250440, -89525, 261290, 58007, -19433, 418081, 87209, -182886, 151277, -424062, -118910, -103393, -116959, 324857, -138349, -211984, -44313, 5131, -116056, 95055, 732, -5146, -211946, -273801, 73310, -106679, 98269]
17651A01803K8131J8890o9890c2830A68381n7331J21179b26580B01434b5248A737
17639a40124E8778a23846p0619E8379a92398A29894A4090d39270a26920K3105
17629a03815j43721A344K41428a41131j22275A33967K12371e8590A48975a39928
17618A69103j8379Q5977g5820k9157I6441k6501G945e2447E6207d2397m9902q0775
17606a73074b2085r2252C23683j10457N4390I4579K07906A16030N6580a94455
17595A37779g0853a7476k40176a3793k5762A96946i823B30442a54122B88038c28760
17583B18475a87941C38808j5434a1381B49446B7787R1834M9448C2030b74681A16474
17571C62261A18148a08501C7274J93828C6574a61474E3217f2451d88p6719F7576
$$ y = [101803, 129934, 148824, 78934, -32830, 168381, 111050, 232229, -226580, 201434, -25248, 1737, -140124, 58778, -123846, -194465, 58379, -192398, 129894, 14090, -439270, -126920, -103815, -247536, 1344, 242772, -141131, -263406, 133967, 346338, -58590, 148975, -139928, 169103, 150724, 236701, -75820, -104977, 96441, 69940, 7945, -52447, 56207, -42397, -92299, -173074, -22085, -114337, 323683, 213226, 267616, 94579, 302485, 116030, 172610, -194455, 137779, -70853, -17476, -257652, -13793, -39555, 196946, -9823, 230442, -154122, 288038, -328760, 218475, -187941, 338808, 323374, -11381, 249446, 27787, 119621, 169069, 32030, -274681, 116474, 362261, 118148, -108501, 37274, 231102, 36574, -161474, 53217, -62451, -488, -77207, 67576]
17559A69998c6007B58744g8211j38010M4777m7723C21063H4816a8125B4736a01249
17547A4201a72219O746e7285A0680J59810q0483c6584A39275o701a7201j05418
17536a22619n1645l8151M9559l87493A45069a32742j20012B09421n3605c87842
17525G1321b43855j6287a21328H6189Q1773P8304C0899n189Q4219J22689a93910
17513b6728G0789J86878b06449N9566k6582B2652a41105B15535E9609k345a11328
17501B65503I0224N76154k69735F0882A6823K75644g9781I6943P3707c9406a46
17489i2682B39949E9274J48182q2680a04186D6951a68151G5461K6188a65464G3326
17477A14338a47081P2025A18245a18609c8405C7554M25843j88489D1614K03215
$$ y = [169998, -36007, 258744, -78211, -216221, -171444, -219167, 321063, 84816, -18125, 24736, -101249, 14201, -172219, -165473, -57285, 10680, 170490, 90007, -36584, 139275, 132574, -17201, -122619, -174264, -212415, -162856, -550349, 145069, -132742, -252754, 209421, 155816, -387842, 71321, -243855, -260142, -121328, 86189, 167962, 246266, 30899, 25710, 109929, 232618, -193910, -26728, 70789, 257667, -206449, -146883, -173465, 22652, -141105, 215535, 59609, 57264, -111328, 265503, 90224, 666378, 396643, 60882, 16823, 292467, -79781, 96943, 170650, -39406, -146, -92682, 239949, 59274, 207456, 124776, -104186, 46951, -168151, 75461, 101649, -165464, 73326, 114338, -147081, -75056, 118245, -118609, -38405, 37554, 463397, 274908, 41614, 244829]
17467B44829A3698J4027O3379J0270c05127e0857b0545n1476A57767R5275A08826
17455f6566J9215A63444K46456C004K53939E2771a14508A77366J6503a40661A30542
17443C43245A34427P8529M1783d0278B28226N3488r6023a6345A83545m8055L08971
17432D44461j35945n4668j09320J01976j19997K11649D802L23116a120F10471
17421C7983P0626d3968C00376J7776A4742a00449E50145A97482Q3443L86566k39147
17410D28344j3435j79057O6806G7058B0728g435B20417a15621E3096K13777B2158
17398A36755D9817L7456J39794C1897M97149b72388A056a94183B32058R7931b57281
17386B45778c0679o2162A21901L0120l4811b52150C21131f7628A32064B3326b97453
$$ y = [244829, 13698, 27725, 91104, 101374, -305127, -50857, -20545, -72021, 157767, 253042, 108826, -66566, -47351, 163444, 409900, 3004, 256943, 52771, -114508, 177366, 193869, -140661, 130542, 343245, 134427, 212956, 254739, -40278, 228226, 281714, 185691, -16345, 183545, 135490, 444461, 308516, 253848, 144528, 246504, 126507, 338156, 4802, 327918, -1120, 610471, 37983, 108609, -43968, 300376, 318152, 14742, -100449, 550145, 197482, 280925, 667491, 428344, 414909, 235852, 302658, 77058, 20728, -7435, 220417, -115621, 53096, 266873, 22158, 136755, 49817, 87273, 227067, 31897, 529046, -272388, 1056, -194183, 232058, 329989, -257281, 245778, -30679, -92841, 121901, 152021, 117210, -252150, 321131, -67628, 132064, 23326, -297453]
17374D11042b7816q4587j1151B08128D118b178B17021a44020A02363a3552E4889
17362A62686N7051p9565K15864q4586J20614h7897r1697A16512J63285D8240J68271
17351B16511b07318C33902j3382k3345i318A11192J56569b8695A63949l9113j958
17340A22878J32961a72658g0939D9892P5901l8662K30109j25825L8569a02451
17329i7421G9047J53445a22736C99567j79016n4217J45031E1450B5062M5618n562
17318F5118J34014o724l042G5014J83836b3267k8664F9535h7951B28751o8270
17307A60481K57509A71631i447C97976F3504b46587C11165M8258j42880G8372
17296B35367b64689H9695O9314m7046M5926n451M2013j9833j7640J12342K1750
$$ y = [411042, -27816, -112403, -123554, 208128, 4118, -2178, 217021, -144020, 102363, -13552, 54889, 162686, 219737, 140172, 356036, 271450, 392064, -87897, -179594, 116512, 279797, 48240, 216511, -207318, 333902, 320520, 297175, -9318, 111192, 267761, -28695, 163949, 124836, 122878, 255839, -172658, -70939, 49892, 125793, 87131, 317240, 191415, 229984, -102451, -97421, 79047, 232492, -122736, 399567, 220551, 166334, 311365, 51450, 25062, 70680, 65118, 199132, 192408, 189366, 75014, 258850, -23267, -51931, 69535, -87951, 228751, 160481, 417990, 171631, -9447, 397976, 63504, -246587, 311165, 359423, 216543, 78372, 235367, -264689, 89695, 159009, 111963, 157889, 152438, 194451, 174618, 156978, 269320, 291070]
17285B91070c3212F0545c26637E1979J89052k4338d2921C84009a63894B49001
17274C77896K8961A61725l7794C4487f6602B50838l0939b4971Q397C07052A42998
17262b5856L925b462B7552J79814d5146l0862E2183R6209L5703Q4557A22873K6426
17250A49299q305L8842J7418L4081L17798j15159H5426K37269F70J13792R7823
17239B12285b4770A40532J62160A50678n9190P9477j8196a98196A83884o3942
17229A19942J70995a29068A60378n0711N931K82488I4016O2011J20153I7388K11743
17218C09131A18527E71O8692J66208K24164H9075K98763j53093K48035A15420
17207A61957J47607r9687g5800B16323o5998a17644B46214A03579d679B45409
$$ y = [291070, -33212, 60545, -326637, 51979, 241031, 216693, -42921, 384009, -163894, 249001, 377896, 406857, 161725, 123931, 34487, -66602, 250838, 219899, -24971, -16574, 307052, 142998, -25856, -21931, -2462, 27552, 207366, -45146, -76008, 52183, 148392, 184095, 268652, 122873, 149299, 140994, 179836, 197254, 231335, 549133, 433974, 85426, 322695, 670, 114462, 212285, -24770, 140532, 302692, 150678, 91488, 170965, 152769, -198196, 183884, 119942, 290937, -129068, 160378, 109667, 115598, 398086, 94016, 156027, 276180, 97388, 309131, 118527, 571, 69263, 235471, 459635, 89075, 387838, 234745, 482780, 115420, 161957, 309564, 209877, -75800, 216323, 150325, -117644, 246214, 103579, -4679, 245409]
17196A70752O9870a55184A61341K14916A76397O11686B6245i1422B23322r1345
17186A31977K32309j04551q1666P0996j07876f0856B59334J81993j38545d3472
17175B88040L108a56502A05180a05900n5215L0840c5945B06900o5678E7747N03754
17164E61501j89212P6944a92063E6980P2778J34965k9676o2230O6732C2094M09078
17153D41172J33036P2230B68008P2516A38467L53116B01327Q6219c8677E73213
17142A0767K22690m3757k1649J6343q4105l1323Q8760L9243p6057a35480E12464
17130c0964B51588q2041O0682r0700J41500J6793P3868j7785b9980C26653M5363
17119C72016G7637K00741K34760a08004c4451C23091K33373k32455q8062O6698
$$ y = [170752, 240622, -155184, 161341, 376257, 176397, 788083, 26245, -91422, 223322, 131977, 364286, 259735, 178069, 249065, 141189, -60856, 259334, 441327, 302782, -43472, 288040, 291148, -156502, 105180, -105900, -161115, -130275, -35945, 206900, 141222, 57747, 561501, 372289, 449233, -192063, 56980, 129758, 264723, 235047, 172817, 239549, 32094, 441172, 574208, 646438, 268008, 340524, 138467, 491583, 201327, 287546, -38677, 573213, 10767, 233457, 189700, 168051, 184394, 100289, 68966, 157726, 196969, 120912, -135480, 512464, -30964, 251588, 169547, 230229, 139529, 281029, 297822, 371690, 353905, -29980, 326653, 372016, 77637, 278378, 513138, -108004, -34451, 323091, 556464, 324009, 235947, 302645]
17109C02645J10257A40521J07624A7008N51946j34149J49575b7466E92733A83000
17098D91329j88606J35734n9558K68979j62568J40844k44626j50954K08299l5507
17088D03366A95210J09363J04218j88137J73930l1665l8234J44406J0954A82747
17077D24023o5725j30463L70792Q6108j77189j21808M5861J98600q142J12339
17067G34396k28904j52162J46693A65101G6202K36689J27626J21098j10360j52241
17057B99014L43999A82685K24488R1956L04768j8874B06707J01748J2946J95365
17047E16766j15219K24844K24o8394K2476J28362p8723A36703J47910K30316L19388
17036H34317k72208j73521L4161O1241j46693J20565K80370j96197J1713J0912
$$ y = [302645, 412902, 140521, 248145, 17008, 568954, 434805, 584380, -27466, 592733, 183000, 491329, 302723, 438457, 378899, 647878, 485310, 626154, 381528, 230574, 438873, 403366, 195210, 304573, 408791, 220654, 394584, 362919, 324685, 469091, 480045, 182747, 424023, 358298, 227835, 598627, 684735, 507546, 385738, 431599, 630199, 622057, 734396, 505492, 353330, 500023, 165101, 76202, 312891, 440517, 561615, 451255, 299014, 643013, 182685, 407173, 499129, 803897, 785023, 206707, 308455, 321401, 516766, 401547, 626391, 626615, 558221, 580697, 709059, 630336, 136703, 284613, 514929, 834317, 562109, 388588, 422749, 483990, 337297, 457862, 738232, 542035, 553748, 564660]
17026E64660j95531j302g4286H91369p4965k4197k30142j5527r2357Q5016M18758
17015I57955D40983R5883J2807A96087K98238M7683n2343J05162L20363m04379
17005E10811J98825j09999j48561K77898P6324j48921R8405J10247k56457k57270
16995C51302K32172m4344j04206J08974J95376k92777R0509J13261R9399L156
16985G52822j2162j71414K25993K84881A88537L05643K45603m6810k58217K54238
16975F88994L44519k13477j30668J38725K63066k74377m4484j80661J09960k11692
16965D89905N69898k11998j24659P9459J49889J19865j43842k17859K32743K67327
16955A210728l23506j99761K70105j54877K34262j06266J08025j57104N40264
$$ y = [564660, 369129, 367827, -74286, 891369, 816404, 792207, 562065, 546538, 454181, 539197, 957955, 440983, 536866, 549673, 196087, 494325, 542008, 489665, 594827, 915190, 510811, 709636, 599637, 451076, 728974, 805298, 656377, 754782, 865029, 608572, 351302, 583474, 539130, 434924, 543898, 739274, 446497, 537006, 650267, 749666, 752822, 740660, 569246, 795239, 1080120, 188537, 494180, 739783, 692973, 434756, 688994, 1033513, 820036, 689368, 828093, 1091159, 816782, 772298, 591637, 701597, 489905, 1059803, 847805, 723146, 802605, 952494, 1072359, 928517, 710658, 943401, 1210728, 887222, 687461, 957566, 802689, 1036951, 930685, 1038710, 881606, 1421870]
16946A421870l40809J39077J6328l54565L66149m39755J98720j45326J30860j5011
16936I77538K64992j43171o505q9086K62930r625j24451k85347N11836m497l28925
16925A025689o732J30105p671L64458l11697n4516j74994N04202k79762L3973
16915A223055o8410o2569K65001Q0920R809j33774l9824k0044J81459k13804J77312
16904A399131p0767J20195L66103l15665k0772K06608J65397M7828m86706N08159
16894A919511l48072L52975P7537j61560L6417J25798k69458R9336J53810j53734
16884A832560M8470K6633Q580J63999J57938k74508K94619q6980K13859m71723
16874A913447K14631k15257K95900J73031k01684J79602r9911J34328Q3638R9799
$$ y = [1421870, 1081061, 1220138, 1236466, 881901, 1248050, 808295, 1007015, 861689, 992549, 977538, 1242530, 1099359, 1092854, 1003768, 1266698, 1257073, 1132622, 847275, 1359111, 1354614, 1025689, 1018957, 1149062, 1141391, 1505849, 1194152, 1139636, 964642, 1468844, 1189082, 1223055, 1154645, 1092076, 1357077, 1437997, 1447806, 1314032, 1274208, 1254164, 1435623, 1221819, 1399131, 1328364, 1448559, 1814662, 1498997, 1478225, 1684833, 1850230, 1898058, 1411352, 1919511, 1571439, 1924414, 2001951, 1840391, 1876808, 2002606, 1733148, 1832484, 1986294, 1832560, 1881030, 1907663, 1916243, 2080242, 2238180, 1963672, 2258291, 2171311, 2385170, 1913447, 2128078, 1912821, 2208721, 2381752, 2180068, 2359670, 2259759, 2394087, 2477725, 2577524]
16864B577524j80212M06423m19176O3516M48219j07398l34104K258L79362m659
16854B831753k3699J9788j11781k3408N29021J1732j73937O7281L32541o09265
16844B850026J96836N12161j41841K03567j50859j12671K51182j00994L16523
16835C823930K56130n8547L99341l14148J03631k50787J92025N39320j86529k64988
16825D239378J77273K29127K12916J44583J3203j01704L16586P3045J86550j08750
16815E382207M49031j57575J10669k82381O79292M5998l9174N21555l51234L06697
16805F665085Q5328O02105j63733M5178N11547K94022K8081J93522J77800l19448
16795H119487N57843J37271J41447K34777O21247j94335J103763p31853K73551
$$ y = [2577524, 2397312, 2803735, 2384559, 2448075, 2896294, 2788896, 2454792, 2457050, 2836412, 2831753, 2808054, 2827842, 2716061, 2692653, 3221674, 3233406, 3059469, 3126750, 3459291, 2850026, 3046862, 3559023, 3417182, 3620749, 3469890, 3357219, 3608401, 3507407, 3823930, 4080060, 4021513, 4420854, 4106706, 4210337, 3959550, 4151575, 4690895, 4504366, 4239378, 4416651, 4645778, 4858694, 5003277, 5016480, 4914776, 5231362, 5304407, 5490957, 5382207, 5831238, 5673663, 5784332, 5501951, 6181243, 6227241, 6188067, 6709622, 6358388, 6665085, 6750413, 7352518, 7188785, 7233963, 7745510, 8039532, 8067613, 8261135, 8438935, 8119487, 8677330, 8814601, 8956048, 9190825, 9812072, 9617737, 10721500, 9989647, 10263198]
16786A0263198Q92631P2527L84933P3088M76064P3830J075910K02257N19785J22333
16776A4156556M89156L58648N76672O77745M18653O03582M42795R38480L36480
16767A8998767P09363Q34561J138015K41045J025477Q34173J228860Q13746O89595
16758B6513602J376999J270546J349857J119902J140574K007447J333695J874786
16750C7987408J500185K438557K006145K204209K370065K196599K829997K715017
16742E6248182L259557L277076L564219L903421L627557M732514M626415M802639
16734H8041580N342376N053172N759857N676273O534658O238943O427303O788299
16726A35862461O514256O696652N721911N739910N074426M157914L655141K768425
$$ y = [10263198, 11155829, 11228356, 11613289, 11686377, 12162441, 12236271, 13312181, 13514438, 14034223, 14156556, 14645712, 15004360, 15581032, 16258777, 16677430, 17281012, 17723807, 18662287, 18998767, 19708130, 20542691, 21680706, 21921751, 22947228, 23781401, 25010261, 25824007, 26513602, 27890601, 29161147, 30511004, 31630906, 32771480, 34778927, 36112622, 37987408, 39487593, 41926150, 43932295, 46136504, 48506569, 50703168, 53533165, 56248182, 59507739, 62784815, 66349034, 70252455, 73880012, 78612526, 83238941, 88041580, 93383956, 98437128, 104196985, 109873258, 116407916, 122646859, 129074162, 135862461, 142376717, 149073369, 154795280, 160535190, 165609616, 169767530, 173422671, 176191096]
16718A76191096J666677N96957r42112j758634k704343l565067m668530n194033
16710A59622011n552900o346052o278072o454148o942174o028129o438505o903589
16702A08678442n520000n719881n307380n555858m462108m685247m235050m273231
16694F8919687l445754l958762l168114l138667k757505k712770k224924k919549
16686D4593642j673099k168809j999032j883079j499084j521934j350084j779980
16678C0718541j188637j307510j315044q94615j262744o89106p87620j293494
16670B1979771m72531q85408j058705m63033o47564o20259q20657m64535o58176
16661A5888903m37923p42310n1523m24263n38304j43825o28721n25818m82802
$$ y = [176191096, 177857773, 178454730, 177512618, 175753984, 173049641, 169484574, 164816044, 159622011, 154069111, 147723059, 141444987, 134990839, 128048665, 122020536, 115582031, 108678442, 103158442, 97438561, 92131181, 86575323, 82113215, 77427968, 73192918, 68919687, 65473933, 61515171, 58347057, 55208390, 52450885, 49738115, 47513191, 44593642, 42920543, 40751734, 38752702, 36869623, 35370539, 33848605, 32498521, 30718541, 29529904, 28222394, 26907350, 26012735, 24749991, 24060885, 23273265, 21979771, 21507240, 20621832, 19563127, 19100094, 18452530, 17832271, 17011614, 16547079, 15888903, 15450980, 14708670, 14657147, 14232884, 13694580, 13550755, 12922034, 12396216, 11913414]
16652A1913414j97822k84682o91058o0583l25893j46810k53943p60640J43511
16643I335494m60366K67025n02489J29743n13424m58888j83513M5920K12551p36199
16633G135854P9735j18205l15319J31283j68378l31907k66565k5881k83626l2690
16623E804301N5082k21027j71312m62773M5118j5176R2534K6719m58051o0510
16613D634905j28169L9213l59480L39035j35666l58972k48376j348J42111J60178
16603D083431k24315L508j87963k59177n4804K02628m6708j95248q2727P3863
16593C312488m4119L2170l69619J1100Q7854m343j29431J95154j99923J27452
16583C018783k35689j92748L32092j96917l11398J95984l3915j76467L3082j11773
$$ y = [11913414, 11715592, 11430910, 10739852, 10679269, 10353376, 10206566, 9952623, 9191983, 9335494, 8875128, 9142153, 8639664, 8769407, 8255983, 7797095, 7613582, 7659502, 7872053, 7135854, 7215589, 7097384, 6782065, 6913348, 6744970, 6413063, 6146498, 6120617, 5836991, 5804301, 5859383, 5638356, 5467044, 5004271, 5049389, 5034213, 5126747, 5153466, 4695415, 4634905, 4506736, 4545949, 4186469, 4525504, 4389838, 4030866, 3782490, 3781142, 3923253, 4083431, 3859116, 3862624, 3674661, 3415484, 3360680, 3563308, 3516600, 3321352, 3238625, 3312488, 3268369, 3300539, 2930920, 2942020, 3029874, 3025531, 2896100, 3091254, 2891331, 3018783, 2783094, 2590346, 2922438, 2725521, 2414123, 2610107, 2576192, 2399725, 2432807, 2321034]
16573B321034k74668L60116K3321l2941j07744M510k10274L25027l08151o77j37199
16562A962354q7526J86145k3065r3093K4902P6623r6951Q0953j51672k72953J64033
16551A769750K94307k51734K54838l68782O0491p1779j661q7078l39702L36137
16541A594787l15466L15153n6827j55151J40368j75035j7900j73113J44366J3500
16531A314682J29797J05232J35554m37098M15607l98692j11675k3333M33187k80048
16521A283213m3591M4955L0168l55998J6592J93113Q8324J5930R4067j12750j26727
16510A127296K17912j48289q2809j75403K37385j07672J45613O5630n44497N24138
16500A259304m47486M04599j67983J38283J42355l00072m9817j269J74417m7131
$$ y = [2321034, 2046366, 2406482, 2429803, 2396862, 2289118, 2293628, 2083354, 2408381, 2100230, 2099553, 1962354, 1874828, 2060973, 2037908, 1944815, 1969717, 2046340, 1949389, 2030342, 1878670, 1605717, 1769750, 2064057, 1812323, 2067161, 1698379, 1758870, 1687091, 1685430, 1598352, 1258650, 1594787, 1279321, 1594474, 1537647, 1382496, 1522864, 1347829, 1329929, 1156816, 1301182, 1314682, 1444479, 1549711, 1685265, 1248167, 1663774, 1265082, 1153407, 1130074, 1563261, 1283213, 1239622, 1284577, 1314745, 958747, 975339, 1168452, 1256776, 1272706, 1366773, 1254023, 1127296, 1345208, 1196919, 1114110, 938707, 1176092, 1068420, 1214033, 1279663, 735166, 1259304, 811818, 1216417, 1048434, 1186717, 1329072, 1029000, 979183, 977914, 1152331, 1105200]
16490A105200j13643k9472J63284k91732o4694j73847N77841l20568m1104R470
16480H20735k38237j13701L18527K85281J7328k21855k21132K68878n3816r8182
16470G63826C60102K70674K34794k96395K15676O7851l81401j24412N14831o9251
16460G92469B43214M70037p6141M08162l99020q1249M21360r8106A65759L41059
16450E06818K07149j74362J40074K19315m09043J80976J145J7893j33720j42006
16440D14239L3042L70481C69502l9812K26643J38201q4425L4636j77352j53483
16430C13910J54632k4530J16162L4257j90165K38529j55619M23406l11603m7709
16420E51270j97776J6225L34526k29130j03036j10J85199q0826O1243l5082J53276
$$ y = [1105200, 991557, 962085, 1125369, 833637, 768943, 595096, 1172937, 852369, 811265, 820735, 582498, 468797, 787324, 1072605, 1089933, 868078, 646946, 915824, 862008, 763826, 360102, 630776, 865570, 569175, 784851, 852702, 471301, 346889, 861720, 792469, 243214, 713251, 637110, 1045272, 646252, 565003, 986363, 888257, 165759, 506818, 713967, 539605, 679679, 898994, 489951, 670927, 672072, 689965, 556245, 414239, 447281, 817762, 369502, 329690, 556333, 694534, 610109, 644745, 467393, 313910, 468542, 444012, 560174, 594431, 404266, 642795, 487176, 910582, 598979, 551270, 353494, 369719, 704245, 475115, 372079, 371969, 557168, 476342, 537585, 502503, 655779]
16409F55779B95818N3896A58566M29921j92733Q9798l4790L44230o6744B26628
16398F99629q9109k78865A17843M81669B49221K45255j47897p4194K97929k27424
16388C42890j07533J01356J93920q6578j18663A47492J84904n7627K67931j70481
16378C72219L21118k96162N427p9840l7673L2751k1860k6364N21177C7700L13206
16367C50906j11860j8458K75909A00323N55686E665L54788p3547J89232o1809
16357D14329D3289L23034J31109k00792A06867J91493f130B24653J66346K7684
16347D18683j7083G8391N10078D1572R0372K26263j05169L70500C10450j17258
16337A93192p4915J0337M578m6301a9217B54093l2922K36894j16909j67872M51914
$$ y = [655779, 295818, 349714, 158566, 588487, 395754, 485552, 450762, 794992, 728248, 226628, 699629, 610520, 331655, 117843, 599512, 249221, 494476, 346579, 272385, 570314, 342890, 235357, 336713, 530633, 444055, 325392, 147492, 332396, 274769, 542700, 372219, 693337, 397175, 402602, 322762, 285089, 317840, 295980, 269616, 790793, 37700, 350906, 239046, 220588, 496497, 100323, 656009, 5665, 360453, 286906, 476138, 414329, 43289, 366323, 497432, 296640, 106867, 298360, -6130, 224653, 390999, 418683, 401600, 78391, 588469, 41572, 131944, 358207, 253038, 623538, 310450, 193192, 118277, 128614, 133192, 86891, -19217, 254093, 221171, 458065, 341156, 173284, 625198]
16326F25198B15572N6977n7410G4376J21949I0240k9597J51147K24565j75596
16316B60759P5897j39413N70610B15470O8918j07299K53806F3176K51329J12788
16306D27293A13120O2874J45949j22921E5572J86519o5551l3501K27787P0023
16296D40849o1536c66786A08601a98547B16272J3568N0810M33975B38920D6714
16285D27515d632C29368A14107K69598k302l6925E8286K34934j39056J01260K0455
16274B75879m2723G2482L75972A90254L6039f2395A86212M1802k4407D8435P6827
16263A25262J52753j35001O2679f2051A62739k9277E8017a41937A70917l9167
16253A31750b619m1744A75251a14905B41731F0564L23611a58921A96662B4131
$$ y = [625198, 215572, 272549, 215139, 74376, 196325, 90240, 60643, 211790, 436355, 260759, 336656, 197243, 767853, 215470, 284388, 177089, 430895, 63176, 314505, 427293, 113120, 175994, 321943, 199022, 55572, 242091, 176540, 143039, 370826, 440849, 379313, -366786, 108601, -198547, 216272, 229840, 280650, 714625, 238920, 46714, 427515, -4632, 329368, 114107, 383705, 381403, 344478, 58286, 293220, 154164, 255424, 275879, 233156, 72482, 448454, 190254, 226293, -62395, 186212, 228014, 203607, 48435, 125262, 278015, 143014, 205693, -62051, 162739, 133462, 58017, -141937, 170917, 131750, -2619, -44363, 175251, -114905, 241731, 60564, 384175, -158921, 196662, 24131]
16242D9725P9465a9842D06625C9794J209J73303P2713j05662B0689i6627C27967
16230D21022A35882c3673n6065B74179A14274a64690O7115d0672C14293M5708
16220C60001A6498b81299A88401E2033b9004G6710A8119P9970G187M63301A5688
16208A03619j6003K37340c75972e7560C48125A33613K54493A39052Q1776a4653
16197b74762C6059A2832K15172H6403J39891J57181A54853O6979K3555J61051
16187D06438j81095E0364N3971a72286C98480c944k52136B13722e6338B35248
16176a62072F4289J61789a47737A54008a51600B2384a64175B30848j5295J7291
16166B32844a58146I5537O3416M9960m9653o957B2219K40227A09359h6338B43965
$$ y = [49725, 129190, -19842, 406625, 39794, 41003, 214306, 287019, 181357, 20689, -96627, 327967, 421022, 135882, -33673, -89738, 274179, 114274, -164690, -97575, -40672, 314293, 360001, 16498, -281299, 188401, 52033, -29004, 76710, 18119, 98089, 7187, 470488, 15688, 103619, 87616, 324956, -375972, -57560, 348125, 133613, 388106, 139052, 220828, -14653, -274762, 36059, 12832, 228004, 86403, 226294, 383475, 154853, 221832, 245387, 406438, 225343, 50364, 104335, -172286, 398480, -3944, -256080, 213722, -56338, 235248, -162072, 64289, 226078, -147737, 154008, -151600, 22384, -164175, 230848, 215553, 232844, -158146, 95537, 158953, 208913, 159260, 152303, 22219, 262446, 109359, -86338, 243965]
16154b34424A67125P3831J40763I8709a73280H2893a37669L5977C6863f3606O076
16143e7530G9177K71374a3807D57676j96880f0172H5566J22872I5544b79773A51933
16131b8832A80184m7694c9910D9079J3987N0780b56533A10788D2085Q5366B5217
16119b21486A13573J95365b0416B59445g0846C58994c54100a74334B01045c2862
16108E5258B1410K7032Q0442l3164l2167b0948B27074k7219P2025b18538A13841
16096A29427E9317d6625E2238a30737B32857h3693j3390A54660a62875G1253A052
16084c52296J50678E0578B0175K05683a67907a9759j727D9904i8773j85923a6308
16072a03668j6770M139H5595l7080L3457b3564A81959c5871C0562J15393M6781
$$ y = [-234424, 167125, 240956, 381719, 98709, -173280, 82893, -137669, -101692, 36863, -63606, -57530, 79177, 350551, -13807, 457676, 260796, -60172, 85566, 208438, 95544, -279773, 151933, -28832, 180184, 132490, -39910, 49079, 63066, 113846, -256533, 110788, 42085, 127451, 25217, -221486, 113573, 308938, -20416, 259445, -70846, 358994, -354100, -174334, 201045, -32862, 55258, 21410, 48442, 128884, 95720, 63553, -20948, 227074, 199855, 271880, -218538, 113841, 129427, 59317, -46625, 52238, -130737, 232857, -83693, -97083, 154660, -162875, 71253, 1052, -352296, -201618, 50578, 20175, 225858, -167907, -19759, -21486, 49904, -98773, -284696, -16308, -103668, -120438, -116299, 85595, 48515, 81972, -23564, 181959, -35871, 30562, 145955, 192736]
16061A92736q7251N9654b8241A36440j7432a03555I3865J79762a95233B67348
16050e4664C4249K1232k2550a87083M1885B211b5173k2914D6656L3391a91173
16038E4192L2770b6282A71733a4829A88479b69845b3202C32316l6138A24111b05380
16026g9960B67938A18948e2131a9918B07158b79218J15750P21d4886k96397G5762
16014b29706c0196F9768g8311a4296j40256A20781a54178L7048m5853E9961a50791
16002b46594E9427Q2205H2J30798K19727D7573c09756g6716k5208A45152b93978
15990f5672j16567n0460A58336C3140a7008D22124b2393B75618q9069J53612q6860
15979B53301Q1855A4667P9606a94148A26939i2225l6143A28780c7783k32098J29084
$$ y = [192736, 105485, 165139, -28241, 136440, 119008, -103555, 93865, 273627, -195233, 267348, -54664, 34249, 55481, 32931, -187083, -145198, 2211, -25173, -48087, 46656, 80047, -191173, 54192, 86962, -26282, 171733, -14829, 188479, -269845, -23202, 332316, 296178, 124111, -205380, -79960, 267938, 118948, -52131, -19918, 207158, -279218, -163468, -162747, -44886, -341283, 75762, -229706, -30196, 69768, -78311, -14296, -154552, 120781, -154178, -117130, -162983, 59961, -150791, -246594, 59427, 141632, 82, 130880, 350607, 47573, -309756, -76716, -101924, 145152, -293978, -65672, -182239, -232699, 158336, 33140, -17008, 422124, -22393, 275618, 186549, 340161, 253301, 335156, 14667, 94273, -194148, 126939, -92225, -128368, 128780, -37783, -269881, -140797]
15968a40797d5224F8363b31975Q5238c2448B02702H2624a44411i148L108j20954
15957a26994B49899c72840B08362a76323j3902E6712b51931A06352b32456a4477
15946a02738A65188a77397k7135N1510j17531F0117b0355I2398c0376A00914a49889
15934A40401a07220A57210a48504a4163r0965k8201l4043R939C72487A32111j612
15923A30499a22854A16960J75942n1767a33696m3784h96r1694o6220O0673B1700
15911E9749c2751j22855A49067G612a90103O5460N5742B32098a39339l6791d5896
15899c66594e1379C0133b21631A2150O8425b23936a0734j58600Q3862b3901B57229
15887B16521a45143H4794a69112I5346h2576B52755J16073A61090a01484B95714
$$ y = [-140797, -45224, 68363, -231975, -146737, -32448, 202702, 82624, -144411, -9148, -6040, -126994, 249899, -372840, 208362, -176323, -190225, 56712, -251931, 106352, -232456, -14477, -102738, 165188, -177397, -204532, -153022, -270553, 60117, -20355, 92398, -30376, 100914, -149889, 140401, -107220, 157210, -148504, -14163, -105128, -133329, -167372, -157433, 372487, 132111, 130499, -122854, 116960, 292902, 241135, -133696, -177480, -896, -92590, -158810, -98137, 21700, 59749, -32751, -155606, 149067, 7612, -190103, -124643, -68901, 232098, -139339, -176130, -45896, -366594, -51379, 30133, -221631, 12150, 80575, -223936, -10734, -169334, -85472, -23901, 257229, 216521, -145143, 84794, -169112, 95346, -82576, 252755, 368828, 161090, -101484, 295714]
15876h5759A37687b38761h1734j5597b6045k79289B7928a33343d8466C0877a50463
15864e1002A54394l1342b7884k09686A85380q5428c32344J55721j76020a18378
15853b04649l1720c0091l94917C5039M4599L4306J42154A134O4078J75702i9155
15841a06204B81331a41320L8682E7308N1726b08460I5430a80575B19768H6581
15830f0173p0407K2208k986I1659a1831p2991k08003a03063a7756B76271j5248
15819B61023d6484j32434C16478a62458l0941B96879d0970J9449l595B20782b1289
15807a87264A25105c01648I8458K921i0817k65324A20056i4887j00407c9964l71093
15796d11057D13864F865d3562J4213j67408H2999K25190j42384a41861J0903g203
$$ y = [-85759, 137687, -238761, -81734, -97331, -26045, -305334, 27928, -133343, -48466, 30877, -150463, -51002, 154394, 123052, -27884, -237570, 185380, 99952, -332344, -176623, -352643, -118378, -204649, -236369, -30091, -425008, 35039, 79638, 113944, 256098, 1134, 65212, 240914, -99155, -106204, 281331, -141320, -102638, 57308, 109034, -208460, 95430, -180575, 219768, 86581, -60173, -130580, -108372, -111358, 91659, -11831, -84822, -292825, -103063, -17756, 276271, 261023, -46484, -178918, 316478, -162458, -193399, 296879, -40970, -21521, -25116, 220782, -21289, -187264, 125105, -301648, 98458, 101379, -90817, -356141, 120056, -94887, -195294, -39964, -411057, 413864, 6865, -43562, -29349, -196757, 82999, 308189, 165805, -141861, -130958, -7203]
15784a13786G2768b14016a01862C5728h253j14719k69197a91505j04261E9797
15773b93041B54919b15120p389f733c307k66460f5731n1484l4201l9602E2773
15761A75998B3318J29015D2634K68397j2692b10189A89171p3563c4133A4970O6853
15750H1823a72597C56877c3400B2763c7998l5393B53893a09814a2112I9830d07510
15738C23106A47841b62556i3101H8192D030c91854a25428g05A48194B0272d7674
15726b5707m25408Q5289a82443j7051d9435q0136b4182j4652o2554b455j53300
15715a55755n2208c2630j97354g5196q8499a4997q6822n5292k73442a78416C03320
15703D29274j71152D5866a32093m1621F492J24149a20607l61427f7075A32833
$$ y = [-113786, 72768, -214016, -101862, 35728, -8253, -122972, -392169, -191505, -295766, 59797, -293041, 254919, -215120, -222509, -6733, -3307, -269767, -65731, -117215, -151416, -191018, 52773, 175998, 23318, 152333, 42634, 311031, 298339, -210189, 189171, 115608, -34133, 14970, 81823, -172597, 356877, -33400, 22763, -37998, -73391, 253893, -109814, -12112, 99830, -407510, 323106, 147841, -262556, -93101, 88192, 4030, -391854, -125428, -705, 148194, 20272, -47674, -25707, -451115, -365826, -182443, -199494, -49435, -129571, -24182, -38834, -101388, -2455, -155755, -207963, -32630, -229984, -75196, -163695, -14997, -101819, -157111, -430553, -178416, 303320, 429274, 258122, 45866, -132093, -173714, 6492, 130641, -120607, -482034, -67075, 132833]
15692A16339i830H5869K31007A39382m7075K69066j73788d2776a3382k87324a23251
15680a35921r3750D1513a51109A62102j327b8940j090n3274K6267b654p6402I5431
15667E1518c6954k166l56073C7144a9628o6446n8272m2994C7625N9612I093J06222
15655A15315i9810b6963A78628g6282A3367a2682F1110a9551q6976A18369E0092
15643a19113a123H2086b03090l0807A8681e77221A41732a9518n8219J1321B11453
15631b11896O7451a0732B48400a07135A62145c57236C80307c75542A60855c820
15620i7735j22821B26866d6532n1596n521A21827h8740C56843M6143e4528k6049
15609h0577j04281I428c94894A67845A4252a82233B8175M9990J84212A30042a56966
$$ y = [116339, -9830, 85869, 316876, 139382, 92307, 361373, 187585, -42776, -13382, -300706, -123251, -135921, -229671, 41513, -151109, 162102, 160775, -28940, -30030, -83304, -57037, -2654, -79056, 95431, 51518, -36954, -39120, -395193, 37144, -19628, -86074, -144346, -187340, 37625, 97237, 9093, 115315, -99810, -26963, 178628, -76282, 13367, -12682, 61110, -19551, -106527, 118369, 50092, -119113, -1123, 82086, -203090, -233897, 18681, -577221, 141732, -19518, -77737, -66416, 211453, -211896, -144445, -10732, 248400, -107135, 162145, -357236, 380307, -375542, 160855, -3820, -97735, -220556, 226866, -46532, -98128, -103649, 121827, -88740, 356843, 402986, -54528, -80577, -184858, 9428, -394894, 167845, 14252, -182233, 28175, 78165, 262377, 130042, -156966]
15597C70781a81632d5713k37793A82635D8538f4076a5293A605a92856O7211C40862
15585F2690c21852O3297C8691a59076A60726a36811k08886a03362j58760A05047
15574b32489F5635b08827c6707m10720g8325H1146a42825a524I9142J6805g3888
15562c18483A37303g6416G5377b51049B8401a06519b2635l26947B70760c01944
15551d79205J39583e7850E120J53033a80311B0757L50091c19319a30584A24466
15540a10015A43759J00980a47430A01440a09289B1289K58677g4759A70024c7149
15529I5571a59429P5826E0986d22249A238d13462B51659a59317H238K57770d9378
15517D63623H1068J94398G5286b8637j23307B59246q5396c7516j05698D7123c00847
$$ y = [370781, -181632, -45713, -283506, 182635, 48538, -64076, -15293, 1605, -192856, -125645, 340862, 62690, -321852, -258555, 38691, -159076, 160726, -136811, -345697, -103362, -262122, 105047, -232489, 65635, -208827, -36707, -447427, -78325, 81146, -142825, -1524, 99142, 115947, -73888, -318483, 137303, -76416, 75377, -251049, 28401, -106519, -22635, -349582, 270760, -301944, -479205, -339622, -57850, 5120, 158153, -180311, 20757, 370848, -319319, -130584, 124466, -110015, 143759, 244739, -147430, 101440, -109289, 21289, 279966, -74759, 170024, -37149, 95571, -159429, -83603, 50986, -422249, 1238, -413462, 251659, -159317, 8238, 266008, -49378, 463623, 81068, 275466, 75286, -28637, -151944, 259246, 173850, -37516, -143214, 47123, -300847]
15505F7789j3437b89537A42820d05905I0654b68617i2798A4698e4221j46673A19380
15493a45394e4617m5294H7472d25836A54589b23528B2713a72947h0697j88208
15483b68905A21415P7789j5771L05478A09010k7809L5657Q927A5229J81042b90901
15471A67607C9977k016a85190D2334L8852O7130c1030A8488K40443d30952a04105
15459B08517a66569k3711A51920b78613h8448j4445F7579q067A5040b40514B7845
15447C1970a63633c0830j8551j05368A02554J4414C1563a64349D2928a41157A52495
15435B27624A8434e5838r7148A57062a0619A8686a89537K1065e5958B02766i7047
15423B9912c33139a15099N4461j11825N86k43804a74303P1799n705L2206j42266
$$ y = [67789, 54352, -289537, 142820, -405905, 90654, -268617, -92798, 14698, -54221, -200894, 119380, -145394, -54617, -99911, 87472, -425836, 154589, -223528, 22713, -172947, -80697, -268905, 121415, 199204, 183433, 488911, 109010, 81201, 116858, 125785, 15229, 196271, -290901, 167607, 39977, 37961, -185190, 42334, 81186, 148316, -31030, 18488, 258931, -430952, -104105, 208517, -166569, -190280, 151920, -278613, -88448, -102893, 67579, 59512, 15040, -240514, 27845, 31970, -163633, -30830, -49381, -154749, 102554, 116968, 31563, -164349, 42928, -141157, 152495, 227624, 18434, -55838, -152986, 157062, -10619, 18686, -189537, -168472, -55958, 202766, -97047, 29912, -333139, -115099, -60638, -172463, -171877, -415681, -174303, -102504, -108209, -76003, -218269]
15412b18269A23956E1217b09719F5600M1409a69657G8190a25683P099A30667H182
15400c3924A77198F8404P4597c7014B2213d59646C7898A6349a12548j74890B3321
15388A33370a5334D1701b02874i9895c1256l31752A95367F0185b76722H907R4091
15377A02998b84063j21914H8924a16200A88694m7821b36076d1435k08944A24855
15366c18839a25767m10456H8846C4179d13968B00326c44678B83046r8757g2637
15355a09543A9757J27026b10480F1660e7491B55204a65985C22716b22029n9353
15345b81382d8020m4031A44878c93931D0457b85840d6500D5747b82857B97182
15334A6265K68871b01529P627B3886c5751A68005D0427M4370b59955a1611A87242
$$ y = [-218269, 123956, 51217, -209719, 65600, 107009, -169657, 78190, -125683, -118584, 130667, 8182, -33924, 177198, 68404, 143001, -37014, 22213, -459646, 37898, 16349, -112548, -287438, 23321, 133370, -15334, 41701, -202874, -99895, -31256, -363008, 195367, 60185, -276722, 8907, 102998, -284063, -405977, 88924, -116200, 188694, 140873, -236076, -41435, -250379, 124855, -318839, -125767, -536223, 88846, 34179, -413968, 200326, -344678, 283046, 184289, -72637, -109543, 19757, 146783, -210480, 61660, -57491, 255204, -165985, 322716, -222029, -281382, -48020, -92051, 144878, -393931, 40457, -285840, -46500, 45747, -282857, 297182, 16265, 285136, -201529, -193902, 23886, -35751, 168005, 40427, 84797, -259955, -11611, 187242]
15322D0565a5573j13192p9470F4862a33403L1837k83931B41473c3447O916j62069
15311a88600d4689j78605A72407i637H0952P4354K90301B17931C1292L2796Q2761
15300A46849K41580B8520a59151B45098a8469A02189D8966A3477b40626e336D50618
15288a60965D0621o398J24805a22276H2609b81487a20522a6988A39232r560J7181
15277A46853a26199m8607C4249K0301A4252e2141j22881A30151l810b83662g0019
15265A18770m4195J88476b86739L3731B99875o4294g2106j463G1823a98909d9188
15253B81974g6951B11794q9887K15867K21816M7232O74616l59269J53871E03445
15242E1421c3619j83834d0150C21731p9116A04842K61292e3163H9836J51746R1344
$$ y = [40565, -15573, -128765, -208235, 64862, -133403, -101566, -385497, 241473, -33447, -26531, -188600, -44689, -223294, 172407, -9637, 80952, 155306, 445607, 217931, 31292, 64088, 146849, 388429, 28520, -159151, 245098, -18469, 102189, 48966, 13477, -240626, -5336, 450618, -160965, 40621, 34223, 159028, -122276, 82609, -281487, -120522, -16988, 139232, 129672, 146853, -126199, -174806, 34249, 54550, 14252, -52141, -175022, 130151, 126341, -283662, -70019, 118770, 74575, 263051, -286739, -253008, 299875, 235581, -72106, -73569, 71823, -198909, -49188, 281974, -76951, 211794, 121907, 337774, 559590, 606822, 1281438, 922169, 1076040, 503445, 51421, -33619, -217453, -40150, 321731, 242615, 104842, 366134, -53163, 89836, 241582, 332926]
15231C32926F299a6065B15866b39534F044L18376j18632b4808K939m717k784C97661
15218B6772i4231D12721r5897A21841o767A4393P7572K41122a00171j46809F1407
15206B0471K02542D4539a74543a0992F3273K08968a79588j55389g1507G2855J4436
15195H7291C1599c5807H8784b18150e5506C19884a41663B88735f0672E5509b08753
15183b71364r578H9252q709J63396j05379e3504p764B85340m1795C1717b36911
15171H9439K84348a20923M5716A5627a78775A77232N8658r0436D0200c45086D1915
15159f9243k0856L5639C25938m8999a41664k5891K3174L7540m58b3887p463C6321
15146a12557J6503C03136r6921c50414B6637c6182B44993r6871a1750D6795L5328
$$ y = [332926, 6299, -16065, 215866, -239534, 6044, 324420, 205788, -24808, -21869, -26586, -29370, 397661, 26772, -94231, 412721, 316824, 121841, 115074, 14393, 91965, 333087, -100171, -246980, 61407, 20471, 223013, 44539, -174543, -10992, 63273, 272241, -179588, -334977, -71507, 72855, 87291, 31599, -35807, 88784, -218150, -55506, 319884, -141663, 288735, -60672, 55509, -208753, -271364, -280942, 89252, 80543, 243939, 138560, -53504, -61268, 285340, 243545, 31717, -236911, 89439, 373787, -120923, -75207, 15627, -178775, 177232, 235890, 145454, 40200, -345086, 41915, -69243, -90099, -54460, 325938, 276939, -141664, -167555, -144381, -106841, -107299, -23887, -31350, 36321, -112557, -96054, 303136, 206215, -350414, 26637, -36182, 244993, 148122, -11750, 46795, 82123]
15135H2123J48342p4750b9530j17862E3811J31404J7766D2684P2927n6771f0608
15123d0284B0380c33248A66727J83241A70666L0559i6537q2505O376j8445c8502
15111c1382k89852A78222i3008C47925e1969d309q6220E8153a3975j05382B24756
15099h9886A56363b853l7769j3573B05343J7619L0895r7446E8736j5118K68491
15088C12109k3158E4978c39889A33529m6989O1032E9749K11042f6716B28913a02263
15076C44356a16909A47984J75040b14689B32954h1918p0696D38739j13718C8981
15065B26690i1295B46830b7328A76952h9361C04222D0649b26089A17227Q4664
15055B01891J49150A36769E6475A0244c934C35581A54021J30849o6475I8866L6453
$$ y = [82123, 230465, 155715, -29530, -147392, 53811, 185215, 202981, 42684, 115611, 58840, -60608, -40284, 20380, -333248, 166727, 349968, 170666, 201225, -96537, -179042, -172666, -191111, -38502, -31382, -321234, 178222, -93008, 347925, -51969, -4309, -90529, 58153, -13975, -119357, 224756, -89886, 156363, -2853, -40622, -54195, 205343, 222962, 253857, 156411, 58736, 43618, 312109, 288951, 54978, -339889, 133529, 86540, 147572, 59749, 270791, -66716, 228913, -102263, 344356, -116909, 147984, 323024, -214689, 232954, -81918, -152614, 438739, 325021, 38981, 226690, -91295, 246830, -27328, 176952, -89361, 304222, 40649, -226089, 117227, 201891, 351041, 136769, 56475, 10244, -3934, 335581, 154021, 284870, 218395, 98866, 135319]
15044A35319J126L1819O4035A6399L2197h3878A74053L9830h4493j26143a0621
15032A60705O6097i7924A40443J75029a29450A69425b31411F4425b45585Q9053
15022a56532l5006B28189A12922a769j7715j2913A37070d5903C18962H7647K05920
15011B93567a61077A12522k9878K09462a45451G5484K17621h9927C4343J58598
15001A92941j0950M9051d9663I1972g110B33947j06585L14331H3859L54888J20433
14990E59180B50979c46562A09046f8693B32518A12371a65823C60180R9588j12403
14980C47365J72960i5260M1121A14449K312J69938I7291K91365A72989C2924Q735
14969D1659a40970A42389j5360J19386j081K0460A17458M12443j22667G6683K44479
$$ y = [135319, 136445, 168264, 232299, 16399, 48596, -83878, 174053, 213883, -84493, -210636, -10621, 160705, 226802, -97924, 140443, 315472, -129450, 169425, -231411, 64425, -245585, -156532, -191538, 228189, 112922, -1769, -19484, -32397, 137070, -45903, 318962, 87647, 293567, -161077, 112522, 82644, 292106, -145451, 75484, 293105, -89927, 34343, 192941, 181991, 231042, -49663, 91972, -7110, 233947, 127362, 441693, 83859, 438747, 559180, 250979, -346562, 109046, -68693, 232518, 112371, -165823, 360180, 459768, 347365, 520325, -95260, -54139, 114449, 116761, 286699, 97291, 388656, 172989, 32924, 41659, -140970, 142389, 127029, 246415, 245334, 265794, 117458, 529901, 407234, 76683, 321162]
14958C21162j01544K0422p8245J22542F6759K55570a891C41900b7994B13200J93802
14947D07002r8721m0233r8315J94841j30699N7730l8872r5714K61019D1512L90432
14936D31944A29295K43791g6227j933F9161K18600j04875N7802k8186j4910K60992
14925D58584l0089G0369b3003H1959f3730C46057A71008G6806B9769K2676L3451
14914H5896L15498r6207A51254a8434C1556K27507I4726d0300D02752a09291B93880
14902A04825a384A31643f76B21176J46882L0022J11771A29163R3960K00093j42525
14891B80691A07872L9620K48623j93207M32421A25647E5157J87604k4633N1360
14881B69488r4593K46854O4356A50379J74857j12661M20800k57372B2209R8907
$$ y = [321162, 219618, 240040, 161795, 284337, 66759, 322329, -1891, 341900, -27994, 213200, 407002, 308281, 268048, 169733, 364574, 233875, 291605, 252733, 157019, 418038, 41512, 431944, 129295, 373086, -76227, -78160, 69161, 287761, 182886, 240688, 212502, 197592, 458584, 428495, 70369, -23003, 81959, -63730, 346057, 171008, 76806, 29769, 52445, 85896, 401394, 305187, 151254, -18434, 31556, 259063, 94726, -40300, 402752, -109291, 293880, 104825, -1384, 131643, -676, 221176, 368058, 398080, 509851, 129163, 223123, 423216, 280691, 107872, 147492, 396115, 202908, 635329, 125647, 55157, 242761, 218128, 269488, 174895, 421749, 486105, 150379, 325236, 212575, 633375, 376003, 22209, 121116]
14871A21116L05703r3987a07970a1086B38082J75561J62352B06743L83604C0049
14860E22458G3062J51906a05030H5410K31236B5924L64458j77350O7246K9519
14850C09797j00534K23397A95871L01483J1698j34127j10887A22425D4436L12292
14840C56728K6489r735j29582L77145J14259A77274l2869M90978k74671k1570
14830C39142r1679K57874p5896K1675j74327f4889B82645J32095o2864H4369N63933
14819F48302k63295D4616L17120J18919K87037C00945M1325n7648J6533l5437
14809B65718J63070n8061L3144p9615j48002o4987M13994R2826B25130L5366j25164
14798A35332J81244J93619P2721j01973J58327j35810n7302k0743n8200j34467
$$ y = [121116, 426819, 332832, -107970, -11086, 238082, 413643, 575995, 206743, 590347, 30049, 522458, 73062, 224968, -105030, 85410, 316646, 25924, 390382, 213032, 280278, 309797, 209263, 432660, 195871, 497354, 509052, 374925, 264038, 122425, 44436, 356728, 383217, 373482, 243900, 621045, 735304, 177274, 144405, 635383, 360712, 339142, 247463, 505337, 429441, 451116, 276789, -64889, 282645, 414740, 351876, 84369, 648302, 385007, 44616, 361736, 480655, 767692, 300945, 342270, 284622, 301155, 265718, 428788, 370727, 403871, 324256, 176254, 111267, 525261, 618087, 225130, 260496, 135332, 316576, 510195, 582916, 480943, 639270, 503460, 446158, 425415, 367215, 232748]
14788B32748K10933j65051M12755l39436j22021K15297k652j6447j6570O0622
14778D70178L6154j09515J96303k16196j01570L23087k73849J94775o1215K54989
14768G13141B43487J7705J91795L69968l97403j16841K11521B06586L82463L6110
14758F25159k57659J04151J9219K17863C24514J96847L8391J5730o3207L16456
14748H28731j96150j89123J03323B64559N81196k23421j54508J62098K90376k45022
14738F75278Q180j59115k45859M20723O1758j77094O2224O3926K01239m36237
14728D75023j09059J35674j15768L4764J35853R4903J8198j12558o1722J61548
14718F56856N3487O0754k71727J90130M25955D62108K10836J64540k31729J9248
$$ y = [232748, 443681, 278630, 691385, 351949, 229928, 445225, 442573, 426126, 409556, 470178, 506332, 396817, 593120, 376924, 275354, 598441, 324592, 519367, 458152, 713141, 243487, 261192, 452987, 822955, 425552, 308711, 520232, 206586, 589049, 625159, 367500, 471651, 490870, 708733, 324514, 521361, 559752, 575482, 512275, 828731, 632581, 443458, 546781, 264559, 845755, 622334, 467826, 629924, 920300, 675278, 683458, 524343, 278484, 699207, 760965, 583871, 646095, 710021, 911260, 475023, 365964, 501638, 385870, 420634, 556487, 651390, 669588, 557030, 495308, 656856, 710343, 771097, 499370, 689500, 1115455, 462108, 672944, 837484, 605755, 625003]
14708F25003J07256j54329K91017l27018J79863K7591L70296D80521N74520l50363
14698G04678o9202K3248J58127k68165K09187K7582o1746K65634A52187R03054
14688A055241k30085n9011L89145l56676J16916l86918L70753K01719l34261K97870
14678A064693m07232L50508j04301q4499J41164m32483K69991j36466J48924J03524
14668I13823J02487j61299m14679K13515J59034K3445k49607L21167l48182K53350
14658H13054N288l3394m5340K30190j26844N3570L9430P9262j02227P5598J85923
14647A174510k24453r4639J22199L53856l53927k87869J14385J77396k83393M41578
14637A139643k11386L46799k34063J90011j04529j6082j68927J91556J16815k85653
$$ y = [625003, 732259, 577930, 868947, 541929, 721792, 749383, 1119679, 480521, 1055041, 704678, 635476, 658724, 816851, 548686, 757873, 785455, 723709, 989343, 152187, 1055241, 825156, 766145, 1155290, 798614, 915530, 528612, 899365, 1101084, 766823, 1064693, 657461, 1007969, 903668, 819169, 960333, 527850, 797841, 661375, 810299, 913823, 1016310, 855011, 440332, 653847, 812881, 836326, 586719, 907886, 559704, 813054, 818342, 784948, 739608, 969798, 842954, 896524, 935954, 1015216, 912989, 988587, 1174510, 950057, 855418, 977617, 1331473, 977546, 689677, 804062, 981458, 698065, 1139643, 928257, 1275056, 1040993, 1231004, 1126475, 1110393, 941466, 1133022, 1249837, 964184]
14627I64184J88067J47318j30682K7350J1904l27821K86154J17947m50599O22003
14617A455825k10506l86756J95687K89642Q8441J6968m06249r414M09571Q8826
14607A532035m24573K54057o2409J28332k53601K02631r6858P2167K16497k45773
14597A322505k17892J79941J19414k00279J60301K14570k32925K18710k65524
14588A298821J95588l7543K87205n96313K53696M9621M54940o56615J38392L58930
14578A746722q7460J94082k65191J51845R6489l63073q0885L79317J08137j71862
14568A708121J76912L04008m15252K10673p1455L51925k68130J11453O5849Q0530
14558B254634J92974j63988J79510L73631L7345J38475M71160M31603Q47771J772186
$$ y = [964184, 1152251, 1299569, 1168887, 1196237, 1208141, 880320, 1166474, 1284421, 833822, 1455825, 1245319, 858563, 1054250, 1343892, 1432333, 1449301, 1043052, 1033638, 1443209, 1532035, 1107462, 1361519, 1299110, 1427442, 1173841, 1376472, 1279614, 1351781, 1568278, 1322505, 1104613, 1284554, 1403968, 1203689, 1363990, 1578560, 1345635, 1564345, 1298821, 1494409, 1456866, 1744071, 1147758, 1401454, 1451075, 1906015, 1249400, 1387792, 1746722, 1659262, 1853344, 1588153, 1739998, 1836487, 1473414, 1392529, 1771846, 1879983, 1708121, 1885033, 2189041, 1773789, 1984462, 1913007, 2264932, 1996802, 2108255, 2174104, 2254634, 2447608, 2283620, 2463130, 2836761, 2874106, 3012581, 3483741, 3915344, 4763115, 6535301]
14548F535301L837044J0340237J6646814N146366k0190883H751315m174557j595646
14540B981112o93032m96366j90804K86334j34586L12387l26588m5927J648L9285
14530A733463r8877J44179m9586o3894K62986j4455J44806N1576k72642L74401
14520B211957k85149k33159L1422L01666K11954j18821L66245p0987J25290j08021
14510B432397R9668l28641J30254K05355j73193J65796o2362J91027j3584k49474
14500B397243K05519K02673j70711N3591k07721L31002J71928N7790l38404O9001
14490B771911O5355j80170j33612O03936j62819M6674K59966k13339Q7626M38126
14480C583654l99789K51183m7415k7482J23416l27383J76281n1317K92075o3250
$$ y = [6535301, 10372345, 20712582, 37359396, 42505762, 22314879, 8751315, 4576758, 2981112, 2288080, 1791714, 1600910, 1887244, 1752658, 2065045, 1738457, 1692530, 1694178, 1733463, 1634586, 1778765, 1729179, 1665285, 1928271, 1913816, 2058622, 2110198, 1837556, 2211957, 1926808, 1693649, 1725071, 2026737, 2238691, 2119870, 2486115, 2415128, 2540418, 2432397, 2532065, 2203424, 2333678, 2539033, 2365840, 2531636, 2469274, 2660301, 2646717, 2397243, 2602762, 2805435, 2634724, 2688315, 2480594, 2811596, 2983524, 3041314, 2702910, 2771911, 2837266, 2657096, 2523484, 3127420, 2964601, 3011275, 3271241, 3057902, 3145528, 3583654, 3183865, 3435048, 3387633, 3360151, 3483567, 3156184, 3332465, 3281148, 3573223, 3509973]
14470C509973J91929o7498K757P9913k8506m0695L09555l44145L11083J48094
14460D072460o4739k96927R9360K17627K77882O5505k02820k0117J21967O3603
14450D333801L56744j64185j79152K16101L75556l20438J99509K08217q4101n0552
14440D891500K48380O7961P5357J38044J28245J15840j17057K86979j70735K36017
14430E900531P4015j36015K3575N7493L80722j88766M77659l02864J27399L25279
14420F739028j05386J07546J11793L3537k4612O40653R71j48537L46455O1254
14410G762702m1797R1577J31616J40288n3981K67583K35535L32457p3946M15407
14400I207441m4237K26328l35151P19794k86154L11121K15803K09826p6450M28238
$$ y = [3509973, 3701902, 3634404, 3637161, 3717074, 3688568, 3647873, 3957428, 3613283, 3924366, 4072460, 4007721, 3710794, 3810154, 4027781, 4305663, 4371168, 4168348, 4148231, 4270198, 4333801, 4690545, 4526360, 4347208, 4563309, 4938865, 4618427, 4817936, 5026153, 4942052, 4891500, 5139880, 5207841, 5283198, 5421242, 5549487, 5665327, 5548270, 5835249, 5664514, 5900531, 5974546, 5838531, 5862106, 5919599, 6300321, 6111555, 6589214, 6286350, 6413749, 6739028, 6633642, 6741188, 6852981, 6886518, 6861906, 7502559, 7503530, 7354993, 7701448, 7762702, 7720905, 7812482, 7944098, 8084386, 8030405, 8297988, 8533523, 8865980, 8792034, 9207441, 9163204, 9389532, 9054381, 9774175, 9488021, 9799142, 10014945, 10224771, 10148321, 10576559]
14390A0576559j31724N21694p7556J05694N59688M2013O7397M20086J25680N7891
14380A2267422N23823k42686M72465M15896Q6462O11469Q2502M4551L47650J62473
14370A4772027Q10306K83638k28963P12586L65338K38724L26871N10258Q3535
14361A7874320M15806J081261r9567K56863N40821Q41709K63319N15192N72073
14352B2261797O79569O0789O92401N91033L40868J055203O97596O00464Q30772
14343B7810492P16595M96430R01776J027186O24330R14151J020997Q40370J159483
14334C5511810J636232N08388J039760J257181J349284J378308J448908J332624
14326D5462495J587267J782258J153387J995788J738386K002355J998570K009045
$$ y = [10576559, 10444835, 10966529, 10888973, 10994667, 11554355, 11596368, 11663765, 12083851, 12209531, 12267422, 12791245, 12548559, 13021024, 13436920, 13523382, 14134851, 14217353, 14261904, 14609554, 14772027, 15582333, 15865971, 15637008, 16349594, 16714932, 16953656, 17280527, 17790785, 17874320, 18290126, 19371387, 19271820, 19528683, 20069504, 20911213, 21174532, 21689724, 22261797, 22941366, 23002155, 23694556, 24285589, 24626457, 25681660, 26379256, 26979720, 27810492, 28527087, 29023517, 29925293, 30952479, 31576809, 32490960, 33511957, 34352327, 35511810, 37148042, 37656430, 38696190, 39953371, 41302655, 42680963, 44129871, 45462495, 47049762, 48832020, 49985407, 51981195, 53719581, 55721936, 57720506, 59729551]
14318E9729551K164469K667496K535839K467443K821694K801921L115870L171501
14310H1475784L508832L805297M049750M097062M185892M978967M614764N208880
14302A15925228N372395O276654N947736P242899P443252P499712Q054489R088507
14294A72850872R348748R735960J0742918J1357675J1788202J2873088J3288305
14287B51985768J4395332J4999988J5151791J6412310J6625559J7011654J7085398
14280C63667800J7569406J6628614J6450038J5284065J3996314J2602634J0309579
14273D66508450P723463K651419k387278l094410j039808j584286n127019r240468
14265D54410063r791516j1011382j2906233j4604226j6248972j7358212j7555789
$$ y = [59729551, 61894020, 64561516, 67097355, 69564798, 72386492, 75188413, 78304283, 81475784, 84984616, 88789913, 92839663, 96936725, 101122617, 106101584, 110716348, 115925228, 121297623, 127574277, 133522013, 140764912, 148208164, 155707876, 163762365, 172850872, 182199620, 191935580, 202678498, 214036173, 225824375, 238697463, 251985768, 266381100, 281381088, 296532879, 312945189, 329570748, 346582402, 363667800, 381237206, 397865820, 414315858, 429599923, 443596237, 456198871, 466508450, 474231913, 476883332, 474496054, 471401644, 470361836, 468777550, 463650531, 454410063, 444618547, 433607165, 420700932, 406096706, 389847734, 372489522, 354933733]
14258C54933733j7226102j7386556j6597022j5017772j5086192j4825173j3862495
14251B44932421j3025485j2426670j1452416j1402847r958777r667387r038798
14244A67960041q255262p891183p434624p123063o588689o408134n414716n178167
14236A13666203n190636m980842m574731m112875l639441l626601l591456l171215
14228H0778406l597634l192463k435530l037431k768140k155048k349303k114667
14220E9128190j883093j995104j905571j961917j695638j365771j274464j104927
14212D5941705j895258j481177j626091o79788j101634q59603j071073j323503
14204C5903578j268162q86121r57590m30835o13787j159271j110178o96984n68937
$$ y = [354933733, 337707631, 320321075, 303724053, 288706281, 273620089, 258794916, 244932421, 231906936, 219480266, 208027850, 196625003, 186666226, 176998839, 167960041, 159704779, 151813596, 144378972, 137255909, 130667220, 124259086, 118844370, 113666203, 108475567, 103494725, 98919994, 94807119, 91167678, 87541077, 83949621, 80778406, 77180772, 73988309, 71552779, 68515348, 65747208, 63592160, 61242857, 59128190, 57245097, 55249993, 53344422, 51382505, 49686867, 48321096, 47046632, 45941705, 44046447, 42565270, 40939179, 40259391, 39157757, 38298154, 37227081, 35903578, 34635416, 33749295, 32791705, 32360870, 31747083, 30587812, 29477634, 28780650, 28211713]
14195B8211713j062502N9869j110362n47088n57586p79698m41192o94524l96421
14186B2682209n59474p44790n00143k69832p66194m6950m21795k70105q32494
14177A8270432L9341p26639k87749m42294l97235J0271q40073M53979q23856j66902
14167A5089275l36864j14631m99296k45185k79944j22748j06359k27791l26044
14158A2830413k42345l91850j22601J72580l29426j06673m69152J4738p3519k11281
14148A1070884m62538r7707k19543j58046k64798L59956o19431L7907m45114j54445
14138I047125j65938M06563l77695J60781l27161k00913J43894o04310K3269r666
14128H095949q823k71186J25604l54851K66390k95183m17991J11808j16940N6367
$$ y = [28211713, 27149211, 27209080, 26098718, 25551630, 24994044, 24214346, 23773154, 23078630, 22682209, 22122735, 21377945, 20877802, 20607970, 19841776, 19794826, 19373031, 19102926, 18270432, 18309773, 17583134, 17295385, 16853091, 16455856, 16466127, 15626054, 16080033, 15256177, 15089275, 14752411, 14637780, 14138484, 13893299, 13613355, 13490607, 13384248, 13156457, 12830413, 12588068, 12196218, 12073617, 12246197, 11916771, 11810098, 11340946, 11355684, 11282165, 11070884, 10608346, 10510639, 10291096, 10133050, 9868252, 10228208, 9608777, 9646684, 9201570, 9047125, 8881187, 9287750, 8910055, 9070836, 8743675, 8542762, 8686656, 8082346, 8105615, 8095949, 8087126, 7815940, 7941544, 7586693, 7853083, 7557900, 7139909, 7251717, 7134777, 7191144]
14118G191144L9207l56772k23185p7033o5311K00370J7916m31685m02640M09655
14108F301666j73364j35868m776r45m01550L38999n09418J18376L72707k62420
14098E643407m0621q0779k89764Q7908m19416L17158K64585o21763m1255M23707
14088E243167l62111K4562j79657R4354m54726J85068j22882L77816l40270j34559
14078D330762J7170o7866L78936k46001k74933P9154j00359m4897j87759J40068
14068D024275L13580k34865o7369j19125J92976k21231j67534J83252j11278j92721
14058C599960M19772k88338O8123K17799n50167J30918j43276J55223k37984k65431
14048C106599K25391k66123J93286l85610J31635n0309J00813k07538K40263j28751
$$ y = [7191144, 7230351, 6873579, 6650394, 6573361, 6508050, 6708420, 6726336, 6294651, 5892011, 6301666, 6128302, 5992434, 5987658, 5986713, 5585163, 5924162, 5414744, 5533120, 5905827, 5643407, 5602786, 5522007, 5232243, 5320151, 4900735, 5217893, 5482478, 4860715, 4819460, 5243167, 4881056, 4905618, 4725961, 4820315, 4365589, 4550657, 4427775, 4805591, 4465321, 4330762, 4347932, 4280066, 4659002, 4413001, 4138068, 4217222, 4116863, 4071966, 3884207, 4024275, 4337855, 4102990, 4035621, 3916496, 4109472, 3888241, 3720707, 3903959, 3792681, 3599960, 4019732, 3731394, 3799517, 4017316, 3467149, 3598067, 3454791, 3610014, 3372030, 3106599, 3331990, 3065867, 3259153, 2873543, 3005178, 2954869, 3055682, 2848144, 3088407, 2959656]
14038B959656o9704k8853k1460L49425l97551o4949J54278p7380K07082k56641
14028B753903m1666k1378r1166j11992J10007j16872j39583j90961K75062o1041
14018B364313Q8399J93588k08069L3605q6726k28135K47424j03516P6714j63189
14008B214408O5011k39852O026L84543m74964R7370k41058K97320k39399J08787
13998A978192j30927j51641P3465J8732K23036m35580L11991r4555K01568J231711
13988C225992K301627Q226124J7879735J1789555j6819091A2570883m350302k288701
13980E931880j244695r01028n15697N5257j62438l56352k98327q0413J35502n41546
13970B022143L91616J58585l89846o2694K73730l45804k99614K43352J4768K5349
$$ y = [2959656, 2889952, 2861099, 2839639, 3189064, 2791513, 2726564, 2880842, 2803462, 3010544, 2753903, 2712237, 2690859, 2599693, 2487701, 2597708, 2480836, 2341253, 2150292, 2425354, 2364313, 2452712, 2646300, 2438231, 2471836, 2385110, 2156975, 2404399, 2300883, 2377597, 2214408, 2279419, 2039567, 2045593, 2430136, 1955172, 2052542, 1811484, 2108804, 1869405, 1978192, 1847265, 1695624, 1769089, 1787821, 2010857, 1575277, 1887268, 1792713, 1994281, 3225992, 5527619, 13753743, 31633478, 43423033, 26603942, 12570883, 8220581, 5931880, 4687185, 3786157, 3270460, 3325717, 3163279, 2806927, 2508600, 2428187, 2563689, 2022143, 2413759, 2572344, 2182498, 2119804, 2393534, 2047730, 1748116, 1991468, 2006236, 2031585]
13960B031585j1843k37515L93312j32017k84497K27352q3009o1682m22537M09594
13950A828743N8931o6776l6318K80468k77597j30916q0885K49954j60328j2304
13940A652972K3857q886l8994J17895k57832J60193m0634j15501J05055J37186
13930A735311N1969j47494q0985l74434N95815k56835j15236K13630j29761P8326
13920A570306k28522r6142K91831j91099O601q3432K1744j38076O0679M27655
13910A641545n39696J72680N5911O1080q4729l7245n0251P5186j27363O1520K20083
13899A448721j90324q3814J39960M9782k33027L64346m6663r0701J27889l69816
13889A116353K34940j99147J70688k86489L737J87877K6923j47527J4840J12205
$$ y = [2031585, 2019742, 1782227, 2175539, 2043522, 1759025, 1986377, 1903368, 1841686, 1419149, 1828743, 1887674, 1820898, 1784580, 2065048, 1787451, 1656535, 1575650, 1825604, 1665276, 1652972, 1676829, 1667943, 1628949, 1746844, 1489012, 1649205, 1608571, 1493070, 1598125, 1735311, 1787280, 1639786, 1558801, 1184367, 1780182, 1523347, 1408111, 1621741, 1491980, 1570306, 1341784, 1245642, 1537473, 1346374, 1352975, 1269543, 1291287, 1153211, 1213890, 1641545, 1101849, 1274529, 1330440, 1391520, 1306791, 1269546, 1219295, 1294481, 1167118, 1228638, 1448721, 1258397, 1174583, 1314543, 1364325, 1131298, 1495644, 1448981, 1358280, 1486169, 1116353, 1351293, 1152146, 1322834, 1036345, 1040082, 1227959, 1254882, 1107355, 1122195, 1234400]
13879A234400n60827M77822N1681J51083n15158K72502O1831j38466k89825K63252
13869A008295q7497J95990Q7596q1585j10469L9554p7725J37977j73753J54576
13859A092959R6725j49446l12050Q3746R3646J76545l1746j60811N0346J05902
13849A045816R1119j39550P5219j09359q1323J79813q4394L3890J1131k31202
13839G91160k3930M3760K08522j42042q5212J71733J46379k62627R6862l30382
13829F14223o8846M33033l94861J50874Q2417J04446j66009K27166l30750J36143
13819G87836k7387M8866J18995k40967J06106Q41461m07733j93694l67150j73049
13809D93284M93638N4026k41085K6381r2210J4520C29493N71470k51806O8415
$$ y = [1234400, 673573, 1151395, 1203076, 1354159, 839001, 1111503, 1173334, 1034868, 745043, 1008295, 920798, 1116788, 1204384, 1122799, 1012330, 1051884, 974159, 1112136, 938383, 1092959, 1189684, 1040238, 728188, 811934, 905580, 1082125, 1050379, 889568, 939914, 1045816, 1136935, 997385, 1072604, 963245, 881922, 1061735, 977341, 1011231, 1022362, 791160, 767230, 810990, 1019512, 877470, 792258, 963991, 1110370, 847743, 944605, 614223, 545377, 978410, 583549, 734423, 816840, 921286, 755277, 982443, 651693, 787836, 760449, 809315, 928310, 687343, 793449, 1634910, 1227177, 1033483, 666333, 493284, 986922, 1040948, 799863, 826244, 734034, 748554, 329493, 900963, 649157, 717572]
13799G17572j69677L05947O3523q50N0867j88276J85710l52250J59150j31525
13789F40191J22586m023k9352j01474K25708J48891m89067K80853M1495p9740
13779G56068j0774j81119K2816L4068k28356N11635j42309j37547J96530k42580
13769E78432Q561q9697K23859k75657K79601j01883J21096L08016D25784M66364
13759H92148j71520j16230K80026k57880K02429j78631J71121j4356k35599J00219
13749F71727j99862l1131K98726P241j07462K70788O904l06124j26235J11824
13739E96396o9258N5971l3491m6685K03043j73451j49143M96196l73259q4740
13729D21579K62732l22651K58656j29889p2397j23914M503J02269L2004M83767
$$ y = [717572, 547895, 853842, 917365, 916515, 967382, 779106, 964816, 612566, 771716, 640191, 762777, 758754, 729402, 627928, 853636, 1002527, 513460, 794313, 835808, 756068, 745294, 564175, 586991, 621059, 392703, 904338, 762029, 624482, 821012, 578432, 586993, 497296, 721155, 445498, 725099, 623216, 744312, 1052328, 425784, 892148, 720628, 604398, 884424, 626544, 828973, 650342, 821463, 807107, 571508, 671727, 471865, 440734, 739460, 746701, 639239, 910027, 916931, 610807, 484572, 596396, 527138, 583109, 549618, 502933, 705976, 532525, 383382, 879578, 506319, 421579, 684311, 361660, 620316, 490427, 418030, 294116, 298619, 400888, 432892, 916659]
13719I16659l79537d5209F55717l4584p3521n5032j52915l8250L2542K39912l9555
13708E34314m3067L706Q6056k68320J22267N9735j14036J44374j29713J98620
13698E93936j73787B03454L13330R3928j92336K92058C50724M8335J60497r0778
13688D68778J33749j94877J10664J4469j133p3998J34463B49883J19441P6758
13678D46082J70765q1040k19245n9093L79476j85380L0847e1424B28592j6895
13668B11697L50173k8234r2807A63024L27003f7316E08905A90591J94803m2760
13658C42634A32033J86612L16929l03723M53920B00688P7800o4844J53961K8637
13648C96242R1256j27190L7360j38722K31728b6375E39262k57489P566K05719
$$ y = [916659, 537122, -45209, 655717, 621133, 547612, 492580, 339665, 301415, 333957, 573869, 534314, 491247, 494953, 581009, 312689, 434956, 494691, 380655, 525029, 395316, 593936, 420149, 203454, 516784, 610712, 418376, 710434, 350724, 399059, 559556, 468778, 602527, 407650, 518314, 532783, 531650, 457652, 592115, 249883, 369324, 446082, 616847, 535807, 316562, 257469, 636945, 451565, 482412, -51424, 228592, 211697, 561870, 533636, 440829, 163024, 490027, -67316, 508905, 190591, 385394, 342634, 132033, 318645, 635574, 331851, 785771, 200688, 278488, 213644, 367605, 396242, 487498, 360308, 397668, 258946, 490674, -26375, 539262, 281773, 289339, 495058]
13638D95058K03848j73466p069J34185k96616P2520n2363J8973N5258j73988M2776
13627C19116m3125Q1096m369a02692E61334k49093O49790C85756j7245O5038L5629
13616D69178A39622N42606l15733r602K89110k45519r5067J82968K0732E8137
13605E63898j24427j93352r3801L3375J78866K15191B42428j20862K22938n0681
13595B93823A39159K56200Q4968B17429m1195N07072B78530K10277k25194J71618
13585D35231H6335K01341J29391A92439K87634n1565L43988A92792J66559p3338
13575B86013J14775j17104J98139C1869L86600B07917C9959J70491R5881k8745
13565B77586J06278L61636l56137j01750J25210G8936K98680l73j55939K48579
$$ y = [495058, 698906, 525440, 518371, 652556, 355940, 428460, 376097, 395070, 450328, 276340, 319116, 275991, 357087, 352718, -102692, 561334, 312241, 962031, 385756, 368511, 433549, 469178, 139622, 682228, 366495, 356893, 646003, 400484, 305417, 488385, 509117, 58137, 563898, 439471, 246119, 152318, 185693, 364559, 579750, 242428, 121566, 344504, 293823, 139159, 395359, 480327, 217429, 176234, 683306, 278530, 488807, 263613, 435231, 86335, 287676, 417067, 192439, 480073, 428508, 772496, 192792, 359351, 286013, 400788, 283684, 481823, 31869, 418469, 207917, 39959, 210450, 306331, 277586, 383864, 745500, 389363, 287613, 412823, 78936, 377616, 377243, 221304, 469883]
13555D69883j74122O6121I7611J04660K33186j59339n1754L11694B24878b05064
13544E14926A03576L55411j34806A15446Q6368M5853o039R0449J17775j80578
13534B69274r2083K31539D3053L85755j15966K05164A12678O8168R6699N6730
13524C34275l4768J74841A11471K17279a3354p478B80552K1806q7473O1006H4902
13512E69778j49096j30059r8042b44237g0752C6759L67152j75294J48957m3068
13502C34506J89136G5896L46654o0029p2366J53717B4927Q60733B18997J81938
13492D00935I2315a8670C57702A20628J51250L04977A17247c3396F17731k78092
13482C39639j07962A00948R6284P1924J81828G7253K61282j02418j00517J45597
$$ y = [469883, 295761, 361882, 97611, 202271, 435457, 276118, 224364, 536058, 224878, -205064, 514926, 103576, 458987, 324181, 115446, 201814, 247667, 241628, 332077, 449852, 269274, 177191, 408730, 43053, 428808, 312842, 518006, 112678, 180846, 277545, 334275, 299507, 474348, 111471, 328750, -13354, -20832, 280552, 302358, 214885, 275891, 84902, 569778, 420682, 290623, 192581, -244237, -70752, 36759, 403911, 228617, 377574, 334506, 523642, 75896, 422550, 362521, 290155, 443872, 24927, 885660, 218997, 400935, 92315, -18670, 357702, 120628, 271878, 576855, 117247, -33396, 617731, 339639, 231677, 100948, 197232, 269156, 450984, 77253, 338535, 236117, 135600, 281197]
13472B81197J95056B33765j16865K74766a0958A37422L52237E3953K66031Q5884
13462D05868j21176J63398j78936Q417N3075B3104K87023C5561J00375J07690
13452B43626l3893P0225P9009A25007a13283C48019j4102J98001j21260E0021
13441A19589P808a1481C70235F7139M17098A71877J44117a44039B45394a53948
13430D80900j47888r3498k2487E7407J50855R3344j23771a7019A85109r076J14002
13419B90035O4448g4693B81653q3606p749H8823J03491J72973A43717m6240L15522
13408D12999A26559n2292K20792K894J00986b41056C82757j69909L00092a15822
13397D22825d3593A38381J18413j6561J21279A14574a09344C43256A23501J66119
$$ y = [281197, 476253, 233765, 116900, 391666, -10958, 137422, 489659, 53953, 319984, 405868, 284692, 448090, 269154, 277571, 330646, 23104, 310127, 35561, 135936, 243626, 209733, 279958, 358967, 125007, -113283, 348019, 333917, 531918, 410658, 50021, 119589, 127397, -11481, 370235, 67139, 484237, 171877, 315994, -144039, 245394, -153948, 480900, 333012, 239514, 217027, 57407, 208262, 301606, 177835, -17019, 185109, 176033, 290035, 354483, -74693, 281653, 198047, 190298, 88823, 192314, 365287, 143717, 97477, 412999, 126559, 74267, 295059, 297953, 398939, -241056, 382757, 212848, 512940, -115822, 422825, -43593, 138381, 256794, 240233, 361512, 114574, -109344, 343256, 123501, 289620]
13387B89620J02302A72595m1680f0979A43919M07116k3777k07035n9248G9517
13376B07086a73459B76349L9946H0955A279N55063B12753K31370E4483N3056K20178
13365C27717j28714F8534a49304A4327J72422p070K00899f0269p6551L7988B07013
13353A62573P3663J68121j67404A3666a12140M7416B57367J84087j22683k0596
13343B98175j27565J79012J5026j52794r8446m8097K58963D0146a59910B36591
13332C98594n1223J0726N1250N2182l8189j41347J33436j86914J85406A85197
13321B87043A38725n6865J67100E0221L36141j08177k0427J61610J6332B1051
13310A75894k5640L7978n0328J47846n2624J22609P2625a0689M538D20315b7541
$$ y = [289620, 391922, 172595, 130915, -60979, 143919, 551035, 527258, 320223, 260975, 79517, 207086, -173459, 276349, 316295, 80955, 1279, 556342, 212753, 444123, 54483, 107539, 327717, 199003, 68534, -149304, 14327, 186749, 179679, 380578, -60269, -136820, -98832, 207013, 162573, 236236, 404357, 236953, 13666, -112140, -64724, 257367, 441454, 318771, 298175, 170610, 349622, 364648, 211854, 113408, 65311, 324274, 40146, -159910, 236591, 398594, 347371, 358097, 409347, 461529, 423340, 281993, 415429, 228515, 413921, 185197, 287043, 138725, 81860, 248960, 50221, 386362, 278185, 257758, 419368, 435700, 21051, 175894, 150254, 188232, 137904, 285750, 233126, 355735, 428360, -10689, -6151, 420315, -27541]
13298H8494K85040A67301B7890J75788O0423F7434J74704G288b3091B80438l1556
13287B48882r8475K24274j0546A16475K74216A71373K1762b02613C5676J49173
13277A84849R5819J59357a2684B75040a41714b0863A01736K68544G4336K01419
13267B75755o5033I696K6959e2001B17406B8370J71658B579a11132C00099K4508
13256C24607a5686E06590E499d0387e325C90602j30824k0174A05849c0009A23003
13244e18700D3324J11759J30537A0507J53676J18248a1900A07333e365A42450
13233G9665a45501A7430M2713a74585D62414C4014b38165H2453J14050J14853
13223C11356j27610J57679e1671B59140K7436J29883h2951C27450K7524b83291
$$ y = [88494, 373534, 167301, 27890, 203678, 264101, 67434, 242138, 7288, -23091, 280438, 248882, 150407, 374681, 364135, 116475, 390691, 171373, 193135, -202613, 35676, 184849, 280668, 440025, -12684, 275040, -141714, -20863, 101736, 370280, 74336, 275755, 210722, 9696, 36655, -52001, 217406, 28370, 200028, 2579, -111132, 300099, 324607, -15686, 506590, 5499, -40387, -5325, 390602, 259778, 239604, 105849, -30009, 123003, -518700, 43324, 155083, 285620, 10507, 164183, 282431, -11900, 107333, -5365, 142450, 79665, -145501, 17430, 60143, -174585, 462414, 34014, -238165, 82453, 196503, 311356, 183746, 341425, -51671, 259140, 286576, 416459, -82951, 327450, 354974, -283291]
13212a95785A06376a758B12241p1109J8129m9717c32727H9274K53718a22222B15614
13200h9140A57870D5911J54125J48511C0670K32510j29398J01152r9137J15577
13190B51374A18513a23059d7057A61793O9419I5846a4379A13691N1166J05352
13180B70209j26871G0197e8751C9980h9361A37187J02090L8526G2663a60932a6172
13168A90405a94741A36467J75364q2576a81786C1016J79042a145m4221j47278
13158a92644G916a49508c1688j03210j1196e1833C58310F9872k8279a4135k62921
13147b77056D9367P3875m4151J10886J52506A35198F5414c8769A63415E4287K27420
13136B81707H9929K20224H5031g652E5687a12219A49184f4605l1647L7086C35381
$$ y = [-195785, 106376, -1758, 212241, 141132, 159261, 109544, -332727, 89274, 342992, -122222, 215614, -89140, 157870, 45911, 200036, 348547, 30670, 263180, 133782, 234934, 135797, 251374, 118513, -123059, -47057, 161793, 231212, 95846, -14379, 113691, 164857, 270209, 143338, 70197, -58751, 39980, -89361, 137187, 239277, 277803, 72663, -160932, -16172, 190405, -194741, 136467, 311831, 229255, -181786, 31016, 210058, -1145, -45366, -192644, 7916, -149508, -31688, -134898, -146094, -51833, 358310, 69872, 41593, -14135, -277056, 49367, 123242, 79091, 189977, 342483, 135198, 65414, -38769, 163415, 54287, 281707, 89929, 310153, 85031, -7652, 55687, -112219, 149184, -64605, -96252, -59166, 335381]
13124c24879E8572b17217C20906I0425L30608A73651g9414H4791a06430K2580
13114h3850a3128j37541O0346B06615m3591J09441J82559b2277C17715a16968
13103H4083M4213o2904R9580i325A66283m7213m2384a14226E7504Q6294J93434
13092C37232a8598k23785B14835m4244a43493A36611a09619B74765r0709c56561
13081H281K69444B1050g5295B23963B964K06248o1301j1577a08853I2983K73214
13070C66197e0388B96033J68808j93739a3696B25101C1010J49438F641a04376
13059B95350M5592E407N16882j99874F4125K73079l0942b8258B52991C9820J57096
13048A96916B2177E415K12387n4842Q9967B2641d3844F4386O0875L66301B14945
$$ y = [-324879, 58572, -217217, 320906, 90425, 421033, 173651, -79414, 84791, -106430, -83850, -13128, -150669, -90323, 206615, 163024, 272465, 455024, -22277, 317715, -116968, 84083, 128296, 65392, 164972, -9325, 166283, 119070, 76686, -114226, 57504, 143798, 337232, -18598, -242383, 214835, 170591, -143493, 136611, -109619, 274765, 184056, -356561, 8281, 277725, 21050, -75295, 223963, 2964, 209212, 147911, 136334, -108853, 92983, 366197, -50388, 296033, 464841, 271102, -13696, 225101, 31010, 180448, 6641, -104376, 295350, 340942, 5407, 522289, 322415, 64125, 337204, 306262, -28258, 252991, 39820, 196916, 22177, 5415, 217802, 162960, 252927, 22641, -43844, 64386, 125261, 491562, 214945]
13036i3994A68628H3177J68860q3984R286k7686a54853b293p605A1674K92786
13025C04460A32632F5596R2782Q8137d0265B26562j07774J11089q7607o0640k4905
13014E6725M42606f2632E01746A68919a10587d7026C83762j49961b34819d280
13003f5307B41236c9554k7139B16710J7663G0480K38121Q575j050m7349a49771
12991h3821A60702i6919A03317K72210e19488A25051C8113K45606G8177B7762
12980B94134C8092K12935a05807J5562B27112K09412b78173D9782B3329Q4905
12970A08234a68213e3026l07232G9356a57269K9520H552O1130K34322a38747l0657
12959a69404A2202K9238J3144k1744R6823J16096a2666I6081K44442o0257r9880
$$ y = [-93994, 168628, 83177, 252037, 168053, 177339, 149653, -154853, -2293, -9898, 11674, 304460, 132632, 65596, 158378, 246515, -40265, 226562, 118788, 229877, 142270, 81630, 56725, 499331, -62632, 501746, 168919, -110587, -47026, 383762, 233801, -234819, -4280, -65307, 241236, -39554, -66693, 216710, 234373, 70480, 308601, 317176, 316126, 268777, -149771, -83821, 160702, -96919, 103317, 375527, -519488, 125051, 38113, 283719, 78177, 27762, 294134, 38092, 251027, -105807, -90245, 227112, 436524, -278173, 49782, 23329, 108234, -168213, -53026, -360258, 79356, -157269, -127749, 8552, 69682, 304004, -138747, -169404, 12202, 41440, 54584, 32840, 129663, 245759, -12666, 96081, 340523, 280266, 180386]
12948A80386a17522N7243I6084e9273l4082M6633B64319N196d512A00889a9266
12936A82359J6184i1739J2560E238b54159B8411j2007b4607B49068c7077q1434
12925a18511I924d200k8341A88559l7085a38432j57393C36811J5669j29852d3076
12913a01735A65501F2166c8903A7206a59724E9264K0657O3192l6582a88194f4046
12901h3833C4553a22673F4687g2003A98024a04126a8410D3359P4278m7326R2440
12890A62751J88849G5720d1772I1616L15157D7234a55829q882D0087b2556j6793
12879c9349A30155b7789k27199C23176j19733b3301A91543b14101G6974e0617
12868H7191J67374o0052P0616i268A16270C8323d3180A42324R8934l1972b92429
$$ y = [180386, -117522, -60279, 96084, -59273, -93355, -46722, 264319, 269515, -4512, 100889, -19266, 182359, 198543, -91739, -79179, 5238, -254159, 28411, 16404, -24607, 249068, -37077, -118511, 9924, -4200, -32541, 188559, 151474, -138432, -295825, 336811, 352480, 222628, -43076, -101735, 165501, 62166, -38903, 17206, -159724, 59264, 79921, 143113, 106531, -188194, -64046, -83833, 34553, -122673, 64687, -72003, 198024, -104126, -18410, 43359, 117637, 70311, 162751, 351600, 75720, -41772, 91616, 406773, 47234, -155829, -164711, 40087, -22556, -39349, 130155, -27789, -254988, 323176, 203443, -23301, 191543, -214101, 76974, -50617, 87191, 254565, 194513, 265129, -9268, 116270, 38323, -43180, 142324, 241258, 209286, -292429]
12856g1130k33135P7290A11620C2935r971J34628n6877D0770N5999b06244L1877
12845a74367A76115a684B67810f6145C964a57504A60007b376A46864F3294J32631
12834A95925B895Q6888O4357e3643B7987f832I3490P4705a18767A26816e8195
12822A13124a21453b569j39931j7314E60928B24501f2501F9871R9790h6573j46547
12811b33120G1445h0504A12353J56035a21497d2037G0041k8420A8998P4283d8839
12799A08340J51707a8831j65510n1477D6833J75745b100k06549d4731H1244J6871
12788I8115h4416A56917G5366a68691J9890P0420B97082e25460A95354g2147n7932
12777a30079B15800a33316D7231a60499M1122A51152a31617l0015j15644J29704
$$ y = [-71130, -304265, -226975, 111620, 32935, 22964, 157592, 100715, 40770, 96769, -206244, -174367, 176115, -1684, 267810, -66145, 3964, -157504, 160007, -2376, 146864, 63294, 195925, 2895, 89783, 154140, -53643, 27987, -6832, 93490, 168195, -118767, 126816, -58195, 113124, -121453, -2569, -142500, -159814, 560928, 224501, -62501, 69871, 169661, -86573, -233120, 71445, -80504, 112353, 268388, -121497, -42037, 70041, 41621, 18998, 93281, -48839, 108340, 260047, -18831, -184341, -235818, 46833, 222578, -2100, -208649, -44731, 81244, 98115, -84416, 156917, 75366, -168691, -148801, -78381, 297082, -525460, 195354, -72147, -130079, 215800, -133316, 47231, -160499, -119377, 151152, -131617, -161632, -277276, -147572]
12767a47572G6695J3392a27239A0655b05756a02622C9858a82927P4180L1398c8569
12755a91182B76159D5531A9823M0589J04842D8725Q9096a5464A6808f7959D83827
12743B06743j00820b96221A31383a17321B01440k5807c19570B9406a31323N1045
12733h0278B52139l360h3656q7915E5400a1219H3771f6487j99486B04096a14106
12721e5078C42702j09669E2838n080J30287J17131C8486K20492i4378A87720N43797
12710G31517I681L80416A59672R4989r2722N696Q4538J4192J44869b7117A39413
12698e2280A63202l9106a00196C14404a11190I0198a42713B3141c88642a02611
12687G8418e242p0311i367k6962A17633d88523D4428O554K74624m9330N3924a6009
$$ y = [-147572, 76695, 90087, -127239, 10655, -205756, -102622, 39858, -182927, -108747, -77349, -38569, -191182, 276159, 45531, 19823, 60412, 165254, 48725, 137821, -15464, 16808, -67959, 483827, 206743, 105923, -296221, 131383, -117321, 201440, 175633, -319570, 29406, -131323, -80278, 252139, 248779, -83656, -171571, 55400, -11219, 83771, -66487, -265973, 204096, -114106, -55078, 342702, 233033, 52838, 47758, 178045, 295176, 38486, 258978, -94378, 187720, 731517, 9681, 390097, 159672, 254661, 161939, 167635, 252173, 266365, 411234, -27117, 139413, -52280, 163202, 124096, -100196, 314404, -111190, 90198, -142713, 23141, -388642, -102611, 78418, -5242, -75553, -9367, -36329, 117633, -488523, 44428, 50982, 325606, 276276, 330200, -16009]
12674C51865j3795j06602g499k1533j6978k23855a3725B08382b42452f8213f837
12662C5684M8723g7519B70837J24183j35014p4314E9701J40191D7968J09388B4816
12650B7549q609a69263b5755B55967m5249J03262j34378J33634b53243A32203
12639A21196a07007a0383l8452B33157Q7668C5345M9296L5982O6449J82306A877
12627H6657P7928N0082r2480O0000q8049a71648A62986R0793H1174L03016b07129
12615B43962a03484B10459P2102I5076d1549A55321A0878K23735b26002B04769
12604b64879H1345P1323l6132E122b9265A28962g5862A29706L8026j4972N7360
12593B10120E151h229j42595G2691k0220J71604a65854A73237k593c0180G7984
$$ y = [351865, 338070, 231468, -7499, -29032, -46010, -269865, -13725, 208382, -242452, -68213, -6837, 35684, 84407, -77519, 270837, 395020, 260006, 185692, 59701, 199892, 47968, 157356, 24816, 27549, 18940, -169263, -25755, 255967, 210718, 313980, 179602, 313236, -253243, 132203, 121196, -107007, -10383, -48835, 233157, 320825, 35345, 84641, 120623, 187072, 369378, 1877, 86657, 164585, 214667, 122187, 182187, 94138, -171648, 162986, 253779, 81174, 384190, -207129, 243962, -103484, 210459, 282561, 95076, -41549, 155321, 10878, 234613, -226002, 204769, -264879, 81345, 152668, 116536, 5122, -29265, 128962, -75862, 129706, 167732, 152760, 210120, 5151, -8229, -150824, 72691, 52471, 224075, -165854, 173237, 170644, -30180, 77984]
12581b89178D6537r23O8390J32423b44582A60708R5347b50350b5541k30972B7131
12569B52033P149i8902C4872O4492b16867A27619P7793a74839A61164J95947A31166
12557i1451A32793a63520B41116p9631c2449B244M71944a07419A70612q0779B8451
12545a87512A09952L4194p1182b9811B51992G0489f7518J8786A20759a82007B39043
12533h190A70238a80254C04962i2565A67682p9293H368J22212b3606A32413m9569
12522H2844c5896A15131g2203A11285k479g3018r0485m0160j93393A69188E5469
12510a05098G0101d6389B3009R83L40858b57910h9425A32756e3794C90023c00551
12498B1696a97459A50547F7565J7002N0543c06246C97845i2082b5000L731A6892
$$ y = [-289178, 46537, 45614, 114004, 246427, -244582, 160708, 256055, -250350, -25541, -256513, 27131, 252033, 259182, -98902, 34872, 99364, -216867, 127619, 205412, -174839, 161164, 357111, 131166, -91451, 132793, -163520, 241116, 161485, -32449, 2244, 474188, -107419, 170612, 89833, 28451, -187512, 109952, 144146, 72964, -29811, 251992, 70489, -67518, -48732, 120759, -182007, 239043, -8190, 170238, -180254, 304962, -92565, 167682, 88389, 8368, 130580, -23606, 132413, 82844, -35896, 115131, -72203, 111285, 108806, -73018, -163503, -203663, -397056, 169188, 55469, -105098, 70101, -46389, 23009, 23992, 364850, -257910, -89425, 132756, -53794, 390023, -300551, 21696, -197459, 150547, 67565, 84567, 135110, -306246, 397845, -92082, -25000, -21269, 16892]
12486A22514B9011M1568g4198G669a77918k32031D8016J12399F589K40271q7528
12475A59332o7246l7945J34251n6484e3987C03333i5430j0482B35676l2882n6469
12464A46325Q611C1482J96569a59465A0641M1837e0465A7302K22334d700k02135
12453b06835B188K15212a52798N5362I2253N1634O9813a71711K0758k9932h4310
12441G5836J48691p4591l9811N30J66879f7312G4498c35003g9042j394j82729
12430b63165A41832g983l59674D5335j0430j6190h1395k75519a57373E1427b81982
12418a29351k07988D0468a37661B7085a25967O0835A48946d56824F3723c08457
12407b74824B22752G1777h5140p813j89320A93589a8629k52300B1293M4851a15241
$$ y = [122514, 29011, 70579, -74198, 7669, -177918, -409949, 48016, 160415, 6589, 246860, 159332, 92086, 54141, 188392, 131908, -53987, 303333, -95430, -105912, 235676, 202794, 146325, 154936, 31482, 228051, -159465, 10641, 52478, -50465, 17302, 239636, -4700, -206835, 2188, 217400, -152798, -97436, 92253, 143887, 213700, -171711, -150953, -180885, -84310, 75836, 224527, 149936, 110125, 110655, 277534, -67312, 74498, -335003, -79042, -80436, -263165, 141832, -7983, -367657, 45335, 34905, 18715, -81395, -356914, -157373, 51427, -281982, -129351, -337339, 40468, -137661, 27085, -125967, -65132, 148946, -456824, 63723, -308457, -274824, 222752, 71777, -85140, -92953, -282273, 193589, -18629, -270929, 21293, 66144, -115241]
12395G1187A1345L8722l435B39J76790M9983n5258L5271I0283a11022C52948B7662
12382D8730j962b62040j04528D7515a39574p5005B61983a71403O8617B37260b651
12370D2612e5193A96685d2383A68170d9235I0280j3332a07251A38208l9590c8863
12358B32209h9998m6768k05176O0266N8360h8010A28260c210G8808K66692c6296
12346d1700D6798K70031G6173K87198A37947E5115J32151l5808B3688M8577J19108
12335A91373a54317o1733B1617J67471q3009n2512f0340A97710a3066k84392A74853
12323D8120Q5810a39934B35211a9725k27718D639a38091B322L5863J00766a16939
12311b328I5299r073i458F9738c8128C52763a22769K2071A49145P236M5831D8766
$$ y = [71187, 11345, 50067, 46632, 239, 177029, 227012, 171754, 207025, 90283, -111022, 352948, 27662, 48730, 46768, -262040, -366568, 47515, -139574, -214579, 261983, -171403, -102786, 237260, -2651, 42612, -55193, 196685, -42383, 168170, -49235, 90280, 76948, -107251, 138208, 98618, -38863, 232209, -89998, -136766, -341942, -281676, -223316, -88010, 128260, -3210, 78808, 345500, -36296, -41700, 46798, 316829, 76173, 363371, 137947, 55115, 187266, 151458, 23688, 72265, 191373, -154317, -216050, 21617, 189088, 106079, 53567, -60340, 197710, -13066, -297458, 174853, 48120, 133930, -139934, 235211, -19725, -247443, 4639, -138091, 2322, 38185, 138951, -116939, -2328, 95299, 86226, -9458, 69738, -38128, 352763, -122769, -100698, 149145, 156381, 202212, 48766]
12298a2075A04805N0777c02012E517c1118j23436B73395H5309B4791J36786k2490
12287A39087o623B4023d3371B03150G3541h7413A26313n5024A4447P659K1403
12276D3509J83135d1260B01701b2723B7322J00605C1946K97066r4555Q5723B7923
12264b95049J34475f6498C15388A26292D8490b6444a0644A17908R0454c21007
12253A50437O3983n6161K3913c5365a3702B06820J90969b22136A83364B0197a02612
12241B8640M6140c65425h0172o0070B10184e8636A65505O8596a00115B59b00242
12229D9192B2384J70054J64458j70395c2477D48683j77918L078K6627l6738m8807
12218B14925j5073b29619G3142J09347J82240j59036J626F5655c2791A2068K42901
$$ y = [-12075, 104805, 155582, -302012, 5517, -31118, -154554, 273395, 85309, 24791, 161577, 139087, 132464, 24023, -43371, 203150, 73541, -87413, 126313, 71289, 14447, 22106, 43509, 226644, -41260, 201701, -22723, 27322, 127927, 31946, 329012, 234457, 320180, 27923, -295049, -160574, -66498, 315388, 126292, 48490, -26444, -10644, 117908, 208362, -321007, 150437, 214420, 158259, 182172, -35365, -13702, 206820, 397789, -222136, 183364, 20197, -102612, 28640, 74780, -365425, -80172, -140242, 210184, -58636, 165505, 234101, -100115, 259, -200242, 49192, 22384, 192438, 356896, 186501, -32477, 448683, 270765, 273843, 300470, 263732, 214925, 199852, -229619, 73142, 182489, 364729, 205693, 207319, 65655, -32791, 12068, 254969]
12207B54969I4103a2276D2085K815L04693i9190L4586m1126H135J25068J51829
12196B85032I7382J43443F3253K27930J20405b12341B11761Q627R6069f2802C78900
12184D51460k08460A0860N3424H947c6380A97183e626B90014O0546A05113N4707
12173A59820B372K56011N4422j41045a84506C3109a75529I6214m428D5393b5363
12161A30521h1290A62801b9296p7980A02975K22998H3823i4775r5048G1115M02169
12150D73284j78152O643j49676a15069j9534C4473H09b14970a213m0771A57294
12138d742B66055a80284G3319J90175a58043G2274K85703J04991G6798J04971
12128A81769c58667A00445a69136B54418q4406P9441A03536e3941B57810r244
$$ y = [254969, 94103, -12276, 42085, 44900, 349593, -99190, -64604, -105730, 8135, 133203, 285032, 97382, 240825, 63253, 291183, 411588, -212341, 211761, 220388, 316457, -62802, 378900, 451460, 243000, 10860, 64284, 8947, -36380, 197183, -5626, 290014, 350560, 105113, 159820, 2372, 258383, 312805, 171760, -184506, 33109, -175529, 96214, 91786, 45393, -25363, 130521, -81290, 162801, -29296, -107276, 102975, 325973, 83823, -94775, -189823, 71115, 473284, 295132, 301775, 152099, -115069, -134603, 34473, 809, -214970, -1213, -41984, 157294, -4742, 266055, -180284, 73319, 263494, -158043, 72274, 357977, 462968, 76798, 181769, -358667, 100445, -169136, 254418, 170012, 249453, 103536, -53941, 257810, 248566]
12118B48566J74261F3537J25471M6367j6502J36689H4776k4232b64286J24015
12108a40271q1026j5510F4556J869K45074b17785A84239c90897a54282g4955j00776
12097a75731p118a0470F9158C0465b3598i17k99730c7907N663n2203A74975a5130
12084i886k53486A18790a92877o6579C5670b2241N279B10888h0050D18014M2R31482
12072A349538J72044F65938A72656i5989A27210K02398A40956B9913J58757a69554
12061C69409A78425g4571j56488B00732b27115K9645d7951K1950G5497f4156j52462
12050b16618d6448j87284h2318B2848h2704b9613F1859B3639b30631B16961d7935
12038A31991k281a90864O8515j8883B80374a62824b8562k76355J19215A5722L21120
$$ y = [248566, 422827, 63537, 189008, 235375, 218873, 355562, 84776, 60544, -264286, -140271, -221297, -236807, 64556, 66425, 311499, -217785, 184239, -390897, -154282, -74955, -175731, -182849, -10470, 69158, 30465, -23598, -917, -300647, -37907, -32244, -84447, 174975, -15130, -9886, -263372, 118790, -192877, -259456, 35670, -22241, -16962, 210888, -80050, 418014, 418056, 1349538, 1521582, 665938, 172656, -95989, 127210, 329608, 140956, 29913, 188670, -169554, 369409, 178425, -74571, -231059, 200732, -227115, -197470, -47951, -26001, 75497, -64156, -216618, -46448, -233732, -82318, 22848, -82704, -29613, 61859, 23639, -230631, 216961, -47935, 131991, 129710, -190864, -122349, -141232, 280374, -162824, -28562, -304917, -185702, 15722, 336842]
12027C36842D2430n086R6556a77753C57260a53088L8216A94010b6881B30871a57789
12015A72486g1188H7465c8655J4921B29404o9136F171a29750p9117M0556P7238
12004i1073j57898N9655b186A318J20304b87857J20010c6568j75566c0231C4270
11992a1792l9151d364H7812l2947k0368b96616a9103q7965M8986j24326A6232
11980A07274a31339j19302M8533B06760l4747c02441F7968b4690j33962O55H4006
11968A7842i9839B85920C6559b92899O8193A6077J93037B5607g949L022k15257
11957b20184I5989l8994J23793H9831a44931E7042a62291A19931J57521b7865
11946C57152C4527a68695B20078a30829c0553m0061o4300A76746a75829P7575
$$ y = [336842, 42430, 37344, 133900, -177753, 357260, -153088, -114872, 194010, -26881, 230871, -157789, 172486, -71188, 87465, -38655, -23734, 229404, 160268, 6171, -129750, -208867, -168311, -91073, -248971, -189316, -2186, 1318, 121622, -287857, -167847, -36568, -212134, -30231, 34270, -11792, -50943, -4364, 87812, 54865, 34497, -296616, -19103, -107068, -58082, -182408, 16232, 107274, -131339, -250641, -202108, 206760, 172013, -302441, 67968, -24690, -158652, -157997, 84006, 17842, -99839, 285920, 36559, -292899, -224706, 16077, 209114, 25607, -7949, -4927, -220184, 95989, 56995, 180788, 89831, -144931, 57042, -162291, 119931, 277452, -27865, 357152, 34527, -168695, 220078, -130829, -30553, -70614, -134914, 176746, -175829, -98254]
11936i8254c2153A8306N2924p858Q1702b07131a8838A44477B4346f8822A61823
11924b00198A6222Q3661l5992M7571a32867B96605G2988M0401J15362D4384J35746
11913A80130D679h9235C5308J44293a59412A2453j358f5216E5578B0595a10706
11901B56622j04103K5566D4299j2865O6079b34483B77008a06689c140j50789C28624
11889A16384d91069J09785A83085a83174d786I6687a59626g813l0550A21025b16937
11877A96838b67304O0050d3047m07005a7972j16123M1434C24529d1808a1714j05031
11866a16745J2983n6542g731I916L0083J21414M36869a72895c8030L910k7928
11855f2048j298j59498i1027F2442M4152c8570n8619q1408I1299l851a75798A84509
$$ y = [-98254, -32153, 18306, 71230, 63372, 145074, -207131, -18838, 144477, 24346, -68822, 161823, -200198, 16222, 99883, 63891, 111462, -132867, 296605, 72988, 113389, 228751, 44384, 180130, 4679, -89235, 35308, 179601, -159412, 12453, 11095, -65216, 55578, 20595, -110706, 256622, 152519, 178085, 44299, 31434, 97513, -234483, 277008, -106689, -3140, -153929, 328624, 116384, -491069, -381284, 183085, -183174, -4786, 96687, -159626, -7813, -38363, 121025, -216937, 196838, -267304, -207254, -43047, -450052, -17972, -134095, -92661, 324529, -41808, -11714, -116745, -103762, -160304, -7731, 9916, 39999, 161413, 598282, -172895, -38030, -34120, -62048, -63346, -222844, -91027, 62442, 106594, -38570, -97189, -178597, 91299, 87448, -175798, 184509]
11842B75975d5958A48448a7426B3586a17577J9847j41697h2163k66944C53368
11831a89914j29061c6623A74552G3061c52866B07504d99556A23010c0947j45944
11821a76891A48313j3676k0382d0558A17290c51360d0555l20252A35659J16156
11811B51815b40827A73570a14216j03207A56263J94501g897I2068O7057n2129
11801A06996f4094r3323G2903a78644A3092g9992H5946J10445J0911o5389l6629
11790A05284N5283c7047r7040E7861J5627b22560D0057a29036J7954L5005A29942
11778b43862R5309A37324B874a01871B8871e21A45424f8120A62346b5379I4033
11766I3640K63089a40948j2228H0335b76608I4281M090q771O4164h6618C11620
$$ y = [275975, -45958, 148448, -17426, 23586, -117577, -97730, -239427, -82163, -349107, 353368, -189914, -318975, -36623, 174552, 73061, -352866, 207504, -499556, 123010, -30947, -176891, 148313, 134637, 114255, -40558, 117290, -351360, -40555, -360807, 135659, 251815, -240827, 173570, -114216, -217423, 156263, 350764, -7897, 92068, 159125, 106996, -64094, -157417, 72903, -178644, 13092, -79992, 85946, 196391, 207302, 141913, 105284, 160567, -37047, -134087, 57861, 73488, -222560, 40057, -129036, -111082, -76077, 129942, -243862, -148553, 137324, 2874, -101871, 28871, -521, 145424, -68120, 162346, -25379, 94033, 93640, 356729, -140948, -153176, 80335, -276608, 94281, 98371, 89600, 153764, -86618, 311620]
11754A22895b34185h3005o4500J261D6721c30608g6964k7482j44209c0371P810
11743b2561F917K27274r2969g8451A16039a04799N558A70869G0948J23689a30020
11731A48483a53584b6636j48649K5975B29090e81m1032A41020a09552D14722k4080
11720C90642b676j88134b5736k01158f6103E0024c0090j57292I1299r113Q9422
11709A71608E7889M9969J84533a57591D8654O8380J83022A12434b02943d9525
11698B79907L7367j56649B4535K3930e4507G1507e7860A72065F8393J82808L7470
11687B88671A25988K16402a00328A11493B2177L29143i6433B0857c4675C2135
11676a14684A88357b25613A5776a31873a665j71873P6864B1267K07500I3667i8523
$$ y = [122895, -234185, -83005, -147505, -146244, 46721, -330608, -76964, -104446, -248655, -30371, -22561, 6917, 234191, 141222, -78451, 116039, -104799, -99241, 170869, 70948, 194637, -130020, 148483, -153584, -26636, -175285, -149310, 229090, -581, -41613, 141020, -109552, 414722, 390642, -2676, -190810, -25736, -226894, -66103, 50024, -30090, -187382, 91299, 82186, 171608, 57889, 107858, 292391, -157591, 48654, 117034, 300056, 112434, -202943, -49525, 279907, 317274, 160625, 24535, 48465, -54507, 71507, -57860, 172065, 68393, 251201, 288671, 125988, 342390, -100328, 111493, 22177, 351320, -96433, 20857, -34675, 32135, -114684, 188357, -225613, 15776, -131873, -1665, -173538, -96674, 21267, 228767, 93667, -98523]
11664B6803b9976a106C7472J8886a03564C25174F7591d6499m156D51212j54836
11653B96376c9090B06478J8669K5234A18008M6993D4017O3756k4864B902a95607
11641a00150k2164C5892d6487k08512C0303O350N43118k71132A26310b97380A6215
11629A36618j2145L6008K6316l8854k6553b22445e5585C0527K6606a51k54987
11618b55138A70759J3005b39941k76627F4468j5607K8089f6050f461l69245d4185
11606A46109d1472A67839M073o8778a0225B16633a0024A39015J77296j16009q4484
11595A15818M3618F642h9462H0690a17361A95229M5709p2889b6924A25195K59988
11584C85183q2286b36368L3803B75283H7945J7527O5033F766J52905m5872D0864
$$ y = [26803, -29976, -1106, 37472, 56358, -103564, 325174, 67591, -46499, -50655, 451212, 296376, -39090, 206478, 225147, 250381, 118008, 165001, 44017, 107773, 82909, 2902, -195607, -100150, -122314, 35892, -46487, -254999, 30303, 36653, 579771, 308639, 126310, -297380, 16215, 136618, 124473, 160481, 186797, 147943, 121390, -222445, -55585, 30527, 57133, -151, -255138, 170759, 183764, -239941, -516568, 64468, 48861, 76950, -66050, -6461, -375706, -44185, 146109, -41472, 167839, 171912, 103134, -10225, 216633, -10024, 139015, 316311, 200302, 115818, 159436, 6642, -89462, 80690, -117361, 195229, 240938, 168049, -26924, 125195, 385183, 302897, -236368, -202565, 275283, 87945, 105472, 170505, 6766, 159671, 113799, 40864]
11572I6380R8936d639F2817j6975P2711i9099E22185I8550b51459O7963A19401
11560E17471a18832A10852P417b0223F1678h0349A51726J46413a80213j25568
11550c05781i3394G5092L58943j94239q7353m5858a24723n0075G630J08529M69821
11539E85980a00601D0850N9194A8350i6408B06134H1278K61112j05712o5778D3739
11527a68078A82211N6940d3439r9496B15856A03790L9077J60557o8025b1059B75006
11515F0711J27158H1249K59462g5484A08228J67830J77521A41087h4632D02664
11504D65099a43147E2385L92969E8724K70568b5785B63052l1588a32366A41183
11493B96660g4651j20668d6772k9401B57006K20309k20128r3651b78144H3087
$$ y = [96380, 195316, -4639, 62817, 45842, 118553, -99099, 522185, 98550, -251459, -183496, 119401, 517471, -118832, 110852, 118269, -20223, 61678, -80349, 151726, 298139, -180213, -305781, -93394, 75092, 434035, 239796, 152443, 106585, -124723, -174798, 7630, 116159, 585980, -100601, 40850, 100044, 18350, -96408, 206134, 81278, 342390, 236678, 170900, 43739, -168078, 182211, 239151, -43439, -142935, 215856, 103790, 142867, 303424, 235399, -21059, 275006, 60711, 187869, 81249, 340711, -75484, 108228, 276058, 453579, 141087, -84632, 402664, 465099, -143147, 52385, 445354, 58724, 329292, -25785, 263052, 231464, -132366, 141183, 296660, -74651, -195319, -46772, -76173, 257006, 477315, 257187, 163536, -278144, 83087]
11482D42746A5295b59629f6997I7023M4032O4795I4830P7155g8321B81232o3409
11471B17823A9820R0368D7324K9157A4488K80831a04291d2497C42747j53023A058
11459a66041C2286J95928a30024c6736j31129B20675I2453J31124J7507o9474
11449A71610p5981K09022H4206KP0778I935R8355K82726D1675J86991P0614C1874
11436C00826o0318A775a20914J5661r0837A63970H0947J22171n6585g7904D5262
11424C14244A02216b44296A2921d4899A46809b09739e1708j14302r338A66894
11413f7593B91591a5862B08664a21813r6644C25670j17916b7394A03901m0784
11403F3117K37983A29224D0610N1529c7128B7114d199k13690A03952l1616J30151
$$ y = [442746, 15295, -259629, -66997, 97023, 141055, 205850, 94830, 171985, -78321, 281232, 217823, 19820, 110188, 47324, 76481, 14488, 295319, -104291, -42497, 342747, 189724, 1058, -166041, 32286, 228214, -130024, -36736, -167865, 220675, 92453, 223577, 241084, 171610, 95629, 304651, 84206, 84208, 154986, 9935, 108290, 391016, 41675, 228666, 299280, 31874, 300826, 240508, 1775, -120914, -105253, -196090, 163970, 80947, 203118, 146533, -77904, 45262, 314244, 102216, -244296, 12921, -44899, 146809, -209739, -51708, -166010, -175348, 166894, -67593, 291591, -15862, 208664, -121813, -218457, 325670, 207754, -27394, 103901, 63117, 301100, 129224, 40610, 92139, -37128, 27114, -4199, -217889, 103952, 72336, 202487]
11392B02487a14879D8898a24455e1827A21046h3485l1911p839B0207a43508I5443
11380H557L3755g5030A03446j3889i9639k7478A79688J06095A24532m2951l1173
11369E0408A95b79935G1621J07273b3025j0726C5415h5812B06751c0713B1732
11357B12493J80482a41685q8377c8758F2976b2334o2640G2048Q813b98151B13526
11345a97511D6300E776c64642Q9941c6545B11128j0796b77579c8252F7638L53543
11334D21181e5443J6116l58442A00030K65655c8858O493O019A32311C332O00932
11323F04264c36096A53425E3016J70185h5508b9204A21518a28743E4276a04759
11312a79398B7160g3693B81963f178k9509l73367N3093a12665B87496j32760l798
$$ y = [202487, -114879, 48898, -124455, -51827, 121046, -83485, -115396, -123235, 20207, -143508, 95443, 8557, 42312, -75030, 103446, 89557, -99639, -127117, 179688, 285783, 124532, 81581, 50408, 195, -279935, 71621, 178894, -23025, -33751, 35415, -85812, 206751, -30713, 21732, 212493, 392975, -141685, -230062, -38758, 62976, -22334, -84974, 72048, 80861, -298151, 213526, -197511, 46300, 5776, -364642, -274701, -36545, 211128, 200332, -277579, -38252, 67638, 421181, -55443, -39327, -397769, 100030, 365685, -38858, -32365, -26346, 132311, 3332, 604264, -336096, 153425, 53016, 223201, -85508, -29204, 121518, -128743, 54276, -104759, -179398, 27160, -73693, 281963, -6178, -35687, -409054, -355961, -112665, 287496, 154736, 150938]
11301A50938d8365C34203b72431C06238F8994h8464A29509c44587B63540g1458
11290i8079l2493M3516G2310h27k6281r5123A54822g5173k8610o1117N7245C12342
11277B52322j00614b7138I9353J52569b75701A97337D3364b0705j48930r2590
11267b62225A32108b40095A48287b441k45907Q8103L5184D78291A30054g4900
11256A72993b36168B16954P4401a68972c9453m14804A03082c12931a36092C8388
11245G0158d0264D4526J78805D9050A8639L24724o3688a76804B8346J94526a35184
11233E0231k1810L0052k0174a1094k02168j38816e8927k19310J3920c9436D2413
11221c97866a55085b3491k16767L6030g9365b890k44783A50271d3073j83501H1009
$$ y = [150938, -48365, 334203, -272431, 306238, 68994, -88464, 129509, -344587, 263540, -71458, -98079, -130572, -87056, 72310, -827, -27108, -122231, 154822, -75173, -103783, -164900, -107655, 312342, 252322, 151708, -27138, 99353, 251922, -275701, 197337, 43364, -20705, -169635, -262225, 132108, -240095, 148287, -2441, -248348, -160245, -125061, 478291, 130054, -74900, 172993, -236168, 216954, 291355, -168972, -39453, -454257, 103082, -312931, -136092, 38388, 70158, -40264, 44526, 223331, 49050, 18639, 343363, 279675, -176804, 28346, 222872, -135184, 50231, 28421, 58473, 38299, -11094, -213262, -352078, -58927, -278237, -264317, -39436, 42413, -397866, -155085, -23491, -240258, -204228, -79365, -2890, -247673, 150271, -43073, -226574, 81009]
11209e7757l95980J36405f7321n9488d094l4151j84560D8088g5950r9006L1803
11198a43153b2765k16526e161j65823A06329a88615o2788A58432K13525C778a68213
11186h8063j08044G359l506a26038b8898j22571f3021m22434J50133a44241A33991
11174a13646B27707k5580b68139e9462m734l3830A82782J82991A73675C3713g8733
11162a09317p2595A06155b33880h0621r0607I3189a60957C31402M5033h4113A8170
11150a62634j28388b1682k15013d6428J4277j42001H5114J86094c16065A07222
11139A40595b42645a0813C054b28721P7783c6260j0889B04791a6376m03694B09599
11127A64922j4104a28206B00729p4875R8556b5469j74931h3936B33028j04955
$$ y = [-57757, -453737, -317332, -67321, -126809, -4094, -38245, -222805, 48088, -75950, -174956, -143153, -22765, -239291, -5161, -170984, 106329, -188615, -251403, 158432, 371957, 3778, -168213, -88063, -196107, 7359, 3853, -126038, -28898, -151469, -63021, -485455, -335322, -144241, 133991, -113646, 227707, 202127, -268139, -59462, -64196, -98026, 182782, 365773, 173675, 33713, -78733, -109317, -181912, 106155, -233880, -80621, -171228, 93189, -160957, 331402, 376435, -84113, 18170, -162634, -291022, -21682, -236695, -46428, -32151, -174152, 85114, 271208, -316065, 107222, 140595, -242645, -10813, 3054, -228721, -150938, -36260, -47149, 204791, -16376, -420070, 209599, 164922, 150818, -128206, 200729, 125854, 224410, -25469, -200400, -83936, 233028, 128073]
11117A28073D1025K7176a5041j66323D16964m0631B0850J34124a24027A12571
11106A79504i0268e677k66908B24709n4519a55176H0100L59308j8767B08789q1360
11095A27429J98724J16627j28333H9071e0611A43546b2923C34520A08412L93261
11085E01673B12541N0679H8174R6359L252L242N7834H9736A2737L24718p3949
11074B63506K6817j3519b183G4830J99374q156K37792o3934J77935B63111M80245
11063G43356l15183O9102j05985A25066M72255j25863A41197M52886l5785B04633
11052A80433M6629J16358j32275K28680K31422k10514R7809K54349j07115k38940
11042D66836M8822B38414J00278J43416L84514l39351O7618O0814l1769k94858
$$ y = [128073, 41025, 68201, -15041, -181364, 416964, 376333, 20850, 154974, -124027, 112571, 179504, -90268, -5677, -272585, 224709, 170190, -155176, 80100, 439408, 420641, 208789, 127429, 326153, 442780, 314447, 89071, -50611, 143546, -22923, 334520, 108412, 501673, 212541, 263220, 88174, 184533, 187785, 191027, 248861, 89736, 12737, 337455, 263506, 290323, 276804, -2183, 74830, 274204, 266048, 503840, 439906, 617841, 263111, 743356, 428173, 497275, 391290, 125066, 597321, 471458, 141197, 594083, 558298, 204633, 180433, 227062, 343420, 211145, 439825, 671247, 460733, 558542, 812891, 705776, 466836, 515658, 238414, 338692, 482108, 866622, 527271, 594889, 655703, 623934, 329076]
11032C29076K73084j91841N7109O7491P6405l7438m905m2862J83827k98642L81051
11021G92355J22195j69849l69730J3461n2456M41178j57104k62285j09041K25671
11011D74395j61980L41416j90080l2520K12296K71544l97839J14186K928r5383
11001E38963L1274j37483J52908J86272q31M8615C08167L35902B07328P18464
10991I25792k99516q8577J96699J37903r0695j57303O88510k76993l19881J79868
10981H95807J42422P915M7948L24395j24828j57225J25115N89566J71251P25973
10971B748339j03381l08021J98817l90499j18732m6781j3884k29522j62440L16425
10961A890321o1153M2979K24590J14514j73712M225r2283n8623M1768k32625p5716
$$ y = [329076, 602160, 410319, 467428, 534919, 611324, 573886, 568981, 526119, 709946, 411304, 792355, 914550, 744701, 374971, 388432, 335976, 777154, 620050, 357765, 248724, 474395, 312415, 653831, 463751, 431231, 643527, 915071, 517232, 631418, 634346, 538963, 570237, 432754, 585662, 771934, 771103, 819718, 308167, 644069, 207328, 925792, 626276, 537699, 734398, 872301, 781606, 624303, 1312813, 1035820, 715939, 895807, 1038229, 1046144, 1094092, 1418487, 1293659, 1136434, 1261549, 1851115, 2022366, 2748339, 2644958, 2336937, 2535754, 2145255, 2026523, 1979742, 1965858, 1736336, 1573896, 1890321, 1829168, 1872147, 2096737, 2211251, 2037539, 2041764, 1949481, 1890858, 1932626, 1700001, 1624285]
10950A624285m87332k11997Q5138m50898J04579l31350r2202N5912R0738k8901
10940C57972J00017k03465p9310J06465R0496q5653l035A03599P4425d5823B9411
10928A06982h2006B2084c9154n9727A57169P9318r9942K81176j94310a73792H7606
10916A9407L41091j68295p3294a12481O737N034C22784a95267C1631a53359B1420
10904A65081a1090B5316K92272i4002j02089P6248A25834g4202B47712b78226
10893d39067C02529a52105A59458C0577q996i7647J0444C08672B9809J15288d3172
10881B8875b7619B09972d03862c6198G2934J0773f838j49784B26446a10283j58729
10870b69012f1590J4568j1186A7252J48625F9797k2315a72903h5680A0789h8085
$$ y = [1624285, 1136953, 924956, 1010094, 559196, 663775, 332425, 240223, 296135, 386873, 357972, 457989, 254524, 175214, 281679, 372175, 286522, 283487, 103599, 178024, -45823, 29411, 106982, -82006, 22084, -39154, -98881, 157169, 236487, 136545, 417721, 223411, -173792, 87606, 19407, 360498, 192203, 118909, -112481, -105744, -100710, 322784, -195267, 31631, -153359, 21420, 165081, -11090, 25316, 317588, -94002, -196091, -119843, 125834, -74202, 247712, -278226, -439067, 302529, -152105, 159458, 30577, 21581, -97647, -87203, 308672, 29809, 145097, -43172, 28875, -27619, 209972, -403862, -36198, 72934, 83707, -6838, -156622, 226446, -110283, -269012, -61590, -47022, -58208, 17252, 165877, 69797, 47482, -172903, -85680, 10789, -88085]
10858g9408A50671J03446d6143j17020j41A78108q0897a19134j28874E1836O1224
10847A13060k0091J17175b69079B8012f2327E216c88967G8259r75a87121A20577
10835A38402c37366a63292C8384a65034D3068i1417k75992O1813j38475c2349
10824B30446j0376E6312K00341j14842B5104f4454c900j13645E3004a13288j52189
10813b65477L7995B19119g5879A75408e8383A5526d15451a28665A08709e0187
10802a30819P230l02060H3345C5829K54948j8591e4070A62517l2737d57191a10523
10790a45098l0691G6855a86779a8198k95007r643E6526b53279J09278p7135A17480
10778C4360R7210b72313G8598A7345a8467B483a88478A04577J75240c5925B41020
$$ y = [-79408, 150671, 254117, -46143, -163163, -163304, 178108, 97211, -119134, -248008, 51836, 113060, 92969, 210144, -269079, 28012, -62327, 5216, -388967, 78259, 77284, -187121, 120577, 138402, -337366, -163292, 38384, -165034, 43068, -91417, -367409, -305596, -444071, -32349, 230446, 220070, 56312, 256653, 141811, 25104, -64454, -3900, -117545, 53004, -113288, -265477, -227482, 219119, -75879, 175408, -58383, 15526, -415451, -128665, 108709, -50187, -130819, -123589, -425649, 83345, 35829, 290777, 272186, -54070, 162517, 129780, -457191, -110523, -145098, -175789, 76855, -186779, -18198, -313205, -322848, 56526, -253279, -144001, -221136, 117480, 34360, 131570, -272313, 78598, 17345, -18467, 2483, -188478, 104577, 279817, -35925, 241020]
10766a1556E1601a62985N0148L6521A70161H377K74399b28714G5960g6770A12276
10754A32796D8552d2038m0773J8218C034b45967g6372A07600m6493k4581J0958
10743D7484c52775F4833J65204g2205L1597B39085A12815a4200k2207k58447J00612
10732a94242g8997G0333g3502m248I7201J99338c8766j5347A3517J04954K39670
10721C58141c29B53940F6459c951p7489F5128c80202B47697r6255b00642R9138
10710a01504j04753R3179d0552G264L30385a30116B532J20298b07717j38613A26007
10698A5408a43405N0510p423j0864j96723B80460j21832C125J52683P0420i2760
10686f4300k33811i5787c8397k48993H4752a24872q3300f9701B46233n2973c454
$$ y = [-11556, 51601, -162985, -112837, -76316, 170161, 8377, 282776, -228714, 75960, -76770, 112276, 132796, 48552, -42038, -82811, -64593, 3034, -245967, -76372, 107600, 61107, 36526, 47484, -352775, 64833, 230037, -72205, -40608, 239085, 112815, -14200, -36407, -294854, -194242, -78997, 70333, -73502, -77750, 97201, 296539, -38766, -54113, 13517, 118471, 358141, -329, 253940, 66459, -3951, -81440, 65128, -380202, 247697, 151442, -200642, -101504, -206257, -113078, -40552, 7264, 337649, -130116, 2532, 122830, -207717, -346330, 126007, 15408, -143405, -92895, -100318, -111182, -307905, 280460, 158628, 3125, 155808, 226228, -92760, -64300, -298111, -95787, -38397, -287390, 84752, -124872, -208172, -69701, 246233, 193260, -3454]
10674F0284L63811I6681d05382B79168h0371A29377c26925N185m7189a23290C2694
10662b8318k7158B34574H9421J4549A8070b6505n6421o3856A43637a25533G5011
10650b08001h0035A78014o6518A6127a12865M0007l09921Q3810A15246e7687A24838
10638b54163f2080l9746M6303C275h8551l216k92756a5279k29744p4409B04232
10626a19846A20646O261i6704H3829d4891j05116r4330A25010c19994e9414k23128
10615b82542C8999a49760C8095a0232m38621F7704a38803B53988e44644e1005
10604A48395b21466B61892a56330F0605j9444c9359r4719n2018a7438j76180G7740
10592d6907j95959C2078L3675L56799b72362h7685A75986a94656f3732j77955
$$ y = [60284, 424095, 96681, -405382, 279168, -80371, 129377, -326925, -321740, -368929, -123290, 32694, -28318, -55476, 234574, 89421, 103970, 18070, -26505, -82926, -146782, 143637, -125533, 75011, -208001, -80035, 178014, 111496, 16127, -112865, -72858, -382779, -298969, 115246, -57687, 124838, -254163, -62080, -101826, -55523, 3275, -88551, -91767, -384523, -15279, -245023, -319432, 204232, -119846, 120646, 126907, -96704, 83829, -44891, -150007, -244337, 125010, -319994, -59414, -282542, 38999, -149760, 38095, -10232, -448853, 67704, -138803, 253988, -544644, -51005, 148395, -221466, 261892, -156330, 60605, 41161, -39359, -134078, -186096, -17438, -193618, 77740, -46907, -242866, 32078, 65753, 422552, -272362, -87685, 175986, -194656, -63732, -241687]
10582b41687a12386C03523h954j07935A47537D9069h760k90703a16887l47994
10572d64881b107j06599j05727O1732l79F8562E908N2654e2997j32715j50509
10561c36221k10064I9054b08931C8698J97040C3536a57918k10010A70815J55226
10551C26041m078l217A11128E2312K23782a75229I3565M9889o4941l2370a00279
10539D207a14340q1937C1766f2356k66481L9721B22639f4588g006F6706a36511
10527e4497k42631A49771C1621J38956c42583f1369g688o191A38158i6991a9215
10515c1515A09998K7667a96813r167A18880I173b75440g525k42929q7706A28229
10503e7158F3955a87144h4855A41282e5814j0604q5414A03786a60087j4788Q4062
$$ y = [-241687, -112386, 303523, -8954, -116889, 147537, 49069, -8760, -299463, -116887, -464881, -2107, -108706, -214433, -152701, -153080, 68562, 5908, 58562, -52997, -185712, -336221, -546285, 99054, -208931, 38698, 235738, 33536, -157918, -367928, 170815, 326041, 321963, 318746, 111128, 52312, 276094, -175229, 93565, 143454, 78513, 46143, -100279, 4207, -114340, -196277, 31766, -62356, -328837, -289116, 222639, -64588, -7006, 66706, -136511, -54497, -297128, 149771, 31621, 170577, -342583, -61369, -7688, -13879, 138158, -96991, -19215, -31515, 109998, 137665, -196813, -205980, 118880, 9173, -275440, -7525, -250454, -338160, 128229, -57158, 63955, -187144, -84855, 141282, -55814, -66418, -151832, 103786, -160087, -174875, -90813]
10492i0813E3550Q0508R7759N1209I2011A9926f554B74152a24583D5032K08811
10481B53843K27122M84024C09291K02113o7421j26008J22482A56548K45495G3834
10470A69989c07813H0762J16246o6167C2520i3577B22002l4923A5123R3736g1533
10458a11377A4126a29528B9529f0227E8973g0861e781A76924N8440h8745B21270
10446F296f7073a4508n3085j75044Q9419e171F547J12674J15820C5611a65980
10434a51084K671j13898I5566a69750C23673a15420h913A67980p8739k8248J24418
10423A85411D1174j3707h8324m5448L1870P676j8929A61624p039F6649d48614
10411b63708I6020J50242b65590D07627a57331e5351j1175b7722j26648B03858
$$ y = [-90813, 53550, 134058, 231817, 283026, 92011, 19926, -6554, 274152, -124583, 45032, 253843, 480965, 964989, 309291, 511404, 443983, 317975, 440457, 156548, 402043, 73834, 169989, -307813, 80762, 197008, 130841, 32520, -93577, 222002, 187079, 15123, 108859, -71533, -111377, 14126, -129528, 29529, -60227, 58973, -70861, -5781, 176924, 235364, -88745, 221270, 6296, -67073, -14508, -67593, -242637, -153218, -5171, 6547, 119221, 235041, 35611, -165980, -151084, -148413, -262311, 95566, -169750, 323673, -115420, -8913, 167980, 89241, 60993, 185411, 41174, 27467, -88324, -133772, -101902, -94226, -113155, 161624, 154585, 66649, -448614, -263708, 96020, 246262, -265590, 407627, -157331, -55351, -66526, -27722, -154370, 203858]
10400B29539H1820a74848j5241n1363M7531d8045A02865e8760A0201M4086M3443
10389I7730a07002J5239j01854O256f8115r1276g8075B00052b20753C47158a3824
10377A84843p2869Q7394l9081J24902a32819q2254C99608o1757A67740K74580
10367D42320A34850J40542N0778M0763m687M7696B4575M34106A83188D6851J55587
10356B02438F6970Q3893O9648I3078J0633K18353m5113J88452J77370p7365A52982
10344C01566j1196R1695j26286q1176J00838A12066K02874j56570p5646K92591
10334C75315j47091o4518F416J00600l6824J95094e6218b2462k9765D6367R9623
10323A45990A4978J11814O5695A6430e6737m4060B29991e8695q3676M6648B22533
$$ y = [229539, 81820, -174848, -190089, -241452, -193921, -48045, 102865, -58760, 10201, 54287, 97730, -107002, -91763, -193617, -187361, -68115, -159391, -78075, 200052, -220753, 347158, -13824, 184843, 111974, 199368, 160287, 285189, -132819, -215073, 399608, 337851, 167740, 442320, 134850, 275392, 326170, 366933, 362246, 409942, 24575, 458681, 183188, 46851, 202438, 66970, 150863, 220511, 93078, 103711, 322064, 276951, 465403, 642773, 565408, 152982, 301566, 290370, 382065, 255779, 174603, 275441, 112066, 314940, 158370, 82724, 375315, 228224, 163706, 6416, 107016, 70192, 265286, -56218, -22462, -52227, 46367, 145990, 14978, 126792, 192487, 16430, -56737, -100797, 229991, -58695, -142371, -95723, 222533]
10311i8453j36654E0456J17003a41241d9618A80526J37046b8861q2126D7334O0872
10300A08206f8661p6737c7595C00630a45485D5829D072a61747O0649B0278O5581
10289H5859c36092J54115K0431f937l40590g5423k8803A14672a0700k1352k0527
10278e2579j62441A93446G5273K18706a6554k02707d0843B69397A05639c67722
10267a83397a8639A17209f11676I5635a63819G7367d9383A81628K19858A88097
10256B09603O9568j16386N0621c6407r4646A55356b7018A73783p5862J86265C8486
10244g484A93518b15567L4807A53061J9608q3302j220l0466a46120H4716l1096
10233E3620K34653b9677r5043A93804J56860F2193e9455k11103G1274l4393a14617
$$ y = [-98453, -235107, 50456, 167459, -141241, -49618, 180526, 317572, -28861, -110987, 47334, 108206, -68661, -145398, -37595, 300630, -145485, 45829, 4072, -161747, -101098, 20278, 85859, -336092, -181977, -161546, -6937, -347527, -75423, -104226, 114672, -10700, -32052, -52579, -215020, 193446, 75273, 293979, -16554, -219261, -40843, 269397, 105639, -367722, -183397, -18639, 117209, -611676, 95635, -163819, 77367, -49383, 181628, 401486, 188097, 209603, 279171, 162785, 213406, -36407, -131053, 155356, -27018, 173783, 97921, 284186, 38486, -7484, 193518, -215567, -180760, 153061, 172669, 89367, 88147, 57681, -146120, 84716, 53620, 288273, -29677, -124720, 193804, 350664, 62193, -59455, -270558, 71274, 36881, -114617]
10221b51707M1336A75281b3871r0133A11703B2024c12804O5764e0821o7434A98663
10209c7684B28064a4331C43000b75175f6007A03099a83475b8989p6660j6813H61
10197A05472L9337j7953J36480q4644h3985G7166i9037j0533A11599a45775j18368
10186b64143A6729d062j22176a1828j07953l2646j8747M8836A6221a73812B22463
10174b25920R5251j95633a11420p7889B28268d803o766n5643K4849o4544r5786
10163b02693F6890c3228j04737c1646k58005n5759N5653a8589q8519F780a40372
10151C76915a04442k2979A84a34083K5848l14095a40139G380d1098l89825F2105
10139a80311p2079a16093E7956O5331j0452l1519c29693R7717A55407A3232a196
$$ y = [-251707, -210371, 175281, -23871, -114004, 111703, 22024, -312804, -247040, -50821, -118255, 198663, -37684, 228064, -14331, 343000, -275175, -66007, 103099, -183475, -28989, -105649, -122462, 861, 105472, 144809, 126856, 263336, 178692, -83985, 77166, -99037, -109570, 111599, -145775, -264143, 16729, -4062, -126238, -11828, -119781, -152427, -171174, -122338, 16221, -173812, 222463, -225920, -130669, -326302, -111420, -189309, 228268, -4803, -11569, -67212, -42363, -106907, -202693, 66890, -33228, -137965, -31646, -289651, -345410, -289757, -18589, -107108, 6780, -140372, 376915, -104442, -127421, 184, -134083, -108235, -422330, -140139, 7380, -41098, -430923, 62105, -180311, -252390, -116093, 57956, 123287, 112835, 81316, -329693, -231976, 155407, 13232, -1196]
10127a26606A78162b4421e544n5435C51467h4752K8272E7742b06883j1151D2797
10115b6627k12968H2004k2639e5033H9916a04800M2532A07154d0176j58426k60149
10104d58751c5243J6787I0856b03570j57703g3802k7141m1737e4367l66339A87338
10092B78964j26494i9094n5069a1466k04782B3038a40195L541q9881a6545m1065
10081e7610A743a93188g8295b0619g463A67081m9243g1446B24417C9227R9384
10070A38611b63027C2441a95351j33381a06691J3592a5483O01p0539E4779c90476
10058b75219A2124J67440d6103k86727K8234D2440L84773a11980L259b3575A37173
10046C1284i2564I764a24430F9529b52138a0499o2057k99176A35145a1058j13035
$$ y = [-126606, 178162, -24421, -5544, -60979, 351467, -84752, -56480, 57742, -206883, -218034, 42797, -26627, -239595, 82004, 59365, -55033, 89916, -104800, -62268, 107154, -40176, -198602, -458751, -35243, -18456, 90856, -203570, -361273, -73802, -100943, -142680, -54367, -420706, 187338, 278964, 152470, -99094, -154163, -11466, -216248, 23038, -140195, -136654, -226535, -16545, -57610, 1743, -193188, -78295, -20619, -7463, 167081, 117838, -71446, 224417, 39227, 138611, -263027, 32441, -195351, -328732, -106691, -93099, -15483, -14882, -85421, 54779, -390476, -275219, 12124, 179564, -46103, -332830, -304596, 42440, 427213, -111980, -108721, -23575, 137173, 31284, -92564, 9764, -124430, 69529, -252138, -10499, -72556, -371732, 135145, -11058, -124093]
10035a24093D3248J98356c45003A57925L52599B26692g9530j90498a07325D3751
10024b92167R9339Q815m296h3905H4695I871M8256a00110j5344j26652e4061H2849
10011b81838N4031R4327L6216A86642d24830J81063e0036n30344d5885A17862
10000C4567a93469A86873c9897l7004H096L49502A0339a06199D3711g6981l0628
9989a07609L6755G2202d30184B91076r0625a10189N3773J0158j78764i2496c1603
9977a36603B15605C2412K39436a91245j49182J43724A10812J26004A7298h3649
9966D1336a41843j7019e6503B6614a30538m2748H3175A3076J26593b58174F1092
9954F6871a29933A9388a81106A2891a23757j14996M0740A22808c4986j45681F2797
$$ y = [-124093, 43248, 241604, -345003, 157925, 510524, 226692, -79530, -270028, -107325, 43751, -292167, -192828, -184013, -188309, -83905, 84695, 9871, 58127, -100110, -115454, -242106, -54061, 82849, -281838, -227807, -133480, -97264, 186642, -424830, -243767, -50036, -580380, -45885, 117862, 34567, -193469, 186873, -39897, -76901, 8096, 357598, 10339, -106199, 43711, -76981, -107609, -70854, 72202, -430184, 291076, 200451, -110189, -56416, -46258, -225022, -92496, -31603, -136603, 215605, 32412, 271848, -191245, -340427, -196703, 110812, 236816, 17298, -83649, 41336, -141843, -158862, -56503, 26614, -130538, -173286, 83175, 13076, 139669, -258174, 61092, 66871, -129933, 19388, -181106, 12891, -123757, -238753, -198013, 122808, -34986, -180667, 62797]
9942F7464a63106N0733c0776k0031J3962j52876M1489B1007J4121d09443G1375
9930c67827K951A07021b90762J33139k114p951l8124A11343b38014P9944J6749
9919a41321F4667Q3295c15019H5349k2575l983R6369d25875F4140d4172j01248
9908a45420d7739A57279a82515N5221j3817n3249g4144d442D9766g3903A47028
9896a39094C18726e3770j78502g3701C2487g6375P766b2018k0584A93246b93233
9884E8936c10994F2111Q0215a90663Q4837B05061L6550d28102J2045a45702A12660
9872A76065i3003A49005c71271a57591N2700j43650A44682a11867B13988f6318
9861b34575C6837h7222B82581d4146F9508i483j40092O3784C80435a18895A5245
$$ y = [67464, -163106, -112373, -30776, -50807, -36845, -189721, -148232, 21007, 35128, -409443, 71375, -367827, -364876, 107021, -290762, -157623, -159737, -167688, -205812, 111343, -238014, -158070, -141321, 64667, 147962, -315019, 85349, 62774, 58791, 155160, -425875, 64140, -44172, -145420, -47739, 157279, -182515, -127294, -141111, -194360, -74144, -4442, 49766, -73903, 147028, -139094, 318726, -53770, -232272, -73701, 32487, -76375, -68609, -22018, -42602, 193246, -293233, 58936, -310994, 62111, 142326, -190663, -105826, 205061, 241611, -428102, -416057, -145702, 112660, 176065, -93003, 149005, -371271, -157591, -104891, -248541, 144682, -111867, 213988, -66318, -234575, 36837, -87222, 282581, -44146, 69508, -9483, -149575, -85791, 380435, -118895, 15245]
9849B95419b56976I971a8901p8739M4847A53686a41254M0617k29302M7264i4829
9837B2918a58751A03558c69719a33418G786K3068J53203p7333b40501r5290I0569
9825b47056a17079q8084I976a31744a1704j72023I555a43369D4308a03997B34049
9813A20884k02a00304A22881C6640R3651a59256A61951J06134b04403a6151j19394
9802a35545B47110a75075a0871j29791b1369o3047J6474I7985a06395C3168e282
9790h0595k10640c1787j05207B36662j00499b29100A44840N5643i5717d63l20375
9779c20838J2077j84474A89435F3334a3981o809E2373i9203K2292A1344K98215
9768C09559c71123F3755J26550D1959b50512P388D1014i6798b4934G4198J02629
$$ y = [295419, -256976, 9971, -18901, -97640, -52793, 153686, -141254, -100637, -329939, -282675, -94829, 22918, -158751, 103558, -369719, -133418, 7786, 30854, 184057, 106724, -240501, -335791, 90569, -247056, -117079, -205163, 9976, -131744, -11704, -183727, 9555, -143369, 44308, -103997, 234049, 120884, 120682, -100304, 122881, 36640, 130291, -159256, 161951, 268085, -204403, -16151, -135545, 247110, -175075, -10871, -140662, -21369, -84416, -67942, 97985, -106395, 33168, -5282, -80595, -291235, -31787, -136994, 236662, 136163, -229100, 144840, 200483, -95717, -463, -320838, -308761, -493235, 189435, 63334, -13981, -20790, 52373, -99203, -76911, 11344, 309559, -371123, 63755, 190305, 41959, -250512, -243124, 41014, -96798, -24934, 74198, 176827]
9757A76827H3374o937a46870k16942G2036K3043e9292b2791k21723e7823l6263
9746i4086p4781k4155j40705b1584A71354d93426C85979A50642d40963g1539k1087
9735i2626B64642a20259k01942H9425K2973A4074a0020l6367l7437L0121A05760
9723A58298a24449B38649a04655A58995b31290i750B45885i4250A65769a0950
9712C41506a17428B446M1255a82095f7111j46370D7872f6207k92632e7221P541
9701d9680o0915j92186a14359l03965A4567i0528r9908e791k78057g6080k90590
9690c66670f7131j40210j48918c2576j12312e179B09295c34790A26907A8225g8898
9678e47494c1080j54644k01827I3708Q0138a42371K5757A529b15661D6548c02435
$$ y = [176827, 83374, 76437, -146870, -363812, 72036, 95079, -59292, -22791, -244514, -57823, -94086, -168867, -193022, -333727, -21584, 171354, -493426, 385979, 150642, -440963, -71539, -92626, 264642, -120259, -322201, 89425, 112398, 14074, -10020, -46387, -83824, -53703, 105760, 158298, -124449, 238649, -104655, 158995, -231290, -9750, 245885, -94250, 165769, -10950, 341506, -117428, 2446, 43701, -182095, -67111, -213481, 47872, -66207, -358839, -57221, -49680, -110595, -302781, -114359, -418324, 14567, -90528, -190436, -5791, -283848, -76080, -366670, -67131, -207341, -356259, -32576, -144888, -5179, 209295, -334790, 126907, 18225, -78898, -547494, -31080, -185724, -387551, 93708, 173846, -142371, -116614, 1529, -215661, 46548, -302435]
9666a25604j12422j37790i7592A38266i0437K1635k00453L1237g3220a0860E1427
9654B33411a09079B70676d6595b2995A10957g2652j32947D7640d10011A54511
9643b74974A2117i3854C4981P4129d22037a65921j16569F7075K8878c2683k04813
9632b37496i7145A62611c14482c8554E8513e9760n2614q2449E360b20670k9622
9621b50292d1463A21942a0723A5143J07970E0430h8337n5207j47336a14229J6761
9610i7468q2107P1413k3584l4142G513b83422e1594b1407l750j62997e8609B2112
9597i3627c6805D3357d1898j16058A03454c9854k41843N5340R5588A60203L0585
9586A90788N3717e7886C7636f4592A43318D7931a64204G4877p239a9750k22460
$$ y = [-125604, -238026, -375816, -97592, 138266, -90437, -68802, -269255, -238018, -73220, -10860, 51427, 233411, -109079, 270676, -46595, -22995, 110957, -72652, -205599, 47640, -410011, 154511, -274974, 12117, -93854, 34981, 109110, -422037, -165921, -282490, 67075, 95953, -32683, -237496, -97145, 162611, -314482, -38554, 58513, -59760, -112374, -194823, 5360, -220670, -250292, -41463, 121942, -10723, 15143, 123113, 50430, -88337, -143544, -290880, -114229, -97468, -179575, -108162, -131746, -165888, 7513, -283422, -51594, -21407, -25157, -188154, -58609, 22112, -93627, -36805, 43357, -41898, -157956, 103454, -39854, -281697, -226357, -130769, 160203, 190788, 244505, -57886, 37636, -64592, 143318, 47931, -164204, 74877, 67638, -19750, -242210]
9575b42210l9904a37264k4610d3524G0480K7726b13782n2282a32234J8761l9230
9564a52703N1545k54666h174j43503f335q6154r400A07703b6383j28124F9163
9552b51142A84388m0647A6916K55368c51620c0164A4955a25494d7294D21430A35578
9540a53905e2875B31519b20676C3180a19876A6315K40236H4598J62553a95261
9529F7246a00374B6033c1562j36010I5203a02989C5816r778E533g3345c5901l13649
9517c49550A9370R9221E2836h5318D2638a53351I2156J52444b50522k91313a90053
9505d04856C49724a04086j08526F4472a91220p399M083d7350k11251B05800f8343
9493B56986A7289a73340g2805l73292A47728o2527a07767m8953B26761r6456C9405
$$ y = [-242210, -282114, -137264, -161874, -43524, 70480, 98206, -213782, -266064, -132234, -113473, -152703, -101158, -355824, -8174, -151677, -6335, -92489, -101889, 107703, -26383, -154507, 69163, -251142, 184388, 143741, 16916, 272284, -351620, -30164, 14955, -125494, -47294, 421430, 135578, -153905, -52875, 231519, -220676, 33180, -119876, 16315, 256551, 84598, 247151, -195261, 67246, -100374, 26033, -31562, -167572, 95203, -102989, 35816, 26038, 5533, -73345, -35901, -349550, 19370, 118591, 52836, -85318, 42638, -153351, 92156, 244600, -250522, -541835, -190053, -404856, 349724, -104086, -212612, 64472, -191220, -198619, -194536, -47350, -258601, 205800, -68343, 256986, 17289, -173340, -72805, -446097, 147728, 85201, -107767, -156720, 226761, 130305, 39405]
9481e281k24569b3069A25862h9995A19035a94902o5794c673j17781b6448C5902
9469F257a8527j27593b7981l15374B2637b82787A16480c13129J41205N7528j10586
9458b24982A09800b183k59347j8478C26430a5651A6272L968c02883E7478g5340
9446c1113j3544m3175D13280f5561A70596a30471l0311A25546b46739K744C6067
9434b4115j73436j1801g6740B76128a14510d7608k62416R5640Q5928A5571L19025
9423C34596a7742j74161G2844a04118F6126b12786A6960d61937A41596J37619
9413B79215b85645h824j1392p8123r5036B2407K600a49045A82829c37627Q8457
9402b49170r3128a03609k05953D4776c16064b2762C01113c8143p6490G5107J45863
$$ y = [-5281, -229850, -23069, 125862, -89995, 119035, -194902, -260696, -3673, -121454, -26448, 35902, 6257, -18527, -146120, -27981, -343355, 22637, -282787, 116480, -313129, -171924, -114396, -224982, 109800, -2183, -261530, -280008, 326430, -15651, 16272, 20240, -302883, 57478, -75340, -31113, -44657, -87832, 413280, -65561, 170596, -130471, -160782, 125546, -246739, -243995, 36067, -24115, -197551, -209352, -76740, 276128, -114510, -47608, -310024, -214384, -128456, 15571, 334596, -17742, -191903, 72844, -104118, 66126, -212786, 16960, -461937, 141596, 279215, -285645, -8824, -20216, -98339, -193375, 22407, 25007, -149045, 182829, -337627, -249170, -342298, -103609, -309562, 44776, -316064, -22762, 301113, -38143, -114633, 75107, 220970]
9391B20970b30358d7490B702b37409N6384A58160a75857B3530a47910N8435A98629
9379a64470B03309d7183A27570a34488j174j6772P2869A37115d8730l97442K17839
9368b28333A32845a38006M2761d3713A88360i8056j03620A56149f0875D7882K08378
9357B56260h4174C4969b557H256J410J50794a83695e6816q15A73067f1615p1031
9345a32646c8077j14901j42609J7238a13707M3888n8394B301a33799A54623a61115
9333C63768o6566q4834p8800g5215p3233j44260a05666k31557I97J18542b84217
9321B07969B5623b3351q8750n5832j18955J27391I2826b77494a19750l4483M4573
9310a09660j32353A47287b66872A86024d9194j82630q6966O0050E8Q966L7363
$$ y = [220970, -230358, -47490, 2702, -237409, -181025, 158160, -175857, 23530, -147910, -89475, 198629, -164470, 203309, -47183, 127570, -134488, -135662, -152434, -79565, 137115, -48730, -446172, -228333, 132845, -138006, -95245, -43713, 188360, -98056, -201676, 156149, -60875, 47882, 256260, -84174, 34969, -2557, 8256, 9666, 160460, -183695, -56816, -57631, 173067, -61615, -132646, -38077, -152978, -295587, -278349, -113707, -69819, -128213, 2301, -133799, 154623, -161115, 363768, 297202, 212368, 133568, -75215, -148448, -292708, -105666, -337223, 997, 119539, -284217, 207969, 25623, -23351, -112101, -167933, -286888, -159497, 92826, -277494, -119750, -154233, -109660, -242013, 147287, -266872, 186024, -49194, -231824, -318790, -258740, 58, 9024, 46387]
9299D6387J82778b48039c423G5559J74801a82671g9295A34244A2417J03326d1801
9287b76946K8822L6405j81777d2981k18949h1066A07546a99577B27038h2857k44321
9276c27178A13768a54263A21349b20545D9982b47186B91767A8141a52079j4652
9266a66731R945K2340c5890B11952h1820k41121a57356d1239H5197R2233J21137
9255B98567A20959d4642A46378h0971H3456M1866a75093B05630c35121a7043B8812
9243c0088A5564d5347k35324i8461n6467D19625a34572n1675e0993n9140j12429
9232b22562G1091f8096F6899h2426E7623e67279J81229D7725N6908c33707D6680
9220c35068e9210J7724A33071C1084N8230a06229C98443b63473j7721f621A81828
$$ y = [46387, 229165, -248039, -3423, 75559, 250360, -182671, -79295, 134244, 12417, 115743, -41801, -276946, -248124, -211719, -393496, -42981, -261930, -81066, 107546, -199577, 227038, -82857, -327178, 113768, -154263, 121349, -220545, 49982, -247186, 291767, 18141, -152079, -166731, -156786, -134446, -35890, 211952, -81820, -322941, -157356, -41239, 85197, 177430, 298567, 120959, -44642, 146378, -80971, 83456, 125322, -175093, 205630, -335121, -17043, 28812, -30088, 15564, -45347, -280671, -98461, -154928, 419625, -134572, -186247, -50993, -110133, -222562, 71091, -68096, 66899, -82426, 57623, -567279, -386050, 47725, 104633, -333707, 46680, -335068, -59210, -41486, 133071, 31084, 89314, -106229, 398443, -263473, -281194, -6621, 181828]
9208B7731d17047M3017a26288p0530L7568c5879o9716o5189h1552k82570a49744
9196e1461k0049J0341C23968b63171M0520j471Q6363B6583N18458E3897a69303
9184a32804p2490B32627q7155b8174l36854J55445c0079n5977n6944M8471E635
9172b76460D25139G3400a06543A20929K31927d20788A02090C4659J64395L4735
9162B33789a78385D2305b26935J13406C83131A38046C282Q4466J05138N0893d23811
9150C252P0569l6080K00678c9198k84707J54879E1796Q7910P5239a40637n5138
9139a95775h7085B53813b27377F9695a82543d5743n26426b12192a05696E8123
9128b91724j43959F7248M1033i3565P3G4516J77849b28373a12188m4024p4853
$$ y = [27731, -417047, -374030, -126288, -196818, -159250, -35879, -105595, -170784, -81552, -364122, -149744, -51461, -71510, -61169, 323968, -263171, -222651, -224122, -137759, 26583, 545041, 53897, -169303, -132804, -205294, 232627, 145472, -28174, -365028, -209583, -30079, -86056, -143000, -94529, 5635, -276460, 425139, 73400, -106543, 120929, 352856, -420788, 102090, 34659, 199054, 233789, -178385, 42305, -226935, -113529, 383131, 138046, 3282, 87748, 192886, 243779, -423811, 3252, 73821, 37741, 238419, -39198, -323905, -169026, 51796, 139706, 214945, -140637, -195775, -87085, 253813, -227377, 69695, -182543, -45743, -572169, -212192, -105696, 58123, -291724, -435683, 67248, 108281, -93565, -93492, 74516, 252365, -228373, -112188, -156212, -231065]
9117b31065j03434B1711K14779f0160A16165b59627E6077f4978D48695I991M6069
9106E6060a33530J7298j270B17641b07244c8848J2887j3060k77761o8184J02679
9095b82287B1206e0046H3234c2773F88c58259C6699g5771l2934k7852k13839h1838
9082i8363m6419J125M592A33778b54510F1305a9686r9164p1052m6277O7791P5155
9070i3233H5842b0453E9096K7200a72213O3512A11832a84793l9009B36719c29254
9058a09676A65588b99125a45280k18704A06806j1441B9894b96270B43071a52302
9047g6841m6325A12015a75183A31875d00764a97287b6987m09491B2342b03455
9036f6561B00934f0732B05715q3139b99185A64416J21535a69396f7449C25983
$$ y = [-231065, -334499, 21711, 236490, -60160, 116165, -259627, 56077, -64978, 448695, 9991, 56060, -133530, -116232, -117502, 217641, -207244, -38848, -25961, -39021, -316782, -384966, -282287, 21206, -50046, 83234, -32773, 688, -358259, 36699, -75771, -108705, -136557, -350396, -81838, -98363, -144782, -143657, -139065, 133778, -254510, 61305, -19686, -118850, -189902, -236179, -168388, -93233, 85842, -20453, 59096, 86296, -172213, -108701, 111832, -184793, -223802, 236719, -329254, -109676, 165588, -299125, -145280, -363984, 106806, 95365, 29894, -296270, 243071, -152302, -76841, -123166, 112015, -175183, 131875, -400764, -197287, -26987, -436478, 22342, -203455, -66561, 200934, -60732, 205715, 122576, -299185, 164416, 285951, -169396, -67449, 325983]
9025b02700J7767Q5011j8160C7214a10616j17804E0145J50628H688M02491c86143
9013e3972R078B39163A00776c28410A69781h9839l8574l1627k99241F1210J53777
9002B14987n0192f0886J7211A60204a65433q9354g9719J8214A7121P8502b49779
8990c15198A03767d35062K17327R5773K7767k81419a84494A93823e06732A7797
8979c20911A79483d12175B29935b64123B20093b2192j12760B16726e8985P891
8969e1094F9373a54987C35194a81962K5069K437b495A31838c6191A20232j3868
8958A06364A1623i6703b495m7474G0062b25256j86464m919a30734k89491A30001
8946a06691a8913r9469n5432A4495D44N8793K13366g13396b8355a1381m7629C36053
$$ y = [-202700, -184933, -99922, -118082, 37214, -110616, -228420, 50145, 200773, 8688, 411179, -386143, -53972, -44894, 239163, 100776, -328410, 169781, -89839, -128413, -160040, -459281, 61210, 214987, 164795, -60886, -43675, 160204, -165433, -254787, -79719, -61505, 17121, 95623, -249779, -315198, 103767, -435062, -217735, -121962, -94195, -375614, -184494, 193823, -506732, 17797, -320911, 179483, -412175, 229935, -264123, 220093, -22192, -134952, 216726, -58985, -51094, 69373, -154987, 335194, -181962, -156893, -154456, -2495, 131838, -36191, 120232, 106364, 11623, -96703, -2495, -49969, 70062, -225256, -411720, -416639, -130734, -420225, 130001, -106691, -18913, -118382, -173814, 14495, 444, 59237, 272603, -713396, -28355, -11381, -59010, 336053]
8933C2739a90123M6198a2379o8872k1788d0875B10406a12680C42399j5911J113737
8922A440225M433467L656755C735439A030795l86254k57646j35878f3456r4816
8913a58272B96040a38546J7332H4137C3149g40A39060J31882b12638A7042a93572
8901E6150j5734j705K07116e4705l00162A90866F0817B1175a39221R065N9748
8890g0408E8530b1298A80767j6131l8368b54005A5286b54611B8212L0802a0750
$$ y = [32739, -190123, -143925, -12379, -81251, -103039, -40875, 210406, -112680, 342399, 326488, 1440225, 5873692, 9530447, 3735439, 1030795, 644541, 386895, 251017, -63456, -158272, 296040, -138546, -121214, 84137, 33149, -740, 139060, 270942, -212638, 17042, -193572, 56150, 40416, 38711, 245827, -54705, -354867, 190866, 60817, 21175, -139221, -130156, -70408, 58530, -21298, 180767, 164636, 126268, -254005, 15286, -254611, 28212, 59014, -10750]
$$ [...]
##END NTUPLES=NMR SPECTRUM
##END=
