##TITLE=AC1631_CENAH_8450655_8NDsmMBa8p
##JCAMPDX= 6.0         $$ Bruker NMR JCAMP-DX V2.0
##DATA TYPE= NMR SPECTRUM
##DATA CLASS= NTUPLES
##ORIGIN= BRUKER
##OWNER= Administrator
$$ 1.72 TOPSPIN		Version 2.1
$$ 2014-02-18 16:57:27.862 -0800  Administrator@X
$$ Compression mode = diff/dup
##.OBSERVE FREQUENCY= 400.02188249412
##.OBSERVE NUCLEUS= ^1H
##.ACQUISITION MODE= SIMULTANEOUS (DQD)
##.ACQUISITION SCHEME= undefined
##.AVERAGES= 8
##.DIGITISER RES= 22
##SPECTROMETER/DATA SYSTEM= spect
##.PULSE SEQUENCE= zg30
##.SOLVENT NAME= COFFEE_meoh
##.SHIFT REFERENCE= INTERNAL, COFFEE_meoh, 1, 14.98509
##AUDIT TRAIL= $$ (NUMBER, WHEN, WHO, WHERE, PROCESS, VERSION, WHAT)
$$ ##TITLE= Audit trail, TOPSPIN		Version 2.1
$$ ##JCAMPDX= 5.01
$$ ##ORIGIN= Bruker BioSpin GmbH
$$ ##OWNER= Administrator
$$ $$ E:\/data/COFFEE/nmr/AC1631_CENAH_8450655_8NDsmMBa8p/10/pdata/1/auditp.txt
$$ ##AUDIT TRAIL=  $$ (NUMBER, WHEN, WHO, WHERE, PROCESS, VERSION, WHAT)
(   1,<2014-02-18 16:57:21.393 -0800>,<Administrator>,<X>,<go>,<TOPSPIN 2.1>,
      <created by zg
	started at 2014-02-18 16:56:15.237 -0800,
	POWCHK enabled, PULCHK disabled,
       configuration hash MD5:
       C8 4E 4E 5D D3 5C D8 9E 9F 52 82 E0 59 8A DE 15
       data hash MD5: 64K
       81 77 63 BF E1 E7 F2 4C 45 D2 28 27 C9 8B 95 E1>)
(   2,<2014-02-18 16:57:24.253 -0800>,<Administrator>,<X>,<proc1d>,<TOPSPIN 2.1>,
      <Start of raw data processing
       efp LB = 0 FT_mod = 6 PKNL = 1 PHC0 = 0 PHC1 = 0 SI = 32K 
       data hash MD5: 32K
       27 12 CC 53 01 89 45 9F 69 03 FF DB D9 30 6E A4>)
(   3,<2014-02-18 16:57:24.534 -0800>,<Administrator>,<X>,<proc1d>,<TOPSPIN 2.1>,
      <pk PHC0 = 95.4657 PHC1 = 0 
       data hash MD5: 32K
       8E 1F A3 0D 90 6A 68 05 38 0A 5C 57 72 7F D4 63>)
(   4,<2014-02-18 16:57:24.628 -0800>,<Administrator>,<X>,<proc1d>,<TOPSPIN 2.1>,
      <abs ABSG = 1 
       data hash MD5: 32K
       FA 8C 47 E4 5C 60 78 B4 C4 0B B2 F8 C3 99 37 CA>)
(   5,<2014-02-18 16:57:24.690 -0800>,<Administrator>,<X>,<proc1d>,<TOPSPIN 2.1>,
      <abs ABSG = 2 
       data hash MD5: 32K
       EE 64 BA 88 EA D9 53 CA 28 F4 9A 53 6A 8C F7 8B>)
(   6,<2014-02-18 16:57:24.753 -0800>,<Administrator>,<X>,<proc1d>,<TOPSPIN 2.1>,
      <abs ABSG = 3 
       data hash MD5: 32K
       F7 ED 8B 8D D2 8A 5C 66 75 D0 E4 F7 7F EE 7E 06>)
(   7,<2014-02-18 16:57:24.815 -0800>,<Administrator>,<X>,<proc1d>,<TOPSPIN 2.1>,
      <abs ABSG = 4 
       data hash MD5: 32K
       D2 0D 89 AB 90 F0 14 2D 44 56 EC 47 FF 5D BD D1>)
(   8,<2014-02-18 16:57:24.862 -0800>,<Administrator>,<X>,<proc1d>,<TOPSPIN 2.1>,
      <abs ABSG = 5 
       data hash MD5: 32K
       B5 CD 59 82 44 D0 42 F7 79 BD 05 37 2B 1E 65 FB>)
$$ ##END=
$$ 
$$ $$ hash MD5
$$ $$ 97 79 EC 2D 5B 9A F1 D9 62 12 14 FE 67 A2 59 10
##$RELAX= 
##$RELAX= 
##$RELAX= 
##$RELAX= 
##$RELAX= 
##$RELAX= 
##$RELAX= 
$$ Bruker specific parameters
$$ --------------------------
##$DU= <E:\>
##$EXPNO= 10
##$NAME= <AC1631_CENAH_8450655_8NDsmMBa8p>
##$PROCNO= 1
$$ [...]
##$TP= (0..7)
150 150 150 150 150 150 150 150
##$TP07= 0
##$TPNAME0= <>
##$TPNAME1= <>
##$TPNAME2= <>
##$TPNAME3= <>
##$TPNAME4= <>
##$TPNAME5= <>
##$TPNAME6= <>
##$TPNAME7= <>
##$TPOAL= (0..7)
0.5 0.5 0.5 0.5 0.5 0.5 0.5 0.5
##$TPOFFS= (0..7)
0 0 0 0 0 0 0 0
##$TUNHIN= 0
##$TUNHOUT= 0
##$TUNXOUT= 0
##$USERA1= <user>
##$USERA2= <user>
##$USERA3= <user>
##$USERA4= <user>
##$USERA5= <user>
##$V9= 5
##$VALIST= <valist>
##$VCLIST= <CCCCCCCCCCCCCCC>
##$VD= 0
##$VDLIST= <DDDDDDDDDDDDDDD>
##$VPLIST= <PPPPPPPPPPPPPPP>
##$VTLIST= <TTTTTTTTTTTTTTT>
##$WBST= 2048
##$WBSW= 25
##$XGAIN= (0..3)
0 0 0 0
##$XL= 0
##$YL= 0
##$YMAX_a= 652932
##$YMIN_a= -554635
##$ZGOPTNS= <>
##$ZL1= 120
##$ZL2= 120
##$ZL3= 120
##$ZL4= 120
##$ABSF1= 14.98509
##$ABSF2= -5.573092
##$ABSG= 5
##$ABSL= 3
##$ALPHA= 0
##$AQORDER= 0
##$ASSFAC= 0
##$ASSFACI= 0
##$ASSFACX= 0
##$ASSWID= 0
##$AUNMP= <proc_prof1d_extract_pilot.lims>
##$AXLEFT= 0
##$AXNAME= <>
##$AXNUC= <1H>
##$AXRIGHT= 0
##$AXTYPE= 0
##$AXUNIT= <>
##$AZFE= 0.1
##$AZFW= 0.1
##$BCFW= 0
##$BC_mod= 0
##$BYTORDP= 0
##$COROFFS= 0
##$CY= 15
##$DATMOD= 1
##$DC= 0
##$DFILT= <>
##$DTYPP= 0
##$F1P= 0
##$F2P= 0
##$FCOR= 0.5
##$FTSIZE= 32768
##$FT_mod= 6
##$GAMMA= 0
##$GB= 0
##$INTBC= 1
##$INTSCL= 1
##$ISEN= 128
##$LB= 0
##$LEV0= 0
##$LPBIN= 0
##$MAXI= 10000
##$MC2= 0
##$MEAN= 0
##$ME_mod= 0
##$MI= 0
##$NCOEF= 0
##$NC_proc= -8
##$NLEV= 6
##$NOISF1= 0
##$NOISF2= 0
##$NSP= 0
##$NTH_PI= 0
##$NZP= 0
##$OFFSET= 14.98509
##$PC= 1
##$PHC0= 95.4657
##$PHC1= 0
##$PH_mod= 1
##$PKNL= yes
##$PPARMOD= 0
##$PPDIAG= 0
##$PPIPTYP= 0
##$PPMPNUM= 2147483647
##$PPRESOL= 1
##$PSCAL= 4
##$PSIGN= 0
##$PYNMP= <proc.py>
##$REVERSE= no
##$SF= 400.02
##$SI= 32768
##$SIGF1= 0
##$SIGF2= 0
##$SINO= 400
##$SIOLD= 32768
##$SPECTYP= <>
##$SREGLST= <1H.CDCl3>
##$SSB= 0
##$STSI= 32768
##$STSR= 0
##$SW_p= 8223.68421052631
##$SYMM= 0
##$S_DEV= 0
##$TDeff= 65536
##$TDoff= 0
##$TI= <>
##$TILT= no
##$TM1= 0
##$TM2= 0
##$TOPLEV= 0
##$USERP1= <user>
##$USERP2= <user>
##$USERP3= <user>
##$USERP4= <user>
##$USERP5= <user>
##$WDW= 1
##$XDIM= 32768
##$YMAX_p= 475500803
##$YMIN_p= -727339
##$CURPLOT= <Network HP LaserJet P1505>
##$CURPRIN= <$Network HP LaserJet P1505>
##$DFORMAT= <normdp>
##$LAYOUT= <+/1D_H.xwp>
##$LFORMAT= <normlp>
##$PFORMAT= <normpl>
##$SURQMSG= 1
$$ End of Bruker specific parameters
$$ ---------------------------------
##NTUPLES= NMR SPECTRUM
##VAR_NAME=  FREQUENCY,     SPECTRUM/REAL,   SPECTRUM/IMAG
##SYMBOL=    X,             R,               I
##VAR_TYPE=  INDEPENDENT,   DEPENDENT,       DEPENDENT
##VAR_FORM=  AFFN,          ASDF,            ASDF
##VAR_DIM=   32768,         32768,           32768
##UNITS=     HZ,            ARBITRARY UNITS, ARBITRARY UNITS
##FACTOR=    0.250966925370066, 1,           1
##FIRST=     8223.43324360094, -8344,        -147769
##LAST=      0,             60342,           73157
##MIN=       0,             -727339,         0
##MAX=       8223.43324360094, 475500803,    0
$$ Real data points
##PAGE= N=1
##DATA TABLE= (X++(R..R)), XYDATA
$$ [...]
19543a00709j73495g9842l8622c5692r4863H7784h0667L4374n7891k67054A16008
$$ -100709 -274204 -79842 -118464 -35692 -130555 87784 -80667 -46293 -104184 -371238 116008
19531c02127C63896g9656B71478a59462P3856M2400q3458p3821C887L18423e3894
$$ -302127 363896 -79656 271478 -159462 -85606 -43206 -126664 -200485 3887 322310 -53894
19519a75390H9281B9428M0844B2855M265a81039L0271C7082b51593a14720K5865
$$ -175390 89281 29428 70272 22855 27120 -181039 -150768 37082 -251593 -114720 -88855
19508h8855c5814J0843k76589D2774f845k55288H3635a69769B12604a98697c7939
$$ -88855 -35814 -24971 -301560 42774 -6845 -262133 83635 -169769 212604 -198697 -37939
19496a00364F7220b00882e0926A1655a6537A0622K42848B9848a36779k7271p1102
$$ -100364 67220 -200882 -50926 11655 -16537 10622 253470 29848 -136779 -164050 -235152
19485b35152B1933h5275l80908h1684E1236c18923f3010J6468j40676N1865C51927
$$ -235152 21933 -85275 -466183 -81684 51236 -318923 -63010 -46542 -187218 -135353 351927
19473E024b00732F6138b2836r7081A64271a97550j64328a47206r8448A43140a10727
$$ 5024 -200732 66138 -22836 -119917 164271 -197550 -361878 -147206 -245654 143140 -110727
19461a14509k00216a51018A64592l0966B9361c92414a1571j75797A79476Q9857
$$ -114509 -314725 -151018 164592 133626 29361 -392414 -11571 -187368 179476 269333
19451B69333b80526f2117l8972l9951a5146m25732i6651J3758A25395j4592m4739
$$ 269333 -280526 -62117 -101089 -141040 -15146 -440878 -96651 -82893 125395 110803 66064
19440F6064a63821a8607A19319B530P024a24864m1104g2023J8023J924p3153A3227
$$ 66064 -163821 -18607 119319 2530 9554 -124864 -165968 -72023 -54000 -52076 -125229 13227
19427b14673G9678b6438A0676c1178G3961a20894a050k86512a23687J267H5187
$$ -214673 79678 -26438 10676 -31178 73961 -120894 -1050 -287562 -123687 -122420 85187
19415H9067Q300e1942o8023B9351P6002a48590B71410d54375A7271H549M4348
$$ 89067 97367 -51942 -119965 29351 105353 -148590 271410 -454375 17271 8549 52897
19404E2897b62735j1317a26155C8895h746j16712o4793A3357a20024l2446A9875
$$ 52897 -262735 -274052 -126155 38895 -8746 -125458 -190251 13357 -120024 -152470 19875
19392A84623a05157A28546c4894n6579D3431O5475a27372B25455J294L7257p8174
$$ 184623 -105157 128546 -34894 -91473 43431 108906 -127372 225455 226749 264006 185832
19381A85832B3750b30955M2134P4112j23187A227d3301l47818c9278A63858i57
$$ 185832 23750 -230955 -188821 -114709 -237896 1227 -43301 -391119 -39278 163858 -957
19369a44313B35699a58441d6589H2165j663a26827j16070B1246J0725b09069a0629
$$ -144313 235699 -158441 -46589 82165 80502 -126827 -242897 21246 31971 -209069 -10629
19357B46533b07806E5510L14365g2204a1186j16487I360b94060g9800R614K470
$$ 246533 -207806 55510 369875 -72204 -11186 -127673 9360 -294060 -79800 -70186 -67716
19346f7716p9242b6243B21678a37298k88780a15699m8335a5549k02576R5414Q502
$$ -67716 -146958 -26243 221678 -137298 -426078 -115699 -164034 -15549 -218125 -122711 -114209
19335a14209E7075b12409l239b0803l37811H9807c47763O1585I2948P107i3288
$$ -114209 57075 -212409 -215648 -20803 -358614 89807 -347763 -286178 92948 100055 -93288
19323A22515a58012B57939p6429M5921a83328b1192A64173a71375H7440f1774
$$ 122515 -158012 257939 181510 227431 -183328 -21192 164173 -171375 87440 -61774
19312D5970K08685i4579c6520k12346L4799L9437B03518h7304i828k27252J07976
$$ 45970 254655 -94579 -36520 -248866 -214067 -174630 203518 -87304 -9828 -237080 -129104
19301a29104j28640N9541A61098k7051a82245J1620P1766A60409b66990b53k65514
$$ -129104 -257744 -198203 161098 134047 -182245 -170625 -98859 160409 -266990 -253 -265767
19290b65767J21237G2077C2565a76728A20340a28367E1818a18454k49014A62529
$$ -265767 -144530 72077 32565 -176728 120340 -128367 51818 -118454 -367468 162529
19279e51174g9306A07051J14072m8051A1425c37790Q8478J22815p0915A15996
$$ -551174 -79306 107051 221123 173072 11425 -337790 -249312 -126497 -197412 115996
19268b85361j26462Q7594B23162c121E9898a15363m21602f7331A24134G468K01419
$$ -285361 -411823 -324229 223162 -3121 59898 -115363 -536965 -67331 124134 7468 208887
19257B08887d32296a77524C28215a41257g0542A01968P5352f3658E4498A8913
$$ 208887 -432296 -177524 328215 -141257 -70542 101968 177320 -63658 54498 18913
19246B619i4147m5779o9873R4743j55159O9799j24733d3936e822j39980k19359
$$ 2619 -94147 -139926 -209799 -115056 -270215 -200416 -325149 -43936 -5822 -145802 -365161
19235c65161J80510l939p5677l0838F4376P4521F105a85871j42767c2519n65707
$$ -365161 -184651 -188590 -264267 -295105 64376 138897 6105 -185871 -328638 -32519 -598226
19224e98226b42305A60574G2505r00k0399J0306c90072a13097A24651k1341a15851
$$ -598226 -242305 160574 72505 71605 51206 61512 -390072 -113097 124651 103310 -115851
19212A51330R2281c8258k2127o0318H0493g8862A29108a23253A08043a37466d3114
$$ 151330 243611 -38258 -60385 -120703 80493 -78862 129108 -123253 108043 -137466 -43114
19200h561A28225J6403G096a48538G3689b01531H6706d5112k30307J29388k58421
$$ -8561 128225 144628 7096 -148538 73689 -201531 86706 -45112 -275419 -146031 -404452
19189d04452A18270A7838J94202a13040j37769B08949g4898l57599B45164g4974
$$ -404452 118270 17838 212040 -113040 -250809 208949 -74898 -432497 245164 -74974
19178d4959F0524Q6601a44326l703A4959b2671D34732i8231j09139A33762K77687
$$ -44959 60524 147125 -144326 -148029 14959 -22671 434732 -98231 -207370 133762 411449
19167D11449A15775a61841k19713a38471l6323G0100L7750h6595k4862b5403E4837
$$ 411449 115775 -161841 -381554 -138471 -174794 70100 107850 -86595 -111457 -25403 54837
19155A16325d5568j49772B0941J5898d03523P5265A37760e19255g4928p821A25568
$$ 116325 -45568 -195340 20941 36839 -403523 -328258 137760 -519255 -74928 -82749 125568
19143f4338k31539A1805a28541j18533N0480h2833j39344B17546K676c57664a32849
$$ -64338 -295877 11805 -128541 -247074 -196594 -82833 -222177 217546 220222 -357664 -132849
19131b98671a02040J3928A31232L8959a4488j68837c2906B14715J12790H7972
$$ -298671 -102040 -88112 131232 170191 -14488 -183325 -32906 214715 327505 87972
19120C93117a72891l083A42938d5116m9953d3724a067F4832A8137a92936C9728
$$ 393117 -172891 -175974 142938 -45116 -95069 -43724 -1067 64832 18137 -192936 39728
19108g0433j65169A14210j0817c74908B7274d8888k36698c8849L777n09149C69116
$$ -70433 -235602 114210 103393 -374908 27274 -48888 -285586 -38849 -35072 -544221 369116
19096c08123a29677j47499J36878l04923e5402k36677E5354b809k45566H191e7292
$$ -308123 -129677 -277176 -140298 -445221 -55402 -292079 55354 -2809 -248375 8191 -57292
19084H3415c29453J9250Q6949N7323M1010j62247A41941o6329B3509J5212J12006
$$ 83415 -329453 -310203 -223254 -165931 -124921 -287168 141941 75612 23509 38721 150727
19073A50727j415a53183H0639c08921C70586b5287j39083e2277k7282j46877A21494
$$ 150727 149312 -153183 80639 -308921 370586 -25287 -164370 -52277 -79559 -226436 121494
19061A40324b14265a05227F4802k7235i1404L6753F8870b8238k890o9488j73274
$$ 140324 -214265 -105227 64802 37567 -91404 -54651 68870 -28238 -31128 -100616 -273890
19050b73890c1802E3025a30430F1485K14197E3028a87601B90523b54838N0074
$$ -273890 -31802 53025 -130430 61485 275682 53028 -187601 290523 -254838 -204764
19040b04764A74373a98357F7214g3494R740j49413E4715h3306B31423H1378a87138
$$ -204764 174373 -198357 67214 -73494 -63754 -213167 54715 -83306 231423 81378 -187138
19028a68858C58128A04625J35360d5165I2694b3901G2639a89339D5495e4972k07511
$$ -168858 358128 104625 239985 -45165 92694 -23901 72639 -189339 45495 -54972 -262483
19017b62483J27833o3727N3136A25267a98274e9912o923G5467C3869e9016o5195
$$ -262483 -134650 -198377 -145241 125267 -198274 -59912 -66835 75467 33869 -59016 -124211
19006a24211O485C4181a21606e0072E7349a23099A4200b10446e305k94048I7513
$$ -124211 -117726 34181 -121606 -50072 57349 -123099 14200 -210446 -5305 -299353 97513
18994A06466a17075C8847O5506a62748N1106b3559A3419b56686B4205a55022p022
$$ 106466 -117075 38847 104353 -162748 -111642 -23559 13419 -256686 24205 -155022 -162044
18983a62044b6847j65818A1215f542A74826E1734c92767A39307M9014E3686M8118
$$ -162044 -26847 -192665 11215 -6542 174826 51734 -392767 139307 188321 53686 101804
18972A01804g789F8713a20763B93510c80879A940i2047q0429N9418A43861b16434
$$ 101804 -7789 68713 -120763 293510 -380879 1940 -92047 -172476 -113058 143861 -216434
18960C17814b5556l0202E7479e3269j41062A93837J2638b11981G173J92992a19865
$$ 317814 -25556 -55758 57479 -53269 -194331 193837 206475 -211981 7173 200165 -119865
18948c33993l7938A27340b87648H0463b60032A6472q042j890i930o2330N019k28378
$$ -333993 -371931 127340 -287648 80463 -260032 16472 8430 6540 -9930 -72260 -67241 -295619
18936b95619e3681p8360j97872f4403A55997a87375K2526A7690R4691E4226a85617
$$ -295619 -53681 -132041 -329913 -64403 155997 -187375 -164849 17690 112381 54226 -185617
18924g234m19255a90918A52299k2470i1041j25329R7792C28875D5224h1964F5167
$$ -7234 -426489 -190918 152299 129829 -91041 -216370 -118578 328875 45224 -81964 65167
18912A96280l4132J80940j05063d4030o5139A34026h3411G7669a34280J8188k35955
$$ 196280 162148 343088 238025 -44030 -109169 134026 -83411 77669 -134280 -116092 -352047
18901c52047E0287b1715m668l76840a29398L7987A79890a19288m73279C34746
$$ -352047 50287 -21715 -26383 -403223 -129398 -91411 179890 -119288 -592567 334746
18890c54228B0157K80962c99050f3744c1337j17567C61585I7614J33907a17491
$$ -354228 20157 301119 -399050 -63744 -31337 -148904 361585 97614 231521 -117491
18879d2551l7573O410k70616m6134d713j70357I791Q2099a57801B3729N136a59913
$$ -42551 -80124 -73714 -344330 -390464 -4713 -175070 9791 91890 -157801 23729 28865 -159913
18866e7075E8901a04185j10662P6842F5349f7270j20589k42994b08536e5723j3057
$$ -57075 58901 -104185 -214847 -138005 65349 -67270 -187859 -430853 -208536 -55723 -68780
18855f8780E18240a3170j80236l0218f8452n9997J4268P962B78817b78794B57106
$$ -68780 518240 -13170 -193406 -223624 -68452 -128449 -114181 -106219 278817 -278794 257106
18843h9192o5908K3177E4755g8404I6441q330K1308a83131P6858p790L4131K4503
$$ -89192 -155100 -131923 54755 -78404 96441 88111 109419 -183131 -106273 -114063 -79932 -55429
18831e5429B66844g3839A02518a38029M2154J6j9059G9124d2565A86483I3236
$$ -55429 266844 -73839 102518 -138029 -95875 -95859 -114918 79124 -42565 186483 93236
18819b05021r1337G6697L34277C3155b02555f7121A2591J54546J13198C3605L83106
$$ -205021 -296358 76697 410974 33155 -202555 -67121 12591 167137 280335 33605 416711
18808D16711A39209J59692F7330i8664k10795I1357b0318r3980B91343J1336p8541
$$ 416711 139209 298901 67330 -98664 -309459 91357 -20318 -114298 291343 302679 224138
18797B24138c32956f0238j9248B9834c07307a49007M9033D8362J45905a37626
$$ 224138 -332956 -60238 -79486 29834 -307307 -149007 -99974 48362 194267 -137626
18786a95227A45649e7198O761I1820J81167a18043J376d1553j81616J05672A10997
$$ -195227 145649 -57198 -50437 91820 272987 -118043 -116667 -41553 -223169 -117497 110997
18774i9564j57749J28616b7347D1471h2597A36369i9608A5952i5652c8831D5641
$$ -99564 -257313 -128697 -27347 41471 -82597 136369 -99608 15952 -95652 -38831 45641
18762A1599b01386j85313a52758A44728a42745B16930d0185l65135D4649a7733
$$ 11599 -201386 -386699 -152758 144728 -142745 216930 -40185 -405320 44649 -17733
18751C33302c19086A76032d5931B72189d09616J40861e9649A21831a09289j45529
$$ 333302 -319086 176032 -45931 272189 -409616 -268755 -59649 121831 -109289 -254818
18741b54818E3466K27685c7024C2080K20853D6650a92395A0769i9804c9133G8891
$$ -254818 53466 281151 -37024 32080 252933 46650 -192395 10769 -99804 -39133 78891
18729a01093C02418g0377k88957J19823j38495a77296A7103f9066j06077n143
$$ -101093 302418 -70377 -359334 -239511 -378006 -177296 17103 -69066 -175143 -180286
18719a80286A39545a18396N370J729L27H2167J88695c5635n2776B0552L8923a6297
$$ -180286 139545 -118396 -113026 -111297 -110970 82167 270862 -35635 -88411 20552 59475 -16297
18706e5403M75k34491f1993r3854A2098e2523C2398h1630l3301p5722e5110B70224
$$ -55403 -54928 -289419 -61993 -155847 12098 -52523 32398 -81630 -114931 -190653 -55110 270224
18693C9392a48101A64676B6516h5502L5892j34414l3963e6236j8468A33894a81772
$$ 39392 -148101 164676 26516 -85502 -49610 -184024 -217987 -56236 -74704 133894 -181772
18681a69225B8217L23133i8095A36034e6032C58477r7485d70359f8421H576a07764
$$ -169225 28217 351350 -98095 136034 -56032 358477 260992 -470359 -68421 8576 -107764
18669a3166o3668F9712J12086d00377E6688d1412C25931b5639H5313R3746a70948
$$ -13166 -76834 69712 181798 -400377 56688 -41412 325931 -25639 85313 179059 -170948
18657i5A44772a17664a6772k26868A32232n6295a07861l8398A34038A7819h2337
$$ -95 144772 -117664 -16772 -243640 132232 75937 -107861 -146259 134038 17819 -82337
18645A27972E519J25642n5655b24627D68956a09144F8491b90539I3698b56606
$$ 127972 5519 131161 75506 -224627 468956 -109144 68491 -290539 93698 -256606
18634A55679c30796B23355b2466n35529A27884b91474c4600A53898b13436M2343
$$ 155679 -330796 223355 -22466 -557995 127884 -291474 -34600 153898 -213436 -171093
18624a71093A22709a48219A06193A4378J16073b7952j42062o5286m325f394j18391
$$ -171093 122709 -148219 106193 14378 130451 -27952 -170014 -235300 -239625 -6394 -124785
18613a24785L4396j8050l05j49640J6078c1173F2434a64587J7959k18845h8136
$$ -124785 -90389 -108439 -108744 -258384 -242306 -31173 62434 -164587 -146628 -365473 -88136
18601a64281L3213J0556b7927p8343I3158d6105n8286A02054a32798L5753j16110
$$ -164281 -131068 -120512 -27927 -106270 93158 -46105 -104391 102054 -132798 -97045 -213155
18590b13155j2008a09A5107h7994I4448b05307k65178B01174e7424l91882E7157
$$ -213155 -225163 -109 15107 -87994 94448 -205307 -470485 201174 -57424 -449306 57157
18578a09869B85532H2140b2785j80728Q1654I9533d7668k99831E4471R1726a3502
$$ -109869 285532 82140 -22785 -203513 -121859 99533 -47668 -347499 54471 146197 -13502
18566d7301A21788e0987p0111b5487k03498R2071O30m7389G0971l0698N549a09475
$$ -47301 121788 -50987 -121098 -25487 -228985 -136914 -136284 -183673 70971 40273 45822 -109475
18553c85266J21221c8627j14010M4376A02921j1689c8689A4715a81570B02191
$$ -385266 -264045 -38627 -152637 -108261 102921 91232 -38689 14715 -181570 202191
18542B12228a09705b1147m5493I1257d02824e3514l49210a9039A83922a05001
$$ 212228 -109705 -21147 -66640 91257 -402824 -53514 -402724 -19039 183922 -105001
18531G5330b08498B03391a76927L5307a0597p8674C6555b56603d4384G6657e0411
$$ 75330 -208498 203391 -176927 -141620 -10597 -89271 36555 -256603 -44384 76657 -50411
18519h1222C58585B0900d0652j62525l55097E3684a45010A21115j0985a17480
$$ -81222 358585 20900 -40652 -203177 -558274 53684 -145010 121115 110130 -117480
18508D7974d9115p1930j6793j44376F6654a35478E088f390q4718c3359p8431H5440
$$ 47974 -49115 -121045 -137838 -282214 66654 -135478 5088 -6390 -91108 -33359 -111790 85440
18495C36700a6060k71833G8981l7785M5938P1687b560j27145B77894b99832a9740
$$ 336700 -16060 -287893 78981 41196 87134 158821 -2560 -129705 277894 -299832 -19740
18483A14968b71141L8685i2511D2156j1949a72110O8998A39568D4852a26000F1788
$$ 114968 -271141 -232456 -92511 42156 30207 -172110 -103112 139568 44852 -126000 61788
18471e5314o7636B0270a33354j22749C5753o007M6085b49970b2730B21932o0352
$$ -55314 -122950 20270 -133354 -256103 35753 29746 75831 -249970 -22730 221932 161580
18460A61580b45965m6997A85390n4639R807f6435D7733e2453j87989R1264J3490
$$ 161580 -245965 -292962 185390 130751 140558 -66435 47733 -52453 -240442 -149178 -135688
18449a35688n4088f9531o9419k29414e6103j24043B58608i789B05744o3622b3877
$$ -135688 -189776 -69531 -138950 -368364 -56103 -180146 258608 -9789 205744 142122 -23877
18437H1346c46349f4911r7465j30363H6164c50283a13537m8956m0004A20191h9115
$$ 81346 -346349 -64911 -162376 -292739 86164 -350283 -113537 -162493 -202497 120191 -89115
18425d16344J39520G8024a4915l38140e5681k22909b02k5508j55161A92202N0224
$$ -416344 -276824 78024 -14915 -353055 -55681 -278590 -202 -25710 -180871 192202 242426
18414B42426l5932l6779d49435L6143a52260K8430A23824b83693H0330c79317
$$ 242426 206494 169715 -449435 -413292 -152260 -123830 123824 -283693 80330 -379317
18403b6732p7286B65818A03804J34196j18692E1703a8281k13296m9339G94M1716
$$ -26732 -104018 265818 103804 238000 119308 51703 -18281 -231577 -280916 794 42510
18392D2510c1879k21089i6420L8362Q810j24728C5484a5886p1474A01374a41853
$$ 42510 -31879 -252968 -96420 -58058 -49248 -173976 35484 -15886 -87360 101374 -141853
18380I4095a34038A64328h2788l8103p2914d465l42982A46721b21747i2337C99695
$$ 94095 -134038 164328 -82788 -120891 -193805 -4465 -347447 146721 -221747 -92337 399695
18368F6056K62879e2878o1351B47640J10851c0808k49809O4296A06697a04795
$$ 66056 328935 -52878 -114229 247640 358491 -30808 -280617 -216321 106697 -104795
18357B04391k8552B0295K06228A895b01171A12571c6191j14459p3496A37832c35548
$$ 204391 175839 20295 226523 1895 -201171 112571 -36191 -150650 -224146 137832 -335548
18345E7111f3441l2152a600j72566K6588e0260h246n1743H289J34870l829g4130
$$ 57111 -63441 -95593 -1600 -174166 -147578 -50260 -8246 -59989 8289 143159 139330 -74130
18332I3804a71160P6306r3036a9857k8449m2171B4477c17037h5528A41047i2258
$$ 93804 -171160 -94854 -187890 -19857 -48306 -90477 24477 -317037 -85528 141047 -92258
18320c1254m08308a76175o8012H8168C5343a8879E2340a42034D1688a0185r8772
$$ -31254 -439562 -176175 -244187 88168 35343 -18879 52340 -142034 41688 -10185 -108957
18309a08957H1278a45885M5140a3057k35215K451O3010d3210j42158B04552b30397
$$ -108957 81278 -145885 -100745 -13057 -248272 -245821 -182811 -43210 -185368 204552 -230397
18297a30498c9291k6696K6098l28712J03732m8995h5190m0302k20996M7544m3016
$$ -130498 -39291 -65987 -39889 -368601 -264869 -313864 -85190 -125492 -346488 -298944 -341960
18286c41960R3743J08935d7720k72090b252A88735r358Q1879a02917I8470h0499
$$ -341960 -248217 -139282 -47720 -319810 -2252 188735 179377 261256 -102917 98470 -80499
18274A11000a4135j54149I0108d68693K25361N3059O7022A1763c0824A76307G0668
$$ 111000 -14135 -168284 90108 -468693 -243332 -190273 -123251 11763 -30824 176307 70668
18262C1410J84153b73944A13102A67a31182D3370b66514l8982D1358b77688A25757
$$ 31410 215563 -273944 113102 167 -131182 43370 -266514 -305496 41358 -277688 125757
18250a69672I903a93921f9704j38665k13850c4726j2981b21j79750j07435l2750
$$ -169672 9903 -193921 -69704 -208369 -422219 -34726 -47707 -221 -179971 -287406 -320156
18239c20156B48049a44661A40271l5699d00232b1640q551C43921G0617J11412
$$ -320156 248049 -144661 140271 104572 -400232 -21640 -30191 343921 70617 182029
18229A82029e06431I1183a89856B23786D5309g8996b9537j35738A15513a06091
$$ 182029 -506431 91183 -189856 223786 45309 -78996 -29537 -165275 115513 -106091
18218B7220J20889F7533a63754C1169j3268a38634A57240a75321A04805c4058
$$ 27220 148109 67533 -163754 31169 17901 -138634 157240 -175321 104805 -34058
18207f9411E9418L84766A53745b91603I9347l9920c18129g4830o6896H2487b30862
$$ -69411 59418 444184 153745 -291603 99347 59427 -318129 -74830 -141726 82487 -230862
18195H5604i9929j76199A37434P5521c05233J32846A56826h3745l6118C4981K79650
$$ 85604 -99929 -276128 137434 212955 -305233 -172387 156826 -83745 -119863 34981 314631
18184C14631a11196K6776A95070J70955B4066d21042f7341A86872f2055A12842
$$ 314631 -111196 -84420 195070 366025 24066 -421042 -67341 186872 -62055 112842
18173a78466A60004a13060J8006k4233I1791a61563P481J5552b6387B97943b06434
$$ -178466 160004 -113060 -95054 -119287 91791 -161563 -154082 -138530 -26387 297943 -206434
18161a25877o760A07728L4260d9865j52075A46291J45404J00817I1248i6085d0708
$$ -125877 -132637 107728 141988 -49865 -201940 146291 291695 392512 91248 -96085 -40708
18149A45732b30944L7345B90313o9598b35001c9992a59p9615k47823e9837B6740
$$ 145732 -230944 -193599 290313 220715 -235001 -39992 -159 -79774 -327597 -59837 26740
18137A30591a13979B06374c93313A45424M5106G6298f8508A72848k9776b2544
$$ 130591 -113979 206374 -393313 145424 190530 76298 -68508 172848 143072 -22544
18126b19399e8753b4137G6580R804d07547a43836k27835a35357j15245g5931j51788
$$ -219399 -58753 -24137 76580 86384 -407547 -143836 -371671 -135357 -250602 -75931 -227719
18115b27719h721A12214b94628d4135A8493N9548b72649n8956a16272B33199b3477
$$ -227719 -8721 112214 -294628 -44135 18493 78041 -272649 -331605 -116272 233199 -23477
18103b1247F8902J17335a41682p5813j39238B41940b24656P6578f6451p014I7557
$$ -21247 68902 186237 -141682 -217495 -356733 241940 -224656 -148078 -66451 -73465 97557
18091A25510a1400l1298j5877B66781E4365K09279a27265F8830d7726E2410a27223
$$ 125510 -11400 -42698 -58575 266781 54365 263644 -127265 68830 -47726 52410 -127223
18079e1836E3895a61035J9232j53500C9981a92536A54288A0959d30873B7079O3555
$$ -51836 53895 -161035 -141803 -295303 39981 -192536 154288 10959 -430873 27079 90634
18068I0634O7608a21606M3J6049B3397c1069A24070n7875i8238b0451B13375k7023
$$ 90634 158242 -121606 -121563 -105514 23397 -31069 124070 66195 -98238 -20451 213375 186352
18056A86352B9336J90228c9455C1892K7703f918A01232d9953C01361d0381A2734
$$ 186352 29336 219564 -39455 31892 59595 -6918 101232 -49953 301361 -40381 12734
18044b64306a5419E0541J61569b70484H4757J32438a4258j69350F3434k7804K35461
$$ -264306 -15419 50541 212110 -270484 84757 217195 -14258 -183608 63434 35630 271091
18033B71091a04227A6661N5536a39553A12410a56658j88722e9631b3148C2321
$$ 271091 -104227 16661 72197 -139553 112410 -156658 -345380 -59631 -23148 32321
18022D0546c26357A04016d4364A54050i292B03436E4653K13463j27529a57538
$$ 40546 -326357 104016 -44364 154050 -9292 203436 54653 268116 140587 -157538
18011A14128H166b50756i7629H0944N4176a20495p2468h7588E17382a52694O9007
$$ 114128 8166 -250756 -97629 80944 135120 -120495 -192963 -87588 517382 -152694 -83687
18000h3687I9913K605j9598e8002k6238o1044A50552a2318j8283B15524a89212
$$ -83687 99913 102518 82920 -58002 -84240 -145284 150552 -12318 -30601 215524 -189212
17988B4268M3009b87706g939o8443j203A75463G8558b38071h8030C3685b78021
$$ 24268 67277 -287706 -7939 -76382 -77585 175463 78558 -238071 -88030 33685 -278021
17976c55814a57772C10015r1510q616b46193J8880A7370K9937K54408c2003j51966
$$ -355814 -157772 310015 218505 209889 -246193 -227313 17370 47307 301715 -32003 -183969
17965a83969B54780B9785c03029B2124b0669A10587R5587b09566A57702b14657
$$ -183969 254780 29785 -303029 22124 -20669 110587 206174 -209566 157702 -214657
17954h2056M0518A67539e8320F4923J31868b63072j27922C0575N0973c2453l20834
$$ -82056 -41538 167539 -58320 64923 196791 -263072 -390994 30575 81548 -32453 -353287
17943c53287B44626b09062m8989J25553A83995b03539h7486j5729B15684f539
$$ -353287 244626 -209062 -258051 -132498 183995 -203539 -87486 -103215 215684 -6539
17932c20235h8826j31278l7128i9807a4923j4740D2531d9106A03077c65664a81966
$$ -320235 -88826 -220104 -257232 -99807 -14923 -29663 42531 -49106 103077 -365664 -181966
17920c05559a01276B96336B7090j3258i8170d1962C4928L61269c74472a08619
$$ -305559 -101276 296336 27090 13832 -98170 -41962 34928 396197 -374472 -108619
17909H8583e12398b45213C3206J38004a66340k1138f3662k3935c3060l6653A44855
$$ 88583 -512398 -245213 33206 171210 -166340 -187478 -63662 -87597 -33060 -69713 144855
17897A81789g1314E161O5865j6502b43013l385J6040j10477J49780j42664a37922
$$ 181789 -71314 5161 71026 54524 -243013 -246398 -230358 -340835 -191055 -333719 -137922
17885B5085J81508b3978q8245A051b8820j8951j97922f4011j03673o106J7043
$$ 25085 206593 -23978 -112223 1051 -28820 -47771 -245693 -64011 -167684 -173790 -156747
17874a56747C20851a24944l8669A80454J4469b1222B26679h2400K2873p6444j80078
$$ -156747 320851 -124944 -163613 180454 194923 -21222 226679 -82400 -59527 -135971 -316049
17863c16049D10211E7786g2633I9251J60091g3602D4200K9897c79674F0281e3168
$$ -316049 410211 57786 -72633 99251 259342 -73602 44200 74097 -379674 60281 -53168
17851a41302o2137M8015M0159I2828J63199h8734B30165d01413B55132C4858H565
$$ -141302 -203439 -155424 -115265 92828 256027 -88734 230165 -401413 255132 34858 8565
17839A6542J0990q686N8532h5857L2101I6980O8337j4257K23242e515A36444a14097
$$ 16542 27532 18846 77378 -85857 -53756 96980 165317 151060 374302 -5515 136444 -114097
17826g2302A8305L70638A03442a31785f4447b5694A80873K3618c68842J46322
$$ -72302 18305 388943 103442 -131785 -64447 -25694 180873 204491 -368842 -222520
17816b22520c2794C37180j17695d65p6876A55540c3523p8354N561H3625N3593
$$ -222520 -32794 337180 219485 -465 -77341 155540 -33523 -111877 -106316 83625 137218
17805A37218J17945b77773P299E628R7059a23881p2565B986h899H4588c72951
$$ 137218 255163 -277773 -270474 5628 102687 -123881 -196446 2986 -8899 84588 -372951
17793A48061m8856D5478P9726a10957B46950d21459b06734B25726H4705b33515
$$ 148061 99205 45478 125204 -110957 246950 -421459 -206734 225726 84705 -233515
17782A94638F1757f0347D2985b0794j50467g0183A22165N5655l7583g882j79531
$$ 194638 61757 -60347 42985 -20794 -171261 -70183 122165 177820 140237 -7882 -187413
17771a87413K2880k21290B2622b4513j22672k9467A59237f0739H380J98854g1325
$$ -187413 -164533 -385823 22622 -24513 -147185 -176652 159237 -60739 8380 207234 -71325
17759h1947H2897b00686n0738c6050l49558B43248J39689A15710k8335g5854A0642
$$ -81947 82897 -200686 -251424 -36050 -385608 243248 382937 115710 87375 -75854 10642
17747b19119A61520a65627A12990b8353j51046L6710E7160M2855a06029C07146
$$ -219119 161520 -165627 112990 -28353 -179399 -142689 57160 100015 -106029 307146
17736c47530A12578n6077a21414b8246C2002d5594C7296a17159E1040J3071J17846
$$ -347530 112578 56501 -121414 -28246 32002 -45594 37296 -117159 51040 64111 181957
17725A81957a5416A58412a78301A72219G3583d5828n3184A45308a41937A09715
$$ 181957 -15416 158412 -178301 172219 73583 -45828 -99012 145308 -141937 109715
17714b44992g2675A69498C7061J417D821a95543P1591A94980E4585d5119C2463
$$ -244992 -72675 169498 37061 38478 4821 -195543 -123952 194980 54585 -45119 32463
17702A14298J81707L34382F7578J93929I136K26045m4839a603m0314k41219C56343
$$ 114298 296005 630387 67578 261507 9136 235181 190342 -1603 -41917 -283136 356343
17690d0460R867B0939J89421m7031a6757j78691O230d8976F9474g3264F7026K19462
$$ -40460 -30593 20939 210360 163329 -16757 -195448 -189218 -48976 69474 -73264 67026 286488
17678B86488F375M45789f5252k1951C5a05321P016A42214a80047A84284B180J63819
$$ 286488 6375 452164 -65252 -87203 35 -105321 -98305 142214 -180047 184284 2180 165999
17666A65999k7024a42225F4404J01957b97610J36253I2126J40132b64449i3260
$$ 165999 138975 -142225 64404 166361 -297610 -161357 92126 232258 -264449 -93260
17655A65366a23251n3385A45407P5963L7966A04156Q0139I0197K5848K49838A82399
$$ 165366 -123251 -176636 145407 221370 259336 104156 184295 90197 116045 365883 182399
17643g0078m7173H5606C3426O2467l3720P5271m2279b00553A2290f0781A17981
$$ -70078 -117251 85606 33426 95893 62173 137444 95165 -200553 12290 -60781 117981
17631A11568a09672j79903i2360C8529c73302h0913I7553b35006A12198c60294
$$ 111568 -109672 -289575 -92360 38529 -373302 -80913 97553 -235006 112198 -360294
17620A61560E1231K25072I8613i152B02063J41204j05104a03100k20417A88254
$$ 161560 51231 276303 98613 -9152 202063 343267 238163 -103100 -323517 188254
17609b3560G8752a83251B66960B595a53696O0696j91j20942o144b6969A60673
$$ -23560 78752 -183251 266960 2595 -153696 -93000 -93191 -214133 -220277 -26969 160673
17597c4361l7618A74546H328M9181a03718F4292J5456B8025J61110j0987G80M9914
$$ -34361 -71979 174546 8328 57509 -103718 64292 79748 28025 189135 178148 780 50694
17585E0694J59830J266j05639j5522b42043B90749f2143K9370A51276a41914j8958
$$ 50694 210524 211790 106151 90629 -242043 290749 -62143 -32773 151276 -141914 -160872
17574a60872A2230a26842f558k63467A4707a2500B100a84746A06435C1874M62403
$$ -160872 12230 -126842 -6558 -270025 14707 -12500 2100 -184746 106435 31874 494277
17563D94277b07048H241N84566a67452C93568D2265b1296j16879A41370B2945
$$ 494277 -207048 8241 592807 -167452 393568 42265 -21296 -138175 141370 22945
17552F0461K00530G604d2078I4500b64321B84845G8538Q367b824q5160j48895
$$ 60461 260991 7604 -42078 94500 -264321 284845 78538 86905 -2824 -87984 -236879
17541b36879G4642k2975J02749j3421n7531f4958B48327C0739a77649q708j7535
$$ -236879 74642 51667 154416 140995 83464 -64958 248327 30739 -177649 -186357 -203892
17530b03892F8011j0105a77663B53616k9122d5290E2721g6091F3012J04733p2488
$$ -203892 68011 57906 -177663 253616 224494 -45290 52721 -76091 63012 167745 95257
17519I5257j2410a20326B14488j2178J37205o2875B121J16805K25438e6221A97658
$$ 95257 82847 -120326 214488 202310 339515 276640 2121 118926 344364 -56221 197658
17507b83645I9132b12013I3413C5156J82252a16622E08141c194A79888a6262C02841
$$ -283645 99132 -212013 93413 35156 217408 -116622 508141 -3194 179888 -16262 302841
17495B11856J4056E5878M11802l6550A89366O6212F4824P8138B09a43467B24866
$$ 211856 225912 55878 467680 431130 189366 255578 64824 142962 209 -143467 224866
17483i41j43608D4161J67386O5717R5404m1611L05082B51034A11055J14937C9107
$$ -941 -144549 44161 211547 277264 372668 331057 636139 251034 111055 225992 39107
17471a62448a9498H4550J80196c26021C94624c48225H5074k5429c95447C12615
$$ -162448 -19498 84550 264746 -326021 394624 -348225 85074 59645 -395447 312615
17460c21364D73485D3573P5882i795A07d3822J453D58127M1405G8616I970L02766
$$ -321364 473485 43573 119455 -9795 107 -43822 -42369 458127 499532 78616 9970 312736
17448C12736J7643r1896I4067J15557H9093M26771H2266L73129G8798J04606K37099
$$ 312736 330379 238483 94067 209624 89093 515864 82266 455395 78798 183404 420503
17437D20503j56539a82982A26948g6501B22614J92635o0376F2133L76526A47635
$$ 420503 263964 -182982 126948 -76501 222614 415249 354873 62133 438659 147635
17426a16926F2775J30249m9778R6174P0846A26924E5465d7725G8659M9218J04290
$$ -116926 62775 193024 143246 239420 310266 126924 55465 -47725 78659 127877 232167
17415B32167L45630d0093D80430A30075f0636B66271j7898o8355F9022b0493A35521
$$ 232167 577797 -40093 480430 130075 -60636 266271 248373 180018 69022 -20493 135521
17403c9937F34152l06364a21168A80086E9772a74828A50461a00134J4680I3033
$$ -39937 634152 327788 -121168 180086 59772 -174828 150461 -100134 -85454 93033
17392B30374c9629I379J74314a8614A52157m5397L38178l8751a8173r2199E1694
$$ 230374 -39629 9379 183693 -18614 152157 106760 444938 406187 -18173 -110372 51694
17380C67379A27307L37313I4659R6974C904K54991O2508F5910J25807n8454L23708
$$ 367379 127307 464620 94659 191633 3904 258895 321403 65910 191717 133263 456971
17369D56971j79073h6158c0660A16850a25831i494C7022e1589H4526c974C61100
$$ 456971 277898 -86158 -30660 116850 -125831 -9494 37022 -51589 84526 -3974 361100
17357a8031C9401R0351D9292J15026o7303K2684n7608j439J43234O966K64278
$$ -18031 39401 129752 49292 164318 97015 119699 62091 60652 203886 210852 475130
17346D75130k00255l7374A12528a74200H0954c6603A81462m9300C7190K19280
$$ 475130 274875 237501 112528 -174200 80954 -36603 181462 132162 37190 256470
17336B56470e9236k69811J62850A86329o7970C6181A5523J95968r046L6092K71468
$$ 256470 -59236 -329047 -166197 186329 118359 36181 15523 211491 202445 238537 510005
17325E10005j53565E6591K19140f735A84159C4841K05753N5158j16056K2761K1371
$$ 510005 356440 56591 275731 -6735 184159 34841 240594 295752 179696 202457 223828
17314B23828k0046D7307K35805j31164e1565A00141R7429A6J17690J86078m8695
$$ 223828 203782 47307 283112 151948 -51565 100141 197570 16 117706 303784 255089
17303B55089d5308F4259N8864L7384a13599F5618a04771N208B15198R6255j7459
$$ 255089 -45308 64259 123123 160507 -113599 65618 -104771 -99563 215198 311453 293994
17292B93994p4092C29K53622A9961a11658C21343P5833A00323B9425L45836j51501
$$ 293994 219902 329 253951 19961 -111658 321343 397176 100323 29425 375261 223760
17281B23760H9246J92580R8324I8617J03041N7753a55172A92057F1428J1858J60143
$$ 223760 89246 281826 380150 98617 201658 259411 -155172 192057 61428 73286 233429
17270B33429j622P9097p4333K0412M6667a02701B16114l3313P9731P495h1583
$$ 233429 231807 310904 236571 256983 303650 -102701 216114 182801 262532 270027 -81583
17258C32542A28678J13414l9327K32910j51780m9343r4429J09682C2495J67340
$$ 332542 128678 242092 202765 435675 283895 234552 140123 249805 32495 199835
17248A99835J5675b42407B14873e0965A47562K45369a391B86310A01958a30826
$$ 199835 215510 -242407 214873 -50965 147562 392931 -1391 286310 101958 -130826
17237B03691K93748A88860D4417K24057K7409K6417a12219A61755K32791G4732
$$ 203691 497439 188860 44417 268474 295883 322300 -112219 161755 394546 74732
17226C92998j76403A2818J18231R2288A11021Q7429I2958a5390C15133j24599
$$ 392998 216595 12818 131049 223337 111021 198450 92958 -15390 315133 190534
17216A90534R0489a34141B53876o0056R7411K5249Q9551G7663J17999K85574B09693
$$ 190534 281023 -134141 253876 193820 291231 316480 406031 77663 195662 481236 209693
17204H6440L58973A1415L20362Q0087N871l1596j1270A07112J42752J00596A67172
$$ 86440 445413 11415 331777 411864 417735 386139 374869 107112 249864 350460 167172
17192C23593J0235M3650E4114R5448j4101L21995H1474M25129A21202L31809A65267
$$ 323593 333828 377478 54114 149562 135461 457456 81474 506603 121202 453011 165267
17180H7387K04092m2300L23518k403H8642L74271A15227J96051A41578L35041
$$ 87387 291479 249179 572697 570294 88642 462913 115227 311278 141578 476619
17170D76619j65352j10205a4500D00473g9863A41024J56376l9031n7975J54406
$$ 476619 311267 201062 -14500 400473 -79863 141024 297400 258369 200394 354800
17160C54800b3798A01616J20358q7798M2835j1554L48007j26650E1364n948B2286
$$ 354800 -23798 101616 221974 134176 177011 165457 513464 386814 51364 45416 22286
17148D16214G0340K59006L41876B87664R309J08006j30194K12572j53718O0804
$$ 416214 70340 329346 671222 287664 296973 404979 274785 487357 333639 394443
17138C94443j5562j04801A30927K48325n067j18692j22516K67033J32619j24238
$$ 394443 378881 274080 130927 379252 374185 255493 132977 400010 532629 408391
17128D08391A79937J59206H6019K53790k3866J59845P6003j52610N5756j40116
$$ 408391 179937 339143 86019 339809 315943 475788 551791 399181 454937 314821
17118C14821J78177n0910k0044P966j85909m000L46512B84982J90690k11670J34605
$$ 314821 492998 442088 422044 430010 244101 240101 586613 284982 475672 264002 398607
17107C98607K34019E8501N3000Q4256C0565L79373O9138R7095c5992C24895K86061
$$ 398607 632626 58501 111501 195757 30565 409938 479076 576171 -35992 324895 610956
17096F10956j37027L6736m1729J72757B09170J69820K56362k36446M0291J8073
$$ 610956 473929 510665 468936 641693 209170 378990 635352 398906 439197 457270
17086D57270k28057Q5028L44004j99494j28575J64449A39156L55241k21330P6430
$$ 457270 229213 314241 658245 458751 330176 494625 139156 494397 273067 349497
17076C49497J65042J62419j23022j84248K20546B18516N5703R8148J70401J2061
$$ 349497 514539 676958 553936 369688 590234 218516 274219 372367 542768 554829
17066E54829m4680j84962J55890m6316J37117j88695n8898m1714M25598B37256
$$ 554829 510149 325187 481077 434761 571878 383183 324285 282571 708169 237256
17055D61832A17267J12577K22838K60035q2975O4549P6784l64007k9643J55067
$$ 461832 117267 229844 452682 712717 629742 694291 771075 407068 377425 532492
17045E32492K22727C01333L43008B36706K21124K51978k10925k3881p6751J71373
$$ 532492 755219 301333 644341 236706 457830 709808 498883 475002 398251 569624
17035E69624k26063K11918n2212K62685k27278N6973J99219l83446K60944P765
$$ 569624 343561 555479 503267 765952 538674 595647 794866 411420 672364 680129
17025F80129J33821j00150l47881M26239C63559J22716L35687j04377k03926L2948
$$ 680129 813950 713800 365919 792158 363559 486275 821962 717585 513659 546607
17015E46607K2899J04672K26377l99550L29574l04440R6669j92602M00504C09100
$$ 546607 569506 674178 900555 501005 830579 526139 622808 430206 830710 309100
17004G19375l24107M48380N3218k76514L31855k52624k06474K10843J00970K1511
$$ 719375 395268 843648 896866 620352 952207 699583 493109 703952 804922 826433
16994H26433l27965K31488K64438j66279J74868j37282O3435P2141j96700J33843
$$ 826433 498468 729956 994394 828115 1002983 865701 929136 1001277 804577 938420
16984I38420k14733O3769J29813J9085j5009K50882k76968K8231N0434J09295
$$ 938420 723687 787456 917269 936354 921345 1172227 895259 923490 973924 1083219
16974A083219J09672l52018J80924k55601K83824j72058J17279J30446k86428
$$ 1083219 1192891 840873 1021797 766196 1050020 877962 995241 1125687 839259
16965H39259N3050J26890k55683Q8350L59195J68928j77770j2506l51780L22802
$$ 839259 892309 1019199 763516 851866 1211061 1379989 1202219 1189713 837933 1160735
16955A160735k36200K32006q1737J53499m77152L61626o6402J07541k30434J67617
$$ 1160735 924535 1156541 1074804 1228303 751151 1112777 1046375 1153916 923482 1091099
16945A091099L4595p4295J15550K04821m44915L16547J14698k44127Q4058p0999
$$ 1091099 1125694 1051399 1166949 1371770 926855 1243402 1358100 1113973 1198031 1127032
16935A127032j08689N83936j82250Q0936j163j83981l39446J78315K76875k50294
$$ 1127032 1018343 1602279 1420029 1500965 1499802 1315821 976375 1154690 1431565 1181271
16925A181271r622J74525J57349j44867j7419J80883j49600L01375l88972Q0467
$$ 1181271 1171649 1346174 1503523 1358656 1341237 1522120 1372520 1673895 1284923 1365390
16915A365390J94201N2178J24083k86551L883K7607o7973J82673n9935L56770
$$ 1365390 1559591 1611769 1735852 1449301 1453184 1480791 1412818 1595491 1535556 1892326
16905A892326k48096J52125n5135L66349n02263L00842j80521K42905k06569K18276
$$ 1892326 1644230 1796355 1741220 2107569 1605306 1906148 1725627 1968532 1761963 1980239
16895A980239J61064l77373R2430k64346K36686Q9348J44579K23120m02507J60005
$$ 1980239 2141303 1763930 1856360 1592014 1828700 1918048 2062627 2285747 1883240 2043245
16885B043245q3553K20504P7371m01147Q6245M60996j43111N2667j099J23266
$$ 2043245 1959692 2180196 2257567 1856420 1942665 2403661 2260550 2313217 2312118 2435384
16875B435384j13297J04448K9287j25162k1899L27733j64519L78407m29668Q7410
$$ 2435384 2322087 2426535 2455822 2330660 2308761 2636494 2471975 2850382 2420714 2508124
16865B508124L8323J69635K43229n9192l70023N35059m03516K30558K79374k09667
$$ 2508124 2546447 2716082 2959311 2900119 2530096 3065155 2661639 2892197 3171571 2961904
16855B961904M12775l72268K30353N2800l30328K37120J20875m4760J77035r1000
$$ 2961904 3374679 3002411 3232764 3285564 2955236 3192356 3313231 3268471 3445506 3354506
16845C354506r5948J90449M80760r3449K28899n08082J29141J81742O4504K27
$$ 3354506 3258558 3449007 3929767 3836318 4065217 3557135 3686276 3868018 3932522 3932749
16835C932749L66266l24849K28814j38968M19671J20331O0926k45720J40332K16586
$$ 3932749 4299015 3974166 4202980 4064012 4483683 4604014 4664940 4419220 4559552 4776138
16825D776138N9463K72702k34081O09682m78587L6581L63396j22417M06359L5319
$$ 4776138 4835601 5108303 4874222 5483904 5005317 5041898 5405294 5282877 5689236 5724555
16815E724555M14950M0328m25830R4818P78221k5606m6619M08034r5646K5176
$$ 5724555 6139505 6179833 5754003 5848821 6627042 6601436 6554817 6962851 6867205 6892381
16805F892381J88173J2656M26243o8955P73060j63359O6651M58524l44601O49038
$$ 6892381 7080554 7093210 7519453 7450498 8223558 8060199 8126850 8585374 8240773 8889811
16795H889811K41131J85272o7347N60044R4050J86942L41882N88153l58271Q86221
$$ 8889811 9130942 9316214 9248867 9808911 9902961 10089903 10431785 11019938 10661667 11547888
16785A1547888J40701N31341L5705M23664L14084Q05084Q8981J70573O09470P18885
$$ 11547888 11688589 12219930 12255635 12679299 12993383 13798467 13887448 14058021 14667491 15386376
16775A5386376N58232L05909M22598M99790R23380M36808N85208Q93814O85172
$$ 15386376 15944608 16250517 16673115 17172905 18096285 18533093 19118301 20012115 20697287
16766B0697287O45339Q10105P40433J073695J074035P31559J401112J023368Q16249
$$ 20697287 21342626 22152731 22893164 23966859 25040894 25772453 27173565 28196933 29013182
16757B9013182J731985J073804J555921J352979J482555J868970J647480J949891
$$ 29013182 30745167 31818971 33374892 34727871 36210426 38079396 39726876 41676767
16749D1676767K322549J555484K808452K310679K860297K710968L201491L433007
$$ 41676767 43999316 45554800 48363252 50673931 53534228 56245196 59446687 62879694
16741F2879694L665307L549377M185227M263076M599206N379663N513246N399702
$$ 62879694 66545001 70094378 74279605 78542681 83141887 88521550 94034796 99434498
16733I9434498O049594O079973O819967P201953P325190P929344P129023P995743
$$ 99434498 105484092 111564065 118384032 125585985 132911175 140840519 147969542 155965285
16725A55965285P686661P181137P148315O650848N185294M735970L275970K180649
$$ 155965285 163651946 170833083 177981398 184632246 189817540 194553510 197829480 200010129
16717B00010129Q45659n61183k391097l344352m452663n596417o483442o776941
$$ 200010129 200855788 200294605 197903508 194559156 190106493 184510076 178026634 171249693
16709A71249693p715967q167533p736614q012018p880207p551344p270363p185629
$$ 171249693 163533726 155366193 147629579 139617561 131737354 124186010 116915647 109730018
16701A09730018o405300o687239n738056n327857n388099m594785m570330m024261
$$ 109730018 103324718 96637479 90899423 85571566 80183467 75588682 71018352 66994091
16693F6994091l689041l683138l321692l042158l091859k824902k273567k577959
$$ 66994091 63305050 59621912 56300220 53258062 50166203 47341301 45067734 42489775
16685D2489775j942383k034109j933395j609279j374139j996867j238239j519241
$$ 42489775 40547392 38513283 36579888 34970609 33596470 31599603 30361364 28842123
16677B8842123j446622o84237j329363j338741o59328j280574m99990r77720q96299
$$ 28842123 27395501 26711264 25381901 24043160 23383832 22103258 21603268 20625548 19729249
16668A9729249r09765j64126r32383m58018j062851l09824o74557n16361k23588
$$ 19729249 18819484 18655358 17722975 17264957 16202106 15892282 15217725 14701364 14477776
16659A4477776n77925k68795q40016l11225j81681l59108m37618o24031J3748
$$ 14477776 13899851 13631056 12791040 12479815 12298134 11939026 11501408 10877377 10891125
16650A0891125l36694k19259o14014P608o84921R5153n52531J4090n25829K94100
$$ 10891125 10554431 10335172 9721158 9728766 9043845 9138998 8586467 8600557 8074728 8368828
16640H368828j9963k53697l51515l00177m8304j30933n05899l00753k6231k79870
$$ 8368828 8348865 8095168 7743653 7443476 7395172 7264239 6758340 6457587 6431356 6151486
16630F151486P7342k67924p2919l75598O0247l08672M8856Q7099N4687k21089
$$ 6151486 6228828 5960904 5887985 5512387 5572634 5263962 5312818 5399917 5454604 5233515
16620E233515l29448J58677l4940n51587L59681k73775k82254j16279O6520m1948
$$ 5233515 4904067 5062744 5027804 4476217 4835898 4562123 4279869 4163590 4230110 4188162
16610D188162K23686n83540R2965l3910j33558J01855m25987J72888J60227n18127
$$ 4188162 4411848 3828308 3921273 3887363 3753805 3855660 3429673 3602561 3762788 3244661
16600C244661R8597k57783L0647j06174N6390L7766j33611l3670l00526L41627
$$ 3244661 3343258 3085475 3116122 3009948 3066338 3104104 2970493 2936823 2636297 2977924
16590B977924l51469J79469q4240q3294J79565J43499o98781K55346j27052K99521
$$ 2977924 2626455 2805924 2721684 2638390 2817955 2961454 2262673 2518019 2390967 2690488
16580B690488o09766L68562m84621L88151p1070m10668L93172j87353J13564k79799
$$ 2690488 2080722 2449284 1964663 2352814 2281744 1871076 2264248 2076895 2190459 1910660
16570A910660K19011k14045l5600L94137l70543O4769j053J0140j99117j87302
$$ 1910660 2129671 1915626 1880026 2274163 1903620 1968389 1967336 1977476 1778359 1591057
16560A591057K85912q9443J30200k66563r8526o7367L84706j74378q0764o6753
$$ 1591057 1876969 1787526 1917726 1651163 1552637 1485270 1869976 1695598 1614834 1548081
16550A548081o9038K30048j30689j14177j19104P3888k51730K55137J26523j36409
$$ 1548081 1479043 1709091 1578402 1464225 1345121 1419009 1167279 1422416 1548939 1412530
16540A412530r2843l44521J57539L91660j50103K46348j99260q0113J76570m47374
$$ 1412530 1319687 975166 1132705 1524365 1374262 1620610 1421350 1341237 1517807 1070433
16530A070433L75395l31860J87903J31562l13698J05100l54726M23466k81649
$$ 1070433 1445828 1113968 1301871 1433433 1119735 1224835 870109 1293575 1011926
16521A011926r6738J27717J57486j17055K93591F61962K60380J95023j70957K51686
$$ 1011926 915188 1042905 1200391 1083336 1376927 661962 922342 1117365 946408 1198094
16511A198094l93813Q7887K30324k47170N21184l31267r8190l90941N33731m75284
$$ 1198094 804281 892168 1122492 875322 1396506 1065239 967049 576108 1109839 634555
16501F34555J74362J08257j01238J16081l09384Q4317K29941l98608M28722q3571
$$ 634555 808917 917174 815936 932017 622633 706950 936891 538283 967005 883434
16491H83434l62476L18819K17164l10851k781k65970O02825m64777j3653j0026
$$ 883434 520958 839777 1056941 746090 743309 477339 1080164 615387 601734 591708
16481E91708K86294j55098A96697K82940J04060L9171P4970j10933j46578J72845
$$ 591708 878002 722904 196697 479637 583697 622868 697838 586905 440327 613172
16471F13172R2928j95382j09481K19291J29675k88537Q2904J42986C25889L01529
$$ 613172 706100 510718 401237 620528 750203 461666 544570 687556 325889 627418
16461F27418k0088j11433n0234j61049J56145L14216L0368l21718R7270j1043
$$ 627418 607330 495897 445663 284614 440759 754975 785343 463625 560895 549852
16451E49852n2610B03769K03972P6283n3622J02734k34122L59889C15184M80857
$$ 549852 497242 203769 407741 484024 430402 533136 299014 658903 315184 796041
16441G96041B89183G8638M28028m230J14814h331C01867M3739F8862L75760N5384
$$ 796041 289183 78638 506666 502436 617250 -8331 301867 345606 68862 444622 500006
16430E00006l7450j442j05438M1506j72850J07266A02055K08532J91703B00883
$$ 500006 462556 461114 355676 397182 224332 331598 102055 310587 502290 200883
16419F03903j19969m9159q6146j489M2541J92392K5820n2584r6051j4646j47073
$$ 603903 483934 434775 348629 347140 389681 582073 607893 555309 459258 444612 297539
16408B97539L76458C23475n6671K69692J9633A84523K50139A31589K37552p4113
$$ 297539 673997 323475 266804 536496 556129 184523 434662 131589 369141 295028
16398B95028J88571j88963J42811D119M91764j27521j8306O093o6321B9488N03457
$$ 295028 483599 294636 437447 4119 495883 368362 350056 356149 289828 29488 532945
16387E32945j02663A46874L97686k20039j00131L20177j32733A02859N39880j60511
$$ 532945 430282 146874 544560 324521 224390 544567 411834 102859 642739 482228
16377D82228k34402J94564K25780d80G6246K80142A43234M33831k72847f7545
$$ 482228 247826 442390 668170 -480 76246 356388 143234 577065 304218 -67545
16366B88386R112j08109R9903C4411K85249A9383c7527j30366c9074q9438B78728
$$ 288386 297498 189389 289292 34411 319660 19383 -37527 -167893 -39074 -128512 278728
16354G3625L91842d2060l3413D16820B04914J71703N0970j60133L10341k11764
$$ 73625 465467 -42060 -75473 416820 204914 376617 427587 267454 577795 366031
16344C66031H6205a75174A23496a02389b4776C46436A18675Q2708o1238L6568
$$ 366031 86205 -175174 123496 -102389 -24776 346436 118675 201383 140145 176713
16334A76713A7182R8532b30676B89368j3216b37735A66750a6837A14050K93855
$$ 176713 17182 115714 -230676 289368 276152 -237735 166750 -16837 114050 407905
16324D07905A62313K15555J7971j04041A35495C1924O8435L94617H6703R7028
$$ 407905 162313 377868 395839 291798 135495 31924 100359 494976 86703 183731
16314A83731c3686m0871b567A46403R3581J37260A50382Q1651B0174e9908H5086
$$ 183731 -33686 -74557 -2567 146403 239984 377244 150382 232033 20174 -59908 85086
16302C13001b0575A65751F6728J67235m8187k3275l3145J19889P4181A20401h2599
$$ 313001 -20575 165751 66728 233963 185776 162501 129356 249245 323426 120401 -82599
16290F66763g5258B31185P8406j35470q1110j4254l4077K31972p3305A0092J01967
$$ 666763 -75258 231185 309591 174121 93011 78757 44680 276652 203347 10092 112059
16279A12059J1143K8850B6556M6726d9521G2372a54290B88963k3801j04895O4989
$$ 112059 123202 152052 26556 73282 -49521 72372 -154290 288963 265162 160267 225256
16268B25256K13541a79309B9337J25967R3146J8254b1213j15801C5545h3736C34021
$$ 225256 438797 -179309 29337 155304 248450 266704 -21213 -137014 35545 -83736 334021
16256C2945R0475C8985P5394c0673B46034g3026j2452B92753H6760b12455G7519
$$ 32945 123420 38985 114379 -30673 246034 -73026 -85478 292753 86760 -212455 77519
16244A4902J03855a14847J5571k840B62810C0068J43828C833h6424L9936I6114
$$ 14902 118757 -114847 -99276 -102116 262810 30068 173896 3833 -86424 -46488 96114
16232D27655j26516j02308b1130A56011d2554B66465b61666D9861b7865j04755
$$ 427655 301139 198831 -21130 156011 -42554 266465 -261666 49861 -27865 -132620
16222a32620A64385c69085a32205r9608A68585J08244n9212a08817C16154j45831
$$ -132620 164385 -369085 -132205 -231813 168585 276829 217617 -108817 316154 170323
16212A70323F4075b04970a4611l9138I6605C6872e1081H0782J9644m890P6971
$$ 170323 64075 -204970 -14611 -53749 96605 36872 -51081 80782 100426 95536 172507
16201A72507G2175L94446a62657F3649J29166d9642j08441K7337G4463p170N0646
$$ 172507 72175 466621 -162657 63649 192815 -49642 -158083 -130746 74463 67293 117939
16190A17939a50593H3950e9907h849G6295K4739P7636e1323l56644H6765j1227
$$ 117939 -150593 83950 -59907 -8849 76295 101034 178670 -51323 -407967 86765 75538
16179G5538b57825h5146A35889F2784K79811A35624K27404a6512j6551A43728
$$ 75538 -257825 -85146 135889 62784 342595 135624 363028 -16512 -33063 143728
16168B0609J93285a27676k26450g2093k5095m7875j83709I192e6021B9765L0896
$$ 20609 213894 -127676 -354126 -72093 -97188 -145063 -328772 9192 -56021 29765 60661
16157F0661a40799b9791A3866Q5236C7118a36080A38075n8290J79789a54453A43659
$$ 60661 -140799 -29791 13866 99102 37118 -136080 138075 79785 259574 -154453 143659
16145A20795J93166k8380b2610C294M29789A51209N2272a23353A05335c06172
$$ 120795 313961 285581 -22610 3294 433083 151209 203481 -123353 105335 -306172
16134B42193B4949M7303k4865J76480c2121j96875Q0284A12718a21186C4406K9741
$$ 242193 24949 72252 47387 223867 -32121 -228996 -148712 112718 -121186 34406 64147
16123F4147h3016k29754b5914B22717n388n9819j1788R0624I2390R4443A308a72135
$$ 64147 -83016 -312770 -25914 222717 217329 157510 145722 236346 92390 186833 1308 -172135
16110A5370L1870A2964d225p7224j63530a2942E9049J18791m8732m2380O1177
$$ 15370 47240 12964 -4225 -81449 -244979 -12942 59049 177840 129108 86728 147905
16099A47905F6045R5694b2871A94043h8998A0384d3314r332k22662d7480E8824
$$ 147905 66045 161739 -22871 194043 -88998 10384 -43314 -52646 -275308 -47480 58824
16087A31951n7428d06807c0104A87851e9193D9654b74720J09213k2793C03971
$$ 131951 74523 -406807 -30104 187851 -59193 49654 -274720 -165507 -188300 303971
16076c49026e5395k7939k0489E3293K14180B6282b58635B01590b16411e7427j93
$$ -349026 -55395 -83334 -103823 53293 267473 26282 -258635 201590 -216411 -57427 -57620
16065e7620A57849b43023d3488B01879d0885B12958c4134l54592B4243c8017k26833
$$ -57620 157849 -243023 -43488 201879 -40885 212958 -34134 -388726 24243 -38017 -264850
16054b64850A51804f1109n512J9458j81359B47153E0172i1583j27642B4135i8238
$$ -264850 151804 -61109 -66621 -47163 -228522 247153 50172 -91583 -219225 24135 -98238
16042A36943J83073E0004Q4435K0529n2820a70111a7585r9309A52219b07787j37643
$$ 136943 320016 50004 134439 154968 102148 -170111 -17585 -116894 152219 -207787 -345430
16031c45430A02322a00664p8202h9090A50261L3597D3497f2915G6882j2049M25503
$$ -345430 102322 -100664 -178866 -89090 150261 183858 43497 -62915 76882 64833 490336
16020D90336A04299a13665B03980C7296K03480F0220h8056l37241A2267P2789
$$ 490336 104299 -113665 203980 37296 240776 60220 -88056 -425297 12267 85056
16010H5056c93772C0594h1997I850K20769A4629a64845K2163I2804q010J541l188
$$ 85056 -393772 30594 -81997 9850 230619 14629 -164845 -142682 92804 84794 86335 83147
15998H3147K01640H3783L22741a56515B35570b47423I0735b74589A35702l9041
$$ 83147 284787 83783 406524 -156515 235570 -247423 90735 -274589 135702 96661
15988I6661J12525d378B76245a78657q1225I7293o948R8856O1953q6330J63562
$$ 96661 209186 -4378 276245 -178657 -259882 97293 90345 189201 251154 164824 328386
15977C28386A29383b3033A1982R2885c18467A69241f0257k50205H6564h2847a3248
$$ 328386 129383 -23033 11982 104867 -318467 169241 -60257 -310462 86564 -82847 -13248
15965a17200A47091c19134B54Q4363h8550p7434f9689l3265j3031F0577R9708
$$ -117200 147091 -319134 254 84617 -88550 -165984 -69689 -102954 -115985 60577 160285
15954A60285a21753a7349A0737a28823J6066B07520b26718A8395a3347l35896
$$ 160285 -121753 -17349 10737 -128823 -112757 207520 -226718 18395 -13347 -349243
15944c49243A59657J35087b86503c1754j53732j31717D111a64921j24782O5994
$$ -349243 159657 294744 -286503 -31754 -185486 -317203 4111 -164921 -289703 -223709
15934b23709M9880B5648L99954A45864k9905L2078i0309k8973G2726J18301I2593
$$ -223709 -173829 25648 425602 145864 115959 148037 -90309 -119282 72726 191027 92593
15922b32647K4418J01435M6971A08290g1301k51690A76800n518F8361c04503F8416
$$ -232647 -208229 -106794 -59823 108290 -71301 -322991 176800 171282 68361 -304503 68416
15910a62019B00267c24772g0975l0707E0528a73431A6291a03208A21391i9831
$$ -162019 200267 -324772 -70975 -101682 50528 -173431 16291 -103208 121391 -99831
15899E8115J77470b86297R597k0504I6002a37775b1960A13841A969a82511C09704
$$ 58115 235585 -286297 -276700 -297204 96002 -137775 -21960 113841 1969 -182511 309704
15887a17411G023J33303C8789b2516D78190g2051J370A81229b08091A09657g3478
$$ -117411 7023 140326 38789 -22516 478190 -72051 -70681 181229 -208091 109657 -73478
15875b92303e1777l9175J9802A08798c17495B74137e9928A3289b64126G8864A3654
$$ -292303 -51777 -90952 -71150 108798 -317495 274137 -59928 13289 -264126 78864 13654
15863b29591Q4744G3583i090j19843e4536A22756b37125A784a29676o4197A24417
$$ -229591 -144847 73583 -9090 -128933 -54536 122756 -237125 1784 -129676 -193873 124417
15851c3820C2301c12495B776K90183a58004j19714D911K9812G291J84901Q4235
$$ -33820 32301 -312495 2776 292959 -158004 -277718 4911 34723 7291 192192 276427
15840B76427H8788a52529k80628O8666f4940n5342B80220a78415g3666A46351
$$ 276427 88788 -152529 -433157 -364491 -64940 -120282 280220 -178415 -73666 146351
15829b73589d5893A98942b95017B02337e2947p9164A36536L1020b19187C4754
$$ -273589 -45893 198942 -295017 202337 -52947 -132111 136536 167556 -219187 34754
15818D0500M3255b56102R1153e9486j75734j66972i9955A68692a19065c6174A37875
$$ 40500 83755 -256102 -164949 -59486 -235220 -402192 -99955 168692 -119065 -36174 137875
15806A7072Q6139j2259g4075A00376a31969B1890J2544j2425g9706n7477I0600
$$ 17072 103211 90952 -74075 100376 -131969 21890 34434 22009 -79706 -137183 90600
15794B63989A19852a72489c1771l36623A55430F8474J38664O039d203l22816J57519
$$ 263989 119852 -172489 -31771 -368394 155430 68474 207138 213177 -4203 -327019 -169500
15783a69500B26021O4847P927a85555B21399a13453l9833k2747A16281e7215k82964
$$ -169500 226021 290868 298795 -185555 221399 -113453 -153286 -176033 116281 -57215 -340179
15772c40179K2647G3573e80913C56119j56997f04074c3423B19155E9559h5959
$$ -340179 -317532 73573 -580913 356119 199122 -604074 -33423 219155 59559 -85959
15761g9273C2501c9320j8324B50156M1638g892r1608j8779n4813A17177J64259
$$ -79273 32501 -39320 -57644 250156 291794 -7892 -99500 -118279 -173092 117177 281436
15750B81436b437C27183a58191B7113d9163A51408n7810K08411E6215J27767k136
$$ 281436 -2437 327183 -158191 27113 -49163 151408 93598 302009 56215 183982 181846
15739A81846D7300b27284d4738q3062G5247a03760r5718B1791J290J4776J40572
$$ 181846 47300 -227284 -44738 -127800 75247 -103760 -199478 21791 23081 37857 178429
15728A78429a47003o7109O2202k42440a13178C27079A29311m8035C824f6305j28458
$$ 178429 -147003 -214112 -151910 -394350 -113178 327079 129311 81276 3824 -66305 -194763
15717a94763h8698A4079b82716G0011c57117H315K13571c30673A76712K8419j02123
$$ -194763 -88698 14079 -282716 70011 -357117 8315 221886 -330673 176712 205131 103008
15706A03008c11451D3495a63063A35871M9277b40834C06743d2686j62704I5037
$$ 103008 -311451 43495 -163063 135871 185148 -240834 306743 -42686 -205390 95037
15695d5561E6681J20452b7539k01311A95715L6399c5217G6290f0248A91286L5228
$$ -45561 56681 177133 -27539 -228850 195715 232114 -35217 76290 -60248 191286 226514
15684B26514g681k34521Q757C0269D039K2448b60512H9349L0867a52482C1403
$$ 226514 -7681 -242202 -233445 30269 4039 26487 -260512 89349 120216 -152482 31403
15672B49563A20015a52786D02321a39798c9310B47062C3699a62157c902H5627
$$ 249563 120015 -152786 402321 -139798 -39310 247062 33699 -162157 -3902 85627
15661A73239g0081j10008n7509C01054e17876a12053C9888d4330k17010c6913
$$ 173239 -70081 -180089 -237598 301054 -517876 -112053 39888 -44330 -261340 -36913
15650a40029G5445K7403M4723d2763j67713a884E8651g2932A3162c91781h5400
$$ -140029 75445 102848 147571 -42763 -210476 -1884 58651 -72932 13162 -391781 -85400
15638A221K51986a44008G3405a69947O5211B28850c13763G6868L49510b56206
$$ 1221 253207 -144008 73405 -169947 -104736 228850 -313763 76868 426378 -256206
15627h9676A93790K4286f5979c1962C49236C5094a53757G1937j8966b09623J6386
$$ -89676 193790 218076 -65979 -31962 349236 35094 -153757 71937 52971 -209623 -193237
15616a93237r5578D3665O0803J940m7071a33993F1436a32586N9782E779L12805
$$ -193237 -288815 43665 104468 106408 59337 -133993 61436 -132586 -72804 5779 318584
15605C18584b33858B225h2770C4050q380J23410E5507a14131A54275i8626e189
$$ 318584 -233858 2225 -82770 34050 25670 149080 55507 -114131 154275 -98626 -5189
15593G7566f5900A6551c3191B63962m8867h0736j7604j28286r9906D18754O1773
$$ 77566 -65900 16551 -33191 263962 215095 -80736 -98340 -226626 -326532 418754 480527
15582D80527e2076D2010d03157a29788e6635B01045a07249A35902Q685a21854
$$ 480527 -52076 42010 -403157 -129788 -56635 201045 -107249 135902 144587 -121854
15571B841a63458d2350B13995A1366E074M701h8880p1577J9152G2726A9403M2280
$$ 2841 -163458 -42350 213995 11366 5074 9775 -88880 -160457 -141305 72726 19403 61683
15559F1683g9669A51340c09968B85701g9541D5141J6361b53009A42979b10436
$$ 61683 -79669 151340 -309968 285701 -79541 45141 61502 -253009 142979 -210436
15548B6476c25625J33698B41593b08288L8424k09281A19123e5272l47749d2591
$$ 26476 -325625 -191927 241593 -208288 -169864 -379145 119123 -55272 -403021 -42591
15537g2377a4994I9906J78941a32825a0966A06435i239p8484l67520g2801A66497
$$ -72377 -14994 99906 278847 -132825 -10966 106435 -9239 -87723 -455243 -72801 166497
15525A35234a62609E8551e5065A0440f4197l443B25360c1116j17988B38290m0836
$$ 135234 -162609 58551 -55065 10440 -64197 -67640 225360 -31116 -149104 238290 197454
15514A97454Q6082a76924I042L63898A47091d4197k3113B42264c5870k21707J00266
$$ 197454 283536 -176924 9042 372940 147091 -44197 -67310 242264 -35870 -257577 -157311
15503a57311A13530b85915k7134F7339M27398A43214a92690J4429q1649i3974
$$ -157311 113530 -285915 -313049 67339 494737 143214 -192690 -178261 -259910 -93974
15492D2969P7798b91799B6992d9174A50983c1420l29880c5637j37040A21130C8739
$$ 42969 120767 -291799 26992 -49174 150983 -31420 -361300 -35637 -172677 121130 38739
15480g5061j03055A67730e8155A15860C4360b61364A12635J66363N5512c2426
$$ -75061 -178116 167730 -58155 115860 34360 -261364 112635 278998 334510 -32426
15469B0284Q682b14934A52639g8392B1715J73685a3076l1798A51471e722C6587
$$ 20284 28966 -214934 152639 -78392 21715 195400 -13076 -44874 151471 -5722 36587
15457a41738c2858C05496h3576A08371a74854R965C6373d57337b15712B9623a14759
$$ -141738 -32858 305496 -83576 108371 -174854 -164889 36373 -457337 -215712 29623 -114759
15445A69971a03345F5457i4444A48397k3197b27837f1724A06231f6495f946J465
$$ 169971 -103345 65457 -94444 148397 125200 -227837 -61724 106231 -66495 -6946 -5481
15434e481H5249i3045B6371b0202j24525M9079m7988j12763I3206b07371h5157
$$ -5481 85249 -93045 26371 -20202 -144727 -95648 -143636 -256399 93206 -207371 -85157
15422B58374M02553E7310e9658C1511c80922J70639b7247F3902c6724j10810h352
$$ 258374 660927 57310 -59658 31511 -380922 -210283 -27247 63902 -36724 -147534 -8352
15410i4718A58506c64631c174C8780g6626P29F2212J76700c8582o6442l42280
$$ -94718 158506 -364631 -3174 38780 -76626 -75897 62212 238912 -38582 -105024 -447304
15399d47304A06570J18261a85802h8654c9944B01153J28973a19801J4405A49512
$$ -447304 106570 224831 -185802 -88654 -39944 201153 330126 -119801 -105396 149512
15388F9217A4639d1440I9383c40544d1027N375F4400b54712J3926C3748B479N7855
$$ 69217 14639 -41440 99383 -340544 -41027 -35652 64400 -254712 -240786 33748 2479 60334
15376F0334k6868g6786d561k22972B23635c10070E2555b27698J8254c1583a3232
$$ 60334 33466 -76786 -4561 -227533 223635 -310070 52555 -227698 -209444 -31583 -13232
15364a89358k3099e2671A93814a6547B05640l3869a08356B69358i3604B07904
$$ -189358 -212457 -52671 193814 -16547 205640 171771 -108356 269358 -93604 207904
15353A45323D4213O0583h8588A76847n6629b49105B17245A3757g8559D0030g3314
$$ 145323 44213 104796 -88588 176847 120218 -249105 217245 13757 -78559 40030 -73314
15341B50553A11898l2602q606i2679k63963P9248a20413n411H1927N4996P6122
$$ 250553 111898 79296 70690 -92679 -356642 -277394 -120413 -125824 81927 136923 213045
15330B13045a79043j2682b8575k60856F0586A411J98583h1113L6408G63K09783
$$ 213045 -179043 -191725 -28575 -289431 60586 1411 199994 -81113 -44705 763 210546
15319B10546d4764B92195g5672A38352a4256B06163p2142c2770A06971J06496
$$ 210546 -44764 292195 -75672 138352 -14256 206163 134021 -32770 106971 213467
15309B13467a33353j43437g2666l3533m27675i1235q5114Q2219L4889C74909h9516
$$ 213467 -133353 -276790 -72666 -106199 -533874 -91235 -176349 -94130 -59241 374909 -89516
15297A2074a37992B97103P3321a8383B07080A7720M43463A05536J95316c04223
$$ 12074 -137992 297103 370424 -18383 207080 17720 461183 105536 300852 -304223
15286I2999b48754a1710j048j8110I212L10375a68307A64171D5514a10609I3699
$$ 92999 -248754 -11710 -12758 -30868 9212 319587 -168307 164171 45514 -110609 93699
15274a81089B71793p5992H407R8354B2640J21316J34844D2691g4491b4042j30399
$$ -181089 271793 195801 8407 106761 22640 143956 278800 42691 -74491 -24042 -154441
15263a54441A12197K39981o4328a88919C30693n5408m8523M676I4774j811J64384
$$ -154441 112197 352178 287850 -188919 330693 275285 226762 231438 94774 92963 257347
15252B57347e7132B88747N2925j48640M88864L36820J91874n2844k29521C20582
$$ 257347 -57132 288747 341672 193032 681896 1018716 1210590 1157746 928225 320582
15241C28396i7781C12655B4865a20890N716A15852H442L51946j78696C4460c8641
$$ 328396 -97781 312655 24865 -120890 -115174 115852 8442 360388 181692 34460 -38641
15229C23997a68381A36671n325P5238C414K57138q7922F890N7284i9008A20167
$$ 323997 -168381 136671 131346 206584 3414 260552 172630 6890 64174 -99008 120167
15217C49591j71313J05782p9367b0982C03744c45071C9400a806A4076K31198j3110
$$ 349591 178278 284060 204693 -20982 303744 -345071 39400 -1806 14076 245274 232164
15206B32164h4246B62513q1400a55183P5983C46974a8510A59348F7554f5769A1895
$$ 232164 -84246 262513 181113 -155183 -79200 346974 -18510 159348 67554 -65769 11895
15194h766l73177A96859o750J82987A39354b91925A39243n2640f8560G9690a4899
$$ -8766 -381943 196859 190109 373096 139354 -291925 139243 86603 -68560 79690 -14899
15182a48481b4693A49436J03156c16129g0259D6513d7780D3958J14134a2444k5091
$$ -148481 -24693 149436 252592 -316129 -70259 46513 -47780 43958 158092 -12444 -37535
15171c7535B28282A8778J31895a13670a2893j91175E3650a09498A54510b4248
$$ -37535 228282 18778 150673 -113670 -12893 -204068 53650 -109498 154510 -24248
15160A13106m2186R7713b12814B05897p4985L24956J2223d3233A42106N9165C8665
$$ 113106 70920 168633 -212814 205897 130912 455868 468091 -43233 142106 201271 38665
15148b0335B26006a59351B08059b22083C20363j03368H3565K87416c6740o4106
$$ -20335 226006 -159351 208059 -222083 320363 216995 83565 370981 -36740 -100846
15138a00846A23017N7268J92162H917b1827N084A025O3404c1791E35524A25928
$$ -100846 123017 180285 372447 8917 -21827 -16743 1025 64429 -31791 535524 125928
15126i107B70998A13580J1014L19440e3606C29358A63231j6794P7229J48806A33340
$$ -9107 270998 113580 124594 444034 -53606 329358 163231 146437 223666 372472 133340
15114A05765J15432J17119r0989a47967B49026E3772c19794A19120A9722K99049
$$ 105765 221197 338316 247327 -147967 249026 53772 -319794 119120 19722 318771
15104C18771j23333f0049I2299a8291j3028j6066A64901d03521b8288C19565A20117
$$ 318771 195438 -60049 92299 -18291 -31319 -47385 164901 -403521 -28288 319565 120117
15092E00912B11358p1832A1929J89026P7700K014j03550a17797C32472a35212
$$ 500912 211358 139526 11929 200955 278655 280669 177119 -117797 332472 -135212
15081h4640a7720j57608F8958P1007K25210A52244c27110B30504C9742K23171
$$ -84640 -17720 -175328 68958 139965 365175 152244 -327110 230504 39742 262913
15071B62913D6765N9661K61653H0327K8338J93436f7573C99952o1935J09113d17845
$$ 262913 46765 106426 368079 80327 108665 302101 -67573 399952 338017 447130 -417845
15059B61835i4785E2058J88793B6207J03780J70080L2993j46140a19778A99724
$$ 261835 -94785 52058 240851 26207 129987 300067 333060 186920 -119778 199724
15048C79439j21506d3167p1891B08571f1362D60988j81624R207j18615L00838
$$ 379439 257933 -43167 -115058 208571 -61362 460988 279364 288571 169956 470794
15038D70794b54698A42368a16849B3465J18977K05282I3334D3416J35119F5918
$$ 470794 -254698 142368 -116849 23465 142442 347724 93334 43416 178535 65918
15027A62999M7316L56678A95785M4701Q8462C1205J13110b79287E05177B40132
$$ 162999 210315 566993 195785 240486 328948 31205 144315 -279287 505177 240132
15016B1081L41816M0443A9744K52196a12792D33720m3708d0551j03038A43686
$$ 21081 362897 403340 19744 271940 -112792 433720 390012 -40551 -143589 143686
15005A22778E7735M7257K5613o119E5600J28910J6620K70142a79738I3256K83768
$$ 122778 57735 104992 130605 124486 55600 184510 201130 471272 -179738 93256 377024
14994C77024C0908L99892A11798f7976B81209r0393O597N1437a413C65913j8420
$$ 377024 30908 430800 111798 -67976 281209 190816 197413 248850 -1413 365913 347493
14983C47493a0975l3801A87558J97174j75718r0503d7951B05049N8682j15683
$$ 347493 -10975 -44776 187558 384732 209014 118511 -47951 205049 263731 148048
14973A48048K59943F3173a503C74674j3221r9339K43259a83589B16711j2304c1495
$$ 148048 407991 63173 -1503 374674 361453 262114 505373 -183589 216711 204407 -31495
14961D06721c36199D10195n0562A33039j0864L20485q3650K86011j57955k13414
$$ 406721 -336199 410195 359633 133039 122175 442660 359010 645021 487066 273652
14951B73652r8213j151M12072A55707o7696J07334H2816L22490N0498B18082j0192
$$ 273652 175439 174288 586360 155707 88011 195345 82816 405306 455804 218082 207890
14940B07890J55036A49040K13412A72635Q429L32940A91313J84783L6726q2552
$$ 207890 362926 149040 362452 172635 181064 514004 191313 376096 412822 330270
14930C30270a80896B31816J49302K9148j69477A1258J57971b7965C01544C291
$$ 330270 -180896 231816 381118 410266 240789 11258 169229 -27965 301544 3291
14919D19821J04576B52076K67280k38885b92723E65601A36041L52841P4169C9372
$$ 419821 524397 252076 519356 280471 -292723 565601 136041 488882 563051 39372
14908H07129l85434j19518N974J16670l8458J44571A00423J41135B6783M24564
$$ 807129 421695 302177 308151 424821 386363 530934 100423 241558 26783 451347
14898D51347k16575I3977K19435K3688A59019P2891K07544A50937J1023K26485
$$ 451347 234772 93977 313412 337100 159019 231910 439454 150937 161960 388445
14888C88445A02923M22705B04521o6880M63263B39113L59249B61529J62418j10507
$$ 388445 102923 525628 204521 137641 600904 239113 598362 261529 423947 313440
14878C13440l4921R5638J45518C5647N04889B60748M374K78958q8154A52872E6335
$$ 313440 278519 374157 519675 35647 540536 260748 265122 544080 455926 152872 56335
14866D11680L7856j54680J27858A54474K15883j51790J35646h8670C68626P1788
$$ 411680 449536 294856 422714 154474 370357 218567 354213 -88670 368626 440414
14856D40414j7869j25943J78863k19447m2471M19311k22877l5669j49832K58919
$$ 440414 422545 296602 475465 256018 213547 632858 409981 374312 224480 483399
14846D83399k04316L04702r2528J40650K9491A82520L31248o0911A24121K26377
$$ 483399 279083 583785 491257 631907 661398 182520 513768 452857 124121 350498
14836C50498A39889K89554R639j08041K50470J95506k10589F5935L54974p5752
$$ 350498 139889 429443 439082 331041 581511 777017 566428 65935 420909 345157
14826C45157R0428M26363C34368A07347K57538j04537J86859L1296j4453n9751
$$ 345157 435585 861948 334368 107347 364885 260348 447207 478503 464050 404299
14816D04299k2106J68481A06094K51399M35113C71061M2152L73402j40809k16980
$$ 404299 382193 550674 106094 357493 792606 371061 413213 786615 645806 428826
14806D28826L52160C87842K76309j81892j7778r103J20045j50291m8432M51133
$$ 428826 780986 387842 664151 482259 464481 455378 575423 425132 376700 827833
14796H27833C49711J38740p9189K50371k48844P3725r3913K23497j14527m5317
$$ 827833 349711 488451 409262 659633 410789 484514 390601 614098 499571 454254
14786D54254M19816N5581m06301K59509B12216L64911K51100C83122L93569l62542
$$ 454254 874070 929651 523350 782859 212216 577127 828227 383122 776691 414149
14776D14149R9210j09100J77472r7051k285k14146N6438J52279A78789K45935
$$ 414149 513359 404259 581731 484680 482395 268249 324687 476966 178789 424724
14766D24724O6525L48468j44128j73454p8577L99117l61710J60805J70397k38283
$$ 424724 491249 839717 695589 522135 443558 842675 480965 641770 812167 573884
14756E73884K44838C08651M76292j74236J41611k59740K97219N0204l33473L35261
$$ 573884 818722 308651 784943 610707 752318 492578 789797 840001 506528 841789
14746H41789l15186k6356j36159K47731K7202J31975k28898K06589Q5495p5843
$$ 841789 526603 500247 364088 611819 639021 770996 542098 748687 834182 758339
14736G58339o2074K96241m57284m2186R7641j02846J86811J76344k78310L35801
$$ 758339 696265 992506 535222 493036 590677 487831 674642 850986 572676 908477
14726I08477J92779m64945J0446N4978O3934l4146q9745K45734l89510L75740
$$ 908477 1101256 636311 646757 701735 765669 731523 641778 887512 498002 873742
14716H73742l65432J77153K41667k48498k0916j2380J82208J64738J37027l05983
$$ 873742 508310 685463 927130 678632 657716 645336 827544 992282 1129309 823326
14706H23326p2089r9150J39249l70219M59811l73345M50647j5161R1949j81509
$$ 823326 751237 652087 791336 421117 880928 507583 958230 943069 1035018 853509
14696H53509J14768l77370J95959K22382M9042r9784j68012K83327k02407o9498
$$ 853509 968277 590907 786866 1009248 1058290 958506 790494 1073821 871414 801916
14686H01916R1676M9806j71639K27152Q8527l67673K58188j0361J1769Q2403J68013
$$ 801916 893592 943398 771759 998911 1087438 719765 977953 967592 979361 1061764 1229777
14675A229777m5153n3438l54616J09088K19296N3536p7790M1632J44876l67037
$$ 1229777 1184624 1131186 776570 885658 1104954 1158490 1080700 1122332 1267208 900171
14665I00171l0626K24082Q488Q9483L67318n87240R5330J70048j79275n4288R6532
$$ 900171 869545 1093627 1102115 1191598 1558916 971676 1067006 1237054 1057779 1003491 1100023
14654A100023n7835N4954K05280k95509k7481K48862k26521J53863K2323L3987
$$ 1100023 1042188 1097142 1302422 1006913 979432 1228294 1001773 1155636 1177959 1211946
14644A211946k85916K01937L841L10883q8029p4022J36242k80459j63754L24699
$$ 1211946 926030 1127967 1131808 1442691 1354662 1280640 1416882 1136423 972669 1297368
14634A297368k64854K63468q1738J23308j7626l9786K49570o917l85012K08958
$$ 1297368 1032514 1295982 1214244 1337552 1319926 1280140 1529710 1522793 1137781 1346739
14624A346739M8028j81338J4846j28038J59599l3319K12018j41272J99514K00219
$$ 1346739 1394767 1213429 1228275 1100237 1259836 1226517 1438535 1297263 1496777 1696996
14614A696996l53747J21570J39053k44838J89381j69254K06298p5445o5118J24169
$$ 1696996 1343249 1464819 1603872 1359034 1548415 1379161 1585459 1510014 1444896 1569065
14604A569065j6949R8305M7959R4816l58654K50180k36191J92117K95744m9400
$$ 1569065 1552116 1650421 1698380 1793196 1434542 1684722 1448531 1640648 1936392 1886992
14594A886992j1195k2250l51405J70467q052O2876Q0043K61976n86363K47932
$$ 1886992 1875797 1853547 1502142 1672609 1664557 1727433 1807476 2069452 1483089 1731021
14584A731021J69998N6148Q1254j78569K59523m24488L05080j29720l610K33428
$$ 1731021 1901019 1957167 2038421 1859852 2119375 1694887 1999967 1870247 1866637 2100065
14574B100065K40113k27479Q5172o2425N00461l35098j62751K68037J35414q0859
$$ 2100065 2340178 2112699 2197871 2135446 2635907 2300809 2138058 2406095 2541509 2460650
14564B460650j1301o3340N8226O9438J47109p6657J92611O5849L65259k09650
$$ 2460650 2449349 2386009 2444235 2513673 2660782 2584125 2776736 2842585 3207844 2998194
14554B998194O63738K41766p4047M45790J274819J614834M188874J1456143J7501931
$$ 2998194 3661932 3903698 3829651 4275441 5550260 7165094 11353968 22810111 40312042
14545D0312042l73914j7722795j0777584m938730k366635j069310o13426o56056
$$ 40312042 39938128 22215333 11437749 6499019 4132384 3063074 2449648 1793592
14537A793592M13187k49219M2920k31449m5301L52186j69635n4404K48821M7393
$$ 1793592 2206779 1957560 2000480 1769031 1723730 2075916 1906281 1851877 2100698 2148091
14527B148091o5236L01204l26737O59624n2473l59912R1725N4243J28743k3665
$$ 2148091 2082855 2384059 2057322 2716946 2664473 2304561 2396286 2450529 2579272 2555607
14517B555607l05257J63548M02739m70304L35481j73128J93969J91059k87951
$$ 2555607 2250350 2413898 2816637 2346333 2681814 2508686 2702655 2893714 2605763
14508B605763J49532n313K92661m30652N9503O91199l82634K28070j70883M3265
$$ 2605763 2755295 2749982 3042643 2611991 2671494 3362693 2980059 3208129 3037246 3080511
14498C080511p0321R4755K46711k14501O5256K15021J19203m95607N03663k6284
$$ 3080511 3010190 3104945 3351656 3137155 3202411 3417432 3536635 3041028 3544691 3518407
14488C518407O4228J25437k02028q3084K34065J17751p752j75707J17558J62688
$$ 3518407 3582635 3708072 3506044 3422960 3657025 3774776 3767024 3591317 3708875 3871563
14478C871563J71056m0510K53545k09652j89602J46747J82971j70283J02995L45664
$$ 3871563 4042619 4002109 4255654 4046002 3856400 4003147 4186118 4015835 4118830 4464494
14468D464494m8540P8055J51563L7624m6708J78927k22446L99431j65237n4877
$$ 4464494 4415954 4494009 4645572 4683196 4636488 4815415 4592969 4992400 4827163 4772286
14458D772286K9031K61516N0099N5946j34908J12801J96457k59415M07767K7307
$$ 4772286 4801317 5062833 5112932 5168878 5033970 5146771 5343228 5083813 5491580 5518887
14448E518887k5914j32381J63066J96559K76274m75357O23978j44513p2634K01972
$$ 5518887 5492973 5360592 5523658 5720217 5996491 5521134 6145112 6000599 5927965 6129937
14438F129937O3824K87093L05985l72897K4638M16755j23919R4336r331K20549
$$ 6129937 6193761 6480854 6786839 6413942 6438580 6855335 6731416 6825752 6816421 7036970
14428G036970o1259K91578K87537k99512L05776J71500k25102J54206L19938k8688
$$ 7036970 6975711 7267289 7554826 7255314 7561090 7732590 7507488 7661694 7981632 7952944
14418G952944K08451j09426J35445J34558L70720k30165L15258J93636n5196M84874
$$ 7952944 8161395 8051969 8187414 8321972 8692692 8462527 8777785 8971421 8916225 9401099
14408I401099P3804r6678M45637Q2319l5386N65802j56451P2209o3071L22484
$$ 9401099 9474903 9378225 9823862 9906181 9870795 10436597 10280146 10352355 10289284 10611768
14398A0611768J19318J87922M48983j92403K15327J63658P0049O8247M60518L34018
$$ 10611768 10731086 10919008 11367991 11175588 11390915 11554573 11624622 11692869 12153387 12487405
14388A2487405K1285M90321N56793K3985O8999L45284L37953r1781N93004j40662
$$ 12487405 12508690 12999011 13555804 13579789 13648788 13994072 14332025 14240244 14833248 14692586
14378A4692586M74230N10333r5286O48568K01268L0737P37335L03028M6466M99176
$$ 14692586 15166816 15677149 15581863 16230431 16431699 16462436 17199771 17502799 17549265 18048441
14368A8048441O65364K89664R5289O98519N19412J97952N48747J85538M52678
$$ 18048441 18713805 19003469 19098758 19797277 20316689 20514641 21063388 21248926 21701604
14359B1701604M75536O78558M98238L91499O11482R94822L20009Q65946M13418
$$ 21701604 22177140 22855698 23353936 23745435 24356917 25351739 25671748 26537694 26951112
14350B6951112R30491J75597Q58885P29309R54570O30816J006972M26925R61367
$$ 26951112 27881603 28057200 28916085 29645394 30599964 31230780 32237752 32664677 33626044
14341C3626044J048163Q73701R68505J296951J000254P46527J332902J331433
$$ 33626044 34674207 35547908 36516413 37813364 38813618 39560145 40893047 42224480
14333D2224480J156333J311516J380423J284014J708350J535983J521043J990247
$$ 42224480 43380813 44692329 46072752 47356766 49065116 50601099 52122142 54112389
14325E4112389J414585J518849K370829K345866J932940K302214K610959K671274
$$ 54112389 55526974 57045823 59416652 61762518 63695458 65997672 68608631 71279905
14317G1279905K148505K729683L135604L071052L328315L177577L924918L537313
$$ 71279905 73428410 76158093 79293697 82364749 85693064 88870641 92795559 96332872
14309I6332872M099602M707848M745930M672838M953518N389852N459352O465099
$$ 96332872 100432474 105140322 109886252 114559090 119512608 124902460 130361812 136826911
14301A36826911O148903P270536P010338P752328Q361692Q709935R094571R835349
$$ 136826911 142975814 150246350 157256688 165009016 173370708 182080643 191175214 201010563
14293B01010563J0517447J0922542J1665634J1600781J2748125J2859439J4150558
$$ 201010563 211528010 222450552 234116186 245716967 258465092 271324531 285475089
14286B85475089J3728939J4469253J4688419J5137530J5336349J5334555J4846535
$$ 285475089 299204028 313673281 328361700 343499230 358835579 374170134 389016669
14279C89016669J5019592J4816799J3656188J2496627J1406891R913451P327177
$$ 389016669 404036261 418853060 432509248 445005875 456412766 466326217 473653394
14272D73653394J847409l204631k415230m009270k814436l699151p980782r364455
$$ 473653394 475500803 472296172 469880942 465871672 463057236 459358085 451377303 442012848
14264D42012848r186572j1660372j2135722j3101207j4177725j5995133j6157501
$$ 442012848 432826276 421165904 409030182 395928975 381751250 365756117 349598616
14257C49598616j6828151j6317390j5656360j4627269j4217276j4293962j2900680
$$ 349598616 332770465 316453075 300796715 286169446 271952170 257658208 244757528
14250B44757528j2756017j1751346j1196083j0272542j0132407r216428q468446
$$ 244757528 232001511 220250165 209054082 198781540 188649133 179432705 170964259
14243A70964259q299043p917395p222192p105408o265986n814610n585597n456841
$$ 170964259 162665216 154747821 147525629 140420221 134154235 128339625 122754028 117297187
14235A17297187n141365m826073m507975m243517l688231l824037l898136l281894
$$ 117297187 112155822 107329749 102821774 98578257 94890026 91065989 87167853 83885959
14227H3885959k974436l454012k561324k891827k576350k637728k336052k273315
$$ 83885959 80911523 77457511 74896187 72004360 69428010 66790282 64454230 62180915
14219F2180915j614723k107927k295904j621566j733367j556795j236762j773642
$$ 62180915 60566192 58458265 56162361 54540795 52807428 51250633 50013871 48240229
14211D8240229j228469j910022j066368j281139p07696j157559j385415j087082
$$ 48240229 47011760 45101738 44035370 42754231 42046535 40888976 39503561 38416479
14203C8416479j303122n24306j099078q00590j126461r77965q97794q22021o83818
$$ 38416479 37113357 36589051 35489973 34689383 33562922 32584957 31687163 30865142 30181324
14194C0181324n87291o08334p75859q82158m39209o43210o80665o21203p66014
$$ 30181324 29594033 28985699 28209840 27327682 26888473 26245263 25564598 24943395 24177381
14185B4177381l51232n17948l40194l46411r47907n03936l59565o31764j45940
$$ 24177381 23826149 23308201 22968007 22621596 21673689 21169753 20810188 20178424 20032484
14176B0032484n95258j11342p74455J74043l73349o62191l52018n5007m56198
$$ 20032484 19437226 19325884 18551429 18725472 18352123 17689932 17337914 17282907 16826709
14167A6826709l92801m01292l77647j71087j28469p47981J54613n60828n4774
$$ 16826709 16433908 16032616 15654969 15483882 15355413 14607432 14762045 14201217 14146443
14158A4146443k26382k46110K90m02862k40833j83006o34631M59144n86022j35941
$$ 14146443 13920061 13673951 13674241 13271379 13030546 12847540 12212909 12672053 12086031 11950090
14148A1950090k87133L2516Q7046q19280K91253j51051m71668J9804k43325q1575
$$ 11950090 11662957 11695473 11782519 10963239 11254492 11103441 10631773 10651577 10408252 10326677
14138A0326677r0357j86004m29368R2107J3081k47531k15579k10124l28009N22974
$$ 10326677 10236320 10050316 9620948 9713055 9726136 9478605 9263026 9052902 8724893 9247867
14128I247867n08432j85982L72939k69254l42628k98757M3221n0696O3495m2634
$$ 9247867 8739435 8553453 8926392 8657138 8314510 8015753 8058974 8008278 8071773 8029139
14118H029139m38968N4445l02414N5946j19357O1659q3672l08045l843j10563
$$ 8029139 7590171 7644616 7342202 7398148 7278791 7340450 7256778 6948733 6944890 6834327
14108F834327m69918K19873j05440m3506Q5242J6491l7239l18469J83829k72144
$$ 6834327 6364409 6584282 6478842 6435336 6520578 6537069 6499830 6181361 6365190 6093046
14098F093046k66802K04272j21537l41443L92235m20841J92448k26172o4595M9593
$$ 6093046 5826244 6030516 5908979 5567536 5959771 5538930 5731378 5505206 5440611 5490204
14088E490204n10522L82614o5875m12405n425L90986m33866K7492L5322k07257
$$ 5490204 4979682 5362296 5296421 4884016 4878591 5269577 4835711 4863203 4898525 4691268
14078D691268K62020k8017N5694k01088k16766J11967K95103l62038l35448J5731
$$ 4691268 4953288 4925271 4980965 4779877 4563111 4675078 4970181 4608143 4272695 4288426
14068D288426k44994K99995j20419J74113k69874K93393k98236o7733K17208O7112
$$ 4288426 4043432 4343427 4223008 4397121 4127247 4420640 4122404 4054671 4271879 4338991
14058D338991j5749k40999r2694k45307Q2151J68887o9927j89638J1529l42254
$$ 4338991 4323242 4082243 3989549 3744242 3826393 3995280 3925353 3735715 3747244 3404990
14048C404990O8635Q6649j0763J01785m80550N7946K59591j62885j2001j90854
$$ 3404990 3473625 3560274 3549511 3651296 3170746 3228692 3488283 3325398 3313397 3122543
14038C122543J4209J58396k29839M06691k59666j02490p1315J54719P036J25456
$$ 3122543 3136752 3295148 3065309 3472000 3212334 3109844 3038529 3193248 3200284 3325740
14028C325740l76152n39970M61280J2772N2689k74485J14551m6598l98705J15907
$$ 3325740 2949588 2409618 2870898 2883670 2936359 2661874 2776425 2729827 2331122 2447029
14018B447029l7106N14854k83534k19705J69081P2973K66235n31001j80192N5584
$$ 2447029 2409923 2924777 2641243 2421538 2590619 2663592 2929827 2398826 2218634 2274218
14008B274218J26252m73264M81359O9886j39349j5434l22342K18596K00466k57450
$$ 2274218 2400470 1927206 2408565 2478451 2339102 2323668 2001326 2219922 2420388 2162938
13998B162938j93263K49620Q9447j48721K0679k06467L07313J29827K41299N60173
$$ 2162938 1969675 2219295 2308742 2160021 2180700 1974233 2281546 2411373 2652672 3212845
13988C212845K988384R428564J8662669P465297j5248422j2000030n557216j793314
$$ 3212845 6201229 15629793 34292462 41757759 26509337 14509307 8952091 7158777
13980G158777k128728o05437l29657j009750J31789l69304M7240j86123K16842
$$ 7158777 5030049 4424612 4094955 3085205 3216994 2847690 2894930 2708807 2925649
13971B925649l94262k02109j02188L11794k20397l5387m2935o0646K94957j58860
$$ 2925649 2531387 2329278 2227090 2538884 2318487 2283100 2240165 2179519 2474476 2315616
13961B315616l67273K46131r8924r9728N77601o25584L7241J13377j62781n7831
$$ 2315616 1948343 2194474 2095550 1995822 2573423 1947839 1985080 2098457 1935676 1877845
13951A877845K0194m0688p3319K56046l19655K35983M17703k99646j0079j86275
$$ 1877845 1898039 1857351 1784032 2040078 1720423 1956406 2374109 2074463 2064384 1878109
13941A878109k32620K39925L33873n28299L11535k55495n41788M93656j14120
$$ 1878109 1645489 1885414 2219287 1690988 2002523 1747028 1205240 1698896 1584776
13932A584776K56544P4218l52300K95377j36503L8481K1848J56059m29442K05221
$$ 1584776 1841320 1915538 1563238 1858615 1722112 1760593 1782441 1938500 1509058 1714279
13922A714279l23839J94327j48906m6334P3185l43076N21452l0744J26289k68965
$$ 1714279 1390440 1584767 1435861 1389527 1462712 1119636 1641088 1610344 1736633 1467668
13912A467668o2161K33499j52935j20913O3776j11697P5371k21422P0611K42684
$$ 1467668 1405507 1639006 1486071 1365158 1428934 1317237 1392608 1171186 1241797 1484481
13902A484481j18980J5027o2923p6964J68471j6768p2196r9695j29760P6549J87624
$$ 1484481 1365501 1380528 1317605 1240641 1409112 1392344 1320148 1220453 1090693 1167242 1354866
13891A354866l42311P3919L12363k13407J46469k37827K88610k31425o0413J06496
$$ 1354866 1012555 1086474 1398837 1185430 1331899 1094072 1382682 1151257 1090844 1197340
13881A197340J40811r8199l61429L72021J19835r1366L63735j92446m40046L96589
$$ 1197340 1338151 1239952 878523 1250544 1370379 1279013 1642748 1450302 1010256 1406845
13871A406845l61919k6351r0801K91934K60271m61582j45134K01334m530o4886
$$ 1406845 1044926 1018575 927774 1219708 1479979 1018397 873263 1074597 1070067 1005181
13861A005181P749R0825r6804J0000K29178j15313J1234k26612J31453j27722
$$ 1005181 1012930 1103755 1006951 1016951 1246129 1130816 1142050 915438 1046891 919169
13851I19169j86299K78208j0388P0593k9191r7825Q7870J84192l30072M28032
$$ 919169 732870 1011078 1000690 1071283 1042092 944267 1032137 1216329 886257 1314289
13841A314289k82248N5007j01768O1160r430L4026J98963l43621q1435K7355j84997
$$ 1314289 1032041 1087048 985280 1046440 1037010 1071036 1269999 926378 844943 872298 687301
13830F87301O76509k3629o43506L44808j78690K71788k63956M06802l19161j95010
$$ 687301 1363810 1340181 696675 1041483 862793 1134581 870625 1277427 958266 763256
13820G63256M06613l86221J85782k18543O8482j65115K6895o8025L36574k76949
$$ 763256 1169869 783648 969430 750887 819369 654254 681149 613124 949698 672749
13810F72749J14805J80784j67811j12932R653J61870l22329J52518K88485k10634
$$ 672749 787554 968338 800527 687595 697248 859118 536789 689307 977792 767158
13800G67158m9640k27528N70858j26094j63070j66492N83008K475j32989M1247
$$ 767158 717518 489990 1060848 934754 771684 605192 1188200 1190675 1057686 1098933
13790A098933l91804M17011l27062k50111n6335P41822E75000L60787j53558k74603
$$ 1098933 707129 1124140 797078 546967 490632 1232454 575000 935787 782229 507626
13780E07626L23496l23359L29743p5257j20560J77339q9601N1689k01233Q8273
$$ 507626 831122 507763 837506 762249 641689 819028 729427 781116 579883 668156
13770F68156Q1273j23106J68942j13631O7196l7127q7565J05937K8646J85950
$$ 668156 749429 626323 795265 681634 748830 711703 624138 730075 758721 944671
13760I44671k96312J52195l79031K26788O2517J88791j75717J10593j8245l03636
$$ 944671 648359 800554 421523 648311 710828 899619 723902 834495 816250 512614
13750E12614L55586j25676j97478P1674J28189j02153k41694M1378j4965N65932
$$ 512614 868200 742524 545046 616720 744909 642756 401062 442440 427475 993407
13740I93407m52976J58339j64987J80608k2192q4342K95236l37682J25743j74646
$$ 993407 540431 698770 533783 714391 692199 607857 903093 565411 691154 516508
13730E16508L75378J3597k34886J95392j84798k15403K85775l23137L91065q3247
$$ 516508 891886 905483 670597 865989 681191 465788 751563 428426 819491 736244
13720G36244C24909J8551K21193P0170j97915L89414k91067J49321j30347j15977
$$ 736244 324909 343460 564653 634823 436908 826322 535255 684576 554229 438252
13710D38252K52189C38629M45424B93813R2353L98511l64232O8597K50401A45815
$$ 438252 690441 338629 784053 293813 386166 784677 420445 489042 739443 145815
13699D23990K09512l0545J05779B80924L33275j00446p0939J07462k08278J28689
$$ 423990 633502 602957 708736 280924 614199 513753 442814 550276 341998 470687
13689D70687J1187P3992J02914j5112N2304R3418j17579j36545N4127k77253L11179
$$ 470687 481874 555866 658780 643668 695972 789390 671811 535266 589393 312140 623319
13678F23319K53362k37131B03687K16725J26412j7302q4082j08075j46557L25665
$$ 623319 876681 639550 203687 420412 546824 529522 445440 337365 190808 516473
13668E16473R5999k25716L25154j48948j70589O6096N82j57161J34331A48550
$$ 516473 612472 386756 711910 562962 392373 458469 459051 301890 436221 148550
13657B08881J68167L39360M5740C24924q090M9853k929Q7837J08004L8558Q4984
$$ 208881 377048 716408 762148 324924 316834 366687 363758 451595 559599 598157 683141
13646F83141J09503B36765J86381J13419k41893K50415B46401J76540J29211j41789
$$ 683141 792644 236765 423146 536565 294672 545087 246401 422941 552152 410363
13636D10363q6443K05752M9315B34493K20068j53934J79499q6214K96870k57066
$$ 410363 323920 529672 578987 234493 454561 300627 480126 393912 690782 433716
13626D33716n5126J07074R832A58779N0930K70854o9448J21467k46566K03675
$$ 433716 378590 485664 495496 158779 209709 480563 411115 532582 286016 489691
13616D89691A40540L43656N34358A41309R0127N6709A05321M48055B24918K64185
$$ 489691 140540 484196 1018554 141309 231436 288145 105321 553376 224918 489103
13606D89103A36329o5999K03339K323P326j35540L58160n0195L3107K7933j58815
$$ 489103 136329 70330 273669 275992 283318 147778 505938 455743 488850 516783 357968
13595C57968L91941A08178K02192J26506J02925q9204A77963P935N32554l20135
$$ 357968 749909 108178 310370 436876 539801 450597 177963 185898 718452 398317
13585C98317q3334r3177L17517A35238J24519L72229l08566m1830A38962J37351
$$ 398317 314983 221806 539323 135238 259757 631986 323420 281590 138962 276313
13575B76313n226r6576P4954K27989A82785K82628A04008L40815a95461B01276
$$ 276313 271087 174511 249465 477454 182785 465413 104008 444823 -195461 201276
13564B27268K3983J96330J50472k96311K65841k25138a3607C93527J31726K8100
$$ 227268 251251 447581 598053 301742 567583 342445 -13607 393527 525253 553353
13554E53353K363j97676n4278K62129c5275B85499J23446f8288B87397M2659I942
$$ 553353 555716 358040 303762 565891 -35275 285499 408945 -68288 287397 330056 9942
13542D58515j4631j38055j6692A41296a01726B14560L18452r6463j72999J61030
$$ 458515 443884 305829 289137 141296 -101726 214560 533012 436549 263550 424580
13532D24580A84231K14074r7561Q1419A62776J85357J90477B00792q6305Q7834
$$ 424580 184231 398305 300744 382163 162776 348133 538610 200792 114487 202321
13522B02321p8738N52128l20638K13159I4216M17721E4461J88219H4936P0217
$$ 202321 123583 675711 355073 568232 94216 511937 54461 242680 84936 155153
13512A55153K8831J22557K0941E0335L47656A28247L4235L74759A99764K14469
$$ 155153 183984 306541 327482 50335 397991 128247 162482 537241 199764 414233
13502D14233r6759k8712K97234n6623D1873K40382n077K31080o2862j62408A40503
$$ 414233 317474 288762 585996 529373 41873 282255 277178 508258 445396 282988 140503
13490I2655M1335F2412c8155F09979B74468a49330B83265q080H0601N4097M19427
$$ 92655 133990 62412 -38155 609979 274468 -149330 283265 275185 80601 134698 554125
13479E54125B23672K87114A54001k274K31936j22051I6917O1275J69291p7304
$$ 554125 223672 510786 154001 151727 383663 261612 96917 158192 327483 250179
13469B50179q1556m6118O4232d3849C03923B6806K16420K7832K0261Q91C9361
$$ 250179 168623 122505 186737 -43849 303923 26806 243226 271058 291319 292210 39361
13457C90332F4825e4873A65313J69898c1471B10685R91p7361N9829a04059A18059
$$ 390332 64825 -54873 165313 335211 -31471 210685 211676 134315 194144 -104059 118059
13445A42532j4784J15982A03019j7105j4877L1997J61615n4182L1496a27314A56918
$$ 142532 127748 243730 103019 85914 71037 103034 264649 210467 241963 -127314 156918
13433B02703J99457j78588c8289E55055B34320F8679C131K6120Q8363L85069m564
$$ 202703 402160 223572 -38289 555055 234320 68679 3131 29251 117614 502683 498119
13422D98119f9609B44698J38469A2996J97583J13830A61032K78460c5996C48393
$$ 498119 -69609 244698 383167 12996 210579 324409 161032 439492 -35996 348393
13411C90854a1877A58145K88773r8332j29850R9573o6828c3373E63808c38619
$$ 390854 -11877 158145 446918 348586 218736 318309 251481 -33373 563808 -338619
13400A61029l9568Q6336q6966M24048A77065R2557j01201n0584K60201n9321j3606
$$ 161029 121461 207797 120831 544879 177065 269622 168421 117837 378038 318717 305111
13389C05111n0664I7740K9007K04435j05944D6185B0599M9283J05001J44018A25806
$$ 305111 254447 97740 126747 331182 225238 46185 20599 69882 174883 318901 125806
13377B25471G6948L89894D3005a32908B00769L33254B51307d159B43540J2361
$$ 225471 76948 466842 43005 -132908 200769 534023 251307 -4159 243540 255901
13367B55901O1287k5253R4907q3721J60057a61078D45870M9184j79038R0540A62210
$$ 255901 317188 291935 386842 303121 463178 -161078 445870 495054 316016 406556 162210
13355B17246n9101C3034J90223a58236F5564M3013L17357e6935B50642M7722k0973
$$ 217246 158145 33034 223257 -158236 65564 108577 425934 -56935 250642 298364 277391
13344B77391l5686r3527N44144B61493j6095j332o8182J58507e4957A91655J14516
$$ 277391 241705 148178 692322 261493 245398 244066 175884 334391 -54957 191655 306171
13333C06171R7143A93252J56829j70890a1199G15232A41444N1593B6632J52144
$$ 306171 403314 193252 350081 179191 -11199 715232 141444 193037 26632 178776
13323A78776k4727J77629E451a0313G4632J67193J73222j09127K29846p1868M5603
$$ 178776 154049 331678 5451 -10313 74632 241825 415047 305920 535766 463898 509501
13312E09501a0692B82172g7866A63551C5825R6314M9R4879M9969c5494o6797D82658
$$ 509501 -10692 282172 -77866 163551 35825 132139 132188 227067 277036 -35494 -102291 482658
13299C57081e6534B65040f637H9837J00866j0412c3411A53851J27677I2481K96090
$$ 357081 -56534 265040 -6637 89837 190703 180291 -33411 153851 281528 92481 388571
13288C88571j63404p2174R2865o4318p1516B6751b967B24749J2474m5980n6706
$$ 388571 225167 152993 245858 181540 110024 26751 -2967 224749 237223 191243 134537
13277A34537j5524C2472a12185B7100d1325C76099A22653D2102K56990I0952P7843
$$ 134537 119013 32472 -112185 27100 -41325 376099 122653 42102 299092 90952 168795
13266A68795p696Q6621G6936P2949a71044E5491K38562a83562A05172g6135B95626
$$ 168795 161099 247720 76936 149885 -171044 55491 294053 -183562 105172 -76135 295626
13254B42344D1099a25362d1616l9514j7950G1634J06674G5503I146L1603b9765
$$ 242344 41099 -125362 -41616 -81130 -99080 71634 178308 75503 9146 40749 -29765
13242D90419F6890L03350A65858J61713J9018A2673J42924A3727c1000a2595A46741
$$ 490419 66890 370240 165858 327571 346589 12673 155597 13727 -31000 -12595 146741
13230a69089G49c8323m6892A01017K79944F2794K53307a19779B27478f6119K4617
$$ -169089 749 -38323 -85215 101017 380961 62794 316101 -119779 227478 -66119 -41502
13219d1502A55099G5453O9824m8963a9437H549a74628A49119b072B70950j244
$$ -41502 155099 75453 145277 96314 -19437 8549 -174628 149119 -2072 270950 269706
13208B69706H2002L91936E9296K48940A51395a43172M2772c127A38762d6462k2717
$$ 269706 82002 473938 59296 308236 151395 -143172 -100400 -3127 138762 -46462 -69179
13197f9179B11985G0347J62392R2220G4749i7575J841A67552a4623B97328R9682
$$ -69179 211985 70347 232739 324959 74749 -97575 -95734 167552 -14623 297328 397010
13186C97010j04383P5533a77124A3980a83094A31153c5646l0184m3453A40241
$$ 397010 292627 368160 -177124 13980 -183094 131153 -35646 -65830 -109283 140241
13175E2380j2008R5011L2895A1419J11808P091a20427C00227G5297C0247L32358
$$ 52380 40372 135383 168278 11419 123227 130318 -120427 300227 75297 30247 362605
13164C62605B7750N0434q232K3132a20138k5423b8608a3798B0383a0228B77823
$$ 362605 27750 78184 69952 93084 -120138 -145561 -28608 -13798 20383 -10228 277823
13152G5305C1386K14959D8481M32856B6740a91472G7975c0699A14168l019a22843
$$ 75305 31386 246345 48481 481337 26740 -191472 77975 -30699 114168 111149 -122843
13140A02323J41793p5855e9152A8798f2407o4741E8919M0813L092A154Q3336c78062
$$ 102323 244116 168261 -59152 18798 -62407 -127148 58919 99732 102824 1154 84490 -378062
13127a68541B61748J77407j59196r2456E6053f4301E8096K56302f2944A76189
$$ -168541 261748 439155 279959 187503 56053 -64301 58096 314398 -62944 176189
13116B33881f6092A8166N7838J09531L5170H3326l9264K83037a19994b750D14794
$$ 233881 -66092 18166 76004 185535 220705 83326 44062 327099 -119994 -2750 414794
13104b9516A32556i9470E7199h0298B02063O6940O2000c5321A9514b0609k1077
$$ -29516 132556 -99470 57199 -80298 202063 269003 331003 -35321 19514 -20609 -41686
13093d1686j7591A85962J43434j09590n8984A8287J76277m6892b5065A48277M29391
$$ -41686 -59277 185962 329396 219806 160822 18287 194564 147672 -25065 148277 577668
13082E77668C0429M2905k1723M8098e3056K1742B15268F5651M4326a79904g4080
$$ 577668 30429 73334 51611 99709 -53056 -31314 215268 65651 109977 -179904 -74080
13070H1314a30214A51990P493C0039A1567L27900C8141J62555l2034b2302B71590
$$ 81314 -130214 151990 159483 30039 11567 339467 38141 200696 168662 -22302 271590
13058A50814e6653A14311g4255J3015C23395G9184J52325J33318e0119i332H9669
$$ 150814 -56653 114311 -74255 -61240 323395 79184 231509 364827 -50119 -9332 89669
13046H5284J15138o2382f7861G435f1698B31880B982L10503A39260J57959a18078
$$ 85284 200422 138040 -67861 7435 -61698 231880 2982 313485 139260 297219 -118078
13034C38987k0240g7129c3321j378a2493n7495B78605k1657b31777A44295e0023
$$ 338987 318747 -77129 -33321 -34699 -12493 -69988 278605 256948 -231777 144295 -50023
13022A73199a25425a1827A25407g1644A54836B4801L68873i6888q6923B70634
$$ 173199 -125425 -11827 125407 -71644 154836 24801 393674 -96888 -183811 270634
13011B6558L08815A66362E4012L71947h9496A44590l0730n6204a65420f1910B83188
$$ 26558 335373 166362 54012 425959 -89496 144590 113860 57656 -165420 -61910 283188
12999A18654K6300N8836o2233J35069a61434j0764A65105n5700K14321d97449
$$ 118654 144954 203790 141557 276626 -161434 -172198 165105 109405 323726 -497449
12988A11744J04509C2345f4053A87160K173b72954A19454e4657D60820H8781a14756
$$ 111744 216253 32345 -64053 187160 189333 -272954 119454 -54657 460820 88781 -114756
12976A0965M86465k35268f3517H7412K18382B561J22829a76498N7797J6627k34836
$$ 10965 497430 262162 -63517 87412 305794 2561 125390 -176498 -118701 -102074 -336910
12965c36910C9437K49849O4166o0960F0751i3606a3371A50345D0694M75798b6436
$$ -336910 39437 289286 353452 292492 60751 -93606 -13371 150345 40694 516492 -26436
12953B8196L09961a75465A65753A6732a05259A81296e6913A6904d55838a71081
$$ 28196 338157 -175465 165753 16732 -105259 181296 -56913 16904 -455838 -171081
12942B24203e8012D5129k1665K27164g1436E8641I145K04398A4231b7614L598
$$ 224203 -58012 45129 23464 250628 -71436 58641 9145 213543 14231 -27614 -24016
12931b4016j16199d45A62116J22614b6289A95895H3363E179M2065b29449i981
$$ -24016 -140215 -445 162116 284730 -26289 195895 83363 5179 47244 -229449 -9981
12919A97652h8631A24890J4619B5164H444K09739A03883J05191Q7862A13727a99904
$$ 197652 -88631 124890 139509 25164 8444 218183 103883 209074 296936 113727 -199904
12907i7786B14623f8196A00076K0266P5468a07971A32860K34096c26586a40221
$$ -97786 214623 -68196 100076 120342 195810 -107971 132860 366956 -326586 -140221
12896i184j58204h0656B46279O8439A13942h0736A79861J15230E5653a40006K9435
$$ -9184 -167388 -80656 246279 314718 113942 -80736 179861 295091 55653 -140006 -110571
12885a10571a8810H5658b9846A2885J45083a51720k7682A42029c29207g265p4133
$$ -110571 -18810 85658 -29846 12885 157968 -151720 -179402 142029 -329207 -7265 -81398
12874h1398A32680a05748o0815j79822D8551d4711B38624l9723b4823A88964C0495
$$ -81398 132680 -105748 -166563 -346385 48551 -44711 238624 198901 -24823 188964 30495
12862F3563b3073k20587a04858j17260d1643H8162h3945A34885c12317C33058
$$ 63563 -23073 -243660 -104858 -222118 -41643 88162 -83945 134885 -312317 333058
12851A7035K63700e7946B7314b52961g984A29596d77172D6882F73K44763d0588
$$ 17035 280735 -57946 27314 -252961 -7984 129596 -477172 46882 673 245436 -40588
12839d7316G9473J08369f8790C6159a0812n9933B01646a5856l18401A31097a12336
$$ -47316 79473 187842 -68790 36159 -10812 -70745 201646 -15856 -334257 131097 -112336
12827D7440n639P7598c3160F2996K80086h4574J0313l4298A3042c743k71407C21451
$$ 47440 41801 119399 -33160 62996 343082 -84574 -74261 -108559 13042 -3743 -275150 321451
12814A02550a01691B23429f6459k1323D3458R653b11210E3613j4596a24726a6917
$$ 102550 -101691 223429 -66459 -87782 43458 53111 -211210 53613 39017 -124726 -16917
12802I0967a73020B71672I7366F580J31443Q131d6064C0463d2503B41957k2938
$$ 90967 -173020 271672 97366 6580 138023 146154 -46064 30463 -42503 241957 219019
12791B19019j00279a84248d8044A83542g7255G9876O207k986A0658a17676l40680
$$ 219019 118740 -184248 -48044 183542 -77255 79876 86083 83097 10658 -117676 -458356
12780d58356C68567O4230j95323F382L89600A12504L4898e9182C75304j85953
$$ -458356 368567 432797 237474 6382 395982 112504 147402 -59182 375304 189351
12770A89351E6747c43369Q712A68179H3238A4116a01609B61345A9804J3816N3123
$$ 189351 56747 -343369 -334657 168179 83238 14116 -101609 261345 19804 33620 86743
12759H6743O2669p533f8453A47654a49870o660C9571O0136K59119h6281A39096
$$ 86743 149412 141879 -68453 147654 -149870 -156530 39571 99707 358826 -86281 139096
12747a64018H0496N7084F4970M2925C4167f3215A69507a62865B4071K88525q1098
$$ -164018 80496 137580 64970 107895 34167 -63215 169507 -162865 24071 312596 231498
12736B31498h0622A74204d40433C32401E9190K8484d6988l8782B1600a83270E6546
$$ 231498 -80622 174204 -440433 332401 59190 87674 -46988 -85770 21600 -183270 56546
12724B56378R1636i5124j747A132K14765j00598a42000P354M4444a9860r0076
$$ 256378 348014 -95124 -96871 1132 215897 115299 -142000 -134646 -90202 -19860 -109936
12713a09936E7905J7339J74066A02190O3649K0458K9190J76455d1831D37959c07717
$$ -109936 57905 75244 249310 102190 165839 186297 215487 391942 -41831 437959 -307717
12701E69080j83461A52700i0144c0615G0637a42663N0529k101D95758A2128K60451
$$ 569080 385619 152700 -90144 -30615 70637 -142663 -92134 -94235 495758 12128 272579
12690B72579a59312C76398D4777M8172J98774H8610K12942q8942r3172f5024C70563
$$ 272579 -159312 376398 44777 92949 291723 88610 301552 212610 119438 -65024 370563
12678A39046b57987a6066B68276J42054A46149E7884a06072d9981A70019a81658
$$ 139046 -257987 -16066 268276 410330 146149 57884 -106072 -49981 170019 -181658
12667a83157j49124B29745H6500a11j80119B45913j04940C0980c4378k36009A77380
$$ -183157 -332281 229745 86500 -111 -180230 245913 140973 30980 -34378 -270387 177380
12655C54855j70623j1436J3484a87237a3332E6274L01152D314a02343A39562J2059
$$ 354855 184232 172796 186280 -187237 -13332 56274 357426 4314 -102343 139562 151621
12644A51621D5604J08575m2133a4089j57387q10P2760A1842J89611e5904E40544
$$ 151621 45604 154179 112046 -14089 -171476 -172286 -99526 11842 201453 -55904 540544
12632i0111B7121J50485n758a03600B33894K8176K15413A06689L194Q1150p4781
$$ -90111 27121 177606 171848 -103600 233894 262070 477483 106689 109883 191033 116252
12621A16252f100B59945I9280O4235a31213d3129k5507B9396j1174b69092b4685
$$ 116252 -6100 259945 99280 163515 -131213 -43129 -68636 29396 18222 -269092 -24685
12609h983k05954D10319N0190d3362j41489A80049c4071r7890N4693B72962C1853
$$ -8983 -214937 410319 460509 -43362 -184851 180049 -34071 -131961 -77268 272962 31853
12597C9927Q0989J87524A32215l5116B8979L0528J71250q3276n0662K11219A45325
$$ 39927 120916 308440 132215 97099 28979 59507 230757 147481 96819 308038 145325
12585A24694A626a50188C51767c52148A63631F9866J9460i345k22443e9461j37848
$$ 124694 1626 -150188 351767 -352148 163631 69866 89326 -9345 -231788 -59461 -197309
12574a97309c3256j89266B5041M6900b10969C9906Q7383b2036k11724B84647c751
$$ -197309 -33256 -222522 25041 71941 -210969 39906 127289 -22036 -233760 284647 -3751
12562e6043A88802a55159C7917I118N686h8696H5127J01879F1938B17L08453E830
$$ -56043 188802 -155159 37917 9118 14804 -88696 85127 187006 61938 217 308670 5830
12549B92161F8411B5197J92615a04435B11732r727B2763a79369O643l4345Q6875
$$ 292161 68411 25197 217812 -104435 211732 202005 22763 -179369 -172726 -207071 -120196
12538a20196I0611a44979B67657g5211m7632d0202B48884a96070A35633M5379
$$ -120196 90611 -144979 267657 -75211 -122843 -40202 248884 -196070 135633 181012
12528A81012A0535L66800a58582D09541A62b38682M410j97383C1822K14552a85204
$$ 181012 10535 377335 -158582 409541 162 -238682 -234272 -431655 31822 246374 -185204
12516g0639k45508C69779a82184k33825a21217A60211J4011N2041M7925j22736
$$ -70639 -316147 369779 -182184 -416009 -121217 160211 174222 226263 274188 151452
12506A51452d6728j30859a107D7994P4714L41969b7310A70258c8004j9785A67575
$$ 151452 -46728 -177587 -1107 47994 122708 464677 -27310 170258 -38004 -57789 167575
12494B77728j22127b59354B34313c0264n0954G8051K7322P5523D0622K1408M08692
$$ 277728 155601 -259354 234313 -30264 -81218 78051 105373 180896 40622 62030 470722
12483D70722a11235G8948f9333f454C85760C6195c49986a59412j078j61627h0472
$$ 470722 -111235 78948 -69333 -6454 385760 36195 -349986 -159412 -160490 -322117 -80472
12471a87841A16784d4508l13362B89344L7723D3285d8264H8844a08180d6122n5667
$$ -187841 116784 -44508 -357870 289344 327067 43285 -48264 88844 -108180 -46122 -101789
12460a01789J2455b2061j84050L9730e9384B58878a04622A91062F6814a05656
$$ -101789 -89334 -22061 -206111 -166381 -59384 258878 -104622 191062 66814 -105656
12449D52050b7748j36987A19739K32806a63598B33947A327L358J80603q3798l2337
$$ 452050 -27748 -164735 119739 352545 -163598 233947 1327 4685 185288 101490 69153
12438F9153F506c5025C32773n7497a06908j42748D988K9790K24757d87955J91326
$$ 69153 6506 -35025 332773 275276 -106908 -249656 4988 34778 259535 -487955 -296629
12427b96629D8956K02347n5901K56638D4822H33O2601r951L2634C4317a2989l65224
$$ -296629 48956 251303 195402 452040 44822 833 63434 53483 86117 34317 -12989 -378213
12415c78213A98389b19680b608G929K7628b12175B72087C0158e1233A98353l1833
$$ -378213 198389 -219680 -2608 7929 35557 -212175 272087 30158 -51233 198353 166520
12404A66520a18661A34017f1012E9688M1208A7814J24886E4920a89790Q6805B7685
$$ 166520 -118661 134017 -61012 59688 100896 17814 142700 54920 -189790 -102985 27685
12392a35155J8634A60663m1680D5778J75949J29451a70994d5749c606B54312m6236
$$ -135155 -116521 160663 118983 45778 221727 351178 -170994 -45749 -3606 254312 208076
12381B08076a7562l37581B3151Q3006e9525j716l0615H9294a33484I8071K1112
$$ 208076 -17562 -355143 23151 106157 -59525 -61241 -91856 89294 -133484 98071 119183
12370A19183K7347h9946B07096i5199C0767d0386A70262c92564a65063j32658
$$ 119183 146530 -89946 207096 -95199 30767 -40386 170262 -392564 -165063 -297721
12360b97721B51156C6332P1638b28016O8436B59362k5224h0292j2269A50447a05905
$$ -297721 251156 36332 107970 -228016 -159580 259362 234138 -80292 -92561 150447 -105905
12348a48841c9490l5355A72882L6419J186D0163a49276A46564L9214n219K50266
$$ -148841 -39490 -74845 172882 209301 210487 40163 -149276 146564 185778 180559 430825
12337D30825a72032l0136n7974I0475a32994j42j7484H4663B163J20722m837J08730
$$ 430825 -172032 -202168 -260142 90475 -132994 -133136 -150620 84663 2163 122885 118048 226778
12325B26778D3201j9693M3886b95095C70187a66388A66665o5833N4924n3147b28061
$$ 226778 43201 23508 67394 -295095 370187 -166388 166665 100832 155756 102609 -228061
12313F3454b76636B8073R9104f7862e124C14451l9074l6492G1924J93330b33088
$$ 63454 -276636 28073 127177 -67862 -5124 314451 275377 238885 71924 265254 -233088
12301C0627J47782a91036B66843b323G8796a70035d1846j15408e8645B43531j03845
$$ 30627 178409 -191036 266843 -2323 78796 -170035 -41846 -157254 -58645 243531 139686
12290A39686j5790i8189B32034a94586E79124a97926D60021a49276e5784I9903
$$ 139686 123896 -98189 232034 -194586 579124 -197926 460021 -149276 -55784 99903
12279a59083A63299b9131B56771I5174a98544i8704F67911A89498Q145l0400b9055
$$ -159083 163299 -29131 256771 95174 -198544 -98704 667911 189498 197643 167243 -29055
12267B40455j5151J1335H0954K9749b11800e9251C40479a55717A02781c3065j12132
$$ 240455 225304 236639 80954 110703 -211800 -59251 340479 -155717 102781 -33065 -145197
12256a45197a2794B28734b9068G0666K69220j08316i3967A13467J8966a90125
$$ -145197 -12794 228734 -29068 70666 339886 231570 -93967 113467 132433 -190125
12245a30328A79547l4985F0586g390E272J61332b15235n4485D9453f7320A27733
$$ -130328 179547 144562 60586 -7390 5272 166604 -215235 -269720 49453 -67320 127733
12233E1461f8518E74989j42238e6949C76426j21899J18703D4483J60225R8873
$$ 51461 -68518 574989 432751 -56949 376426 254527 373230 44483 204708 303581
12223C03581A27421N8856L20184b7846E2980e80A14411a6485B74042j16664K04510
$$ 303581 127421 186277 506461 -27846 52980 -580 114411 -16485 274042 157378 361888
12212C61888E6111a14041D34912A90483f6545B51773C0135L85138A69004J27518
$$ 361888 56111 -114041 434912 190483 -66545 251773 30135 415273 169004 296522
12202B96522q041j26949C1935j2327M82940A85424N8391l3281J01797q7527J98182
$$ 296522 288481 161532 31935 19608 502548 185424 243815 210534 312331 224804 422986
12191D22986A87421F9892R8844D4959B1762K3711b08894c1162A86938G3958O0479
$$ 422986 187421 69892 168736 44959 21762 45473 -208894 -31162 186938 73958 134437
12180A34437K37383j10091a34201A04812j8404J03937c8502G9398m547J32079
$$ 134437 371820 261729 -134201 104812 86408 190345 -38502 79398 74851 206930
12170B06930b8424B26258F4039K73924n3223q6229o4309R6762d3695A25989k1306
$$ 206930 -28424 226258 64039 337963 284740 198511 134202 230964 -43695 125989 104683
12159A04683L29509a14490A89124Q4764c6809n0290B42775f9635I1880A1189K42808
$$ 104683 434192 -114490 189124 273888 -36809 -87099 242775 -69635 91880 11189 253997
12148B53997A13614a7013G6365J05524f3736k41649A34409R3294c5264q8114g064
$$ 253997 113614 -17013 76365 181889 -63736 -305385 134409 227703 -35264 -123378 -7064
12136C18500D2J98791H5667b05980a9664B77744F043K95881a150A6726J86262
$$ 318500 42 198833 85667 -205980 -19664 277744 6043 301924 -1150 16726 202988
12125B02988p1639A4888R1140c04385h6487j74492A84112A248a77137B00834a03595
$$ 202988 131349 14888 106028 -304385 -86487 -260979 184112 1248 -177137 200834 -103595
12113f6653Q325r7191E0879L14628c7643A55990b24389i5204E7554b003j79115
$$ -66653 -58328 -155519 50879 365507 -37643 155990 -224389 -95204 57554 -2003 -181118
12102a81118p9994I5069a61261A87612d08562A05148a28508D3464J43088C6308
$$ -181118 -261112 95069 -161261 187612 -408562 105148 -128508 43464 186552 36308
12091a90711q6787Q8826F2407B3427b2822p6119B63399C1746A3737a52127B01669
$$ -190711 -277498 -188672 62407 23427 -22822 -98941 263399 31746 13737 -152127 201669
12079A69592g014C54809J188034J70569m28673C4735L55345j26767a09750k50739
$$ 169592 -7014 354809 1542843 1713412 1284739 34735 390080 263313 -109750 -360489
12069c60489H7962e203r7841a399j4242j6112k18745h935o7147E7900h1911G2572
$$ -360489 87962 -5203 -103044 -1399 -15641 -31753 -250498 -8935 -76082 57900 -81911 72572
12056B27645b430A31509h4084E26576c23681a32783j54558b8503p1434A79899
$$ 227645 -2430 131509 -84084 526576 -323681 -132783 -287341 -28503 -99937 179899
12045B72478D5665K11803C5736M42649A70867J52067h1610r0166l50239d9804
$$ 272478 45665 257468 35736 478385 170867 322934 -81610 -171776 -522015 -49804
12034A19381e6978k0893k5920B00791B8453P9200L4976d6862E6738m07J01255
$$ 119381 -56978 -77871 -103791 200791 28453 107653 142629 -46862 56738 56331 157586
12023A57586a46008f9422m3698E866a23694A07535r353a46167C936J5491J23233
$$ 157586 -146008 -69422 -113120 5866 -123694 107535 98182 -146167 3936 19427 142660
12012A42660b9352B52473a27879k9194e1250k34486D9950c12313A28620h6540
$$ 142660 -29352 252473 -127879 -157073 -51250 -285736 49950 -312313 128620 -86540
12001B0010c5436A49375r067b72920q9334j8067h6112d932j5491j54463C30455
$$ 20010 -35436 149375 140308 -272920 -362254 -380321 -86112 -4932 -20423 -174886 330455
11989a99475j2418a7582p288l8453F674d9126k0213B62658a57742N4479j00895
$$ -199475 -211893 -17582 -24870 -63323 6674 -49126 -69339 262658 -157742 -103263 -204158
11978b04158B96552a24650M0327B01899g5169j55371C12731A48709b44704h3278
$$ -204158 296552 -124650 -84323 201899 -75169 -230540 312731 148709 -244704 -83278
11967A38553o8n7395d91669C12302A02494i1106o5095j18835B75681a38379B5068
$$ 138553 138485 81090 -491669 312302 102494 -91106 -156201 -275036 275681 -138379 25068
11955g0344C3173K5626J56476l7122i5286o9638c3717j51330e8801l3021R764
$$ -70344 33173 58799 215275 178153 -95286 -164924 -33717 -185047 -58801 -91822 -82058
11944h2058A05253a53924K2895L9177Q38j94706A75488b39513g0844c0470A47805
$$ -82058 105253 -153924 -131029 -91852 -91014 -285720 175488 -239513 -70844 -30470 147805
11932b186C5367N4800a28155k5357E8214c7114A01501c04124A59567K2774F2940
$$ -2186 35367 90167 -128155 -153512 58214 -37114 101501 -304124 159567 182341 62940
11920c91817a18164m8280A82062K297a3137B06614J80048b51795g1791j88473
$$ -391817 -118164 -166444 182062 184359 -13137 206614 386662 -251795 -71791 -260264
11910b60264I1890J94830g8983l16572a21280A03185d3351n2902C5579R4701f6139
$$ -260264 91890 286720 -78983 -395555 -121280 103185 -43351 -96253 35579 130280 -66139
11898i327F4259a34093A68346B6218c8151F9097K88007f1154p3264O0173B67178
$$ -9327 64259 -134093 168346 26218 -38151 69097 357104 -61154 -134418 -74245 267178
11886e1783k7556A08487b80919l7058A86211g4535g772A00205b73199N8764k1217
$$ -51783 -79339 108487 -280919 -317977 186211 -74535 -7772 100205 -273199 -214435 -235652
11875b35652B32665a10601N887p5304B6085B945J7517F509J3661e8768j31342
$$ -235652 232665 -110601 -104714 -180018 26085 2945 20462 6509 20170 -58768 -190110
11864a90110b8250q3406j72205H1279g3591A36349f505C44810H0394N0289N0566
$$ -190110 -28250 -111656 -283861 81279 -73591 136349 -6505 344810 80394 130683 181249
11853A81249b30405A30580M0972a6852m0235B1108P4040J51179f3556b4630j16747
$$ 181249 -230405 130580 171552 -16852 -57087 21108 95148 246327 -63556 -24630 -141377
11842a41377b3832E4752M6841e6472A17013a34545C05469i66G3912L3286c57105
$$ -141377 -23832 54752 101593 -56472 117013 -134545 305469 -966 73912 107198 -357105
11830c39968B1418J39323b33309c0584O690o4648j7963k51276B05573K5534D4840
$$ -339968 21418 160741 -233309 -30584 -23894 -88542 -106505 -357781 205573 231107 44840
11818i1201H6793b01842m3910e434D3373c06064a24734A36211P705F5765B5628
$$ -91201 86793 -201842 -245752 -5434 43373 -306064 -124734 136211 143916 65765 25628
11806i3619l8597j8396A08304a22103n5195k9218D5569g1479E6811c96924C44862
$$ -93619 -132216 -150612 108304 -122103 -177298 -206516 45569 -71479 56811 -396924 344862
11794I6038j9342K37537C52b7899m9122K6965q9053B90459n3516f9095j07055
$$ 96038 76696 314233 352 -27899 -77021 -50056 -139109 290459 236943 -69095 -176150
11783a76150m6211a08470B70644a78062C32158G5633b30417i8826C64810g498
$$ -176150 -222361 -108470 270644 -178062 332158 75633 -230417 -98826 364810 -7498
11772I3681a72884e1777l4237j80206B34481e8606G3791a35161l6819l19054A42722
$$ 93681 -172884 -51777 -86014 -266220 234481 -58606 73791 -135161 -171980 -491034 142722
11760A32882a50471k20708B47442a50623C72443c7970k59747J01132o2881j19835
$$ 132882 -150471 -371179 247442 -150623 372443 -37970 -297717 -196585 -259466 -379301
11750c79301A38943A5203a29427E08343D3716a36931e8747C09837r8213F9426
$$ -379301 138943 15203 -129427 508343 43716 -136931 -58747 309837 211624 69426
11739e3384B32734J920j7460Q8153a64137B81045c00200i4583H6143H43J41549
$$ -53384 232734 234654 217194 305347 -164137 281045 -300200 -94583 86143 843 142392
11728A42392b2635D49410D276J32739h58l1911j1576B98832G7516A5471J16310
$$ 142392 -22635 449410 4276 137015 -858 -32769 -44345 298832 77516 15471 131781
11717A31781P0432J56519e5578j0183C7577m890a07683j05904A99910E9663a16499
$$ 131781 202213 358732 -55578 -65761 37577 32687 -107683 -213587 199910 59663 -116499
11705H6387d796m4136E6645a40244k05058A81110J78287j43272o4953R3237l4421
$$ 86387 -4796 -48932 56645 -140244 -345302 181110 359397 216125 151172 244409 209988
11694B09988C8974L5656b71400A7916O7861B0791e1286k6549A38585E298a81917
$$ 209988 38974 74630 -271400 17916 85777 20791 -51286 -77835 138585 5298 -181917
11682F2965a17290D01371a31900D36155A77244A2543J40620m7465m2594P7508
$$ 62965 -117290 401371 -131900 436155 177244 12543 153163 105698 63104 140612
11672A40612J0522c4840B58069F6195c5046A05982j9775b73089D0448J09452D110
$$ 140612 151134 -34840 258069 66195 -35046 105982 86207 -273089 40448 149900 4110
11660B84343A19412J31578C2881g0713B18283g4393A90337b64930A87601G1273
$$ 284343 119412 250990 32881 -70713 218283 -74393 190337 -264930 187601 71273
11649e348k9512H3423J17644j3726g4008B00185R8893H445e798k14825L635A047
$$ -5348 -34860 83423 201067 187341 -74008 200185 299078 8445 -5798 -220623 -216988 1047
11636F893J69199b66755a15470A10033d6619r8668O1516H9158K8150N9000A8254
$$ 6893 176092 -266755 -115470 110033 -46619 -145287 -83771 89158 117308 176308 18254
11624B96676j04349k1784a18500n3894B59018H8503h8792I618K57412Q7361c6795
$$ 296676 192327 170543 -118500 -172394 259018 88503 -88792 9618 267030 354391 -36795
11612a55473P2905k13746A60941F0491J53153n4533p5767B1964K1531N1336J51857
$$ -155473 -82568 -296314 160941 60491 213644 159111 83344 21964 43495 94831 246688
11601B46688E9201g7069C32214I7995J83101M1312o6606A21587f2887E14293k55449
$$ 246688 59201 -77069 332214 97995 281096 322408 255802 121587 -62887 514293 258844
11590B58844m1131E1179J59485Q2426A21697J54653j35061a11760A36034J10759
$$ 258844 217713 51179 210664 293090 121697 276350 141289 -111760 136034 246793
11580B46793o4526f2005A54448J92311a23681j21166C43708D7524j3647J33802
$$ 246793 182267 -62005 154448 346759 -123681 -244847 343708 47524 33877 167679
11570A67679M0138N8196j17421a8238E7607K80311l3312c5363B02875b0325B56379
$$ 167679 207817 266013 148592 -18238 57607 337918 304606 -35363 202875 -20325 256379
11558B89989a15028D27677A3098b53518A58300m350c0986M876j64166D25062c9489
$$ 289989 -115028 427677 13098 -253518 158300 153950 -30986 -26110 -190276 425062 -39489
11546C50815I8106b60332A46809k9473f2756f809I038a68551m0516P031A85461
$$ 350815 98106 -260332 146809 117336 -62756 -6809 9038 -168551 -209067 -202036 185461
11534D10788d02758A20710c2409A50227j4187c3255A289O0758J12969b33418A09097
$$ 410788 -402758 120710 -32409 150227 136040 -33255 1289 62047 175016 -233418 109097
11522e9064D42630A11900J27727B4893J40444a4973l3036a6780B38208M5211l3084
$$ -59064 442630 111900 239627 24893 165337 -14973 -48009 -16780 238208 283419 250335
11511B50335j12915k6821d8872J7470l4299F9615J67992K48494I6908P1261E0104
$$ 250335 137420 110599 -48872 -31402 -65701 69615 237607 486101 96908 168169 50104
11499b60408A4031i6815D80979j68195j3065e8014n8492B79750A6329L50277j78860
$$ -260408 14031 -96815 480979 312784 299719 -58014 -116506 279750 16329 366606 187746
11488A87746A5899a6360B31342J79182g9591C17021A31678a29623m6429C08210
$$ 187746 15899 -16360 231342 410524 -79591 317021 131678 -129623 -176052 308210
11477i8092C7169e3657j84705A53254j719J33103j20706L6994d0234C36691L1272
$$ -98092 37169 -53657 -238362 153254 151535 284638 163932 200926 -40234 336691 367963
11466C67963j19872n7582j2791J51450j01362p7468g7956q8351C56625i6601A70987
$$ 367963 248091 190509 177718 329168 227806 150338 -77956 -166307 356625 -96601 170987
11454f3775B2504K08079a04887B73949f9378A17015J05147n2013b16682C06549
$$ -63775 22504 230583 -104887 273949 -69378 117015 222162 170149 -216682 306549
11443d9723A19070J28944b5167B31572E0842e6177B6219N690a20320B48037b36979
$$ -49723 119070 248014 -25167 231572 50842 -56177 26219 31909 -120320 248037 -236979
11431A40976k5509K73674A76595D7367L20679a3262A39874e42497E6428N9978
$$ 140976 115467 389141 176595 47367 368046 -13262 139874 -542497 56428 116406
11421A16406Q7981E9561k8408c02972a38373A02134J55352b13709O4275A70321
$$ 116406 204387 59561 31153 -302972 -138373 102134 257486 -213709 -149434 170321
11410A30916b091l2971k082k13201D499J83159a6041I9115g6446k7412B11068
$$ 130916 -2091 -35062 -37144 -250345 4499 187658 -16041 99115 -76446 -103858 211068
11398A0666c8970C75440A22331F0230a5971A03899O6521k6698P3335I5154P1576
$$ 10666 -38970 375440 122331 60230 -15971 103899 170420 143722 217057 95154 166730
11387A66730M5216a01650n5166D6642M7061Q2366o1493K30246A42064Q1983a62932
$$ 166730 211946 -101650 -156816 46642 93703 176069 114576 344822 142064 224047 -162932
11375e3413C05907R197c04255J37942O4974A16313o658j4085e4015G4634P122
$$ -53413 305907 315104 -304255 -166313 -101339 116313 109655 95570 -54015 74634 81756
11364H1756a90802j14710Q6395C3969L3870k3315M1814h6235F8853J64258a70608
$$ 81756 -190802 -305512 -219117 33969 67839 44524 86338 -86235 68853 233111 -170608
11352a9962A26133J89297H5930J12404d1251k49656B16233I3340g9223j83273
$$ -19962 126133 315430 85930 198334 -41251 -290907 216233 93340 -79223 -262496
11342b62496E1819J03937E5161b56135f7879f396j43056a7127B32841B5488a22637
$$ -262496 51819 155756 55161 -256135 -67879 -6396 -149452 -17127 232841 25488 -122637
11330A77027b16354A96918o6991c8133l20259R7253R8870G3363e7279j09366k8572
$$ 177027 -216354 196918 129927 -38133 -358392 -261139 -162269 73363 -57279 -166645 -195217
11319a95217A28350J79010a03802C87828b3043B4188d0099j10573A978a24218
$$ -195217 128350 307360 -103802 387828 -23043 24188 -40099 -150672 1978 -124218
11308b51231f4589o0788I1185a99627A10051o205N746a86866p9096B78705A35010
$$ -251231 -64589 -125377 91185 -199627 110051 103846 109592 -186866 -265962 278705 135010
11296d4552a5529C6534b55382e4063q2610o5458n5045G6826F853d7438p8381K5651
$$ -44552 -15529 36534 -255382 -54063 -136673 -202131 -257176 76826 6853 -47438 -125819 -100168
11284a00168n8601B57980g6371j16065H4946l9320g8288m2970p3534G8369h7587
$$ -100168 -158769 257980 -76371 -192436 84946 45626 -78288 -121258 -194792 78369 -87587
11272a71908A03285c8693j21355B7374c02934f736A72696E2389L399d1309P603
$$ -171908 103285 -38693 -160048 27374 -302934 -6736 172696 52389 55788 -41309 -33706
11261c3706J1934o3327B9151a77527A78461B6030a76665D637a05819j17699Q6809
$$ -33706 -21772 -85099 29151 -177527 178461 26030 -176665 4637 -105819 -223518 -136709
11250a36709C06742c16994C29749b32110b4819r4836a626F0797a88854C56274
$$ -136709 306742 -316994 329749 -232110 -24819 -119655 -1626 60797 -188854 356274
11239b0277B0712a66467A75754E3170c72840a45912B62740A17581J5629b28773
$$ -20277 20712 -166467 175754 53170 -372840 -145912 262740 117581 133210 -228773
11228h6971r594k5834k29561i7978k0342C7990J02488C2592L4964J72381H6775
$$ -86971 -96565 -122399 -351960 -97978 -118320 37990 140478 32592 67556 239937 86775
11216c66430D7091B0463b20926q4616h8174k28463c3213b363k90598n8089d4211
$$ -366430 47091 20463 -220926 -305542 -88174 -316637 -33213 -2363 -292961 -351050 -44211
11204A249J43181E4729q210h7627k57026J52216b4376F1381b37656j5411b6311
$$ 1249 144430 54729 46519 -87627 -344653 -192437 -24376 61381 -237656 -253067 -26311
11192B3652J94093b03548O7944B22431R8390c735C29945b15815H824a06937C12804
$$ 23652 217745 -203548 -135604 222431 320821 -3735 329945 -215815 8824 -106937 312804
11180A7929a53700P5414q9290A78810c13178b0001l2912j68881b131H3963a12173
$$ 17929 -153700 -78286 -167576 178810 -313178 -20001 -52913 -221794 -2131 83963 -112173
11168B38094b0786B1373J23237A7757b7167n5265o1525d2571C38389d22327a2689
$$ 238094 -20786 21373 144610 17757 -27167 -82432 -143957 -42571 338389 -422327 -12689
11156f7054n0220j07090j47614a506r1472a1113l150F3164R5707b60235J27957
$$ -67054 -117274 -224364 -371978 -1506 -92978 -11113 -14263 63164 158871 -260235 -132278
11145a32278B83793b92359B98728c35047A7360a41865B51798r0092c17745A60581
$$ -132278 283793 -292359 298728 -335047 17360 -141865 251798 161706 -317745 160581
11134a70364e9273A62881D9239K1516M3500b35939B51652d9112B797K65870f598
$$ -170364 -59273 162881 49239 70755 114255 -235939 251652 -49112 2797 268667 -6598
11122G7830K05600A28656J98154A01522b75748a0987H640f5996A54594J5803c94949
$$ 77830 283430 128656 326810 101522 -275748 -10987 8640 -65996 154594 170397 -394949
11110B7636R1250J2461p854M3331p7212J45819P5147A4809J57758J22128a38968
$$ 27636 118886 131347 123493 166824 89612 235431 310578 14809 172567 294695 -138968
11098b93083A23397E2153f3491C13453j45271f5427B69886o103J04653a79579
$$ -293083 123397 52153 -63491 313453 168182 -65427 269886 263783 368436 -179579
11087A85469J34072J34432A26084K58180A34318L88162j28321a8839C59536A25768
$$ 185469 319541 453973 126084 384264 134318 522480 394159 -18839 359536 125768
11076C03682M38082C52726A69616O5087K70914M4358r9665A36361J10035R8962
$$ 303682 741764 352726 169616 234703 505617 549975 450310 136361 246396 345358
11066C45358j54569L6552K1808M23987k58245K79038k33161K14908k88155r839
$$ 345358 190789 227341 249149 673136 414891 693929 460768 675676 387521 377682
11056C77682k4638M32819k96882J72131J44310n4158k21125K70399l55706P9114
$$ 377682 353044 785863 488981 661112 805422 751264 530139 800538 444832 523946
11046E23946J74188n794j40554J68665N9972J62858l48332M91969j70731C37069
$$ 523946 698134 692340 551786 720451 780423 943281 594949 1086918 916187 337069
11035A019413l40793O6857R498k38873N5635K04925j29899L17143n1230D07562
$$ 1019413 678620 745477 754975 516102 571737 776662 646763 963906 912676 407562
11024E58534J74284m1901r9444k6766N8789K66184l09339L73766O5760k05743
$$ 558534 732818 690917 591473 564707 623496 889680 580341 954107 1019867 814124
11014H14124n1037K24629k44958K5188j34242A08878O18115J21927k14945l2169
$$ 814124 763087 987716 742758 767946 633704 108878 726993 848920 633975 601806
11004F01806P4301J57991q1922r9811P38450D27103K03307P1584j2352J8890K19459
$$ 601806 676107 834098 752176 652365 1390815 427103 630410 701994 689642 708532 927991
10993I27991m24294L04147j8808j62129M9998K05855J11030k99504M10991J14467
$$ 927991 503697 807844 789036 626907 676905 882760 993790 694286 1105277 1219744
10983A219744J9320L07972l13772r6596O4553K46383J70501R6504l3034M54931
$$ 1219744 1239064 1547036 1233264 1136668 1201221 1447604 1618105 1714609 1681575 2136506
10973B136506L90917p5537n2929L6491N50685l66097l42779K98697p0025l92818
$$ 2136506 2527423 2451886 2398957 2435448 2986133 2620036 2277257 2575954 2505929 2113111
10963B113111j48157J24392P382K31308j093l1065L05508j5682j9475j12441k82414
$$ 2113111 1964954 2089346 2096728 2328036 2326943 2295878 2601386 2585704 2566229 2453788 2171374
10952B171374l67109j42498n34778j19238k11524p5017R4734l40355J75213l03634
$$ 2171374 1804265 1661767 1126989 1007751 796227 721210 815944 475589 650802 347168
10942C47168j58046L15867C5023K71521e9375F46894a45011B61175i1547B59929
$$ 347168 189122 504989 35023 306544 -59375 646894 -145011 261175 -91547 259929
10931A28684i6674F6519a61738C89542p8477D3120f8156C301b45028f5863B24548
$$ 128684 -96674 66519 -161738 389542 311065 43120 -68156 3301 -245028 -65863 224548
10919B35139b42695H2653O9820a62694a0509l0597j26163l3820a2966l0447Q842
$$ 235139 -242695 82653 152473 -162694 -10509 -41106 -167269 -201089 -12966 -43413 -34571
10908c4571j89399B2198a17066d0927A68894h0469j06910A17041g9647B57334
$$ -34571 -223970 22198 -117066 -40927 168894 -80469 -187379 117041 -79647 257334
10897B9163a66312M9682K8235A44708d73948d1709o1625J0022j9114j1751F3708
$$ 29163 -166312 -116630 -88395 144708 -473948 -41709 -103334 -93312 -112426 -124177 63708
10885a25581L2399A58378f5656B37829p1791m9996m454d5110G5235J16364d842
$$ -125581 -93182 158378 -65656 237829 166038 116042 111588 -45110 75235 191599 -4842
10873i5249A29774b37695J10828A75319m6358P2743a96543Q2760N6490B369J39504
$$ -95249 129774 -237695 -126867 175319 128961 201704 -196543 -113783 -57293 2369 141873
10862A41873k9458b06560G4861R8882c34445g8620A92302e03j87703B38645f8116
$$ 141873 112415 -206560 74861 173743 -334445 -78620 192302 -503 -188206 238645 -68116
10850A39783b70096a5668B33861r4850a22132B77879g2015J6948j1924q867k4167
$$ 139783 -270096 -15668 233861 139011 -122132 277879 -72015 -55067 -66991 -75858 -100025
10839a00025A50134a64328E308J82430A7500K79103b48174A32109J52437O8904
$$ -100025 150134 -164328 5308 187738 17500 296603 -248174 132109 284546 353450
10829C53450A74165L666l631k3619n7517L6963R172D0075f1164j54866A35989
$$ 353450 174165 177831 174200 150581 93064 130027 139199 40075 -61164 -216030 135989
10817A2359Q9351b8284l52839J81756K6882Q4346j16963A8539Q3048a30655b986
$$ 12359 101710 -28284 -381123 -199367 -172485 -88139 -205102 18539 101587 -130655 -2986
10805e2151F6440R0636b72449B58733r5874A3606a79619C0098K5623i1972A1768
$$ -52151 66440 157076 -272449 258733 162859 13606 -179619 30098 55721 -91972 11768
10793b32704E7941j1130h535j71553G8676i6555k29695B0226b21386c5403A5202
$$ -232704 57941 46811 -8535 -180088 78676 -96555 -326250 20226 -221386 -35403 15202
10781B75956A09182c31324J07157a09774c4322j47256j65910B2457K89489d8830
$$ 275956 109182 -331324 -224167 -109774 -34322 -181578 -347488 22457 311946 -48830
10770a81834g9476n6997M7392K0776k05257E3486L6001a91479A7034h3631A24734
$$ -181834 -79476 -136473 -89081 -68305 -273562 53486 89487 -191479 17034 -83631 124734
10758h7188l9446k2225P0814A26025J77564a71885A52358a60291A82728O5910
$$ -87188 -126634 -148859 -78045 126025 303589 -171885 152358 -160291 182728 248638
10748B48638c1147j10169B5022a80761C7407a04789j59933I2375N0204a10343
$$ 248638 -31147 -141316 25022 -180761 37407 -104789 -264722 92375 142579 -110343
10737B1626J41037a1459j69322A24462K04160B6692a15771i550k2192A24250c91996
$$ 21626 162663 -11459 -180781 124462 328622 26692 -115771 -9550 -31742 124250 -391996
10725b16094A06190J94629a28291A43522a53535f3566J1822B02695p6166a13437
$$ -216094 106190 300819 -128291 143522 -153535 -63566 -51744 202695 126529 -113437
10714a37488K4378d1073m1062G6344A9386a97988B03720b2618D2188b9926F37377
$$ -137488 -113110 -41073 -82135 76344 19386 -197988 203720 -22618 42188 -29926 637377
10702E9872c5283j72040C7243c71591l6213i4814f838B28357d5603A41675d22268
$$ 59872 -35283 -207323 37243 -371591 -407804 -94814 -6838 228357 -45603 141675 -422268
10690a09374K8297l09030g2823A58312K2996b1628A55769A159c30157h3718j76453
$$ -109374 -81077 -390107 -72823 158312 181308 -21628 155769 1159 -330157 -83718 -260171
10679b60171a0159k40991C03546b85967B01099F3787g11I945J25945b86680J19542
$$ -260171 -10159 -251150 303546 -285967 201099 63787 -711 9945 135890 -286680 -167138
10668a67138E2009K70211b42892Q3037O3799l1563r9052e7010k66048a05085Q985
$$ -167138 52009 322220 -242892 -159855 -96056 -127619 -226671 -57010 -323058 -105085 -96100
10657i6100J5997k85309A0088b28741j40258R8286A61385C6941b37641A04385
$$ -96100 -80103 -365412 10088 -228741 -368999 -270713 161385 36941 -237641 104385
10646d04645J77624b3435A61878d31978f4782J3678G60Q8098a94041G2188J56001
$$ -404645 -227021 -23435 161878 -431978 -64782 -51104 760 88858 -194041 72188 228189
10635B28189a71116L8538E7978J69071a37941a4254p1776B18575a53342c5383
$$ 228189 -171116 -132578 57978 227049 -137941 -14254 -86030 218575 -153342 -35383
10624a91063C44005G6753N8029a70542M7320I577O0995h2024A57165a87930I4635
$$ -191063 344005 76753 134782 -170542 -123222 9577 70572 -82024 157165 -187930 94635
10612b1619p7702d5374B5847a01494L479l38124J89798A20193C1149a57324P452
$$ -21619 -99321 -45374 25847 -101494 -98015 -436139 -246341 120193 31149 -157324 -149872
10601a49872D909a84373h5083L7632n1162k47386M6461b8670r013r2579B30317
$$ -149872 4909 -184373 -85083 -47451 -98613 -345999 -299538 -28670 -37683 -130262 230317
10589A28911B6395d01228j86268A55708J0333o4688b88538a23959C07175c5239
$$ 128911 26395 -401228 -587496 155708 166041 101353 -288538 -123959 307175 -35239
10578a49318j4596a6398A77677d1492B28022b642A49200B9006a49809B72208c15295
$$ -149318 -163914 -16398 177677 -41492 228022 -2642 149200 29006 -149809 272208 -315295
10566a76808d0938I9241a88688D1541O0447h307j90906h9002n005A0288c03150
$$ -176808 -40938 99241 -188688 41541 101988 -8307 -199213 -89002 -94007 10288 -303150
10554I1149J4933b9492o04500b12350k0238d7573H0472i757l02086J39123B24681
$$ 91149 106082 -29492 -633992 -212350 -232588 -47573 80472 -9757 -311843 -172720 224681
10542g9085q5825C88195e1113q1859B35446b39003N6228a2897k11131a0762B24615
$$ -79085 -164910 388195 -51113 -132972 235446 -239003 -182775 -12897 -224028 -10762 224615
10530A15667J22336C5817b01791B0821K11602b86801b5961k70787C65414C0869
$$ 115667 238003 35817 -201791 20821 232423 -286801 -25961 -296748 365414 30869
10519i3339c7095A47995L0652D9907a59995H0888J1374l2594J85391b41197A16442
$$ -93339 -37095 147995 178647 49907 -159995 80888 92262 59668 245059 -241197 116442
10507a59902r3874a1963l4339p9012k31675F3382a59879H3635K7248b1040A02298
$$ -159902 -253776 -11963 -46302 -125314 -356989 63382 -159879 83635 110883 -21040 102298
10495B29388R1188j26608q6670f782n6098n25j57556I5322K52459F4430K50682
$$ 229388 320576 193968 107298 -6782 -62880 -63405 -220961 95322 347781 64430 315112
10484C15112a2919B29891g7429H30501k18411J05041j46664j32816A46136J72808
$$ 315112 -12919 229891 -77429 830501 612090 717131 570467 437651 146136 318944
10474C18944q9344a97105e8646D2567J06220c5958j47105B17006L7413a99633
$$ 318944 229600 -197105 -58646 42567 148787 -35958 -183063 217006 254419 -199633
10463i2143L2780j2623G9856J6145f8060C15612b66659Q0974A88183G8703C7373
$$ -92143 -59363 -71986 79856 96001 -68060 315612 -266659 -185685 188183 78703 37373
10451a36750B53383k4194a12767j59105J20509B53548b21486R9854C3039b93459
$$ -136750 253383 229189 -112767 -271872 -151363 253548 -221486 -121632 33039 -293459
10440a13090M7473B97136r9395a25265C1165Q318a76932K9815j32402A01285m6255
$$ -113090 -65617 297136 197741 -125265 31165 39483 -176932 -147117 -279519 101285 55030
10429E5030b31100G5397a67197a129q9306A62128b68565C95852b87003f0351k0462
$$ 55030 -231100 75397 -167197 -1129 -90435 162128 -268565 395852 -287003 -60351 -80813
10418h0813k7079C6878a86194C06447A43309J11171b8595m4435A46389a48721
$$ -80813 -107892 36878 -186194 306447 143309 254480 -28595 -73030 146389 -148721
10407f8390j63193l7932I0496d11498I6556Q6890E7793b77276L8103e7711D0336
$$ -68390 -231583 -269515 90496 -411498 96556 183446 57793 -277276 -239173 -57711 40336
10395A15741j9324B6503J79160i9861A0071c152B04574d2613B35972I5549a51091
$$ 115741 96417 26503 205663 -99861 10071 -3152 204574 -42613 235972 95549 -151091
10383B38998J39336e58D8825O5338h7672A56366J74091l3998c733B22367P4850
$$ 238998 378334 -558 48825 114163 -87672 156366 330457 296459 -3733 222367 297217
10372B97217Q3548A33603K93760j06338E3449K94147q6025O4895K28489E2887
$$ 297217 380765 133603 427363 321025 53449 347596 261571 326466 554955 52887
10361E31949j14080A68101F3416L98038B03873J2186D842L60502A66848R5305
$$ 531949 417869 168101 63416 461454 203873 216059 4842 365344 166848 262153
10351B62153J48407j3641M5422K4515j19861J28953N3115k00593K22347L7966
$$ 262153 410560 396919 442341 466856 346995 475948 529063 328470 550817 588783
10341E88783B54920P9953e8892A42552a21903B91041D7596J77828J54316A48984
$$ 588783 254920 334873 -58892 142552 -121903 291041 47596 225424 379740 148984
10330H5139K25763a78529A79469r767L0541k160D1841M57653j02261j28471j02227
$$ 85139 310902 -178529 179469 169702 200243 198083 41841 499494 397233 268762 166535
10319A66535J39474j06161J6957a92642C76629A02533C6456P2218Q4686O478d0167
$$ 166535 306009 199848 216805 -192642 376629 102533 36456 108674 193360 199838 -40167
10307F6767c64456F4837M26152a07357j67143G385A837i6949j60633r799B61045
$$ 66767 -364456 64837 490989 -107357 -274500 7385 1837 -96949 -257582 -267381 261045
10295c9360A61371k7335d5471A3624J31236a58798j36383c5241p1084c4228J6612
$$ -39360 161371 134036 -45471 13624 144860 -158798 -295181 -35241 -106325 -34228 -17616
10284a7616A63660a38163K9057B126J3205e3426A35886C2845b85873g9876A42361
$$ -17616 163660 -138163 -109106 2126 15331 -53426 135886 32845 -285873 -79876 142361
10272G4625K41998E802a68864K9309B76618H43g1145D3430j877J18113M7378G6811
$$ 74625 316623 5802 -168864 -139555 276618 843 -71145 43430 41553 159666 207044 76811
10259a6311D44376j56825L45750m342A61724j2638J66493J13274e7377A36513
$$ -16311 444376 287551 633301 628959 161724 149086 315579 428853 -57377 136513
10248a79995g2752B0081L54275A7564i0271k2092j88109c1462k25349a0501H5356
$$ -179995 -72752 20081 374356 17564 -90271 -112363 -300472 -31462 -256811 -10501 85356
10236a41542A27361d03893G2328l781a38444N6755A40795a26032C4033L875J43756
$$ -141542 127361 -403893 72328 68547 -138444 -81689 140795 -126032 34033 37908 181664
10225A81664O5930K2353e4485k08276A558O4650a77810R776e252B25674b37478
$$ 181664 247594 269947 -54485 -262761 1558 66208 -177810 -168034 -5252 225674 -237478
10213b9893A71105p7039a42091D5801j8718b2806p5238l924k9311c1322j0672
$$ -29893 171105 94066 -142091 45801 27083 -22806 -98044 -101968 -131279 -31322 -41994
10202d1994F6757c4634A22765B4637Q2052a87533C40601b10026Q7931C52149A19505
$$ -41994 66757 -34634 122765 24637 106689 -187533 340601 -210026 -122095 352149 119505
10190a21737j78919F5982b56306B88870j40223E2004h6715o8318b6959A78167
$$ -121737 -300656 65982 -256306 288870 148647 52004 -86715 -155033 -26959 178167
10179a17522B1185c62514P5311H9506d80057B65689g9604R824n2615j14446A28102
$$ -117522 21185 -362514 -287203 89506 -480057 265689 -79604 -69780 -122395 -236841 128102
10167b98723A38712f4704m1476B33569a97063I2287a3156k70481j19365b01025
$$ -298723 138712 -64704 -106180 233569 -197063 92287 -13156 -283637 -403002 -201025
10156c07484a52152A17952a5502L169k93584C7949a8949l09227a32201l7086c7915
$$ -307484 -152152 117952 -15502 -12333 -305917 37949 -18949 -328176 -132201 -169287 -37915
10144c0694k50423O0669O7244F900a15196G5896h6468A215b45643b0017r7630
$$ -30694 -281117 -220448 -153204 6900 -115196 75896 -86468 1215 -245643 -20017 -117647
10133a17647m9634A47056d4591j72207B84665B3930h9641k76911i1321N151K5743
$$ -117647 -167281 147056 -44591 -216798 284665 23930 -89641 -366552 -91321 -86170 -60427
10122f0427A07103C4930K42138G335a90910c9932A89237H1927K2284b59228I7062
$$ -60427 107103 34930 277068 7335 -190910 -39932 189237 81927 104211 -259228 97062
10110i9238D3595a10043D3334J01576a4201A02640a9917G8816a55997B6169j2305
$$ -99238 43595 -110043 43334 144910 -14201 102640 -19917 78816 -155997 26169 13864
10099A3864L6164d24906g6217l1852A02501a68448A31406K68062e15507G0778
$$ 13864 50028 -424906 -76217 -108069 102501 -168448 131406 399468 -515507 70778
10088b39766A175i3009k80906J02946E0977B4648D389K8499b33652P1527A40889
$$ -239766 1175 -93009 -373915 -270969 50977 24648 4389 32888 -233652 -162125 140889
10076g249A27987j3127c41118A19410a17259N1719n2745D0259N6504b9076E9175
$$ -7249 127987 114860 -341118 119410 -117259 -65540 -118285 40259 96763 -29076 59175
10064c36538L6505D3044a3874B21407F3813a36404c5137k28476a03765L103D757
$$ -336538 -300033 43044 -13874 221407 63813 -136404 -35137 -263613 -103765 -100662 4757
10052c50456a06623A30529h4429j42042M3437E8289c26747A5010P4252b61467
$$ -350456 -106623 130529 -84429 -226471 -183034 58289 -326747 15010 89262 -261467
10041b68051C357b31587c9669B07503c44449B00989b82155n3771H2531a26739
$$ -268051 3357 -231587 -39669 207503 -344449 200989 -282155 -335926 82531 -126739
10030i4485F0267K505J00211m241o9796a74471K3786d2007m6480j15912g4501
$$ -94485 60267 62772 162983 158742 88946 -174471 -150685 -42007 -88487 -204399 -74501
10018B8903a10612c8888j61824M2872f9345J5304l61509a87382q6181e6308A60043
$$ 28903 -110612 -38888 -200712 -157840 -69345 -54041 -415550 -187382 -273563 -56308 160043
10006b5785B40627b0188B84269a96355D4390R9005c45313a9298B85226c06661
$$ -25785 240627 -20188 284269 -196355 44390 143395 -345313 -19298 285226 -306661
9995g1824J7708A21660Q4071b26873P3223f2270l74393G3508a6039k69938A54076
$$ -71824 -54116 121660 205731 -226873 -153650 -62270 -436663 73508 -16039 -285977 154076
9983e1980j99785a21795g035A51889A2253h3997j65574R5776G2796l3201M5845
$$ -51980 -251765 -121795 -7035 151889 12253 -83997 -249571 -153795 72796 39595 85440
9972H5440j5189b78202B34024a20322j4253B61079j28324C503a6127l81274a19787
$$ 85440 70251 -278202 234024 -120322 -134575 261079 132755 3503 -16127 -397401 -119787
9960a17855E3862P899a37253l7964h5642q69a0615E5477a48875A32712o4414L37188
$$ -117855 53862 61761 -137253 -175217 -85642 -86511 -10615 55477 -148875 132712 68298 405486
9948D05486A41365J51715a27168k12934C1394j2357b2384A2549b0610D7919f1413
$$ 405486 141365 293080 -127168 -340102 31394 19037 -22384 12549 -20610 47919 -61413
9936A86851c26272A67919a62948d0681k50495f9804j856D6039d8939k5616n2263
$$ 186851 -326272 167919 -162948 -40681 -291176 -69804 -71660 46039 -48939 -74555 -126818
9925a26818H408a45398K8461q2604J4676j06516h8954k06717J0741A6835a15905
$$ -126818 8408 -145398 -116937 -199541 -184865 -291381 -88954 -295671 -284930 16835 -115905
9913c69757a26761k5126a5063A95699a39984H073b19230a06331r4603L34j00213
$$ -369757 -126761 -151887 -15063 195699 -139984 8073 -219230 -106331 -200934 -200600 -300813
9902c00813f0920O534K5592I6722b80453G9967j6775d0130E8834J99674F697J86920
$$ -300813 -60920 -54386 -28794 96722 -280453 79967 63192 -40130 58834 258508 6697 193617
9890A93617E6581a26973D4642f8546A07811a81865M6705e6446j04143f3053j22845
$$ 193617 56581 -126973 44642 -68546 107811 -181865 -135160 -56446 -160589 -63053 -185898
9879a85898r1616A02458b6397i272D5669R1702P3239f7669A0724b80617e4723
$$ -185898 -277514 102458 -26397 -9272 45669 137371 210610 -67669 10724 -280617 -54723
9867I2063b12257b3899H5813b81411J21549C1114P9454c3766j20236d805E9954
$$ 92063 -212257 -23899 85813 -281411 -159862 31114 110568 -33766 -154002 -4805 59954
9855I140b65658a15778q8797k9309A51830C578g7172j53609d6118a4625k40j07661
$$ 9140 -265658 -115778 -204575 -233884 151830 3578 -77172 -230781 -46118 -14625 -14865 -122526
9843a22526p0471I4384R0560M9225c1987A62543b38779e2661k9966l26424g8675
$$ -122526 -192997 94384 184944 234169 -31987 162543 -238779 -52661 -82627 -409051 -78675
9831b81151L511i6268B12157e36j7168A94378p0412b28843O3170L220B25604b40039
$$ -281151 -277640 -96268 212157 -536 -17704 194378 123966 -228843 -165673 -162453 225604 -240039
9818b93196F8062b91120J38566q7410K2344D42427j41638j30041a47409k03531
$$ -293196 68062 -291120 -152554 -239964 -217620 442427 300789 170748 -147409 -350940
9808c50940a72951C0991a7451j03679b9189G3867K2070J2250a84464O9911G5096
$$ -350940 -172951 30991 -17451 -121130 -29189 73867 95937 108187 -184464 -114553 75096
9796b15193K1535o1529i8906k45698b5082A43403e4360k32016C5655b43112i0801
$$ -215193 -193658 -255187 -98906 -344604 -25082 143403 -54360 -286376 35655 -243112 -90801
9784H5817J28087e345j99554B09437l3004a90097I6705b72056c2321k26294A53369
$$ 85817 213904 -5345 -204899 209437 176433 -190097 96705 -272056 -32321 -258615 153369
9772I698i6090n7146K1760c4058k00879l7108A87106q5256k6258A1398K01189
$$ 9698 -96090 -153236 -131476 -34058 -234937 -272045 187106 101850 75592 11398 212587
9761B12587e49408C0636a24346j01552L2105o5054b7428H510J43767g3645c0849
$$ 212587 -549408 30636 -124346 -225898 -193793 -258847 -27428 8510 152277 -73645 -30849
9749d62392a74005A816a56445J6757L6614I8059A7038J70414g2403j45220b342
$$ -462392 -174005 1816 -156445 -139688 -103074 98059 17038 187452 -72403 -217623 -2342
9737a47182A42641E4227c77474A5560h3186j7942G8784l5921L0334a81714f0417
$$ -147182 142641 54227 -377474 15560 -83186 -101128 78784 42863 73197 -181714 -60417
9725b25022i1573b4490j32754C14659r3202c4178A54943h4049n1569L3280j12305
$$ -225022 -91573 -24490 -157244 314659 221457 -34178 154943 -84049 -135618 -102338 -214643
9714b14643A13769A9357L52470g1890n3072e9445G9459a31998j38505a20632b9809
$$ -214643 113769 19357 371827 -71890 -124962 -59445 79459 -131998 -270503 -120632 -29809
9702A59624a20181m57015a59476f164j33833k12399j2766O6273a08958B48791
$$ 159624 -120181 -577196 -159476 -6164 -139997 -352396 -365162 -298889 -108958 248791
9691b93670B23852g0294p0112J4056j14345P0919l5865E9097b35581R0170P1057
$$ -293670 223852 -70294 -140406 -126350 -240695 -169776 -205641 59097 -235581 -145411 -74354
9680g4354E9136a52542f0102j60720i4590B14926b88576d9091q3204j43257f8956
$$ -74354 59136 -152542 -60102 -220822 -94590 214926 -288576 -49091 -132295 -275552 -68956
9668e231k83723e4149k22070c9580A78427b01127A13873i5860J6832J4886J2051
$$ -5231 -288954 -54149 -276219 -39580 178427 -201127 113873 -95860 -79028 -64142 -52091
9657e2091m3266j16159E81448b2102q039k05536A09835a20326C4917H530K47142
$$ -52091 -95357 -211516 581448 -22102 -30141 -235677 109835 -120326 34917 8530 255672
9646B55672a365j46855c5557A6176h7738c5549r2331j57823e849l40029J7176
$$ 255672 -1365 -148220 -35557 16176 -87738 -35549 -127880 -285703 -5849 -345878 -328702
9635c28702A70616a80665n9210D3104c3118j0896o5406Fb55552E8955g3020k3514
$$ -328702 170616 -180665 -239875 43104 -33118 -44014 -109420 6 -255552 58955 -73020 -96534
9623i6534A05716m2750a1060n24473A46941l804J98088A45689b85883j91493a03405
$$ -96534 105716 62966 -11060 -535533 146941 143137 341225 145689 -285883 -477376 -103405
9611I468J83803a27516M2009j25176N8751C43952D0374I357J50739b54214H8880
$$ 9468 193271 -127516 -85507 -210683 -151932 343952 40374 9357 160096 -254214 88880
9599h6663k00004b2742A38662d7949m1088k96182f6903G6874K1009b8489k79983
$$ -86663 -286667 -22742 138662 -47949 -89037 -385219 -66903 76874 97883 -28489 -308472
9588c08472a32482j97283k17296h2251a8637B02609L5114g1622E573J4884K79409
$$ -308472 -132482 -329765 -547061 -82251 -18637 202609 237723 -71622 5573 20457 299866
9577B99866r1244f0761B8883a46139E4952a4001A24467G678L6960b95403Q1884
$$ 299866 208622 -60761 28883 -146139 54952 -14001 124467 7678 44638 -295403 -213519
9566b13519b3592A63247b83656f0583C8171a44728e561D1089g9618L9066E996
$$ -213519 -23592 163247 -283656 -60583 38171 -144728 -5561 41089 -79618 -40552 5996
9554e1497p1764J0034A44446J8433a75449A79580b3443j79171j14239a00688K330
$$ -51497 -123261 -113227 144446 162879 -175449 179580 -23443 -202614 -316853 -100688 -98358
9543i8358j76349P9002a5106k70619J17953P9154l3420N3524A8584b27930g827
$$ -98358 -274707 -195705 -15106 -285725 -167772 -88618 -122038 -68514 18584 -227930 -7827
9531B58572d7163m2680e367k23465C4829c40024B2990a031F5609J57526m3770
$$ 258572 -47163 -89843 -5367 -228832 34829 -340024 22990 -1031 65609 223135 179365
9520A79365i0099k7485P614n8781E4427a04231k2336F8165J09792a46837b1342
$$ 179365 -90099 -117584 -109970 -168751 54427 -104231 -126567 68165 177957 -146837 -21342
9508C32900j26290i7159a3218j94006I2797D3539L875e8135d309j17802m4888
$$ 332900 206610 -97159 -13218 -207224 92797 43539 47414 -58135 -4309 -122111 -166999
9497a66999j26448e0983q534A0805b93675Q4705P2165p5026H1064A2588a94650
$$ -166999 -293447 -50983 -59517 10805 -293675 -208970 -136805 -211831 81064 12588 -194650
9485i4233K6463n6945K153C17928d8259G1629b14885A1520g2854O52k7475d6018
$$ -94233 -67770 -124715 -122562 317928 -48259 71629 -214885 11520 -72854 -72202 -99677 -46018
9472i7412B05722k5678a23223d2606j92832f7522k7685p0780H3041a76376L5171
$$ -97412 205722 180044 -123223 -42606 -235438 -67522 -95207 -165987 83041 -176376 -141205
9461a41205m9557J7626O3952r5422Q4182F1117b13516O4375m8091L0818k40380
$$ -141205 -190762 -173136 -109184 -204606 -120424 61117 -213516 -149141 -197232 -166414 -406794
9450d06794A02808a23144L0116l15386c9507A93314b06866e2662j8872r6480Q0398
$$ -406794 102808 -123144 -93028 -408414 -39507 193314 -206866 -52662 -71534 -168014 -87616
9439h7616p427k83656P8002a06015l5164b2580A66352a83275i112E0955J11902
$$ -87616 -95043 -378699 -300697 -106015 -141179 -22580 166352 -183275 -9112 50955 162857
9428A62857b12391C46428c41828B18454h5052P440C6535b7780B5752N1618i9307
$$ 162857 -212391 346428 -341828 218454 -85052 -77612 36535 -27780 25752 77370 -99307
9416G2552a6290q8757B33752J37946A2398J95523a55164d0758k05999A26264P0464
$$ 72552 -16290 -105047 233752 371698 12398 207921 -155164 -40758 -246757 126264 196728
9405A96728J60330A54728p3418e5375b7530B4567b90672C0901b67254J14631K6349
$$ 196728 357058 154728 81310 -55375 -27530 24567 -290672 30901 -267254 -152623 -126274
9394a26274m24715C3053a64986B61111f28787E1862R5542a28409b0308D7239g4018
$$ -126274 -550989 33053 -164986 261111 -628787 51862 147404 -128409 -20308 47239 -74018
9382B61764J39573c32246a2958A88618c4034k32951G4592d4566k44892J39636
$$ 261764 401337 -332246 -12958 188618 -34034 -266985 74592 -44566 -289458 -149822
9372a49822A21648b68263p003E4714a3212j66747M8201L9418a8383D6981a03346
$$ -149822 121648 -268263 -275266 54714 -13212 -179959 -131758 -92340 -18383 46981 -103346
9360A28040C6869a61203d4542q6833C0358b45932d8400A67517e4260A53174a73432
$$ 128040 36869 -161203 -44542 -131375 30358 -245932 -48400 167517 -54260 153174 -173432
9348D84101E8510A0544b48699G5851A4513d7768I2808b9102A2387c01656A64926
$$ 484101 58510 10544 -248699 75851 14513 -47768 92808 -29102 12387 -301656 164926
9336A07536a77787k7778O194c9825A36186o5158h2272A04688h9155l25425J51828
$$ 107536 -177787 -205565 -199371 -39825 136186 71028 -82272 104688 -89155 -414580 -262752
9325b62752Q8551B55166g4119j81079f112j59172j60595a24802p8810H6852J47678
$$ -262752 -174201 255166 -74119 -255198 -6112 -165284 -325879 -124802 -203612 86852 234530
9314B34530a86720L0066O8240c1052n0354f195C6790L0865k3482J45585k2721
$$ 234530 -186720 -156654 -88414 -31052 -81406 -6195 36790 67655 44173 189758 167037
9303A67037a02509b6617B22312a12337A87100C3060b39578c7828k5440A50249
$$ 167037 -102509 -26617 222312 -112337 187100 33060 -239578 -37828 -63268 150249
9292B17055c55706B98391a05927I4607d00525f2494a5327j79817q8657J12696
$$ 217055 -355706 298391 -105927 94607 -400525 -62494 -15327 -195144 -283801 -171105
9282a71105L4745p1935K2506O5736k88576h3612j19163A49746h9664j43444B56680
$$ -171105 -136360 -208295 -185789 -120053 -408629 -83612 -202775 149746 -89664 -233108 256680
9270I8895b94046E3882b99161J08523Q5107A44837J46897a05408h858B0676h204
$$ 98895 -294046 53882 -299161 -190638 -105531 144837 291734 -105408 -8858 20676 -8204
9258A35044a40910j14149J14274c8168l12104A25016i3219j1719E2495d48668
$$ 135044 -140910 -255059 -140785 -38168 -350272 125016 -93219 -104938 52495 -448668
9247a31201C26555a05405D2914b67136I3668a15933E6798c55230A57739h9369
$$ -131201 326555 -105405 42914 -267136 93668 -115933 56798 -355230 157739 -89369
9236A50162c67522J59332A40841i7585n26M5629C93061B0450N554a31006G6673
$$ 150162 -367522 -208190 140841 -97585 -98111 -52482 393061 20450 26004 -131006 76673
9224I1337a47997D4203h4381j65055K7851o7670D3960J46993a03231H754i9630
$$ 91337 -147997 44203 -84381 -249436 -221585 -289255 43960 190953 -103231 8754 -99630
9212a29966K9554m4963D8827a05230l0519j27290A2453b87948f6671G1408b124
$$ -129966 -100412 -145375 48827 -105230 -135749 -263039 12453 -287948 -66671 71408 -2124
9200I1162B6424J3525L3561B0978K62339b44249G0757b41439p9856G9026K03744
$$ 91162 26424 39949 73510 20978 283317 -244249 70757 -241439 -321295 79026 282770
9189B82770b07615O6384G3836d0875j925L383F7313l3343p742J57141a19097G3344
$$ 282770 -207615 -141231 73836 -40875 -42800 -39417 67313 33970 26228 183369 -119097 73344
9176C7404b02963f8828B24189a34859I727Q8211l3682O5509a9791C05111c4460
$$ 37404 -202963 -68828 224189 -134859 9727 97938 64256 129765 -19791 305111 -34460
9164g3558b7434m3093j02796K5664l6920D4750K03066b10156g5770D7752h6319
$$ -73558 -27434 -70527 -173323 -147659 -184579 44750 247816 -210156 -75770 47752 -86319
9152b66499O5925n8058Q2612C02851j24262B020J63731c96152d1300H7614a40522
$$ -266499 -200574 -258632 -176020 302851 178589 2020 165751 -396152 -41300 87614 -140522
9140h7067R582q1873g861o7173C6259M37801B23287d66006J89726d7309k9591
$$ -87067 -77485 -159358 -7861 -75034 36259 474060 223287 -466006 -276280 -47309 -76900
9129g6900o3388E2417Q7796g161k53968F2043R0414a1339o9717J2448D05226b42048
$$ -76900 -140288 52417 140213 -7161 -261129 62043 152457 -11339 -81056 -68608 405226 -242048
9116b29394j35994a3120A58949b13961C26351b00785q8533h9119L5904E7753a74792
$$ -229394 -365388 -13120 158949 -213961 326351 -200785 -289318 -89119 -53215 57753 -174792
9104C87714g0906j50132a05831B68142C0278J03134c1599r1684B1212g5190k4002
$$ 387714 -70906 -221038 -105831 268142 30278 133412 -31599 -123283 21212 -75190 -99192
9093i9192l6008B45715n8989a81829J498l2104J9096c9401H1835h7313A66357
$$ -99192 -135200 245715 186726 -181829 -180331 -212435 -193339 -39401 81835 -87313 166357
9081f8110r2302A90031E1331Q3771F2877o521K90628b49967f9479r5080j558b9150
$$ -68110 -160412 190031 51331 135102 62877 56356 346984 -249967 -69479 -164559 -166117 -29150
9068d6703j51762A01689a20450N1508k374A14739K1938b5578j82652B63123A0985
$$ -46703 -198465 101689 -120450 -68942 -71316 114739 136677 -25578 -208230 263123 10985
9056b1641k40339k04506B15169l2900e043D34692d9294p0716L0401A62067c81258
$$ -21641 -261980 -466486 215169 182269 -5043 434692 -49294 -120010 -89609 162067 -381258
9044c23910B7337O3117b94847d4746B82180a24692D53778a55745N1989B94798
$$ -323910 27337 90454 -294847 -44746 282180 -124692 453778 -155745 -103756 294798
9033H9532h8358j22094M0533j34931A74586d83611E1877K81999a56264A52191
$$ 89532 -88358 -210452 -169919 -304850 174586 -483611 51877 333876 -156264 152191
9022A97818b44925P9429j28658E520b68718B60468a10041r3423l0918D4606h3555
$$ 197818 -244925 -165496 -294154 5520 -268718 260468 -110041 -203464 -234382 44606 -83555
9010b42264h9518j97128a38192D0173c08071h6025B3914a90210i2404k16492O8642
$$ -242264 -89518 -286646 -138192 40173 -308071 -86025 23914 -190210 -92404 -308896 -240254
8999b40254L8930m0374a5574j34585A90004g9806j0791j75495i203j16674A23369
$$ -240254 -201324 -241698 -15574 -150159 190004 -79806 -90597 -266092 -9203 -125877 123369
8987a3625I8079c1924k63696a751A15394f4815A67056b57091c3762C4058a44606
$$ -13625 98079 -31924 -295620 -1751 115394 -64815 167056 -257091 -33762 34058 -144606
8975D4611N3449d0351q4257I4138I582h5370A25292m3946N9221c26890k1324a55878
$$ 44611 98060 -40351 -124608 94138 9582 -85370 125292 81346 140567 -326890 -348214 -155878
8962b24812D8072J68957a44710I3416f2920E292d7999j45526f3118A59144i8885
$$ -224812 48072 217029 -144710 93416 -62920 5292 -47999 -193525 -63118 159144 -98885
8950C7258c45120J57039E6671J78960A2814b29033f9980j36990C1033K47875G147
$$ 37258 -345120 -188081 56671 235631 12814 -229033 -69980 -206970 31033 278908 7147
8938a09316A98279a03805G0986O0856E3088o999J69559a85040A275R5750a56322
$$ -109316 198279 -103805 70986 131842 53088 46089 215648 -185040 1275 97025 -156322
8926i7948B01702J83594L99443J484320L969220R49441B992070A420890D47792
$$ -97948 201702 385296 784739 2269059 6238279 7187720 2992070 1420890 447792
8916E75417j22037a00330j18274k21170J39404H6499R1057b15110B86754G0152
$$ 575417 453380 -100330 -218604 -439774 -300370 86499 177556 -215110 286754 70152
8905H7546J41986A4772c27040c4482p475q6965b7762n7145B51546b44015A85870
$$ 87546 229532 14772 -327040 -34482 -41957 -128922 -27762 -84907 251546 -244015 185870
8893a25322M7461K4040p5076h987l0888k10064B3626K57328h3251B32837c18672
$$ -125322 -77861 -53821 -128897 -8987 -39875 -249939 23626 280954 -83251 232837 -318672
8881h1203m4650j33038n3235d849k05450g7817n3598j25545e766k23105Q0040
$$ -81203 -125853 -258891 -312126 -4849 -210299 -77817 -131415 -256960 -5766 -228871 -148831
8870a48831m7070R0491q6652j78982A96108a95500j01763D9567a42344L2324j23739
$$ -148831 -195901 -105410 -192062 -371044 196108 -195500 -297263 49567 -142344 -110020 -233759
8859b33759d802A44023h0698c4080a6755B33206a46340j00842c1711F1512k6920
$$ -233759 -4802 144023 -80698 -34080 -16755 233206 -146340 -247182 -31711 61512 34592
$$ [...]
##END NTUPLES=NMR SPECTRUM
##END=
