##TITLE=AC1631_CENAH_8450655_8NDsmMBa8p
##JCAMPDX= 6.0         $$ Bruker NMR JCAMP-DX V2.0
##DATA TYPE= NMR SPECTRUM
##DATA CLASS= NTUPLES
##ORIGIN= BRUKER
##OWNER= Administrator
$$ 1.72 TOPSPIN		Version 2.1
$$ 2014-02-18 17:10:26.272 -0800  Administrator@X
$$ Compression mode = diff/dup
##.OBSERVE FREQUENCY= 400.02188249412
##.OBSERVE NUCLEUS= ^1H
##.ACQUISITION MODE= SIMULTANEOUS (DQD)
##.ACQUISITION SCHEME= undefined
##.AVERAGES= 64
##.DIGITISER RES= 22
##SPECTROMETER/DATA SYSTEM= spect
##.PULSE SEQUENCE= noesygpps1d.comp
##.SOLVENT NAME= COFFEE_meoh
##.SHIFT REFERENCE= INTERNAL, COFFEE_meoh, 1, 14.96095
##AUDIT TRAIL= $$ (NUMBER, WHEN, WHO, WHERE, PROCESS, VERSION, WHAT)
$$ ##TITLE= Audit trail, TOPSPIN		Version 2.1
$$ ##JCAMPDX= 5.01
$$ ##ORIGIN= Bruker BioSpin GmbH
$$ ##OWNER= Administrator
$$ $$ E:\/data/COFFEE/nmr/AC1631_CENAH_8450655_8NDsmMBa8p/12/pdata/1/auditp.txt
$$ ##AUDIT TRAIL=  $$ (NUMBER, WHEN, WHO, WHERE, PROCESS, VERSION, WHAT)
(   1,<2014-02-18 17:10:21.300 -0800>,<Administrator>,<X>,<go>,<TOPSPIN 2.1>,
      <created by zg
	started at 2014-02-18 16:58:51.565 -0800,
	POWCHK enabled, PULCHK disabled,
       configuration hash MD5:
       C8 4E 4E 5D D3 5C D8 9E 9F 52 82 E0 59 8A DE 15
       data hash MD5: 64K
       BB 04 39 6E 32 5B C0 32 8E 64 C7 02 D6 7B 6C 4D>)
(   2,<2014-02-18 17:10:24.209 -0800>,<Administrator>,<X>,<proc1d>,<TOPSPIN 2.1>,
      <Start of raw data processing
       efp LB = 0.3 FT_mod = 6 PKNL = 1 PHC0 = 0 PHC1 = 0 SI = 128K 
       data hash MD5: 128K
       0B E3 FA 18 5F 3A 45 8F 32 E3 E0 B4 3D 40 59 CA>)
(   3,<2014-02-18 17:10:25.240 -0800>,<Administrator>,<X>,<proc1d>,<TOPSPIN 2.1>,
      <pk PHC0 = -81.90857 PHC1 = 0 
       data hash MD5: 128K
       01 B7 49 9B 53 FF 32 2D 3C 1E FA 51 2B 4A 78 B1>)
(   4,<2014-02-18 17:10:25.670 -0800>,<Administrator>,<X>,<proc1d>,<TOPSPIN 2.1>,
      <abs ABSG = 1 
       data hash MD5: 128K
       5D 7E DC 82 C3 E7 3D 80 6B DD 15 72 2B 05 7C C1>)
(   5,<2014-02-18 17:10:25.790 -0800>,<Administrator>,<X>,<proc1d>,<TOPSPIN 2.1>,
      <abs ABSG = 2 
       data hash MD5: 128K
       3E 15 20 1F 10 9C EA E2 3D E3 B4 D7 13 BD F5 BC>)
(   6,<2014-02-18 17:10:25.911 -0800>,<Administrator>,<X>,<proc1d>,<TOPSPIN 2.1>,
      <abs ABSG = 3 
       data hash MD5: 128K
       28 0F D2 F3 6E 80 DD 53 B2 60 4A FF EC 1E 0C BC>)
(   7,<2014-02-18 17:10:25.979 -0800>,<Administrator>,<X>,<proc1d>,<TOPSPIN 2.1>,
      <abs ABSG = 4 
       data hash MD5: 128K
       9C EA FA 59 91 06 0C 51 41 1A 88 A9 7D 33 89 78>)
(   8,<2014-02-18 17:10:26.082 -0800>,<Administrator>,<X>,<proc1d>,<TOPSPIN 2.1>,
      <abs ABSG = 5 
       data hash MD5: 128K
       06 25 0C 75 12 8D 38 61 BE CD 82 F7 BB A2 95 A6>)
$$ ##END=
$$ 
$$ $$ hash MD5
$$ $$ BD 7C 20 E4 77 5D 38 C0 0D 7E B1 89 03 10 19 F2
##$RELAX= 
##$RELAX= 
##$RELAX= 
##$RELAX= 
##$RELAX= 
##$RELAX= 
##$RELAX= 
##$RELAX= 
$$ Bruker specific parameters
$$ --------------------------
##$DU= <E:\>
##$EXPNO= 12
$$ [...]
##$TP07= 0
##$TPNAME0= <>
##$TPNAME1= <>
##$TPNAME2= <>
##$TPNAME3= <>
##$TPNAME4= <>
##$TPNAME5= <>
##$TPNAME6= <>
##$TPNAME7= <>
##$TPOAL= (0..7)
0.5 0.5 0.5 0.5 0.5 0.5 0.5 0.5
##$TPOFFS= (0..7)
0 0 0 0 0 0 0 0
##$TUNHIN= 0
##$TUNHOUT= 0
##$TUNXOUT= 0
##$USERA1= <user>
##$USERA2= <user>
##$USERA3= <user>
##$USERA4= <user>
##$USERA5= <user>
##$V9= 5
##$VALIST= <valist>
##$VCLIST= <CCCCCCCCCCCCCCC>
##$VD= 0
##$VDLIST= <DDDDDDDDDDDDDDD>
##$VPLIST= <PPPPPPPPPPPPPPP>
##$VTLIST= <TTTTTTTTTTTTTTT>
##$WBST= 2048
##$WBSW= 25
##$XGAIN= (0..3)
0 0 0 0
##$XL= 0
##$YL= 0
##$YMAX_a= 6387008
##$YMIN_a= -13957907
##$ZGOPTNS= <>
##$ZL1= 120
##$ZL2= 120
##$ZL3= 120
##$ZL4= 120
##$ABSF1= 14.96095
##$ABSF2= -5.597232
##$ABSG= 5
##$ABSL= 3
##$ALPHA= 0
##$AQORDER= 0
##$ASSFAC= 0
##$ASSFACI= 0
##$ASSFACX= 0
##$ASSWID= 0
##$AUNMP= <proc_prof1d_extract.lims>
##$AXLEFT= 0
##$AXNAME= <>
##$AXNUC= <1H>
##$AXRIGHT= 0
##$AXTYPE= 0
##$AXUNIT= <>
##$AZFE= 0.1
##$AZFW= 0.1
##$BCFW= 0
##$BC_mod= 0
##$BYTORDP= 0
##$COROFFS= 0
##$CY= 15
##$DATMOD= 1
##$DC= 0
##$DFILT= <>
##$DTYPP= 0
##$F1P= 0
##$F2P= 0
##$FCOR= 0.5
##$FTSIZE= 131072
##$FT_mod= 6
##$GAMMA= 0
##$GB= 0
##$INTBC= 1
##$INTSCL= 1
##$ISEN= 128
##$LB= 0.3
##$LEV0= 0
##$LPBIN= 0
##$MAXI= 10000
##$MC2= 0
##$MEAN= 0
##$ME_mod= 0
##$MI= 0
##$NCOEF= 0
##$NC_proc= -2
##$NLEV= 6
##$NOISF1= 0
##$NOISF2= 0
##$NSP= 0
##$NTH_PI= 0
##$NZP= 0
##$OFFSET= 14.96095
##$PC= 1
##$PHC0= -81.90857
##$PHC1= 0
##$PH_mod= 1
##$PKNL= yes
##$PPARMOD= 0
##$PPDIAG= 0
##$PPIPTYP= 0
##$PPMPNUM= 2147483647
##$PPRESOL= 1
##$PSCAL= 4
##$PSIGN= 0
##$PYNMP= <proc.py>
##$REVERSE= no
##$SF= 400.02000965536
##$SI= 131072
##$SIGF1= 0
##$SIGF2= 0
##$SINO= 400
##$SIOLD= 131072
##$SPECTYP= <>
##$SREGLST= <1H.CDCl3>
##$SSB= 0
##$STSI= 131072
##$STSR= 0
##$SW_p= 8223.68421052631
##$SYMM= 0
##$S_DEV= 0
##$TDeff= 65536
##$TDoff= 0
##$TI= <>
##$TILT= no
##$TM1= 0
##$TM2= 0
##$TOPLEV= 0
##$USERP1= <user>
##$USERP2= <user>
##$USERP3= <user>
##$USERP4= <user>
##$USERP5= <user>
##$WDW= 1
##$XDIM= 131072
##$YMAX_p= 442315145
##$YMIN_p= -11701
##$CURPLOT= <Network HP LaserJet P1505>
##$CURPRIN= <$Network HP LaserJet P1505>
##$DFORMAT= <normdp>
##$LAYOUT= <+/1D_H.xwp>
##$LFORMAT= <normlp>
##$PFORMAT= <normpl>
##$SURQMSG= 1
$$ End of Bruker specific parameters
$$ ---------------------------------
##NTUPLES= NMR SPECTRUM
##VAR_NAME=  FREQUENCY,     SPECTRUM/REAL,   SPECTRUM/IMAG
##SYMBOL=    X,             R,               I
##VAR_TYPE=  INDEPENDENT,   DEPENDENT,       DEPENDENT
##VAR_FORM=  AFFN,          ASDF,            ASDF
##VAR_DIM=   131072,        131072,          131072
##UNITS=     HZ,            ARBITRARY UNITS, ARBITRARY UNITS
##FACTOR=    0.0627417313425164, 1,          1
##FIRST=     8223.62146879497, -1135,        -66189
##LAST=      0,             1011,            -66959
##MIN=       0,             -11701,          0
##MAX=       8223.62146879497, 442315145,    0
$$ Real data points
##PAGE= N=1
##DATA TABLE= (X++(R..R)), XYDATA
$$ [...]
63890A018848l0820k9956k9227k8604k8365k8176k7356k5836k4104k2260j9901
63879G24243j6958j3996j1473r234o874m264j558J059L529O003Q681J1427J3682
63866G04267J5043J5834J6763J8121J9592K0692K1078K0593J9382J7820J6097
63855I05282J4121J2004J0201Q719O730L663K15k525m636p009r685j1782j3165
63842I12133j4941j7751k0633k2356k3152k4211k5861k7165k7287k6568k6014
63831F56194k6098k6296k5780k4358k2626k1127j9720j8038j6252j4859j3869
63820D27171j2803j1549j0529r909r282q407p686p475p395o739n326l565j982
63807C24524r40o07q15j121j211j140j038q72o53o10r70j705k640l534m012l727
$$ y = [1018848, 988028, 958072, 928845, 900241, 871876, 843700, 816344, 790508, 766404, 744144, 724243, 707285, 693289, 681816, 672582, 665708, 661444, 659886, 660945, 664474, 670477, 679158, 690585, 704267, 719310, 735144, 751907, 770028, 789620, 810312, 831390, 851983, 871365, 889185, 905282, 919403, 931407, 941608, 950327, 957057, 960720, 960935, 958410, 953774, 946765, 937080, 925298, 912133, 897192, 879441, 858808, 836452, 813300, 789089, 763228, 736063, 708776, 682208, 656194, 630096, 603800, 578020, 553662, 531036, 509909, 490189, 472151, 455899, 441040, 427171, 414368, 402819, 392290, 382381, 373099, 364692, 357006, 349531, 342136, 335397, 330071, 326506, 324524, 323584, 322977, 322162, 321041, 319830, 318690, 317652, 316780, 316127, 315517, 314547, 312842, 310202, 306668, 302656, 298929]
63791B98929k831k022j893k434l174l569l211k108r36n87j193j951k165k023k079
63776B66753k349k390j991j385r53j001j579k172j906n77P89R94J67l62K01J171
63760B53410J361N55m64r50q30l86J33N35O63N96O53R30J059P28L18N03J219J611
63742B61644J218P08R54J801K331K195J955K195K788L191K992K106Q94J55N28
63727B87655J738K795L109K984K963L177L541M076M661M869M460L754L222K876
63713C35880K417J768J080L95l93j236j913k259k289k104j833j575j348j117q99
63698C24574p06l66L65J432K423K999L227L354L457L415L136K678K231J985J931
63683C56135J738J087J16o47q51o38m31n48j036j621j793j211j11Q48J120O16
$$ y = [298929, 296098, 294076, 292183, 289749, 286575, 283006, 279795, 277687, 276751, 276164, 274971, 273020, 270855, 268832, 266753, 264404, 262014, 260023, 258638, 257685, 256684, 255105, 252933, 251027, 250450, 251239, 252233, 252400, 252038, 252239, 253410, 254771, 255326, 254862, 253912, 253082, 252696, 252829, 253364, 254027, 254623, 255276, 256206, 257265, 257993, 258311, 258814, 260033, 261644, 262862, 263570, 264524, 266325, 268656, 270851, 272806, 275001, 277789, 280980, 283972, 286078, 286972, 287127, 287655, 289393, 292188, 295297, 298281, 301244, 304421, 307962, 312038, 316699, 321568, 326028, 329782, 333004, 335880, 338297, 340065, 341145, 341540, 341147, 339911, 337998, 335739, 333450, 331346, 329513, 327938, 326590, 325473, 324574, 323868, 323502, 323867, 325299, 327722, 330721, 333948, 337302, 340759, 344174, 347310, 349988, 352219, 354204, 356135, 357873, 358960, 359076, 358429, 357578, 356940, 356509, 355961, 354925, 353304, 351511, 350300, 350189, 351037, 352157, 352773]
63667C52773l35j145j265o92m2J53M1m7l57j272k358k748k515k756l963n199n371
63650C22902m610l769l152k478j713j182r93q93p34o05n44m10l6O46J529K250
63634C06208K488K426K639L255L682L462L033L197M112N216N950O162N990N763
63620C63583N922O691P879R190J0538J1856J2904J3634J4464J5831J7633J9417
63608E09542K0952K2263K3352K4253K5157K6063K6444K5626K3443K0162J6001
63597G63258J1177O329K379j20j300j711k004k684l808n022o194p825j0450j3737
63583G28288j6684j8665j9829k0541k0892k0872k0465j9450j7524j4865j2240
63572E26261j0248q739p123n114k886q11P70J608J737J658K026L066M312N067
$$ y = [352773, 352438, 351293, 350028, 349336, 349294, 349447, 349488, 349441, 349084, 347812, 345454, 342706, 340191, 337435, 333472, 328273, 322902, 318292, 314523, 311371, 308893, 307180, 305998, 305005, 304112, 303378, 302773, 302229, 301819, 301783, 302429, 303958, 306208, 308696, 311122, 313761, 317016, 320698, 324160, 327193, 330390, 334502, 339718, 345668, 351830, 357820, 363583, 369505, 376196, 384075, 393265, 403803, 415659, 428563, 442197, 456661, 472492, 490125, 509542, 530494, 552757, 576109, 600362, 625519, 651582, 678026, 703652, 727095, 747257, 763258, 774435, 780764, 783143, 783023, 781723, 780012, 778008, 775324, 771516, 766494, 760300, 752475, 742025, 728288, 711604, 692939, 673110, 652569, 631677, 610805, 590340, 570890, 553366, 538501, 526261, 516013, 507274, 500151, 495037, 492151, 491340, 492110, 493718, 495455, 497113, 499139, 502205, 506517, 511584]
63558E11584N100M781M615M773N226O118P686R944J2688J5855J9512K3418K7002
63545F58302K9988L2725L5489L7654L7848L4967K8976K0945J2494N058p11m867
63533I28868p553q710q497p632o912o581o480o738p909j0418j4107j8360k2458
63520G96513k5850k8298k9852l0572l0340k9047k6922k4481k2181k0187j8441
63509E10342j6759j4980j3118j1355r827q510p409o631o178n799n256m634m172
63496C95714l886l532k916k082j243o56m83o73r93j242j322j169p47j82K88N82
63480C75458Q84J357J922K366K541K379J933J465J253J242J065M64n07j715l018
63465C89089m053m387m036l510l141k747k138j544j218j014p44o28q85j189r89
$$ y = [511584, 516684, 521465, 526080, 530853, 536079, 542197, 549883, 559827, 572515, 588370, 607882, 631300, 658302, 688290, 721015, 756504, 794158, 832006, 866973, 895949, 916894, 929388, 934446, 933735, 928868, 921315, 912605, 904108, 896476, 889564, 882983, 876503, 869765, 861856, 851438, 837331, 818971, 796513, 770663, 742365, 712513, 681941, 651601, 622554, 595632, 571151, 548970, 528783, 510342, 493583, 478603, 465485, 454130, 444303, 435793, 428384, 421753, 415575, 409776, 404520, 399886, 395714, 391828, 388296, 385380, 383298, 382055, 381399, 380916, 380243, 379250, 378008, 376686, 375517, 374770, 374588, 374876, 375458, 376342, 377699, 379621, 381987, 384528, 386907, 388840, 390305, 391558, 392800, 393865, 394329, 393822, 392107, 389089, 385036, 380649, 376613, 373103, 369962, 367215, 365077, 363533, 362315, 361301, 360557, 359929, 359044, 357855, 356866]
63450C56866k82M19Q82J445K385L403L988M132M396N229O392P296P895Q904J0921
63435D24271J3670J6557J9679K3504K7585L0368L0656K8641K5229K0951J6040
63424F77151J1103P044M454L441L891N602Q307J1777J5779J9810K3271K5980K8087
63411H45697K9344K8982K6619K2746J8040J2770P326K610o61k637l772m136l897
63398I79031l956n221p577j0323j3383j7245k1872k6409k9983l2195l2893l2108
63386G45866l0305k8213k6318k4759k3444k1925j9535j6211j2881j0458q723o856
63374E16238m709k725q86J294L691N495O368O895P574Q201Q589R248J0796J3088
63360E89157J5429J7393J9127K0931K2885K4820K6572K8184K9716L0847L0899
$$ y = [356866, 356584, 357003, 357885, 359330, 361715, 365118, 369106, 373238, 377634, 382863, 389255, 396551, 404446, 413350, 424271, 437941, 454498, 474177, 497681, 525266, 555634, 586290, 614931, 640160, 661111, 677151, 688254, 695298, 699752, 703193, 707084, 712686, 720993, 732770, 748549, 768359, 791630, 817610, 845697, 875041, 904023, 930642, 953388, 971428, 984198, 991524, 994134, 993473, 990836, 987064, 982928, 979031, 975075, 969854, 962277, 951954, 938571, 921326, 899454, 873045, 843062, 810867, 777974, 745866, 715561, 687348, 661030, 636271, 612827, 590902, 571367, 555156, 542275, 531817, 523094, 516238, 511529, 508804, 507918, 509212, 512903, 518398, 524766, 531661, 539235, 547436, 556025, 565273, 576069, 589157, 604586, 621979, 641106, 662037, 684922, 709742, 736314, 764498, 794214, 825061, 855960]
63349H55960K9465K6707K2841J7738J1488N060j80l574n395o196o396o362o427
63336I34729o804p731r546j2307j5627j9121k2603k5593k7283k7500k7102k6734
63324G06778k5751k3242j9562j5864j2513r023n332k175l42m75l147q010j3062
63311E68280j6078j6803j6672j6494j5806j4406j2934j1536r448o512l895k541
63299D25155k025j556j144j055j054r34j011j423j709j669j808k307k501k090
63285D02869j946k791l937m319m031l799l533k645j331m19q7J77M82L81j57n21
63269C74393l68p4l8j08J36Q73J872K674K897K599K175J873J681J814K751M403
63253C99553N814O175N776N473N594N887O210O661P254P963Q913J0083J1119J1860
$$ y = [855960, 885425, 912132, 934973, 952711, 964199, 969259, 969079, 965505, 960110, 953914, 947518, 941156, 934729, 927925, 920194, 910648, 898341, 882714, 863593, 840990, 815397, 788114, 760614, 733512, 706778, 681027, 657785, 638223, 622359, 609846, 600823, 595491, 593316, 592974, 592499, 589352, 581342, 568280, 552202, 535399, 518727, 502233, 486427, 472021, 459087, 447551, 438103, 431591, 427696, 425155, 423130, 421574, 420430, 419375, 418321, 417387, 416376, 414953, 413244, 411575, 409767, 407460, 404959, 402869, 400923, 398132, 394195, 389876, 385845, 382046, 378513, 375868, 374537, 374118, 374031, 374208, 374690, 375071, 374914, 374393, 374025, 373951, 373913, 373805, 373941, 374814, 376686, 379360, 382257, 384856, 387031, 388904, 390585, 392399, 395150, 399553, 405367, 411542, 417318, 422791, 428385, 434272, 440482, 447143, 454397, 462360, 471273, 481356, 492475, 504335]
63239E04335J2717J4101J5861J7736J9900K2436K4766K6347K7579K9232L1157
63228G46167L2475L2924L3140L3529L3740L3409L2826L2521L2691L3223L3939
63217A110584L4685L5475L6497L7687L8289L7399L4834L1083K6440K0739J3919
63206A457631O270j939j0551j9064k6658l2870l7801m1496m3596m3910m2887m1063
63194A122066l8410l4647l0016k5288k0959j6818j2411p698l099J036M818Q596
63182I47170J2501J6313J9712K2524K4711K6312K7465K8355K9073K9592K9904
63171A213632L0022K9870K9345K8496K7425K6004K3907K0931J6972J1737M913
63160A463254l164j1414j8798k4999l0296l5150l9979m4772m8658n0401m9718
$$ y = [504335, 517052, 531153, 547014, 564750, 584650, 607086, 631852, 658199, 685778, 715010, 746167, 778642, 811566, 844706, 878235, 911975, 945384, 978210, 1010731, 1043422, 1076645, 1110584, 1145269, 1180744, 1217241, 1254928, 1293217, 1330616, 1365450, 1396533, 1422973, 1443712, 1457631, 1463901, 1461962, 1451411, 1432347, 1405689, 1372819, 1335018, 1293522, 1249926, 1206016, 1163129, 1122066, 1083656, 1049009, 1018993, 993705, 972746, 955928, 943517, 935819, 932720, 933756, 938574, 947170, 959671, 975984, 995696, 1018220, 1042931, 1069243, 1096708, 1125063, 1154136, 1183728, 1213632, 1243654, 1273524, 1302869, 1331365, 1358790, 1384794, 1408701, 1429632, 1446604, 1458341, 1463254, 1460090, 1448676, 1429878, 1404879, 1374583, 1339433, 1299454, 1254682, 1206024, 1155623, 1105905]
63149A105905m7666m5382m2947l9921l6478l3229l0252k7130k3901k1158j9153
63138G38688j7349j5149j2634j0332q576p262o156n216m588m211l555k080j6J775
63124F43339K862L643M526N277N698O222P101P580O836N435M737M930M820L739
63110G16745K546K188K266J757N75m76r14r91r94q78o27m36m24m45l58k73l84
63093G18877p34j150j396j325j009o64l59R7P98J405J458J098J071J820K855L386
63077G26228L465L903N099O431P111P190P321P908Q941J0355J1925J3053J3360
63064H32290J3550J4847J7460K0317K2560K4619K7280L0435L3477L6435L9898
63053A113168M3940M7936N1555N5266N9616O4415O8955P2780P5907P8354P9819
$$ y = [1105905, 1058239, 1012857, 969910, 929989, 893511, 860282, 830030, 802900, 778999, 757841, 738688, 721339, 706190, 693556, 683224, 674648, 667386, 661230, 656014, 651426, 647215, 643660, 641580, 641564, 643339, 646201, 649844, 654370, 659647, 665345, 671567, 678668, 686248, 693084, 698519, 703256, 708186, 713006, 716745, 719291, 721479, 723745, 725502, 726077, 725601, 724687, 723696, 722702, 721824, 721197, 720761, 720337, 719892, 719534, 719261, 718877, 718143, 716993, 715597, 714272, 713263, 712599, 712240, 712337, 713135, 714540, 715998, 717096, 718167, 719987, 722842, 726228, 729693, 733596, 738695, 745126, 752237, 759427, 766748, 774656, 783597, 793952, 805877, 818930, 832290, 845840, 860687, 878147, 898464, 921024, 945643, 972923, 1003358, 1036835, 1073270, 1113168, 1157108, 1205044, 1256599, 1311865, 1371481, 1435896, 1504851, 1577631, 1653538, 1731892, 1811711]
63042A811711Q0079P9569P9235P9563Q0053Q0032P9750Q0132Q1470Q2946Q3544
63031B698084Q2844Q0672P6653P0508O2340N2126L9349K3708N826j3126l2163
63020C146821n0398o6628p9787q9736r7051j02056j04500j04087j00868r5116
63010B256594q7318p8298o8869n9267m9158l8331k7147j6327o474K283J0329J8173
62998A856190K5823L2708L8335M2778M6340M9058N0931N2311N3605N4735N5294
62987B358108N5210N4848N4344N3165N0384M5325L7987K8940J8712P268n666j9751
62975B738874l3955m7445o0046p1536q1090q7978r2387r5005r6004r5016r1988
62964A886424q7521q2431p7312p2399o7527o2354n6933n1809m7403m3635m0389
$$ y = [1811711, 1891790, 1971359, 2050594, 2130157, 2210210, 2290242, 2369992, 2450124, 2531594, 2614540, 2698084, 2780928, 2861600, 2938253, 3008761, 3071101, 3123227, 3162576, 3186284, 3192110, 3178984, 3146821, 3096423, 3029795, 2950008, 2860272, 2763221, 2661165, 2556665, 2452578, 2351710, 2256594, 2169276, 2090978, 2022109, 1962842, 1913684, 1875353, 1848206, 1831879, 1825405, 1827688, 1838017, 1856190, 1882013, 1914721, 1953056, 1995834, 2042174, 2091232, 2142163, 2194474, 2248079, 2302814, 2358108, 2413318, 2468166, 2522510, 2575675, 2626059, 2671384, 2709371, 2738311, 2757023, 2764291, 2758625, 2738874, 2704919, 2657474, 2597428, 2525892, 2444802, 2356824, 2264437, 2169432, 2073428, 1978412, 1886424, 1798903, 1716472, 1639160, 1566761, 1499234, 1436880, 1379947, 1328138, 1280735, 1237100, 1196711]
62953A196711l7901l6227l4845l3294l1798l0703k9685k8231k6516k5051k3745
62942H58715k2069j9999j8048j6441j5016j3851j3258j3095j2711j1696j0188
62931F92343q451o678n180m259l795l416k977k515j944j293r82j340k009k455
62917F45049k734l162l495l345l118l545m384m616m019l508l721m206m306m052
62903E92838l739l361k864k430k182k085k220k564k557j669m93l32j392k384k316
62888E60250j727j483j342o10M29P76K25l58k39L05M92L6n72n96J66J109J442
62871E58303R66M7j011k085k820k765k031j310r82p60l86j38k99o77r29j031j052
62854E41040q65l81K89J089K023K721K512J327R1k49K52Q01Q43M12k20p87j144
$$ y = [1196711, 1158810, 1122583, 1087738, 1054444, 1022646, 991943, 962258, 934027, 907511, 882460, 858715, 836646, 816647, 798599, 782158, 767142, 753291, 740033, 726938, 714227, 702531, 692343, 683892, 677214, 672034, 667775, 663980, 660564, 657587, 655072, 653128, 651835, 650853, 649513, 647504, 645049, 642315, 639153, 635658, 632313, 629195, 625650, 621266, 616650, 612631, 609123, 605402, 601196, 596890, 592838, 589099, 585738, 582874, 580444, 578262, 576177, 573957, 571393, 568836, 567167, 566674, 566342, 564950, 562566, 560250, 558523, 557040, 555698, 555088, 555517, 556293, 556518, 556160, 555921, 556226, 556718, 556754, 556182, 555586, 555752, 556861, 558303, 559269, 559316, 558305, 556220, 553400, 550635, 548604, 547294, 546312, 545552, 545166, 545028, 544729, 544052, 543123, 542092, 541040, 540175, 539794, 540083, 541172, 543195, 545916, 548428, 549755, 549846, 549597, 549849, 550650, 551493, 551905, 551685, 550898, 549754]
62837E49754j385j717k060k041j524r27p42j037j483j700j466r10m93m51l14N28
62821E32032J795K600K767L024L700M140M002M183N575P563Q678Q433P633P073
62807F03198O813O745P023P678Q396Q910R263R581R867J0195J0800J1822J3129
62794G23420J4503J5844J7112J8259J9391K0953K3546K7478L2466L7892M3356
62783I94220M8867N4579O0627O7297P4983Q3625R2496J00877J08701J16107J22641
62772A925020J27489J30306J31148J29666J25075J16962J05480R0724P2597N1595
62762C006062K9024O169j6293l7874n7853p5557r0612j02696j11525j17281j20582
62751B310982j21793j20872j18003j13805j08671j02516r5420q7967q0670p3660
$$ y = [549754, 548369, 546652, 544592, 542551, 541027, 540100, 539358, 538321, 536838, 535138, 533672, 532762, 532269, 531818, 531504, 532032, 533827, 536427, 539194, 542218, 545918, 550058, 554060, 558243, 563818, 571381, 580059, 588492, 596125, 603198, 610011, 616756, 623779, 631457, 639853, 648763, 658026, 667607, 677474, 687669, 698469, 710291, 723420, 737923, 753767, 770879, 789138, 808529, 829482, 853028, 880506, 912972, 950864, 994220, 1043087, 1097666, 1158293, 1225590, 1300573, 1384198, 1476694, 1577571, 1686272, 1802379, 1925020, 2052509, 2182815, 2313963, 2443629, 2568704, 2685666, 2791146, 2881870, 2954467, 3006062, 3035086, 3041255, 3024962, 2987088, 2929235, 2853678, 2763066, 2660370, 2548845, 2431564, 2310982, 2189189, 2068317, 1950314, 1836509, 1727838, 1625322, 1529902, 1441935, 1361265, 1287605]
62741A287605o7222o1860n7431n2862m7396m1614l6613l2609k8979k5348k1971
62730H13700j9188j6984j5067j3078j0814q495o586n248m163l020j802n77O05
62717G09283J592K341L360N296Q037J0786J3198J5679J8476K1252K3908K6973
62705H60181L0746L4925L9419M4700N0811N6944O2594O8312P4605Q1073Q7350
62694A491660R3940J01068J07536J11886J14117J14964J13951J09437J00511Q7689
62684B546759P1881N3733L4013J3663o710k6781m5941o3373p8638r1522j01475
62673B305609j07901j10971j11549j10433j08061j04653j00066r3925q6588p9472
62663A291990p3584o8205o2058n5329m9409m4809m0727l6609l2855k9745k6844
$$ y = [1287605, 1220383, 1158523, 1101092, 1048230, 1000834, 959220, 922607, 889998, 861019, 835671, 813700, 794512, 777528, 762461, 749383, 738569, 730074, 723488, 718240, 714077, 711057, 709255, 708678, 709283, 710875, 713216, 716576, 721872, 729909, 740695, 753893, 769572, 788048, 809300, 833208, 860181, 890927, 925852, 965271, 1009971, 1060782, 1117726, 1180320, 1248632, 1323237, 1404310, 1491660, 1585600, 1686668, 1794204, 1906090, 2020207, 2135171, 2249122, 2358559, 2459070, 2546759, 2618640, 2672373, 2706386, 2720049, 2713339, 2686558, 2640617, 2577244, 2498606, 2407084, 2305609, 2197708, 2086737, 1975188, 1864755, 1756694, 1652041, 1551975, 1458050, 1371462, 1291990, 1218406, 1150201, 1088143, 1032814, 983405, 938596, 897869, 861260, 828405, 798660, 771816]
62652G71816k3917k1430j9690j8322j6956j5714j4660j3580j2577j2094j1950
62641E90926j1139r107o614m793l931l580l300k806j975j162j099j941k807k889
62627E33783k509k568l152l467l009k197j684j523j272o55J49Q85J579K433L436
62612E20229M345N038N642O214O587O733P005P726Q791R991J1517J3672J6319
62599F29809J9036K1768K4899K8651L2827L7146M1576M6270N1295N6357O0666
62588A050300O3416O4508O4497O3468O0557N5044M7447L8819K9384J8728P057
62577A563225m622j5523k5481l4291m1545m7197n1577n4658n6050n5798n4553
62566A121930n2732n0260m7302m4490m2069l9495l6264l2619k9061k5707k2484
$$ y = [771816, 747899, 726469, 706779, 688457, 671501, 655787, 641127, 627547, 614970, 602876, 590926, 579787, 570680, 564066, 559273, 555342, 551762, 548462, 545656, 543681, 542519, 541420, 539479, 536672, 533783, 531274, 528706, 525554, 522087, 519078, 516881, 515197, 513674, 512402, 511747, 511896, 512781, 514360, 516793, 520229, 524574, 529612, 535254, 541468, 548055, 554788, 561793, 569519, 578310, 588301, 599818, 613490, 629809, 648845, 670613, 695512, 724163, 756990, 794136, 835712, 881982, 933277, 989634, 1050300, 1113716, 1178224, 1242721, 1306189, 1366746, 1421790, 1469237, 1508056, 1537440, 1556168, 1563225, 1558603, 1543080, 1517599, 1483308, 1441763, 1394566, 1342989, 1288331, 1232281, 1176483, 1121930, 1069198, 1018938, 971636, 927146, 885077, 845582, 809318, 776699, 747638, 721931, 699447]
62555F99447j9493j6779j4146j1604r635q640q401q333q032p313o103m555l026
62542E73387j715n78K59M15j30p20o86j05L84M15K26L12R23J841K583K966L477
62525E83254M863P289J0167J2877J5298J7593J9829K2078K4583K7606L1213L5386
62513H12036M0158M5452N0947N6203O0877O4734O7575O9207O9383O7830O4388
62502A468790N9089N2064M3456L3579K2985J2222J709q029j6258k2390k6209k7580
62490A593428k6306k2688j7763j2525p043p70O553J4621K2828L0363L6496M1236
62478A658430M5129M7696M6863M1085L1664K1603J2320K796q107k0036l2207m4416
62466A802820n6181o6055p2855p6914p9245q0144p9357p7022p3561o9060o3548
$$ y = [699447, 679954, 663175, 649029, 637425, 627790, 619150, 610749, 602416, 594384, 587071, 580968, 576413, 573387, 571672, 571094, 571353, 571768, 571638, 570918, 570232, 570127, 570511, 570926, 571152, 571464, 572387, 574228, 576811, 579777, 583254, 588117, 595406, 605573, 618450, 633748, 651341, 671170, 693248, 717831, 745437, 776650, 812036, 852194, 897646, 948593, 1004796, 1065673, 1130407, 1197982, 1267189, 1336572, 1404402, 1468790, 1527879, 1579943, 1623399, 1656978, 1679963, 1692185, 1693894, 1685865, 1669607, 1647217, 1621008, 1593428, 1567122, 1544434, 1526671, 1514146, 1507103, 1506333, 1512886, 1527507, 1550335, 1580698, 1617194, 1658430, 1703559, 1751255, 1798118, 1839203, 1870867, 1892470, 1904790, 1907586, 1899479, 1879443, 1847236, 1802820, 1746639, 1680584, 1607729, 1530815, 1451570, 1371426, 1292069, 1215047, 1141486, 1072426, 1008878]
62455A008878n7539n1560m5441l8879l2440k7184k3345k0072j6583j2983r825
62444F73027p302n064k641N9K571M257N053N595O470P472P918P538O684N680M228
62429G21545J741j820n561q339r850j0876j2165j3407j3729j3025j2166j1846
62417F10502j1818j1449j0604r656q963q627q450p956o802n340m407m347m570
62404E07513m308l526k801k536k582k443j710m31Q43J545J675J692J869K101K349
62389D99250K789L394L753L600L194K975L064L293L582M074N015O434P863Q547
62375E60827Q230P533P177P111O859O501O574P141P751Q296R158J0436J1797J3272
62361F78663J5382J8272K1479K4784K8481L2516L6225L9343M2415M5677M8321
$$ y = [1008878, 951339, 899779, 854338, 815459, 783019, 755835, 732490, 712418, 695835, 682852, 673027, 665725, 660661, 658020, 658079, 660650, 664907, 669960, 675555, 682025, 689497, 697415, 704953, 711637, 717317, 721545, 723286, 721466, 715905, 707566, 697716, 686840, 674675, 661268, 647539, 634514, 622348, 610502, 598684, 587235, 576631, 566975, 558012, 549385, 540935, 532979, 526177, 520837, 516430, 512083, 507513, 503205, 499679, 496878, 494342, 491760, 489317, 487607, 487176, 488019, 489564, 491239, 492931, 494800, 496901, 499250, 502039, 505433, 509186, 512786, 515980, 518955, 522019, 525312, 528894, 532968, 537983, 544417, 552280, 560827, 569057, 576590, 583767, 590878, 597737, 604238, 610812, 617953, 625704, 634000, 643158, 653594, 665391, 678663, 694045, 712317, 733796, 758580, 787061, 819577, 855802, 895145, 937560, 983237, 1031558]
62350A031558M9505M9337M8131M5473M0865L4876K8686K2787J6876J0744M559
62339A383397j548p511j3001j7673k1681k5371k8626l0896l1876l1742l0839k9433
62327A113200k7687k5622k3278k1079j9646j9055j8725j8393j8578j9615k0794
62316H80728k1224k1203k1705k2713k2962k1534j8975j6479j4519j2629j0288
62305F76497p548m888k641p41R66K329L020L016K684K312J936J580J308R02J9
62290F80751j166j897j807j408j311j439j526j849k783l851m034l062j810j214
62276F51594j238j145n09L21Q00J002J577K792M000M415M291M710O220Q239R995
62261F97064J1448J3096J5375J8577K2755K7418L1754L5563L9488M3969M8422
$$ y = [1031558, 1081063, 1130400, 1178531, 1224004, 1264869, 1299745, 1328431, 1351218, 1368094, 1378838, 1383397, 1381849, 1374338, 1361337, 1343664, 1321983, 1296612, 1267986, 1237090, 1205214, 1173472, 1142633, 1113200, 1085513, 1059891, 1036613, 1015534, 995888, 976833, 958108, 939715, 921137, 901522, 880728, 859504, 838301, 816596, 793883, 770921, 749387, 730412, 713933, 699414, 686785, 676497, 668949, 664061, 661420, 660679, 661645, 663974, 666994, 670010, 672694, 675006, 676942, 678522, 679830, 680732, 680751, 679585, 677688, 675881, 674473, 673162, 671723, 670197, 668348, 665565, 661714, 657680, 654618, 652808, 651594, 650356, 649211, 648702, 649023, 649823, 650825, 652402, 655194, 659194, 663609, 667900, 672610, 678830, 687069, 697064, 708512, 721608, 736983, 755560, 778315, 805733, 837487, 873050, 912538, 956507, 1004929]
62250A004929N1828N3690N4035N2863N0154M6042M0598L3741K5774J7594R894
62239A441142K432n490j3994k2464l0120l6514m1643m5805m9121n1075n0982m9007
62227A047359m6127m3011l9570l5820l2304k9276k6309k3219k0528j8489j6528
62216G16178j4381j2742j1897j0751q424n986n082n352m916l210j676j428j725
62203F28608j363l15P30J546K349L097L566L774L931M172M624N418O424P172P334
62188F81067P050O742O762P318Q449R837J0877J1109J0633J0049R859R873R320
62175G98945P768N792M401L936M009M421N415P096R339J2458J6873K1870K5783
62162I28106K8025K9957L2853L5955L7584L7295L5777L3216K9177K3832J8101
$$ y = [1004929, 1056757, 1110447, 1164482, 1217345, 1267499, 1313541, 1354139, 1387880, 1413654, 1431248, 1441142, 1443574, 1438084, 1424090, 1401626, 1371506, 1334992, 1293349, 1247544, 1198423, 1147348, 1096366, 1047359, 1001232, 958221, 918651, 882831, 850527, 821251, 794942, 771723, 751195, 732706, 716178, 701797, 689055, 677158, 666407, 657983, 651997, 646915, 641563, 636647, 633437, 631761, 630333, 628608, 627245, 626930, 627660, 629206, 631555, 634652, 638218, 641992, 645923, 650095, 654719, 660137, 666561, 673733, 681067, 688117, 694859, 701621, 708939, 717388, 727225, 738102, 749211, 759844, 769893, 779752, 789625, 798945, 806713, 812505, 816906, 820842, 824851, 829272, 834687, 841783, 851122, 863580, 880453, 902323, 928106, 956131, 986088, 1018941, 1054896, 1092480, 1129775, 1165552, 1198768, 1227945, 1251777, 1269878]
62151A269878J2588P369K549j855o375j1377j6130j9641k2170k4729k7274k8647
62139A134186k8380k7196k5552k3047j9620j6184j3416j0992q587o739o022o038
62127I42413n966n587n222n054n049n133m966l938j835O49K558L675M644O036
62113I17225P545Q103O923M389J741j91j629l027m137m351l664k646j772j328
62099I23181j634k704l836m251l968l453k742j667o23j60O0R29K454L578L565
62084I08729K839K308K539L626N166O319O584O493O946Q008R077J0021J1123J2073
62070A001851J2107J1259J0457J0271J0507J1100J2299J3762J4705J5262J6576
62059A140156J9043K1469K2475K1844K0075J7538J4631J1861R166N902J947k022
$$ y = [1269878, 1282466, 1289835, 1292384, 1290529, 1284154, 1272777, 1256647, 1237006, 1214836, 1190107, 1162833, 1134186, 1105806, 1078610, 1053058, 1030011, 1010391, 994207, 980791, 969799, 961212, 954473, 948451, 942413, 936447, 930860, 925638, 920584, 915535, 910402, 905436, 901498, 899663, 900312, 902870, 906545, 911189, 917225, 924770, 932873, 939796, 944185, 945926, 945735, 944106, 941079, 936942, 932591, 928927, 926281, 924509, 923181, 921547, 918843, 915007, 910756, 906788, 903335, 900593, 898926, 898303, 898143, 898203, 899132, 901586, 905164, 908729, 911568, 913876, 916415, 920041, 925207, 931526, 938110, 944603, 951549, 959557, 968634, 978655, 989778, 1001851, 1013958, 1025217, 1035674, 1045945, 1056452, 1067552, 1079851, 1093613, 1108318, 1123580, 1140156, 1159199, 1180668, 1203143, 1224987, 1245062, 1262600, 1277231, 1289092, 1298258, 1304160, 1306107, 1304085]
62047A304085n754r926j4892j9866k4088k7851l1603l4859l6945l8078l8759l8719
62035I82745l7498l5567l3840l2310l0194k7302k4341k1887j9794j7763j5864
62024F86385j4309j3135j2252j1607j1158j0789j0226r134p632o543o670p691
62012E65239q270p480n728m046k991k435k016j461p73k52n3K46J089K087K466
61997E35622K336K599L444L937L517K811K455K028R40m92j627k492l399m184m686
61982E42809n424o811q186q523p836p057o729o644o511o216n537m401l319k915
61968D56700l054l025k577k137j998j891j386l70Q96J885K033J256J90l98k68
61953D45856M22J553K835L537L111K113J867L080N161O953P764P628P041O675
$$ y = [1304085, 1298331, 1288405, 1273513, 1253647, 1229559, 1201708, 1170105, 1135246, 1098301, 1060223, 1021464, 982745, 945247, 909680, 875840, 843530, 813336, 786034, 761693, 739806, 720012, 702249, 686385, 672076, 658941, 646689, 635082, 623924, 613135, 602909, 593775, 586143, 579600, 572930, 565239, 556969, 549489, 543761, 539715, 536724, 534289, 532273, 530812, 530039, 529787, 529734, 529980, 531069, 533156, 535622, 537958, 540557, 544001, 547938, 551455, 554266, 556721, 558749, 559689, 559197, 557570, 555078, 551679, 547495, 542809, 537385, 530574, 522388, 513865, 506029, 498972, 492243, 485599, 479088, 472872, 467335, 462934, 459615, 456700, 453646, 450621, 448044, 445907, 443909, 442018, 440632, 440262, 441158, 443043, 445076, 446332, 446522, 446124, 445856, 446278, 447831, 450666, 454203, 457314, 459427, 461294, 464374, 469535, 476488, 484252, 491880, 498921, 505596]
61939E05596P061Q232R682J0803J1390J1605J1564J1101J0136R094Q594Q631Q475
61926F31964P660O635O008N532M404K378r4k577m772o124o238n670n429n515m829
61911F23333k793j84K013L825N858Q228J0395J1682J1696J0675R475Q721P914
61898G10838O099L393Q95j000l064n628p674q222p725p273p169p013o636o197
61884F53624n771n454n438n654n852o258p330q638q992q232p783q655r880r869
61870E49818q510o905n743m908m150l245j914l24Q30J344J947L126M361N294O627
61855E37648Q855J1100J2432J3456J5181J7101J7993J8039J8543J9854K1128K1949
61843G33279K2536K2451K0698J7396J3938J1168Q570N506K155j050l893o002o958
$$ y = [505596, 512657, 520889, 530571, 541374, 552764, 564369, 575933, 587034, 597170, 606264, 614858, 623489, 631964, 639624, 646259, 652267, 657799, 662203, 664581, 664487, 661910, 657138, 651014, 644776, 639106, 633677, 628162, 623333, 620540, 620356, 622369, 626194, 632052, 640280, 650675, 662357, 674053, 684728, 694203, 702924, 710838, 716937, 720330, 721225, 720225, 717161, 711533, 703859, 695637, 687912, 680639, 673470, 666457, 659821, 653624, 647853, 642399, 636961, 631307, 625455, 619197, 611867, 603229, 594237, 586005, 578222, 569567, 559687, 549818, 541308, 534403, 528660, 523752, 519602, 516357, 514443, 514119, 514949, 516293, 518240, 521366, 525727, 531021, 537648, 546503, 557603, 570035, 583491, 598672, 615773, 633766, 651805, 670348, 690202, 711330, 733279, 755815, 778266, 798964, 816360, 830298, 841466, 850036, 855542, 857697, 856647, 852754, 846752, 839794]
61830H39794p027o908o579n315k944j28K681N535Q058R377R316Q649P755O009
61816H68273L003n42l701o448r217j1961j4270j5957j7033j7474j7365j6913j5998
61803G24397j4273j1996j0299j0087j0950j1621j1350j0500r831r520r004p764
61791E97202o140n089n036n377n294m635l664k451j127l28o03j530k089j862j303
61776E50674r34q49r30r57o73j22K27J66K16Q46J645J981K040K431L100L553L852
61759E66266M399M951M910M476M461M966N278N029M463L487J693n26k030k493
61745F09330k846l804m909n477n583n594n463n055m507l872k984k060j777k286
61731E53113k781k426j270J11J259J830J550O61nK07J210K503L631M184L876K885
$$ y = [839794, 832767, 825859, 819280, 813965, 811021, 810893, 813574, 819109, 827167, 836544, 845860, 854509, 862264, 868273, 871276, 870734, 867033, 860585, 851368, 839407, 825137, 809180, 792147, 774673, 757308, 740395, 724397, 710124, 698128, 687829, 677742, 666792, 655171, 643821, 633321, 623490, 613970, 604966, 597202, 591062, 585973, 580937, 575560, 570266, 565631, 561967, 559516, 558389, 558061, 557458, 555928, 553839, 551977, 550674, 549740, 548891, 547961, 547004, 546331, 546209, 546436, 546602, 546818, 547664, 549309, 551290, 553330, 555761, 558861, 562414, 566266, 570665, 575616, 580526, 585002, 589463, 594429, 599707, 604736, 609199, 612686, 614379, 613853, 611823, 609330, 606484, 602680, 597771, 592294, 586711, 581117, 575654, 570599, 566092, 562220, 559236, 557176, 555399, 553113, 550332, 547906, 546636, 546747, 548006, 549836, 551386, 552047, 552042, 552249, 553459, 555962, 559593, 563777, 567653, 570538]
61715E70538J766R59O60J014J815K187J425Q1o20n55q04j806k543k130j188q84
61699E69915j361j914k233k599l173l733m015l924l498k972k676k698k837k960
61685E29322l090l172l087k980l108l306l175k796k729l134l481l294k693k100
61671D87177j810j958k427k723k434j739j023k17Q24J591J461P85M76O22O10N43
61655D79758J178K361K950K709K805L797M527L965K891K576K736K147O89m58l98
61640E14233O97K143L230L310K210N98n55r08p54m07O4O16J050J025K47j059k033
61623E23707k171k256l390n121n716m614l363l380m035l939l173k959l650m367
61609D71573m451m192m057m019l827l411k931k693k936l511l973m086l918l418
$$ y = [570538, 572304, 573263, 573923, 574937, 576752, 578939, 580364, 580445, 579825, 579270, 578466, 576660, 574117, 571987, 570799, 569915, 568554, 566640, 564407, 561808, 558635, 554902, 550887, 546963, 543465, 540493, 537817, 535119, 532282, 529322, 526232, 523060, 519973, 516993, 513885, 510579, 507404, 504608, 501879, 498745, 495264, 491970, 489277, 487177, 485367, 483409, 480982, 478259, 475825, 474086, 473063, 472846, 473670, 475261, 476722, 477507, 477983, 478605, 479215, 479758, 480936, 483297, 486247, 488956, 491761, 495558, 500085, 504050, 506941, 509517, 512253, 514400, 515089, 514631, 514233, 514930, 517073, 520303, 523613, 525823, 526421, 525866, 524958, 524204, 523797, 523861, 524477, 525527, 526552, 526799, 525740, 523707, 521536, 519280, 515890, 510769, 505053, 500439, 497076, 493696, 489661, 485722, 482549, 479590, 475940, 471573, 467122, 462930, 458873, 454854, 451027, 447616, 444685, 441992, 439056, 435545, 431572, 427486, 423568, 420150]
61595D20150k440j334q38j168j825k512l403m306m453l664k749k226j597n85k0
61580C87030n78j528j818j617j710j998j808j206q25p17m36RK84N02Q85R97L02
61563C75768o53p30K40J321J828J920J871J624J198Q15N92N94J011J730K080J692
61547C92901J193J270J507J147N16M92Q65O01k87n62L01J352J757J901K309K527
61531D09790J956J032O76R89J217Q12p6j014j773k342k705k698k220j550j232
61516D00862j324j170l38N40N68q6m08k8M35N43O48J033J285J021N81M36M22J17
61498D05137l67n08j46L28M95L33J04J23N09J088J468J390R92P14R28J541J994
61481D16123J778J085P70J473K952M379N105M987M249L330K582J899P74r04k440
$$ y = [420150, 417710, 416376, 415538, 414370, 412545, 410033, 406630, 402324, 397871, 394207, 391458, 389232, 387635, 387050, 387030, 386452, 384924, 383106, 381489, 379779, 377781, 375973, 374767, 373942, 373225, 372789, 372798, 373082, 373584, 374469, 375466, 375768, 375115, 374385, 374625, 375946, 377774, 379694, 381565, 383189, 384387, 385202, 385794, 386388, 387399, 389129, 391209, 392901, 394094, 395364, 396871, 398018, 398534, 399026, 399891, 400492, 400205, 399643, 399944, 401296, 403053, 404954, 407263, 409790, 411746, 412778, 413454, 414443, 415660, 416472, 416396, 415382, 413609, 411267, 408562, 405864, 403644, 402094, 400862, 399538, 398368, 398030, 398570, 399138, 399052, 398644, 398616, 399051, 399594, 400242, 401275, 402560, 403581, 404162, 404598, 405020, 405137, 404770, 404262, 404116, 404444, 404939, 405272, 405376, 405499, 406008, 407096, 408564, 409954, 410946, 411660, 412588, 414129, 416123, 417901, 418986, 419756, 421229, 424181, 428560, 433665, 438652, 442901, 446231, 448813, 450712, 451486, 450582, 448142]
61466D48142l094k945k583k209j601q53n01p97j359j691j740j810k101k400k163
61451D20295j081L19J021P23K92O21J388J589J036N30N75P40N10J82L77J068J566
61434D31751J459J157J293J787J865J111J70k0N79J176J340J415J647J718J452
61419D49900J295J601K034K177K189K315K269J711R14L56O3j33j71r5l32r69j336
61402D63788r67m55n32q90q43o64j102j920k054j233l14J7l4j8K60Q74J665K047
61384D57625J710J388K016L270L959L804L628L751L451K447J691K089L337M546
61370D98712N265N313M437K833J374P01M44j20j050j815k021j637q74j78l8m70
61354E10876q88p34M4J246K705M182N323N902N816M905L245J629J073J656K381
$$ y = [448142, 445048, 442103, 439520, 437311, 435710, 434857, 434356, 433559, 432200, 430509, 428769, 426959, 424858, 422458, 420295, 419214, 419533, 420554, 421277, 421569, 422190, 423578, 425167, 426203, 426733, 427308, 428048, 428558, 428740, 429117, 430185, 431751, 433210, 434367, 435660, 437447, 439312, 440423, 440593, 440573, 441152, 442328, 443668, 445083, 446730, 448448, 449900, 451195, 452796, 454830, 457007, 459196, 461511, 463780, 465491, 466405, 466761, 466824, 466691, 466520, 466425, 466093, 465124, 463788, 462821, 462366, 461834, 460944, 460101, 459437, 458335, 456415, 454361, 453128, 452814, 452831, 452797, 452779, 453039, 453913, 455578, 457625, 459335, 460723, 462739, 466009, 469968, 473772, 477400, 481151, 484602, 487049, 488740, 490829, 494166, 498712, 503977, 509290, 513727, 516560, 517934, 518635, 519079, 518959, 517909, 516094, 514073, 512436, 511562, 511384, 511346, 510876, 509988, 509254, 509298, 510544, 513249, 517431, 522754, 528656, 534472, 539377, 542622, 544251, 545324, 546980, 549361]
61339E49361K373J715R25L11O5M15J222J925K184K152J902J197J19o61p70p61
61323E63674j203j628j065M89J901K273K019K270L506N081O128O623P257Q357
61309F05682R519J0485J1795J3932J6256J7549J7576J7221J7055J6513J4810J2022
61297G80415Q906O059L523R51k044n423q487j0432j1089j0952j0576j0388j0794
61284G19669j1733j2348j1791j0388r183q428p438n999m755l907k710q76N62O97
61270F31372K23M08J191J425P20k1j6N23J163K084L574N207O170O292O186O251
61254F72752N998M749K717R33J6l80p96j188j315j359j611j878j879j824k015
61239F72920k114j563n59J81M47N39M05k64j083j089k5J372K542L717N083O301
$$ y = [549361, 551734, 553449, 554374, 554685, 554750, 555165, 556387, 558312, 560496, 562648, 564550, 565747, 565866, 565205, 564435, 563674, 562471, 560843, 559778, 560267, 562168, 564441, 566460, 568730, 572236, 577317, 583445, 590068, 597325, 605682, 615201, 625686, 637481, 651413, 667669, 685218, 702794, 720015, 737070, 753583, 768393, 780415, 789321, 795380, 798903, 799854, 797810, 792387, 783900, 773468, 762379, 751427, 740851, 730463, 719669, 707936, 695588, 683797, 673409, 664226, 655798, 648360, 642361, 637606, 633699, 630989, 630113, 630675, 631372, 631595, 632003, 633194, 634619, 635339, 635318, 635302, 635825, 636988, 639072, 642646, 647853, 654023, 660315, 666501, 672752, 678750, 683499, 686216, 687149, 687165, 686785, 685989, 684801, 683486, 682127, 680516, 678638, 676759, 674935, 672920, 670806, 669243, 668684, 668865, 669312, 669851, 670256, 669992, 668909, 667820, 667795, 669167, 671709, 675426, 680509, 686810]
61223F86810P246Q420J0017J1322J1611J1067J0376R858R494R322R295R103Q570
61210H12511P929P452P109O772O367N694M610L513L138L729M914O467Q423J0410
61196H99038J1740J2514J3718J5730J7494J7804J6736J5230J3785J2226J0351
61185A056366Q173N814L495J391p04l127n570p222p923q501r584j0803j1667j2415
61171I97723j3424j4351j4666j4557j4632j5020j5381j5520j5546j5588j5678
61160H33360j5667j5221j4297j3611j3805j4118j2847r576n952l643k565j693
61148G10365o78K84J225K027J934N40j326k643l609m959o353o655n537l827k354
61133F78434j286m39N07K014M162O416Q341J0170J2005J3282J3823J4691J6832
$$ y = [686810, 694056, 702476, 712493, 723815, 735426, 746493, 756869, 766727, 776221, 785543, 794838, 803941, 812511, 820440, 827892, 835001, 841773, 848140, 853834, 858444, 861957, 865095, 868824, 873738, 880205, 888628, 899038, 910778, 923292, 937010, 952740, 970234, 988038, 1004774, 1020004, 1033789, 1046015, 1056366, 1064539, 1070353, 1073848, 1075239, 1074535, 1071408, 1065838, 1058616, 1050693, 1042192, 1032608, 1021805, 1010138, 997723, 984299, 969948, 955282, 940725, 926093, 911073, 895692, 880172, 864626, 849038, 833360, 817693, 802472, 788175, 774564, 760759, 746641, 733794, 724218, 718266, 714623, 712058, 710365, 709687, 709971, 711196, 713223, 715157, 715697, 714371, 711728, 708119, 703160, 696807, 690152, 684615, 680788, 678434, 677148, 676709, 677216, 679230, 683392, 689808, 698149, 708319, 720324, 733606, 747429, 762120, 778952]
61120G78952J9528K1528K3129K5564K8617L0665L1183L1493L2543L3527L3458
61109A090187L2786L2435L2225L1255K9286K6817K4214K1506J8721J5757J2157
61098A367346P568K425k369o325r642j2664j5396j7614j9227k0452k1584k2602
61086A229464k3097k2639k1247j9356j7368j5346j3029j0147o866l849j657K1
61074A074884K084M852P682R936J1795J3693J5540J7091J8613K0502K2509K4026
61062A243207K4960K5691K6347K6688K6671K6528K6332K5934K5280K4374K3076
61051A525088K1300J9254J7211J5228J3492J2413J1939J1228R596P400N383L600
61039A673132J743J14o67p18p83j133j315q98J75J748L354M279M495N170P257
$$ y = [778952, 798480, 820008, 843137, 868701, 897318, 927983, 959166, 990659, 1023202, 1056729, 1090187, 1122973, 1155408, 1187633, 1218888, 1248174, 1274991, 1299205, 1320711, 1339432, 1355189, 1367346, 1374914, 1377339, 1374970, 1368645, 1359003, 1346339, 1330943, 1313329, 1294102, 1273650, 1252066, 1229464, 1206367, 1183728, 1162481, 1143125, 1125757, 1110411, 1097382, 1087235, 1080369, 1076520, 1074863, 1074884, 1076968, 1081820, 1089502, 1099438, 1111233, 1124926, 1140466, 1157557, 1176170, 1196672, 1219181, 1243207, 1268167, 1293858, 1320205, 1346893, 1373564, 1400092, 1426424, 1452358, 1477638, 1502012, 1525088, 1546388, 1565642, 1582853, 1598081, 1611573, 1623986, 1635925, 1647153, 1656749, 1664149, 1669532, 1673132, 1674875, 1674989, 1674322, 1673604, 1672821, 1671688, 1670373, 1669475, 1669650, 1671398, 1674752, 1679031, 1683526, 1688696, 1695953]
61024A695953R978J1740J2227J2437J2949J3577J4719J7506K2267K8138L4535
61013A886026M1778M9886N8142O6302P5081Q5106R6820J11966J33525J63384K01819
61002B969835K50323L13060L94266M96581O23828P81977R72598J186542J407941
60993I396951J620103J795569J878443J795772J512455J082805O34668K88913
60985B0005679R2686K7514O0495J61444K71614K90266J27336k22617o68969j090648
60975A9054800j409333j606359j692691j682335j591329j444114j269237j089701
60967G269701r19856p68204o39070n32245m44360l72035l13429k67155k30807
60958B782540k01153j75596j53286j34669j19821j07479r5932q4591p4045o4798
$$ y = [1695953, 1705931, 1717671, 1729898, 1742335, 1755284, 1768861, 1783580, 1801086, 1823353, 1851491, 1886026, 1927804, 1977690, 2035832, 2102134, 2177215, 2262321, 2359141, 2471107, 2604632, 2768016, 2969835, 3220158, 3533218, 3927484, 4424065, 5047893, 5829870, 6802468, 7989010, 9396951, 11017054, 12812623, 14691066, 16486838, 17999293, 19082098, 19716766, 20005679, 20098365, 20125879, 20186374, 20347818, 20619432, 20909698, 21037034, 20814417, 20145448, 19054800, 17645467, 16039108, 14346417, 12664082, 11072753, 9628639, 8359402, 7269701, 6349845, 5581641, 4942571, 4410326, 3965966, 3593931, 3280502, 3013347, 2782540, 2581387, 2405791, 2252505, 2117836, 1998015, 1890536, 1794604, 1710013, 1635968, 1571170]
60948A571170n6627m9375m3575l9867l8119l7482l7090l6449l5429l4180l2949
60937A130028l1861l0849k9888k9047k8233k7098k5417k3382k1339j9432j7701
60926H45781j6367j5588j4955j3647j1393r015p652p569p967p932p170n861m266
60913G16399k706j613j225j309j369j074m69J37L78K20J39N82J169Q79o99k734
60897G06705m066m475m548m744n120n775o912q369r593j0152j0013r378q543p820
60883F07197p304o858o517o641p281p748p368o411n690n362m854l919l053k700
60869E25491k651k431j838r42K5P05R04R50J427K528L930N255O235O616O349N821
60853E58374N367M715L484K126J621K262L377M263M634M164K557L24j279j614
$$ y = [1571170, 1514543, 1465168, 1421593, 1381726, 1343607, 1306125, 1269035, 1232586, 1197157, 1162977, 1130028, 1098167, 1067318, 1037430, 1008383, 980150, 953052, 927635, 904253, 882914, 863482, 845781, 829414, 813826, 798871, 785224, 773831, 764816, 757164, 749595, 741628, 733696, 726526, 720665, 716399, 713693, 712080, 710855, 709546, 708177, 707103, 706634, 706771, 707149, 707369, 707508, 708090, 709259, 710138, 709439, 706705, 702639, 698164, 693616, 688872, 683752, 677977, 671065, 662696, 653103, 642951, 632938, 623560, 615017, 607197, 599893, 593035, 586518, 579877, 572596, 564848, 557480, 551069, 545379, 540017, 535163, 531244, 528191, 525491, 522840, 520409, 518571, 517629, 517654, 518359, 519263, 520213, 521640, 524168, 528098, 533353, 539588, 546204, 552553, 558374, 563741, 568456, 571940, 574066, 575687, 577949, 581326, 585589, 590223, 594387, 596944, 597268, 595989, 594375]
60839E94375j366j542k375l476m515n274n610n754o206o951p322o928o264n957
60825E24835n913n614m900l995l215k894l225l820l946l513l273l652m085m024
60811D68766l919m374m936m652l586k757k656k646k094j265q47j008j312j304
60797D31410r60o07m23m9R76K301K813K072J223J710L265M139L424K236K065K754
60781D58349K923J973Q10M65Q26J079Q38L32k49r62j659j932j684j335j194j002
60765D57578m63J30K63j7j96q9K2p5l09o75j224j672j566j057q89j363j775j357
60747D45266l26M99P77Q28Q25M45m98j531j916j559j248j820l191m344m433l657
60731D24117k875k527k301j732p66L09J095J236O78p3k96J69Q04J165J410J854
$$ y = [594375, 593009, 591467, 589092, 585616, 581101, 575827, 570217, 564463, 558257, 551306, 543984, 537056, 530792, 524835, 518922, 513308, 508408, 504413, 501198, 498304, 495079, 491259, 487313, 483800, 480527, 476875, 472790, 468766, 464847, 460473, 455537, 450885, 447299, 444542, 441886, 439240, 437146, 435881, 435034, 434026, 432714, 431410, 430450, 429843, 429420, 429371, 430347, 432648, 435461, 437533, 438756, 440466, 443731, 447870, 451294, 453530, 455595, 458349, 461272, 463245, 464055, 464520, 465346, 466425, 467263, 467595, 467346, 466384, 464725, 462793, 461109, 459774, 458580, 457578, 457115, 457245, 457508, 457491, 457295, 457206, 457228, 457153, 456844, 456169, 454945, 453273, 451707, 450650, 449761, 448398, 446623, 445266, 444940, 445439, 446216, 447044, 447869, 448314, 447816, 446285, 444369, 442810, 441562, 439742, 436551, 432207, 427774, 424117, 421242, 418715, 416414, 414682, 413916, 414225, 415320, 416556, 417234, 417161, 416865, 417034, 417838, 419003, 420413, 422267]
60715D22267K329K348J881J558K006L088L960L900L012J985J333J055J016J147
60701D52885J221R48N15N45J085J240L22j109k050k403k669k718j997q52m46j104
60685D43413j810j718j248j140j233q33J88J340K195K679K868K873K825K775K796
60670D55970L074L536L508K328M35r03j134j085j745k984l906l932l205k279j733
60655D45945j701j540m96J148K149J862J112J115K012K977L317K946K161J392
60641D64399R61O83l5j442l024m048m207l612k557j479p33j98M92J242J541J309
60625D49292J001P49J83o29r27m05K18L30L07O43R70P18J63q9r9k75m86l80j48
60606D51136j69j49M60J379J736J245M43k29p51j060r26m67q5K25R21K115L147
$$ y = [422267, 424596, 426944, 428825, 430383, 432389, 435477, 439437, 443337, 446349, 448334, 449667, 450722, 451738, 452885, 454106, 455054, 455569, 456114, 457199, 458439, 458761, 457652, 455602, 453199, 450530, 447812, 445815, 444963, 444517, 443413, 441603, 439885, 438637, 437497, 436264, 435431, 435619, 436959, 439154, 441833, 444701, 447574, 450399, 453174, 455970, 459044, 462580, 466088, 468416, 468851, 467948, 466814, 465729, 463984, 461000, 457094, 453162, 449957, 447678, 445945, 444244, 442704, 442208, 443356, 445505, 447367, 448479, 449594, 451606, 454583, 457900, 460846, 463007, 464399, 465360, 466043, 466008, 464566, 461542, 457494, 453287, 449675, 447118, 445639, 444906, 444708, 445200, 446442, 447983, 449292, 450293, 451042, 451225, 450596, 449669, 449264, 449482, 449812, 450119, 450762, 451732, 452450, 452613, 452524, 452425, 452150, 451664, 451284, 451136, 450967, 450818, 451278, 452657, 454393, 455638, 456081, 455852, 455101, 454041, 453115, 452648, 452563, 452788, 453709, 455824, 458971]
60589D58971L256K411J370R77J463K266K588K171J378O02m0m45m51j88pJ41P83
60572D77246K105L680N175O714Q235R283R916J0989J2888J4663J5153J4426J3318
60559F03791J2130J0579Q558O090K951q15m389o908q347q960q443o632m464l102
60545E92039k402j315M63K409M393O738R154J0957J2430J4685J7830K0559K1817
60532G09757K1803K0899J8844J5604J1978Q533M803L74l917o789q108q835r656
60519G75290j0458j0899j0846j0201q906p199n538m229l340k884k794k681j960
60506F93355l50J866M186O464R065J2419J6504K0944K5564L0533L5899M1363M6724
60493I44536N2191N7777O2670O5730O6503O5306O2277N6852M8331L6697K2788
$$ y = [458971, 462227, 464638, 466008, 466985, 468448, 470714, 473302, 475473, 476851, 477453, 477413, 476968, 476517, 476329, 476322, 476463, 477246, 479351, 483031, 488206, 494920, 503155, 512438, 522354, 533343, 546231, 560894, 576047, 590473, 603791, 615921, 626500, 635058, 641148, 644099, 643284, 638895, 631987, 623640, 614680, 606237, 599605, 595141, 592039, 589637, 588322, 588785, 591194, 595587, 602325, 611479, 622436, 634866, 649551, 667381, 687940, 709757, 731560, 752459, 771303, 786907, 798885, 807418, 812221, 812595, 808678, 801889, 793781, 784946, 775290, 764832, 753933, 743087, 732886, 723980, 716781, 711243, 707014, 703674, 700790, 697996, 695315, 693355, 693005, 694871, 699057, 705521, 714586, 727005, 743509, 764453, 790017, 820550, 856449, 897812, 944536, 996727, 1054504, 1117174, 1182904, 1249407, 1314713, 1376990, 1433842, 1482173, 1518870, 1541658]
60482A541658P847p074k1449l5037m7277n7179o4041o7958o9357o8356o5049o0198
60470I86530n4931m9698m4142l8137l2453k8066k5078k2723k0361j8173j6636
60459F36132j5583j4175j2049r989r015q988q825p958o828n902n136m627m766
60446E22291n303n172l961k627k027j641p88j66q12k144k533j638p51p88j289
60431D90651j608j793j899j564q40m89q96j351j054j97M95Q25J164J703K183K269
60415D87599J907J353R63Q68Q87Q72R78J326J673J749J727J888K103K100K045
60400E10038K201K258J762J088J115J918K597K561K257K358K911L583M145M337
60386E45129L811K609J403R33J410K511L697M410M329L614K795K329K389K874
$$ y = [1541658, 1549505, 1542431, 1520982, 1485945, 1438668, 1381489, 1317448, 1249490, 1180133, 1111777, 1046728, 986530, 931599, 881901, 837759, 799622, 767169, 739103, 714025, 691302, 670941, 652768, 636132, 620549, 606374, 594325, 584336, 575321, 566333, 557508, 549550, 542722, 536820, 531684, 527057, 522291, 516988, 511816, 507855, 505228, 503201, 501560, 500772, 500606, 499794, 497650, 495117, 493479, 492728, 491940, 490651, 489043, 487250, 485351, 483787, 482947, 482458, 481562, 480211, 479157, 478960, 479455, 480280, 481444, 483147, 485330, 487599, 489506, 490859, 491822, 492690, 493577, 494449, 495427, 496753, 498426, 500175, 501902, 503790, 505893, 507993, 510038, 512239, 514497, 516259, 517347, 518462, 520380, 522977, 525538, 527795, 530153, 533064, 536647, 540792, 545129, 548940, 551549, 552952, 553885, 555295, 557806, 561503, 565913, 570242, 573856, 576651, 578980, 581369, 584243]
60372E84243L426L611L406L183K972K210P45m33l06O65J076M88j47L3P73J378
60356F07323J639J775K078K808M024N390O541P541Q519R069Q681P617O607N681
60342F85293M110J579j292l659n135n738n850o120o803p306p009o306n973n880
60328F23911n369m608m367m537m283l670l628m107l821k392j183j243j705j235
60314E77763J40J613L074M848O752Q462J0179J2021J3346J3612J3410J3697J4398
60301F93315J4617J3841J2205R973P474N153K962J29l749p780j0759j2525j3600
60288G11256j3974j3257j1691r943q084n868l882l230l918m650m593m330m567
60275F19269m864m446l614l426m191n116n459n290m995m594m007l461l219l070
$$ y = [584243, 587669, 591280, 594686, 597869, 600841, 603051, 603796, 603363, 603057, 603722, 604798, 605286, 605139, 605172, 605945, 607323, 608962, 610737, 612815, 615623, 619647, 625037, 631578, 639119, 647638, 656707, 665388, 673005, 679612, 685293, 689403, 690982, 689690, 686031, 680896, 675158, 669308, 663188, 656385, 649079, 642070, 635764, 629791, 623911, 618542, 613934, 609567, 605030, 600747, 597077, 593449, 589342, 585521, 583129, 581946, 580703, 578998, 577763, 577903, 579516, 582590, 587438, 594190, 602652, 612831, 624852, 638198, 651810, 665220, 678917, 693315, 707932, 721773, 733978, 743951, 751425, 756578, 759540, 759669, 755920, 748140, 737381, 724856, 711256, 697282, 684025, 672334, 662391, 654307, 648439, 644557, 641327, 637409, 632759, 628166, 623836, 619269, 614405, 609959, 606345, 602919, 598728, 593612, 588153, 582863, 577868, 573274, 569267, 565806, 562587, 559517]
60261E59517k618j965j583j570j533j298j127j036n42N26J533J871J780J753J710
60246E55418J409J200J472J746J243K07l90k76j19k61l05r6j31o50j050o73M21
60229E59165J680K561K729K308K043K633L856M866N306N446N470N420N752O922
60215F16157Q486R525R976J0488J1091J1169J0835J0965J1658J1953J1469J1010
60203G44782J1083J1116J0699J0289J0042R277P824O647O233N618M055K336J367
60190H41368N14j265l532n003n444n687o287p274q671j0139j0699r963r071r171
60176G49676r554q690o765n543n748o094n286l695k529k243k424k606k642k539
60162F83318k371k255k248k260k044j358k68P85J487K052K639K652J497l5l33
$$ y = [559517, 556899, 554934, 553351, 551781, 550248, 548950, 547823, 546787, 546245, 546771, 548304, 550175, 551955, 553708, 555418, 556827, 558027, 559499, 561245, 562488, 562695, 562305, 562029, 561910, 561649, 561344, 561248, 561117, 560467, 559417, 558744, 559165, 560845, 563406, 566135, 568443, 570486, 573119, 576975, 581841, 587147, 592593, 598063, 603483, 609235, 616157, 624643, 634168, 644144, 654632, 665723, 676892, 687727, 698692, 710350, 722303, 733772, 744782, 755865, 766981, 777680, 787969, 798011, 807288, 815112, 821759, 827992, 833610, 837665, 840001, 841368, 841882, 840617, 837085, 832082, 826638, 820951, 814664, 807390, 798719, 788580, 777881, 767918, 758847, 749676, 740122, 731432, 724667, 719124, 713376, 707282, 701996, 698301, 695772, 693529, 691105, 688499, 685857, 683318, 680947, 678692, 676444, 674184, 672140, 670782, 670514, 671299, 672786, 674838, 677477, 680129, 681626, 681591, 681258]
60147F81258Q38J872J612Q17O53R81J201J729L216N018N905N857N933O617P421
60132G30928P946Q265Q347Q067P677P477P193O399N320M520M082L792L810M343
60118H18166M983N234N295N575N779N371M544L795K918J449j84j048j184j599
60104H59094k847m463n798o621o905o813o770o936o806n990n045m670m537l867
60090G81026k864k354k258j708o27L0j58m44k19J4n59j925l391m347m638m582
60074G50996m750n448o410p270q026q661q770q172p521p548q016q203q019p766
60060F46416p169n700l741k369k008k133k208k053j412j01J433K592L554M859
60046F29960O265P033P157P292P502P265O747O817P622Q187P793O743N512M082
$$ y = [681258, 682096, 683968, 685580, 686397, 687050, 688031, 689232, 690961, 694177, 699195, 705100, 710957, 716890, 723507, 730928, 738874, 747139, 755486, 763553, 771230, 778707, 785900, 792299, 797619, 802139, 806221, 810013, 813823, 818166, 823149, 828383, 833678, 839253, 845032, 850403, 854947, 858742, 861660, 863109, 862925, 861877, 860693, 859094, 856247, 851784, 845986, 839365, 832460, 825647, 818877, 811941, 805135, 799145, 794100, 789430, 784893, 781026, 778162, 775808, 773550, 771842, 771215, 771245, 771087, 770643, 770424, 770438, 769879, 767954, 764563, 760216, 755578, 750996, 746246, 740798, 734388, 727118, 719092, 710431, 701661, 693489, 685968, 678420, 670404, 662201, 654182, 646416, 639247, 633547, 629806, 627437, 625429, 623296, 621088, 619035, 617623, 617522, 618955, 621547, 625101, 629960, 636225, 643258, 650415, 657707, 665209, 672474, 679221, 686038, 693660, 701847, 709640, 716383, 721895, 725977]
60032G25977K422Q93k20r45j347j616k398m154o277p778q723j0000j1620j2558
60018F61656j2443j2162j2360j2501j1913j0744r340p598n544l813k992l014l535
60005E53697m190m320l344j765r13j235j683j263k61N78J200J885K463K661K757
59990E46267L207M004M835N530N943N914N633N477N231M130K084O9j138j891k768
59975E92527l486l574l462l965m955n443n003m263l860l523k575j063M5p1r53
59960E46376j144K08K317L617L463K575J941J866K053K111J915J732J975K518
59946E73523K590J832R87R42J409J431R13N01K38m74j452j642q24j03j47o0J192
59929E80856L141M558N144N557O140O449N950M598K771R72n07j796l054l926l834
$$ y = [725977, 728399, 729292, 729072, 728127, 726780, 725164, 722766, 718612, 712335, 704557, 695834, 685834, 674214, 661656, 649213, 637051, 624691, 612190, 600277, 589533, 580193, 572595, 567051, 563238, 560246, 557232, 553697, 549507, 545187, 541843, 540078, 539165, 537930, 536247, 534984, 534723, 535301, 536501, 538386, 540849, 543510, 546267, 549474, 553478, 558313, 563843, 569786, 575700, 581333, 586810, 592041, 596171, 598255, 598324, 597186, 595295, 592527, 589041, 585467, 582005, 578040, 573085, 567642, 562639, 558376, 554516, 550993, 548418, 547355, 547400, 547329, 546376, 545232, 545440, 547757, 551374, 554837, 557412, 559353, 561219, 563272, 565383, 567298, 569030, 571005, 573523, 576113, 577945, 578932, 579874, 581283, 582714, 583627, 584128, 584366, 583892, 582440, 580798, 579974, 579871, 579724, 579664, 580856, 583997, 588555, 593699, 599256, 605396, 611845, 617795, 622393, 625164, 626136, 625629, 623833, 620779, 616853, 613019]
59914F13019k867j839j216n81N14J823K809L291L282K710J732Q82M68J28n17j147
59898F22491j090k98N03O36K40J39R50K398L669M424N087N949O548O414N902N650
59882F69612N600N393N301N851O690O893O352N924O038O097N432M050K327O29
59868G42189o18j284j892k931l870l780k871k284k357k271j622j140j420j995
59854G11854k184j884j190j65O40M44m33m69J230L837N984P218P740P577O713
59839G46912N353L612J462n83j540j043L14J980L823N282N265L549J356j02q49
59824G74791j455k098k933m346o113p136o894o285o297o567o182n127m079l307
59810G05972k656k124j705j194o86p68j550k206k153j951k330k945k995k519k180
$$ y = [613019, 610152, 608313, 607097, 606516, 607030, 608853, 611662, 614953, 618235, 620945, 622677, 623559, 624027, 624155, 623638, 622491, 621401, 621103, 621606, 622242, 622482, 622621, 623571, 625969, 629638, 634062, 639149, 645098, 651646, 658060, 663962, 669612, 675212, 680605, 685906, 691757, 698447, 705340, 711692, 717616, 723654, 729751, 735183, 739233, 741560, 742189, 741571, 740287, 738395, 735464, 731594, 727814, 724943, 722659, 720302, 718031, 716409, 715269, 713849, 711854, 709670, 707786, 706596, 706431, 707071, 707515, 707082, 706613, 707843, 711680, 717664, 724882, 732622, 740199, 746912, 752265, 755877, 757339, 756756, 755216, 754173, 754487, 756467, 760290, 765572, 770837, 774386, 775742, 775640, 774791, 773336, 771238, 768305, 763959, 757846, 750710, 743816, 737531, 731234, 724667, 718485, 713358, 709279, 705972, 703316, 701192, 699487, 698293, 697607, 696839, 695289, 693083, 690930, 688979, 686649, 683704, 680709, 678190, 676010]
59795F76010k186k297k548l122l812m192m183l946l568l282l474m009m075l295
59781F28021k388k161k361k222j631j099r32j030j193j127m75O94J839K647L345
59766F19927M034M417M477M737N435O143O620P195P904Q133P697P431P977Q905
59752G11032R580J0066J0415J0093R017Q222Q398Q532P201M683K635K036K399
59739H04309K733K395J267j57j034j071p88o14l47K4n1o06o83J60Q40L48n30l21
59721H05874R24J850J779J186N26j72o61o16l52m98r42r53l37L07M33J25j24J97
59703H08546J236K408K818K387J991K142K316K092K019K611L289L254K690K162
59689H41961J513K94j278k671l775m507m398l492k885l398m408m988n374o212
$$ y = [676010, 673824, 671527, 668979, 665857, 662045, 657853, 653670, 649724, 646156, 642874, 639400, 635391, 631316, 628021, 625633, 623472, 621111, 618889, 617258, 616159, 615227, 614197, 613004, 611877, 611402, 612096, 613935, 616582, 619927, 623961, 628378, 632855, 637592, 643027, 649170, 655790, 662985, 670889, 679022, 686719, 694150, 702127, 711032, 720612, 730678, 741093, 751186, 760203, 768425, 776823, 785355, 792556, 797239, 799874, 801910, 804309, 807042, 809437, 810704, 810547, 809513, 808442, 807654, 807040, 806693, 806717, 806666, 806060, 805377, 805537, 806377, 806725, 806195, 805874, 806798, 808648, 810427, 811613, 812139, 811967, 811306, 810690, 810338, 809840, 808898, 807945, 807608, 807915, 808348, 808473, 808349, 808546, 809782, 812190, 815008, 817395, 819386, 821528, 823844, 825936, 827955, 830566, 833855, 837109, 839799, 841961, 843474, 843768, 842490, 839819, 836044, 831537, 827139, 823647, 820762, 817364, 812956, 807968, 802594, 796382]
59675G96382p132p402p309p616q111p997p261o467n691m815m322m536m629l702
59661G09392k283j417p94O11K503L567L635L888M843N687N796N614N650N728N400
59646G57820M329K266m84k804l912m473n618p206q173q255q105p953p412o511
59632F93509n733n105m265l332k749k564k778l823n642o929o689n871n923o370
59618F25736n628l795k585k606k688k124j601j561j428r15n54m41J13J245K211
59603F03379K703L150L426K723J160Q6K38Q25Q50K44n72j118p01Q51K197J709
59587F21150j01j040l61L08k71j159j107n61o12j195j542j543j543j513j310j066
59571F06534q26l88nl17j153j387n59K61o5j249k174k290j855j372j267j620j938
$$ y = [796382, 789250, 781848, 774539, 766923, 758812, 750815, 743554, 737087, 731396, 726581, 722259, 717723, 713094, 709392, 707109, 705692, 704898, 705509, 708012, 711579, 715214, 719102, 723945, 729632, 735428, 741042, 746692, 752420, 757820, 762149, 764415, 763931, 761127, 757215, 752742, 747124, 739918, 731745, 723490, 715385, 707432, 700020, 693509, 687776, 682671, 678406, 675074, 672325, 669761, 666983, 663160, 657518, 650589, 643900, 638029, 632106, 625736, 620108, 616313, 613728, 611122, 608434, 606310, 604709, 603148, 601720, 600805, 600251, 599810, 599923, 601168, 603379, 606082, 609232, 612658, 615381, 616541, 616627, 616865, 617690, 618540, 618784, 618212, 617094, 616393, 617244, 619441, 621150, 621049, 620009, 619648, 619956, 619685, 618526, 617419, 616858, 616246, 615051, 613509, 611966, 610423, 608910, 607600, 606534, 605708, 605320, 605315, 604998, 603845, 602458, 601899, 602160, 602095, 600846, 598672, 596382, 594527, 593155, 591888, 590268, 588330]
59554E88330j672j005m47J52J250K385K567J918J639K167K793L237M209N894P382
59539F20799Q276R537J2038J5438J8895K1692K2558J9918J3795O443L15l713n661
59526G60330n519l860k133j224n65M50J259J118K25j006k800n151p087p864q049
59511G18124q475q918q869q723r061r395q830p519o440o024n901n717n430n032
59497F13790m572m190l734k754j266m5L66L43N59J145J824K301K271J688J251
59482F08977J827L157L988L780L340L481M038M645N379O148O483O379O424O606
59468F74652O124M806L527K716J796P44O80J956L057K685J809K325M495O931Q455
59453G26758Q874Q574Q314Q745R445R076P251N222L975K737M60k368m626o315
$$ y = [588330, 586658, 585653, 585206, 585358, 586608, 588993, 591560, 593478, 595117, 597284, 600077, 603314, 607523, 613417, 620799, 629075, 638612, 650650, 666088, 684983, 706675, 729233, 749151, 762946, 769389, 769704, 765991, 760330, 754811, 750951, 748818, 747594, 747029, 747479, 748738, 749856, 750081, 749075, 746275, 741124, 734037, 726173, 718124, 709649, 700731, 691862, 683139, 674078, 664683, 655853, 648334, 641894, 635870, 629969, 624252, 618822, 613790, 609218, 605028, 601294, 598540, 597274, 597229, 597595, 597938, 598497, 599642, 601466, 603767, 606038, 607726, 608977, 610804, 613961, 617949, 621729, 625069, 628550, 632588, 637233, 642612, 648760, 655243, 661622, 668046, 674652, 680776, 685582, 689109, 691825, 693621, 694365, 695045, 697001, 700058, 702743, 704552, 706877, 711372, 718303, 726758, 735632, 744206, 752520, 761265, 770710, 779786, 787037, 792259, 796234, 798971, 799431, 797063, 792437, 786122]
59439G86122q001r337r470q464p072n654m380l835m188m420l558k117j109l06
59425G14211J248L507N640P518R673J2005J3810J4963J5927J6896J7941J9627
59413H52966K2314K5168K7073K8061K8446K6921K1282J1428K16r057j5027j7905
59401A001886j8087j5759j1186m764K705R462J3058J1768N780k894j1500j7841
59389I62628k1166k2037k1362j9622j7101j4180j1086p771m489j997o47K54J529
59376H22953K980L757L560K836K035J309P56M69M31O27J015J226P73j31n21J51
59360H44226J373K448L399M545N783O943Q211R746J1293J2691J4161J5692J6859
59347I57370J7674J8788K0269K1039K0330J8828J7533J6238J4071J0909P322L678
$$ y = [786122, 778121, 768784, 759314, 750850, 743778, 738124, 733744, 729909, 725721, 721301, 717743, 715626, 714517, 714211, 715459, 718966, 724606, 732124, 741797, 753802, 767612, 782575, 798502, 815398, 833339, 852966, 875280, 900448, 927521, 955582, 984028, 1010949, 1032231, 1043659, 1043875, 1034818, 1019791, 1001886, 983799, 968040, 956854, 952090, 954795, 964257, 977315, 989083, 994863, 991969, 980469, 962628, 941462, 919425, 898063, 878441, 861340, 847160, 836074, 828303, 823814, 821817, 821170, 821424, 822953, 825933, 829690, 833250, 836086, 838121, 839430, 840186, 840655, 841086, 841713, 842728, 843954, 844727, 844596, 844075, 844226, 845599, 848047, 851446, 855991, 861774, 868717, 876928, 886674, 897967, 910658, 924819, 940511, 957370, 975044, 993832, 1014101, 1035140, 1055470, 1074298, 1091831, 1108069, 1122140, 1133049, 1140371, 1144049]
59335A144049J77k747n029p442j0516j3466j5144j5650j6020j6615j6858j6423
59323A008316j5736j5297j5123j4929j4428j3553j2631j2121j1991j1773j1361
59312H59373j1121j1090j0850j0379j0115r996r419q439p762p235n753l215r40
59299G53059N86K694O135R377J0734J0610J0005Q304M554k23m159p140j0136j2607
59285G81793j2885j0932q611p046n561l383p07K159N214Q036R932J1084J2489
59272G81582J4536J6669J8338J9307J9138J7612J5592J4227J3325J1563Q392M643
59260I54924J230j626l878n493o947q869j0997j2286j2116j0764q825o920n751
59247H61682n454n084l582j188R51K341L402M447N292N873O367O786P064P295
$$ y = [1144049, 1144226, 1141479, 1136450, 1129008, 1118492, 1105026, 1089882, 1074232, 1058212, 1041597, 1024739, 1008316, 992580, 977283, 962160, 947231, 932803, 919250, 906619, 894498, 882507, 870734, 859373, 848252, 837162, 826312, 815933, 805818, 795822, 786403, 777964, 770202, 762967, 757214, 753999, 753059, 753645, 756339, 762474, 771851, 782585, 793195, 803200, 811504, 816058, 815835, 811676, 804536, 794400, 781793, 768908, 757976, 749365, 742319, 736758, 733375, 732668, 734827, 740041, 748077, 758009, 769093, 781582, 796118, 812787, 831125, 850432, 869570, 887182, 902774, 917001, 930326, 941889, 950281, 954924, 956154, 954528, 950650, 945157, 938210, 929341, 918344, 906058, 893942, 883178, 874353, 867433, 861682, 856228, 851144, 847562, 846374, 847325, 849666, 853068, 857515, 862807, 868680, 875047, 881833, 888897, 896192]
59233H96192P270O236L964J543J88l16j147k833n011p301r383j0703j1118j1403
59219H56178j2177j2826j2476j1462j0734j0338r680q759p979p174o004m837m058
59206G37674l159j685m40l83r13p58N6N78P67J308K009K081J756K009K854L444
59190G47198L642L985M349M208L997M644N886O655O871P299P828P621O814O386
59176H27383O384N977N197M847M737L857K406J835K554L356L459L413L554L155
59162H82114J742j04j697k971m017n022o668r308j1844j2759j2233j1811j2076
59149G93346j2219j1856j1531j1279j0394q900p803p545p634p789q078p906o526
59136F73886m592l627l850m066l648l011k209r14K72L60q3N47K349L885M672N650
$$ y = [896192, 903462, 909698, 913662, 915205, 915393, 915077, 913930, 911097, 906086, 898785, 889402, 878699, 867581, 856178, 844001, 831175, 818699, 807237, 796503, 786165, 776485, 767726, 759747, 752573, 746569, 741732, 737674, 734515, 732830, 732390, 732007, 731094, 730336, 730392, 730970, 731737, 733045, 735054, 737135, 738891, 740900, 743754, 747198, 750840, 754825, 759174, 763382, 767379, 772023, 777909, 784564, 791435, 798734, 806562, 814183, 820997, 827383, 833767, 839744, 844941, 849788, 854525, 858382, 860788, 862623, 865177, 868533, 871992, 875405, 878959, 882114, 883856, 883752, 882055, 879084, 875067, 870045, 863377, 854069, 842225, 829466, 817233, 805422, 793346, 781127, 769271, 757740, 746461, 736067, 727167, 719364, 711819, 704185, 696396, 688318, 680412, 673886, 669294, 665667, 661817, 657751, 654103, 651092, 648883, 647969, 648241, 648601, 648518, 649065, 651414, 655299, 659971, 665621]
59120F65621P039P998Q738J0558J3317J5102J5050J4320J3672J2419J0533R366
59108H03733R275Q780P084N360M393L184J176l13l30j03j030k523l399l804m355
59093H27128m731m554m352m431m023k719j394p53l30L6o05k549m430n208n624
59078G81461o443o931o445n981o537p306p043o056n337m895m351m090m390m439
59064G01217l644k840k901l321l340l369l872m057l131j849j350j408j246j085
59050F63804j387j550q29J76M05j3k56k84n38q71r19q71q82n14K43L79o00j543
59032F53950j256k62K79M56J101K219L299M452O016P622Q815R882J1069J1747
59018G19389J1407J0647J0078R132P099M479K178K23j616k896l361l855m943n541
$$ y = [665621, 672660, 680658, 689396, 699954, 713271, 728373, 743423, 757743, 771415, 783834, 794367, 803733, 813008, 821788, 828872, 834232, 838625, 841809, 842985, 842672, 842342, 842239, 841209, 838686, 835287, 831483, 827128, 822397, 817843, 813491, 809060, 805037, 802318, 800924, 800171, 799841, 799877, 799272, 796723, 792293, 787085, 781461, 775018, 768087, 761642, 755661, 749124, 741818, 734775, 728719, 723382, 718487, 714136, 710046, 705656, 701217, 697573, 694733, 691832, 688511, 685171, 681802, 677930, 673873, 670742, 668893, 667543, 666135, 664889, 663804, 662417, 660867, 660038, 660214, 660619, 660606, 660350, 660066, 659528, 658657, 657738, 656867, 655985, 655471, 655714, 656093, 655493, 653950, 652694, 652432, 652711, 653167, 654268, 656487, 659786, 664238, 670254, 677876, 686691, 696573, 707642, 719389, 730796, 741443, 751521, 760653, 767752, 772231, 774409, 774632, 773016, 770120, 766759, 762904, 757961, 752420]
59004G52420m260j532R77K453L322M096M997O201P410P676O568M934L786L115
58990H02163K463J733P74p20k170k218p75M24K71j44M31J389J713J966L144M818
58974H15262O188P846J0635J3685J5483J6172J6949J7921J8262J8013J7983J8248
58962I92647J8111J7241J5663J3226J0212P626N650K861j639o441r733j1871j4252
58949A039301j6614j7660j7652j8080j9076j9284j8302j7224j6598j5612j3648
58938H49551j1283r333p958o908n853m490k967j860j196j61J493K657K422J523
58924H05637J095R29K49o93j225j581k191k464j747q16q36j468j478o29M34J589
58908G94805L028M295M924N508O705P961Q576R242J0947J3113J4493J5152J5908
$$ y = [752420, 748160, 746628, 747605, 750058, 753380, 757476, 762473, 768674, 776084, 783760, 790328, 795262, 799048, 802163, 804626, 806359, 807133, 806413, 804243, 802025, 801250, 801674, 801945, 801801, 802232, 803621, 805334, 807300, 810444, 815262, 821450, 829296, 839931, 853616, 869099, 885271, 902220, 920141, 938403, 956416, 974399, 992647, 1010758, 1027999, 1043662, 1056888, 1067100, 1074726, 1080376, 1083237, 1081598, 1075157, 1065424, 1053553, 1039301, 1022687, 1005027, 987375, 969295, 950219, 930935, 912633, 895409, 878811, 863199, 849551, 838268, 828935, 820977, 814069, 808216, 803726, 800759, 798899, 797703, 797542, 799035, 801692, 804114, 805637, 806732, 807661, 807910, 807217, 805992, 804411, 802220, 799756, 798009, 797193, 796357, 794889, 793411, 792782, 793216, 794805, 797833, 802128, 807052, 812560, 819265, 827226, 835802, 845044, 855991, 869104, 883597, 898749, 914657]
58895I14657J6509J6206J5491J5479J6049J6367J6728J8090K0172K1807K2775
58884A110330K3531K3537K1759J8515J5126J1928Q328M529J404j160m027p062
58872A226738r222j0322j1180j2007j2096j1091r369p403n794n433o410p442p608
58859A111361p866r442j1633j2913j3303j3835j4498j4609j4490j4737j4615j3281
58847I56139j1873j2052j3075j2746j0978r850j0284j1134j1556j1913j2159j1598
58835H16921j0563j0276j0713j0529r293p919o796n390l811k763j938l30J701
58822G38301K753K816L341M731N894O485P385Q581Q778P725O829O821O625N386
58808H22451L780K671J925J251P61J92j048k682l759m274n159o482p240p183p228
$$ y = [914657, 931166, 947372, 962863, 978342, 994391, 1010758, 1027486, 1045576, 1065748, 1087555, 1110330, 1133861, 1157398, 1179157, 1197672, 1212798, 1224726, 1233054, 1237583, 1238987, 1237827, 1233800, 1226738, 1217516, 1207194, 1196014, 1184007, 1171911, 1160820, 1151451, 1144048, 1138254, 1132821, 1126411, 1118969, 1111361, 1103495, 1094053, 1082420, 1069507, 1056204, 1042369, 1027871, 1013262, 998772, 984035, 969420, 956139, 944266, 932214, 919139, 906393, 895415, 885565, 875281, 864147, 852591, 840678, 828519, 816921, 806358, 796082, 785369, 774840, 765547, 757628, 750832, 745442, 741631, 738868, 736930, 736600, 738301, 741054, 743870, 747211, 751942, 757836, 764321, 771706, 780287, 789065, 796790, 803619, 810440, 817065, 822451, 826231, 828902, 830827, 832078, 832839, 833031, 831983, 829301, 825542, 821268, 816109, 809627, 802387, 795204, 787976]
58793G87976p771q198q294q554q780p959n983m024k767j699m43O22J330K047K847
58778G30350L458M065M899N274M433K959J860O68j689m614o437p136q177r730
58764G20183j0296r378q280p804p206n974m735l844k776j428m16J76Q58J362R51
58749F61393J39L40J656K852L524M426N551O006O008O852Q523R407Q855Q080P990
58734G41602Q037P712P426P413P337P303P710Q057P531O659O535O735O099N257
58720H41413N899P723Q755Q840R914J2408J4207J3925J2620J1422R949P927N988
58707I70990L964O48l855p751j0322j2854j6026j8705k0123k1045k1903k2032
58695H20986k1536k1603k2020k0851j7597j4387j2783j1747r998q216p465p310
$$ y = [787976, 780205, 772007, 763713, 755159, 746379, 738420, 732437, 728413, 725646, 723947, 723504, 724126, 725456, 727503, 730350, 733808, 737873, 742772, 748046, 752479, 755438, 757298, 757966, 756277, 751663, 745226, 738090, 729913, 720183, 709887, 700509, 692229, 684425, 677219, 671245, 666510, 662666, 659890, 658462, 658046, 658222, 659080, 660442, 661393, 661532, 661872, 663528, 666380, 669904, 674330, 679881, 685887, 691895, 698747, 707270, 716677, 725532, 733612, 741602, 749639, 757351, 764777, 772190, 779527, 786830, 794540, 802597, 810128, 816787, 823322, 830057, 836156, 841413, 847312, 855035, 863790, 872630, 882544, 894952, 909159, 923084, 935704, 947126, 957075, 965002, 970990, 974954, 975602, 971747, 963996, 953674, 940820, 924794, 906089, 885966, 864921, 843018, 820986, 799450, 777847, 755827, 734976, 717379, 702992, 690209, 678462, 668464, 660248, 652783, 645473]
58683F45473o953o644o745o781o365n778n097m149l573m061m508l073k44J593
58669E83095J860K485M412O312P386Q646J0413J1343J0928J0318R589P071K571
58656F76429j460l353m174n073n405m952n198o730p883p530o830o690o089m479
58642F00583l265l229k911j344R3K38J86R71J601J282J216K262L073K497J620
58627F04873J498J031p97k648k856j956j269p65p1K87K54J082L168M959N479N850
58611F18119O877P287O111M585M046L969L654L669M096L662K179J445K122K312
58597F74133Q77m71l50j71j257k211j484j01N54J325L294N512P038Q971J2044
58582G07703J4446J4569J3748J3860J4229J3318J1533J0025Q712P590P862R634
$$ y = [645473, 638520, 631876, 625131, 618350, 611985, 606207, 601110, 596961, 593388, 589327, 584819, 581746, 581502, 583095, 584955, 587440, 591852, 598164, 605550, 614196, 624609, 635952, 646880, 657198, 666787, 673858, 676429, 674969, 671616, 667442, 662369, 656964, 652012, 646814, 640084, 632201, 624671, 617841, 611151, 605062, 600583, 597318, 594089, 591178, 589834, 589927, 590165, 590351, 591322, 592923, 594205, 595421, 597683, 600756, 603253, 604873, 606371, 607402, 606605, 603957, 601101, 599145, 597876, 597111, 597040, 597327, 597581, 598663, 601831, 606790, 612269, 618119, 624996, 632283, 638394, 642979, 647025, 650994, 654648, 658317, 662413, 666075, 668254, 669699, 671821, 674133, 675010, 674539, 674189, 674018, 672761, 670550, 669066, 668965, 669519, 670844, 674138, 679650, 686688, 695659, 707703, 722149, 736718, 750466, 764326, 778555, 791873, 803406, 813431, 822143, 829733, 837595, 847229]
58570H47229J0760J0242J0432J3563J8461K2957K7132L1695L5662L8225M0554
58559A106912M3055M3373L9701L3680K7398K0187J1275K863k698o307r604j1526
58547A298309j0738q994q586q619p400o372q055j1911j5875k0067k5383l0229
58535A136080l2382l2599l2894l2712l0377k6735k3843k1406j8025j4580j2843
58524H57684j2028j0187p852o917p014o302m879m259m397m138l643l651l602k995
58510G75820l082m643n807m818l028k471k482j623p78j168j530m74N76K5o25L96
58494G44288J533Q49PJ359L500L899L626N079P186P616P672J0172J4130J6445
58480H27361J7464J9951K3695K5944K6247K6221K5432K1988J6543J1439O608M20
$$ y = [847229, 857989, 868231, 878663, 892226, 910687, 933644, 960776, 992471, 1028133, 1066358, 1106912, 1149967, 1193340, 1233041, 1266721, 1294119, 1314306, 1325581, 1328444, 1325746, 1319439, 1309835, 1298309, 1287571, 1278577, 1269991, 1261372, 1253972, 1247600, 1239545, 1227634, 1211759, 1191692, 1166309, 1136080, 1103698, 1071099, 1038205, 1005493, 975116, 948381, 924538, 903132, 885107, 870527, 857684, 845656, 835469, 827617, 820700, 813686, 807384, 802505, 798246, 793849, 789711, 786068, 782417, 778815, 775820, 772738, 768095, 762288, 757470, 754442, 751971, 749489, 747866, 747088, 745920, 744390, 743916, 744492, 744517, 743892, 744288, 745821, 746670, 746677, 748036, 751536, 755435, 759061, 764140, 771326, 778942, 786614, 796786, 810916, 827361, 844825, 864776, 888471, 914415, 940662, 966883, 992315, 1014303, 1030846, 1042285, 1048893, 1049313]
58468A049313o299j1143j4036j6358j7409j5734j2675j0413p967l250K359N944
58456I42332Q063J1329J5420J8089J9574K1285K1603J7956J1783O498J817m796
58444A090953j2362j7379j9557k1367k2739k1548j8463j6125j4234j0588o143
58433I10448l819l157j450Q61J384J343M072Q667J0992J0619J0895J2411J2238
58420I75504R638O913M497O87l806o329p221r071j1482j1831j0688j0894j1933
58407I13984j0930q633q376r635q825o035m764n164l991j165O7m96J90K194K549
58392H50970J412J814L369K823Q10J187L591L762J543J264L621M544L037K796
58378H86543M932O164N578O160Q366R047P932Q326J0328J0340Q332Q448J1284
$$ y = [1049313, 1043014, 1031871, 1017835, 1001477, 984068, 968334, 955659, 945246, 937279, 934029, 936388, 942332, 950395, 961724, 977144, 995233, 1014807, 1036092, 1057695, 1075651, 1087434, 1093932, 1095749, 1090953, 1078591, 1061212, 1041655, 1020288, 997549, 976001, 957538, 941413, 927179, 916591, 910448, 906629, 903472, 902022, 902883, 904267, 905610, 909682, 918349, 929341, 939960, 950855, 963266, 975504, 985142, 992055, 996552, 997239, 993433, 987104, 979883, 970812, 959330, 947499, 936811, 925917, 913984, 903054, 894421, 886045, 876410, 867585, 861550, 856786, 851622, 847631, 846466, 846533, 846037, 846227, 848421, 850970, 852382, 854196, 857565, 860388, 861198, 862385, 865976, 869738, 871281, 872545, 876166, 880710, 883747, 886543, 891475, 897639, 903217, 909377, 917743, 926790, 934722, 943048, 953376, 963716, 972048, 980496, 991780]
58365I91780J2852J2344J3457J6601J7526J5325J4262J5835J6332J4117J2001
58354A152432J0739P569K895R00J836J262j512k086L74J385j48J51L397N083L826
58339A188103M048P419R971J0312J2295J6817J9428J8850J9360K2006K2164J8696
58327A369469J6548J7272J5981J0960P092O318M049j204m016j841N99P52K674
58314A444653P994J1836J2129J3628J8190K0530J8162J6157J7293J7148J3675
58303A611395J1968J4390J5774J3537J2778J6089J8168J5992J4398J6176J6736
58292A777401J4008J3402J7227J9673J7912J7591K1501K3909K2186K2590K8040
58281A995440L1742K9810K8535L2007L4419L2140L1390L6001L9549L7802L7012
$$ y = [991780, 1004632, 1016976, 1030433, 1047034, 1064560, 1079885, 1094147, 1109982, 1126314, 1140431, 1152432, 1163171, 1170740, 1173635, 1174535, 1176371, 1177633, 1176121, 1174035, 1174409, 1175794, 1175646, 1175797, 1179194, 1184277, 1188103, 1192151, 1199570, 1209541, 1219853, 1232148, 1248965, 1268393, 1287243, 1306603, 1328609, 1350773, 1369469, 1386017, 1403289, 1419270, 1430230, 1437322, 1443640, 1447689, 1446485, 1442469, 1440628, 1441227, 1441979, 1444653, 1452647, 1464483, 1476612, 1490240, 1508430, 1528960, 1547122, 1563279, 1580572, 1597720, 1611395, 1623363, 1637753, 1653527, 1667064, 1679842, 1695931, 1714099, 1730091, 1744489, 1760665, 1777401, 1791409, 1804811, 1822038, 1841711, 1859623, 1877214, 1898715, 1922624, 1944810, 1967400, 1995440, 2027182, 2056992, 2085527, 2117534, 2151953, 2184093, 2215483, 2251484, 2291033, 2328835, 2365847]
58270B365847M1568M5494M4689M5229N0899N5114N4086N5140O2723O9233O9225
58259B959247O9310P4208P6835P2589O9363P2637P4900P0932O9000P5227Q1667
58248C765915Q1840Q3100R1210R8228R8526J00998J12016J22517J25671J30543
58238D810564J43971J56368J60509J66380J81651J96069K01664K09280K27635
58229F454091K45922K55295K67033K90309L13472L27497L45628L78352M12265
58220I289864M36368M64875N09932N57428N95628O40994P08103P82152Q50477
58211A4835821R31441J040799J161473J280570J422281J607780J820045K048773
58203B6148983K329754K695876L134518L644322M286807N129286O196232P543314
$$ y = [2365847, 2407415, 2452909, 2497598, 2542827, 2593726, 2648840, 2702926, 2758066, 2820789, 2890022, 2959247, 3028557, 3102765, 3179600, 3252189, 3321552, 3394189, 3469089, 3540021, 3609021, 3684248, 3765915, 3847755, 3930855, 4022065, 4120293, 4218819, 4319817, 4431833, 4554350, 4680021, 4810564, 4954535, 5110903, 5271412, 5437792, 5619443, 5815512, 6017176, 6226456, 6454091, 6700013, 6955308, 7222341, 7512650, 7826122, 8153619, 8499247, 8877599, 9289864, 9726232, 10191107, 10701039, 11258467, 11854095, 12495089, 13203192, 13985344, 14835821, 15767262, 16808061, 17969534, 19250104, 20672385, 22280165, 24100210, 26148983, 28478737, 31174613, 34309131, 37953453, 42240260, 47369546, 53565778, 61109092]
58195F1109092R315092J1652555J4614607J8266293K2717014K7905962L3423774
58188A99004389L8677158M3028909M5437671M4131652L7373760K5085748R575858
58181D42315145n701131j8169782k6991339l2431123l5006730l5280247l3926629
58174B54808164l1581923k8665387k5466050k2284658j9362042j6757326j4420352
58167I6270426j2337665j0529916q972826p618327o461242n512738m737870m081266
58159C6018576l527244l080700k716003k395878k117358j892500j704859j527415
58151A7056619j363392j229529j117251j007227r04479q23837p56689o85185o14202
58142H554828n58092n10388m56620m03226l64944l36386l03622k71650k53474
$$ y = [61109092, 70424184, 82076739, 96691346, 114957639, 137674653, 165580615, 199004389, 237681547, 280710456, 326148127, 370279779, 407653539, 432739287, 442315145, 436614014, 418444232, 391452893, 359021770, 324015040, 288734793, 254808164, 223226241, 194560854, 169094804, 146810146, 127448104, 110690778, 96270426, 83932761, 73402845, 64430019, 56811692, 50350450, 44837712, 40099842, 36018576, 32491332, 29410632, 26694629, 24298751, 22181393, 20288893, 18584034, 17056619, 15693227, 14463698, 13346447, 12339220, 11434741, 10610904, 9854215, 9169030, 8554828, 7996736, 7486348, 7029728, 6626502, 6261558, 5925172, 5621550, 5349900, 5096426]
58133E096426k43455k27376k08404j98245j92556j79367j62645j54183j50571
58124C379624j40574j27283j21306j19540j11513r9849r4369r2602q5472p5789
58114B311327p2375p2076o5901n6923n4306n5433n1383m4548m3612m6383m4385
58103A704002l9520l9795m3175m1764l7539l8192m1604l9804l4462l3404l5430
58092A279313l3304k8219k6968k8156k5281k0183j9574k1452j8721j3244j2709
58081A031502j6335j7056j5289j7328k2387k4243k3594k6113l0243k9457k4758
58070G84699k2751k3123k0157j4875j3523j5437j4412j0786j0285j2065r758l756
58058F13771p89j693q30K581L528J611J626L697L044j95r26J055Q40j868k491
$$ y = [5096426, 4852971, 4625595, 4417191, 4218946, 4026390, 3847023, 3684378, 3530195, 3379624, 3239050, 3111767, 2990461, 2870921, 2759408, 2659559, 2565190, 2472588, 2387116, 2311327, 2238952, 2166876, 2100975, 2044052, 1989746, 1934313, 1882930, 1838382, 1794770, 1748387, 1704002, 1664482, 1624687, 1581512, 1539748, 1502209, 1464017, 1422413, 1382609, 1348147, 1314743, 1279313, 1246009, 1217790, 1190822, 1162666, 1137385, 1117202, 1097628, 1076176, 1057455, 1044211, 1031502, 1015167, 998111, 982822, 965494, 943107, 918864, 895270, 869157, 838914, 809457, 784699, 761948, 738825, 718668, 703793, 690270, 674833, 660421, 649635, 639350, 627285, 617527, 613771, 612982, 611289, 610459, 613040, 616568, 618179, 619805, 623502, 626546, 626351, 625425, 626480, 627320, 625452, 622961]
58043F22961j041k258o090p373n424m828o432o343m253m013n629n305l561m818
58029E55593q650r992q270p874r399q988o629o547q762q680n764m381n340m704
58015D51613j821n87j858k297j492k537m987m928k659k473m334l719l57J061k76
58000D18349j11K076J600k352m465k370k42r41j945j522j840l316k707N00K186
57985D02900N36j129p55o90k275l196k475k445l780m086l016l155m346l200K58
57970C69146J678j49j178N61J835P19m0J242J997P61J00J385J937K54j092m21
57954C78735J9j291k238j434r10j949k702k196k300l526l377j008R12J035J536
57939C59306L502M768M487N211Q162J0791J1341J1388J1821J0739P555M839L804
$$ y = [622961, 621920, 619662, 613572, 606199, 600775, 595947, 589515, 583172, 578919, 574906, 569277, 563972, 560411, 555593, 546943, 536951, 528681, 520807, 511408, 502420, 495791, 489244, 480482, 471802, 466038, 461657, 456317, 451613, 449792, 449205, 447347, 445050, 443558, 441021, 436034, 431106, 428447, 425974, 421640, 417921, 417564, 418625, 418349, 418238, 420314, 421914, 419562, 415097, 412727, 412485, 411544, 409599, 408077, 406237, 402921, 400214, 400714, 402900, 403436, 402307, 401552, 400862, 398587, 395391, 392916, 390471, 386691, 382605, 379589, 376434, 372088, 368888, 369146, 370824, 370675, 369497, 370058, 371893, 372612, 372572, 373814, 375811, 376572, 376672, 378057, 379994, 380248, 379156, 378735, 378754, 377463, 375225, 373791, 372881, 370932, 368230, 366034, 363734, 360208, 356831, 355823, 356735, 357770, 359306, 362808, 367576, 372063, 377274, 385436, 396227, 407568, 418956, 430777, 441516, 449071, 453910, 457714]
57926D57714K237r99l729m849o431r290j0898j0086r428j0553j1335j0163q733
57913C63457q145o563l293r93j182j557l87N10k43p56K29N77j147k762k478k109
57897C33158l248l935k196L53J431J593K081K284J894K472M378N216L697J957
57883C51135J777J885J228J377L054L849K226M71Q89K205K553K777L916M579L692
57868C87613L001L894M641L541K008J819K088J655J645K842L358J756j27j89P10
57853D20255J081J609K919L367J873L93O88J207l2j903k360j841j738j725j182
57838D22611j046j813j990q08p2r42j618n79O36M68L32J784L429L526L124L652
57822D30694L932K581R35O49P18k36j098o77m62j973l689l710l134l746m772n022
$$ y = [457714, 459951, 458952, 455223, 450374, 443943, 434653, 423755, 413669, 404241, 393688, 382353, 372190, 363457, 355312, 348749, 345456, 344463, 343281, 341724, 341337, 341847, 341604, 340848, 341077, 341654, 340507, 337745, 335267, 333158, 329910, 325975, 323779, 324132, 325563, 327156, 329237, 331521, 333415, 335887, 340265, 345481, 349178, 351135, 352912, 354797, 356025, 357402, 360456, 364305, 366531, 367002, 367891, 370096, 372649, 375426, 379342, 383921, 387613, 390614, 394508, 399149, 402690, 404698, 406517, 408605, 410260, 411905, 414747, 418105, 419861, 419734, 419545, 420255, 421336, 422945, 425864, 429231, 431104, 431497, 432185, 433392, 433360, 431457, 429097, 427256, 425518, 423793, 422611, 421565, 419752, 417762, 416954, 416882, 415940, 414322, 413743, 414379, 414847, 415179, 416963, 420392, 423918, 427042, 430694, 434626, 437207, 438142, 438791, 439509, 439273, 438175, 437498, 437036, 435063, 431374, 427664, 424530, 420784, 416012, 410990]
57806D10990n796q227j0206r471p626p427q177p548o032n674n981n011l195k343
57792C18276k024o44R83P89o25q41L56J072R17J282K469L445M098N115O041N891
57776C46600N158N000N173M887M636N066N137L684J621M00m56j950l308l406l135
57761C75107l765m433l778k618k368k295j050N51J088J399K978M928N482N242
57747C76468N864O812O528N581N526N776M794L296K997L246K220M92J4L95l03
57732D29706j747j893q95q65j981k291j299m88j95P77K209K271O79p56j089j192
57716D20951j536j503j184j444k049j912j308j523k461k789k403k462l065l199
57702C92113k834k832k901j979n33j24p43q06J64J056J302J402J349N80n62j195
$$ y = [410990, 405194, 396967, 386761, 377290, 369664, 362237, 354060, 346512, 340480, 334806, 328825, 323814, 320619, 318276, 316252, 315608, 316591, 317380, 316755, 315914, 316270, 317342, 318259, 319541, 322010, 325455, 329553, 334668, 340709, 346600, 351758, 356758, 361931, 366818, 371454, 376520, 381657, 385341, 386962, 387362, 386906, 384956, 381648, 378242, 375107, 371342, 366909, 363131, 360513, 358145, 355850, 354800, 355351, 356439, 357838, 360816, 365744, 371226, 376468, 382332, 389144, 395672, 401253, 406779, 412555, 417349, 420645, 423642, 426888, 429108, 429600, 429614, 430009, 429706, 427959, 426066, 425171, 424306, 422325, 420034, 418735, 418247, 418052, 418829, 421038, 423309, 423988, 423232, 422143, 420951, 419415, 417912, 416728, 415284, 413235, 411323, 410015, 408492, 406031, 403242, 400839, 398377, 395312, 392113, 389279, 386447, 383546, 381567, 381034, 380910, 380167, 379361, 379525, 380581, 381883, 383285, 384634, 385214, 384652, 383457]
57686C83457j446j912k043j071R1Q4l35O77K979M823N967P969J1564J6098K1525
57671D48427K8739L7934M8405N9715P1198Q0780Q6013Q5537P7952O0923L4334
57660A119957L270k5056m6922o2406p1611p4046p1099o5570n8647n0159m1381
57649E56330l4433k9221k4096j9292j6427j4874j2222q439o044n756n422l832
57637C76272k230j345k27J161J338K71o9Q70J171j95j701k036j945k207k302k087
57621C64739k415l136k892j747j556k814l687l157k501k603k357j112k37p62j586
57606C32177j484r66q61q57o54q72j649k012j588j337j801k283k457l009l938
57591C06409m103l207k500k746l241l415l572l572k723j494j301k127k421j831
$$ y = [383457, 382011, 380099, 378056, 376985, 377076, 377160, 376825, 377502, 380481, 385304, 391271, 399240, 410804, 426902, 448427, 477166, 515100, 563505, 623220, 694418, 775198, 861211, 946748, 1024700, 1085623, 1119957, 1123227, 1098171, 1051249, 988843, 917232, 843186, 772087, 706517, 647870, 597711, 556330, 521897, 492676, 468580, 449288, 432861, 417987, 405765, 397326, 391282, 385526, 380104, 376272, 374042, 372697, 372470, 373631, 374969, 375240, 375171, 376041, 377212, 377017, 375316, 373280, 371335, 369128, 366826, 364739, 362324, 359188, 356296, 354549, 352993, 350179, 346492, 343335, 340834, 338231, 335874, 334762, 334525, 333763, 332177, 330693, 329727, 328866, 328009, 327355, 326483, 324834, 322822, 321234, 319897, 318096, 315813, 313356, 310347, 306409, 302306, 299099, 296599, 293853, 290612, 287197, 283625, 280053, 277330, 275836, 274535, 272408, 269987, 268156]
57577B68156j743k581k991k419k070k497k647k189k317l252l397k159j212j649
57563B35033k226j701p57k73J38N69Q7j169j420j34Q01L14J11J711L782M445M175
57546B43486M237M064K474J57j279j614j607j259k09J028J740K035K074J319k74
57531B56372j463j341o63m56m94k11O7j12l90m32n50p14k06R86J792J819K015
57514B56019K839L392L159K935L131K961K225K070K846L070J771Q1p58j213j969
57499B82559k398j917j372j633k239k615l196m163m635m235l833l726k927j394
57485B42276q69k162l562l454k568k070j367L19K018K506K174J736P07j137k450
57470B32097k268j629j628j490m11N21J62n22k05M63K88j51K86J101J220R23R19
$$ y = [268156, 266413, 263832, 260841, 258422, 256352, 253855, 251208, 249019, 246702, 243450, 240053, 237894, 236682, 235033, 232807, 231106, 230349, 230076, 230214, 230783, 230870, 229701, 228281, 228147, 228948, 229262, 229373, 231084, 234866, 239311, 243486, 247723, 251787, 254261, 254418, 253139, 251525, 249918, 248659, 248450, 249478, 251218, 253253, 255327, 256646, 256372, 254909, 253568, 252905, 252449, 251955, 251744, 251811, 251699, 251309, 250877, 250327, 249613, 249407, 250393, 252185, 254004, 256019, 258858, 262250, 265409, 268344, 271475, 274436, 276661, 278731, 281577, 284647, 286418, 286499, 285741, 284528, 282559, 280161, 278244, 276872, 275239, 273000, 270385, 267189, 263026, 258391, 254156, 250323, 246597, 243670, 242276, 241407, 239245, 235683, 232229, 229661, 227591, 226224, 226543, 228561, 231067, 233241, 234977, 235684, 234547, 232097, 229829, 228200, 226572, 225082, 224671, 225192, 225354, 224832, 224627, 225090, 225378, 225227, 225513, 226614, 227834, 228757, 229676]
57453B29676Q03K17RM58P6j775l000j824J04K98o30m74O22Q80L94P29J687J618
57435B29868N49J14N56N22k00k86O97J664J934J833J503R14P93J702K567K005
57419B46735O12j3P3m05j350j453p20m69q63n82Q37K345L162L458L169J916J96
57402B56648q95j168j219j022j59Q42J010N23L26M76L46P0K09M52K84M22J822
57385B58967L697M373L795L304L284K949K241K010K268K085J224L50l20j083j605
57370B87539j266m74k40o61j175j791k652k995k147r38m74k58O65J536J025j44
57354B75550j03J045J404M90j18N67J796K702L118K710J234k83m22M89Q71L25
57338B91375j61j84j56J17J053J792J212J49L27J364J335J70k40N46P79k40q74
$$ y = [229676, 230479, 230696, 230705, 231163, 231239, 229464, 226464, 224640, 224744, 225042, 224412, 223938, 224560, 225440, 225834, 226563, 228250, 229868, 230417, 230531, 231087, 231609, 231409, 231123, 231820, 233484, 235418, 237251, 238754, 239668, 240461, 242163, 244730, 246735, 247347, 247334, 247407, 247002, 245652, 244199, 243479, 243010, 242147, 241565, 242402, 244747, 247909, 251367, 254536, 256452, 256648, 255753, 254585, 253366, 252344, 252185, 253027, 254037, 254560, 254886, 255362, 255708, 255778, 255987, 256439, 256723, 257145, 258967, 262664, 267037, 270832, 274136, 277420, 280369, 282610, 284620, 286888, 288973, 290197, 290547, 290227, 289144, 287539, 286273, 285799, 285559, 284898, 283723, 281932, 279280, 276285, 274138, 273200, 272726, 272468, 273133, 274669, 275694, 275550, 275447, 276492, 277896, 278386, 278268, 278835, 280631, 283333, 286451, 289161, 290395, 290112, 289690, 290179, 291050, 291375, 291214, 291030, 290874, 290991, 292044, 293836, 295048, 295197, 295524, 296888, 298223, 298393, 298153, 298699, 299478, 299238, 298364]
57321B98364K9J369J829J625J308P54J61L68J303J790J392R64Q94O08J84N53J650
57304C15145K172J744J461J731J552O22J88R75K021K381K380K335J735N39k25
57289C36756L0O64J129J701K494L119L736M869N965N753M367L339L205L011K511
57274C82649K730L792M374M094M276N438O144N493M751N199O119O318O110O394
57260D53881P019P333P273O976O305N528N323N553N276M527M519N559O323N932
57246E37327N171M886M761M501M649N355N780N552N384N625N722N654O238P288
57232F13893P461O716O938Q950J0976J1332J0848J1107J1928J2258J2162J2342
57220G36911J2646J2541J2174J1884J1492J0981J0909J1456J2062J2661J3933
$$ y = [298364, 298393, 299762, 301591, 303216, 304524, 305278, 305439, 305807, 307110, 308900, 310292, 311256, 312150, 312758, 312942, 313495, 315145, 317317, 319061, 320522, 322253, 323805, 324427, 324615, 325590, 327611, 329992, 332372, 334707, 336442, 336981, 336756, 336786, 337450, 338579, 340280, 342774, 345893, 349629, 354498, 360463, 366216, 370583, 373922, 377127, 380138, 382649, 385379, 389171, 393545, 397639, 401915, 407353, 413497, 418990, 423741, 428940, 435059, 441377, 447487, 453881, 460900, 468233, 475506, 482482, 488787, 494315, 499638, 505191, 510467, 514994, 519513, 525072, 531395, 537327, 542498, 547384, 552145, 556646, 561295, 566650, 572430, 577982, 583366, 588991, 594713, 600367, 606605, 613893, 621354, 628070, 635008, 643958, 654934, 666266, 677114, 688221, 700149, 712407, 724569, 736911, 749557, 762098, 774272, 786156, 797648, 808629, 819538, 830994, 843056, 855717, 869650]
57209H69650J5757J6885J6925J7078J8140J9269J9660J9886K0633K1578K2409
57198A077870K3621K5471K7589L0236L4253L9190M3337M6371M9837N4174N7581
57187A509530N9070O0338O3170O6953P0323P3162P5407P5945P4555P3151P3207
57176B274811P3630P2947P1874P1790P2266P2229P2205P3388P5516P7497P9145
57165C087298Q0884Q2766Q5003Q8063R1162R2268R0912Q9244Q8911Q8911Q8013
57154D053435Q7057Q7007Q6800Q5172Q2670P9579P3910O3901N0961L7872K5808
57143D814172J5363Q668P761J2199K0626L3071M9174O5683P8443Q5741Q7503Q2930
57131E361334P1625N5814L8839K2838J0090M679R629K3372M1352N9486P3848P9665
$$ y = [869650, 885407, 902292, 919217, 936295, 954435, 973704, 993364, 1013250, 1033883, 1055461, 1077870, 1101491, 1126962, 1154551, 1184787, 1219040, 1258230, 1301567, 1347938, 1397775, 1451949, 1509530, 1568600, 1628938, 1692108, 1759061, 1829384, 1902546, 1977953, 2053898, 2128453, 2201604, 2274811, 2348441, 2421388, 2493262, 2565052, 2637318, 2709547, 2781752, 2855140, 2930656, 3008153, 3087298, 3168182, 3250948, 3335951, 3424014, 3515176, 3607444, 3698356, 3787600, 3876511, 3965422, 4053435, 4140492, 4227499, 4314299, 4399471, 4482141, 4561720, 4635630, 4699531, 4750492, 4788364, 4814172, 4829535, 4838203, 4845964, 4858163, 4878789, 4911860, 4961034, 5026717, 5105160, 5190901, 5278404, 5361334, 5432959, 5488773, 5527612, 5550450, 5560540, 5565219, 5574848, 5598220, 5639572, 5699058, 5772906, 5852571]
57119E852571P4644O2244M8787L8678L4646L9603N3853P2264Q8413J00644J10953
57108F577300J20436J30134J44191J67046J98657K36996K83751L42971M16035
57099H617517N03366O09755P42769R07650J109170J355852J655118K005234K397586
57090A9904017K823087L267771L706039M109986M464281M762415M995887N165928
57082E3199411N295864N387462N340363M948797M035589K613797R08963p79132
57074H0951114k233819l372978m206054m777611n136021n317957n343181n224451
57066D5339042m982142m646483m249601l821185l388745k974245k589401k238168
57058A6449072j923548j648771j413447j213315j044269r03643p87983o93079
$$ y = [5852571, 5927215, 5989459, 6038246, 6076924, 6111570, 6151173, 6205026, 6277290, 6365703, 6466347, 6577300, 6697736, 6827870, 6972061, 7139107, 7337764, 7574760, 7858511, 8201482, 8617517, 9120883, 9730638, 10473407, 11381057, 12490227, 13846079, 15501197, 17506431, 19904017, 22727104, 25994875, 29700914, 33810900, 38275181, 43037596, 48033483, 53199411, 58495275, 63882737, 69223100, 74171897, 78207486, 80821283, 81730246, 80951114, 78717295, 75344317, 71138263, 66360652, 61224631, 55906674, 50563493, 45339042, 40356900, 35710417, 31460816, 27639631, 24250886, 21276641, 18687240, 16449072, 14525524, 12876753, 11463306, 10249991, 9205722, 8302079, 7514096, 6821017]
57050F821017o16294n55898n07770m65706m25730l87944l53516l22037k92606
57041B893516k65481k41266k19639j99756j81124j63394j46141j29369j13593
57032A233753r9029q5290p1975n8840m5392l1227j6892l291R791K2975L4255L8291
57020I27129L0499J1757j1932l4101n1301o2812o8950p0399o8182o3313n6613
57009D81782m9064m1907l6005l1387k7605k4267k1119j8034j5266j3343j2527
56998A91258j2502j2800j3156j3344j3016j2007j0512q814p051n294l508j355
56986G7899J506M846Q052J0823J2973J3487J0893N146j674p307j1182j3736j4828
56973I6898j4030j1932r786p909n585k532N94L291N889Q774J1801J4749J7786
$$ y = [6821017, 6204723, 5648825, 5141055, 4675349, 4249619, 3861675, 3508159, 3186122, 2893516, 2628035, 2386769, 2167130, 1967374, 1786250, 1622856, 1476715, 1347346, 1233753, 1134724, 1049434, 977459, 918619, 873227, 842000, 825108, 821817, 831608, 854583, 888838, 927129, 957628, 969385, 957453, 923352, 872051, 809239, 740289, 669890, 601708, 538395, 481782, 432718, 390811, 354806, 323419, 295814, 271547, 250428, 232394, 217128, 203785, 191258, 178756, 165956, 152800, 139456, 126440, 114433, 103921, 95107, 88056, 82762, 79254, 77899, 79405, 84251, 92303, 103126, 116099, 129586, 140479, 145625, 143951, 136644, 125462, 111726, 96898, 82868, 70936, 61150, 53241, 47656, 45124, 45718, 49009, 54898, 63672, 75473, 90222, 108008]
56960A08008K1052K4189K6682K8229K8403K6209K0431J0898o39j1254j8975k4042
56948B39191k7683k9920k9560k6374k1965j7917j4180j0040n695j775J904N948
56936F1934J0340J4826J9786K5580L1471L6114L8622L8134L3180K3082R732l465
56924C39336j4312k2430k7717k9892k9573k8111k6072k3030j9092j5332j2487
56913I1288j0319q511p181o319n640n147m971m715l939l050k629k193q79Q42J672
56898B8309J581J786K633L271L661N087Q030J1270J3764J5926J8352K0704K2612
56885A56986K4215K4884K2869J7350R747K107m794j0799j5124j7024j6884j5570
56873A77963j3320j0179o735l432K01M696R662J4538J9799K6344L4118M2178M9800
$$ y = [108008, 129060, 153249, 179931, 208160, 236563, 262772, 283203, 294101, 293462, 282208, 263233, 239191, 211508, 181588, 152028, 125654, 103689, 85772, 71592, 61552, 55857, 54082, 55986, 61934, 72274, 87100, 106886, 132466, 163937, 200051, 238673, 276807, 309987, 333069, 342801, 339336, 325024, 302594, 274877, 244985, 215412, 187301, 161229, 138199, 119107, 103775, 91288, 80969, 72458, 65277, 58958, 53318, 48171, 43200, 38485, 34546, 31496, 28867, 26674, 25795, 26637, 28309, 29890, 31676, 34309, 37580, 41241, 46328, 54358, 65628, 79392, 95318, 113670, 134374, 156986, 181201, 206085, 228954, 246304, 256051, 258158, 253364, 242565, 227441, 210417, 193533, 177963, 164643, 154464, 147729, 144297, 144498, 149194, 158856, 173394, 193193, 219537, 253655, 295833, 345633]
56860C45633N6572O1394O2154N6723M4392K6744P226j0618k4828l4888m0491m1434
56848E08579l8647l4080k9044k3461j6956r730j981O537J5949K6041L6954M9220
56836D89381O2728P6412Q8967R8566J01682R3979P3775M4125J0902k0477m6346
56825A073694o4725p5468p9881p9301p4363o6016n6145m6330l6790k7248j7990
56814D49437r181K8J0626K2451L4495M6022N6518O4846O8947O6274N4793L4621
56802H99877R223j6020l7090n2803o3250o8259o8009o3774n7063m8809m0039l2145
56790C61839k5635j9574j3105o525p3P070J5362K3452K9467L3019L4648L3851
56778D73796K9032J9389O030q568k1685l1445l7510m0599m1140l9146l5436l1646
$$ y = [345633, 402205, 463599, 525753, 582476, 626868, 653612, 660838, 650220, 625392, 590504, 550013, 508579, 469932, 435852, 406808, 383347, 366391, 356661, 354680, 361217, 377166, 403207, 440161, 489381, 552109, 628521, 717488, 816054, 917736, 1011715, 1085490, 1129615, 1140517, 1120040, 1073694, 1008969, 933501, 853620, 774319, 699956, 633940, 577795, 531465, 494675, 467427, 449437, 440256, 440284, 450910, 473361, 507856, 553878, 610396, 675242, 744189, 810463, 865256, 899877, 909100, 893080, 855990, 803187, 739937, 671678, 603669, 539895, 482832, 434023, 393984, 361839, 336204, 316630, 303525, 297000, 296927, 303997, 319359, 342811, 372278, 405297, 439945, 473796, 502828, 522217, 528247, 519679, 497994, 466549, 429039, 388440, 347300, 308154, 272718, 241072]
56766B41072k8451k4940k0574j6539j4139j2969j1832j0448r143p737o054m810
56754G3436m651m859m265k892j711j178j117j434j958k068j491j024j504k534
56740D0750l107k907k220j177o2L39k72r23n79L94R37Q44O87Q10J258K110K964
56723C9846K820J476K48K82R47J062Q24J174J955K208J821J455J205P42M13Q40
56707E9318J584J583Q31M34R96J968K632K735K232J207N8q07j355j581j268n61
56691G0006r3P6P69K209L145K545J226O78J049J471J675J865J730R51K35M47J115
56674I1099J155N92K71K80K9m48o56q38j604k502k335q79Q38J925K296K060J363
56657I2646P07N67P28P63Q26J194J478J177O00L14K17%q9J10m8r41j568q10P76
$$ y = [241072, 212621, 187681, 167107, 150568, 136429, 123460, 111628, 101180, 92037, 84300, 78246, 73436, 68785, 63926, 59661, 56769, 55058, 53880, 52763, 51329, 49371, 47303, 45812, 44788, 43284, 40750, 37643, 34736, 32516, 31339, 31277, 31616, 31344, 30421, 29842, 30236, 31173, 32017, 32704, 33514, 34772, 36882, 39846, 42666, 44142, 44390, 44672, 45619, 46681, 47505, 48679, 50634, 52842, 54663, 56118, 57323, 58065, 58478, 59318, 60902, 62485, 63316, 63750, 64746, 66714, 69346, 72081, 74313, 75520, 75578, 74771, 73416, 71835, 70567, 70006, 69913, 69989, 70758, 72967, 76112, 78657, 79883, 80561, 81610, 83081, 84756, 86621, 88351, 89302, 89537, 89984, 91099, 92254, 92846, 93117, 93397, 93426, 92978, 92322, 91484, 89880, 87378, 85043, 84164, 85002, 86927, 89223, 91283, 92646, 93353, 93920, 94648, 95411, 96237, 97431, 98909, 100086, 100686, 101000, 101217, 101217, 101128, 101238, 101190, 100249, 98681, 97871, 98647]
56638I8647J599J105P0o97q57l05N41P25m6q00p80o19j004j308q46l69p69j360
56620I2927j074m43o13j218j107l59K04P38J638J965P00j045j281j61M23j31p44
56603I0419r02j045r30J28J404J434M81K32J018J536J321J234J290M10j195j690
56587I5145l15J506K371K455K287J806J209J129J412J179M58K74Q14J144R81J097
56571A14952J711K101K122K460L077L166K914L635N688P942R625J1180J2904J4314
56557A97791J5126J5343J4318J1341P305M070K119N64o36o05J91j9j576k790k658
56542B59884k141k178k452k710l354m125m061l375l440m447n034m725m638n199
56528B08005n387m839m518m557l797k232j519k022j914m17N52m92k194k750k597
$$ y = [98647, 100246, 101351, 101421, 100724, 99867, 99562, 100103, 100828, 100782, 99982, 99202, 98583, 97579, 96271, 95425, 95056, 94287, 92927, 91853, 91410, 90797, 89579, 88472, 88113, 88317, 89055, 90693, 92658, 93358, 92313, 91032, 90871, 91294, 91163, 90419, 89517, 88472, 87542, 87670, 89074, 90508, 90989, 91221, 92239, 93775, 95096, 96330, 97620, 98030, 96835, 95145, 94830, 96336, 98707, 101162, 103449, 105255, 106464, 107593, 109005, 110184, 110642, 110916, 111730, 112874, 113855, 114952, 116663, 118764, 120886, 123346, 126423, 129589, 132503, 136138, 141826, 149768, 159393, 170573, 183477, 197791, 212917, 228260, 242578, 253919, 261224, 265294, 267413, 267977, 267341, 266736, 266927, 266908, 265332, 262542, 259884, 257743, 255565, 253113, 250403, 247049, 242924, 238863, 235488, 232048, 227601, 222567, 217842, 213204, 208005, 202618, 197779, 193261, 188704, 184907, 182675, 181156, 179134, 177220, 176803, 177355, 176863, 174669, 171919, 169322]
56513A69322k878l110k486j793k088k688k395j639j603k137k202j634j022n25
56499A41122%L00J44j43l22n96q92p27k94m08r18n96P87J791J503Q24P19P29K30
56480A43253k59j08L55O95J106J527J316M98njk86q45n22P73J482R21M04P91R16
56461A52011j93j448j561j101j146j330p79K74J144J779K048J300k63j077k97
56446A49361R26J315J215J382J470J029N91O40O70L10J30M49O47M81N82R83P82
56429A62963m4l15J58N7r59j456q23l41n57r5J577K723K208J357J264Q14o78j384
56411A66469J35K236K713K018J577J011m67j700j239O7O14O43J018J043o2j012
56395A75064l37R52J051L92N11J171J151P81J129J720J429P06O69R21M94o4K62
$$ y = [169322, 166444, 163334, 160848, 159055, 156967, 154279, 151884, 150245, 148642, 146505, 144303, 142669, 141647, 141122, 141122, 141422, 141566, 141423, 141101, 140505, 139613, 138886, 138592, 138184, 137266, 136670, 137457, 139248, 140751, 141575, 142294, 143023, 143253, 142994, 142886, 143241, 143936, 145042, 146569, 147885, 148383, 148378, 148377, 148091, 147246, 146724, 147497, 148979, 149900, 150304, 151095, 152011, 151818, 150370, 148809, 147708, 146562, 145232, 144453, 144727, 145871, 147650, 149698, 150998, 150735, 149658, 149361, 150287, 151602, 152817, 154199, 155669, 156698, 157289, 157929, 158599, 158909, 159039, 159488, 160135, 160616, 161198, 162181, 162963, 162919, 162604, 162762, 162819, 161860, 160404, 159581, 159240, 158683, 158588, 160165, 162888, 165096, 166453, 167717, 168531, 167853, 166469, 166604, 168840, 171553, 173571, 175148, 176159, 175692, 173992, 172753, 172820, 173434, 174077, 175095, 176138, 176076, 175064, 174727, 175679, 176730, 177122, 177633, 178804, 179955, 180736, 181865, 183585, 185014, 185720, 186389, 187310, 187804, 187740, 188002]
56378A88002R35J009J083J888K258R99n45l66Q96J169M59L73J020J126O43O02
56362B01551Q97O65L38R56J919J881J252J490K360K317J285O26O66M43k15m03
56346B18028J15O61R31J041P95K78M12J537K428K217K012K925L986L911L469L894
56330B48640M471M055L550M279N261M816L694L705M253L248Q18q53r10m69k07
56315B88351J46L48Jj94M13Q00n7r05K4J961K856K689K952L806M435N270P086
56298C19982Q748Q609P421P141P678P590P098P518Q410Q270P373P151P458P228
56284D27675P023Q029R349R303Q558Q985J0273J0801J0955J2209J3760J3595J2321
56271E62836J2420J4188J5762J6797J8587K0939K2374K3167K4896K7331K9050
$$ y = [188002, 188937, 189946, 191029, 192917, 195175, 196174, 195629, 195263, 196159, 197328, 197787, 198160, 199180, 200306, 200949, 201551, 202448, 203113, 203451, 204407, 206326, 208207, 209459, 210949, 213309, 215626, 216911, 217537, 218203, 218646, 218431, 218028, 218143, 218804, 219735, 220776, 221571, 221849, 222261, 223798, 226226, 228443, 230455, 233380, 237366, 241277, 244746, 248640, 253111, 257166, 260716, 264995, 270256, 275072, 278766, 282471, 286724, 289972, 290790, 289937, 289027, 288558, 288351, 288497, 288845, 288846, 288652, 289065, 289865, 289808, 288903, 288927, 290888, 293744, 296433, 299385, 303191, 307626, 312896, 319982, 328730, 337339, 344760, 351901, 359579, 367169, 374267, 381785, 390195, 398465, 405838, 412989, 420447, 427675, 434698, 442727, 452076, 461379, 469937, 478922, 489195, 499996, 510951, 523160, 536920, 550515, 562836, 575256, 589444, 605206, 622003, 640590, 661529, 683903, 707070, 731966, 759297, 788347]
56260G88347L0727L4303L9406M4129M8871N5692O4246P2252P9883Q9681J02131
56249A449668J15067J27641J41064J55210J68305J80166J92027K02920K09965
56240B942033K12521K12279K08947J99803J84001J63492J39169J09981P6587M2081
56230D490894Q271k5287n7876q6897j11370j32662j50944j64343j72399j76991
56220C420396j79137j78084j74203j69380j63893j56194j46414j36874j28618
56211A987599j20593j12568j05557r9089r1525q3304p6478p0938o4756n8222n3616
56200A050953n0837m7331m2595l8593l5500l1365k6399k3119k1648j9327j5736
56189F98503j3589j3764j3836j2498j1145j0228q375o058n646o941p045n443m645
$$ y = [788347, 819074, 853377, 892783, 936912, 985783, 1041475, 1105721, 1177973, 1257856, 1347537, 1449668, 1564735, 1692376, 1833440, 1988650, 2156955, 2337121, 2529148, 2732068, 2942033, 3154554, 3366833, 3575780, 3775583, 3959584, 4123076, 4262245, 4372226, 4448813, 4490894, 4499165, 4473878, 4416002, 4329105, 4217735, 4085073, 3934129, 3769786, 3597387, 3420396, 3241259, 3063175, 2888972, 2719592, 2555699, 2399505, 2253091, 2116217, 1987599, 1867006, 1754438, 1648881, 1549792, 1458267, 1374963, 1298485, 1227547, 1162791, 1104569, 1050953, 1000116, 952785, 910190, 871597, 836097, 804732, 778333, 755214, 733566, 714239, 698503, 684914, 671150, 657314, 644816, 633671, 623443, 615068, 609010, 603364, 596423, 589378, 583935, 579290]
56176E79290n054m117j608n62j650j730M40K031J459R59J965K710K279K554M166
56161E83132N001M516N030P066Q042P226P264R152J0551J0760J2332J5895J8533
56148G04500J9319K1281K5795L0336L4001L9891M9402N9378O7565P5798Q5067
56137A212333R2475R5928R6848R5688Q9889P9104O7510N8167N0023M2806L9131
56126B019902L8783L6596K9475K0380J2315L983n330j2351j5423j8323k4602l2997
56114B052408m1901n3007o6607p8423q5193q8747r0942q9652q3539p5702o8763
56103A229932o1192n2024m4047l8615l2671k4667j8032j5061j2863r230o677o693
56091I08160n961k573p2q79j640L95K413J988J928M360O219N539O012J0167J4206
$$ y = [579290, 574236, 570119, 568511, 567949, 566299, 564569, 565009, 567040, 568499, 569458, 571423, 574133, 576412, 578966, 583132, 588133, 592649, 597679, 604745, 612787, 620013, 627277, 636429, 646980, 657740, 670072, 685967, 704500, 723819, 745100, 770895, 801231, 835232, 875123, 924525, 983903, 1051468, 1127266, 1212333, 1304808, 1400736, 1497584, 1593272, 1683161, 1762265, 1829775, 1887942, 1937965, 1980771, 2019902, 2058685, 2095281, 2124756, 2145136, 2157451, 2161434, 2156104, 2143753, 2128330, 2110007, 2085405, 2052408, 2010507, 1957500, 1890893, 1812470, 1727277, 1638530, 1547588, 1457936, 1374397, 1298695, 1229932, 1168740, 1116716, 1072669, 1034054, 1001383, 976716, 958684, 943623, 930760, 921530, 914853, 908160, 902199, 899626, 899554, 898675, 897035, 897430, 899843, 901831, 903759, 908119, 914338, 919877, 925889, 936056, 950262]
56076I50262J4805J4852J7190J9093J8436J8684K2048K4162K1593J8111J7592
56065A156828J7380J4909J3907J7217K0260J8660J5876J6245J6988J4405J1444
56054A334119J1630J1822Q568N408O378Q506Q242Q667J2850J6745J6561J6314
56042A465810K0110K3949K3449K2469K5506K8746K7622K6011K8715L2036L1216
56031A755639L0039L3329L7198L6594L5272L8291M2000M1669M1421M6138N1200
56020B188790N1017N0006N4105N9426O0389O0861O5787P0466O9935O9982P6575
56009B877339Q3709Q4479Q4451R0674R7625R8248R8470J05886J14647J17241J20214
55998C972983J31660J44340J48845J52114J64397J79358J86596J92350K07174
$$ y = [950262, 965067, 979919, 997109, 1016202, 1034638, 1053322, 1075370, 1099532, 1121125, 1139236, 1156828, 1174208, 1189117, 1203024, 1220241, 1240501, 1259161, 1275037, 1291282, 1308270, 1322675, 1334119, 1345749, 1357571, 1366139, 1371547, 1377925, 1386431, 1394673, 1403340, 1416190, 1432935, 1449496, 1465810, 1485920, 1509869, 1533318, 1555787, 1581293, 1610039, 1637661, 1663672, 1692387, 1724423, 1755639, 1785678, 1819007, 1856205, 1892799, 1928071, 1966362, 2008362, 2050031, 2091452, 2137590, 2188790, 2239807, 2289813, 2343918, 2403344, 2463733, 2524594, 2590381, 2660847, 2730782, 2800764, 2877339, 2961048, 3045527, 3129978, 3220652, 3318277, 3416525, 3514995, 3620881, 3735528, 3852769, 3972983, 4104643, 4248983, 4397828, 4549942, 4714339, 4893697, 5080293, 5272643, 5479817]
55989E479817K24657K33955K41901K60187K82373K96982L11375L38050L69675
55980H038972L93445M17486M55808N00407N37043N75042O31003O97327P59191
55971A3005724Q27571R20958J030357J139554J262948J423753J613762J818476
55963B3043103K061820K378571K766175L218430L782826M526432N477198O671403
55955E3925958Q226734J0285143J2919353J6184983K0190671K4944837L0145801
55948A76823480L5265385L9731003M2681804M2546089L7469308K6796858J2171453
55941D13485380l180497j6393063k6197367l2585473l5890187l6452486l4811852
55934B27974455l1734813k7959079k4024683k0304172j7029224j4264469j1958303
$$ y = [5479817, 5704474, 5938429, 6180330, 6440517, 6722890, 7019872, 7331247, 7669297, 8038972, 8432417, 8849903, 9305711, 9806118, 10343161, 10918203, 11549206, 12246533, 13005724, 13833295, 14754253, 15784610, 16924164, 18187112, 19610865, 21224627, 23043103, 25104923, 27483494, 30249669, 33468099, 37250925, 41777357, 47254555, 53925958, 62152692, 72437835, 85357188, 101542171, 121732842, 146677679, 176823480, 212088865, 251819868, 294501672, 337047761, 374517069, 401313927, 413485380, 410304883, 393911820, 367714453, 335128980, 299238793, 262786307, 227974455, 196239642, 168280563, 144255880, 123951708, 106922484, 92658015, 80699712]
55927H0699712j0051478q501549p238238o177307n279163m540180l935377l420338
55919C1556082k978928k618867k326624k070943j843823j656348j500010j350998
55911A5209541j207374j085501r84283q86874p93104p17348o57755n98232n37942
55902G741128m89879m53023m13491l70911l37452l12928k85707k56204k35499
55893D586034k22570k05916j85904j73236j66994j55945j40251j30638j27046
55884C077534j18728j04967r5732r1969q4603p3363o7980o9894p0267o6966o6690
55873B166375o9697o8693o3725o2463o5021o3564n7500n4199n4172n0356m2643
55862A514342l8687l9394l7790l3099l1988l4855l4621l0461k9242l1909l1600
$$ y = [80699712, 70648234, 62146685, 54908447, 48731140, 43451977, 38911797, 34976420, 31556082, 28577154, 25958287, 23631663, 21560720, 19716897, 18060549, 16560539, 15209541, 14002167, 12916666, 11932383, 11045509, 10252405, 9535057, 8877302, 8279070, 7741128, 7251249, 6798226, 6384735, 6013824, 5676372, 5363444, 5077737, 4821533, 4586034, 4363464, 4157548, 3971644, 3798408, 3631414, 3475469, 3335218, 3204580, 3077534, 2958806, 2853839, 2758107, 2666138, 2581535, 2508172, 2440192, 2370298, 2300031, 2233065, 2166375, 2096678, 2027985, 1964260, 1901797, 1836776, 1773212, 1715712, 1661513, 1607341, 1556985, 1514342, 1475655, 1436261, 1398471, 1365372, 1333384, 1298529, 1263908, 1233447, 1204205, 1172296, 1140696]
55851A140696k7031k4868k6857k7023k3720k2447k4481k4421k1252k0486k3127
55840H74983k3549k0593j9867k2690k3417k0293j8613k0429k1132j8906j7825
55829F47669j8879j7395j2275q657q665q252n791n104p253p786m957k686k683
55816E37286j579J726L534K612K481M275M725L191L255N374N563L336L263O515
55802E85557Q585P785Q195J1516J3486J1459Q447O717M119k90l593m896p504j2400
55788F37183j5705j5369j4316j4387j3142r498o658o657p467p873r607j2390j2608
55775D91506r350o231m894k388K714P320R457J1188J3257J2394O963J72n084r742
55761E17282j4513j7260j7133j6623j7015j6342j3888j2087j1819j0703q109o910
$$ y = [1140696, 1113665, 1088797, 1061940, 1034917, 1011197, 988750, 964269, 939848, 918596, 898110, 874983, 851434, 830841, 810974, 788284, 764867, 744574, 725961, 705532, 684400, 665494, 647669, 628790, 611395, 599120, 590463, 581798, 573546, 567755, 562651, 555398, 547612, 542655, 539969, 537286, 535707, 537433, 540967, 543579, 546060, 550335, 555060, 558251, 561506, 566880, 572443, 575779, 579042, 585557, 594142, 601927, 610122, 621638, 635124, 646583, 655030, 661747, 665866, 665576, 661983, 657087, 649583, 637183, 621478, 606109, 591793, 577406, 564264, 554766, 548108, 541451, 533984, 526111, 516504, 504114, 491506, 482156, 475925, 471031, 468643, 471357, 478677, 488134, 499322, 512579, 524973, 531936, 532108, 527024, 517282, 502769, 485509, 468376, 451753, 434738, 418396, 404508, 392421, 380602, 369899, 361790, 354880]
55749C54880q070q518o674n105n423n514m231l869n354n865l910k085k198k223
55735B85841p97l0j191k058j366j407l462n034m445l907n117o037m925l552l503
55720B39010l265j830j277k747l679j965O81K205L458N270O002M922M436O102
55706B57323P640O686M364K564Q56j430l188l985n384p675q539p016n450n403
55692B31363n164l428j773j354q18L61L73q92l94K906N572N087L729M152N122
55677B44842M781M261M675M260J904Q7P41J583P4k185k593j996k303k623j444
55662B54064k0q3n28K42J230J189J421L027M132L155K114L176M581L686J486L42
55646B83214l91k534n005n582m964n337o425o634o523p587q911q603p298o973
$$ y = [354880, 346810, 338292, 331618, 326513, 321090, 315576, 311345, 307476, 302122, 296257, 292347, 290262, 288064, 285841, 285044, 285014, 283823, 281765, 280399, 278992, 275530, 270496, 266051, 262144, 257027, 250990, 246065, 242513, 239010, 235745, 233915, 232638, 229891, 226212, 224247, 224928, 227133, 230591, 235861, 241863, 246785, 251221, 257323, 264963, 271649, 276013, 278577, 279433, 278003, 274815, 270830, 265446, 257771, 249232, 242216, 236766, 231363, 226199, 222771, 220998, 219644, 218826, 219187, 219560, 218668, 218274, 221180, 226752, 231839, 235568, 239720, 244842, 249623, 253884, 258559, 262819, 264723, 264810, 265551, 267134, 267208, 265023, 262430, 260434, 258131, 255508, 254064, 254044, 253961, 253433, 253675, 254905, 256094, 257515, 260542, 264674, 267829, 269943, 273119, 277700, 281386, 282872, 283214, 282823, 280289, 275284, 269702, 264738, 259401, 252976, 246342, 239819, 232232, 223321, 214718, 207420, 200447]
55632B00447p327o664n216m499m312l353j925j314j391j360j730l048l908k864
55618A51536j123q07j654j965j641j804k407k625k605k691k102m70O42p5j367
55603A28842j407o34m44o15l18j66r41j714j511j314k190k973k233r31o88j002
55587A09761o14j29o08j083j43J280J314K37l26j06J37M76J135J243M58L31J843
55570A15206L218K589J152J088J965K019J453J587K027J594Q87J059J177l14k460
55555A34247k984j823q06n56k81O6r8l42P5O27N92O47J397J778J048P92K364M044
55537A40787L523J728J123J598J247J18j65L17J54l75J32J105N63j603l630m835
55521A41787n781o082m929l415l428m489m449l033j981j842j436m71n9n11r62
$$ y = [200447, 193120, 186456, 181240, 176741, 172429, 169076, 167151, 165837, 164446, 163086, 161356, 158308, 154400, 151536, 150413, 149606, 147952, 145987, 144346, 142542, 140135, 137510, 134905, 132214, 130112, 129642, 130284, 130209, 128842, 127435, 126801, 126357, 125742, 125424, 125258, 124317, 122603, 121092, 119778, 117588, 114615, 112382, 111451, 110763, 109761, 109147, 109018, 108410, 107327, 107184, 108464, 109778, 110015, 109689, 109583, 109720, 110196, 111331, 112574, 113032, 113363, 115206, 118424, 121013, 122165, 123253, 125218, 127237, 128690, 130277, 132304, 133898, 134785, 135844, 137021, 136707, 134247, 131263, 129440, 128634, 128078, 127797, 127863, 127765, 127423, 127498, 128125, 128717, 129364, 130761, 132539, 133587, 134379, 136743, 140787, 144310, 146038, 147161, 148759, 150006, 150124, 149959, 150276, 150430, 150055, 150187, 151292, 151855, 150252, 146622, 141787, 136006, 129924, 124995, 121580, 118152, 113663, 109214, 106181, 104200, 102358, 100922, 100451, 100392, 99881, 98919]
55506I8919j182j626j873j151j51k06j047j461j486j776j602J4J900K045P71j4
55490I0074o9n92j312p78P03J326Q29N48O61J20p99p09J43J34p20p69K08P14M48
55471I0160P09J593J569L01o88p00p71j426j819j555j220p49N26J919J786J92
55455H9827r76q93o26p60n75R4L07j76n12n05p36q78QJ356J545O52M18J249J611
55436I0430Q33J16J93K46j82l19J72N35M63M89M93k12j029m74J243K156J483N19
55418I7155J92r0n59l22P09J180M37m52n83m39o39j000j370j822j801p09M94K47
55400I0628j018j342m27K4n91q64k01P4o06p61M72J577J061k39p38m80m03n81
55382H5585m97j95m5m2m3r1n7K15M15K69L52J202J996J552K91m72p71j537k244
$$ y = [98919, 97737, 96111, 94238, 93087, 92936, 92730, 91683, 90222, 88736, 86960, 85358, 85372, 87272, 89317, 90088, 90074, 90005, 89413, 88101, 87323, 88026, 89352, 90181, 90729, 91390, 91510, 90711, 90002, 90145, 90279, 89559, 88790, 88998, 89712, 90160, 90869, 92462, 94031, 94332, 93644, 92944, 92173, 90747, 88928, 87373, 86153, 85404, 85930, 87849, 89635, 89827, 88851, 87958, 87332, 86572, 85997, 86091, 86398, 86222, 85710, 85205, 84469, 83591, 83599, 84955, 86500, 87152, 87570, 88819, 90430, 91263, 91379, 91572, 91818, 91636, 91317, 91489, 92024, 92487, 92976, 93469, 93257, 92228, 91754, 92997, 95153, 96636, 97155, 97347, 97257, 96698, 96376, 97085, 98265, 98702, 98250, 97667, 97228, 96589, 95589, 94219, 92397, 90596, 89887, 90381, 90628, 89610, 88268, 87841, 87865, 87274, 86410, 86209, 86283, 85677, 84916, 85388, 86965, 88026, 87787, 87049, 86569, 86166, 85585, 85088, 84893, 84848, 84806, 84763, 84672, 84615, 84830, 85245, 85514, 85866, 87068, 89064, 90616, 90907, 90435, 89664, 88127, 85883]
55363H5883j390O23J576P22l27l67QK94R38J694J374J1q34o32n97j205j286m04
55345H6081J72j34j43P51J313P96L59Q97J348O47m42p21l14J63O59R34L04r20
55327I1750j352p12l56q80j118m44rm86p15O4O51M6o57k36N68N39J01K09N38L99
55307H7900K14M98N84j67j007j072r42j466k091j749n95M22Q82P70K1q75p82N22
55289H1067J710J735J171R10P53L05k0O7k4n90r08o24n86j291j781j255m68l69
55271G9802n40k40J90J37o0J17L80L31K86M27K84k31l66R2L65K29N80J577J959
55252H5319J210O80J305J912J195j77q96j001j013n41O05J249N01n37l93N20Q40
55235I0778M75K36J61k13o87q56j020j409j396o26P0L8k3N32R34M01l30k57K04
$$ y = [85883, 84493, 85116, 86692, 87414, 87087, 86720, 86728, 87022, 87960, 89654, 91028, 91039, 90205, 89573, 88976, 87771, 86485, 86081, 86253, 86119, 85976, 86727, 88040, 88836, 89195, 90092, 91440, 92087, 91645, 90924, 90610, 90773, 91432, 92366, 92670, 91750, 90398, 89686, 89330, 88450, 87332, 86888, 86879, 86393, 85678, 85742, 86393, 86439, 85782, 85546, 86114, 86653, 86754, 86963, 87501, 87900, 88114, 88612, 89196, 89029, 88022, 86950, 86008, 84542, 82451, 80702, 80107, 80529, 81411, 82181, 82202, 81327, 80545, 81067, 82777, 84512, 85683, 86593, 87346, 87651, 87631, 87698, 87674, 87084, 86176, 85552, 84966, 83675, 81894, 80639, 80171, 79802, 79262, 79022, 79212, 79349, 79289, 79406, 79786, 80117, 80403, 80830, 81114, 80883, 80517, 80609, 80974, 81203, 81783, 83360, 85319, 86529, 87209, 88514, 90426, 91621, 91444, 90548, 89547, 88534, 87993, 88598, 89847, 90348, 89811, 89418, 89938, 90778, 91253, 91489, 91650, 91437, 90750, 89894, 88874, 87465, 86069, 85443, 85513, 85551, 85528, 86060, 86994, 87395, 87065, 86808, 87012]
55216H7012K41J81N58Q15L89q1j5j67j061j563o97M32M05p4M28J389J265K44j84
55197H9517J98L80K32M55Q43N58r3n6N43O78L36L79P47N64j08l22K2O8l82p00
55177I3859p51r42j071n24M47R18O70K15k67p70o77N13J981K404J697P63l8q16
55159I7611j093m12M07J75p12q29N5Q16Q62O12K33n31j268j164m45j46m07l51
55141I3413K80P37O46M68M06J27k44l5P87J369J185O45K95J44j9l20p74j149j018
55122I6943m20k5j35j73J47O7q94j691j112L25J145R96O22K59m86j390j616r17
55104I1645J90J214J759J367K45m02J85J204J642J817K298K362J230m7J06J172
55088A07987J278J71n68j26P10J293J793J980J170l07j248j316j190r53j4J242
$$ y = [87012, 87253, 87434, 87992, 88807, 89196, 89115, 89100, 88933, 87872, 86309, 85612, 86044, 86449, 86375, 86803, 88192, 89457, 89701, 89517, 89715, 90095, 90327, 90782, 91625, 92183, 92090, 92034, 92577, 93255, 93591, 93970, 94717, 95281, 95173, 94851, 94873, 94941, 94559, 93859, 93108, 92166, 91095, 90571, 91018, 91936, 92606, 92821, 92554, 91784, 91107, 91620, 93601, 96005, 97702, 98465, 98427, 97611, 96518, 96106, 96513, 96688, 95976, 95147, 95202, 96018, 96880, 97492, 97725, 97194, 95926, 94762, 94317, 94171, 93764, 93413, 93693, 94430, 95076, 95544, 95950, 96077, 95833, 95798, 96585, 97954, 99139, 99784, 100079, 100223, 100204, 99884, 99110, 97961, 96943, 96523, 96498, 96363, 96190, 96337, 96404, 95510, 93819, 92707, 93032, 94177, 95173, 95795, 96054, 95568, 94178, 92562, 91645, 91835, 93049, 94808, 96175, 96420, 96018, 96203, 97407, 99049, 100866, 103164, 105526, 106756, 106709, 106815, 107987, 109265, 109436, 108868, 108742, 109452, 110745, 112538, 114518, 115688, 115381, 114133, 112817, 111627, 110674, 110660, 111902]
55072A11902J450L41p17o98j5O05R64Q34oq41n68N64J066M54j46J7J87m16j294
55053A13683j635j511j376j255j002p38n52l78l36n45o51k68J90K1n38o14j14
55036A02381K33K03K95N98O26L50K78M39L54M0o1j17o72j465j670j287j035r00
55018I8590j58J076J774J609J292J102N44l22o35j99J07j32k47J73N03K41j63
55001A05155j86kJ14L00O63J043J360J523J120L6q36o57m9j64o30j54J031J258
54983A10925J89m75L49J575J879J502J204Q71K57o7L68R63R02L29o1K6M12P04
54965A21852L53p36j589j100L03J114R62R22J394J305L8j346j701j340j057p97
54949A18577j96M39O16M03K4n04q31l24P83J241M19p60j094m62N21J327J528R72
$$ y = [111902, 113352, 113693, 112976, 112278, 112263, 112868, 113832, 114666, 114660, 113819, 113251, 113815, 114881, 115335, 115189, 115206, 115393, 114977, 113683, 112048, 110537, 109161, 107906, 106904, 106166, 105614, 105236, 104900, 104355, 103704, 103436, 103626, 103647, 103109, 102495, 102381, 102614, 102817, 103112, 103710, 104336, 104686, 104964, 105403, 105757, 105797, 105736, 105619, 104947, 103482, 101812, 100525, 99490, 98590, 98432, 99508, 101282, 102891, 104183, 105285, 105829, 105507, 104872, 104673, 104780, 104648, 104401, 104574, 105077, 105318, 105155, 104969, 104967, 105081, 105381, 106044, 107087, 108447, 109970, 111090, 111126, 110290, 109633, 109584, 109420, 108790, 108636, 109667, 110925, 111114, 110639, 110988, 112563, 114442, 115944, 117148, 118019, 118276, 118209, 118577, 119540, 120442, 120771, 120710, 120736, 121148, 121852, 122205, 121469, 119880, 118780, 119083, 120197, 121159, 122081, 123475, 124780, 124818, 123472, 121771, 120431, 119374, 118577, 118381, 118820, 119436, 119839, 119863, 119359, 118528, 118204, 118987, 120228, 120647, 119887, 118793, 118331, 118852, 120179, 121707, 122679]
54931A22679L55O76J737K292K027K088L097M110M319M449N404O751P610Q041Q437
54916A84072Q426P520O199N155M064K110o47l302n231o450p185p628p876p764
54902A71463p046n936m907l985k880j876j635j986j987j383r02q41o22o3J92P4
54886A35680N06J792K862K900K518K514K691K808L481N069O757P712Q237Q720
54872A94247Q525P094N189L836K644M19k989o447q809r639r187q248p621p177
54858A61837o121m488l383l280l257k630k089k285k513j969j260j350j867j800
54844A23545j181q04q18q19q88j322j743j530q43k94J06P26J407J629J298P28
54828A19197J82r3R8L52p0j040j428p97j11j12j40M45R57O47J75L94O59n7j175
$$ y = [122679, 123034, 123710, 125447, 127739, 129766, 131854, 134951, 139061, 143380, 147829, 153233, 159984, 167594, 175635, 184072, 192498, 200018, 206217, 211372, 215436, 217546, 216899, 213597, 208366, 201916, 194731, 187103, 179227, 171463, 164417, 158481, 153574, 149589, 146709, 144833, 143198, 141212, 139225, 137842, 136940, 136099, 135477, 135414, 135606, 135680, 136186, 137978, 140840, 143740, 146258, 148772, 151463, 154271, 157752, 162821, 169578, 177290, 185527, 194247, 202772, 209866, 215055, 218891, 221535, 221954, 218965, 212518, 203709, 194070, 184883, 176635, 169014, 161837, 155716, 151228, 147845, 144565, 141308, 138678, 136589, 134304, 131791, 129822, 128562, 127212, 125345, 123545, 122364, 121560, 120742, 119923, 119035, 117713, 115970, 114440, 113597, 113303, 113409, 114135, 115542, 117171, 118469, 119197, 119379, 119286, 119384, 119736, 119666, 118626, 117198, 116401, 116290, 116178, 116038, 116483, 117440, 118087, 118262, 118656, 119315, 119258, 118083]
54809A18083j272l08N45Q83J319J928J994J309M77m6k03J57R70J392P29l74p14
54792A26869k89k1l6L73J141J232K50q85j261r40l87K18P46R64Q79P64P44Q37
54774A31198J240K085L013L597L955M466N183O019P098Q271Q818Q429P919Q005
54760B09296P895O259L278N33j014j808k563l475m647o141p400p564o642n621
54746A80386n177m968m439l590k780k236j964j795j454r23o18p69q92l87N20J028
54730A49942Q06K82K2L65J448L015M359M960N112N485O277P145P653P385O044
54715B10300L893J684k32k227m400o016o554o585o810o949o491n800n425m917
54701A53471l554j807q61q70r36o29m15n77q11r59j208j489j535j496j708j896
$$ y = [118083, 116811, 116503, 117048, 117931, 119250, 121178, 123172, 124481, 124958, 124912, 124709, 124866, 125836, 127228, 127957, 127583, 126869, 126580, 126559, 126523, 126896, 128037, 129269, 129519, 128634, 127373, 126433, 126046, 126264, 127010, 127974, 128853, 129617, 130361, 131198, 132438, 134523, 137536, 141133, 145088, 149554, 154737, 160756, 167854, 176125, 184943, 193372, 201291, 209296, 217191, 223450, 226728, 227261, 226247, 224439, 221876, 218401, 213754, 207613, 200213, 192649, 186007, 180386, 175209, 170241, 165802, 162212, 159432, 157196, 155232, 153437, 151983, 151060, 150442, 149673, 148781, 148394, 148914, 149942, 150748, 151030, 151052, 151417, 152865, 155880, 160239, 165199, 170311, 175796, 182073, 189218, 196871, 204256, 210300, 214193, 215877, 215645, 213418, 209018, 203002, 196448, 189863, 183053, 176104, 169613, 163813, 158388, 153471, 149917, 148110, 147249, 146379, 145443, 144814, 144399, 143822, 143011, 142052, 140844, 139355, 137820, 136324, 134616, 132720]
54685A32720j347L1J517K348K164R81o24j611j501r86r00j047p87k65k1N3L61
54668A31086O14L50k8P1J34p20j984k199j067K56R32J138R45O1j085j434q46l56
54650A25868m84n67k04n1n11p90q3J102J665J298M96k16n52l50K12O01M89R8j78
54631A27843j46K26P51R31M16l75o51k36L08M88K06n28j506j996j335P9J156J444
54613A27075J361J081K45j043j824j422l50M09N45M91O89J053J071L98n33p81
54597A28465o7O76M40n74j390j517j077j48J088J873J536M95k24l46l46l67j28
54580A28389K74M63N40P83Q15J46o61n70K52O05R3m06k83R0L67P58J206J205P46
54561A34812M86O50P30M75K61K28Q6j15l6M0m79j236j245o22n72j364j759r76
$$ y = [132720, 131373, 131404, 132921, 135269, 137433, 138414, 137790, 136179, 134678, 133692, 132792, 131745, 130958, 130693, 130672, 130725, 131086, 131700, 132050, 132022, 132093, 132227, 131507, 129523, 127324, 126257, 126513, 127445, 128583, 129528, 129589, 128504, 127070, 126224, 125868, 125384, 124817, 124613, 124562, 124051, 123261, 123178, 124280, 125945, 127243, 127739, 127523, 126971, 126621, 126833, 127434, 127923, 128021, 127843, 127697, 127923, 128674, 129605, 130021, 129646, 128995, 128759, 129067, 129555, 129761, 129233, 127727, 125731, 124396, 124475, 125631, 127075, 128436, 129517, 129762, 128719, 126895, 125473, 125123, 125532, 126077, 126568, 127257, 128310, 129381, 129779, 129246, 128465, 128398, 129074, 129514, 128940, 127550, 126033, 124956, 124808, 125896, 127769, 129305, 129800, 129576, 129230, 128884, 128517, 128389, 128663, 129126, 129666, 130449, 131264, 131410, 130749, 130179, 130431, 131036, 131129, 130723, 130440, 130530, 130897, 131655, 132861, 134066, 134812, 135298, 135948, 136678, 137153, 137414, 137642, 137728, 137613, 137577, 137617, 137138, 135902, 134657, 134035, 133463, 132099, 130340, 129364]
54543A29364K39J137K041L159L655K935J711Q73K80l98p36m46k73q76j634j598
54527A39433r63n26l65r4J15j48o63r04q95r41q71m82j78l16l61L69J389J565
54509A35164P91J42L05P06M81l64j070j032k95N83R97P48J39k93j19O70J472J384
54491A40409J88j131j366n45K07K46M7J96N88R59J364J732J601Q34k2m84o87p00
54473A43436k0J584L202L559K508J120M07M15N58M00l0m76p54p59l84K75O28J26
54455A55795q14j059l83N0m66p96L06J900J927K28j270j402j038j077j027l64
54439A50510J90j79r94j270r10m48p2L10N77N72L59M8k09M2J013J895J639N70
54421A53643j0R8k37j219j388M1J675J956J311J020J104P43l8n44o69p80p86m77
$$ y = [129364, 129603, 130740, 132781, 135940, 139595, 142530, 144241, 145114, 145394, 144996, 144260, 143814, 143541, 142665, 141031, 139433, 138470, 137944, 137579, 137485, 137600, 137452, 136789, 135885, 134990, 134049, 133178, 132696, 132518, 132202, 131841, 132210, 133599, 135164, 135955, 136097, 136402, 137108, 137589, 137225, 136155, 135123, 134828, 135411, 136408, 137156, 137295, 137002, 136883, 137553, 139025, 140409, 140597, 139466, 138100, 137555, 137762, 138008, 138055, 138251, 138839, 139798, 141162, 142894, 144495, 145329, 145307, 144823, 144136, 143436, 143416, 145000, 148202, 151761, 154269, 155389, 155796, 156211, 156769, 157169, 157139, 156663, 155909, 155150, 154766, 155041, 155669, 155795, 154981, 153922, 153539, 153589, 153123, 152327, 152633, 154533, 156460, 156688, 155418, 154016, 152978, 151901, 150874, 150510, 150700, 150521, 149527, 148257, 147347, 146899, 146827, 147137, 147714, 148286, 148645, 148693, 148484, 148526, 149539, 151434, 153073, 153643, 153633, 153731, 153494, 152275, 150887, 150928, 152603, 154559, 155870, 156890, 157994, 158737, 158699, 158155, 157486, 156706, 155920, 155443]
54403A55443k79o10r22m33N43R96O39N4k62k34J36P49J217J325J312J333J194
54386A62201R29R79J284J080J20p29p36l05j09j62m18j099j737j081R70K698K921
54369A66806K748L594M777M858M175M012M102L221J766J389K150K216P19j083
54355B05450j905j956j841j551j217j503k434l007k620j919j672j780j919k241
54341A77885k773k938k307j314o54m80n42o23m74J21Q64R89K05q17j205q54l72
54324A64711k95n64p26m92j05N3J25N83J243J166qj284j506p84l3L84O43O37J32
54305A63880m40l76K54P23O73K51m71j368j844j430n88o4K31P16R60K57q69j077
54287A59418j59P93J155J381J616J231J90l94R9Q21Q30N04O45J018P84m4n55k42
$$ y = [155443, 155164, 154554, 153632, 153199, 153742, 154738, 155377, 155431, 155169, 154935, 155071, 155820, 157037, 158362, 159674, 161007, 162201, 163130, 164109, 165393, 166473, 166593, 165864, 165128, 164823, 164714, 164552, 164134, 163035, 161298, 160217, 161187, 163885, 166806, 169554, 173148, 177925, 182783, 186958, 190970, 195072, 198293, 200059, 201448, 203598, 205814, 206533, 205450, 203545, 201589, 199748, 198197, 196980, 195477, 193043, 190036, 187416, 185497, 183825, 182045, 180126, 177885, 175112, 172174, 169867, 168553, 167899, 167419, 166877, 166254, 165780, 165901, 166765, 167754, 167959, 167142, 165937, 165083, 164711, 164416, 163852, 163126, 162634, 162529, 162582, 162707, 163290, 164533, 165699, 165691, 164407, 162901, 162117, 162084, 162468, 163111, 163748, 163880, 163440, 163064, 163318, 164041, 164714, 164965, 164494, 163126, 161282, 159852, 159264, 159200, 159431, 160147, 161107, 161364, 160495, 159418, 159259, 160052, 161207, 162588, 164204, 165435, 165625, 165231, 165330, 166151, 166981, 167485, 168130, 169148, 169932, 169888, 169333, 169091]
54269A69091L62M39j49p19n41K89Q17L50n82p78K16J646K443K185J253M78N10
54252A77310J080J170L40n46n59r5j51o29o30k09l98j389k088j830j264j007o72
54235A68433O1N38K06l15j74M43Q74J210J918K637K456J280O5m45m81n46o11l26
54217A77223K71O76N48J18j61k41m10o91o93l21j29n72j273j519j221q06m72j80
54199A70147j14m13o27k47L43K95l77q15o84n49p33p66l59J3j8j2N07J204J435
54180A68230J197J024J238J725K180K290J881J126M18j00n61r81j212j278j266
54165A75911r90k99L21J23q14j595j744j648j666j577j304j303j723j832r35N66
54149A59491J596J622J027M59K01Q1j66l88m0R72J724J207k74j393j478j040o36
$$ y = [169091, 169453, 169892, 169743, 169024, 168483, 168772, 169589, 169939, 169357, 168579, 168795, 170441, 172884, 175069, 176322, 176800, 177310, 178390, 179560, 179900, 179354, 178795, 178700, 178549, 177920, 177290, 177081, 176683, 175294, 173206, 171376, 170112, 169105, 168433, 168494, 169032, 169238, 168923, 168749, 169192, 170066, 171276, 173194, 175831, 178287, 179567, 179632, 179187, 178706, 178160, 177549, 177223, 177494, 178170, 178718, 178836, 178675, 178434, 178024, 177333, 176640, 176319, 176190, 175618, 174345, 172826, 171605, 170799, 170327, 170147, 170033, 169620, 168993, 168746, 169089, 169384, 169007, 168192, 167508, 166959, 166226, 165460, 165101, 165114, 165096, 165084, 165591, 166795, 168230, 169427, 170451, 171689, 173414, 175594, 177884, 179765, 180891, 181309, 181209, 180648, 179667, 178455, 177177, 175911, 174921, 174622, 174943, 175066, 174252, 172657, 170913, 169265, 167599, 166022, 164718, 163415, 161692, 159860, 158925, 159491, 161087, 162709, 163736, 164195, 164396, 164477, 164311, 163923, 163883, 164855, 166579, 167786, 167512, 166119, 164641, 163601, 162965]
54132A62965j55M58Q13Q19R28J159Q04k92j006l52J124K188K527K627K630K304
54116A79541J857J781K012K064J927K060K557L016L238L467L850M213M367M201
54102B20151L570K526J628J364J284M30j170k167j531m9M49p49k527l491l580
54087B16138l665l953l687k516j317j097j590j724j130l69K40J001J934K393K055
54072B02713J591J731K209K231J602Q15K77L4J43O31J109Q74k77j635k147j382
54056B10519J18J407J967J945J758J685J923K590L376L532K730J779J782K728
54042B39839L576L813M150N342P019Q214Q637Q781R073R455R758J0008J0205J0049
54028C47919R175P680O265N612N567N255M193K962K457K707K946K568J541J7j765
$$ y = [162965, 162810, 163268, 164081, 164900, 165828, 166987, 167791, 167499, 166493, 166141, 167265, 169453, 171980, 174607, 177237, 179541, 181398, 183179, 185191, 187255, 189182, 191242, 193799, 196815, 200053, 203520, 207370, 211583, 215950, 220151, 223721, 226247, 227875, 229239, 230523, 230953, 229783, 227616, 226085, 226036, 226485, 225736, 223209, 219718, 216138, 212473, 208520, 204833, 202317, 201000, 199903, 198313, 196589, 195459, 195090, 195330, 196331, 198265, 200658, 202713, 204304, 206035, 208244, 210475, 212077, 212892, 213169, 213203, 213346, 213977, 215086, 215960, 215683, 214048, 211901, 210519, 210637, 212044, 214011, 215956, 217714, 219399, 221322, 223912, 227288, 230820, 233550, 235329, 237111, 239839, 243415, 247228, 251378, 256720, 263739, 271953, 280590, 289371, 298444, 307899, 317657, 327665, 337870, 347919, 357094, 364774, 371039, 376651, 382218, 387473, 391666, 394628, 397085, 399792, 402738, 405306, 406847, 406864, 405099]
54013D05099l310m234m843n733o834p515p688q015q813r476r321q417p208n875
53999C07817m582l846m051m775n077m522l683l518m215m800m166k564j515j883
53985B54620k706k591j608q43n10J36J153J570R56J29j00K09R11K294M223N804
53969B63647O625P470R114J1090J2314J2238J0735P652L262j363n147p775r169
53956C20693r019p552o068n665n794m994k825k88J467K176K331K618L410M385
53942B94875M842M690M779N864P660R310J0285J0407R543P943O459N691N245M374
53928C91967L091K077J846K415L509M583N118N321O082P674R143R601R516R823
53914D71766J0418J0608J0566J1105J2063J2180J0814Q756P006N612M100K452
$$ y = [405099, 401789, 397555, 392712, 386979, 380145, 372630, 364942, 356927, 348114, 338638, 329317, 320900, 313692, 307817, 303235, 299389, 295338, 290563, 285486, 280964, 277281, 273763, 269548, 264748, 260582, 258018, 256503, 254620, 251914, 249323, 247715, 246872, 246362, 246498, 247651, 249221, 250177, 250306, 250206, 250415, 251326, 253620, 257843, 263647, 270272, 277742, 286856, 297946, 310260, 322498, 333233, 340885, 344147, 342784, 337637, 329862, 320693, 311674, 304122, 298054, 292389, 286595, 281601, 278776, 278488, 279955, 282131, 284462, 287080, 290490, 294875, 299717, 304407, 309186, 315050, 322710, 332020, 342305, 352712, 362255, 370198, 376657, 382348, 387593, 391967, 395058, 397135, 398981, 401396, 404905, 409488, 414606, 419927, 426009, 433683, 442826, 452427, 461943, 471766, 482184, 492792, 503358, 514463, 526526, 538706, 549520, 558276, 565282, 570894, 574994, 577446]
53902E77446J046K3r01k047l402m592n269n624o321p673r175j0127j0539j0981
53888E01864j1715j2399j2638j2435j2101j1891j1749j1339j0456r396q616q057
53876C69072p237o150n411n332n465n427n492n864o052n635n061m985n194n034
53862B90733m532m256m218l775k666j495j047j490k275k636k256j596j345j510
53848B55636j558j475j933k975l488k675j336p68j016j106o24n2J35p1m90p13
53832B35491j71J025J749J268M93P26J644J790R12K53N47J064J056Q59R61J094
53816B50761R57J046J874K954L277K597J627J158J407K180L263M594O044P263
53802B91002P926Q218Q631R163R158Q355P519P403P607P187O115N133M472L724
$$ y = [577446, 578492, 578515, 577614, 575567, 572165, 567573, 562304, 556680, 550359, 542686, 533511, 523384, 512845, 501864, 490149, 477750, 465112, 452677, 440576, 428685, 416936, 405597, 395141, 385745, 377129, 369072, 361835, 355685, 350274, 344942, 339477, 334050, 328558, 322694, 316642, 311007, 305946, 300961, 295767, 290733, 286201, 281945, 277727, 273952, 271286, 269791, 268744, 267254, 264979, 262343, 260087, 258491, 257146, 255636, 254078, 252603, 250670, 247695, 244207, 241532, 240196, 239428, 238412, 237306, 236682, 236630, 236765, 236694, 236204, 235491, 235320, 236345, 238094, 239362, 239855, 240581, 242225, 244015, 244927, 245180, 245727, 246791, 247847, 248706, 249667, 250761, 251718, 252764, 254638, 257592, 260869, 263466, 265093, 266251, 267658, 269838, 273101, 277695, 283739, 291002, 298928, 307146, 315777, 324940, 334098, 342453, 349972, 357375, 364982, 372169, 378284, 383417, 387889, 391613]
53788C91613K905K590K777K612J573J76q47j421j888k524l580n175o831p634p314
53773C67032o703o779p538q197q185p604o844o113n365m663m367m730n317n276
53759B79351m409l501l185l086k611k013j865j967j785j564j930k564k441j505
53745B44925q66j105j491j268p15m18l46k59l07o12q12o23l18k15j07K63O20N99
53727B36945L64L23M35M04K77M24Q95J236J058N67M44J086K034K350J699P91M48
53710B51780N77N10J34rL75R60J433J872K338K651K784K996L455M035M589N076
53694B85556N342N201M735M144L357K227J038L02O3r4m05p55j085j374j362r24
53678C05966n60p86j176q10K99J140J131P05L49K3k20l8L89K91m29p81j42P22
$$ y = [391613, 394518, 397108, 399885, 402497, 404070, 404246, 403399, 401978, 400090, 397566, 393986, 388811, 381980, 374346, 367032, 360329, 353550, 346012, 337815, 329630, 322026, 315182, 309069, 303704, 299041, 294674, 289944, 284627, 279351, 274942, 271441, 268256, 265170, 262559, 260546, 258681, 256714, 254929, 253365, 251435, 248871, 246430, 244925, 244059, 242954, 241463, 240195, 239480, 239062, 238716, 238457, 238150, 237538, 236726, 236103, 235785, 235570, 235463, 235726, 236346, 236945, 237309, 237632, 238067, 238471, 238748, 239172, 240067, 241303, 242361, 242928, 243372, 244458, 246492, 248842, 250541, 251332, 251780, 252357, 252867, 253001, 252992, 253367, 254327, 255760, 257632, 259970, 262621, 265405, 268401, 271856, 275891, 280480, 285556, 290898, 296099, 300834, 304978, 308335, 310562, 311600, 311902, 311965, 311871, 311466, 310711, 309626, 308252, 306890, 305966, 305406, 304620, 303444, 302634, 302933, 304073, 305204, 305909, 306258, 306281, 306061, 306023, 306412, 306703, 306274, 305493, 305351, 306073]
53660C06073P82J98j69j49k42n80o67k11M69Q41O73K17K1M45J195J582J327Q06
53642C12611M54L73N26Q68J092R31P85J390K671L642L708L325L028K684K239K309
53626C42636L177L908L440K139J284J267J297Q38M08O49J362J827J710J296J033
53611C68271J099J338J506J516J458J512J865K596L377L514K715J715J619K538
53597C96639L388L240K312J403Q35M12K6j54k9K57M47L42l3m73q76j375j977k259
53579D02125j929j433j440j812j793j198o43n62p84j239k138l112l076j547N42
53564C79961J886K093J576P91J15j11Nl3k50K5J013J862J768J106P14N87J97l46
53546C92959l40M09J353J993K294K353K219K037J946J941K096K695L742M693N098
$$ y = [306073, 306855, 307053, 306884, 306735, 306493, 305913, 305246, 305035, 305504, 306345, 307018, 307235, 307256, 307701, 308896, 310478, 311805, 312611, 313065, 313438, 313964, 314832, 315924, 316855, 317640, 319030, 321701, 325343, 329051, 332376, 335404, 338088, 340327, 342636, 345813, 349721, 353161, 355300, 356584, 357851, 359148, 359986, 360394, 361043, 362405, 364232, 365942, 367238, 368271, 369370, 370708, 372214, 373730, 375188, 376700, 378565, 381161, 384538, 388052, 390767, 392482, 394101, 396639, 400027, 403267, 405579, 406982, 407817, 408229, 408255, 408101, 408072, 408329, 408776, 409118, 409085, 408612, 407736, 406361, 404384, 402125, 400196, 398763, 397323, 395511, 393718, 392520, 391877, 391315, 390531, 389292, 387154, 384042, 380966, 379419, 379961, 381847, 383940, 385516, 386307, 386422, 386311, 386316, 386283, 386033, 386058, 387071, 388933, 390701, 391807, 392521, 393108, 393305, 392959, 392619, 393028, 394381, 396374, 398668, 401021, 403240, 405277, 407223, 409164, 411260, 413955, 417697, 422390, 427488]
53531D27488N195N462N890O218O550P099P632P799P853Q375R434J0553J1425J2066
53517E39039J2426J2484J2676J3600J5189J6727J7769J8582J9562K0764K2092
53506G20910K3463K4583K4919K4302K3285K2576K2249K1790K0957K0196K0019
53495I69249K0123J9666J8432J7290J7099J7589J7859J7680J7635J8037J8518
53484A169177J8814J9116J9445J9349J8685J8128J8362J9172J9671J9173J7583
53473A376675J5279J2913J0932R151P107M833K750Q01j517m132o257p551q551
53460A412433r569j0155j0161j0332j1107j1826j2022j2497j4041j5866j6637
53449A278220j6536j6889j8058j8978j8815j7888j6872j6074j5642j5514j4996
$$ y = [427488, 432683, 438145, 444035, 450253, 456803, 463902, 471534, 479333, 487186, 495561, 504995, 515548, 526973, 539039, 551465, 563949, 576625, 590225, 605414, 622141, 639910, 658492, 678054, 698818, 720910, 744373, 768956, 793875, 818177, 841462, 864038, 886287, 908077, 929034, 949230, 969249, 989372, 1009038, 1027470, 1044760, 1061859, 1079448, 1097307, 1114987, 1132622, 1150659, 1169177, 1187991, 1207107, 1226552, 1245901, 1264586, 1282714, 1301076, 1320248, 1339919, 1359092, 1376675, 1391954, 1404867, 1415799, 1424950, 1432057, 1436890, 1439640, 1440441, 1438924, 1434792, 1428535, 1420984, 1412433, 1402864, 1392709, 1382548, 1372216, 1361109, 1349283, 1337261, 1324764, 1310723, 1294857, 1278220, 1261684, 1244795, 1226737, 1207759, 1188944, 1171056, 1154184, 1138110, 1122468, 1106954, 1091958]
53438A091958j3241j0353p369n044l384k375k235k677k751j907o65J33L57N44
53424A040991J210K466M019N371O207O763P575Q913J0616J2456J4282J5932J7281
53411A154082J8458J9686K0955K2179K3496K5110K6878K8423K9660L0848L2144
53400A431919L3478L4819L6344L8316M0906M3920M6599M8034M8182M8168M9119
53389A899804N0921N2497N3147N3067N2716N2167N1217M9743M7887M6066M4692
53378B453924M3682M2315L9831L6094L1554K6832K2461J8707J5370J1871P715
53367B750356K717l109r467j5640k1000k5734l0394l4787l8145m0491m2671m4678
53355B446957m5272m4001m2308m1602m1319m0173l8320l6807l5663l4228l2905
$$ y = [1091958, 1078717, 1068364, 1060995, 1055951, 1052567, 1050192, 1047957, 1045280, 1042529, 1040622, 1039957, 1040090, 1040447, 1040991, 1042201, 1044667, 1048686, 1054057, 1060264, 1067027, 1074602, 1083515, 1094131, 1106587, 1120869, 1136801, 1154082, 1172540, 1192226, 1213181, 1235360, 1258856, 1283966, 1310844, 1339267, 1368927, 1399775, 1431919, 1465397, 1500216, 1536560, 1574876, 1615782, 1659702, 1706301, 1754335, 1802517, 1850685, 1899804, 1950725, 2003222, 2056369, 2109436, 2162152, 2214319, 2265536, 2315279, 2363166, 2409232, 2453924, 2497606, 2539921, 2579752, 2615846, 2647400, 2674232, 2696693, 2715400, 2730770, 2742641, 2750356, 2753073, 2749964, 2740497, 2724857, 2703857, 2678123, 2647729, 2612942, 2574797, 2534306, 2491635, 2446957, 2401685, 2357684, 2315376, 2273774, 2232455, 2192282, 2153962, 2117155, 2081492, 2047264, 2014359]
53344B014359l2810l3816l4574l4560l4531l4763l4331l2675l0575k9011k8002
53333A654711k7084k6024k4550k2263j9367j6799j5255j4600j4580j5339j6831
53322A442019j8325j9085j9147j9098j9348j9819k0032j9428j7910j6086j4579
53311A239162j3279j1710r914q350p043n630m181l217k863k601j892m58J853M821
53297A174698P590R458J0861J2763J5255J7575J9384K0977K2348K3071K3186K3124
53285A380290K2740K1569K0164J9861K0838K1591K0784J8612J5849J2687R141
53274A584126N665K664P1k187l994n697q004j0850j3254j4745j5993j7584j9212
53261A481006k0581k1980k3310k3677k2841k2008k2249k3012k3205k2880k2731
$$ y = [2014359, 1981549, 1947733, 1913159, 1878599, 1844068, 1809305, 1774974, 1742299, 1711724, 1682713, 1654711, 1627627, 1601603, 1577053, 1554790, 1535423, 1518624, 1503369, 1488769, 1474189, 1458850, 1442019, 1423694, 1404609, 1385462, 1366364, 1347016, 1327197, 1307165, 1287737, 1269827, 1253741, 1239162, 1225883, 1214173, 1204259, 1195909, 1188866, 1183236, 1179055, 1175838, 1172975, 1170374, 1168482, 1168024, 1169877, 1174698, 1182288, 1191746, 1202607, 1215370, 1230625, 1248200, 1267584, 1288561, 1310909, 1333980, 1357166, 1380290, 1403030, 1424599, 1444763, 1464624, 1485462, 1507053, 1527837, 1546449, 1562298, 1574985, 1584126, 1589791, 1592455, 1592526, 1590339, 1586345, 1580648, 1572644, 1561794, 1548540, 1533795, 1517802, 1500218, 1481006, 1460425, 1438445, 1415135, 1391458, 1368617, 1346609, 1324360, 1301348, 1278143, 1255263, 1232532]
53250A232532k2694k2273k1714k1627k1847k1734k1358k1256k1337k1125k0786
53239I94781k0891k1180k0715j9370j8142j7773j7811j7337j6010j4138j2224
53228G99190j0687r678r004q471q173q321q837r545j0475j1755j3276j4780j6092
53215F60096j7020j7330j7093j6746j6486j5933j4758j3247j1865j0682r649q976
53203D90311q730q467p904p469p606p896p745p516q099r399j0294j0072r194q394
53189C71526p811p275o846o662o598o383n806m734l265j890j216j376j934k410
53175C07320k654k742k772k813k849k724k378k043j981k012j658p82J37M68R8
53160B80615m91p04m20q4k12q30j511j882j891j602j075m51J40P60J448J817J343
$$ y = [1232532, 1209838, 1187565, 1165851, 1144224, 1122377, 1100643, 1079285, 1058029, 1036692, 1015567, 994781, 973890, 952710, 931995, 912625, 894483, 876710, 858899, 841562, 825552, 811414, 799190, 788503, 778825, 769821, 761350, 753177, 744856, 736019, 726474, 715999, 704244, 690968, 676188, 660096, 643076, 625746, 608653, 591907, 575421, 559488, 544730, 531483, 519618, 508936, 499287, 490311, 481581, 473114, 465210, 457741, 450135, 442239, 434494, 426978, 418879, 409480, 399186, 389114, 379920, 371526, 363715, 356440, 349594, 342932, 336334, 329951, 324145, 319411, 316146, 314256, 313040, 311664, 309730, 307320, 304666, 301924, 299152, 296339, 293490, 290766, 288388, 286345, 284364, 282352, 280694, 279912, 280049, 280517, 280615, 280124, 279420, 279000, 278916, 278704, 277874, 276363, 274481, 272590, 270988, 269913, 269462, 269602, 270362, 271810, 273627, 274970]
53143B74970J68q85j243j123r67q65p77p97q70o87j54M10Q15J179J354Q90m1m20
53125B70957L21J379J718J484J489J804J837J524J412J639J747J539J423J709
53111B91982K208K531K388J634N08k64k52J2l04j159j801j932j924j914j601j100
53095B89012j033j522j832j466r14q41j124j226j056q98p88n14j05J16lk47k94
53078B75265n1J85o7r39j822j874r65R4N07K99rj79l57n62o21n94q55j541k123
53059B63791j886p85M50J132J315J413J394Q28j78o77K5J352J993J413L74j08
53043B71846J62O35Q00O02K09k80p94j084q05N7R05J006K93m77n56j9M48L41k72
53024B73017r32j117n67M00R53N82j91l30M25J200J112M23J78P80J417J074j33
$$ y = [274970, 275138, 274253, 273010, 271887, 270920, 270055, 269278, 268481, 267611, 266924, 266770, 267180, 267995, 269174, 270528, 271418, 271377, 270957, 271278, 272657, 274375, 275859, 277348, 279152, 280989, 282513, 283925, 285564, 287311, 288850, 290273, 291982, 294190, 296721, 299109, 300743, 301251, 300987, 300735, 300747, 300443, 299284, 297483, 295551, 293627, 291713, 290112, 289012, 287979, 286457, 284625, 283159, 282245, 281404, 280280, 279054, 277998, 277100, 276312, 275798, 275693, 275809, 275806, 275559, 275265, 275214, 275399, 275332, 274393, 272571, 270697, 269732, 269826, 270333, 270632, 270623, 270444, 270087, 269525, 268904, 268310, 267455, 265914, 263791, 261905, 261120, 261570, 262702, 264017, 265430, 266824, 267652, 267474, 266797, 266822, 268174, 270167, 271580, 271954, 271846, 272008, 272643, 273443, 274045, 274254, 273974, 273180, 272096, 271291, 271348, 272253, 273259, 273552, 273075, 272519, 272500, 272948, 273289, 273017, 272085, 270968, 270401, 270801, 271754, 272336, 272145, 271815, 272240, 273440, 274552, 274975, 275153, 275933, 277350, 278424, 278291]
53007B78291j003o85L05P33J71n76n58J18N10J01n30l48Q46K073K176J150J53
52990B82927K09J132J967K140J805J327R51Q82J188J533J487J200J273J870K402
52975C04293K271J508N33l55j019j343j300r68m11K58P35Q17P58R39J221J190
52959C09127R51R63J154Q67l9r37j442j892k449k609k139j674j745j906j596j178
52943B93456j356j965k260k025j570j004k60L55M38J72K0r5n89j290j493r07j5
52926B79612N95P58O09L88L25M07L21j04n76p92q28p71m42J7j07j044j712r19
52908B75737Q66J915J382P5r22j448j769j708q74O04J926K212J229k31q98k79
52892B77817P84J167Q12N44P56R99P50O2o77j084r23l45Q5k9l55l26M2L30N12
$$ y = [278291, 277288, 276603, 276908, 277641, 277812, 277236, 276678, 276796, 277306, 277407, 276877, 276529, 277375, 279448, 281624, 282774, 282927, 283136, 284268, 286235, 288375, 290180, 291507, 292458, 293340, 294528, 296061, 297548, 298748, 300021, 301891, 304293, 306564, 308072, 308605, 308250, 307231, 305888, 304588, 303620, 303209, 303467, 304202, 305019, 305777, 306716, 307937, 309127, 310078, 311041, 312195, 313062, 313023, 312086, 310644, 308752, 306303, 303694, 301555, 299881, 298136, 296230, 294634, 293456, 292100, 290135, 287875, 285850, 284280, 283276, 283016, 283371, 283809, 283981, 284001, 283906, 283317, 282027, 280534, 279627, 279612, 280207, 280965, 281574, 281962, 282287, 282694, 283015, 282911, 282335, 281543, 280715, 279944, 279502, 279519, 279412, 278368, 276656, 275737, 276603, 278518, 279900, 279975, 279053, 277605, 275836, 274128, 273254, 273858, 275784, 277996, 279225, 278994, 278096, 277817, 278601, 279768, 280580, 281124, 281880, 282879, 283629, 283691, 283014, 281930, 281007, 280662, 280747, 280718, 280363, 280037, 280079, 280409, 280921]
52873B80921R57J708K381K791L071L227L146K988L055L218L038K427J653Q07k14
52858C15174j217j818k032k251k625l034l519m144m525m235l632l455l621l218
52844B71848j955q41r57k190l451l818l187k156j486j387j349q54j32K60K99M35
52828B49079Q10J243J730K281K427J752Q00M95P28N33k14n21P7P34P45O51J136
52811B64486J740J646J058P71P96M65k35m84P9O15J41j122j867j242R8O74j75
52794B67444j597k298j925j157p54r06j311j392o91N78J560J731J504J441J303
52779B63530O91J21M57J434J842J172R8p35j323j626j328n74k1J39K87L62k06
52762B64320j235j658j122n81o96p84k15L11om79J48J682K705K602K186K306K783
$$ y = [280921, 281878, 283586, 285967, 288758, 291829, 295056, 298202, 301190, 304245, 307463, 310501, 312928, 314581, 315388, 315174, 313957, 312139, 310107, 307856, 305231, 302197, 298678, 294534, 290009, 285774, 282142, 278687, 275066, 271848, 269893, 269052, 268095, 265905, 262454, 258636, 255449, 253293, 251807, 250420, 249071, 248217, 248085, 248345, 248644, 249079, 249889, 251132, 252862, 255143, 257570, 259322, 260122, 260617, 261345, 261878, 261664, 261143, 261220, 261954, 262699, 263350, 264486, 266226, 267872, 268930, 269701, 270497, 270962, 270727, 270243, 270322, 270937, 271078, 269956, 268089, 266847, 266945, 267619, 267444, 265847, 263549, 261624, 260467, 259713, 258807, 257496, 256104, 255413, 255991, 257551, 259282, 260786, 262227, 263530, 264221, 264342, 264799, 266233, 268075, 269247, 269345, 268610, 267287, 265661, 264333, 263759, 263738, 263877, 264164, 264526, 264320, 263085, 261427, 260305, 259724, 259028, 258244, 258029, 258340, 258334, 257855, 258003, 259685, 262390, 264992, 267178, 269484, 272267]
52745B72267K939K519J835J352J256J308J209J154J656K641L199K653J445N11
52731B97944J50n7m32q53j062r44n97k78j63j14N2O0m70j197j260n08J69J10k45
52712B90305k52p9k44o94j044j266j488j480j054n79n13o13k79N34J259J391Q47
52695B84751j49j092j385r05k46l9k50l99k51K9J20k05p61q36j8R14O42q29j922
52676B77169j536m76j47p05j357j720j878j669r33j33K01L32P74J292J288Q96
52660B71398P51Q98R03P81R24J262J416J568K222L183L676L424K762J756K44j247
52644B95921j753j197n48l98l17P9M35M25L60M40K29n49j200p64Q34K881M814
52627B99692O611Q386R974J0774R900O892K495j640m319n640o295o613o602o449
$$ y = [272267, 275206, 277725, 279560, 280912, 282168, 283476, 284685, 285839, 287495, 290136, 293335, 295988, 297433, 297944, 298094, 298037, 297605, 296752, 295690, 294746, 294149, 293871, 293708, 293594, 293646, 293706, 293236, 292039, 290779, 290271, 290440, 290550, 290305, 290053, 289974, 289730, 289036, 287992, 286726, 285238, 283758, 282704, 282125, 281612, 280999, 280720, 281254, 282513, 283904, 284751, 284602, 283510, 282125, 281220, 280974, 280935, 280685, 280286, 280035, 280064, 280184, 279979, 279218, 278382, 278364, 279278, 279920, 279091, 277169, 275633, 275157, 275010, 274305, 272948, 271228, 269350, 267681, 266748, 266615, 266816, 267148, 267922, 269214, 270502, 271398, 272149, 273047, 273950, 274731, 275655, 276917, 278333, 279901, 282123, 285306, 288982, 292406, 295168, 296924, 297168, 295921, 294168, 292971, 292423, 292025, 291708, 291787, 292222, 292647, 293007, 293447, 293676, 293127, 291927, 291163, 291997, 294878, 299692, 306303, 314689, 324663, 335437, 345337, 352229, 354724, 353084, 348765, 343125, 336830, 330217, 323615, 317166]
52613C17166o268n643m091j995m66j20m81p92r34j118j117m51O49J178N62n57
52597B95522j121r64q01j115j555j493p14M80J493J791J375Q65P46O84J33n98
52581B94728n88L16J249J596J671J855J938J770J670J618Q95o97k011j918q53
52566C03239j03j8M2K70J42m62r19q25n30m40m76m69n73r72j519j824j612r46
52548B92005k79r2l72o23n76m55m04j36M33Q09P48Q70J758K845L006K013O58l25
52530C01883p39o18j32K89M20O17J154J520J192O31O18Q90N13m55q93k82O76J393
52512C08677K232L587M961N583N358M712L956L151K278J217j54j707l134m275
52498C36442n019n041m195l049k453k537k704k601k473k498k464k162j573o21
$$ y = [317166, 310898, 305255, 301164, 299169, 298703, 298583, 298102, 297310, 296376, 295258, 294141, 293690, 294339, 295517, 296079, 295522, 294401, 293437, 292636, 291521, 289966, 288473, 287759, 288239, 289732, 291523, 292898, 293763, 294509, 295193, 295326, 294728, 294140, 294456, 295705, 297301, 298972, 300827, 302765, 304535, 306205, 307823, 308718, 308021, 306010, 304092, 303239, 303136, 303118, 303160, 303430, 303572, 303110, 302191, 301366, 300836, 300396, 299920, 299451, 298878, 297906, 296387, 294563, 292951, 292005, 291726, 291634, 291262, 290639, 290063, 289608, 289204, 289068, 289501, 290310, 291058, 291928, 293686, 296531, 299537, 301550, 302208, 301883, 301144, 300526, 300394, 300683, 301103, 301720, 302874, 304394, 305586, 306217, 306835, 307725, 308238, 307783, 306890, 306608, 307284, 308677, 310909, 314496, 319457, 325040, 330398, 335110, 339066, 342217, 344495, 345712, 345558, 343851, 340717, 336442, 331423, 326382, 322187, 319138, 316685, 314148, 311444, 308843, 306370, 303872, 301408, 299246, 297673, 297052]
52484B97052O19J523J417N44j67k49L9O12J728L078L687L129K125J502J229R65
52468C18833Q43J176J865K615L353M015M334M265M208M362M190K996Q64j305k610
52453C54004k854k600k655l386m413n103n188m740l812k592j599j177q60k1J049
52438C14053J408Q69J99j44n39j211j579j156l70N2J7q3n0J13M03P20Q32P14O13
52419C14861N34J67m46o58k2J062J859K174K383K872L714M714N598O362P399R030
52403C61603J0944J2437J3090J2737J1020P657L241r56m108o218p482p960p903
52390C98102p626o955n598m050l213l067k756k078j736j793j265K02J506J782
52376C61455J762K407L254L319K959L431N003O617P313P060O207M971L439J674
$$ y = [297052, 297671, 299194, 300611, 301155, 300988, 300739, 300778, 301390, 303118, 306196, 309883, 313012, 315137, 316639, 317868, 318833, 319676, 320852, 322717, 325332, 328685, 332700, 337034, 341299, 345507, 349869, 354059, 357055, 357919, 356614, 354004, 351150, 348550, 345895, 342509, 338096, 332993, 327805, 323065, 319253, 316661, 315062, 313885, 313025, 313004, 314053, 315461, 316330, 316529, 316385, 315846, 314635, 313056, 311900, 311530, 311582, 311599, 311516, 311466, 311579, 311982, 312702, 313534, 314248, 314861, 315395, 315562, 315116, 314458, 314436, 315498, 317357, 319531, 321914, 324786, 328500, 333214, 338812, 345174, 352573, 361603, 372547, 384984, 398074, 410811, 421831, 429488, 432729, 431773, 427665, 421447, 413965, 406005, 398102, 390476, 383521, 377923, 373873, 370660, 367593, 364837, 362759, 361023, 359230, 357965, 358167, 359673, 361455, 363217, 365624, 368878, 372197, 375156, 378587, 383590, 390207, 397520, 404580, 410787, 415758, 419197, 420871]
52362D20871j78j572j874j317r93j350j416k96J263J813J241P33R74J525J889
52347D21313K153K460K687K868L274L916M439M614M513M228L912L944M644N860
52333D74825P240Q703J0244J1567J2501J3500J5110J7157J9011K0503K1890K3161
52321F55412K4029K4483K4692K4532K3916K3383K3617K4390K4802K4561K4342
52310I22159K4768K5779K7068K8362K9158K8908K7772K6560K5719K4972K4030
52299A215255K3006K1838K0056J7457J4523J1721Q926N836K485j026m718q188
52287A327171j0474j1164j1197j1797j2821j3031j1932j0429r472q822p727o151
52275A202154m615l155j216J395M138O508Q571J0490J2091J3269J4377J5675J6769
$$ y = [420871, 420693, 419121, 417247, 415930, 414937, 413587, 412171, 411875, 413138, 414951, 416192, 416925, 417899, 419424, 421313, 423466, 425926, 428613, 431481, 434755, 438671, 443110, 447724, 452237, 456465, 460377, 464321, 468965, 474825, 482065, 490768, 501012, 512579, 525080, 538580, 553690, 570847, 589858, 610361, 632251, 655412, 679441, 703924, 728616, 753148, 777064, 800447, 824064, 848454, 873256, 897817, 922159, 946927, 972706, 999774, 1028136, 1057294, 1086202, 1113974, 1140534, 1166253, 1191225, 1215255, 1238261, 1260099, 1280155, 1297612, 1312135, 1323856, 1332782, 1338618, 1341103, 1340077, 1335359, 1327171, 1316697, 1305533, 1294336, 1282539, 1269718, 1256687, 1244755, 1234326, 1224854, 1216032, 1208305, 1202154, 1197539, 1194384, 1193168, 1194563, 1198701, 1205209, 1213780, 1224270, 1236361, 1249630, 1264007, 1279682, 1296451]
52262A296451J7217J7386J8071J9383K0654K1371K1541K1258K0630K0166K0382
52251A514510K0891K0599J8982J6478J3518J0011O069K242j275m843q291j0749
52239A598142j2080j3438j5521j7283j7486j6704j6513j7237j7839j7628j6778
52228A419635j5440j3649j2006j1201j0761r589p811o795o985p012n594l255j499
52215A308038r78j206j375q50O72K826M682N637N929O043O055N910N841N997O114
52200A359335O050O211O922P692P775P284P049P400P838Q027Q400R343J0290J0217
52186A469833Q885O971M972K660j88l108n564p750j0037j1926j2529j2035j1723
52173A418461j2159j2435j1646j0271r215q266o569m175k108r70l78K46J161K451
$$ y = [1296451, 1313668, 1331054, 1349125, 1368508, 1389162, 1410533, 1432074, 1453332, 1473962, 1494128, 1514510, 1535401, 1556000, 1574982, 1591460, 1604978, 1614989, 1621058, 1623300, 1622025, 1617182, 1608891, 1598142, 1586062, 1572624, 1557103, 1539820, 1522334, 1505630, 1489117, 1471880, 1454041, 1436413, 1419635, 1404195, 1390546, 1378540, 1367339, 1356578, 1346989, 1339178, 1332383, 1325398, 1318386, 1312792, 1309537, 1308038, 1307060, 1305854, 1304479, 1303629, 1304301, 1307127, 1311809, 1317446, 1323375, 1329418, 1335473, 1341383, 1347224, 1353221, 1359335, 1365385, 1371596, 1378518, 1386210, 1393985, 1401269, 1408318, 1415718, 1423556, 1431583, 1439983, 1449326, 1459616, 1469833, 1478718, 1485689, 1490661, 1493321, 1493133, 1490025, 1484461, 1476711, 1466674, 1454748, 1442219, 1430184, 1418461, 1406302, 1393867, 1382221, 1371950, 1362735, 1354469, 1347900, 1343725, 1341617, 1340647, 1340269, 1340515, 1341676, 1344127]
52159A344127L983N175N499N150M540L421J405p99j811j407q62j077j395q14N52
52144A365687J902K857L361L108J938N42j44j40l17j052j606j020P60K956M940
52129A383772O916R536J2963J6556J9614K2178K4771K7492K9926L1903L3763L5640
52117A655030L7042L7448L6954L5997L4787L3306L1526K9366K6732K3949K1795
52106B003932K0675J9977J8717J6734J4735J3318J2350J1334R916P928N349K365
52094B157330p76m101p899j2175j6397j9991k2872k5240k6982k7690k7250k6059
$$ y = [1344127, 1348110, 1353285, 1358784, 1363934, 1368474, 1371895, 1373300, 1372501, 1370690, 1369283, 1368421, 1367344, 1365949, 1365135, 1365687, 1367589, 1370446, 1373807, 1376915, 1378853, 1379395, 1379251, 1379111, 1378794, 1377742, 1376136, 1375116, 1375876, 1378832, 1383772, 1390688, 1400224, 1413187, 1429743, 1449357, 1471535, 1496306, 1523798, 1553724, 1585627, 1619390, 1655030, 1692072, 1729520, 1766474, 1802471, 1837258, 1870564, 1902090, 1931456, 1958188, 1982137, 2003932, 2024607, 2044584, 2063301, 2080035, 2094770, 2108088, 2120438, 2131772, 2141688, 2149616, 2154965, 2157330, 2156554, 2152453, 2144554, 2132379, 2115982, 2095991, 2073119, 2047879, 2020897, 1993207, 1965957, 1939898]
$$ [...]
##END NTUPLES=NMR SPECTRUM
##END=
