##TITLE=AC1632_CEHAH_8493842_NxJCE5YjTH
##JCAMPDX= 6.0         $$ Bruker NMR JCAMP-DX V2.0
##DATA TYPE= NMR SPECTRUM
##DATA CLASS= NTUPLES
##ORIGIN= BRUKER
##OWNER= Administrator
$$ 1.72 TOPSPIN		Version 2.1
$$ 2014-02-18 17:30:12.380 -0800  Administrator@X
$$ Compression mode = diff/dup
##.OBSERVE FREQUENCY= 400.02188249412
##.OBSERVE NUCLEUS= ^1H
##.ACQUISITION MODE= SIMULTANEOUS (DQD)
##.ACQUISITION SCHEME= undefined
##.AVERAGES= 8
##.DIGITISER RES= 22
##SPECTROMETER/DATA SYSTEM= spect
##.PULSE SEQUENCE= zg30
##.SOLVENT NAME= COFFEE_meoh
##.SHIFT REFERENCE= INTERNAL, COFFEE_meoh, 1, 14.98509
##AUDIT TRAIL= $$ (NUMBER, WHEN, WHO, WHERE, PROCESS, VERSION, WHAT)
$$ ##TITLE= Audit trail, TOPSPIN		Version 2.1
$$ ##JCAMPDX= 5.01
$$ ##ORIGIN= Bruker BioSpin GmbH
$$ ##OWNER= Administrator
$$ $$ E:\/data/COFFEE/nmr/AC1632_CEHAH_8493842_NxJCE5YjTH/10/pdata/1/auditp.txt
$$ ##AUDIT TRAIL=  $$ (NUMBER, WHEN, WHO, WHERE, PROCESS, VERSION, WHAT)
(   1,<2014-02-18 17:30:05.895 -0800>,<Administrator>,<X>,<go>,<TOPSPIN 2.1>,
      <created by zg
	started at 2014-02-18 17:28:59.864 -0800,
	POWCHK enabled, PULCHK disabled,
       configuration hash MD5:
       C8 4E 4E 5D D3 5C D8 9E 9F 52 82 E0 59 8A DE 15
       data hash MD5: 64K
       8B 35 10 DF 8E FF D9 8D ED A5 66 7B F4 06 8E C7>)
(   2,<2014-02-18 17:30:08.676 -0800>,<Administrator>,<X>,<proc1d>,<TOPSPIN 2.1>,
      <Start of raw data processing
       efp LB = 0 FT_mod = 6 PKNL = 1 PHC0 = 0 PHC1 = 0 SI = 32K 
       data hash MD5: 32K
       13 E5 5B 2B 21 68 25 33 35 28 7A 0B C8 42 D1 0A>)
(   3,<2014-02-18 17:30:08.973 -0800>,<Administrator>,<X>,<proc1d>,<TOPSPIN 2.1>,
      <pk PHC0 = 94.2572 PHC1 = 0 
       data hash MD5: 32K
       BC D2 00 68 A0 ED 4F C3 9E E5 E7 7E D7 61 33 41>)
(   4,<2014-02-18 17:30:09.067 -0800>,<Administrator>,<X>,<proc1d>,<TOPSPIN 2.1>,
      <abs ABSG = 1 
       data hash MD5: 32K
       BC 44 E2 69 A9 F8 07 61 9B 05 87 9A 18 97 34 43>)
(   5,<2014-02-18 17:30:09.145 -0800>,<Administrator>,<X>,<proc1d>,<TOPSPIN 2.1>,
      <abs ABSG = 2 
       data hash MD5: 32K
       26 25 8D 01 95 FF 03 0A 6E FE 91 27 C2 8D 5D 5B>)
(   6,<2014-02-18 17:30:09.192 -0800>,<Administrator>,<X>,<proc1d>,<TOPSPIN 2.1>,
      <abs ABSG = 3 
       data hash MD5: 32K
       8D 69 91 F5 F9 3D BB 19 B1 98 15 1B 38 20 15 7D>)
(   7,<2014-02-18 17:30:09.239 -0800>,<Administrator>,<X>,<proc1d>,<TOPSPIN 2.1>,
      <abs ABSG = 4 
       data hash MD5: 32K
       DF 3E A4 EA 49 12 DE BD 50 68 66 E3 F9 98 ED 7B>)
(   8,<2014-02-18 17:30:09.301 -0800>,<Administrator>,<X>,<proc1d>,<TOPSPIN 2.1>,
      <abs ABSG = 5 
       data hash MD5: 32K
       64 AA 7C B5 B5 E7 56 40 6D 6A 12 C2 F2 12 1B D7>)
$$ ##END=
$$ 
$$ $$ hash MD5
$$ $$ 04 D0 C7 7D 4A 1B 5A 90 5A 40 48 6B 3F 00 73 20
##$RELAX= 
##$RELAX= 
##$RELAX= 
##$RELAX= 
##$RELAX= 
##$RELAX= 
##$RELAX= 
$$ Bruker specific parameters
$$ --------------------------
##$DU= <E:\>
##$EXPNO= 10
##$NAME= <AC1632_CEHAH_8493842_NxJCE5YjTH>
##$PROCNO= 1
$$ [...]
150 150 150 150 150 150 150 150
##$TP07= 0
##$TPNAME0= <>
##$TPNAME1= <>
##$TPNAME2= <>
##$TPNAME3= <>
##$TPNAME4= <>
##$TPNAME5= <>
##$TPNAME6= <>
##$TPNAME7= <>
##$TPOAL= (0..7)
0.5 0.5 0.5 0.5 0.5 0.5 0.5 0.5
##$TPOFFS= (0..7)
0 0 0 0 0 0 0 0
##$TUNHIN= 0
##$TUNHOUT= 0
##$TUNXOUT= 0
##$USERA1= <user>
##$USERA2= <user>
##$USERA3= <user>
##$USERA4= <user>
##$USERA5= <user>
##$V9= 5
##$VALIST= <valist>
##$VCLIST= <CCCCCCCCCCCCCCC>
##$VD= 0
##$VDLIST= <DDDDDDDDDDDDDDD>
##$VPLIST= <PPPPPPPPPPPPPPP>
##$VTLIST= <TTTTTTTTTTTTTTT>
##$WBST= 2048
##$WBSW= 25
##$XGAIN= (0..3)
0 0 0 0
##$XL= 0
##$YL= 0
##$YMAX_a= 588768
##$YMIN_a= -500064
##$ZGOPTNS= <>
##$ZL1= 120
##$ZL2= 120
##$ZL3= 120
##$ZL4= 120
##$ABSF1= 14.98509
##$ABSF2= -5.573092
##$ABSG= 5
##$ABSL= 3
##$ALPHA= 0
##$AQORDER= 0
##$ASSFAC= 0
##$ASSFACI= 0
##$ASSFACX= 0
##$ASSWID= 0
##$AUNMP= <proc_prof1d_extract_pilot.lims>
##$AXLEFT= 0
##$AXNAME= <>
##$AXNUC= <1H>
##$AXRIGHT= 0
##$AXTYPE= 0
##$AXUNIT= <>
##$AZFE= 0.1
##$AZFW= 0.1
##$BCFW= 0
##$BC_mod= 0
##$BYTORDP= 0
##$COROFFS= 0
##$CY= 15
##$DATMOD= 1
##$DC= 0
##$DFILT= <>
##$DTYPP= 0
##$F1P= 0
##$F2P= 0
##$FCOR= 0.5
##$FTSIZE= 32768
##$FT_mod= 6
##$GAMMA= 0
##$GB= 0
##$INTBC= 1
##$INTSCL= 1
##$ISEN= 128
##$LB= 0
##$LEV0= 0
##$LPBIN= 0
##$MAXI= 10000
##$MC2= 0
##$MEAN= 0
##$ME_mod= 0
##$MI= 0
##$NCOEF= 0
##$NC_proc= -8
##$NLEV= 6
##$NOISF1= 0
##$NOISF2= 0
##$NSP= 0
##$NTH_PI= 0
##$NZP= 0
##$OFFSET= 14.98509
##$PC= 1
##$PHC0= 94.2572
##$PHC1= 0
##$PH_mod= 1
##$PKNL= yes
##$PPARMOD= 0
##$PPDIAG= 0
##$PPIPTYP= 0
##$PPMPNUM= 2147483647
##$PPRESOL= 1
##$PSCAL= 4
##$PSIGN= 0
##$PYNMP= <proc.py>
##$REVERSE= no
##$SF= 400.02
##$SI= 32768
##$SIGF1= 0
##$SIGF2= 0
##$SINO= 400
##$SIOLD= 32768
##$SPECTYP= <>
##$SREGLST= <1H.CDCl3>
##$SSB= 0
##$STSI= 32768
##$STSR= 0
##$SW_p= 8223.68421052631
##$SYMM= 0
##$S_DEV= 0
##$TDeff= 65536
##$TDoff= 0
##$TI= <>
##$TILT= no
##$TM1= 0
##$TM2= 0
##$TOPLEV= 0
##$USERP1= <user>
##$USERP2= <user>
##$USERP3= <user>
##$USERP4= <user>
##$USERP5= <user>
##$WDW= 1
##$XDIM= 32768
##$YMAX_p= 432174863
##$YMIN_p= -712550
##$CURPLOT= <Network HP LaserJet P1505>
##$CURPRIN= <$Network HP LaserJet P1505>
##$DFORMAT= <normdp>
##$LAYOUT= <+/1D_H.xwp>
##$LFORMAT= <normlp>
##$PFORMAT= <normpl>
##$SURQMSG= 1
$$ End of Bruker specific parameters
$$ ---------------------------------
##NTUPLES= NMR SPECTRUM
##VAR_NAME=  FREQUENCY,     SPECTRUM/REAL,   SPECTRUM/IMAG
##SYMBOL=    X,             R,               I
##VAR_TYPE=  INDEPENDENT,   DEPENDENT,       DEPENDENT
##VAR_FORM=  AFFN,          ASDF,            ASDF
##VAR_DIM=   32768,         32768,           32768
##UNITS=     HZ,            ARBITRARY UNITS, ARBITRARY UNITS
##FACTOR=    0.250966925370066, 1,           1
##FIRST=     8223.43324360094, 6119,         -147885
##LAST=      0,             46513,           -97556
##MIN=       0,             -712550,         0
##MAX=       8223.43324360094, 432174863,    0
$$ Real data points
##PAGE= N=1
##DATA TABLE= (X++(R..R)), XYDATA
$$ [...]
19573b52254n1335C6516c12420B06826K73774j52197c46923a53655G4193K2652
$$ -252254 -303589 36516 -312420 206826 480600 328403 -346923 -153655 74193 96845
19563I6845E718b12075B76775c80180B4959b20929a0977l33444A32498b9488H108
$$ 96845 5718 -212075 276775 -380180 24959 -220929 -10977 -344421 132498 -29488 8108
19551b66612J00959e808o4156K6702R929j05496A66980J3180k4191m8240R1680
$$ -266612 -165653 -5808 -69964 -43262 -33333 -138829 166980 180160 155969 107729 199409
19540A99409J2731B7398b13170k6070a01441j10049B13010a33387J0761G0098
$$ 199409 212140 27398 -213170 -239240 -101441 -211490 213010 -133387 -122626 70098
19529b27956Q2664p7928B4548O5673a10204j95960J46670c4821j0665j47546g9371
$$ -227956 -145292 -223220 24548 90221 -110204 -306164 -159494 -34821 -45486 -193032 -79371
19517d7644D5810h6281l2315m4051P3365E8210R5419a67749G8828J0731b62166
$$ -47644 45810 -86281 -118596 -162647 -89282 58210 153629 -167749 78828 89559 -262166
19505f3235n4794p679B10623d41802a69296E5244D175a63015k58954C67727a25528
$$ -63235 -118029 -125708 210623 -441802 -169296 55244 4175 -163015 -421969 367727 -125528
19493a38367d5234m20773F4342a57675F1916a60389D99J61916E5927J0371A8379
$$ -138367 -45234 -466007 64342 -157675 61916 -160389 499 162415 55927 66298 18379
19481A58040a65044H9350c4510H4520b63579J5902g2549K7422m4406d0359F9781
$$ 158040 -165044 89350 -34510 84520 -263579 -247677 -72549 -45127 -89533 -40359 69781
19469b6424A66567b8393l25391H0625b5454l41304P9977A82584c70037J16664
$$ -26424 166567 -28393 -353784 80625 -25454 -366758 -286781 182584 -370037 -253373
19459b53373a16033k24160B6121f3267k9645E3892b0400B22177p6582a15617A45828
$$ -253373 -116033 -340193 26121 -63267 -92912 53892 -20400 222177 145595 -115617 145828
19447A75880H64d1089D6569C688J16794a63403N8563B13079a91718A27752d12056
$$ 175880 864 -41089 46569 3688 120482 -163403 -104840 213079 -191718 127752 -412056
19435a57283E6223K74887B2416a09058k01037C2974J5387K2361a27544K8644C5447
$$ -157283 56223 331110 22416 -109058 -310095 32974 48361 70722 -127544 -98900 35447
19423a98146A41949E1878a65162m43004b41003D0579g6902A9599J558b34029E3075
$$ -198146 141949 51878 -165162 -608166 -241003 40579 -76902 19599 21157 -234029 53075
19411a94785A4089e9910H692a39460B4943a34568j18838G5195P575J59738a45613
$$ -194785 14089 -59910 8692 -139460 24943 -134568 -253406 75195 82770 242508 -145613
19399A40790a9096k17414n586L8004A19486J07933C4370N6169b3691A39550H132
$$ 140790 -19096 -236510 -242096 -204092 119486 227419 34370 90539 -23691 139550 8132
19387a7862B9187d6424A35168h746j40064k38863e4180A90192a96031C9786i0277
$$ -17862 29187 -46424 135168 -8746 -148810 -387673 -54180 190192 -196031 39786 -90277
19375A52129c29110B8231d16795i2760H8176b20924L5182J9554H4737M8006e5894
$$ 152129 -329110 28231 -416795 -92760 88176 -220924 -185742 -166188 84737 132743 -55894
19363a36105B9228j4127O9423i0019d1474p1010m4521j0449A20309b60775A94243
$$ -136105 29228 15101 84524 -90019 -41474 -112484 -157005 -167454 120309 -260775 194243
19351e65232a47940A64350i7286j07013G9476k8727J58873b99456B31169e40975
$$ -565232 -147940 164350 -97286 -204299 79476 50749 209622 -299456 231169 -540975
19340d53752b07352C2379g4854j53649j0030J16061k76225J72346e6661A53273
$$ -453752 -207352 32379 -74854 -228503 -238533 -122472 -398697 -226351 -56661 153273
19329b78121P8079B72201H4360a4621j46736N6513a0150j69816A67721R1014c03280
$$ -278121 -200042 272201 84360 -14621 -161357 -104844 -10150 -179966 167721 258735 -303280
19317c11051a04000j00894G449c37737a18364J2129n0311l7071a3918j66606A90747
$$ -311051 -104000 -204894 7449 -337737 -118364 -106235 -156546 -193617 -13918 -180524 190747
19305g0850k76179e4881A07741Q6013E469b11939O2730b2291B0143a80495j49911
$$ -70850 -347029 -54881 107741 193754 5469 -211939 -149209 -22291 20143 -180495 -330406
19294c30406J47478d2320j70670g932p9955r116I3943d1354k1456J6956j99295
$$ -330406 -182928 -42320 -212990 -7932 -87887 -97003 93943 -41354 -62810 -45854 -245149
19283b45149B34196B2335a71753r3014a21593j53929E0994b29982N9829E9845
$$ -245149 234196 22335 -171753 -264767 -121593 -275522 50994 -229982 -170153 59845
19272b98994c3658A70824J9832m8761i6863k23116R9842G0066c98750a94818k36741
$$ -298994 -33658 170824 190656 141895 -96863 -319979 -220137 70066 -398750 -194818 -431559
19261d31559L5398f8670k4825j81679f1025o6666b6730l35496a0463k57970A32097
$$ -431559 -396161 -68670 -93495 -275174 -61025 -127691 -26730 -362226 -10463 -268433 132097
19249a83654A50977G4968c54330j5724d8913k77221A6670b12654G6027b12781
$$ -183654 150977 74968 -354330 -370054 -48913 -326134 16670 -212654 76027 -212781
19238A61863a98185A72928b69740a03874I1235d8175B79025b07798D2339r464
$$ 161863 -198185 172928 -269740 -103874 91235 -48175 279025 -207798 42339 32875
19228C2875J923a29241B50037e1095a1755n1018D83132e9495I0769d4813j31555
$$ 32875 34798 -129241 250037 -51095 -11755 -62773 483132 -59495 90769 -44813 -176368
19217a76368H4333l7840b36096B1311i7061j35461c2278k3821p6393A31908b81206
$$ -176368 84333 46493 -236096 21311 -97061 -232522 -32278 -56099 -132492 131908 -281206
19205a2764k81154g7933r3486E14843a01655C0a9244p7705j26731N2953A51358
$$ -12764 -293918 -77933 -171419 514843 -101655 30 -19244 -96949 -223680 -170727 151358
19193a45191J8733b1711j32218g0773E7260C246J28679P8032a41352A25849C2008
$$ -145191 -126458 -21711 -153929 -70773 57260 3246 131925 209957 -141352 125849 32008
19181b07063L5666d7381j38832f8461j63371l5323I782J2238a82907A17311e5856
$$ -207063 -171397 -47381 -186213 -68461 -231832 -267155 9782 22020 -182907 117311 -55856
19169C8670N799b23299b774l45981g7194B72270B9327a2052n3424k10656P1867
$$ 38670 44469 -223299 -2774 -348755 -77194 272270 29327 -12052 -65476 -276132 -204265
19158b04265A65536p3393k7667a26680J3491C14754a43872j5154h060j60054K5071
$$ -204265 165536 92143 64476 -126680 -113189 314754 -143872 -159026 -8060 -168114 -143043
19147a43043c9497A0853g12550K71393B5040b79734A00881k0255b22248C2750
$$ -143043 -39497 10853 -712550 -441157 25040 -279734 100881 80626 -222248 32750
19136A32103b00924A92319b90502J28847d6578A9687c53499G856K1644b66617
$$ 132103 -200924 192319 -290502 -161655 -46578 19687 -353499 7856 29500 -266617
19125F662P990g4441C2021P396a6235r5562c9697I6498K82939d09995c5680A12365
$$ 6662 14652 -74441 32021 39417 -16235 -111797 -39697 96498 379437 -409995 -35680 112365
19112i794j73520N2786j68436B1307f7342A23174l2091L0549d7442l09748A18216
$$ -9794 -183314 -130528 -298964 21307 -67342 123174 91083 121632 -47442 -357190 118216
19100b25372a11742D8651a88823C21686i9281n3830b271j26339c2628l28311a04912
$$ -225372 -111742 48651 -188823 321686 -99281 -153111 -2271 -128610 -32628 -360939 -104912
19088d403m56782b15785a00059A84151a23301m5009a0357B6933M2366b9887A6716
$$ -4403 -461185 -215785 -100059 184151 -123301 -168310 -10357 26933 69299 -29887 16716
19076a42463N7025E8054a24404r3964P0088c7797B73984h9086I3606K02386b44461
$$ -142463 -85438 58054 -124404 -218368 -148280 -37797 273984 -89086 93606 295992 -244461
19064c51989c7453a24A2437f05080g2651C02575b96309e4839j34879Q4953j45733
$$ -351989 -37453 -124 12437 -605080 -72651 302575 -296309 -54839 -189718 -104765 -250498
19053b50498A74180a83799D6527P3397a36748A68766c09506a15668H8263a31143
$$ -250498 174180 -183799 46527 119924 -136748 168766 -309506 -115668 88263 -131143
19042e4367H4845O6074h0283a8839A43564d1599F5152f9645E9509a25558e571
$$ -54367 84845 150919 -80283 -18839 143564 -41599 65152 -69645 59509 -125558 -5571
19030f5986A31905K37446b47261i3831I6764A3313L02347E2159J91615j11191
$$ -65986 131905 369351 -247261 -93831 96764 13313 315660 52159 243774 132583
19020A32583J16474p5952b32099A04270a70530J5407O526o2130A02506L0837L9312
$$ 132583 249057 173105 -232099 104270 -170530 -155123 -148597 -210727 102506 133343 172655
19009A72655G8874a03113K5353D02573A47175e4587k6048b6809k68868d9388A32994
$$ 172655 78874 -103113 -77760 402573 147175 -54587 -80635 -26809 -295677 -49388 132994
18997A28517a9525j03676q2108B55755e6529B3615b11644A59678l7479B4263K1406
$$ 128517 -19525 -123201 -205309 255755 -56529 23615 -211644 159678 122199 24263 45669
18986D5669c25216G5201a32074n6924C3114g4273k23682l7610e869A90988d81405
$$ 45669 -325216 75201 -132074 -188998 33114 -74273 -297955 -335565 -5869 190988 -481405
18974g9837j8144C4411a4822F9434J9148L0846c72059A50692d65648A6580R3877
$$ -79837 -97981 34411 -14822 69434 88582 119428 -372059 150692 -465648 16580 110457
18963A10457E2163a99334I31f6433B04704G3852P8152K235b68550q9081J4524
$$ 110457 52163 -199334 931 -66433 204704 73852 152004 154239 -268550 -357631 -343107
18952c43107G8232I931i0501j4395m8598j7688H885K00230a34882e0036j15366
$$ -343107 78232 9931 -90501 -104896 -153494 -171182 8885 209115 -134882 -50036 -165402
18941a65402B2666R3085k8227L5170b1911B17217c89375A6078c5183j92151A78436
$$ -165402 22666 115751 87524 122694 -21911 217217 -389375 16078 -35183 -227334 178436
18929f6029l8609c7752m2810L6772J7014j83352A0157a19716F299a46495A55229
$$ -66029 -104638 -37752 -80562 -43790 -26776 -210128 10157 -119716 6299 -146495 155229
18917a41621B0055d51997c8845A95492e7045A17695O0437j6084l9548a6158D64701
$$ -141621 20055 -451997 -38845 195492 -57045 117695 178132 162048 122500 -16158 464701
18905A5609J13549e173m25910c261E957a73668A5114a01696E1431a55099A88290
$$ 15609 129158 -5173 -431083 -3261 5957 -173668 15114 -101696 51431 -155099 188290
18893C11068p2935G9107M1635b29147A53692a13408D3940d8801k36150a38673
$$ 311068 238133 79107 120742 -229147 153692 -113408 43940 -48801 -284951 -138673
18882a58765j29020B07939l2385d86947g5961C64302g8442B47011a55728k03796
$$ -158765 -287785 207939 175554 -486947 -75961 364302 -78442 247011 -155728 -359524
18872c59524C3017a66254A76986J74705c8927k0483j71716b1593j11128K2950
$$ -359524 33017 -166254 176986 351691 -38927 -59410 -231126 -21593 -132721 -109771
18862a09771j79719J38035r0365R3576H3095a37340p3771i4143d6071K1355H0488
$$ -109771 -289490 -151455 -241820 -148244 83095 -137340 -211111 -94143 -46071 -24716 80488
18850C7645K5825N4739g8495A54713b50912f9393B60013I152h8227c8878A5578
$$ 37645 63470 118209 -78495 154713 -250912 -69393 260013 9152 -88227 -38878 15578
18838D5288g768G5441J54770b99449b4471A10807A7083a3444j84869h4855q2507
$$ 45288 -7768 75441 230211 -299449 -24471 110807 17083 -13444 -198313 -84855 -167362
18827a67362c8418l67133J89305F9857J9598a19392m69674a4281I8658a40963
$$ -167362 -38418 -405551 -216246 69857 89455 -119392 -589066 -14281 98658 -140963
18816A45241a9619A11965K1783F4417k7517i0724A7185J39047K0798i6035A12824
$$ 145241 -19619 111965 133748 64417 36900 -90724 17185 156232 177030 -96035 112824
18804F3596b08344f0663m876K9122j5158A15185a58998I3453a54075d4715o5823
$$ 63596 -208344 -60663 -65539 -36417 -51575 115185 -158998 93453 -154075 -44715 -110538
18793a10538M4173p2132c0875m09801A42527A2990a89987j43865b963k31375j43026
$$ -110538 -66365 -138497 -30875 -440676 142527 12990 -189987 -333852 -2963 -234338 -377364
18782c77364C9269q058d735F4296O4299c05337h5104D8710a1970l28047c7289
$$ -377364 39269 31211 -4735 64296 128595 -305337 -85104 48710 -11970 -340017 -37289
18770b10447p4887c5682A51050f5934C90179j88857G376J16547b56805f2534I881
$$ -210447 -285334 -35682 151050 -65934 390179 201322 7376 123923 -256805 -62534 9881
18758B32276a69048H7826J70992R3385h7973c3426j22117J205C659a54443k9476
$$ 232276 -169048 87826 258818 352203 -87973 -33426 -155543 -154338 3659 -154443 -183919
18747a83919g6677j77356B744d0766k51105a26518E1629c64693Q5558c6285j78328
$$ -183919 -76677 -254033 2744 -40766 -291871 -126518 51629 -364693 -279135 -36285 -214613
18736b14613D9248e2093j08057H2873b05911R8886A9935b1566j20956L9780j37302
$$ -214613 49248 -52093 -160150 82873 -205911 -107025 19935 -21566 -142522 -102742 -240044
18725b40044D0974a48602f7603r194C6270J99187M5600C6346b09296B55223a35596
$$ -240044 40974 -148602 -67603 -76797 36270 235457 281057 36346 -209296 255223 -135596
18713f3920G3964b33088j30157e604n0689k11670r886P9176A51636k8139f61488
$$ -63920 73964 -233088 -363245 -5604 -56293 -267963 -277849 -198673 151636 123497 -661488
18701b50077O7637j58251A86529O1815B1947g130k81692g6543j51716C94868b8379
$$ -250077 -182440 -340691 186529 248344 21947 -7130 -288822 -76543 -228259 394868 -28379
18689a48628A58919K0119a39471A48645a50264D3263a52613A06303a38124N9630
$$ -148628 158919 179038 -139471 148645 -150264 43263 -152613 106303 -138124 -78494
18679g8494L1914o1621R015p350J3836c0958H7794M6117b43094a01960o5196O9631
$$ -78494 -46580 -108201 -99186 -106536 -92700 -30958 87794 133911 -243094 -101960 -167156 -97525
18667i7525A328K37983P3e9310q9253m4541m3261J18155C47309c84670B578e9216
$$ -97525 1328 239311 239384 -59310 -148563 -193104 -236365 -118210 347309 -384670 2578 -59216
18654c02482P5275F3759a59947r3661a22034A00190b35836A86585C6257b42463
$$ -302482 -227207 63759 -159947 -253608 -122034 100190 -235836 186585 36257 -242463
18643A64610a25764N3263H8058c46780O668J66519j5162A6410M5574g2229A64365
$$ 164610 -125764 -72501 88058 -346780 -340112 -173593 -188755 16410 61984 -72229 164365
18631a02247J1557D745b69186a11910e5549j20004H3049b72709F7478c3977m2011
$$ -102247 -90690 4745 -269186 -111910 -55549 -175553 83049 -272709 67478 -33977 -75988
18620g5988l2548E711a71426g1234j0021j3732D0004h2651B0478J4066r331O8057
$$ -75988 -108536 5711 -171426 -71234 -81255 -94987 40004 -82651 20478 34544 25213 93270
18608I3270D6060N2018M3387h5847p4694A81860a91136o0581j21802B54326a67631
$$ 93270 46060 98078 141465 -85847 -160541 181860 -191136 -251717 -373519 254326 -167631
18596i5364A49110K3730a2337B06445g9669A21028b8022C5891k519b2745j95812
$$ -95364 149110 172840 -12337 206445 -79669 121028 -28022 35891 33372 -22745 -218557
18585b18557A14884a9868F4543a53890f4497A12644h0122c23l26809b4450k00898
$$ -218557 114884 -19868 64543 -153890 -64497 112644 -80122 -323 -327132 -24450 -225348
18574b25348I6094L8598h5079A55469c74751A79561G9508K34137A47176m0383
$$ -225348 96094 134692 -85079 155469 -374751 179561 79508 313645 147176 106793
18564A06793b43059i3036n7799g3658J8278k270j78630C68511A6426b17085K5388
$$ 106793 -243059 -93036 -150835 -73658 -55380 -57650 -236280 368511 16426 -217085 -191697
18553a91697g6133j6460A28602a55702F9837J1742R750a79971N3441l37060C09377
$$ -191697 -76133 -92593 128602 -155702 69837 81579 91329 -179971 -126530 -463590 309377
18541B24935c31504J47293F3625L9623g3783j77288N5570b4792k83154A7829j185
$$ 224935 -331504 -184211 63625 103248 -73783 -251071 -195501 -24792 -307946 17829 16644
18530A6644a48482A78718e9124E0938l99d2350C9079a15861j45076K5485b7366
$$ 16644 -148482 178718 -59124 50938 50539 -42350 39079 -115861 -260937 -235452 -27366
18518i4380j19682n9696B9918c82360a61129B5008a23326k41008a37875K7899
$$ -94380 -214062 -273758 29918 -382360 -161129 25008 -123326 -364334 -137875 -109976
18508a09976a0150r5015B15052h5945q1984j7923B37160a5534j4987I7614c90577
$$ -109976 -10150 -105165 215052 -85945 -167929 -185852 237160 -15534 -30521 97614 -390577
18496a10231a8159A50754b22546P2303e0530l49282E9429b75155E6751b28559
$$ -110231 -18159 150754 -222546 -150243 -50530 -399812 59429 -275155 56751 -228559
18485a87394D59034c69177B7805M1638b02658a0274F5888k7673g2765G0443K38153
$$ -187394 459034 -369177 27805 69443 -202658 -10274 65888 38215 -72765 70443 308596
18474C08596B5520K1945a54635A63048C1154b7925k02123B26823H9494j3756b39394
$$ 308596 25520 47465 -154635 163048 31154 -27925 -230048 226823 89494 75738 -239394
18462e2684k72534a31980C5841R1907b90199c4039j26683j87271B12078C7554
$$ -52684 -325218 -131980 35841 127748 -290199 -34039 -160722 -347993 212078 37554
18451a18838B6770J68226h6029m0266I8434K3534K11574i7844A46458C7084a35958
$$ -118838 26770 194996 -86029 -126295 98434 121968 333542 -97844 146458 37084 -135958
18439a10098j96035J24555i0450B42986c66967g5970b9255m27453A159b80172
$$ -110098 -306133 -181578 -90450 242986 -366967 -75970 -29255 -456708 1159 -280172
18428d0250j88629B9790j1350d91178a14606L0537j30581D7348a82237c9215k89766
$$ -40250 -228879 29790 18440 -491178 -114606 -84069 -214650 47348 -182237 -39215 -328981
18417c28981J19262B05852a48323L8691j16334B0251J33190b86293A98982d33406
$$ -328981 -209719 205852 -148323 -109632 -225966 20251 153441 -286293 198982 -433406
18406B29401C4207c40786E5637b09027C11990j02500h0004n5583b7404B62927
$$ 229401 34207 -340786 55637 -209027 311990 209490 -80004 -135587 -27404 262927
18395b60469i5351m1088H0610b34893Q638i3400a634l9396G6157k2746j7395K38454
$$ -260469 -95351 -136439 80610 -234893 -226255 -93400 -1634 -41030 76157 53411 36016 274470
18383B74470K89011d3726J0441j3591o0983A06006m3067g6959H7850f8647j755
$$ 274470 563481 -43726 -33285 -46876 -107859 106006 62939 -76959 87850 -68647 -70402
18372g0402A46460b34670d8348G1026c1371p7645l874B40014E9493J83542A15265
$$ -70402 146460 -234670 -48348 71026 -31371 -109016 -112890 240014 59493 243035 115265
18360a13661j16083A77175J1870a49378A8054a08395A64805D2980a0708A34192
$$ -113661 -229744 177175 189045 -149378 18054 -108395 164805 42980 -10708 134192
18349a7456B39281j14334b18702J1271h0229D3272c3757q4087E7420M07587f0271
$$ -17456 239281 124947 -218702 -207431 -80229 43272 -33757 -117844 57420 465007 -60271
18337A05989a42232D319J53671a26720J363A96752b44089m9796j22191A73425
$$ 105989 -142232 4319 157990 -126720 -125357 196752 -244089 -293885 -416076 173425
18326E6685e8575J7695C01294d6294j61098a7381A02699h0021l067m5666L682
$$ 56685 -58575 -40880 301294 -46294 -207392 -17381 102699 -80021 -83088 -128754 -125072
18315a25072A29845c6967I1327a23979B13006c11962L4245A13101o994O0164a5468
$$ -125072 129845 -36967 91327 -123979 213006 -311962 -277717 113101 106107 166271 -15468
18303a63598B75333a10766l7360f3118J8983F3628a75852A34985a25921C516F06
$$ -163598 275333 -110766 -148126 -63118 -44135 63628 -175852 134985 -125921 3516 606
18291B76735d4513j14622E4432O9286R3875A03645a78691c6880G6899a31589d4916
$$ 276735 -44513 -159135 54432 123718 217593 103645 -178691 -36880 76899 -131589 -44916
18279a7592A30401b01730A3734a75773Q2434A51352c24969d6255j84616q4383
$$ -17592 130401 -201730 13734 -175773 -93339 151352 -324969 -46255 -230871 -315254
18269c15254B15070G5576a94779A35858a54824O8115J8314k60016J525N1850A62218
$$ -315254 215070 75576 -194779 135858 -154824 -86709 -68395 -328411 -326886 -275036 162218
18257c20477C7370b01353B0294a25500G7430b15400n7895B44383C9447h6674c0788
$$ -320477 37370 -201353 20294 -125500 77430 -215400 -273295 244383 39447 -86674 -30788
18245b82893M8990A16854l0523J13155a17936A89476a9236j26120N0563l7085
$$ -282893 -233903 116854 86331 199486 -117936 189476 -19236 -145356 -94793 -131878
18235a31878L5502n6892f0257k23306M789A77506c20676g136k51207J05486k928
$$ -131878 -96376 -153268 -60257 -283563 -278774 177506 -320676 -7136 -258343 -152857 -155785
18224a55785j7701c6252p6994A50306a96260B69253j10840A2900f7739j2414j69313
$$ -155785 -173486 -36252 -113246 150306 -196260 269253 158413 12900 -67739 -80153 -249466
18213b49466m7405D6739d8214A60826O7265D2872b31336g9968o2630a0976j20649
$$ -249466 -296871 46739 -48214 160826 228091 42872 -231336 -79968 -142598 -10976 -131625
18202a31625B72483i5715c3626j69024a8812H3521N1607e6387j27850A26952J42891
$$ -131625 272483 -95715 -33626 -202650 -18812 83521 135128 -56387 -184237 126952 269843
18191B69843c00356a36116I1574c01654g3388j1561D0573J9877K1040O106K22866
$$ 269843 -300356 -136116 91574 -301654 -73388 -84949 40573 60450 81490 87596 310462
18180C10462A37250K3143b95455c1587o696B40768i67A37142A9529L7464b74312
$$ 310462 137250 160393 -295455 -31587 -38283 240768 -967 137142 19529 56993 -274312
18168a18485p4939Q6661G3458h5669L9224a1751j51774O8769B61834a94423c1019
$$ -118485 -193424 -106763 73458 -85669 -46445 -11751 -163525 -94756 261834 -194423 -31019
18156c03409i0746O023F2705b56208B6886b40774e4185D3523J8934a66832j75820
$$ -303409 -90746 -84723 62705 -256208 26886 -240774 -54185 43523 62457 -166832 -342652
18145c42652A15749r60h3846j19148D8096k1511c17790B27537E314b19986P1497
$$ -342652 115749 114789 -83846 -202994 48096 26585 -317790 227537 5314 -219986 -148489
18134a48489A57198A2993a84589K3045m078A42759c5458A74396b19928a08892
$$ -148489 157198 12993 -184589 -161544 -165622 142759 -35458 174396 -219928 -108892
18123f4350k3239L951k38740E234J05482l5669L14976H1916C1357b66069P1260
$$ -64350 -87589 -83638 -322378 5234 110716 75047 390023 81916 31357 -266069 -194809
18112a94809C11602a26686A16832a84615f3012m0659p6492f2644B6847K10621
$$ -194809 311602 -126686 116832 -184615 -63012 -103671 -180163 -62644 26847 237468
18102B37468a49656M9380j385a9390l49737A5371J71929n0866K13716f6476q7531
$$ 237468 -149656 -100276 -101661 -19390 -369127 15371 187300 136434 350150 -66476 -154007
18091a54007c4912D4978r577b02601A42898m2132a5630C7042c8414j27278B5777
$$ -154007 -34912 44978 35401 -202601 142898 100766 -15630 37042 -38414 -165692 25777
18079A02824J63419l3467E3001M1931a83843I0117D3392a52574A76659G6244A5164
$$ 102824 266243 232776 53001 94932 -183843 90117 43392 -152574 176659 76244 15164
18067a36665A037c5905j41614A91419l224F70a03246B02241c48690A99014d25748
$$ -136665 1037 -35905 -177519 191419 188195 670 -103246 202241 -348690 199014 -425748
18055e8379O445B25569p8879K43398I1767h0957I2838a03929c5984A91751F9653
$$ -58379 -51934 225569 146690 390088 91767 -80957 92838 -103929 -35984 191751 69653
18043C7217c3411D5837c3250k95560a60767k5182P7257k29324a04642q8474F2717
$$ 37217 -33411 45837 -33250 -328810 -160767 -185949 -108692 -338016 -104642 -193116 62717
18031B02159c7681B547a22318p5163j21843R0554Q296G8114J56336a27559c3655
$$ 202159 -37681 2547 -122318 -197481 -319324 -228770 -220474 78114 234450 -127559 -33655
18019i73n5217D7230j6050a70370k08079C3029K18517o2915b99445B36627e8603
$$ -973 -56190 47230 31180 -170370 -378449 33029 251546 188631 -299445 236627 -58603
18007a02525A04919m9824B3888a42402A10511J19997F8274f7287I195J49507a92001
$$ -102525 104919 55095 23888 -142402 110511 230508 68274 -67287 9195 158702 -192001
17995h7364b8898p6422j3025M4045A64243O0639a37275a0082k3305j17340e0189
$$ -87364 -28898 -105320 -118345 -74300 164243 224882 -137275 -10082 -33387 -150727 -50189
17983c4137j16438O3795n463a9925j63184K2015b1605l2204F6351f2064j24625
$$ -34137 -150575 -86780 -92243 -19925 -183109 -161094 -21605 -53809 66351 -62064 -186689
17972a86689n8086B87304a95890K4168B62587b43148f4214C0224a17660n2786
$$ -186689 -244775 287304 -195890 -171722 262587 -243148 -64214 30224 -117660 -170446
17962a70446D4226i6014c5825j02683F3584J04059b57304A05883K12246q1131
$$ -170446 44226 -96014 -35825 -138508 63584 167643 -257304 105883 318129 236998
17952B36998b96931g0562B15647E6258b55764D2468f9679A32792K4954C8589M3159
$$ 236998 -296931 -70562 215647 56258 -255764 42468 -69679 132792 157746 38589 81748
17941H1748J87917O9176C2395K3871J69788g4495o3584I3733O875C2549h609A51229
$$ 81748 269665 338841 32395 56266 226054 -74495 -138079 93733 100608 32549 -8609 151229
17928b99147O3483a6058G5404M7976m0119J0107a57244I0501b57746C7368E215
$$ -299147 -235664 -16058 75404 123380 83261 93368 -157244 90501 -257746 37368 5215
17916G87J86035e1509H6033c4296n6899q5020A36569d717j63230j28500b469p4100
$$ 787 186822 -51509 86033 -34296 -91195 -176215 136569 -4717 -167947 -296447 -2469 -76569
17904g6569r3524c6077j298A1919N5735L83861D5144J0334K61461A24734C2J5902
$$ -76569 -170093 -36077 -37375 11919 67654 451515 45144 55478 316939 124734 32 15934
17892A5934b01741i3386J0m6129q5782C15052a46790B38141g3778l54255E9812
$$ 15934 -201741 -93386 -93376 -139505 -225287 315052 -146790 238141 -73778 -428033 59812
17880C45606b92610i8334j2891A67995p1785b24885l2039Q4748B01548j00586
$$ 345606 -292610 -98334 -111225 167995 96210 -224885 -256924 -172176 201548 100962
17870A00962e85480G874J05548a72559f3627A80225B3570N9638l6077a52871j81447
$$ 100962 -585480 7874 113422 -172559 -63627 180225 23570 83208 47131 -152871 -334318
17859c34318A10543b41177a10530k4443a7221m0750p2746j89352N0579m8580a9864
$$ -334318 110543 -241177 -110530 -134973 -17221 -57971 -130717 -320069 -269490 -318070 -19864
17847b44591E48583b3871E7109K958g1513HJ44427h3335A88241g2055A3064c6330
$$ -244591 548583 -23871 57109 60067 -71513 8 144435 -83335 188241 -72055 13064 -36330
17834c10416A45422a23525K4702k06618E5420a38929B1495O5334a05697j49041
$$ -310416 145422 -123525 -98823 -305441 55420 -138929 21495 86829 -105697 -254738
17824b54738A59016K3271C0845K5139a41596j09077M2093A28239J890a37018p7368
$$ -254738 159016 182287 30845 55984 -141596 -250673 -208580 128239 130129 -137018 -214386
17813b14386K5614c4210C7728J77040b8161f175k02118h8720B62590q0451o3744
$$ -214386 -188772 -34210 37728 214768 -28161 -6175 -208293 -88720 262590 182139 118395
17802A18395a20913n4854C40939A49042c7279A01609f1087K1631j17524n911F8454
$$ 118395 -120913 -175767 340939 149042 -37279 101609 -61087 -39456 -156980 -162891 68454
17790b38602a2787B83703a00644A78682b87718C57145b78306A82561j9988b7994
$$ -238602 -12787 283703 -100644 178682 -287718 357145 -278306 182561 162573 -27994
17779a84419F4057b258E7896g1454p2557k90317e7896n1342C4634h2267B17812
$$ -184419 64057 -2258 57896 -71454 -144011 -434328 -57896 -109238 34634 -82267 217812
17767a16394a7103Q017q7793A1011a85586D3375J31410n8859c59083a76656E5849
$$ -116394 -17103 -9086 -96879 11011 -185586 43375 174785 115926 -359083 -176656 55849
17755a03359D218i7156A28753f0687i690G1147c38130H8558a52938A21604a5946
$$ -103359 4218 -97156 128753 -60687 -9690 71147 -338130 88558 -152938 121604 -15946
17743a06055q9694B52781q2127b65994C17509D9861L75481D3324a76435h4816
$$ -106055 -195749 252781 170654 -265994 317509 49861 425342 43324 -176435 -84816
17732a80621C52219A07196b43089G6829d29635d942B70556a61628B29968I7523
$$ -180621 352219 107196 -243089 76829 -429635 -4942 270556 -161628 229968 97523
17721a12008I2066P1815N835a44241B55343b1360A8946b95830A47108f9178C33220
$$ -112008 92066 163881 169716 -144241 255343 -21360 18946 -295830 147108 -69178 333220
17709E8524a06364B88418A09038e1073H741O5884N9744P6034h7746k81838A62647
$$ 58524 -106364 288418 109038 -51073 8741 74625 134369 210403 -87746 -369584 162647
17697f3994j2384l39357A70548J07695g8065n6152H1807N6812J21854r5470m2432
$$ -63994 -76378 -415735 170548 278243 -78065 -134217 81807 138619 260473 165003 122571
17686A22571K9181c6819I6367P6585a27784D8098L5404a31637j88248B37250a47873
$$ 122571 151752 -36819 96367 172952 -127784 48098 83502 -131637 -319885 237250 -147873
17674C42352j41152b97544i9047j2679C22060E3289J06114F0864J67803J94980
$$ 342352 201200 -297544 -99047 -111726 322060 53289 159403 60864 228667 423647
17664D23647m4593E1443b32520a01982G0139a20160I208i0530j33024A29668b52324
$$ 423647 379054 51443 -232520 -101982 70139 -120160 9208 -90530 -223554 129668 -252324
17652i4613C27310o2905b03791a5794C87665A88140H7221J41090e6102m60129
$$ -94613 327310 264405 -203791 -15794 387665 188140 87221 228311 -56102 -516231
17642e16231E4890c1804A71677m0372E5070J6834K02594H2697K92298A73895L29791
$$ -516231 54890 -31804 171677 131305 55070 71904 274498 82697 374995 173895 503686
17631E03686A65692L67679d6472A97965a56519A38526G924J57270a41740q0165
$$ 503686 165692 533371 -46472 197965 -156519 138526 7924 165194 -141740 -221905
17621b21905i1297p5822I0770b40892C1595a65023j1141h159q1211A07866K42357
$$ -221905 -91297 -167119 90770 -240892 31595 -165023 -176164 -8159 -89370 107866 350223
17610C50223A54081d2258k67651f9203r9746B4424J98730H9086K68359I36N6756
$$ 350223 154081 -42258 -309909 -69203 -168949 24424 223154 89086 357445 936 57692
17599E7692a91712e7441A64517g9874c6488C62882b51582K4591B38300a3089b698
$$ 57692 -191712 -57441 164517 -79874 -36488 362882 -251582 -226991 238300 -13089 -2698
17587B98907I5939d8263j2000m9212d9784A72113K3686b740j4123k1882H8081
$$ 298907 95939 -48263 -60263 -109475 -49784 172113 195799 -2740 -16863 -38745 88081
17575A55442c2820j29200B29473a54413p8053i3127A5002L041J1407K3342J51401
$$ 155442 -32820 -162020 229473 -154413 -232466 -93127 15002 18043 29450 52792 204193
17564B04193a63138b4073A21254e2698J1971K435l613C2596M5392i1865A78044
$$ 204193 -163138 -24073 121254 -52698 -40727 -38292 -41905 32596 77988 -91865 178044
17552f6282n8428b0406A86236A0855L72181a9465B69882A14532D6928J16235d23648
$$ -66282 -124710 -20406 186236 10855 383036 -19465 269882 114532 46928 163163 -423648
17540C80871d321l1229A36811J5248n3595a04939E7286a81701j55502G4571L979
$$ 380871 -4321 -35550 136811 152059 98464 -104939 57286 -181701 -337203 74571 78550
17529G8550M851m458K75363E2356L9172b15070C237K61682b08685C38152H1284
$$ 78550 83401 78943 354306 52356 91528 -215070 3237 264919 -208685 338152 81284
17517f1918A67972K7182j5977b22129j5462A01024C9678R8726g0326E4285L4661
$$ -61918 167972 195154 179177 -222129 -237591 101024 39678 138404 -70326 54285 88946
17506H8946K6463J20877g1962A76178Q4714A00031J00043L1949J75494E3536a90593
$$ 88946 115409 236286 -71962 176178 260892 100031 200074 232023 407517 53536 -190593
17494C38369N9366F4184O5460b01742i4853b1987p0698D271L90394B7657e6005
$$ 338369 397735 64184 129644 -201742 -94853 -21987 -92685 4271 394665 27657 -56005
17482F2147M32345A45090L26072a70468H8774c34970I047J12281q871J11221j11290
$$ 62147 494492 145090 471162 -170468 88774 -334970 9047 121328 112457 223678 112388
17471A12388M54484A05924K93171e4248C00950H6403l999A0751J66765g3564C8143
$$ 112388 566872 105924 399095 -54248 300950 86403 82404 10751 177516 -73564 38143
17459A21317e9222j71054D39242A25572K55715q8821j25284J2910J47212d0984
$$ 121317 -59222 -230276 439242 125572 381287 292466 167182 180092 327304 -40984
17448D08795j32265J41803A83565J22503I2458b4909A83943g2765B28015B9474
$$ 408795 276530 418333 183565 306068 92458 -24909 183943 -72765 228015 29474
17437C54985B8934K93255o6924K08941k02656P8067g9143A6002a32656A92823
$$ 354985 28934 322189 255265 464206 261550 339617 -79143 16002 -132656 192823
17426A17770M9753p1816A513d346B88077k6318j01324P8768q478R0765A13311
$$ 117770 167523 95707 1513 -4346 288077 261759 160435 239203 230725 321490 113311
17414B41968a06229D45555I0407a1211C47172G2236L2497C4778M7675J25698b01316
$$ 241968 -106229 445555 90407 -11211 347172 72236 104733 34778 82453 208151 -201316
17402g6199A02249J13283b72192B75217o2695l6697a08268A63127b04346B37763
$$ -76199 102249 215532 -272192 275217 212522 175825 -108268 163127 -204346 237763
17391a3455C29627a00564m2826B21015G0685h339A47496i7608B73230r7306J43744
$$ -13455 329627 -100564 -143390 221015 70685 -8339 147496 -97608 273230 175924 319668
17380C19668d3741B29302L8873B0398b9931D02662A87916J42501o850A48856K49249
$$ 319668 -43741 229302 268175 20398 -29931 402662 187916 330417 323567 148856 398105
17369C98105j44762f8745C78240O8331j92206d9566B21241j07488j6397K16726
$$ 398105 253343 -68745 378240 446571 254365 -49566 221241 113753 97356 314082
17359C14082Q0955b4644Q461A54211E3062L40879H0798R9198J61661j54813M5488
$$ 314082 395037 -24644 -16183 154211 53062 393941 80798 179996 341657 186844 232332
17348B32332D1978c2144j52570A22947K19500A69850J37491a5122k12988C34254
$$ 232332 41978 -32144 -184714 122947 342447 169850 307341 -15122 -228110 334254
17337H3135K85187j12232a13654D6659J3311I406a40713h13I2475K46217a1274
$$ 83135 368322 256090 -113654 46659 59970 9406 -140713 -813 92475 338692 -11274
17325B905d3781A20946O2018o345k2012J30373m1765P8061m024j02591R3549e5502
$$ 2905 -43781 120946 182964 176619 154607 284980 243215 321276 317252 214661 308210 -55502
17312A58440J3350C377Q0735g7719B7672K87946e1227D58948j01808j08073B598
$$ 158440 171790 3377 84112 -77719 27672 315618 -51227 458948 357140 249067 2598
17300A75015J40931j01709A05510j0830J48189a83406C75436F3085J58183i074
$$ 175015 315946 214237 105510 94680 242869 -183406 375436 63085 221268 -9074
17289D88276A43223A5410L14402n4504A17491L18568E4285K02233g2228B97351
$$ 488276 143223 15410 329812 275308 117491 436059 54285 256518 -72228 297351
17278D33991j29494F0500A8147J68851J00274a49427B57180N5523a6115D43608
$$ 433991 304497 60500 18147 186998 287272 -149427 257180 312703 -16115 443608
17267A19091Q513J97662Q1496b8759B88657F9370k1803M93777j63072e4539a8746
$$ 119091 127604 325266 406762 -28759 288657 69370 47567 541344 378272 -54539 -18746
17255E56674H3128J15134F078P902L38510A66965q3270g3876A71409J92542g8012
$$ 556674 83128 198262 6078 13980 352490 166965 83695 -73876 171409 363951 -78012
17243B93355m8985K21608D4266R6008L56788j62169j19597J92078j09841J32523
$$ 293355 244370 465978 44266 140274 497062 334893 215296 407374 297533 430056
17233D30056G1607l4939J44760K35838A84065c7269A10053J8787b385A66488J01867
$$ 430056 71607 36668 181428 417266 184065 -37269 110053 128840 -2385 166488 268355
17222B68355a66269a2354F1438d8712A97407K86019j23501p3170a11082B85398
$$ 268355 -166269 -12354 61438 -48712 197407 483426 359925 286755 -111082 285398
17211C97671A24540k2880M43511j16950C8653N89844B95972A45368J47966f9325
$$ 397671 124540 101660 545171 428221 38653 628497 295972 145368 293334 -69325
17200H1498J19194I620K74085h2361E92493G5245g1485C70778A70415K84145e5894
$$ 81498 200692 9620 283705 -82361 592493 75245 -71485 370778 170415 454560 -55894
17188I6432K26841j14172P3615M8059J38360j8659B23110a43685E74178a3711
$$ 96432 323273 209101 282716 330775 469135 450476 223110 -143685 574178 -13711
17177E13964j57671A72476O7940e380F23498C03016l3942J6070J74962B4198P240
$$ 513964 356293 172476 240416 -5380 623498 303016 269074 285144 460106 24198 31438
17166C1438K16105G2095K0540K49909L4543j47447M6759A22239A276L59249m037
$$ 31438 247543 72095 92635 342544 377087 229640 276399 122239 1276 360525 356488
17155C56488A02129f8517A74255k5223M43545I2479L62174A43808L85698K0868
$$ 356488 102129 -68517 174255 149032 592577 92479 454653 143808 529506 550374
17145E50374j4772k36931O522A49122L66199j65607J0999j72542M6560j2248K11404
$$ 550374 535602 298671 305193 149122 515321 349714 360713 188171 234731 222483 433887
17134D33887K4281f3652F1676N96706k87503A08976K84932K986O9466J187A54850
$$ 433887 458168 -63652 61676 658382 370879 108976 393908 396894 466360 467547 154850
17122C55948M31802B62164G9565K02243J27401A48853K37914j56118g283F12684
$$ 355948 787750 262164 79565 281808 409209 148853 386767 230649 -7283 612684
17111D15220A25545J19375J51174j64353J41008J8517J65212q4962J02212j20993
$$ 415220 125545 244920 396094 231741 372749 391266 556478 471516 573728 452735
17101D52735O8583B00812k3711Q1068A16107K75897J43054A36709L46447l8485
$$ 452735 521318 200812 177101 258169 116107 392004 535058 136709 483156 444671
17091D44671J46064J5559q8130j54546J39740Q0960B37704D2772L84517j13081
$$ 444671 590735 606294 518164 363618 503358 584318 237704 42772 427289 314208
17081C14208P1492K46559C12433N0127J38669J09692k17557K46715C15621n5976
$$ 314208 385700 632259 312433 362560 501229 610921 393364 640079 315621 259645
17071B59645I6159L24876j20013L02354B43536Q6052A23314O21574C51218L23011
$$ 259645 96159 421035 301022 603376 243536 329588 123314 744888 351218 674229
17061F74229A95019M95594A45853P9783L95406k34188l7439L23736B58944K00987
$$ 674229 195019 690613 145853 225636 621042 386854 349415 673151 258944 459931
17051D59931n6076J70271B14656M89030m0485j70684J12605n2770o8057Q2156
$$ 459931 403855 574126 214656 703686 663201 492517 605122 552352 484295 566451
17041E66451J96405C52733J3776l615J01191L3713J44648J34271l69854O6384
$$ 566451 762856 352733 366509 362894 464085 497798 642446 776717 406863 473247
17031D73247B24888L04704K9002A85825j4221N59116C59601k9872K66987j5857
$$ 473247 224888 529592 558594 185825 171604 730720 359601 329729 596716 580859
17021E80859m4314J14085A79151L90265J20968J05063k25933k2323B71907L00026
$$ 580859 536545 650630 179151 569416 690384 795447 569514 547191 271907 571933
17011E71933j77849J85352N6945J27266k80737J84L54779l9487l33463L71114
$$ 571933 394084 579436 636381 763647 482910 483094 837873 798386 464923 836037
17001H36037p4146q0207N7274J63931k71449J4305M03922D88226P1778J72881
$$ 836037 761891 681684 738958 902889 631440 645745 1049667 488226 560004 732885
16991G32885J14657C09736K83103j45481J65939R2476k99503N55879k44233L29438
$$ 732885 847542 309736 592839 447358 613297 705773 406270 962149 717916 1047354
16981A047354l61309q6563M58025E17816N37953k79653K49442k07395j36667J84214
$$ 1047354 686045 599482 1057507 517816 1055769 776116 1025558 818163 681496 865710
16971H65710l13973M36273m42287L56846n1007Q0567k25529L33861K73484m60218
$$ 865710 551737 988010 545723 902569 851562 932129 706600 1040461 1313945 853727
16961H53727J40745M0822m38068Q8842L01407L7701j19770K40623l84412n0289
$$ 853727 994472 1035294 597226 686068 987475 1025176 905406 1146029 761617 711328
16951G11328L06235Q0498p5702j66611L20557o8408j23037j77195K89276j59130
$$ 711328 1017563 1098061 1022359 855748 1176305 1107897 984860 807665 1096941 937811
16941I37811o4271j0793Q5867L8351L00066R9773j29033R0010M0831n13043K55745
$$ 937811 873540 862747 948614 986965 1287031 1386804 1257771 1347781 1388612 875569 1131314
16930A131314k13355J21856Q6242J83544r4582j84646K90703r4529J4605Q5416
$$ 1131314 917959 1039815 1126057 1309601 1215019 1030373 1321076 1226547 1241152 1326568
16920A326568R968J23152n9723j51264J51210N8884q9749k19418N76416l36053
$$ 1326568 1336536 1459688 1399965 1248701 1399911 1458795 1369046 1149628 1726044 1389991
16910A389991j12903L53867j67402k40133M28709k3570k72556M32737m37699L44390
$$ 1389991 1277088 1630955 1463553 1223420 1652129 1628559 1356003 1788740 1351041 1695431
16900A695431j3195k74047N38386j45330j43281k34473J67840K11810k10998J86910
$$ 1695431 1682236 1408189 1946575 1801245 1657964 1423491 1591331 1803141 1592143 1779053
16890A779053J8343l33395J72640K28283L4461J55565l90207K88220J27332j78247
$$ 1779053 1797396 1464001 1636641 1864924 1899385 2054950 1664743 1952963 2080295 1902048
16880A902048J00564p6045j26106K66238J97740k69530J44335K69740j08412k14209
$$ 1902048 2002612 1926567 1800461 2066699 2264439 1994909 2139244 2408984 2300572 2086363
16870B086363P5734J13755l256K48357q7396q5682L37726k12824K86837o0217
$$ 2086363 2162097 2275852 2272596 2520953 2433557 2347875 2685601 2472777 2759614 2699397
16860B699397j49875J309q936M12147l21965J36963O4677j32167K63717k24265
$$ 2699397 2549522 2550831 2541895 2954042 2632077 2769040 2833717 2701550 2965267 2741002
16850B741002r731K27645j33977L04444K77511k8786k41354K39234K45673k32930
$$ 2741002 2731271 2958916 2824939 3129383 3406894 3378108 3136754 3375988 3621661 3388731
16840C388731K23692J2842J50195k22553L13842j09371J35155m0182n2784K73217
$$ 3388731 3612423 3625265 3775460 3552907 3866749 3757378 3892533 3852351 3799567 4072784
16830D072784J86842m6627P570j53016p8273M25151j63067L50041K20719J04756
$$ 4072784 4259626 4212999 4220569 4067553 3989280 4414431 4251364 4601405 4822124 4926880
16820D926880J10135K5651q8700P9286K51514K26544J65525j04432K45646M7900
$$ 4926880 5037015 5062666 4973966 5053252 5304766 5531310 5696835 5592403 5838049 5885949
16810E885949N0855P6293M45096q5106J26439N8413J60580M08554j04954j26773
$$ 5885949 5936804 6013097 6458193 6373087 6499526 6557939 6718519 7127073 7022119 6895346
16800F895346P62076J48668J00371Q742L68007K77532J79922R8271R3046K04443
$$ 6895346 7657422 7806090 7906461 7915203 8283210 8560742 8740664 8838935 8931981 9136424
16790I136424N10640L0318M20801K55221P42430l19876J46621M92734N74834O6426
$$ 9136424 9647064 9677382 10098183 10353404 11095834 10775958 10922579 11415313 11990147 12056573
16780A2056573N76918P4546P23865J67259M62808L63581R62702K26094O00067
$$ 12056573 12633491 12708037 13431902 13599161 14061969 14425550 15388252 15614346 16214413
16771A6214413N74854L10795P15299P95014O70515O44817Q09967Q52279R64959
$$ 16214413 16789267 17100062 17815361 18610375 19280890 19925707 20735674 21587953 22552912
16762B2552912M78983R66675J332160R23302J276983Q17410J386804J633273J029080
$$ 22552912 23031895 23998570 25330730 26254032 27531015 28348425 29735229 31368502 32397582
16753C2397582J633043J640684J647255J803153J874135J852512K296370K072561
$$ 32397582 34030625 35671309 37318564 39121717 40995852 42848364 45144734 47217295
16745D7217295K861666K484979K709572K749891L524369L194235L988066L941403
$$ 47217295 50078961 52563940 55273512 58023403 61547772 64742007 68730073 72671476
16737G2671476L903153M790933M424043M888710N451051N542088N993578O187710
$$ 72671476 76574629 81365562 85789605 90678315 96129366 101671454 107665032 113852742
16729A13852742N779611O306284O647755N878783O234449O224688N396313N033296
$$ 113852742 119632353 125938637 132586392 138465175 144699624 150924312 156320625 161353921
16721A61353921M208361L270527K729818J687042q2503r99547j801871k977261
$$ 161353921 165562282 168832809 171562627 173249669 173167166 172167619 170365748 167388487
16713A67388487l536077m569704n350550n625737o257782o912228o370982o099466
$$ 167388487 163852410 159282706 153932156 148306419 142048637 135136409 128765427 122665961
16705A22665961o582694o606131n864218n838082n475229n312474n096480m401727
$$ 122665961 116083267 109477136 103612918 97774836 92299607 86987133 81890653 77488926
16697G7488926m760050l806072m062826l591690l457701k984923k929961k744526
$$ 77488926 72728876 68922804 64859978 61268288 57810587 54825664 51895703 49151177
16689D9151177k729022k129895k336183j985383k038823j769526j809250j675222
$$ 49151177 46422155 44292260 41956077 39970694 37931871 36162345 34353095 32677873
16681C2677873j349958j177861j467746j199911j294312j081481r21000r40505
$$ 32677873 31327915 30150054 28682308 27482397 26188085 25106604 24185604 23245099
16673B3245099q94136q36513q86769q91151q63887l03853q46454o29828q31032
$$ 23245099 22350963 21514450 20627681 19736530 18872643 18568790 17722336 17092508 16261476
16664A6261476k30829p76229o82123o4292n98375n31419l41724n23861L6787l04032
$$ 16261476 16030647 15254418 14572295 14508003 13909628 13378209 13036485 12512624 12549411 12245379
16654A2245379p99130k60633k07321o70953j46358k96586p6585k40209l89183
$$ 12245379 11446249 11185616 10978295 10307342 10160984 9864398 9787813 9547604 9158421
16645I158421O1033q99849L55426o18727k19298K49671o85907q1650j41806j91013
$$ 9158421 9219454 8319605 8675031 8056304 7837006 8086677 7400770 7319120 7177314 6986301
16635F986301j7662j41292k92726L9414l61190k08311k11266L7696r6839k35534
$$ 6986301 6968639 6827347 6534621 6574035 6212845 6004534 5793268 5830964 5734125 5498591
16625E498591K3201m4136M5764n03064j21330R9961m8863o8582o4595k17289m46435
$$ 5498591 5521792 5477656 5523420 5020356 4899026 4998987 4950124 4881542 4816947 4599658 4153223
16614D153223k51410K95586j46160l00433K27859J31515l30861L7770k3551R6954
$$ 4153223 3901813 4197399 4051239 3750806 3978665 4110180 3779319 3817089 3793538 3890492
16604C890492l48638k0940m3619p8055N6054k68126L93905n18214P1225j41145
$$ 3890492 3541854 3520914 3477295 3399240 3455294 3187168 3581073 3062859 3134084 2992939
16594B992939k24708K92466j95485j17900k1115L8420r0236L9213j33655k59945
$$ 2992939 2768231 3060697 2865212 2747312 2726197 2764617 2674381 2713594 2579939 2319994
16584B319994K13929k27014J0888L294M8604J35934k9312l85193K28267J9460
$$ 2319994 2533923 2306909 2317797 2321091 2369695 2505629 2476317 2091124 2319391 2338851
16574B338851Q6146l86940m1253K66502j29721l8510R2753l24029l06495J20666
$$ 2338851 2424997 2038057 1996804 2263306 2133585 2095075 2187828 1863799 1557304 1677970
16564A677970O3891N51260k09270M895k07201l22346L71675n56889L83690j30634
$$ 1677970 1741861 2293121 2083851 2088746 1881545 1559199 1930874 1373985 1757675 1627041
16554A627041J57526q9865K73397n11426k50062L31301j47977J77344j88892N37097
$$ 1627041 1784567 1694702 1968099 1456673 1206611 1537912 1389935 1567279 1378387 1915484
16544A915484k66058p4685k73165N4419k17995K23728K9576k15840M3476P2826
$$ 1915484 1649426 1574741 1301576 1355995 1138000 1361728 1391304 1175464 1218940 1291766
16534A291766r9825j25003M37974l83692k7224j40740M09720l19042K50393l27369
$$ 1291766 1191941 1066938 1504912 1121220 1093996 953256 1362976 1043934 1294327 966958
16524I66958K07356j85441K07062j22373K42918k76900j47457k32096L29041J91929
$$ 966958 1174314 988873 1195935 1073562 1316480 1039580 892123 660027 989068 1180997
16514A180997j96472l28759J37163J43628k42359K28388K83192j18054l63270
$$ 1180997 984525 655766 792929 936557 694198 922586 1205778 1087724 724454
16505G24454J84911K93361k67138j34239K39473k71853M7914Q6436k2506N6454
$$ 724454 909365 1202726 935588 801349 1040822 768969 816883 903319 880813 937267
16495I37267N8372k56180P0313j21469M3570k502J87295C09128K66390J77065
$$ 937267 995639 739459 809772 688303 731873 729371 916666 309128 575518 752583
16485G52583q7899L46981o3262J74913k63658l60475L23697l4704q7977L987k98908
$$ 752583 664684 1011665 948403 1123316 859658 499183 822880 788176 700199 704186 405278
16474D05278J52865J5133J62989r3009J79199k43157J78374k36220Q9993q4115
$$ 405278 558143 573276 736265 643256 822455 579298 757672 521452 611445 527330
16464E27330J49148k4327r7728j31696K59825l18908K74823o7031M6599j26409
$$ 527330 676478 652151 554423 422727 682552 363644 638467 571436 618035 491626
16454D91626K82093o2098k26765j20410J92700N6165j5447q0974L911P3034A67947
$$ 491626 773719 711621 484856 364446 557146 613311 597864 516890 520801 593835 167947
16442D85659r7839J37130O1783J24424k13537p6289K66336k24530M0983j56878
$$ 485659 387820 524950 586733 711157 497620 421331 687667 463137 504120 347242
16432C47242P1159M48544C01558K90615k3425A03589M29007q8279J35j03730J83519
$$ 347242 418401 866945 301558 592173 568748 103589 532596 444317 444452 340722 524241
16421E24241m3154j88986L45078p990A28399N13012l06655R4423J73532P1519
$$ 524241 481087 292101 637179 629189 128399 641411 334756 429179 602711 674230
16411F74230c8592B37376j1434r0627R9238K97884j47544j61030o0921J15649
$$ 674230 -38592 237376 225942 135315 234553 532437 384893 223863 162942 278591
16401B78591K2449N7713A49154K1297K39963J04513q709j13297Q7535J38927G1549
$$ 278591 301040 358753 149154 170451 410414 514927 506218 392921 480456 619383 71549
16389A56007f3656F23170k92370j38245P0662J90455j91687j2146K00770L72876
$$ 156007 -63656 623170 330800 192555 263217 453672 261985 249839 450609 823485
16379H23485C08987j22402L24278A04329a3691B73869Q393J67352J73000B56674
$$ 823485 308987 186585 510863 104329 -13691 273869 282262 449614 622614 256674
16368C63524k8727J38755k27866K97784o1443A22251O5039K84899B06526h2284
$$ 363524 334797 473552 245686 543470 482027 122251 187290 472189 206526 -82284
16357B15183J425L73332g6522E43166B59581r8071C9397L36478j58876A6248c7305
$$ 215183 216608 589940 -76522 543166 259581 161510 39397 375875 216999 16248 -37305
16345F580J27644J4229C2837M6846K83932l8218A60667O3741J36380N3760A33510
$$ 6580 134224 148453 32837 79683 363615 325397 160667 224408 360788 414548 133510
16333a13803D62668A94822o8137J39543J00243K5016A44541F7583M1789f5041
$$ -113803 462668 194822 126685 266228 366471 391487 144541 67583 109372 -65041
16322D13019a09961E64566o1489n2887A90171d039B01232J29929j60845J73558
$$ 413019 -109961 564566 503077 450190 190171 -4039 201232 331161 170316 343874
16312C43874r7616J00624b0197B24414J26809a11011B62198J650j19248K03570
$$ 343874 246258 346882 -20197 224414 351223 -111011 262198 263848 144600 348170
16302C48170A38819K37118b78291g5447A19599k9696O8229J89354I4711K40729
$$ 348170 138819 375937 -278291 -75447 119599 89903 158132 347486 94711 335440
16292C35440F4704L8804J56107l3845j04402q977J72414Q8345c20l2679j95238
$$ 335440 64704 103508 259615 225770 121368 112391 284805 373150 -320 -32999 -228237
16281b28237C25455e2802C67979G0414b23705I7187J4174J44423a83401B64179
$$ -228237 325455 -52802 367979 70414 -223705 97187 111361 255784 -183401 264179
16270I7907J0722O3161J97579A09001J34302J9735k8055K13612N889j65969A08335
$$ 97907 108629 171790 369369 109001 243303 263038 234983 448595 454484 288515 108335
16258B56882M6374j19176b02983P4853B63430j15443A4271M0096a23350K0957
$$ 256882 303256 184080 -202983 -128130 263430 147987 14271 54367 -123350 -102393
16248a02393l5213D2544a76704L6064A08532b8494D9158J10207f9762D95893B12934
$$ -102393 -137606 42544 -176704 -140640 108532 -28494 49158 159365 -69762 495893 212934
16236E6755d41750K16798I6305K48286A46137A9988L7442J75352b86538b7431
$$ 56755 -441750 -224952 96305 344591 146137 19988 57430 232782 -286538 -27431
16225E0826R9475J69433j26303b8656A27603b70618C09314a41960A71637J65969
$$ 50826 150301 319734 193431 -28656 127603 -270618 309314 -141960 171637 337606
16215C37606N0571r0316b29923B71900h6705M2668j9553G1381a83014I6780m0211
$$ 337606 388177 297861 -229923 271900 -86705 -44037 -63590 71381 -183014 96780 56569
16204E6569a84566K9367k45P6483A2388Q7387J51203c2734k71564B25884F5508
$$ 56569 -184566 -155199 -155444 -78961 12388 99775 250978 -32734 -304298 225884 65508
16192A16156c53302a12547J9065D39572E3623b55943A37901b03B59774h092k16999
$$ 116156 -353302 -112547 -93482 439572 53623 -255943 137901 -203 259774 -8092 -225091
16181b25091C37218a49556N6283l2B79257j12844R8331I3290i0243j71625B96740
$$ -225091 337218 -149556 -93273 -93305 279257 166413 264744 93290 -90243 -261868 296740
16169a06657C16418a32821A90085o6646J18270a57771c9969H989O4835a01566
$$ -106657 316418 -132821 190085 123439 241709 -157771 -39969 8989 73824 -101566
16158A35095i1187A22198g0009J1684a1353j05936k00085A21578B6428J65048
$$ 135095 -91187 122198 -70009 -58325 -11353 -117289 -317374 121578 26428 191476
16148A91476M7546J39177d6688a060C00216A09073m0253J89966o0356a09027A26113
$$ 191476 239022 378199 -46688 -1060 300216 109073 68820 258786 198430 -109027 126113
16136F1883K7134a30449G694L2652b91407A59307L4038h2893a3246j31187A01765
$$ 61883 89017 -130449 7694 40346 -291407 159307 193345 -82893 -13246 -144433 101765
16124H0864L08138G9894h4222l3115L5375l7330e3467j6025B46223e4499B15491
$$ 80864 389002 79894 -84222 -117337 -81962 -119292 -53467 -69492 246223 -54499 215491
16112A7785K31710I7282k8516K5122R273C5431J91457k4497a01853L8721A33014
$$ 17785 249495 97282 68766 93888 103161 35431 226888 202391 -101853 -63132 133014
16100C14093A17233a20022J1331B20983a90693B16617b97646J13867P1693m9846
$$ 314093 117233 -120022 -108691 220983 -190693 216617 -297646 -183779 -112086 -161932
16090a61932k09610B14801a50506b8696E6K2385R636J65109C3563a10884C8228
$$ -161932 -371542 214801 -150506 -28696 56 22441 32077 197186 33563 -110884 38228
16078C65916h1260D4481h715k80595J6932B34935b34995a14707D8301a00069k24274
$$ 365916 -81260 44481 -8715 -289310 -272378 234935 -234995 -114707 48301 -100069 -324343
16067c24343B47570a63415Q0849j09062F1080b04760h3136D0462a68400g8813
$$ -324343 247570 -163415 -82566 -191628 61080 -204760 -83136 40462 -168400 -78813
16056c79880A31855a28280E9280N1772a66108c7302k86129a01680A32724K09665
$$ -379880 131855 -128280 59280 111052 -166108 -37302 -323431 -101680 132724 342389
16046C42389A8538M8516a8320A45878n5166h4293r696j43935e7679A46855e4476
$$ 342389 18538 67054 -18320 145878 90712 -84293 -93989 -237924 -57679 146855 -54476
16034A42519a10569A04160L4259i739o401k8838B22844a16698K3688j1817b6557
$$ 142519 -110569 104160 138419 -9739 -16140 -44978 222844 -116698 -93010 -104827 -26557
16022D6940f9038E0909O1715i5799j77746M3808A01900n793J52636B897a2530
$$ 46940 -69038 50909 112624 -95799 -273545 -229737 101900 96107 248743 2897 -12530
16010a66310B66984j11580K10287a11938G775K951K30617a71781p6064A46123
$$ -166310 266984 155404 365691 -111938 7775 10726 241343 -171781 -247845 146123
15999B6952J46933J8225D3066h1022J2223C86042d35641A46219g1356B15437R826
$$ 26952 173885 192110 43066 -81022 -68799 386042 -435641 146219 -71356 215437 225263
15988B25263a02120d1355b46C18151r0430l6992J47792G2393K56520F9767R7918
$$ 225263 -102120 -41355 -246 318151 227721 190729 338521 72393 328913 69767 167685
15977A67685K29368G9623g4611m3797G0891a16024A20635K41590B3899F004c68573
$$ 167685 397053 79623 -74611 -118408 70891 -116024 120635 362225 23899 6004 -368573
15965A59559b58440J27016I3845f6780A43929a34622D4924b22439A64606i4842
$$ 159559 -258440 -131424 93845 -66780 143929 -134622 44924 -222439 164606 -94842
15954b1482m1391j16937e3024G669Q910K3189O5924a55176b2663O869p5785o1619
$$ -21482 -62873 -179810 -53024 7669 16579 39768 105692 -155176 -22663 -15794 -91579 -153198
15942a53198B19459a26101A03564J50788a12102n1183j62622Q8389j9717I088
$$ -153198 219459 -126101 103564 254352 -112102 -163285 -325907 -237518 -257235 9088
15931B64981h8255j58938a6558l3754q511D2588J7762c40783o4227B4164k417
$$ 264981 -88255 -247193 -16558 -50312 -58823 42588 60350 -340783 -405010 24164 21747
15920B1747I546M86252a36153O6010I1485J8857Q2234b16797I4429k0547k5000
$$ 21747 9546 495798 -136153 -70143 91485 110342 192576 -216797 94429 73882 48882
15909D8882a48779j82038a32452A39125m6842D563d9385b1455A13175c371F6200
$$ 48882 -148779 -330817 -132452 139125 92283 4563 -49385 -21455 113175 -3371 66200
15897c74814A68617e2221k23451f5075C9068b18601Q5316A8687F23J7662g2683
$$ -374814 168617 -52221 -275672 -65075 39068 -218601 -133285 18687 623 18285 -72683
15885b1145l3676l32573D8181c51236Q8183P4991p2002m5818J44242g8704l55766
$$ -21145 -54821 -387394 48181 -351236 -263053 -188062 -260064 -305882 -161640 -78704 -434470
15874d34470A57991a87056b9929l67421B687F27h0568H587b517k720k4676A12412
$$ -434470 157991 -187056 -29929 -397350 2687 627 -80568 8587 -2517 -5237 -29913 112412
15861a59446p1450C1974a90378o930Q4299j57231a26855D6883J88685I1426a17589
$$ -159446 -230896 31974 -190378 -197308 -113009 -270240 -126855 46883 235568 91426 -117589
15849B20802b51731I9062a36004A28311j9881a23804C333g3195A32429a94787
$$ 220802 -251731 99062 -136004 128311 108430 -123804 3333 -73195 132429 -194787
15838e95m14029a3637k90948A22506A9450c39809i601B532a20326a1285A4729
$$ -595 -414624 -13637 -304585 122506 19450 -339809 -9601 2532 -120326 -11285 14729
15826i0558F690d3604A78511J96522A35990C0073K0289J72484a18942i440p82
$$ -90558 6690 -43604 178511 375033 135990 30073 50362 222846 -118942 -9440 -10222
15815a0222A65501f5406H2263b78852C12497a71727N7492B86121A27851D2047
$$ -10222 165501 -65406 82263 -278852 312497 -171727 -114235 286121 127851 42047
15804I5320d6391N619l1769F4238a73545I7329a0336A22675b53j78094D579b11937
$$ 95320 -46391 -40772 -72541 64238 -173545 97329 -10336 122675 -253 -178347 4579 -211937
15791C09902a34186H0465g8338j60584A92617c21137a7645A71668a02650j89546
$$ 309902 -134186 80465 -78338 -238922 192617 -321137 -17645 171668 -102650 -292196
15781b92196g6710j58916B5067J48456H456c85494A24237M4855a03308A49588
$$ -292196 -76710 -235626 25067 173523 8456 -385494 124237 169092 -103308 149588
15770i4783A19540i9393B079c60852E2744Q604R6627d4054A20905I349c6158j12571
$$ -94783 119540 -99393 2079 -360852 52744 61348 157975 -44054 120905 9349 -36158 -148729
15758a48729f2441B38843a9381B62377A28301F0264c35785J32899R0280C1683
$$ -148729 -62441 238843 -19381 262377 128301 60264 -335785 -202886 -112606 31683
15747A03975A1125a11424D16720c4114k91254A49150a59045q3830C71928F1973
$$ 103975 11125 -111424 416720 -34114 -325368 149150 -159045 -242875 371928 61973
15736c79416J21539F7667J01360b19034C65343a72898k9449D51165a11256h032
$$ -379416 -257877 67667 169027 -219034 365343 -172898 -202347 451165 -111256 -8032
15725A00495i4308A34685a80160E0777a09547J2353A50494E3049b38511E6456
$$ 100495 -94308 134685 -180160 50777 -109547 -97194 150494 53049 -238511 56456
15714A76024a55150l6185M7886j52859R1921k7680g3824E6674b65019d6940A02444
$$ 176024 -155150 -191335 -143449 -296308 -204387 -232067 -73824 56674 -265019 -46940 102444
15702C42999a54846k16128g6507E73a88024A03176c66592i3149A15118j5685B0109
$$ 342999 -154846 -370974 -76507 573 -188024 103176 -366592 -93149 115118 99433 20109
15690a46627C92901b4851B94032A33733h4541N500B04375d72011f1731j34117
$$ -146627 392901 -24851 294032 133733 -84541 -79041 204375 -472011 -61731 -195848
15680a95848A67577b60528A61882g2268l7500r7386R834G3447g9086B27383r4040
$$ -195848 167577 -260528 161882 -72268 -109768 -207154 -197320 73447 -79086 227383 133343
15669A33343c80015a9242l26312H4125P8223G3078b47180i5872C2172J84186N0006
$$ 133343 -380015 -19242 -345554 84125 162348 73078 -247180 -95872 32172 216358 266364
15658B66364g3159K4512J9843A2037c3791j77338A34722r045a66681c1807j81496
$$ 266364 -73159 -48647 -28804 12037 -33791 -211129 134722 125677 -166681 -31807 -213303
15647b13303A96140p0063e4704j03557B63461A5777L38513b76l34179J896l4859
$$ -213303 196140 126077 -54704 -158261 263461 15777 354290 -276 -334455 -332559 -367418
15636c67418b0555k15659a2702n8273A14628A3215L4473C811K94248b31684I5994
$$ -367418 -20555 -236214 -12702 -70975 114628 13215 47688 3811 298059 -231684 95994
15624A44096c00900a40930k25160I5847Q0506e0883C3062c9947l1413B68701H1428
$$ 144096 -300900 -140930 -366090 95847 176353 -50883 33062 -39947 -71360 268701 81428
15612A32604a76434A93583q3414c6776B1554g9139a3303A3024a06575F9817i454
$$ 132604 -176434 193583 110169 -36776 21554 -79139 -13303 13024 -106575 69817 -9454
15600c77883A98435A7074b16887i2784A84043e8181k06941c0299D7363a31267
$$ -377883 198435 17074 -216887 -92784 184043 -58181 -265122 -30299 47363 -131267
15589h5953k3087j6234M5861B18143b11509G2697b44177e5269j73044C21529A7703
$$ -85953 -109040 -125274 -79413 218143 -211509 72697 -244177 -55269 -228313 321529 17703
15577B30188J3208A07737J23965A9623J34826f4206B42631B429J02357b15479
$$ 230188 243396 107737 231702 19623 154449 -64206 242631 2429 104786 -215479
15566f7738A87723C4998b47445c1089J549k7820C05119h8100o5812d7057B20930
$$ -67738 187723 34998 -247445 -31089 -29540 -57360 305119 -88100 -153912 -47057 220930
15554d8493j02665A31725a00346A83492q7374l8517d6595I2399d04779A34175
$$ -48493 -151158 131725 -100346 183492 96118 57601 -46595 92399 -404779 134175
15543c11686A4099a54932M9739j30801A8921f0604A28536l9046c48023a21875
$$ -311686 14099 -154932 -105193 -235994 18921 -60604 128536 89490 -348023 -121875
15532E3017g2540B69781d7903B06026a50784I8857D9119J00171j7737L937m4976
$$ 53017 -72540 269781 -47903 206026 -150784 98857 49119 149290 131553 135490 90514
15521I0514R3960e6508B77672a80775k37133a25477B71155i7749h440q688m838
$$ 90514 184474 -56508 277672 -180775 -417908 -125477 271155 -97749 -8440 -17128 -21966
15510b1966k00971R1065B01967i7223n0638B34788c01490A84621c15531J37763
$$ -21966 -222937 -131872 201967 -97223 -147861 234788 -301490 184621 -315531 -177768
15500a77768B84992c02402B74694b09281c532A06397C4771q165c9937B5384J47784
$$ -177768 284992 -302402 274694 -209281 -3532 106397 34771 26606 -39937 25384 173168
15489A73168b15184M2922j86252D00857a39776Q101d2312A50061d32928J07728
$$ 173168 -215184 -172262 -358514 400857 -139776 -131675 -42312 150061 -432928 -325200
15479c25200B32264f4150A80431A6502a8624j8012r1149J2041c15A4642a11034
$$ -325200 232264 -64150 180431 16502 -18624 -36636 -127785 -115744 -315 14642 -111034
15467I0579B9633n521m135b44285A06755E1610a06125I4320f6761a4061I2275
$$ 90579 29633 24112 19977 -244285 106755 51610 -106125 94320 -66761 -14061 92275
15455d60945h6714b3243n6754d276j06248a3840l06326a16973A18405b09665e0308
$$ -460945 -86714 -23243 -79997 -4276 -110524 -13840 -320166 -116973 118405 -209665 -50308
15443a54812b6779l4112q5122f638A01855K8651a47364c8293A16329J33901b21710
$$ -154812 -26779 -60891 -146013 -6638 101855 130506 -147364 -38293 116329 250230 -221710
15431f4326r013j23859A92674q3446b4505m3596I770J2513N9107a61366O0827
$$ -64326 -73339 -197198 192674 109228 -24505 -68101 9770 22283 81390 -161366 -100539
15420a00539k15204h3121B0390g0754B21932h4980F3612a19026j51396P3038Q5438
$$ -100539 -315743 -83121 20390 -70754 221932 -84980 63612 -119026 -270422 -197384 -111946
15409a11946J8840E9805L95724A17739d51424a98928D3856a306m4216a9146j13171
$$ -111946 -93106 59805 455529 117739 -451424 -198928 43856 -1306 -45522 -19146 -132317
15398a32317C41773b8634A39809d7505F3234P5241b30495A58154K13053c9161
$$ -132317 341773 -28634 139809 -47505 63234 138475 -230495 158154 371207 -39161
15387E7521a26961m723F7683c25555B06862P2622C0412c21662J48769D00753j09612
$$ 57521 -126961 -131684 67683 -325555 206862 279484 30412 -321662 -172893 400753 291141
15376B91141a05382j19478C05022i652A31067A2014a57256H1043j645a312B22161
$$ 291141 -105382 -224860 305022 -9652 131067 12014 -157256 81043 79398 -1312 222161
15364b74867C8390M0366B4057a42876N7326q7022J515A5605a56306A45512a0128
$$ -274867 38390 78756 24057 -142876 -85550 -172572 -171057 15605 -156306 145512 -10128
15352d40767c0446A00467a28955d9705D8611a4799k17439I0845a508I9772b15062
$$ -440767 -30446 100467 -128955 -49705 48611 -14799 -232238 90845 -1508 99772 -215062
15340a86862G9161K23227A40529n9252a7465E3620N2169i2823C5946P6871J03223
$$ -186862 79161 302388 140529 81277 -17465 53620 105789 -92823 35946 112817 216040
15329B16040a22056Q793I9932L1450o5637b37884B9555a40215A69702k1787a60858
$$ 216040 -122056 -113263 99932 131382 65745 -237884 29555 -140215 169702 147915 -160858
15317b23654A7536J51961e49432Q5518C90812a33213k49764B88537B0022J13518
$$ -223654 17536 169497 -549432 -463914 390812 -133213 -382977 288537 20022 133540
15307A33540K1930K710B3434A1580g9057j26016A29016B1694a63367F7624e2269
$$ 133540 155470 158180 23434 11580 -79057 -205073 129016 21694 -163367 67624 -52269
15295C30277F8015L2437a32038B58240i9149A55050b32135A60872b1045k12090
$$ 330277 68015 100452 -132038 258240 -99149 155050 -232135 160872 -21045 -233135
15285b33135R7631H0043f620k01568F2601a60560C4496f696B24399A1711j783
$$ -233135 -135504 80043 -6620 -208188 62601 -160560 34496 -6696 224399 11711 9928
15274I928K01333L1370H9468O6595P2970h9047k3016F3064P5952l5594b87321
$$ 9928 211261 242631 89468 156063 229033 -89047 -112063 63064 139016 103422 -287321
15262F8060K63137j15411g8893j66436e7853B61070H6885A5600J33978K44227
$$ 68060 331197 215786 -78893 -245329 -57853 261070 86885 15600 149578 393805
15252C93805D3636K35609A1822K44064M26741M29285D86128O48725J58547A80355
$$ 393805 43636 279245 11822 255886 682627 1111912 486128 1134853 1293400 180355
15241B26705d1706A71410a20863b1855J441l4963k64444B22311J60810I4801h8423
$$ 226705 -41706 171410 -120863 -21855 -20414 -55377 -319821 222311 383121 94801 -88423
15229A26563n4225j5454K83205Q6693A1242N3430f9632q2559c9675A1401K97412
$$ 126563 72338 56884 340089 426782 11242 64672 -69632 -152191 -39675 11401 308813
15218C08813g1963C1103J28988Q3623f9133B3731k272K05986k9285R4859b14261
$$ 308813 -71963 31103 160091 243714 -69133 23731 21459 227445 198160 293019 -214261
15206a83535M7076M8209D24904j72493B315L66272e2365J0486A96398a69543O9997
$$ -183535 -136459 -88250 424904 252411 2315 368587 -52365 -41879 196398 -169543 -99546
15195i9546K8264g055j94056a3751j70512Q7973A10646c743A29243E6492f3023
$$ -99546 -71282 -7055 -201111 -13751 -184263 -96290 110646 -3743 129243 56492 -63023
15183A87150p3362m9946K02142a49809A33250o1886J7052J85263A06127R0739
$$ 187150 113788 63842 265984 -149809 133250 71364 88416 273679 106127 196866
15173A96866H5892d100C75266d3660a4396G0889J59486b56903I9051M4994O7509
$$ 196866 85892 -4100 375266 -43660 -14396 70889 230375 -256903 99051 144045 211554
15162B11554a77095f7194m2260e4046A4086b2603a743C62635C2411J72327K34989
$$ 211554 -177095 -67194 -109454 -54046 14086 -22603 -1743 362635 32411 204738 439727
15151D39727A03610K05829A1117f11194A8941e8548b8893p2151r702I7248a93884
$$ 439727 103610 309439 11117 -611194 18941 -58548 -28893 -101044 -110746 97248 -193884
15139H5307C6396N7312O1466c4274j85977A97303N5756J54772j58187j4657k2802
$$ 85307 36396 93708 155174 -34274 -220251 197303 253059 407831 249644 234987 212185
15128B12185I6597m5592j1302Q4965a68481C46939m8137j46185B9710i3218f239
$$ 212185 96597 51005 39703 124668 -168481 346939 298802 152617 29710 -93218 -6239
15116A42851J8330f7527C6977J09095j4029m1827i4800J3648A61191f4932B26228
$$ 142851 161181 -67527 36977 146072 132043 90216 -94800 -81152 161191 -64932 226228
15104F5010a86945A35538F0461K3091O1431L16437B592K70634d7817I575f4245
$$ 65010 -186945 135538 60461 83552 144983 461420 2592 273226 -47817 9575 -64245
15092B4106a90488A01711D4074N7998K43614E3623R653R3782k4190D9643N60840
$$ 24106 -190488 101711 44074 102072 345686 53623 63276 157058 132868 49643 610483
15081F10483c7634A80029b16807e1521A20429L27780L4462a1419B4476b24684
$$ 610483 -37634 180029 -216807 -51521 120429 448209 482671 -11419 24476 -224684
15070A25754K11147k5060j41172p8303O7727a00608F5896L58931a47590A41751
$$ 125754 336901 311841 170669 92366 160093 -100608 65896 424827 -147590 141751
15059B77018p0460C6945J62505J30965K4920c8151B50613J26773A69020a85233
$$ 277018 206558 36945 199450 330415 355335 -38151 250613 377386 169020 -185233
15048A37984J62667j8007a6795A32805L58384A44471b11102E7542J89333J3323
$$ 137984 300651 282644 -16795 132805 491189 144471 -211102 57542 246875 260198
15038B60198r9322p0360L89937A43347D1922N4724M393b13938A11577K90207n0558
$$ 260198 160876 90516 480453 143347 41922 96646 101039 -213938 111577 401784 351226
15027C51226g7096C63283j54362q8746a6204B80656I7848J98831j00501a19005
$$ 351226 -77096 363283 208921 120175 -16204 280656 97848 296679 196178 -119005
15016B63865o5266k9545J67167Q2617j35509M5213K59304i9382E9482K17456l5151
$$ 263865 198599 169054 336221 418838 283329 328542 587846 -99382 59482 276938 241787
15005B41787J7992l6719j07477L5438k6816j3538J22706p8825C6816J8261K25494
$$ 241787 259779 223060 115583 151021 124205 110667 233373 154548 36816 55077 280571
14994B80571G9802b83848A22104a3800E07029G346K86013m8376J13873A33438
$$ 280571 79802 -283848 122104 -13800 507029 7346 293359 244983 358856 133438
14983A88191B8214J58670b62141C43266H0302M10065m3624B05531i6569d0903
$$ 188191 28214 186884 -262141 343266 80302 490367 446743 205531 -96569 -40903
14972B52668P1261J92683C8181L89572k10262E8562P1412J20909I6540K23018
$$ 252668 323929 516612 38181 427753 217491 58562 129974 250883 96540 319558
14962C19558j40999h1387B44804K1435M6660j48902R9123N0415j49536O105J21029
$$ 319558 178559 -81387 244804 266239 312899 163997 263120 313535 163999 170104 291133
14951B91133h0225A79716f2141B63202j28800C8786O00394B02610F9472K70602
$$ 291133 -80225 179716 -62141 263202 134402 38786 639180 202610 69472 340074
14941C40074m3383O5890j37879a1165A527J86953K9256k1319L51101k58060R5875
$$ 340074 296691 362581 224702 -11165 1527 188480 217736 196417 547518 289458 385333
14930C85333k8051A8191d4899A87262K13636r5317p4741L86889B50376I7135l4693
$$ 385333 357282 18191 -44899 187262 400898 305581 230840 617729 250376 97135 62442
14919F2442g9686A58052J72107M2635E2584J04769K24077N9389j14084q6767L0543
$$ 62442 -79686 158052 330159 372794 52584 157353 381430 440819 326735 239968 270511
14908B70511n0286K3521J88935b0725D41942j17489M5457o5693L1956r8361A16088
$$ 270511 220225 243746 432681 -20725 441942 324453 369910 304217 336173 237812 116088
14896E83596A62142J34696j09003L97377k03056K1265J37511j40487a53609B40157
$$ 583596 162142 296838 187835 585212 382156 403421 540932 400445 -153609 240157
14885A2897K60192k6681K09693r6897d955C69056p3412k5186r1509J27607A27794
$$ 12897 273089 246408 456101 359204 -4955 369056 295644 270458 178949 306556 127794
14873f4879D51536j53386k0062j5574Q7952M6253K09499r6183j46091L52787l22278
$$ -64879 451536 298150 278088 262514 350466 396719 606218 510035 363944 716731 394453
14862C94453n2927A22158L54931O4829G0316K81996m0567A30252J58984R9700
$$ 394453 341526 122158 477089 541918 70316 352312 311745 130252 289236 388936
14852C88936n3977L6680J81155k73677J31810h1518C50160o5756K03959p0124
$$ 388936 334959 371639 552794 279117 410927 -81518 350160 284404 488363 418239
14842D18239j05118L81381A75457J00632P7038K97040B49231J92419j94929K90422
$$ 418239 313121 694502 175457 276089 353127 650167 249231 441650 246721 537143
14832E37143J37453k24031j39653I5077K72809j71467J82995L95100l55900L15783
$$ 537143 674596 450565 310912 95077 367886 196419 379414 774514 418614 734397
14822G34397q6268K3001k86481j3896J90930j51562j20894n4055J97856K79194
$$ 734397 648129 671130 384649 370753 561683 410121 289227 235172 433028 712222
14812G12222H8375L58669q5340M0888N1280J40311j07981N0912A69409J52773
$$ 712222 88375 447044 361704 402592 453872 594183 486202 537114 169409 322182
14802C22182K5639p0818J87336N9489K70945l13890K39253l37082N5656l3631
$$ 322182 347821 277003 464339 523828 794773 480883 720136 383054 438710 405079
14792D05079R0644Q8307j32106m097K74817l48255L82184k28309J80028C9446
$$ 405079 495723 584030 451924 447827 722644 374389 756573 528264 708292 39446
14781E70699J70056j87418j58049L1899J528M3739K2611p0564P6361o5775K16544
$$ 570699 740755 553337 395288 427187 428715 472454 495065 424501 500862 435087 651631
14770F51631k09682J58720j78196M87504g7880E80822j06483Q979q7913J59998
$$ 651631 441949 600669 422473 909977 -77880 580822 474339 483318 395405 555403
14760E55403j06719o3461L67174P7383k56634j92957K6904L49875j04940q8208
$$ 555403 448684 385223 752397 829780 573146 380189 407093 756968 652028 563820
14750E63820K84021j34449l6307k05815J06568K79420k08407k38652L50941q0184
$$ 563820 847841 713392 677085 471270 577838 857258 648851 410199 761140 680956
14740F80956j38124K1735M984K36368j89883n3602J34688j5706k37136L97957
$$ 680956 542832 564567 569551 805919 616036 562434 697122 681416 444280 842237
14730H42237j77366j4481L5786k07451P8578j4241L44222j61739k07988L63082
$$ 842237 664871 650390 686176 478725 557303 543062 887284 725545 517557 880639
14720H80639r1371j19539N81172E60535J20362P2217j67765R4877m791K85848
$$ 880639 789268 669729 1250901 560535 680897 753114 585349 680226 675435 961283
14710I61283j76792K4649j78003P3864K14002J20m11203J68338j8048K4974k42885
$$ 961283 784491 809140 631137 705001 919003 919123 507920 676258 658210 683184 440299
14699D40299N3460K77663J55614j76368M2276M5044J68210m28509K83964q7442
$$ 440299 493759 771422 927036 750668 792944 837988 1006198 577689 861653 774211
14689G74211R7012l65737J60693L48044K3957k84931j19258J60928J13042J01018
$$ 774211 871223 505486 666179 1014223 1038180 753249 633991 794919 907961 1008979
14679A008979j78177j66403R7106j25216J42971L39305l14050j80675M60537k72221
$$ 1008979 830802 664399 761505 636289 779260 1118565 804515 623840 1084377 812156
14669H12156K70301l60832K15541k4565l1535j47385L81896J02728m34704J63769
$$ 812156 1082457 721625 937166 912601 881066 733681 1115577 1218305 783601 947370
14659I47370L18414J6228j33777l22304L25839O7070o8804q2934l46316J88444
$$ 947370 1265784 1282012 1148235 825931 1151770 1218840 1150036 1067102 720786 909230
14649I09230j13256L59398k48413j81946M93577j23180l59810M25230J91053l45388
$$ 909230 795974 1155372 906959 725013 1218590 1095410 735600 1160830 1351883 1006495
14639A006495O4493m31359L86310N5118K11833p3702k24803J49680Q5042l99978
$$ 1006495 1070988 639629 1025939 1081057 1292890 1219188 994385 1144065 1229107 829129
14629H29129L76213O5665q0553J86088l96110K89033j13605r9497l0647O91459
$$ 829129 1205342 1271007 1190454 1376542 980432 1269465 1155860 1056363 1025716 1717175
14619A717175m36990k07147L29703m6399K02524k23961l13703M13419N2503l2500
$$ 1717175 1280185 1073038 1402741 1356342 1558866 1334905 1021202 1434621 1487124 1454624
14609A454624r9644j45716L30794n6068O3460J46943l53682N76519l00437o6077
$$ 1454624 1354980 1209264 1540058 1483990 1547450 1694393 1340711 1917230 1616793 1550716
14599A550716N5827J42033j57424K8794j73089K51412l71576K14760K5484l0855
$$ 1550716 1606543 1748576 1591152 1619946 1446857 1698269 1326693 1541453 1566937 1536082
14589A536082j22117P6647K92184p5640k3830l06701m541J66484J54245n1541
$$ 1536082 1413965 1490612 1782796 1707156 1683326 1376625 1372084 1538568 1692813 1641272
14579A641272O661k04480R7644J03707J97043R2983j57060K63717j31259j52571
$$ 1641272 1647933 1443453 1541097 1644804 1841847 1934830 1777770 2041487 1910228 1757657
14569A757657K33761L8822J10935l67115N14535n55199K24582K29799L3711M65415
$$ 1757657 1991418 2030240 2141175 1774060 2288595 1733396 1957978 2187777 2221488 2686903
14559B686903k5343j10892J87421j72987K84859K81077J7676N35643K66606J280365
$$ 2686903 2661560 2550668 2738089 2565102 2849961 3131038 3148714 3684357 3950963 5231328
14549E231328J684953K981393R067219J6426300O958264A9837647H626357D031940
$$ 5231328 6916281 9897674 18964893 35391193 42349457 19837647 8626357 4031940
14540C174782r28200l61417R6026k33203J80699j79781J2249j648M2631N6025
$$ 3174782 2246582 1885165 1981191 1747988 1928687 1748906 1761155 1759507 1802138 1858163
14530A858163j7774O8563j57406K54616l17640J48126O4267M35676m23336O2193
$$ 1858163 1840389 1908952 1751546 2006162 1688522 1836648 1900915 2336591 1913255 1975448
14520A975448M01961j81205L1194P0265K17734k97218J42464L97082m42627K30911
$$ 1975448 2377409 2196204 2227398 2297663 2515397 2218179 2360643 2757725 2315098 2546009
14510B546009J70852l92257k57423L33340M8956J36999J75502Q1071k35645j2688
$$ 2546009 2716861 2324604 2067181 2400521 2449477 2586476 2761978 2843049 2607404 2594716
14500B594716M00717k8737j63859M4937j0255k33526L90765l02766J51900p8329
$$ 2594716 2995433 2966696 2802837 2847774 2837519 2603993 2994758 2691992 2843892 2765563
14490B765563L02859l54143M15702p6500M9294N55341j46772P9667k60242K85194
$$ 2765563 3068422 2714279 3129981 3053481 3102775 3658116 3511344 3591011 3330769 3615963
14480C615963j86698N69O8169k28821o3532N72175k30701J9863K41102j01220
$$ 3615963 3429265 3429834 3498003 3269182 3205650 3777825 3547124 3566987 3808089 3706869
14470C706869M36559N4163k14374Q0658j90226L77908j34220M9818J25796j32592
$$ 3706869 4143428 4197591 3983217 4063875 3873649 4251557 4117337 4167155 4292951 4160359
14460D160359J35461K19178l51590K32726j76479J77390j94533N09502O5722j26295
$$ 4160359 4295820 4514998 4163408 4396134 4219655 4397045 4202512 4712014 4777736 4651441
14450D651441k13393N41524j56055j92219K84032K6518q419L79342j48971j14354
$$ 4651441 4438048 4979572 4823517 4631298 4915330 4941848 4933429 5312771 5163800 5049446
14440E049446N75856o8149r3205K84609l04801M54316R3425n125k18879K65618
$$ 5049446 5625302 5557153 5463948 5748557 5443756 5898072 5991497 5986372 5767493 6033111
14430F033111K37937J05992k53859L30251j16617J20925L24821K67598l7017K02583
$$ 6033111 6271048 6377040 6123181 6453432 6336815 6457740 6782561 7050159 7013142 7215725
14420G215725k30615n9578K53946K42440J96006j46915m1828K2126R6701L48725
$$ 7215725 6985110 6925532 7179478 7421918 7617924 7471009 7429181 7451307 7548008 7896733
14410G896733R3702O19971l27976K80290j16963m8550K15791J30674J08479M01278
$$ 7896733 7990435 8610406 8282430 8562720 8445757 8397207 8612998 8743672 8852151 9253429
14400I253429M12969P5650J91942j45874k8681N45858Q1088N31014n3975k22604
$$ 9253429 9666398 9742048 9933990 9788116 9759435 10305293 10386381 10917395 10863420 10640816
14390A0640816L09446L31239L66613l9339M19413j72522O42858M9941K24664L39228
$$ 10640816 10950262 11281501 11648114 11608775 12028188 11855666 12498524 12548465 12773129 13112357
14380A3112357P6840M25181r1613N15444K9287L64956P30591J13610J63302L69598
$$ 13112357 13189197 13614378 13522765 14038209 14067496 14432452 15163043 15276653 15439955 15809553
14370A5809553M59459R8777J10001L23601N34930K64108K33979P34870N25496
$$ 15809553 16269012 16367789 16477790 16801391 17336321 17600429 17834408 18569278 19094774
14361A9094774K15759O66031j09316J027147O580M49888M69470N84236N22318
$$ 19094774 19310533 19976564 19867248 20894395 20900975 21350863 21820333 22404569 22926887
14352B2926887N54952O15887N66443O56351O59607P34267N79392O85437Q73566
$$ 22926887 23481839 24097726 24664169 25320520 25980127 26714394 27293786 27979223 28852789
14343B8852789R31749L79710R93284Q90010P95969J133033O39519J126424J279525
$$ 28852789 29784538 30164248 31157532 32047542 32843511 33976544 34616063 35742487 37022012
14334C7022012P08257J252228J438182J129825J336983J315041J281203J737913
$$ 37022012 37730269 38982497 40420679 41550504 42887487 44202528 45483731 47221644
14326D7221644J360328J582665K004880J446466J895050K255295J804334K191969
$$ 47221644 48581972 50164637 52169517 53615983 55511033 57766328 59570662 61762631
14318F1762631K488016K478876K303156L069405K822134K860459K901024L502400
$$ 61762631 64250647 66729523 69032679 72102084 74924218 77784677 80685701 84188101
14310H4188101L225356M147584L815889M438745M426067M700770M956746N291262
$$ 84188101 87413457 91561041 95376930 99815675 104241742 108942512 113899258 119190520
14302A19190520N796866O274045N705866O895046P105604P848613P509648Q388773
$$ 119190520 124987386 131261431 136967297 143862343 150967947 158816560 166326208 174714981
14294A74714981Q623736R276939J0437808J0200702J0936168J1444522J2145100
$$ 174714981 183338717 192615656 203053464 213254166 224190334 235634856 247779956
14287B47779956J2573778J2769300J3908774J3574876J4206435J4081250J3879504
$$ 247779956 260353734 273123034 287031808 300606684 314813119 328894369 342773873
14280C42773873J3832706J3561885J2794960J2060428J0713807R632071Q147093
$$ 342773873 356606579 370168464 382963424 395023852 405737659 415369730 423516823
14273D23516823O203031K455009o65252j071272j295037l520397m660465p187678
$$ 423516823 429719854 432174863 431509611 430438339 429143302 425622905 420962440 413774762
14265D13774762r075781j0620707j1753087j2905647j4064490j4393173j4742541
$$ 413774762 404698981 394078274 382325187 369419540 355355050 340961877 326219336
14258C26219336j4843350j5049046j4382405j3292800j3213784j2736776j2467119
$$ 326219336 311375986 296326940 281944535 268651735 255437951 242701175 230234056
14251B30234056j1661633j1177551j0366801j0249589r393134q858433p917826
$$ 230234056 218572423 207394872 197028071 186778482 177385348 168526915 160609089
14244A60609089p648818p312342o998679o581173o336705n738180m821184n325616
$$ 160609089 152960271 145647929 138649250 132068077 125731372 119993192 115172008 109846392
14236A09846392m765981m347509m462331l840178l641464l138736l510908l331108
$$ 109846392 105080411 100732902 96270571 92430393 88788929 85650193 82139285 78808177
14228G8808177l231387l094539k625083k910921j734432k530453k295797j851259
$$ 78808177 75576790 72482251 69857168 66946247 65211815 62681362 60385565 58534306
14220E8534306k156507j593470j717280k408390j362430j627855j166016j218202
$$ 58534306 56377799 54784329 53067049 50658659 49296229 47668374 46502358 45284156
14212D5284156j666417j508892j225921j006815j023216p60332o91344j393450
$$ 45284156 43617739 42108847 40882926 39876111 38852895 38092563 37401219 36007769
14204C6007769j228846q38532j289829n42603m31408j027886j277961q80046p20890
$$ 36007769 34778923 33940391 32650562 32107959 31676551 30648665 29370704 28490658 27769768
14195B7769768j22275p72125o02735q95494o73228p29488j68653p40358m33761
$$ 27769768 27647493 26875368 26272633 25377139 24703911 23974423 23805770 23065412 22631651
14186B2631651n58081q38687j4417o57145m92432J6464o51403l39481r19876R9773
$$ 22631651 22073570 21234883 21220466 20563321 20070889 20087353 19435950 19096469 18176593 18276366
14176A8276366o64524k97078j31946m49062m18701k01527l39634l82236j10830
$$ 18276366 17611842 17314764 17182818 16733756 16315055 16113528 15773894 15391658 15280828
14167A5280828n49225j17929k35563l99499j40998l05782j45182n30764k28549
$$ 15280828 14731603 14613674 14378111 13978612 13837614 13531832 13386650 12855886 12627337
14158A2627337k85153O9445o6396n40660j6636o9876k93088k35454j64772j05009
$$ 12627337 12342184 12411629 12345233 11804573 11787937 11718061 11424973 11189519 11024747 10919738
14148A0919738q4229n42161Q4p8136k67326N5985j57887j05606k08951l08871
$$ 10919738 10835509 10293348 10293432 10215296 9947970 10003955 9846068 9740462 9531511 9222640
14138I222640k68490o1890J401l90156l3001r2754J75874j34764j34498j55281
$$ 9222640 8954150 8892260 8893661 8503505 8470504 8377750 8553624 8418860 8284362 8129081
14128H129081j48409j22778j75269J04998k71106j76337K13825j11097l79601
$$ 8129081 7980672 7857894 7682625 7787623 7516517 7340180 7554005 7442908 7063307
14119G063307J87461l25132N2704r8477j94115j46345J52440j37425j51080j27535
$$ 7063307 7250768 6925636 6978340 6879863 6685748 6539403 6691843 6554418 6403338 6275803
14109F275803m856l26028k5437J43812l77578J53126l6625m01571K01315k42794
$$ 6275803 6270947 5944919 5919482 6063294 5685716 5838842 5802217 5400646 5601961 5359167
14099E359167L17621l12897j05263j6183o3430k34287J58703l2746K1155L47004
$$ 5359167 5676788 5363891 5258628 5242445 5179015 4944728 5103431 5070685 5091840 5438844
14089E438844n39692O9463O1626l55860j20144L00588j76692k94247K85926l56146
$$ 5438844 4899152 4968615 5030241 4674381 4554237 4854825 4678133 4383886 4669812 4313666
14079D313666k72q5621K11067l87503M05889k77238j0165j84216L09129k31592
$$ 4313666 4313394 4227773 4438840 4051337 4457226 4179988 4169823 3985607 4294736 4063144
14069D063144j21926L0188p5133l84808M14373l43521K75231l13284L71593L9014
$$ 4063144 3941218 3971406 3896273 3511465 3925838 3582317 3857548 3544264 3915857 3954871
14059C954871k79537K45069j03773O3832m54851N3470R6959m55939P4595J57834
$$ 3954871 3675334 3920403 3816630 3880462 3425611 3479081 3576040 3120101 3194696 3352530
14049C352530J17804l17117o4232J4672j32564L23514k52449j1274j35392j33044
$$ 3352530 3470334 3153217 3088985 3103657 2971093 3294607 3042158 3030884 2895492 2762448
14039B762448J81288r3831P0111q994j12160k6502M55021j78205k99299J8930
$$ 2762448 2943736 2849905 2920016 2911022 2798862 2772360 3227381 3049176 2749877 2768807
14029B768807j9094r1394j2171L19646l85434N9804r1507J41327j64306j25843
$$ 2768807 2749713 2658319 2646148 2965794 2580360 2640164 2548657 2689984 2525678 2399835
14019B399835J09882k41165J37075K78569n13345L59980l8383k26815K74805j63112
$$ 2399835 2509717 2268552 2405627 2684196 2170851 2530831 2492448 2265633 2540438 2377326
14009B377326R339k77298M7460K62451j19744k57934j7468O5764l08380M73371
$$ 2377326 2386665 2109367 2156827 2419278 2299534 2041600 2024132 2089896 1781516 2254887
13999B254887J0414l17187J03386K99280j86008L6783k12212K73597K3596q525
$$ 2254887 2265301 1948114 2051500 2350780 2164772 2201555 1989343 2262940 2286536 2278011
13989B278011J544024J498126O817069J6445112J4961648j9350837j1999113m829313
$$ 2278011 3822035 5320161 12137230 28582342 43543990 24193153 12194040 7364727
13981G364727j785538q97495q73149j43137m35932m44464l96467M43013m87755
$$ 7364727 5579189 4681694 3808545 3665408 3229476 2785012 2388545 2831558 2343803
13972B343803M80164n67430j05503J09378j78969m9139K1297j22149K39501k08106
$$ 2343803 2823967 2256537 2151034 2260412 2081443 2032304 2053601 1931452 2170953 1962847
13962A962847j08122k37955K40866K99632m55520j04362M00266l84200K57068
$$ 1962847 1854725 1616770 1857636 2157268 1701748 1597386 1997652 1613452 1870520
13953A870520k85486M87490m08591K21037K84111m80384j72277K54769j50746
$$ 1870520 1585034 2072524 1663933 1884970 2169081 1688697 1516420 1771189 1620443
13944A620443J49363L7216k32899M0439L128K61960n19758m2812K79133k92162
$$ 1620443 1769806 1807022 1574123 1614562 1617690 1879650 1359892 1317080 1596213 1304051
13934A304051r616K22719J47136l73505K59257J34740l63989j03946L60445k969
$$ 1304051 1294435 1517154 1664290 1290785 1550042 1684782 1320793 1216847 1577292 1574323
13924A574323J10728j08122Q2583j88861J53832j4511j43972j57542n5507p5801
$$ 1574323 1685051 1576929 1659512 1470651 1624483 1609972 1466000 1308458 1252951 1177150
13914A177150L52345j71531J77372k71950P288J60313K37577m28337m1947K41804
$$ 1177150 1529495 1357964 1535336 1263386 1270674 1430987 1668564 1240227 1198280 1440084
13904A440084P1142Q112l38426p3078Q9705M700J3890J60850M7816l17370J34079
$$ 1440084 1511226 1519338 1180912 1107834 1197539 1202239 1216129 1376979 1424795 1107425 1241504
13893A241504O3617j13826O5619m0843l45288L72974Q4375l92380L10048J35221
$$ 1241504 1305121 1191295 1256914 1216071 870783 1243757 1328132 935752 1245800 1381021
13883A381021n20395M55128k00175K47934l34061j63386K05779R0720k1982j78652
$$ 1381021 860626 1315754 1115579 1363513 1029452 866066 1071845 1162565 1140583 961931
13873I61931J80366m32501J55305n1289N44928k87242k17529J92018j55937L9832
$$ 961931 1142297 709796 865101 813812 1358740 1071498 853969 1045987 890050 929882
13863I29882J7161k52555N72016j32255j59775k31204r9483N9297K46283m03294
$$ 929882 947043 694488 1266504 1134249 974474 743270 643787 703084 949367 546073
13853E46073K72097j44760M39741j22308l61510M77787R4820k76531J03509j17889
$$ 546073 818170 673410 1113151 990843 629333 1107120 1201940 925409 1028918 911029
13843I11029l9238j79747K08230J0327J72214j12840j06346j31852K56856k8538
$$ 911029 871791 692044 900274 910601 1082815 969975 863629 731777 988633 960095
13833I60095J29627k33688K84848j80930j61147L74356k96296N5250j99592j69971
$$ 960095 1089722 856034 1140882 959952 798805 1173161 876865 932115 732523 562552
13823E62552L34704k25198J53163L83774k24424k86247L15745l45104K03463K08167
$$ 562552 897256 672058 825221 1208995 984571 698324 1014069 668965 872428 1080595
13813A080595D73265M32273l53610j9469K10549K59997m66986K71586C59438J10438
$$ 1080595 473265 905538 551928 532459 743008 1003005 536019 807605 359438 469876
13803D69876L64732k79338L33588j491q6700J03029J53516l97817K23907l48233
$$ 469876 834608 555270 888858 887367 800667 903696 1057212 659395 883302 535069
13793E35069K02157j43448n6891K80649j37085j03960n1524Q0616K90788R7866
$$ 535069 737226 593778 536887 817536 680451 576491 524967 605583 896371 994237
13783I94237l84803j10990J78513Q3681J22384j23600O5431N0397j53656j43331
$$ 994237 609434 498444 676957 760638 883022 759422 824853 875250 721594 578263
13773E78263k43806M26153k90122J81319K21561j42639B22339J90564Q8974K74622
$$ 578263 334457 760610 470488 651807 873368 730729 222339 412903 501877 776499
13763G76499k78901p0306P6973K78342q1277l05567L14887j06790N982L11375
$$ 776499 497598 427292 504265 782607 701330 395763 710650 603860 609842 921217
13753I21217D02267J66898J91623G9159M81484J74280q440j45799J64312o4305
$$ 921217 402267 569165 760788 79159 560643 734923 726483 580684 744996 680691
13743F80691k38749j81808m0234j7760m6983O95665k05488j86310K64834k16968
$$ 680691 441942 260134 219900 202140 155157 850822 645334 459024 723858 506890
13733E06890o220K8488J07150j00259J97703j34025K51342C15299J62292J85043
$$ 506890 500670 529158 636308 536049 733752 599727 851069 315299 477591 662634
13723F62634L11261l96219r4172r3077P9819J67752k00372J52419j54300J44485
$$ 662634 973895 577676 483504 390427 470246 637998 437626 590045 435745 580230
13713E80230k00744j32430K68033j81152J8186K68957P6296p0796o2469o2305
$$ 580230 379486 247056 515089 333937 352123 621080 697376 626580 564111 501806
13703E01806K27674A04305K77247K84361B89027L26155n1205B54632L14548A27275
$$ 501806 729480 104305 381552 665913 289027 615182 563977 254632 569180 127275
13692E73808N762j36239J11324M7692k41409K87454k99695Q0276A62119K48564
$$ 573808 579570 443331 554655 602347 360938 648392 348697 428973 162119 410683
13682D10683r5333J28883m1180j17304a0313A93485K52636q8332J60877b1088
$$ 410683 315350 444233 403053 285749 -10313 193485 446121 357789 518666 -21088
13671B02215Q98526D23143K145B09924M95995k55267j7584L943J8742j0225L87759
$$ 202215 1100741 423143 425288 209924 705919 450652 433068 437011 455753 445528 833287
13660H33287C96838j72777L11116k23842K83037o9748j21214A02429L88912r012
$$ 833287 396838 224061 535177 311335 594372 524624 403410 102429 491341 482329
13650D82329d5390D66801k24614K67536q5979n9603j68623M10862A70337J58107
$$ 482329 -45390 466801 242187 509723 423744 364141 195518 606380 170337 328444
13640C28444J57639M79B03195L08216J32958k43669m0262A73851M02821j3344
$$ 328444 486083 486562 203195 511411 644369 400700 360438 173851 576672 563328
13630E63328j10353k0788Q6767k20698K26736j49692M08455B48694F9395P71462
$$ 563328 452975 432187 518954 298256 524992 375300 783755 248694 69395 840857
13620H40857k91838e2017B06699K55977k03911p884A02155J82415p3701G8425
$$ 840857 549019 -52017 206699 462676 258765 250881 102155 284570 210869 78425
13609A12610K59871E8994M03561o8563p7205L22881k39729j47838N87041l10353
$$ 112610 372481 58994 462555 393992 316787 639668 399939 252101 839142 528789
13599E28789J65420j96417A73876L36694j93749A26846L44687q9844O5876n9093
$$ 528789 694209 497792 173876 510570 316821 126846 471533 381689 447565 388472
13589C88472J52337A72766G2097R5392M12343j12727j1893B17740j1868J42055
$$ 388472 540809 172766 72097 167489 579832 467105 455212 217740 205872 347927
13579C47927M4019A20324K50390o0005K9638B9724L43437j16322O5065q6160K54763
$$ 347927 391946 120324 370714 310709 340347 29724 373161 256839 321904 235744 490507
13568D90507r0431p5471D2108d4909D26794j71026L10425A86413C2268e998A88981
$$ 490507 400076 324605 42108 -44909 426794 255768 566193 186413 32268 -5998 188981
13556C41804O998J21538j80255J79916A44702L42713A94606g1850D07510b5851
$$ 341804 348802 470340 290085 470001 144702 487415 194606 -71850 407510 -25851
13545C06274j37423d536C56163A63037A7000J44656N6119J04856j58576j3960
$$ 306274 168851 -4536 356163 163037 17000 161656 217775 322631 164055 150095
13535A50095M14422A75446K95896J56332a76039C20135J4478F7841N0438R3803
$$ 150095 564517 175446 471342 627674 -176039 320135 334613 67841 118279 212082
13525B12082K17662k12101k3220O6941J10001G8610N13666A82024A4232O95673
$$ 212082 429744 217643 194423 261364 371365 78610 592276 182024 14232 709905
13515G09905A54013L447f1510F9361J46087K26068j06274K6558A19515l1513L05871
$$ 709905 154013 157460 -61510 69361 215448 441516 335242 361800 119515 88002 393873
13504C93873j62065C4318K17869J76372A72365Q9081b326H4626L86969n6418E0490
$$ 393873 231808 34318 252187 428559 172365 261446 -2326 84626 471595 415177 50490
13492D36052j61192J33360D4319N5986Q5755J69562A2433L54660j35981J51619
$$ 436052 274860 408220 44319 100305 186060 355622 12433 367093 231112 382731
13482C82731j62922P7153L11696B74381g750D28395a00815G6822M1557J11269
$$ 382731 219809 296962 608658 274381 -7750 428395 -100815 76822 118379 229648
13472B29648O5141K72239J34687B07936K27223j88660J33307j64140J45283A42011
$$ 229648 294789 567028 701715 207936 435159 246499 379806 215666 360949 142011
13461H5135K05970n7218m9606D6984J04730O9553a08220B32556L52286b43749
$$ 85135 291105 233887 184281 46984 151714 221267 -108220 232556 584842 -243749
13450H6798a56642A73410J31133k2224J4578r9962C5680K89977J195j23451l3257
$$ 86798 -156642 173410 304543 282319 296897 196935 35680 325657 326852 203401 170144
13439A70144d7300C67355A20048C8204J23236A3569J31211L5705J54525K58895
$$ 170144 -47300 367355 120048 38204 161440 13569 144780 180485 335010 593905
13429E93905i9092D94047j19336b00559D11058F3771O3670L83937b634j24730
$$ 593905 -99092 494047 374711 -200559 411058 63771 127441 511378 -2634 -127364
13419a27364L1014A82252D7774K49200p3499o2785G9563h9787C87048j31157j1270
$$ -127364 -96350 182252 47774 296974 223475 160690 79563 -89787 387048 255891 244621
13408B44621E8596N0959J71651C4586f2951J2694A31486J92490K4320j00371q1637
$$ 244621 58596 109555 281206 34586 -62951 -50257 131486 323976 348296 247925 166288
13397A66288j5992k9158J68759G4788G580b2191B10367K89989B29865e0936A00262
$$ 166288 150296 121138 289897 74788 7580 -22191 210367 500356 229865 -50936 100262
13385F7059j8347D231b06637A63506L0388N0393H3544a5825l7329A15644C2666
$$ 67059 48712 4231 -206637 163506 193894 244287 83544 -15825 -53154 115644 32666
13373A28280L2467J63433P990j08367K61629A75289b4160D72401A67759J3299
$$ 128280 160747 324180 332170 223803 485432 175289 -24160 472401 167759 181058
13363A81058l0413m9286J63251K151j5546K9125q8849Q8998o5065N2015R9528
$$ 181058 150645 101359 264610 266761 251215 280340 191491 280489 215424 267439 366967
13352C66967H5799J42968G367h2885A56416J02281N0068L09173k23425q7107A5796
$$ 366967 85799 228767 7367 -82885 156416 258697 308765 617938 394513 307406 15796
13340E1248N20092j72280B6691J15840O0162o7517f5939E1294K86776r9477f0036
$$ 51248 571340 399060 26691 142531 202693 135176 -65939 51294 338070 238593 -60036
13328c2736A36946M08783A96901M8355n120I3718i6497A12747J938L71886A58069
$$ -32736 136946 545729 196901 245256 240136 93718 -96497 112747 114685 486571 158069
13316b11040C2297J18974C3136L14803A13205K9618D069K28252J02090C1481J94964
$$ -211040 32297 151271 33136 347939 113205 142823 4069 232321 334411 31481 226445
13305B26445K58844H4411R2973e7574F9770K40316A01881e0571C30102h194F43352
$$ 226445 485289 84411 177384 -57574 69770 310086 101881 -50571 330102 -8194 643352
13293B53766b09962B64044L3052j10202O1334H5084C6120b21047C22165a55829
$$ 253766 -209962 264044 297096 186894 248228 85084 36120 -221047 322165 -155829
13282a19581A92054G6198M0987a0705E1502J75180m407J44793A48369N3843j2035
$$ -119581 192054 76198 117185 -10705 51502 226682 222275 367068 148369 202212 190177
13271A90177J8878J74374j88303L60276A92784I5780b17507B89146M1174B4399
$$ 190177 209055 383429 195126 555402 192784 95780 -217507 289146 330320 24399
13260A47537h4451A920a69348f4123B83245j28326R3439n2154K3134M4762A692
$$ 147537 -84451 1920 -169348 -64123 283245 154919 248358 196204 219338 264100 1692
13248H1891O0229O5382d0277C59215j8598d4835B62703i1270B35713f08A76794
$$ 81891 142120 207502 -40277 359215 340617 -44835 262703 -91270 235713 -608 176794
13236C06769F4313P6913o2070P6065J67158q7230j9377D0115h2653A53926h9606
$$ 306769 64313 141226 79156 155221 322379 235149 215772 40115 -82653 153926 -89606
13224B72945E2261b4543A2462J57800a8295C32404g1812B83859c6028P193A4031
$$ 272945 52261 -24543 12462 170262 -18295 332404 -71812 283859 -36028 -28835 14031
13212B98865A00929l4876J3088N8230b02348A20862K61558A59099a13609B56934
$$ 298865 100929 66053 79141 137371 -202348 120862 382420 159099 -113609 256934
13201B91913D6848a09889p9441E46043G5685N9032b958l69829a00163j02486B35411
$$ 291913 46848 -109889 -189330 546043 75685 134717 -2958 -372787 -100163 -202649 235411
13189A44824M04456c9986C73054c3819B7401H888d6403C29625F6318R6742G5771
$$ 144824 549280 -39986 373054 -33819 27401 8888 -46403 329625 66318 163060 75771
13177A286J24810D8693J35616D9304b03538e5289j28626D74409A94302J5197B7100
$$ 1286 126096 48693 184309 49304 -203538 -55289 -183915 474409 194302 209499 27100
13165B9888J36758C9216M222L9736O6718K325n6767J53251F1916b29873E67094
$$ 29888 166646 39216 43438 83174 149892 152217 95450 248701 61916 -229873 567094
13153h1087B87450F2010b4701A09570K86454j96757L3441G8845K58690A37929
$$ -81087 287450 62010 -24701 109570 396024 199267 232708 78845 337535 137929
13142a20031c1200A14379J55495E502L6616J75633K5125b3656j60801E3668M076
$$ -120031 -31200 114379 269874 5502 42118 217751 242876 -23656 -184457 53668 57744
13131E7744J15509D010a47874c7B95094d6495k398j66397a02249C24345F6904
$$ 57744 173253 4010 -147874 -37 295094 -46495 -48893 -215290 -102249 324345 66904
13119g9514m4370I7162P8616b5557j8512F939b65440d1845k73087d6416D0832
$$ -79514 -123884 97162 175778 -25557 -44069 6939 -265440 -41845 -314932 -46416 40832
13107I2439K34291j06519Q9052j44543p7011g3439A21147L7823O6377G8351L78777
$$ 92439 326730 220211 309263 164720 87709 -73439 121147 158970 225347 78351 457128
13096D57128k05855b96407A80533a1231j96309n6106B11980a75380j0895I1439
$$ 457128 251273 -296407 180533 -11231 -207540 -263646 211980 -175380 -186275 91439
13085a28786C92339A88483m1357b4139A32127J9239K3828b12924n3477A3537K40557
$$ -128786 392339 188483 147126 -24139 132127 151366 175194 -212924 -266401 13537 254094
13074B54094l7070K64640j87313F8178b890D84048f830p5348A31333J17219e7109
$$ 254094 217024 481664 294351 68178 -2890 484048 -6830 -82178 131333 248552 -57109
13062E7701a35037A44703a79064N878A19432D0070a14437B21289a31892C03735
$$ 57701 -135037 144703 -179064 -173186 119432 40070 -114437 221289 -131892 303735
13051b3101A83879J1533a3447E21509e4654B34604r932C853J75929K20852q4803
$$ -23101 183879 195412 -13447 521509 -54654 234604 224672 3853 179782 400634 315831
13040C15831H7499O653P8063b63342B14441C1280M86852A12564J56098P8708A55492
$$ 315831 87499 94152 172215 -263342 214441 31280 518132 112564 268662 347370 155492
13028G2173c15136b919B96539h5260M0356G8762J96973H6192K8858J84518H4252
$$ 72173 -315136 -2919 296539 -85260 -44904 78762 275735 86192 115050 299568 84252
13016b60505I0327i8571B94992j20043p9398J02255G0490K0358b2265m1416B15694
$$ -260505 90327 -98571 294992 174949 95551 197806 70490 90848 -22265 -63681 215694
13004a30644A78987Q4896a6954B9141L9980b91977A17364g029o5167q4312A65515
$$ -130644 178987 263883 -16954 29141 69121 -291977 117364 -7029 -72196 -156508 165515
12992B09370d815B8604a00139D1524a16026r6565b4023B54844k8546b09177B03652
$$ 209370 -4815 28604 -100139 41524 -116026 -212591 -24023 254844 226298 -209177 203652
12980E2909J0042c691j88032A62722B7689A078L96656b23673I9861Q9263H8293
$$ 52909 62951 -3691 -191723 162722 27689 1078 397734 -223673 99861 189124 88293
12968b9687F7124b13494j25678B93265h5329H2914a65841G4225N6392J10068h7920
$$ -29687 67124 -213494 -339172 293265 -85329 82914 -165841 74225 130617 240685 -87920
12956A0552N0585M8537J55327b88254A39174a70173H4278a94919B74528j18068
$$ 10552 61137 109674 265001 -288254 139174 -170173 84278 -194919 274528 156460
12946A56460e6854G6878L56165G2916a18869F4651J65710L42881b0193k58431
$$ 156460 -56854 76878 433043 72916 -118869 64651 230361 573242 -20193 -278624
12936b78624a33908H1703a91297H9789j9199f8678I0369K7110L8894g0088G2735
$$ -278624 -133908 81703 -191297 89789 70590 -68678 90369 117479 156373 -70088 72735
12924b72973J13443p0171D36668A38962e3672A42463K52667D2933J20861a70536
$$ -272973 -159530 -229701 436668 138962 -53672 142463 395130 42933 163794 -170536
12913A0822R4997h5085C57221A59080O7827n6732a0385C30757b52690E5742M8785
$$ 10822 105819 -85085 357221 159080 226907 170175 -10385 330757 -252690 55742 104527
12902A04527M3373n6060j6744f7462j73709e7320A10881g4458B1761K76132j29013
$$ 104527 147900 91840 75096 -67462 -241171 -57320 110881 -74458 21761 297893 168880
12891A68880K28264a53269c6312j3316q7575B3895b81618P9581g7441H1265D024
$$ 168880 397144 -153269 -36312 -49628 -137203 23895 -281618 -202037 -77441 81265 4024
12879C90012e5637C7492K33168l085a89221c6173A10414O5940M6187d6039b0100
$$ 390012 -55637 37492 270660 267575 -189221 -36173 110414 176354 222541 -46039 -20100
12867a88746A20674J25741b94027C21239c66325a20502B35796M5705l2989j16019
$$ -188746 120674 246415 -294027 321239 -366325 -120502 235796 281501 248512 132493
12857A32493J05613B3773L2079O8434B7465a72966e3757A36929F1184A0909J55150
$$ 132493 238106 23773 55852 124286 27465 -172966 -53757 136929 61184 10909 166059
12846A66059R5998I5152M8638E9353D910K55943a43374A561N7469a52254A59965
$$ 166059 262057 95152 143790 59353 4910 260853 -143374 1561 59030 -152254 159965
12834b3520B94927j19661C7452a58135C99709A50346D6810e07457A83103a26431
$$ -23520 294927 175266 37452 -158135 399709 150346 46810 -507457 183103 -126431
12823a84424F7992K51338a31210B344K2058j50N7970a00838o6515F8446a1815
$$ -184424 67992 319330 -131210 2344 24402 24252 82222 -100838 -167353 68446 -11815
12811b54555a01918L8743E3835K42615F6925J81504A20612J78231M2698b40111
$$ -254555 -101918 -63175 53835 296450 66925 248429 120612 298843 341541 -240111
12800a09385q092A98941C2250J74315l9848H2413a1047A02484M8225A5285J10996
$$ -109385 -117477 198941 32250 206565 166717 82413 -11047 102484 150709 15285 126281
12789A26281J46869K8751b13027M4046A19942c06990f1938j63574A75560L4505
$$ 126281 273150 301901 -213027 -168981 119942 -306990 -61938 -225512 175560 210065
12779B10065a6737q1842a2917D8396E750N00195B05650G08d4661E8544M05094
$$ 210065 -16737 -98579 -12917 48396 5750 505945 205650 708 -44661 58544 463638
12768D63638A67555d9588j16494A83720g206C03443A3680L8337i4496m2128N9638
$$ 463638 167555 -49588 -166082 183720 -7206 303443 13680 52017 -94496 -136624 -76986
12757g6986F6893J17971K0483p5339g5256A65785c52447H4756D0497b9028B7867
$$ -76986 66893 184864 205347 130008 -75256 165785 -352447 84756 40497 -29028 27867
12745f8788K0904A09404P5879n5020c8646p165j97233D08557k01080K38332B09100
$$ -68788 -47884 109404 185283 130263 -38646 -45811 -243044 408557 207477 445809 209100
12733E7742J27239d25914a11298A68179b1739A05391a7806q7854J3531k13608
$$ 57742 184981 -425914 -111298 168179 -21739 105391 -17806 -105660 -92129 -305737
12723c05737F6814a0557A0529O4477R2105m1074b15619E4311d2859o2637G3683
$$ -305737 66814 -10557 10529 75006 167111 126037 -215619 54311 -42859 -105496 73683
12711a85576A11604R5333J2621J16114n5342K47945n4744q8508n9105j25731G1151
$$ -185576 111604 206937 219558 335672 280330 528275 473531 385023 325918 200187 71151
12699A72867c74093F2435K62979h7514A62103E1798b4321C98698H595N1993J2856
$$ 172867 -374093 62435 325414 -87514 162103 51798 -24321 398698 8595 60588 73444
12688G3444J16659G8831a52461n6061h9954A63022d3837A14595J04926A06993
$$ 73444 190103 78831 -152461 -208522 -89954 163022 -43837 114595 219521 106993
12677A60942o7698P8822m1842C4794K9025r713e3015b5868q801k53029B40436
$$ 160942 93244 172066 130224 34794 63819 54106 -53015 -25868 -34669 -287698 240436
12665B07513f5046B1558c37013B75830a38956B8090J30544a35256A29782K6583
$$ 207513 -65046 21558 -337013 275830 -138956 28090 158634 -135256 129782 156365
12655A56365O6438f4372A88085J3911p8844a0089G82a3155l06976b1563k3223
$$ 156365 222803 -64372 188085 201996 123152 -10089 782 -13155 -320131 -21563 -44786
12644d4786A40983D489J31506N7930a65100G410K48145a74354h0324B2436a55605
$$ -44786 140983 4489 135995 193925 -165100 7410 255555 -174354 -80324 22436 -155605
12632a43226D4054K69691O9598M6944j66048I0166D2266a80960c9987A08501K5179
$$ -143226 44054 313745 383343 430287 264239 90166 42266 -180960 -39987 108501 133680
12621A33680P3621P3930J04367E1896R4274b90538A60798m7751a39479r8912C0173
$$ 133680 207301 281231 385598 51896 146170 -290538 160798 113047 -139479 -238391 30173
12609A57884G6167c18373D0342a1965C30929j17448o4741k1238P9507O8345B8012
$$ 157884 76167 -318373 40342 -11965 330929 213481 148740 127502 207009 275354 28012
12597B9757K07480G7620L4137J88080b63144A62466f6409A1361K61571a75082
$$ 29757 237237 77620 111757 299837 -263144 162466 -66409 11361 272932 -175082
12586A2329N5492a64628j2534B31318p8929a23802A04180j5273C2076K39482b58981
$$ 12329 67821 -164628 -177162 231318 152389 -123802 104180 88907 32076 271558 -258981
12574H0430J17857E687J01241J31978b66738f9234C22133C2064K17718c13771
$$ 80430 198287 5687 106928 238906 -266738 -69234 322133 32064 249782 -313771
12563I8527J56941l7754h8192j07521E231J41648m3882D3545a05778L1737D1396
$$ 98527 255468 217714 -88192 -195713 5231 146879 102997 43545 -105778 -74041 41396
12551c63492A28018R2091a42488I1389p531a68294D2577J09728a59821c2267B2538
$$ -363492 128018 220109 -142488 91389 83858 -168294 42577 152305 -159821 -32267 22538
12539A97682k4797K6816l6072O419h4906A88759k144E7421J46684a19341A08372
$$ 197682 172885 199701 163629 170048 -84906 188759 186615 57421 204105 -119341 108372
12527A36160f2933B12670E2362R0120J26027A04061a5329A04109b63212A88012
$$ 136160 -62933 212670 52362 142482 268509 104061 -15329 104109 -263212 188012
12516A17911O6030e0596j39217A91310c6639F1740a09302D70128c721B09719I7339
$$ 117911 183941 -50596 -189813 191310 -36639 61740 -109302 470128 -3721 209719 97339
12504b03667Q8557M4181C04943b94759j20582M9140F0821a41878j1350B8888a81152
$$ -203667 -115110 -70929 304943 -294759 -415341 -366201 60821 -141878 -153228 28888 -181152
12492a91577h1379p3146r84P5490H8389Q7492q0318A0689J9074O3709q280d52721
$$ -191577 -81379 -154525 -155509 -80019 88389 175881 95563 10689 29763 93472 85192 -452721
12479A7625a68737g106A15274a64222I3530L538b52682A37276C7881O3136A0609
$$ 17625 -168737 -7106 115274 -164222 93530 97068 -252682 137276 37881 101017 10609
12467i2397F1063J87134a32490H4361K6389J43348f5584B6366a86472d9067j37519
$$ -92397 61063 248197 -132490 84361 110750 254098 -65584 26366 -186472 -49067 -186586
12456a86586D56054A05824g0712A37512b45389m2941a06574k9307E0837b80660
$$ -186586 456054 105824 -70712 137512 -245389 -288330 -106574 -135881 50837 -280660
12445h2199c3485B32282o7688F8739a41458B25896G1148h9489q1813o0969A36945
$$ -82199 -33485 232282 164594 68739 -141458 225896 71148 -89489 -171302 -232271 136945
12433E6335L11097g0314p0790d3598l17693F059J28374b59729A8716a00414M2036
$$ 56335 367432 -70314 -141104 -43598 -361291 6059 134433 -259729 18716 -100414 -58378
12422e8378B64433d39106A0416J8276j0131b0370k09973f7591l09992B34939c4207
$$ -58378 264433 -439106 10416 28692 18561 -20370 -230343 -67591 -377583 234939 -34207
12410E7145c4967k37137B32768a52351P3430k37461F1575J5765C7693K46899a46570
$$ 57145 -34967 -272104 232768 -152351 -78921 -316382 61575 77340 37693 284592 -146570
12398A31017F2707a40036j18626B20685l8511a91649c3679q2777j11063E6386
$$ 131017 62707 -140036 -258662 220685 182174 -191649 -33679 -116456 -227519 56386
12387g3482B0155d55501B70059d9756B3361b2404A6964a7905l711I4699a95050
$$ -73482 20155 -455501 270059 -49756 23361 -22404 16964 -17905 -21616 94699 -195050
12375i3432M6513F1320j8750M2766L9465O4233H1427l5712c6310j51412E6398
$$ -93432 -46919 61320 42570 85336 124801 189034 81427 45715 -36310 -187722 56398
12363A66439m8850c42629e6697j23217M2875M8833L7565D24955j12363H8975h3553
$$ 166439 117589 -342629 -56697 -179914 -137039 -88206 -50641 424955 312592 88975 -83553
12351C9167f4029e951A0812c1733A88366H8846i5632b9168B65941c5732k81625
$$ 39167 -64029 -5951 10812 -31733 188366 88846 -95632 -29168 265941 -35732 -317357
12340c17357A08353b209F8227a80898I3818J1186C7557C607e4202b4929A29077
$$ -317357 108353 -2209 68227 -180898 93818 105004 37557 3607 -54202 -24929 129077
12328A59185Q0739E8627d2963r9743M0728A27569J18139H3717b69238A30974C2066
$$ 159185 239924 58627 -42963 -142706 -101978 127569 245708 83717 -269238 130974 32066
12316d0121A50680E8922a55667j8184p1319A44133i383I2597J71019B4461J43933
$$ -40121 150680 58922 -155667 -173851 -245170 144133 -9383 92597 263616 24461 168394
12305A68394b92128b9474n1572n5620B67129d1065B49763b69829A13417l15K53626
$$ 168394 -292128 -29474 -81046 -136666 267129 -41065 249763 -269829 113417 113102 366728
12294C66728D5376a47710A2731L2479k0976M33984A99213C6536J68942b6235j50592
$$ 366728 45376 -147710 12731 45210 24234 458218 199213 36536 205478 -26235 -176827
12283a76827G4360f5025j30702A82375L06079k22653k2286R2525j16726K21578
$$ -176827 74360 -65025 -195727 182375 488454 265801 243515 336040 219314 440892
12273D40892q8065A46532n8743a19049A85409J4602F7060J53839J08532b90491
$$ 440892 352827 146532 87789 -119049 185409 200011 67060 220899 329431 -290491
12262A45642a50607G970b2028C93832m2785a85738f5550A26907N6889i5143A14720
$$ 145642 -150607 7970 -22028 393832 351047 -185738 -65550 126907 183796 -95143 114720
12250a42421A67768o4229h5486B46903c13299c4514C8086L9033c72921C1395K34772
$$ -142421 167768 103539 -85486 246903 -313299 -34514 38086 77119 -372921 31395 266167
12239B66167i0766K8939B83050r9858K66561F7849c8699C7708i3637k25443m2489
$$ 266167 -90766 -61827 283050 183192 449753 67849 -38699 37708 -93637 -319080 -361569
12228c61569A28595c2618j06905C60456A72656n2686J53985A03535a11204B81263
$$ -361569 128595 -32618 -139523 360456 172656 119970 273955 103535 -111204 281263
12217f8886B83903D9118C340L19392o7113i3477A83044D2477d6516a9175K096
$$ -68886 283903 49118 3340 322732 255619 -93477 183044 42477 -46516 -19175 -17079
12206a7079B76464a00436B6026J43280d9147C62129m3040q6105H6276J7626m5011
$$ -17079 276464 -100436 26026 169306 -49147 362129 319089 232984 86276 103902 58891
12195E8891R0188L67175a38832D10101c36354F7730a33499C2186J6988J13471
$$ 58891 149079 516254 -138832 410101 -336354 67730 -133499 32186 49174 162645
12185A62645f2013q6173B74419p266H2139k4564K3281J72071d6452K2918E1833
$$ 162645 -62013 -148186 274419 267153 82139 57575 80856 252927 -46452 -23534 51833
12173C1603L31673a98911D03777a59356A93358H7553O861A234K4536a08059C99428
$$ 31603 363276 -198911 403777 -159356 193358 87553 94414 1234 25770 -108059 399428
12161a44179D5792J81255b6237B2350P6547e7103j3194B73390N9962c08869e6076
$$ -144179 45792 227047 -26237 22350 98897 -57103 -70297 273390 333352 -308869 -56076
12149c9423K487A09789a48205c4453o0071A61342b15351C34651I3711g8217r5221
$$ -39423 -36936 109789 -148205 -34453 -94524 161342 -215351 334651 93711 -78217 -173438
12138a73438d6867A33082b06775C8680J30265G6220f4261A89678C2614a30894
$$ -173438 -46867 133082 -206775 38680 168945 76220 -64261 189678 32614 -130894
12127B251N9305j4958J02299F9294i8937b5800D05642a20914B1464b32287L0443
$$ 2251 61556 46598 148897 69294 -98937 -25800 405642 -120914 21464 -232287 -201844
12116b01844C33313a33673F3384J77715H6296d2677j8931A2427N9088L63470C1175
$$ -201844 333313 -133673 63384 241099 86296 -42677 -61608 12427 71515 434985 31175
12104A2383J2275K70086j02776E3442P1542J8013g1131B75616a02504A39090d7527
$$ 12383 24658 294744 191968 53442 124984 142997 -71131 275616 -102504 139090 -47527
12092c1379j86815B30412b49142E9580K14376r6994n6906D2938M11009d6806a6937
$$ -31379 -218194 230412 -249142 59580 273956 176962 120056 42938 453947 -46806 -16937
12080A53969b15008i5967c0223k46701o1205a40283e6960A95022P65567R03397
$$ 153969 -215008 -95967 -30223 -276924 -338129 -140283 -56960 195022 960589 1863986
12070A863986I15228B80159J32032d6385B81973j30785o8953b7078j280k51277
$$ 1863986 915228 280159 412191 -46385 281973 151188 82235 -27078 -28358 -279635
12060b79635A53194j9116k7897a48485A69721R079G2084J00987c18952a41015
$$ -279635 153194 134078 106181 -148485 169721 178800 72084 173071 -318952 -141015
12049A6669j327Q6632a04437a5818F3630J34995d61592b5125o5336B96856b8461
$$ 16669 15342 101974 -104437 -15818 63630 198625 -461592 -25125 -90461 296856 -28461
12037A52885a00266j09225D7079B0311c64513C6075h5640j2202p0176N638f1589
$$ 152885 -100266 -209491 47079 20311 -364513 36075 -85640 -97842 -168018 -162380 -61589
12025C03068b59751d558C0920J39499c5647H8405N3783a6955j029B74304A11229
$$ 303068 -259751 -4558 30920 170419 -35647 88405 142188 -16955 -17984 274304 111229
12013A28406a72521E3166b7270A97231D5265a55123E9389c7552l0749j55756B02499
$$ 128406 -172521 53166 -27270 197231 45265 -155123 59389 -37552 -68301 -224057 202499
12001A55263b03606N0594e3936A49715c45795B30121a07119M4178H2887a309D7142
$$ 155263 -203606 -153012 -53936 149715 -345795 230121 -107119 -62941 82887 -1309 47142
11989E9189c27224J14886B69415j10900a31017L0261l9152F6356P330a5754A4009
$$ 59189 -327224 -212338 269415 158515 -131017 -100756 -139908 66356 73686 -15754 14009
11977A65929A2282a41483A63823n3402j9206b88992B2875c330j3365l42130J07505
$$ 165929 12282 -141483 163823 110421 91215 -288992 22875 -3330 -16695 -358825 -251320
11966b51320J25620f2481E22379a69266A05825A219b62383e387n8980A9689L14879
$$ -251320 -125700 -62481 522379 -169266 105825 1219 -262383 -5387 -64367 19689 334568
11955C34568B5992a67758E6229k0341d487B40365b0451m253l3442B944a62727
$$ 334568 25992 -167758 56229 35888 -4487 240365 -20451 -24704 -58146 2944 -162727
11943H5608J1092K60946a00955M0976j48735R0518B04086a98862A86783n3205
$$ 85608 96700 357646 -100955 -59979 -208714 -118196 204086 -198862 186783 133578
11933A33578h746A07026a04088B24229d03698E91K9217j3179b86341q8036D6855
$$ 133578 -8746 107026 -104088 224229 -403698 591 29808 16629 -286341 -374377 46855
11921H9233N7855a99155A6126a07896b6084j49751q522I0664J23292c30176A11012
$$ 89233 147088 -199155 16126 -107896 -26084 -175835 -184357 90664 213956 -330176 111012
11909B35769b24234B79868j28982b24376A76471g3114j603D6472K2135b3382H3009
$$ 235769 -224234 279868 150886 -224376 176471 -73114 -74717 46472 68607 -23382 83009
11897c15048g9946k63998H5375B3211a15820p5695C70481a02036A2699i7738j28574
$$ -315048 -79946 -343944 85375 23211 -115820 -191515 370481 -102036 12699 -97738 -226312
11886b26312c986j93255B30262K0853c3329A89690d9497j65113B06909m5269a96070
$$ -226312 -3986 -197241 230262 251115 -33329 189690 -49497 -214610 206909 161640 -196070
11874A66014n267A4276M03735d06887J05946l7746H4600J34141f9837j44756g6886
$$ 166014 160747 14276 418011 -406887 -300941 -338687 84600 218741 -69837 -214593 -76886
11862c51063n2014a83072K242B12459a50611k24830a03285A73914e3629D4460
$$ -351063 -403077 -183072 -180830 212459 -150611 -375441 -103285 173914 -53629 44460
11851a51346c7688A93659f6536A38688e6522a5190l77819J15888J29329c5387
$$ -151346 -37688 193659 -66536 138688 -56522 -15190 -393009 -277121 -147792 -35387
11840g5387j74017c7261A74681F4395i9417k41415A56391b797A16896a40004C9981
$$ -75387 -249404 -37261 174681 64395 -99417 -340832 156391 -2797 116896 -140004 39981
11828d5239C27932a75087B35849a35697d5670r0018j36603a1244A01870g0154
$$ -45239 327932 -175087 235849 -135697 -45670 -135688 -272291 -11244 101870 -70154
11817A07014C2306a97817n404L6576L3482B945J54872n0652h0306l3664A62774
$$ 107014 32306 -197817 -203221 -166645 -133163 2945 157817 107165 -80306 -113970 162774
11805A24163N763b56340g0085A29088a93128A45207b01078f4677A50638a27080
$$ 124163 129926 -256340 -70085 129088 -193128 145207 -201078 -64677 150638 -127080
11794B47358a19791m1287L9393F6801F788a7148j79140I5493a42390j68332C9687
$$ 247358 -119791 -161078 -121685 66801 6788 -17148 -196288 95493 -142390 -310722 39687
11782A45453b7811A40502d3656k5624n8686C4422j2200a87625i0431D1871h655
$$ 145453 -27811 140502 -43656 -69280 -127966 34422 22222 -187625 -90431 41871 -8655
11770A15405O5460b53745h4230A03893k0213P277a60459O5486C4568L1175K6864
$$ 115405 180865 -253745 -84230 103893 83680 90957 -160459 -94973 34568 65743 92607
11759I2607i4488I6415O4567b32362O8378A71105a18441d0249A32554m1083D2868
$$ 92607 -94488 96415 160982 -232362 -163984 171105 -118441 -40249 132554 91471 42868
11747F9715B6614c74494C4496K12916c987B23642F9865h0013E8872M7322c13597
$$ 69715 26614 -374494 34496 247412 -3987 223642 69865 -80013 58872 106194 -313597
11735H3190P3687o5991J897L25035j36768G0500O6471b04258A0423b54347A70555
$$ 83190 156877 90886 92783 417818 281050 70500 136971 -204258 10423 -254347 170555
11723e3861A57831A2302L49835A71680a07689B73873A7309a32040I0338e6646
$$ -53861 157831 12302 362137 171680 -107689 273873 17309 -132040 90338 -56646
11712a95066c5318B58056A8603J70531N3823q0m1234A1707K42526e9370D67199
$$ -195066 -35318 258056 18603 189134 242957 242877 201643 11707 254233 -59370 467199
11700g8737D5528M549a91708K3400B11071L6152H553J97038c9453A11083i0090
$$ -78737 45528 50077 -191708 -168308 211071 247223 8553 205591 -39453 111083 -90090
11688a23345J1781B14454a90797G8154J72359b11751j68891a7550A34593F5882
$$ -123345 -111564 214454 -190797 78154 250513 -211751 -380642 -17550 134593 65882
11677f0708A98768r6884a64360A17638a76491A3139K19440J1453G7296J52267
$$ -60708 198768 101884 -164360 117638 -176491 13139 232579 244032 77296 229563
11667B29563d3575B20311B9521L11499b03108B19379a13368B13591b52094A36230
$$ 229563 -43575 220311 29521 341020 -203108 219379 -113368 213591 -252094 136230
11656A62140c03062C6325J1767a88293A88157q8262R2197n039a10899B90897a91160
$$ 162140 -303062 36325 48092 -188293 188157 99895 192092 187053 -110899 290897 -191160
11644a99276C3704J24847p6215f1021I4352j9075P6567b7702I2345a10628p0949
$$ -199276 33704 158551 82336 -61021 94352 75277 151844 -27702 92345 -110628 -181577
11633a81577H4125J4693a68551N8584n4443C9983i7361A08669a22450L058C7360
$$ -181577 84125 98818 -168551 -109967 -164410 39983 -97361 108669 -122450 -119392 37360
11621a33759B68227p8435J23969l2574b13074A40638b204k00738l5217a09733
$$ -133759 268227 189792 313761 281187 -213074 140638 -2204 -202942 -238159 -109733
11610h264A45537K56569c98373A94331a6599B76482j05753b3194k853j3133I5330
$$ -8264 145537 402106 -398373 194331 -16599 276482 170729 -23194 -26047 -39180 95330
11598B65104b83175G192N5900P9994O0056b77071A46221e2833A54925C2102f1208
$$ 265104 -283175 7192 63092 143086 203142 -277071 146221 -52833 154925 32102 -61208
11586B58208j15583J21021q0663E4703g6604C1289M54621b6986A40855f8770A16273
$$ 258208 142625 263646 182983 54703 -76604 31289 485910 -26986 140855 -68770 116273
11574A81271o7175A5624J6445h5174A29248O5345a11289B05464a17782E2621J181
$$ 181271 114096 15624 32069 -85174 129248 194593 -111289 205464 -117782 52621 53802
11563E3802o66c24320C89246A64805D5944J11125J00808K97793e4465l296j1987
$$ 53802 53136 -324320 389246 164805 45944 157069 257877 555670 -54465 -57761 -69748
11552f9748A00043l7503K50594B1202K96249A07319K37381e8156P802A50073F9221
$$ -69748 100043 62540 313134 21202 317451 107319 344700 -58156 -50354 150073 69221
11540E1520L3977J87678j06357P969c26480B47584K0777j25198K48208g8724B20942
$$ 51520 85497 273175 166818 174787 -326480 247584 268361 143163 391371 -78724 220942
11528A09268k2383e4682D11280A41977a36618l68445b13266B27779m3101R2742
$$ 109268 86885 -54682 411280 141977 -136618 -505063 -213266 227779 184678 277420
11518B77420a21757d3279A16963m8970q258J84469a33667I4059O4640P0537F1231
$$ 277420 -121757 -43279 116963 67993 59735 244204 -133667 94059 158699 229236 61231
11506B85726G3043C6501L09325A71383b11850A1221M91243c33013A39332a29564
$$ 285726 73043 36501 345826 171383 -211850 11221 502464 -333013 139332 -129564
11495b1435F5137J67954R0965a11534I810P4535J70421a12297A75371j7488e79086
$$ -21435 65137 233091 324056 -111534 9810 84345 254766 -112297 175371 157883 -579086
11483F5667c4010a354C3930L65644i4547A89352J02061D0769A5467J51954j0317
$$ 65667 -34010 -1354 33930 399574 -94547 189352 291413 40769 15467 167421 157104
11472A57104a74837A29303C1581K68593g1523B68645e4544B62585J52011o4805
$$ 157104 -174837 129303 31581 300174 -71523 268645 -54544 262585 414596 349791
11462C49791p7497J8891A07050g6766A81371i1867A89598M7002a8527C28913j21620
$$ 349791 272294 291185 107050 -76766 181371 -91867 189598 236600 -18527 328913 207293
11451B07293K8030j1162P4716A1849J69373a26008B68876j21871b06A74456N3192
$$ 207293 235323 224161 298877 11849 181222 -126008 268876 147005 -206 174456 227648
11440B27648q2086c02800h4342j61658A5017K3016L05572F0329J34363e005o14196
$$ 227648 145562 -302800 -84342 -246000 15017 38033 343605 60329 194692 -5005 -619201
11429f19201A54194b46036C789J9248g1205A00509a11810l8519d065k22643D38163
$$ -619201 154194 -246036 3789 23037 -71205 100509 -111810 -150329 -4065 -226708 438163
11417A48326i0665L7739C8637a07895A10250g4928R018k93798C78361A81846A68
$$ 148326 -90665 -52926 38637 -107895 110250 -74928 -65910 -359708 378361 181846 168
11405E8045L46040j57343a29302A40272l0761P2440n8995D0517a25397A83632
$$ 58045 404085 246742 -129302 140272 109511 181951 122956 40517 -125397 183632
11394f9704n8332B49141M4332b46031A03504D041b45543B24784c111k22020e5539
$$ -69704 -128036 249141 293473 -246031 103504 4041 -245543 224784 -3111 -225131 -55539
11382a0523k07072d4374A04248L59248c45746d5780A37030b53808B04707g7051
$$ -10523 -217595 -44374 104248 463496 -345746 -45780 137030 -253808 204707 -77051
11371d9946F2421a72463N8014B47980a38289k42107b5859j22303i953I0251f4176
$$ -49946 62421 -172463 -114449 247980 -138289 -380396 -25859 -148162 -9953 90251 -64176
11359C1778c24842J26721A77304b57833M5012o8099A68095h1228l95192h8767
$$ 31778 -324842 -198121 177304 -257833 -212821 -280920 168095 -81228 -476420 -88767
11348b6036k48518A69076l5525a58793C698J58722a12394E26279H8504A7161b03463
$$ -26036 -274554 169076 133551 -158793 3698 162420 -112394 526279 88504 17161 -203463
11336A82561p9903K2198J67687j07452D2722a32636H1092d8031j58837C12127
$$ 182561 102658 124856 292543 185091 42722 -132636 81092 -48031 -206868 312127
11325a69996A61619e9917A83593b0428F0056a50253e0008k21B57593A28416a58023
$$ -169996 161619 -59917 183593 -20428 60056 -150253 -50008 -50229 257593 128416 -158023
11313f7560b0785I727N671J14768E9772k4098J8957c80948A0834J45785a65233
$$ -67560 -20785 9727 15398 130166 59772 35674 54631 -380948 10834 156619 -165233
11301B45312F0107a37957B28154e9097C93703A2072a73523g6152o9991J1776q0726
$$ 245312 60107 -137957 228154 -59097 393703 12072 -173523 -76152 -146143 -134367 -215093
11290b15093A20870a28359A205R9087k3653j6205N538O8130g6269A17788q731
$$ -215093 120870 -128359 1205 100292 76639 60434 65972 134102 -76269 117788 109057
11279A09057a09090K8682A70019e7603J035A12796K04803D6587b84241J3774A96971
$$ 109057 -109090 -80408 170019 -57603 -56568 112796 317599 46587 -284241 -270467 196971
11267f6811p8346P0610q3942B49438e11040E7053r271D099f0598r8155c3517A91237
$$ -66811 -145157 -74547 -158489 249438 -511040 57053 47782 4099 -60598 -158753 -33517 191237
11254b20605B742a7085H8424e2891j4584j43470A0275M3254a38659B06845d3506
$$ -220605 2742 -17085 88424 -52891 -67475 -210945 10275 53529 -138659 206845 -43506
11242G43b21556J10717q6815L3790A85856a01384J2531o0009j06438J09870D3321
$$ 743 -221556 -110839 -197654 -163864 185856 -101384 -88853 -148862 -255300 -145430 43321
11230a19465A52796j8045k392C123M1882b58871A37583b3082A35089c27505a25239
$$ -119465 152796 134751 132359 3123 45005 -258871 137583 -23082 135089 -327505 -125239
11218h1867a9450B50868m7700b64599b8868H7424h2036k19728a30843j9265j16845
$$ -81867 -19450 250868 203168 -264599 -28868 87424 -82036 -301764 -130843 -150108 -266953
11207b66953D2638b09227H4688c58687J26363F3107K07055H5024Q1017a94801
$$ -266953 42638 -209227 84688 -358687 -232324 63107 270162 85024 166041 -194801
11196a52663A28653J12660c47925R4768I3235f8654l1350H5216a34559n8543f0539
$$ -152663 128653 241313 -347925 -253157 93235 -68654 -100004 85216 -134559 -193102 -60539
11184a4910k31782e6547B0417P7192e7682k54713H915K17370h4303c5728k6620
$$ -14910 -246692 -56547 20417 97609 -57682 -312395 8915 226285 -84303 -35728 -62348
11173f2348a7441q9450A70920K65387c26704A55632n1692j0107e2429q0025C8911
$$ -62348 -17441 -106891 170920 436307 -326704 155632 103940 93833 -52429 -132454 38911
11161B66872j12380d7555B60779E861J58933a52301L2995A29460h2197A71349
$$ 266872 154492 -47555 260779 5861 164794 -152301 -119306 129460 -82197 171349
11150A50331F0778b55234J17490k9296j31747B46918b0550C28036F2247B3860
$$ 150331 60778 -255234 -137744 -167040 -298787 246918 -20550 328036 62247 23860
11139F7902a52271a221q15A12680r70L28229A02866J49356a41208A75251o7531
$$ 67902 -152271 -1221 -2036 112680 111710 439939 102866 252222 -141208 175251 107720
11128A07720a12435J3197a7869I3282a71156Q1430A33075E113a21194A75891b10897
$$ 107720 -112435 -99238 -17869 93282 -171156 -89726 133075 5113 -121194 175891 -210897
11116E4789c68186J29650B21190C5456J16681K25941j08683K2016A06077a26358
$$ 54789 -368186 -238536 221190 35456 152137 378078 269395 291411 106077 -126358
11105B49067I5543e2575H1930B5351J10215J3558J5883C3965J53623J93082f3763
$$ 249067 95543 -52575 81930 25351 135566 149124 165007 33965 187588 380670 -63763
11093A74677J85749Q0106C6972J58478Q4035C8095Q3659K07335j07004a95683
$$ 174677 360426 440532 36972 195450 279485 38095 121754 329089 222085 -195683
11082C77724A83147b669B70451A05230O1360k8092J25107e8406A09508E1234J39149
$$ 377724 183147 -2669 270451 105230 166590 138498 263605 -58406 109508 51234 190383
11071A90383E8784L38632a933D19254A34645L01543J79949B28050E0443M24576
$$ 190383 58784 397416 -1933 419254 134645 436188 616137 228050 50443 475019
11061D75019Q1047k51766O4223R4084Q8508J51543l03029N4095Q7602j76632L80234
$$ 475019 556066 304300 368523 462607 551115 702658 399629 453724 541326 364694 744928
11050G44928N8645C84694P0123J2170J25580J78847j70953M1981K03462k30932
$$ 744928 803573 384694 454817 466987 592567 771414 600461 642442 845904 614972
11040F14972R4955k10332j11239M5245J30128k00639K34859p8845j13663K77577
$$ 614972 709927 499595 388356 433601 563729 363090 597949 519104 405441 683018
11030F83018J08756k87666l2348L14909j21965K43797j23656C85618M7268L1765
$$ 683018 791774 504108 471760 786669 664704 908501 784845 385618 432886 464651
11020D64651l277j91367K18368K26482l23933K51179j49369M9235L31811l77199
$$ 464651 461374 270007 488375 714857 390924 642103 492734 541969 873780 496581
11010D96581K797K30616l3801k62080J52267q8343Q7469J05869j76522j78984
$$ 496581 499378 729994 696193 434113 586380 498037 585506 691375 514853 335869
11000C35869K25424L18103k99861J40909l48102L94213j38825B57905M06911n9055
$$ 335869 561293 879396 579535 720444 372342 766555 627730 257905 664816 605761
10990F05761k13544L24829J28279N8679l45387O3043j22279J01912M03895j06005
$$ 605761 392217 717046 845325 904004 558617 621660 499381 601293 1005188 899183
10980H99183n808M80791k62191L74281M2908K9183P20145j32287Q0235J65721
$$ 899183 893375 1374166 1111975 1486256 1529164 1558347 2278492 2146205 2226440 2392161
10970B392161k56434M52185l45900P7346l94025k06096J15134m8534k16220M43081
$$ 2392161 2135727 2587912 2242012 2319358 1925333 1719237 1834371 1785837 1569617 2012698
10960B012698j18446K60164o7672L43559j27240l82501M07417p04856k01090j13435
$$ 2012698 1894252 2154416 2086744 2430303 2303063 1920562 2327979 1623123 1422033 1308598
10950A308598L436l47314l4925k28359k55468j08003A11891J06225P4349J2272
$$ 1308598 1312034 964720 929795 701436 445968 337965 111891 218116 292465 304737
10940C04737K35979k33746k8190J22948r8720A49320J19855F2791a342D43554
$$ 304737 540716 306970 278780 401728 303008 149320 269175 62791 -1342 443554
10929A70935j6605A2315K17056a4261j02642C12104m9255j2999j20920l6475N3886
$$ 170935 154330 12315 229371 -14261 -116903 312104 262849 249850 128930 92455 146341
10918A46341D7026g3042A52330h9497B0894M5031B0414J57992a6799j23437B02015
$$ 146341 47026 -73042 152330 -89497 20894 65925 20414 178406 -16799 -140236 202015
10906c40460B32952d6792A18792I16O3833J68671a01736L7857C24057A9441P7822
$$ -340460 232952 -46792 118792 916 64749 233420 -101736 -63879 324057 19441 97263
10895I7263Q4696K00463b55159f4922F0998K33123b72988a7468A15291c47085
$$ 97263 181959 382422 -255159 -64922 60998 294121 -272988 -17468 115291 -347085
10884f5236l9542c8244j33188e8413A33165b2902k26807C3383J18229l1900n1136
$$ -65236 -104778 -38244 -171432 -58413 133165 -22902 -249709 33383 151612 119712 68576
10873F8576b70866J07432j5350k07586d3823A9074i7424j44517i7297p0993A23462
$$ 68576 -270866 -163434 -178784 -386370 -43823 19074 -97424 -241941 -97297 -168290 123462
10861H1506a84783f7608I9073a45113l0998n062k1164i3613J8794k05911B79063
$$ 81506 -184783 -67608 99073 -145113 -176111 -181173 -202337 -93613 -74819 -280730 279063
10849E6108e1763j76116B09084C0250E102O2940G849i9859A44702m8515K42856
$$ 56108 -51763 -227879 209084 30250 5102 68042 7849 -99859 144702 96187 339043
10838C39043I2577l7551a48434A23545f158j31414f5635L360r4581F0407L05493
$$ 339043 92577 55026 -148434 123545 -6158 -137572 -65635 -62275 -156856 60407 365900
10827C65900A15296a59330j92806J02232o8315J12708r2545E6080a49753f9007
$$ 365900 115296 -159330 -352136 -249904 -318219 -205511 -298056 56080 -149753 -69007
10816C09346i8200A82891a65842A39180b8321B34356i6928l8649A63414f8157
$$ 309346 -98200 182891 -165842 139180 -28321 234356 -96928 -135577 163414 -68157
10805A42350i460j14046j71073D0216L8222b0213B6284R1147r817c79304d9356
$$ 142350 -9460 -123506 -294579 40216 78438 -20213 26284 117431 107614 -379304 -49356
10793a9184D0357R7173d4352E7457c2512j50733k88923A16377g6259k46067J0080
$$ -19184 40357 137530 -44352 57457 -32512 -183245 -472168 116377 -76259 -322326 -312246
10782c12246r1682f1521k57686J03456m082k6511f5499D9376b56449C952i354
$$ -312246 -403928 -61521 -319207 -215751 -219833 -246344 -65499 49376 -256449 3952 -9354
10770g4084A46569a57864j4514A58130K5605c0956m5814G4719a55378j39425a32903
$$ -74084 146569 -157864 -172378 158130 183735 -30956 -76770 74719 -155378 -294803 -132903
10758f8791I9430K1813c41476B04080B8340L50605b0203k57551h6608h990j99083
$$ -68791 99430 121243 -341476 204080 28340 378945 -20203 -277754 -86608 -8990 -208073
10747b08073k27976K00712k35923a03195A06142a00472A5691e8447j13152b5858
$$ -208073 -436049 -235337 -471260 -103195 106142 -100472 15691 -58447 -171599 -25858
10736b75625A21744b97770C05379b62721A83019E7228J65651J68757a71132b8616
$$ -275625 121744 -297770 305379 -262721 183019 57228 222879 391636 -171132 -28616
10725b8896k39266B47332D4873K25492b28283B27540a66486N8483A51895J49690
$$ -28896 -268162 247332 44873 270365 -228283 227540 -166486 -108003 151895 301585
10715C01585b5696k5989J451A50047d60744a12413a6186j88965H519b18738f6756
$$ 301585 -25696 -51685 -50234 150047 -460744 -112413 -16186 -205151 8519 -218738 -66756
10703H1503a98520d9213A7727b12559k1690f4764j960C49421B0388b54182q4101
$$ 81503 -198520 -49213 17727 -212559 -234249 -64764 -66724 349421 20388 -254182 -338283
10692c38283i5264j95007B5577J31495L8890i305A60445E3443A4015A098L5601
$$ -338283 -95264 -290271 25577 157072 195962 -9305 160445 53443 14015 1098 36699
10681C6699a13196B08299E3847B1957a77719M2619B73655r1953d01483C65674
$$ 36699 -113196 208299 53847 21957 -177719 -135100 273655 181702 -401483 365674
10670E4163a77196g1428L4873E3660b5895o0888n6915N5710j70581e0113j26700
$$ 54163 -177196 -71428 -36555 53660 -25895 -86783 -143698 -87988 -258569 -50113 -176813
10659a76813H1403k4937a10758q3706j35656d8690A29233a99873k81009A1278
$$ -176813 81403 56466 -110758 -194464 -330120 -48690 129233 -199873 -480882 11278
10648g1199b3046A51884c8687A46330d47188K03136G1095d3956H3099P7140n8084
$$ -71199 -23046 151884 -38687 146330 -447188 -244052 71095 -43956 83099 160239 102155
10637A02155c23901d6612B7559M33639a15364e2997k968m1088A7301K00071C6262
$$ 102155 -323901 -46612 27559 461198 -115364 -52997 -55965 -97053 17301 217372 36262
10625a47763P0579G9379d0427j28392b4405j92066B9855J8651J6643K19230c1125
$$ -147763 -77184 79379 -40427 -168819 -24405 -216471 29855 48506 65149 284379 -31125
10613B52949e0813G2539b45605a01780n2226j9881P9851C77018f48941B55337
$$ 252949 -50813 72539 -245605 -101780 -154006 -173887 -94036 377018 -648941 255337
10602a04217j98312n2938L6818h2545j27713C77J03362a18555n547e4159D6080
$$ -104217 -302529 -355467 -318649 -82545 -210258 377 103739 -118555 -124102 -54159 46080
10590A01153P1853B8016J8736j2808a66211l2537k10555a17664B37451F4372a32690
$$ 101153 173006 28016 46752 33944 -166211 -198748 -409303 -117664 237451 64372 -132690
10578G0607C1714M92812e5495H1457C8608A8475a19719l0018B0243K63798a43555
$$ 70607 31714 524526 -55495 81457 38608 18475 -119719 -149737 20243 284041 -143555
10566B30176a97713K9021j62962B74849A16358g5291B4756K16819h6180B41190
$$ 230176 -197713 -168692 -331654 274849 116358 -75291 24756 241575 -86180 241190
10555B73438F6365a01597j49512D3965a01159j77654l9049j90508K06673a22684
$$ 273438 66365 -101597 -251109 43965 -101159 -278813 -317862 -508370 -301697 -122684
10544A01025C8010J07309b83144b6745j58800A51532R922f4740K5057F1288J05685
$$ 101025 38010 145319 -283144 -26745 -185545 151532 161454 -64740 -39683 61288 166973
10533A66973a85646b9155a251C44188j49654o0793E8556P7936e6896C34825a94360
$$ 166973 -185646 -29155 -1251 344188 194534 133741 58556 136492 -56896 334825 -194360
10521i9255j4925D7570c350m25036A07228c9936k16510d5624D5532a63841I2058
$$ -99255 -114180 47570 -3350 -428386 107228 -39936 -256446 -45624 45532 -163841 92058
10509a04242k18459D1757J10247L51331c30376B08739b8048C28587b6186j15726
$$ -104242 -322701 41757 152004 503335 -330376 208739 -28048 328587 -26186 -141912
10499a41912I7247K42269r1598a49879J9600o0521D80734a08782D2596a34103
$$ -141912 97247 339516 247918 -149879 -130279 -190800 480734 -108782 42596 -134103
10488A80329a15790E7907L7436K87508a21248B26349K80147K84901j52374J46364
$$ 180329 -115790 57907 95343 382851 -121248 226349 506496 791397 639023 785387
10478G85387k75216A53383J71053r2960A12195K40049b36881F3897f8181A86602
$$ 785387 510171 153383 324436 231476 112195 352244 -236881 63897 -68181 186602
10467B29595D5984J8953J19863a18607E9215L9115h3177A6225b84009a11851c2446
$$ 229595 45984 64937 184800 -118607 59215 98330 -83177 16225 -284009 -111851 -32446
10455A84163A2160a58497A63888k5344a61676C6383i1221E3961L03189a46770
$$ 184163 12160 -158497 163888 138544 -161676 36383 -91221 53961 357150 -146770
10444E0501a87695G2415M775g6072B47259a2331H8761f941D6551c04413A34328
$$ 50501 -187695 72415 77190 -76072 247259 -12331 88761 -6941 46551 -304413 134328
10432d2726r2012o3046j99287E2318a61080C576f8289J9004J7153l78096a72764
$$ -42726 -134738 -197784 -397071 52318 -161080 3576 -68289 -49285 -32132 -410228 -172764
10420c1052j67338p224D9003J67704A523d43659a41438M6339L9959I6453b11226
$$ -31052 -198390 -205614 49003 216707 1523 -443659 -141438 -95099 -55140 96453 -211226
10408B83512c40570B09913p451k3521c18745A96442H0178C6689L42867c83849
$$ 283512 -340570 209913 202462 178941 -318745 196442 80178 36689 379556 -383849
10397C05445j33426K1282a12029C9325I443g0415E3468Q7466J18636a50078j8909
$$ 305445 172019 193301 -112029 39325 9443 -70415 53468 140934 259570 -150078 -168987
10386a68987B26744J3848O5936a96951D7176K36725A18827a67426A79444g4692
$$ -168987 226744 240592 306528 -196951 47176 283901 118827 -167426 179444 -74692
10375B56532j0025j4215o1684g1157a4939D92994B07110K17936r0348N129I0162
$$ 256532 246507 232292 170608 -71157 -14939 492994 207110 425046 334698 339827 90162
10363A79374a13780D45667a23444A97189l4170l278K65351j70145E1071O9982
$$ 179374 -113780 445667 -123444 197189 163019 159741 425092 254947 51071 121053
10353A21053J6592O0424K13493j8841P3958k6272J37541j91812j24292K61736
$$ 121053 137645 198069 411562 392721 466679 440407 577948 386136 261844 523580
10343E23580J21548A83044Q2430R2926A08596K87549n5835A68618p0651J02866
$$ 523580 645128 183044 265474 358400 108596 396145 340310 168618 97967 200833
10333B00833A3946a34741A67628o5901a96121f2044j95265a6651B375J5630K53210
$$ 200833 13946 -134741 167628 101727 -196121 -62044 -257309 -16651 2375 18005 271215
10322B71215a39003B33174J2337h5289A5735R1119d14601B59107P8528M118a27015
$$ 271215 -139003 233174 245511 -85289 15735 106854 -414601 259107 337635 341753 -127015
10310A24587J9171O124b10989A42555A7536f3052f881A33857b69177l7043B66768
$$ 124587 143758 149882 -210989 142555 17536 -63052 -6881 133857 -269177 -306220 266768
10298B73490a7011M999G4604Q3321b5905o4343K5095E2054P800c74411h4458A86793
$$ 273490 -17011 -12012 74604 157925 -25905 -90248 -65153 52054 59854 -374411 -84458 186793
10285C7765Q9683K41000a19775j7322m6884m6350A76470D5822b25023F8269j7132
$$ 37765 127448 368448 -119775 -137097 -183981 -230331 176470 45822 -225023 68269 51137
10274E1137b1159E1705b82710F3875c6984a5245I4368j7208e0082m3355j62203
$$ 51137 -21159 51705 -282710 63875 -36984 -15245 94368 77160 -50082 -93437 -255640
10263b55640Q1804A0144K77323D8922J92052K28946A83425l9739n7119J32666
$$ -255640 -173836 10144 287467 48922 240974 469920 183425 143686 86567 219233
10253B19233B8999c16764e5008D34048J50066B14567q0970a74589j75131f806
$$ 219233 28999 -316764 -55008 434048 584114 214567 133597 -174589 -349720 -6806
10242i8392o8748k7037A62469m4392l0490c23547C742J48596b97264R2499C00286
$$ -98392 -167140 -194177 162469 118077 87587 -323547 3742 152338 -297264 -204765 300286
10230e9999n0961r7350g3883n9986C18167b08709D6117a95916n5577P4042j17887
$$ -59999 -110960 -208310 -73883 -133869 318167 -208709 46117 -195916 -251493 -177451 -295338
10219b95338H3480d38307D8036a84264C03911b05882O5421o7535B18187J8671
$$ -295338 83480 -438307 48036 -184264 303911 -205882 -140461 -207996 218187 236858
10209B36858M0476a13666G340b15947F542a78245l1432K1159l2114A90902A886
$$ 236858 277334 -113666 7340 -215947 6542 -178245 -209677 -188518 -220632 190902 1886
10197A72221A1140b08047l00681b20914E3228P5063C0559a59052B2945d8226A1330
$$ 172221 11140 -208047 -508728 -220914 53228 128291 30559 -159052 22945 -48226 11330
10185g1279j00008m1894b9547k08887l1116O3854f3921j37962k7825I7066J25586
$$ -71279 -171287 -213181 -29547 -238434 -269550 -205696 -63921 -201883 -229708 97066 222652
10174B22652a62563B31347j07517C5918b58399N1727i1709l0880j97701R5768
$$ 222652 -162563 231347 123830 35918 -258399 -206672 -91709 -122589 -320290 -224522
10164b24522C24108B9847a75405J7589A54294L380p1586J43309A6670b21954e0035
$$ -224522 324108 29847 -175405 -157816 154294 157674 86088 229397 16670 -221954 -50035
10152f5283q1039A54091a16033l6817O4227k10320C50879b04837A15581P0413
$$ -65283 -146322 154091 -116033 -152850 -88623 -298943 350879 -204837 115581 185994
10142A85994K4744k2270a42135E7204B6371q400O7377b52449i8766A28261i0291
$$ 185994 210738 188468 -142135 57204 26371 17971 85348 -252449 -98766 128261 -90291
10130H4681b74532H6562i8813A53828b4494P883j12226o4330F9695b56369J0746
$$ 84681 -274532 86562 -98813 153828 -24494 -16611 -128837 -193167 69695 -256369 -245623
10119b45623k48601h3249n33633a08619j9572O1990l32845B09325a64103f8861
$$ -245623 -494224 -83249 -616882 -108619 -128191 -66201 -399046 209325 -164103 -68861
10108c00489a883A53256A2399O1830j0113j0029a46517j5591a8130F6559a99430
$$ -300489 -1883 153256 12399 74229 64116 54087 -146517 -162108 -18130 66559 -199430
10096c54949J71086d1509m8458q2883a7991D8015b78453K3366A40889a92346A10599
$$ -354949 -183863 -41509 -89967 -172850 -17991 48015 -278453 -255087 140889 -192346 110599
10084B5200L53963a90768C8884b48731E2443N2068g5610B7035K298e39223A07340
$$ 25200 379163 -190768 38884 -248731 52443 104511 -75610 27035 29333 -539223 107340
10072d1709j04089j7950G8985b44132L4358A57707a20687B14327F7306a4675A48343
$$ -41709 -145798 -163748 78985 -244132 -209774 157707 -120687 214327 67306 -14675 148343
10060c08803a8415A44966J72081g8210j34034H7094a20487m3802a0801H7311J34168
$$ -308803 -18415 144966 317047 -78210 -212244 87094 -120487 -164289 -10801 87311 221479
10049B21479I7692a08281l502j24910n4703E2820c02417b7604A66544b49890E8805
$$ 221479 97692 -108281 -111783 -236693 -291396 52820 -302417 -27604 166544 -249890 58805
10037a39175j16633J16747A71434K0728G7162b10913J1435l5170E8806a38909
$$ -139175 -255808 -139061 171434 192162 77162 -210913 -199478 -234648 58806 -138909
10026C36049B9159b83390C91619a49774j30804f7321B11141a09134c8502j6185
$$ 336049 29159 -283390 391619 -149774 -280578 -67321 211141 -109134 -38502 -54687
10016e4687j34670f7388n8500A19734J42683a13617d2513l8999A12208L3322a25849
$$ -54687 -189357 -67388 -125888 119734 262417 -113617 -42513 -81512 112208 145530 -125849
10004B3862g5406k19046B06310D1137a82058K2173P8246A87285E0854h8043l77743
$$ 23862 -75406 -294452 206310 41137 -182058 -159885 -81639 187285 50854 -88043 -465786
9993d65786B4368a45435I8160L9478d48356b22725A75869a57542C400R339J60313
$$ -465786 24368 -145435 98160 137638 -448356 -222725 175869 -157542 3400 12739 173052
9982A73052J2122n467b48445a11254D8204b36664a09760l39746b07922R9582a103
$$ 173052 185174 179707 -248445 -111254 48204 -236664 -109760 -449506 -207922 -108340 -1103
9970a5315A97017b26201K2885f5321a6057A37762a94678j22086a02426A78730
$$ -15315 197017 -226201 -203316 -65321 -16057 137762 -194678 -316764 -102426 178730
9959d048k05504N8043j23567m0313J43386g5105B96075a90885j20928a48101o2624
$$ -4048 -209552 -151509 -275076 -315389 -172003 -75105 296075 -190885 -311813 -148101 -210725
9948b10725E0194a20274k09549c3086H3368J6023L7875b14015P3261d4377k1805
$$ -210725 50194 -120274 -329823 -33086 83368 99391 137266 -214015 -140754 -44377 -66182
9937f6182B94051i7601B36623j09881c61511E100b65589l24746C7413i2250C8956
$$ -66182 294051 -97601 236623 126742 -361511 5100 -265589 -590335 37413 -92250 38956
9925E6595j2515b0541B4783h5780d0935k41403A92759a11070l28002c2409H3658
$$ 56595 44080 -20541 24783 -85780 -40935 -282338 192759 -111070 -439072 -32409 83658
9913e4984B3950K4709M0335I416b5747C9885K1305e2201B5822E274O6455l0177
$$ -54984 23950 48659 88994 9416 -25747 39885 61190 -52201 25822 5274 71729 41552
9901D1552c17486J00765B28356N9621e3639m8183k03758A01091d9928k12533D6755
$$ 41552 -317486 -216721 228356 287977 -53639 -101822 -305580 101091 -49928 -262461 46755
9889a87823E405a6857k28944A67001d57112f0043C5010i9564j10883f3316D70658
$$ -187823 5405 -16857 -245801 167001 -457112 -60043 35010 -99564 -210447 -63316 470658
9877B09898B66J69134C6229b32148e0578k80931J44049O0766e0201I1780C4116
$$ 209898 266 169400 36229 -232148 -50578 -331509 -187460 -126694 -50201 91780 34116
9865f2438k24388a22349j2519A59316F7908F269Q9594a3079A00939K67156b27020
$$ -62438 -286826 -122349 -134868 159316 67908 6269 95863 -13079 100939 368095 -227020
9853E0259b56571b4636j16733C2846a90597j83383d9084j98960R4239O1346k58429
$$ 50259 -256571 -24636 -141369 32846 -190597 -373980 -49084 -248044 -153805 -92459 -350888
9842c50888J23395k4539k0501d6599e618b043l52712a59937q3353d9274j64204
$$ -350888 -227493 -252032 -272533 -46599 -5618 -2043 -354755 -159937 -243290 -49274 -213478
9831b13478J0809M7812C27831b49002B5736g3125k03309O7928J03894B02819R6169
$$ -213478 -202669 -154857 327831 -249002 25736 -73125 -276434 -208506 -104612 202819 298988
9820B98988j21672a35375L8724j0921C0639r311a67264E1177b38040n4784A96464
$$ 298988 177316 -135375 -96651 -107572 30639 21328 -167264 51177 -238040 -292824 196464
9808b9327p5117F7824b59720K0409a8553j28736F2891b02969H2309c19729a16760
$$ -29327 -104444 67824 -259720 -239311 -18553 -147289 62891 -202969 82309 -319729 -116760
9796C20741H3126a05193H1129d2810I9965B9489P5963b86447D9415c08004P3288
$$ 320741 83126 -105193 81129 -42810 99965 29489 105452 -286447 49415 -308004 -234716
9785b34716d6444j72356B8676a11135n2454B99622h4537J398m2833j11738G452
$$ -234716 -46444 -218800 28676 -111135 -163589 299622 -84537 -83139 -125972 -237710 7452
9773h3763l65451B27674d4971O371a3325A4958d26063J49493L3313E5644d5109
$$ -83763 -449214 227674 -44971 -38600 -13325 14958 -426063 -276570 -243257 55644 -45109
9761A01622c35476e229j09625A05794b64595a0564D7969b93612J41694g3387j86933
$$ 101622 -335476 -5229 -114854 105794 -264595 -10564 47969 -293612 -151918 -73387 -260320
9750b60320A23133a00021j4420K5608A2519b51725O1457C34239g8871B1418K9229
$$ -260320 123133 -100021 -114441 -88833 12519 -251725 -190268 334239 -78871 21418 50647
9739E0647a56337J2886A84005Q7251j14116B0826L50475B3078R8048L4871e5594
$$ 50647 -156337 -143451 184005 271256 157140 20826 371301 23078 121126 155997 -55594
9727a75098O6522B67158I2986C8568c0910J3978k47952h9734k70257h8612A41328
$$ -175098 -108576 267158 92986 38568 -30910 -16932 -264884 -89734 -359991 -88612 141328
9715I4508c66841J19892C3490a08735m7089A36673k6231c91694a3173B4642a4222
$$ 94508 -366841 -246949 33490 -108735 -155824 136673 110442 -391694 -13173 24642 -14222
9703A67223E4963b5355m07244A22594h1997L7813j86581c833A28485C221J29104
$$ 167223 54963 -25355 -432599 122594 -81997 -44184 -230765 -3833 128485 3221 132325
9692A32325d8062H2736h6225A2788a80608A12295a03784m0817A61893Q8400f1807
$$ 132325 -48062 82736 -86225 12788 -180608 112295 -103784 -144601 161893 250293 -61807
9680b93416Q3078b3711A31108b93041a5297j54332f8753j07146H6591b0094j8614
$$ -293416 -210338 -23711 131108 -293041 -15297 -169629 -68753 -175899 86591 -20094 -38708
9669c8708k10715B31928j10795A5984a02242B51687a37635A51141d2173a8741
$$ -38708 -249423 231928 121133 15984 -102242 251687 -137635 151141 -42173 -18741
9658c9882A4286a01750A44070c67460J21060l1255R3761j2404L1257O9823j784
$$ -39882 14286 -101750 144070 -367460 -246400 -277655 -183894 -196298 -165041 -95218 -97002
9647i7002l1946j41473A24713b99926F2188P7720m4496a76809L4817I7991b65342
$$ -97002 -128948 -270421 124713 -299926 62188 139908 95412 -176809 -141992 97991 -265342
9635a43041B8884E740c44594a18483L2045n3444A81549a68667k01672n7562f0309
$$ -143041 28884 5740 -344594 -118483 -86438 -139882 181549 -168667 -370339 -427901 -60309
9623A88775a43055K0026B75293b26070g0697A2709N2841b35546O8576A70881a37937
$$ 188775 -143055 -123029 275293 -226070 -70697 12709 65550 -235546 -166970 170881 -137937
9611a22504A01521b10393A82668g9817r9434O0792j23223P2825k0181q8720D9234
$$ -122504 101521 -210393 182668 -79817 -179251 -118459 -241682 -168857 -189038 -277758 49234
9599B95987e8874j57536A20037H532b12236F5321M4164K74537d1054G9422L3449
$$ 295987 -58874 -216410 120037 8532 -212236 65321 109485 384022 -41054 79422 112871
9588A12871i3113j1625j04473K8472B40124R4817j25415B2673K2471b35820J01790
$$ 112871 -93113 -104738 -209211 -180739 240124 334941 209526 22673 45144 -235820 -134030
9577a34030A19911n4749b8627o853a1415C15997j25527b86938J21156j00724J10839
$$ -134030 119911 65162 -28627 -35480 -11415 315997 190470 -286938 -165782 -266506 -155667
9566a55667D9327a88178A01225a04811r2970k51157D8891k2927O5445e8109k05534
$$ -155667 49327 -188178 101225 -104811 -197781 -448938 48891 25964 91409 -58109 -263643
9555b63643i3406k5358A0350a98576A15747K08273a6231C71603q0608c1050J27
$$ -263643 -93406 -118764 10350 -198576 115747 324020 -16231 371603 290995 -31050 -30923
9544c0923j53386d8776j69397r4686a22702A10227j5359L858K0130a61176J2443
$$ -30923 -184309 -48776 -218173 -312859 -122702 110227 94868 98726 118856 -161176 -148733
9533a48733E4680N6189d18276i1749o9644B6410n240b34845Q1631n6702B2636
$$ -148733 54680 110869 -418276 -91749 -161393 26410 21170 -234845 -153214 -209916 22636
9521a66294A00781b36363A91699D3698N022b60017r2312a42744A19517c14193
$$ -166294 100781 -236363 191699 43698 48720 -260017 -352329 -142744 119517 -314193
9510B13525d0082m8523m37228a75214k017P9255n8955l3432A46206c19524J21766
$$ 213525 -40082 -88605 -525833 -175214 -177231 -97976 -156931 -190363 146206 -319524 -197758
9499a97758A94779a91131j1925f9857k8697H989J14757b09629q1391h2350E3480
$$ -197758 194779 -191131 -203056 -69857 -98554 8989 123746 -209629 -291020 -82350 53480
9487A56655C5259a50723B25414b45113A7932J86023j6035f3317j15977d467A4980
$$ 156655 35259 -150723 225414 -245113 17932 203955 187920 -63317 -179294 -4467 14980
9475a91246d5488j27275j743e8091m25038D6350J10266F1777a7392B85933E6873
$$ -191246 -45488 -172763 -174506 -58091 -483129 46350 156616 61777 -17392 285933 56873
9463c12537C70067A55379e4664j1421o2249m61312K67183a10095A46386L3309
$$ -312537 370067 155379 -54664 -66085 -128334 -589646 -322463 -110095 146386 179695
9453A79695b35248A37747b30525f3578j44862A17084a37430C1246b79667A9494
$$ 179695 -235248 137747 -230525 -63578 -208440 117084 -137430 31246 -279667 19494
9442h8117p5058A82607a38538N1298c7026q281r4590j10084l1554N5346A77677
$$ -88117 -163175 182607 -138538 -87240 -37026 -45307 -139897 -249981 -281535 -226189 177677
9430d92957A62688a25656A16880c44896g0848j81565h9132o7743A32511m8747
$$ -492957 162688 -125656 116880 -344896 -70848 -252413 -89132 -156875 132511 83764
9420H3764k074a05917j0998j80553A33175a48590A34043d01049b7847A43664e5019
$$ 83764 81690 -105917 -116915 -297468 133175 -148590 134043 -401049 -27847 143664 -55019
9408A86007b31534D7J8731f4592a104m90252a08591C48747b02025A35980c04194
$$ 186007 -231534 47 18778 -64592 -1104 -491356 -108591 348747 -202025 135980 -304194
9396a0746j41298E5516b88873a8275k66360B05082E9585B0066c6220A98856E0946
$$ -10746 -152044 55516 -288873 -18275 -284635 205082 59585 20066 -36220 198856 50946
9384I6014b34677O2067A65685a18419j97866G8528h9082A00490i2669O557o456
$$ 96014 -234677 -172610 165685 -118419 -316285 78528 -89082 100490 -92669 -86112 -92568
9373i2568b0988k45102n0714B0423K1775M7680a8802A51361b4609r5224R490k4405
$$ -92568 -20988 -266090 -316804 20423 42198 89878 -18802 151361 -24609 -119833 -110343 -134748
9361a34748c9475j11649E4145a05517I8486d48801b6622k8736k85249A37070b31977
$$ -134748 -39475 -151124 54145 -105517 98486 -448801 -26622 -55358 -340607 137070 -231977
9349b56691C63657I1336b93244B56527a25330A17931a4164k09295A3397N1638
$$ -256691 363657 91336 -293244 256527 -125330 117931 -14164 -223459 13397 65035
9339F5035b8394I8166d9757b4450l33857J74643N6200k29380A15852e2176C8733
$$ 65035 -28394 98166 -49757 -24450 -358307 -183664 -127464 -356844 115852 -52176 38733
9327a5813j41334k75516i614G7433e62978b43908e6041m7785A90409b1614p3340
$$ -15813 -157147 -432663 -9614 77433 -562978 -243908 -56041 -103826 190409 -21614 -94954
9316i4954A33544c13201G1916M6644O7496O9k6009a25619n9771G3200b44893E8689
$$ -94954 133544 -313201 71916 118560 186056 186125 160116 -125619 -185390 73200 -244893 58689
9303a39023c4502j60369M315r2439P0687a5483r1229I6874b50578A74205P9436
$$ -139023 -34502 -194871 -190556 -282995 -212308 -15483 -106712 96874 -250578 174205 253641
9292B53641E8887b42244H3889a41027k27225g8311G6409K9295b50649R465Q7418
$$ 253641 58887 -242244 83889 -141027 -368252 -78311 76409 105704 -250649 -241184 -153766
9281a53766A57670J42402p5192j11840f06528b1811j16256c0790j35083A6579
$$ -153766 157670 300072 224880 113040 -606528 -21811 -138067 -30790 -165873 16579
9270A14178D3960k1911a96777f8003D3551b6454C8274c49500b2520H3482K2073
$$ 114178 43960 22049 -196777 -68003 43551 -26454 38274 -349500 -22520 83482 105555
9259A05555n238a91725a4883I1893J11237b8718p9341K3341A04607a59088m7767
$$ 105555 100317 -191725 -14883 91893 203130 -28718 -108059 -84718 104607 -159088 -206855
9248b06855j07014j2126R8666I5548l3267a60935o0376M3978b2823B0429e7928
$$ -206855 -313869 -325995 -227329 95548 62281 -160935 -221311 -177333 -22823 20429 -57928
9236e0150n7102L0243B7211J45895B4811K2035c62028J16121L8819A95509f1503
$$ -50150 -107252 -77009 27211 173106 24811 46846 -362028 -245907 -207088 195509 -61503
9224a74866B03513d0584k61192g4179A6638H223a11631A69605R197q5355L2044
$$ -174866 203513 -40584 -301776 -74179 16638 8223 -111631 169605 178802 93447 125491
9213A25491a05280G3302a742j0114k16841D600J88304a72821B7269b30607g0926
$$ 125491 -105280 73302 -1742 -11856 -228697 4600 192904 -172821 27269 -230607 -70926
9201a26920K1910k58108a952j41259A50913K25046a3140m4311A38102B6381b00585
$$ -126920 -105010 -363118 -1952 -143211 150913 375959 -13140 -57451 138102 26381 -200585
9189b56071B67524q3716J33344f6611B54616k9013C3310a92880A5369c19154Q4833
$$ -256071 267524 183808 317152 -66611 254616 225603 33310 -192880 15369 -319154 -234321
9178b34321A98078b19247A3649N2204e6377q9711B26263E9504J922h5766B43095
$$ -234321 198078 -219247 13649 65853 -56377 -146088 226263 59504 61426 -85766 243095
9166a43167I0118a39743d5628n4295d1836B62845E2370J04471o5002N62J8023
$$ -143167 90118 -139743 -45628 -99923 -41836 262845 52370 156841 91839 92401 110424
9155A10424D7210f0231i067k99692a06914C23504b9127k29641J1939q2502e353
$$ 110424 47210 -60231 -9067 -308759 -106914 323504 -29127 -258768 -246829 -329331 -5353
9143a59057d2025F060i2098m0837n4792C44714i6368C8863b85305b3190l70199
$$ -159057 -42025 6060 -92098 -132935 -187727 344714 -96368 38863 -285305 -23190 -393389
9132c93389J92791g7445I179h0167B3439a49879K3693N1383k22760a37545b279
$$ -393389 -200598 -77445 9179 -80167 23439 -149879 -126186 -74803 -297563 -137545 -2279
9120a79095K3657d6023k65006a5496k53932a10722C1883b82785J20867k4652C36746
$$ -179095 -155438 -46023 -311029 -15496 -269428 -110722 31883 -282785 -161918 -186570 336746
9108C02747j43713a49145a1822j16096F964e1399C09640h8477m0603B1989J74969
$$ 302747 159034 -149145 -11822 -127918 6964 -51399 309640 -88477 -129080 21989 196958
9097A96958d2859j34100r734C4590L28025G1919O4885c16893J10851E4595a1309
$$ 196958 -42859 -176959 -186693 34590 362615 71919 136804 -316893 -206042 54595 -11309
9085E8413b67350D1675c16894a9472A20766J36667d81883a56124N7546k14528
$$ 58413 -267350 41675 -316894 -19472 120766 257433 -481883 -156124 -98578 -313106
9075c13106D55877D3999f5391j01202a5073k8750G8591b17331C29510a30647A9788
$$ -313106 455877 43999 -65391 -166593 -15073 -43823 78591 -217331 329510 -130647 19788
9063h9232G4376i3738A23597a4956l5322A6967e4301j73662G1727n193e0378J8562
$$ -89232 74376 -93738 123597 -14956 -50278 16967 -54301 -227963 71727 66534 -50378 -31816
9051c1816m7675l6889A89809D511J66495J09418e7986o6256k55568J33287a0716
$$ -31816 -79491 -116380 189809 4511 171006 280424 -57986 -124242 -379810 -246523 -10716
9039g637p0802k3601E8167a60722d4226j97598h6338j31730m9212d9500D2386
$$ -7637 -78439 -102040 58167 -160722 -44226 -241824 -86338 -218068 -267280 -49500 42386
9027c39355E12641d2280A07768k4719N5027E0711c21336A99130H3604l5362a44665
$$ -339355 512641 -42280 107768 83049 138076 50711 -321336 199130 83604 48242 -144665
9015a47834o7524b2875j40727m42472B15963G0411a24605A17007l6939j2193h02
$$ -147834 -215358 -22875 -163602 -606074 215963 70411 -124605 117007 80068 67875 -802
9003A7553a22689f1288K6218A75b70565a14346L1051A83257a06837C0256O7894
$$ 17553 -122689 -61288 -35070 175 -270565 -114346 -83295 183257 -106837 30256 98150
8992I8150a56614g8247a9729E3824J04643N634G8835g4334k40304a30021l6350
$$ 98150 -156614 -78247 -19729 53824 158467 164101 78835 -74334 -314638 -130021 -166371
8981a66371l0070M5735e2680j5534m08968D90329c02457i7574a2607j97754D9087
$$ -166371 -196441 -150706 -52680 -68214 -477182 490329 -302457 -97574 -12607 -210361 49087
8969C47109j52889e7592j24804C64582a45851H8562d9065k9984c9281i663k52347
$$ 347109 194220 -57592 -182396 364582 -145851 88562 -49065 -79049 -39281 -9663 -262010
8958b62010g4093H029J03907J46288a71749d2569B39087b44727B5004c20018C21653
$$ -262010 -74093 8029 111936 258224 -171749 -42569 239087 -244727 25004 -320018 321653
8946a00318L5145C6719c9031m2318q1624C47902e3150j24944I9992L49487A83457
$$ -100318 -65173 36719 -39031 -81349 -162973 347902 -53150 -178094 99992 449479 183457
8934I0908B3365N7511M8468D7926M424H320M7331K69409A16834a52588C00689
$$ 90908 23365 80876 129344 47926 52350 8320 55651 325060 116834 -152588 300689
8922B416968L920280K569220B496169G21809l55572L2323F4082L14658d5486E3492
$$ 2416968 6337248 8906468 2496169 721809 366237 398560 64082 378740 -45486 53492
8911a38971O0044A1961b08100E33897j54464B1219c1362j88358b6325l6406I6793
$$ -138971 -78927 11961 -208100 533897 379433 21219 -31362 -219720 -26325 -62731 96793
8899b57752H2392f9455k08189J6556a17485e2781o3150j23440R3519N7312D02939
$$ -257752 82392 -69455 -277644 -261088 -117485 -52781 -115931 -239371 -145852 -88540 402939
8887c9035k26308F3783h6869l07938A02223h2684m3494f2877D2124a82672J5362
$$ -39035 -265343 63783 -86869 -394807 102223 -82684 -126178 -62877 42124 -182672 -167310
8876a67310n4976A96361D712c51822J75678H5402a14998C2983a37802n821k44981
$$ -167310 -222286 196361 4712 -351822 -176144 85402 -114998 32983 -137802 -143623 -388604
8865c88604e6773k15124d3722k97514N6724c5806o5317D23593i773j89521K1893
$$ -388604 -56773 -271897 -43722 -341236 -284512 -35806 -101123 423593 -9773 -199294 -177401
$$ [...]
##END NTUPLES=NMR SPECTRUM
##END=
