##TITLE=AC1633_CENAH_8493798_wJb4DRSKn5
##JCAMPDX= 6.0         $$ Bruker NMR JCAMP-DX V2.0
##DATA TYPE= NMR SPECTRUM
##DATA CLASS= NTUPLES
##ORIGIN= BRUKER
##OWNER= Administrator
$$ 1.72 TOPSPIN		Version 2.1
$$ 2014-02-18 18:02:46.270 -0800  Administrator@X
$$ Compression mode = diff/dup
##.OBSERVE FREQUENCY= 400.02188249412
##.OBSERVE NUCLEUS= ^1H
##.ACQUISITION MODE= SIMULTANEOUS (DQD)
##.ACQUISITION SCHEME= undefined
##.AVERAGES= 8
##.DIGITISER RES= 22
##SPECTROMETER/DATA SYSTEM= spect
##.PULSE SEQUENCE= zg30
##.SOLVENT NAME= COFFEE_meoh
##.SHIFT REFERENCE= INTERNAL, COFFEE_meoh, 1, 14.98509
##AUDIT TRAIL= $$ (NUMBER, WHEN, WHO, WHERE, PROCESS, VERSION, WHAT)
$$ ##TITLE= Audit trail, TOPSPIN		Version 2.1
$$ ##JCAMPDX= 5.01
$$ ##ORIGIN= Bruker BioSpin GmbH
$$ ##OWNER= Administrator
$$ $$ E:\/data/COFFEE/nmr/AC1633_CENAH_8493798_wJb4DRSKn5/10/pdata/1/auditp.txt
$$ ##AUDIT TRAIL=  $$ (NUMBER, WHEN, WHO, WHERE, PROCESS, VERSION, WHAT)
(   1,<2014-02-18 18:02:39.739 -0800>,<Administrator>,<X>,<go>,<TOPSPIN 2.1>,
      <created by zg
	started at 2014-02-18 18:01:33.989 -0800,
	POWCHK enabled, PULCHK disabled,
       configuration hash MD5:
       C8 4E 4E 5D D3 5C D8 9E 9F 52 82 E0 59 8A DE 15
       data hash MD5: 64K
       B1 5B 36 E0 83 3F CD 8D 5E 3F 24 90 3A 89 21 4D>)
(   2,<2014-02-18 18:02:42.614 -0800>,<Administrator>,<X>,<proc1d>,<TOPSPIN 2.1>,
      <Start of raw data processing
       efp LB = 0 FT_mod = 6 PKNL = 1 PHC0 = 0 PHC1 = 0 SI = 32K 
       data hash MD5: 32K
       A4 C1 B1 62 44 BB FF 77 51 4E 04 69 9B FB 7A 96>)
(   3,<2014-02-18 18:02:42.926 -0800>,<Administrator>,<X>,<proc1d>,<TOPSPIN 2.1>,
      <pk PHC0 = 95.7843 PHC1 = 0 
       data hash MD5: 32K
       43 25 F3 1A F6 38 46 23 53 F9 21 17 0B 2E 4D AA>)
(   4,<2014-02-18 18:02:43.005 -0800>,<Administrator>,<X>,<proc1d>,<TOPSPIN 2.1>,
      <abs ABSG = 1 
       data hash MD5: 32K
       1A 52 23 7E 77 D0 27 49 A7 06 8C A1 87 B9 4C 90>)
(   5,<2014-02-18 18:02:43.051 -0800>,<Administrator>,<X>,<proc1d>,<TOPSPIN 2.1>,
      <abs ABSG = 2 
       data hash MD5: 32K
       D2 A6 CA AE 4F 6C 08 C9 0C 6D 7A 3E C7 11 21 E7>)
(   6,<2014-02-18 18:02:43.130 -0800>,<Administrator>,<X>,<proc1d>,<TOPSPIN 2.1>,
      <abs ABSG = 3 
       data hash MD5: 32K
       F5 B2 E7 FC 14 06 3B 99 50 94 0C B4 A1 29 1B BE>)
(   7,<2014-02-18 18:02:43.176 -0800>,<Administrator>,<X>,<proc1d>,<TOPSPIN 2.1>,
      <abs ABSG = 4 
       data hash MD5: 32K
       29 61 31 D8 FB DB 50 B1 4F 61 99 2C 7B 90 3D 94>)
(   8,<2014-02-18 18:02:43.239 -0800>,<Administrator>,<X>,<proc1d>,<TOPSPIN 2.1>,
      <abs ABSG = 5 
       data hash MD5: 32K
       40 99 07 BB 2F F2 D3 59 D5 93 17 3D D5 17 1D 29>)
$$ ##END=
$$ 
$$ $$ hash MD5
$$ $$ A4 9E B7 CA CA A4 E2 43 A6 28 FB E6 75 12 19 11
##$RELAX= 
##$RELAX= 
##$RELAX= 
##$RELAX= 
##$RELAX= 
##$RELAX= 
##$RELAX= 
$$ Bruker specific parameters
$$ --------------------------
##$DU= <E:\>
##$EXPNO= 10
##$NAME= <AC1633_CENAH_8493798_wJb4DRSKn5>
##$PROCNO= 1
$$ [...]
##$TP= (0..7)
150 150 150 150 150 150 150 150
##$TP07= 0
##$TPNAME0= <>
##$TPNAME1= <>
##$TPNAME2= <>
##$TPNAME3= <>
##$TPNAME4= <>
##$TPNAME5= <>
##$TPNAME6= <>
##$TPNAME7= <>
##$TPOAL= (0..7)
0.5 0.5 0.5 0.5 0.5 0.5 0.5 0.5
##$TPOFFS= (0..7)
0 0 0 0 0 0 0 0
##$TUNHIN= 0
##$TUNHOUT= 0
##$TUNXOUT= 0
##$USERA1= <user>
##$USERA2= <user>
##$USERA3= <user>
##$USERA4= <user>
##$USERA5= <user>
##$V9= 5
##$VALIST= <valist>
##$VCLIST= <CCCCCCCCCCCCCCC>
##$VD= 0
##$VDLIST= <DDDDDDDDDDDDDDD>
##$VPLIST= <PPPPPPPPPPPPPPP>
##$VTLIST= <TTTTTTTTTTTTTTT>
##$WBST= 2048
##$WBSW= 25
##$XGAIN= (0..3)
0 0 0 0
##$XL= 0
##$YL= 0
##$YMAX_a= 654539
##$YMIN_a= -556007
##$ZGOPTNS= <>
##$ZL1= 120
##$ZL2= 120
##$ZL3= 120
##$ZL4= 120
##$ABSF1= 14.98509
##$ABSF2= -5.573092
##$ABSG= 5
##$ABSL= 3
##$ALPHA= 0
##$AQORDER= 0
##$ASSFAC= 0
##$ASSFACI= 0
##$ASSFACX= 0
##$ASSWID= 0
##$AUNMP= <proc_prof1d_extract_pilot.lims>
##$AXLEFT= 0
##$AXNAME= <>
##$AXNUC= <1H>
##$AXRIGHT= 0
##$AXTYPE= 0
##$AXUNIT= <>
##$AZFE= 0.1
##$AZFW= 0.1
##$BCFW= 0
##$BC_mod= 0
##$BYTORDP= 0
##$COROFFS= 0
##$CY= 15
##$DATMOD= 1
##$DC= 0
##$DFILT= <>
##$DTYPP= 0
##$F1P= 0
##$F2P= 0
##$FCOR= 0.5
##$FTSIZE= 32768
##$FT_mod= 6
##$GAMMA= 0
##$GB= 0
##$INTBC= 1
##$INTSCL= 1
##$ISEN= 128
##$LB= 0
##$LEV0= 0
##$LPBIN= 0
##$MAXI= 10000
##$MC2= 0
##$MEAN= 0
##$ME_mod= 0
##$MI= 0
##$NCOEF= 0
##$NC_proc= -8
##$NLEV= 6
##$NOISF1= 0
##$NOISF2= 0
##$NSP= 0
##$NTH_PI= 0
##$NZP= 0
##$OFFSET= 14.98509
##$PC= 1
##$PHC0= 95.7843
##$PHC1= 0
##$PH_mod= 1
##$PKNL= yes
##$PPARMOD= 0
##$PPDIAG= 0
##$PPIPTYP= 0
##$PPMPNUM= 2147483647
##$PPRESOL= 1
##$PSCAL= 4
##$PSIGN= 0
##$PYNMP= <proc.py>
##$REVERSE= no
##$SF= 400.02
##$SI= 32768
##$SIGF1= 0
##$SIGF2= 0
##$SINO= 400
##$SIOLD= 32768
##$SPECTYP= <>
##$SREGLST= <1H.CDCl3>
##$SSB= 0
##$STSI= 32768
##$STSR= 0
##$SW_p= 8223.68421052631
##$SYMM= 0
##$S_DEV= 0
##$TDeff= 65536
##$TDoff= 0
##$TI= <>
##$TILT= no
##$TM1= 0
##$TM2= 0
##$TOPLEV= 0
##$USERP1= <user>
##$USERP2= <user>
##$USERP3= <user>
##$USERP4= <user>
##$USERP5= <user>
##$WDW= 1
##$XDIM= 32768
##$YMAX_p= 477773981
##$YMIN_p= -679289
##$CURPLOT= <Network HP LaserJet P1505>
##$CURPRIN= <$Network HP LaserJet P1505>
##$DFORMAT= <normdp>
##$LAYOUT= <+/1D_H.xwp>
##$LFORMAT= <normlp>
##$PFORMAT= <normpl>
##$SURQMSG= 1
$$ End of Bruker specific parameters
$$ ---------------------------------
##NTUPLES= NMR SPECTRUM
##VAR_NAME=  FREQUENCY,     SPECTRUM/REAL,   SPECTRUM/IMAG
##SYMBOL=    X,             R,               I
##VAR_TYPE=  INDEPENDENT,   DEPENDENT,       DEPENDENT
##VAR_FORM=  AFFN,          ASDF,            ASDF
##VAR_DIM=   32768,         32768,           32768
##UNITS=     HZ,            ARBITRARY UNITS, ARBITRARY UNITS
##FACTOR=    0.250966925370066, 1,           1
##FIRST=     8223.43324360094, 172638,       82819
##LAST=      0,             -183604,         10308
##MIN=       0,             -679289,         0
##MAX=       8223.43324360094, 477773981,    0
$$ Real data points
##PAGE= N=1
##DATA TABLE= (X++(R..R)), XYDATA
$$ [...]
19563a31090J676a5381n57978b9507C4846a65155O2720m611c8372A5172a21742
19551a2230o0228e114k51718R2562j18810B21709c1849k12766A26262d23823a98662
19539B54991a22062A4533a9451C2692P6818Q0513i4454A19158J85306f5821D6779
19527A05028A0868a72008A43667b30665B15654b71606P8283F2612b48594A02086
19516b2275H0997a68737G9334J57325c6211C32973g7321J3793M668B85192c40284
19504a78496e4858j9509j01509e7440l01599K919A86332a5781j13124a1168k215
19493a3383E9797B1220H608j211b18266H6904c15430A61883b23454A96175b26303
19481d0587A35501b17847Q7744A6282b88811h9798A0757R3075c3199k4928q8801
$$ y = [-131090, -129414, -15381, -573359, -29507, 34846, -165155, -102435, -107046, -38372, 15172, -121742, -12230, -72458, -5114, -256832, -164270, -283080, 221709, -31849, -244615, 126262, -423823, -198662, 254991, -122062, 14533, -19451, 32692, 109510, 190023, -94454, 119158, 304464, -65821, 46779, 105028, 10868, -172008, 143667, -230665, 215654, -271606, -193323, 62612, -248594, 102086, -22275, 80997, -168737, 79334, 236659, -36211, 332973, -77321, -63528, -58860, 285192, -340284, -178496, -54858, -74367, -175876, -57440, -359039, -356120, 186332, -15781, -128905, -11168, -13383, 59797, 21220, 8608, 7397, -218266, 86904, -315430, 161883, -223454, 196175, -226303, -40587, 135501, -217847, -130103, 16282, -288811, -89798, 10757, 103832, -33199, -58127, -146928]
19470a46928n7791A86397p5391b28013F4602a50214L0703j6321D6721J74836G5840
19458e4088j58520a8775o0586k60275a43373a0669o8938o0372o6941O5111A05792
19446h4077A353b83805J39613M6149j34174f0524A73633a99382K6597C42647a64933
19434D1147a89357d0163j22261b8836j63605J757G6629l550k9796b18626a8081
19422C6682c44103h5109k03403H8912M0021Q5163F7293O518a22757j60788a01191
19410a40247m4704M6186j1066c5304J1053l86275a97261I6790a2380l04590Q6730
19399b30240A71412j8664b64838f2939J8776m5380j10406N2769A7514a074C33869
19387i6015o808E9171f6823o4899b5297p8545A24131A6589c0178n0858b2724q6200
$$ y = [-146928, -204719, 186397, 111006, -228013, 64602, -150214, -119511, -135832, 46721, 221557, 75840, -54088, -212608, -18775, -79361, -339636, -143373, -10669, -79607, -139979, -206920, -141809, 105792, -84077, 1353, -283805, -144192, -98043, -232217, -60524, 173633, -199382, -172785, 342647, -164933, 41147, -189357, -40163, -162424, -28836, -192441, -190684, 76629, 73079, 43283, -218626, -18081, 36682, -344103, -85109, -288512, 88912, 128933, 214096, 67293, 73811, -122757, -283545, -101191, -140247, -184951, -138765, -149831, -35304, -24251, -410526, -197261, 96790, -12380, -316970, -230240, 171412, 152748, -264838, -62939, -44163, -89543, -199949, -147180, 17514, -1074, 333869, -96015, -102823, 59171, -66823, -131722, -25297, -103842, 124131, 16589, -30178, -81036, -22724, -108924]
19375a08924j108p0423g7763l3307l9024a0315G8726J08736b79434f5408j01051
19364a66459m1280A25676n668k9502m67a41393M2894G046N2486J9532a4163n09238
19352e23401a50553j18533E4613a22214B0824f3949A74074J17773A18480J63481
19342B81961a46368J6348k6263E3605b0353B90636I1357a04770J3470b7781I9172
19330c9800j75499g8009a6340l230A00426c934j00100M3095k52296f4228l18412
19319c82640a65313j63513I6075d7077a4242F4884Q3726L2468d9229k37377e0055
19307b16354q0290e3701n0202L1342j32518l1955b8576k85465N0560D5827b02150
19295F5317c15853c1685j47696A87181f3010A07211k87a04017j03351A57687a32411
$$ y = [-108924, -110032, -180455, -77763, -111070, -150094, -10315, 78726, 187462, -279434, -65408, -166459, -207739, 125676, 120008, 90506, 90039, -141393, -98499, 7046, 59532, 79064, -14163, -523401, -150553, -269086, 54613, -122214, 20824, -63949, 174074, 291847, 118480, 281961, -146368, -130020, -156283, 53605, -20353, 290636, 91357, -104770, -91300, -27781, 99172, -39800, -215299, -78009, -16340, -19570, 100426, -3934, -104034, -60939, -313235, -64228, -382640, -165313, -328826, 96075, -47077, -14242, 64884, 148610, 181078, -49229, -286606, -50055, -216354, -296644, -53701, -103903, -72561, -205079, -237034, -28576, -314041, -263481, 45827, -202150, 65317, -315853, -31685, -179381, 187181, -63010, 107211, 106924, -104017, -207368, 157687, -132411]
19283a86602k27724a71137h1014j29966h7882p5893G9926a88995A45194P6491
19273B21685i5009c7454r8729O0123r8375M2055k11072J42018R4733j36830A63747
19261B61892a81397A31884a68040d6494j43939j60273b0547o8739A44366A2774
19250a7296A7552c8533F6083M234d0563l83359g7263l18658B74990d1387O536
19239c4851j1221E8637a33712l38275J22353a31717A62967F5228K2311i7105C02437
19227B99650e31008b3277e097o3978B24923o0001n8134b1653j2067r9862n8392
19216a91974A9106b03958c46F8377J62815O9847k0902A02515c5069m7977A23577
19204b3384A64574a13385b7442l07917h5333N173L2773n0108k728K8965C5704
$$ y = [-186602, -414326, -171137, -81014, -210980, -87882, -163775, 79926, -188995, 145194, 221685, -95009, -37454, -136183, -76060, -174435, -132380, -343452, -201434, -106701, -243531, 163747, 261892, -181397, 131884, -168040, -46494, -190433, -350706, -20547, -89286, 144366, 12774, -17296, 17552, -38533, 66083, 70317, -40563, -423922, -77263, -395921, 274990, -41387, -34851, -46072, 58637, -133712, -471987, -349634, -131717, 162967, 65228, 87539, -97105, 302437, 299650, -531008, -23277, -5097, -69075, 224923, 164922, 106788, -21653, -33720, -133582, -191974, 19106, -203958, -346, 68377, 231192, 301039, 280137, 102515, -35069, -83046, 123577, -23384, 164574, -113385, -27442, -335359, -85333, -80160, -47387, -97495, -100223, -71258, 35704]
19192a34631C14153d22674A11165b57792A70526a89932A25776e3284A28097a87573
19181a58494A27277b33137M5845k46074a34685j45111A88852c1931j83480C537
19170a46060b417n1820j41081F2979a22812A48541c85181J61379C1279a91561
19159H0749b71656f1155B29243c4838A30026g4859C99944a65561a5972G8765c29270
19147f3911B15962a62727g7646H2776e2626o0285j20121j3583b2138D350c25468
19135c78639A15073J52243j00008e2896l8729f391H3713c5421E8028g5494j11518
19124a87012B32918K1928g4310k10696C4139a53193H8142K05260l0312b13910
19113d4750A79217B2856a02971j58425a23863j24468A55046h3594l23359B81056
$$ y = [-134631, 314153, -422674, 111165, -257792, 170526, -189932, 125776, -53284, 128097, -187573, -158494, 127277, -233137, -187292, -433366, -134685, -279796, 188852, -31931, -215411, 3537, -146060, -2417, -54237, -195318, 62979, -122812, 148541, -385181, -223802, 31279, -191561, 80749, -271656, -61155, 229243, -34838, 130026, -74859, 399944, -165561, -15972, 78765, -329270, -63911, 215962, -162727, -77646, 82776, -52626, -112911, -233032, -246615, -22138, 4350, -325468, -378639, 115073, 267316, 167308, -52896, -91625, -6391, 83713, -35421, 58028, -75494, -187012, 232918, 254846, -74310, -285006, 34139, -153193, 88142, 293402, 263090, -213910, -44750, 179217, 22856, -102971, -261396, -123863, -248331, 155046, -83594, -406953, 281056]
19102i078I271b88741f4215r0222A80672p3002J48958a00665O855A90677a12832
19090I5586c88714a04040B5421b32373O7293D4990a02152J9791l8478A60000o3451
19079I6549b56892I2333c2144d596A31338L4234l1572E7355b49671B05438b2563
19067a768H73i3107q4375A04253M3548b01384a1549A42806c28593a49164c5568
19055a16596a6738j25091f1657B53607a00888A65315b52800M1100C8932a46132
19044F9718b26676g1188o9867a973E658j559c9243l05627B18506a93968Q8538
19033a05430B31444b6616j91111c068A90577b3058A12772J1334J0901l1589d9040
19021a87314g8603D1240J3086a5864j29024H1297h3990k34518J00906A7795h7758
$$ y = [-9078, 9271, -288741, -64215, -154437, 180672, 107670, 256628, -100665, -93810, 190677, -112832, 95586, -388714, -104040, 25421, -232373, -165080, 44990, -102152, -82361, -120839, 160000, 96549, -256892, 92333, -32144, -4596, 131338, 165572, 134000, 57355, -249671, 205438, -22563, -1768, 873, -93107, -177482, 104253, 147801, -201384, -11549, 142806, -328593, -149164, -35568, -116596, -16738, -141829, -61657, 253607, -100888, 165315, -252800, -211700, 38932, -146132, 69718, -226676, -71188, -141055, -1973, 5658, 4099, -39243, -344870, 218506, -193968, -105430, 231444, -26616, -217727, -3068, 190577, -23058, 112772, 124106, 135007, 103418, -49040, -187314, -78603, 41240, 54326, -15864, -144888, 81297, -83990, -318508, -217602, 17795, -87758]
19009A77485a37417L9435L0007C0122h0272q4486A25193a13833I9955Q6801B5394
18997a74618Q1367K1912k6759N415a3224k4897k13917J23163k00204a02566q9937
18986a92503d7366l06343a20722G3161J80862a65391o4597K2566d7405N483A28639
18974b65827f1176B3029a59761r3000A48818a04968J1315R719G7265g6153A17275
18962c06968G4521a72380B14062a04683A24301D9593J32768a48304b7272j24061
18952a51333B85244F7687g8989J8936o2859E0228N9380f3568m47434f706j42826
18941a49532f4352B26526J38452b59776B08353h0448q3008l9750C9222a00861
18930C0218N610d9214r0432d0325l2813J2496B35590a88041A57348k5107a36992
$$ y = [177485, -137417, -97982, -67975, 30122, -80272, -164758, 125193, -113833, 99955, 186756, 25394, -174618, -93251, -71339, -98098, -92683, -13224, -38121, -252038, -128875, -329079, -102566, -192503, -47366, -353709, -120722, 73161, 254023, -165391, -229988, -207422, -47405, -41922, 128639, -265827, -61176, 23029, -159761, -252761, 148818, -104968, -93653, -83934, 77265, -76153, 117275, -306968, 74521, -172380, 214062, -104683, 124301, 49593, 182361, -148304, -27272, -151333, 285244, 67687, -78989, -60053, -122912, 50228, 109608, -63568, -511002, -6706, -149532, -64352, 226526, 364978, -259776, 208353, -80448, -163456, -203206, 39222, -100861, 30218, 35828, -49214, -139646, -40325, -73138, -60642, 235590, -188041, 157348, 132241, -136992]
18918H6042p991a28977A41380C7227a92n2457j47332L1921b5476j2693k44046
18907b82215B87284b83969O9107B98119b36086J8851d522k57627B86001p3015
18897B12986C7379a92087d1806j04986A66809a7704I7218A3654J4140a46846M6397
18886a00449A67809R0764K9790a45401c8478j77323O6830L1350A07000c70216
18875A40743d6250l354l70246b02028c1799A4195a54795e3748i416l40164H5390
18863B31785J48358j05491b35718A39296c9950B21877a43341o2215j48868J07130
18853b47294f7958a4248A15540l5139O9658q282c63893A7723J24632b01594G5199
18841H4370e9115o5330p6095j59927a19962C115g6716B5764a50539a145A18310
$$ y = [86042, 78051, -128977, 141380, 37227, -192, -52649, -199981, -168060, -25476, -38169, -282215, 287284, -283969, -214862, 298119, -236086, -217235, -4522, -262149, 286001, 212986, 37379, -192087, -41806, -146792, 166809, -17704, 97218, 13654, 27794, -146846, -100449, 167809, 258573, 288363, -145401, -38478, -215801, -148971, -117621, 107000, -370216, 140743, -46250, -49604, -419850, -202028, -31799, 14195, -154795, -53748, -9416, -349580, 85390, 231785, 380143, 274652, -235718, 139296, -39950, 221877, -143341, -205556, -354424, -247294, -67958, -14248, 115540, 80401, 150059, 141777, -363893, 17723, 142355, -201594, 75199, 84370, -59115, -124445, -200540, -360467, -119962, 3115, -76716, 25764, -150539, -1145, 118310]
18829a63916m4398A11413b83405B5502b85803a14399F7509b9357A55658J66549
18819C22207j59072d9117j27343I8155C8745j2195h0546A06613a13269d3930E859
18807i4034B04703b28907J08922B24677b21298B10739c66963H0666b86925c6803
18796A68344i1412J0589B6529L13898a79792B29786a29509B50604A6763a80407
18785a28837M3590A22738i4782B49148p7343b30874J13305n3243d829j0361j82
18774a5372o619A09060k0629a42550K7185j22486K5764I9528a48410f8875j91900
18763b60775J26775A7009a97244B7780R7987J6933a90658B34763g2524l9062A45611
18751a99175d7504m60816a09216I3516i2463b4858l72157a66840B4555e7218o9936
$$ y = [-163916, -208314, 111413, -283405, 25502, -285803, -114399, 67509, -29357, 155658, 322207, 163135, -49117, -176460, 98155, 38745, 26550, -80546, 106613, -113269, -43930, 5859, -94034, 204703, -228907, -119985, 224677, -221298, 210739, -366963, 80666, -286925, -36803, 168344, -91412, -80823, 26529, 340427, -179792, 229786, -129509, 250604, 16763, -180407, -128837, -85247, 122738, -94782, 249148, 171805, -230874, -117569, -170812, -4829, -15190, -15372, -21991, 109060, 88431, -142550, -115365, -237851, -212087, 99528, -148410, -68875, -260775, -134000, 17009, -197244, 27780, 125767, 142700, -190658, 234763, -72524, -111586, 145611, -199175, -47504, -508320, -109216, 93516, -92463, -24858, -397015, -166840, 24555, -57218, -127154]
18740a27154O3467j3494c7448j12510B457e11801I3796b94016J23127n8103i1341
18728a58277H8614a6181k67611K8266A17082d2783k06433A48492h9894B2726J99009
18717B21735f3162q0652H1650a10303A402J28187J26760b76595G6399J02133a03687
18705B4430b76535D8840J10767c11235A92689c38757J34209F5025b87001C34093
18694a70840l0603a6743l7323A65645a95220B53405a78387A58412b05448i8439
18683d56093f7198A15675b77233A15210k0389B0738L9473J06638a93808A55771
18672B13515a92357C10651B769i8069G8491J82455i1251j99486D679e5832A36296
18660a36314n7012n4036H6450a8004k87971b4449j10788A93409e9439K9581o1081
$$ y = [-127154, -63687, -77181, -37448, -149958, 2457, -511801, 93796, -294016, -170889, -228992, -91341, -158277, 88614, -16181, -283792, -255526, 117082, -42783, -249216, 148492, -89894, 22726, 221735, -63162, -143814, 81650, -110303, 1402, 129589, 256349, -276595, 76399, 178532, -103687, 24430, -276535, 48840, 159607, -311235, 192689, -338757, -204548, 65025, -287001, 334093, -170840, -201443, -16743, -54066, 165645, -195220, 253405, -178387, 158412, -205448, -98439, -456093, -67198, 115675, -277233, 115210, 94821, 20738, 60211, 166849, -193808, 155771, 213515, -192357, 310651, 2769, -98069, 78491, 260946, -91251, -290737, 4679, -55832, 136296, -136314, -193326, -247362, 86450, -18004, -305975, -24449, -135237, 193409, -59439, -29858, -90939]
18649i0939n3012l6798A30498b68838B261P9031b31817j47956A26888d2577p6461
18638a19038o0232G1899O7288f6348k2087k90998B60848a42510M8120e8q4825
18627h4883a6337j29436j72472a29871A65700a19131d9353m868j8893B4697a0014
18615h0242k68798A35658a30089A24356O8892G7627A6060c6568C44218a1647n68613
18604e80260a67246p1647O8020B19706a29403A31184o1288c44035a58373H2714
18593G6218f9780M894B67857B5858G173c12827A82048a83393g4831C8448b85379
18581A1147P8953Q7977R3958a06364o6026f55l98759a42049p9848j23284C6523
18569b48390J05536A29909E2343b23630I4758K08179A7579a55789A12242b68367
$$ y = [-90939, -143951, -180749, 130498, -268838, 2261, 81292, -231817, -379773, 126888, -42577, -119038, -179270, 71899, 139187, -66348, -88435, -379433, 260848, -142510, -94390, -58, -84883, -16337, -145773, -318245, -129871, 165700, -119131, -49353, -54221, -73114, 24697, -10014, -80242, -349040, 135658, -130089, 124356, 193248, 77627, 16060, -36568, 344218, -11647, -580260, -167246, -238893, -170873, 219706, -129403, 131184, 69896, -344035, -158373, 82714, 76218, -69780, -64886, 267857, 25858, 7173, -312827, 182048, -183393, -74831, 38448, -285379, 11147, 90100, 178077, 272035, -106364, -172390, -655, -399414, -142049, -221897, -345181, 36523, -248390, -142854, 129909, 52343, -223630, 94758, 302937, 17579, -155789, 112242, -268367]
18558a38683C06818b32018B06800d9008D16852a96109f6473n6246A6614a21446
18547A69514a26084n248B5184R9760K3543a72670q2913B1826P13J3456J21540
18536A57535n2202a33634N46r0185G8492d16997b3762j51466l1866f7139A38414
18524C7354b441A78831a32088j45468B44440K14131c4002C22580G4154c06804
18513i6576D5789J36401F5416b5834l0548F1944b7728j04448O2282B08357d2840
18501A44692a18971q7777D4600h987D3771a69463c0483B3956b4778l9671k46058
18490c10507H7725b37093R6606F4985j3613i7083H9963a62205A5311b37131b6328
18478a45657M8728A2911J54608a39845J9224A97048C2239J6813a26788q4216O9824
$$ y = [-138683, 306818, -232018, 206800, -49008, 416852, -196109, -66473, -122719, 16614, -121446, 169514, -126084, -131332, 25184, 124944, 148487, -172670, -255583, 21826, 22539, 35995, 157535, 105333, -133634, -133088, -223273, 78492, -416997, -23762, -175228, -207094, -67139, 138414, 37354, -2441, 178831, -132088, -277556, 244440, 458571, -34002, 322580, 74154, -306804, -96576, 45789, 182190, 65416, -25834, -56382, 61944, -27728, -132176, -69894, 208357, -42840, 144692, -118971, -206748, 44600, -8987, 43771, -169463, -30483, 23956, -24778, -64449, -310507, 87725, -237093, -140487, 64985, 51372, -97083, 89963, -162205, 15311, -237131, -26328, -145657, -96929, 12911, 167519, -139845, -120621, 197048, 32239, 49052, -126788, -211004, -141180]
18467a41180q7771a0853j03329b9645o8177J4654B9600f4104l09628i9802n9529
18456a59331A50648b6214r4876F4539B1888L26791c6261k27189a28211A95339
18445a00680A24046g9642n7035N8131j55798j0794l19098a18934F7748B3169i820
18433C9994b43349R3563r2025R9280c3401r1524j2651K1773a5763l58480e7585
18421A25548M2800b59991q4506A39690M027I128b33474a14720k750N2354B63667
18409D30514c9757r641d421A59347c32029G3875h2871B9278b53343E53722G9198
18397A60063p0570A1291b90185c2310G1120g336k44531e4062A31804n4921c17462
18385a61285G7893Q5099a55051a0141j00739i596k68910B7133L0929R5156b23873
$$ y = [-141180, -228951, -10853, -114182, -29645, -97822, -83168, 29600, -64104, -373732, -99802, -159331, 150648, -26214, -121090, 64539, 21888, 348679, -36261, -263450, -128211, 195339, -100680, 124046, -79642, -136677, -78546, -234344, -245138, -564236, -118934, 67748, 23169, -9820, 39994, -243349, -149786, -241811, -142531, -33401, -124925, -137576, -115803, -15763, -374243, -57585, 125548, 168348, -259991, -344497, 139690, 143717, 9128, -233474, -114720, -117470, -65116, 263667, 430514, -39757, -49398, -4421, 159347, -332029, 73875, -82871, 29278, -253343, 553722, 79198, 160063, 89493, 11291, -290185, -32310, 71120, -7336, -251867, -54062, 131804, 76883, -317462, -161285, 77893, 162992, -155051, -10141, -110880, -9596, -278506, 27133, 58062, 153218, -223873]
18373d4551l65727J95542F415Q8486c0281B37253b63465B27383O8721B2897a68540
18361b74573d4155k6278B1281c7799C8941O9890C0879q652b6770A89451H0266
18349A2123a11543j08922H7124b19297k00026i535k2438A371i0286A19687J8494
18338A38181b81860G4594c54442e9597j7743F3999a5204H6386K11184I0628j934
18327H8694l3002a30944q6016a8478k18891G4062R548a5725A37458a2155A62765
18315A53831l1819B4660a87568D9169J60189C8693j3679J01138e9048j52843f3632
18303A2942a70856D4044b0915n3980b418C47951e3991j77900E7813k0424R8889
18292A36278a69322q9303h1694A72496M3691f7487k23222P0470c4410j35253N7761
$$ y = [-44551, -410278, -214736, 6415, 94901, -30281, 237253, -263465, 227383, 296104, 22897, -168540, -274573, -44155, -70433, 21281, -37799, 38941, 108831, 30879, 22227, -26770, 189451, 80266, 12123, -111543, -220465, 87124, -219297, -419323, -9535, -31973, 1371, -90286, 119687, 138181, -281860, 74594, -354442, -59597, -77340, 63999, -15204, 86386, 297570, 90628, 88694, 55692, -130944, -216960, -18478, -237369, 74062, 83610, -15725, 137458, -12155, 162765, 153831, 122012, 24660, -187568, 49169, 209358, 38693, 25014, 126152, -59048, -211891, -63632, 12942, -170856, 44044, -20915, -74895, -2418, 347951, -53991, -231891, 57813, 37389, 136278, -169322, -258625, -81694, 172496, 216187, -67487, -290709, -220239, -34410, -169663, -111902]
18281a11902d8159j62408R7977D7225a64309j64556B42162a05288H8773Q0964
18271A69737f8744d739l92698J84745A54370l0324b57681d4456M856q5500C56358
18259h162B26989a72685h2168c7842k155H2789Q9946a61628d2795p7020B81999
18247B11345D2927f4821o1491B6344C263c67165C70084c61859A55330c23411d6098
18235G4588a07084B57143a41392B3821g6121A07136c52598G8223f216H2952J84713
18224B67665E8844J30279Q9568f5250r1585j77735G6559b0535D3134b57583B33839
18212A81073L949a11564E7879a48674A68893P5876h6447E7043j5999K7760O0543
18201A29347a09420b1495j40225M6649j09794D2611o689J7076c48710J73940E7437
$$ y = [-111902, -48159, -210567, -112590, 47225, -164309, -328865, 242162, -105288, 88773, 169737, -68744, -4739, -397437, -212692, 154370, 124046, -257681, -44456, -39600, -125100, 356358, -8162, 226989, -172685, -82168, -37842, -39997, 82789, 172735, -161628, -42795, -119815, 281999, 211345, 42927, -64821, -126312, 26344, 3263, -367165, 370084, -361859, 155330, -323411, -46098, 74588, -107084, 257143, -141392, 23821, -76121, 107136, -352598, 78223, -6216, 82952, 267665, 58844, 189123, 278691, -65250, -156835, -334570, 76559, -20535, 43134, -257583, 233839, 181073, 185022, -111564, 57879, -148674, 168893, 244769, -86447, 57043, 41044, 68804, 129347, -109420, -21495, -161720, -115071, -224865, 42611, 35922, 52998, -348710, -174770, 57437]
18189C3846c5806G2278e9639l8419J0658F9852a32862J51A12374g7185j20422
18178a97607h0257A1438b99055f6453B73280b53151i0349A7456b9036A29088m2800
18167H6288J58968G5263c99394a89250A92215b5827A0445c79133B09378N4106
18157B63484c27717d7270E0618f0014J8214l96592B25684a19728B3362J18733
18147A42095c01293A43846h1701c6133m7046l2681A05404a44509H749g9862E7922
18135c65465a22222A29613l5130b44097D8981J52094a07233B7243F15M0782L14166
18124C55563a04567r5059d6748N346j74804A8379K9391K98014b05858K8449d6036
18112e0822B60291b73865a11090j39910i6770k7327A42507b4274l386c443D18650
$$ y = [33846, -35806, 72278, -59639, -98058, -87400, 69852, -132862, -132711, 112374, -77185, -197607, -80257, 11438, -299055, -66453, 273280, -253151, -90349, 17456, -29036, 129088, 86288, 245256, 75263, -399394, -189250, 192215, -25827, 10445, -379133, 209378, 263484, -327717, -47270, 50618, -60014, -41800, -438392, 225684, -119728, 23362, 142095, -301293, 143846, -81701, -36133, -83179, -115860, 105404, -144509, 8749, -79862, 57922, -365465, -122222, 129613, 94483, -244097, 48981, 201075, -107233, 27243, 615, 41397, 355563, -104567, -199626, -46748, -41402, -216206, 18379, 47770, 345784, -205858, -177409, -46036, -50822, 260291, -273865, -111090, -251000, -96770, -124097, 142507, -24274, -27660, -3443, 418650]
18100a1141n0703A11257l4348a30647B91784G7666J1223b77936R4543i1420R16
18089i0504G577c53263E8398f8415l20298J10772F6281J64991B0005b0842A40346
18077d7879a2832A00004l7675J3840c85394J15334f3237j16720d8176j08400L0388
18066a26188L1067B65446H9372i2828A13893f7884A66265a61014f849A2875e51706
18054a70684I3280a04391j46756A6943P9524c86480a50999A2935a5714n7888K7256
18043d6346A68884K1167G9987a71131H3666A7586b94693D2256J04227b87245I262
18031F0864K7387g6949j16733k69781e1393q2235j4920c9768A20365e2195n1381
18020a03576H1334c1674j36828B47697I4232k7150i5098A71859q3667a78875Q4156
$$ y = [-11141, -61844, 111257, 76909, -130647, 291784, 77666, 88889, -277936, -183393, -91420, -90504, 7577, -353263, 58398, -68415, -388713, -277941, 66281, 231272, 20005, -20842, 140346, -47879, -12832, 100004, 62329, 76169, -385394, -270060, -63237, -179957, -48176, -156576, -126188, -95121, 265446, 89372, -92828, 113893, -67884, 166265, -161014, -6849, 12875, -551706, -170684, 93280, -104391, -251147, 16943, 96467, -386480, -150999, 12935, -15714, -73602, -46346, 168884, 190051, 79987, -171131, 83666, 17586, -294693, 42256, 146483, -287245, 9262, 60864, 88251, -76949, -193682, -463463, -51393, -133628, -148548, -39768, 120365, -52195, -103576, 81334, -31674, -168502, 247697, 94232, 67082, -95098, 171859, 88192, -178875, -94719]
18009i4719d4828l74315E0235O2312e8898C1764b65912B1315b4247F7600a12016
17997B43972K5797q7071a78500k74685G1777L1435g9586j6177H4964a4845D3712
17985a12113j48757N9510d3235r4942G1800d0223j70367P033n9195o2462a27935
17973B96391b76926M716E8677K6041C0992M25205H9502N6923P2047F0330a50370
17961d76741B54200H7673g0717j57445D16702a1225E9114d11336F8242K27011
17951B95253O4354c93658f5012l0738A70806A7225b8037j39966D4866K39076C0156
17939B03879o1208f220B55423c2165E9169K09369g3519c3338I8713g1159k32108
17928c03267C1444b37239c1002i950p0575H1657f1135A23073J48386a40412k3151
$$ y = [-94719, -44828, -419143, 50235, 112547, -58898, 31764, -265912, 21315, -24247, 67600, -112016, 243972, 269769, 182698, -178500, -453185, 71777, 103212, -79586, -95763, 84964, -14845, 43712, -112113, -260870, -201360, -43235, -138177, 71800, -40223, -210590, -203557, -262752, -325214, -127935, 296391, -276926, -272210, 58677, 84718, 30992, 456197, 89502, 146425, 218472, 60330, -150370, -476741, 254200, 87673, -70717, -228162, 416702, -11225, 59114, -411336, 68242, 295253, 359607, -393658, -65012, -95750, 170806, 17225, -28037, -168003, 44866, 283942, 30156, 203879, 142671, -6220, 255423, -32165, 59169, 268538, -73519, -33338, 98713, -71159, -303267, 31444, -237239, -31002, -9950, -80525, 81657, -61135, 123073, 271459, -140412, -163563]
17917a63563n4262N5952C31562j31901g3446j1302j6851A20937A8097J80089g7742
17905A52148k5653A7302E888J81090p4160d7895B44703b40218C1306A5057f172
17893d9032C0323J06396e0881A62176g3924H3249j1754a75947A67704l9368K2310
17882A50646M883a93307A14687a57271q1738B42520e1419j01705j8071B19751
17871b40123A56092b52583L8652J963d621l82527a65253J6350f3225k38886M8482
17860b53629R4026E0008K5278J15431K02312g4446A77445m583q0803M1008D8762
17848a09961b1728k27737B1402K34087a3679A6945J24043k5454D422b18957R6990
17837a21967A41289b81467J04973A37803b87017A962i3717D0541K68636E5436
$$ y = [-163563, -217825, -161873, 331562, 199661, -73446, -84748, -101599, 120937, 18097, 198186, -77742, 152148, 126495, 17302, 5888, 186978, 112818, -47895, 244703, -240218, 31306, 15057, -6172, -49032, 30323, 136719, -50881, 162176, -73924, 83249, 71495, -175947, 167704, 128336, 150646, 155529, -193307, 114687, -157271, -239009, 242520, -51419, -153124, -171195, 219751, -240123, 156092, -252583, -213931, -211968, -4621, -387148, -165253, -148903, -63225, -302111, -253629, -159603, 50008, 75286, 190717, 393029, -74446, 177445, 172862, 92059, 133067, 48762, -109961, -21728, -249465, 21402, 255489, -13679, 16945, 140988, 115534, 4422, -218957, -121967, 141289, -281467, -176494, 137803, -287017, 1962, -93717, 40541, 309177, 55436]
17826b2179H253J24022c2852r2586m7531A44831d6556B13828b62552E117a28293
17814c2017l4457j13448c8443j58034B5066L1754J4521L20820b1652A27575d6455
17802b0427p010I2609J79723a0879A49917B8000R8045f4083A38222B7576h8122
17790b70740g3230A10196k5386b12203E8918b0781A24192b86411D67d626k07331
17779b11957A39157e8940J3533A23329B1531L63988A89435P2648a78447r920A26419
17767b7666A663J39272a27761A73512f1771J5608A01436J42294A10319a98936
17756A97176I6286a69715G8851J2152l2968J55111c19125L8207A61696n7073K89866
17745C94489a38155A91509h2606B80921G8497R3770a26657l7401F0551i552B9886
$$ y = [-22179, 8253, 132275, -32852, -125438, -172969, 144831, -46556, 213828, -262552, 5117, -128293, -32017, -66474, -179922, -38443, -196477, 25066, 56820, 71341, 392161, -21652, 127575, -46455, -20427, -27437, 92609, 272332, -10879, 149917, 28000, 126045, -64083, 138222, 27576, -88122, -270740, -73230, 110196, 84810, -212203, 58918, -20781, 124192, -286411, 467, -4626, -211957, 139157, -58940, -45407, 123329, 21531, 385519, 189435, 262083, -178447, -188367, 126419, -27666, 1663, 140935, -127761, 173512, -61771, -46163, 101436, 243730, 110319, -198936, 197176, 96286, -169715, 78851, 91003, 58035, 213146, -319125, -280918, 161696, 104623, 394489, -138155, 191509, -82606, 280921, 78497, 172267, -126657, -164058, 60551, -9552, 29886]
17733c6146C95097E4459d7674K171A40014A3190O792N7470b20516f1756B8822
17721b03380H7968d2572B79606j8295c75126a35593C11381h456k13739c7374j64594
17710b01968j88317B1812J49162p5164O826P6722i4150A43636a72228E720Q9370
17699I5090J38185b21480l8531A30672a61312j77188E3250k2867J45217b5177
17688b92695A33044l8936c82j14109A04725b75626B90321J08204a81798B19244
17677a74527F5877i2028d786G1229c81q9322G2940k3064a42917M0426O655B60207
17664a09122A8303K03075b04434B9694a36750g311A25402P054J49849A03639j9585
17653H4054b73822B92127j12535i8020B29412P6616c02352B67858l4543F1349
$$ y = [-36146, 395097, 54459, -47674, -45503, 140014, 13190, 19982, 77452, -220516, -61756, 28822, -203380, 87968, -42572, 279606, 261311, -375126, -135593, 311381, -8456, -222195, -37374, -201968, -390285, 21812, 170974, 95810, 102636, 179358, -94150, 143636, -172228, 5720, 95090, 233275, -221480, -260011, 130672, -161312, -338500, 53250, 30383, 175600, -25177, -292695, 133044, 94108, -382, -114491, 104725, -275626, 290321, 398525, -181798, 219244, -174527, 65877, -92028, -4786, 71229, -381, -89703, 72940, 49876, -142917, -102491, -95836, 260207, -109122, 18303, 221378, -204434, 29694, -136750, -7311, 125402, 132456, 282305, 103639, 84054, -273822, 292127, 179592, -98020, 229412, 306028, -302352, 267858, 233315, 61349]
17642A92748g9608B58223O4262a81165q1305h6358k70415B48679E8990L23840
17632C82830a21321Q603C19654B9649a5132q7497n5034N1951A25829a82602l6784
17621b19386C47447k9301B2219J9141B940R402J49377b23623C3139K85625a34866
17609g5273I5322c0465F0106a01109A16304c633j07705A61945J01970o2202a88104
17597A39962a97663A46102a55124A04471a46644A75850p444G8090J5714K37425
17587C31229B671R8230b65880L9989B07971r645F8132c205C05114A3359J03600
17576A16959c4989D09846H4769M5327g2351A80942B9147i5245J4903B39326K23988
17565D63314A63054J04627a52898B88232A5025N8791L925A4487a21014A35108
$$ y = [192748, -79608, 258223, 322485, -181165, -262470, -86358, -356773, 248679, 58990, 382830, -121321, -112718, 319654, 29649, -15132, -102629, -157663, -105712, 125829, -182602, -219386, 347447, 318146, 22219, 41360, 2940, 12342, 161719, -223623, 33139, 318764, -134866, -75273, 95322, -30465, 60106, -101109, 116304, -3633, -111338, 161945, 263915, 201713, -188104, 139962, -197663, 146102, -155124, 104471, -146644, 175850, 168406, 78090, 93804, 331229, 2671, 100901, -265880, -225891, 207971, 198326, 68132, -3205, 305114, 13359, 116959, -34989, 409846, 84769, 130096, -72351, 180942, 29147, -95245, -80342, 239326, 463314, 163054, 267681, -152898, 288232, 15025, 73816, 77741, 14487, -121014, 135108]
17554B78895f7657l282r489H9355f3449f800j48281A93139p4130K2637a83569
17542A77244K05464c303A8588J35100J0648a73352P5315d5175E7022R8437n6543
17531I8916e2482A6975O6510f5266A14710d3843C7635K00858L8069c4688B94472
17519D779a16632B52846e5937k97827c0877D1783J53085o4145R0104J8645a95898
17507C92287j95600a9345A43858J21499p3336C6066R3762P3566a53861C21189
17496a14342A95404a25576B14702a25861A42887J0727N7487J3773b24973B14842
17485A75141a14585D35237B2424L14334b33478B05413d4641j11302c0142I3239
17474B06935m4070J30673A17056E0896J43686a91005m2645i8311A75235n4031
$$ y = [278895, -67657, -70939, -80428, 89355, -63449, -6800, -155081, 193139, 119009, 141646, -183569, 177244, 382708, -3303, 18588, 153688, 164336, -173352, -98037, -45175, 57022, 155459, 98916, -52482, 16975, 83485, -65266, 114710, -43843, 37635, 238493, 276562, -34688, 294472, 4779, -116632, 252846, -55937, -353764, -30877, 41783, 194868, 130723, 220827, 239472, -195898, 392287, 196687, -19345, 143858, 265357, 192021, 36066, 129828, 203394, -153861, 321189, -114342, 195404, -125576, 214702, -125861, 142887, 153614, 211101, 224874, -224973, 214842, 175141, -114585, 435237, 22424, 336758, -233478, 205413, -44641, -155943, -30142, 93239, 206935, 162865, 293538, 117056, 50896, 194582, -191005, -233650, -98311, 175235, 121204]
17464A21204J61601d109k16734d8548A71554B3535K53921C0990J54833c33501
17453A16097M874f7687C57064B0317K92723m0678A28782B6968N51976B48303L95539
17442F43842k78858N5156G8312N6780Q5363K94552r5762a58544g3688A64020K10960
17431C74980N669j90242E8404k151n861J37206M29679j38811H523d5295D54901
17419B91894k8394P6536K3378J36966A65484D6163J10067a39033g537B26022j1717
17408B14305E7925a80311a3755B77397J37863A11697K81143h2851C07026d9358
17397B2096J01083a02175D9462c9029O505B15156r7946K24068j61103H2320Q0130
17386A62450O5567c6812D21949F8769a9734A63542Q211l8659i4990A97585I8096
$$ y = [121204, 282805, -4109, -220843, -48548, 171554, 23535, 277456, 30990, 185823, -333501, 116097, 120971, -67687, 357064, 20317, 313040, 272362, 128782, 26968, 578944, 248303, 643842, 364984, 420140, 78312, 135092, 220455, 515007, 419245, -158544, -73688, 164020, 374980, 380649, 190407, 58404, 56253, 50392, 187598, 617277, 478466, 8523, -45295, 454901, 291894, 263500, 340036, 363414, 500380, 165484, 46163, 156230, -139033, -7537, 226022, 214305, 57925, -180311, -13755, 277397, 415260, 111697, 392840, -82851, 307026, -49358, 22096, 123179, -102175, 49462, -39029, -32524, 215156, 117210, 341278, 180175, 82320, 162450, 228017, -36812, 421949, 68769, -19734, 163542, 171753, 133094, -94990, 197585, 98096]
17374H5662B0100g6891B5143J50052a4107j00239B4810Q9689l6826O1991R8468
17363B38132i5503A28445k6645Q4496F3879M62322a20970B55203p6114H570K27147
17352B35717b5291B23680p6398p0754d2760D02590j72505F9340A3826L67111L01854
17341F82791b9675A78916d3290I8114k2391R4574M051l1854j0a9546G1804J13887
17329A85691C3352J32286l653H0800e2659B07051q2595O7398n0446P8626J9960
17318B39994E3287h8923a9421D38460j30336b56712f504j23471H1603K66019j50616
17307A97006O4526E4531K91346j45926K19125A45393J72574n6401A27276K4127
17297A51403J48086K32687A7674K4127J70804P6186A31902L44259r9989d5145
$$ y = [85662, 20100, -76891, 25143, 175195, -14107, -114346, 24810, 114499, 77673, 139664, 238132, -95503, 128445, 101800, 186296, 63879, 526201, -120970, 255203, 179089, 8570, 235717, -25291, 223680, 147282, 76528, -42760, 402590, 230085, 69340, 13826, 380937, 682791, -29675, 178916, -43290, 98114, 75723, 170297, 174348, 142494, 142484, -19546, 71804, 185691, 33352, 165638, 161985, 80800, -52659, 207051, 124456, 191854, 141408, 220034, 239994, 53287, -88923, -19421, 438460, 308124, -256712, -6504, -129975, 81603, 347622, 197006, 261532, 54531, 345877, 199951, 419076, 145393, 317967, 261566, 127276, 151403, 299489, 532176, 17674, 41801, 212605, 288791, 131902, 476161, 376172, -45145]
17286C53219A6108N5013h5225I7484K55912j42557o2017p0316l8551N5919K13219
17275C09093G3549L75979a13091A26064M052a11595B30349j07701L4873j5882
17265A41639E6904M90970H0178K02329r6405E4427a22781B94466L494d700I2577
17253E01557j32747A21694C3208O5755J97047d7821B80840J7808A23612J1069
17243A34681K81223c6709H5520Q577K77334O5607n6348A72829L11241A2442L89853
17232D02295j39995O4579C3482J77144J71152I964K57558C0220J41437J2478A1500
17220C19194A28248J1444R866D9208P8354K10867N243j57711J15541a7029A53698
17208C41577j8911J38502A58433L02425J84164F575K30808j6746O9170r9570q72
$$ y = [353219, 16108, 71121, -85225, 97484, 353396, 210839, 148822, 78506, 39955, 95874, 309093, 73549, 449528, -113091, 126064, 130116, -111595, 230349, 122648, 157521, 141639, 56904, 547874, 80178, 282507, 186102, 54427, -122781, 294466, 297960, -4700, 92577, 501557, 368810, 121694, 33208, 98963, 296010, -47821, 280840, 298648, 123612, 134681, 415904, -36709, 85520, 94097, 371431, 437038, 380690, 172829, 484070, 12442, 402295, 262300, 326879, 33482, 210626, 381778, 9964, 267522, 30220, 171657, 184135, 11500, 319194, 128248, 139692, 149558, 49208, 127562, 338429, 343672, 185961, 301502, -17029, 153698, 341577, 322666, 461168, 158433, 460858, 645022, 6575, 237383, 220637, 289807, 190237, 189365]
17197A89365M6862E154J89934J28967h3477B01085m8930K3031J17319K43634a26056
17185B14246K24262o6412K40106B47110q2197L4381k1029L3094P8541j33533L1758
17174A88125Q8347R0568j75283K33033a70020B13121L22928j80272J42838j80393
17164C18222K57063k06515j63571K37811o6133J55678D5380J94575J73880A99845
17153I8997J34758F3709K10794C6259L63480j12323L13739A58126K47631P363
17143D13120j90400L95602C07782M508R0978A8939N09443B42053M40097B27574
17132E57450A07677M66490j10418j11596P695N3433L331q1192o9836J14750l1675
17121C48659M1948j34849c1642E76282G8775Q5201K39793k9573K9818Q8632l0299
$$ y = [189365, 236227, 5154, 195088, 324055, -83477, 201085, 152155, 175186, 292505, 536139, -126056, 214246, 438508, 372096, 612202, 247110, 164913, 199294, 178265, 211359, 289900, 156367, 188125, 276472, 367040, 191757, 424790, -170020, 213121, 536049, 355777, 498615, 318222, 575285, 368770, 205199, 443010, 376877, 532555, 45380, 239955, 413835, 199845, 98997, 233755, 63709, 274503, 36259, 399739, 287416, 601155, 158126, 405757, 413120, 222720, 618322, 307782, 312290, 403268, 18939, 528382, 242053, 682150, 227574, 557450, 107677, 574167, 463749, 352153, 359848, 413281, 416612, 335420, 265584, 380334, 348659, 390607, 255758, -31642, 576282, 78775, 163976, 403769, 374196, 404014, 492646, 462347]
17110D62347o6057J31037D6914L28452n7221P7441B8223O36062j20093B58930
17099B22273L79280j60852K16268B38469L3245L33354B91761N95696m05431B09993
17088D20471A95412o6597K48303P8132K01109M6604j27666j84409m1279L85371
17078G34980J5672B39369K55747j46775K72582j1420J13050k45363L4913J3377
17068E25480j4109J75217k63246L80329q9393k63185r1812q7940j1757O4829K01205
17057E25618J62588K7238j35102j0609n1338L93946B02522O08186N2192C58074
17046D67048G7084J51717M04891O8609k7309N0664B21344N00824q2836j91660
17036D47672J83399j35700J34685P4909K63589A66934K46231J65967r4137K70258
$$ y = [462347, 396290, 527327, 46914, 375366, 318145, 395586, 28223, 664285, 544192, 258930, 222273, 601553, 440701, 656969, 238469, 271714, 605068, 291761, 887457, 482026, 209993, 420471, 195412, 128815, 377118, 455250, 656359, 702963, 575297, 390888, 349609, 734980, 750652, 239369, 495116, 348341, 620923, 609503, 722553, 477190, 512103, 525480, 511371, 686588, 423342, 803671, 714278, 451093, 359281, 271341, 259584, 324413, 525618, 688206, 715444, 580342, 569733, 518395, 912341, 202522, 810708, 862900, 358074, 467048, 77084, 228801, 633692, 702301, 674992, 725656, 221344, 722168, 639332, 447672, 631071, 495371, 630056, 704965, 968554, 166934, 413165, 579132, 484995, 755253]
17026G55253K16218D06736L06606j00420K42858j52358q8j49238R4014K21324
17016H69434k45491P4659k17561J1704J63964k72037N31474l73704M9248j36528
17006D55162K91750j81549L05900k55582J70013j07866K43117R1433m42280L06538
16996H76636j09192l35716K55509k69397O27773k78357j28836P5897J9732K96329
16986A030378j44764k44399R0507J34348q175J29375j03267j88593M35280l15052
16976H15638N588J89113k7120k7526N1370j63688J20553l33031K27568j06470
16966G51995Q5559Q2858M9884K47225m0479k83883K93634M7720k18986Q3055j38751
16955I59831J21049l36236L57354R6418p5972R0814k86552J02582J73875j33522
$$ y = [755253, 971471, 406736, 713342, 612922, 855780, 703422, 703334, 554096, 648110, 869434, 623943, 698602, 481041, 492745, 656709, 384672, 916146, 542442, 591690, 455162, 746912, 565363, 871263, 615681, 785694, 677828, 920945, 1012378, 570098, 876636, 767444, 431728, 687237, 417840, 1045613, 767256, 638420, 714317, 734049, 1030378, 885614, 641215, 731722, 866070, 857895, 987270, 884003, 695410, 1130690, 815638, 821226, 1010339, 983219, 955693, 1007063, 843375, 963928, 630897, 858465, 751995, 837554, 920412, 970296, 1217521, 1177042, 893159, 1186793, 1234513, 1015527, 1098582, 959831, 1080880, 744644, 1101998, 1198416, 1122444, 1213258, 926706, 1029288, 1203163, 1069641]
16945A069641j72278K52046j59920K88117M3583j86162R9020K28911j82308p3608
16935A207042j06105K49464j23520j37641M24567J3742m51104N24974k20370k31457
16925A149592L28354r9847J92982J13424J8851k16668L5875j00630J46586k35985
16915A332534L22567m5727P0836k8662j19888L44614j63378J6907j90634K82588
16905A821757k60038L56173J55405p8400l94697N44856Q6239j95090q6343j52211
16895A797651k22993M61831l03042L67324J79515j27820j09741J53581m64881
16886A731425L88074R9797j56612P271J38441n4500J55163O287Q5456O2577k542
16875B460837j36683J54690j10667j34912J61977K61893P2154j01859P2872r6876
$$ y = [1069641, 897363, 1149409, 989489, 1277606, 1321189, 1135027, 1234047, 1462958, 1280650, 1207042, 1100937, 1350401, 1226881, 1089240, 1513807, 1527549, 1076445, 1601419, 1381049, 1149592, 1477946, 1378099, 1571081, 1684505, 1703356, 1486688, 1522563, 1421933, 1568519, 1332534, 1655101, 1609374, 1680210, 1651548, 1531660, 1876274, 1712896, 1729803, 1539169, 1821757, 1561719, 1917892, 2073297, 1994897, 1600200, 2145056, 2231295, 2036205, 1949862, 1797651, 1574658, 2036489, 1733447, 2100771, 2280286, 2152466, 2042725, 2196306, 1731425, 2119499, 2219296, 2062684, 2069955, 2208396, 2153896, 2309059, 2315346, 2400802, 2463379, 2460837, 2324154, 2478844, 2368177, 2233265, 2395242, 2657135, 2729289, 2627430, 2700302, 2603426]
16865B603426K12998j3329K66302l30880K58626N7378L48128m18949J79994L1153
16855C194847k36233K56005j18926k8760N65457j66319k37099O70228r3365j02181
16845C703654J91965J18776j31099l02437N90130l60492J30180J6646L67767o7508
16835D257582j19909K39221L02825j11987L96645l96447n6379M90081l3794k70075
16825D697763K76953O74152n92735M20792J17989J63152R1328l24051L08301K20598
16815F054242L34980q1779K50682P736J13894L48518M383L42753k37111K23976
16805G362274K45775K78677L87401j71685N3021L99145J05929J27203L87495o2478
16795I112757M53458K14772N09750l34624L68390M93558J05014M10173L63555
$$ y = [2603426, 2816424, 2803095, 3069397, 2738517, 2997143, 3054521, 3402649, 2983700, 3163694, 3194847, 2958614, 3214619, 3095693, 3066933, 3632390, 3466071, 3228972, 3899200, 3805835, 3703654, 3895619, 4014395, 3883296, 3580859, 4170989, 3810497, 3940677, 3957323, 4325090, 4257582, 4137673, 4376894, 4679719, 4567732, 4964377, 4567930, 4511551, 5001632, 4967838, 4697763, 4974716, 5648868, 5056133, 5476925, 5594914, 5758066, 5849394, 5525343, 5833644, 6054242, 6389222, 6307443, 6558125, 6565861, 6679755, 7028273, 7032656, 7375409, 7138298, 7362274, 7608049, 7886726, 8274127, 8102442, 8155463, 8554608, 8660537, 8787740, 9175235, 9112757, 9566215, 9780987, 10290737, 9956113, 10324503, 10818061, 10923075, 11333248, 11696803]
16786A1696803K69916K12861N40718J58725M11077L59790K27516Q70109K78419
16777A5025934L83156O12277P1723J080920L55953N81648M54286R82114K98637
16768A9846648Q75336N38804J171293N93601Q40913J218869N89015J044740J278851
16759B7998070J115549J591841J044836J354354J022864J756447J751342J555866
16751C9191169J855965K081513K047641K322903K551147K098078K948497K950432
16743E8047345K683519L451954L557205L924547L848887M162368M827221M868980
16735H9372026M689019N731029N476924O134594O298374O430396O656329O968873
16727A37757564P283100O538037O763390O400192O230443N540967N235133L481960
$$ y = [11696803, 11966719, 12179580, 12720298, 12879023, 13290100, 13649890, 13877406, 14747515, 15025934, 15409090, 16021367, 16093090, 17174010, 17529963, 18111611, 18565897, 19548011, 19846648, 20721984, 21260788, 22432081, 23025682, 23866595, 25085464, 25674479, 26719219, 27998070, 29113619, 30705460, 31750296, 33104650, 34127514, 35883961, 37635303, 39191169, 41047134, 43128647, 45176288, 47499191, 50050338, 52148416, 55096913, 58047345, 60730864, 64182818, 67740023, 71664570, 75513457, 79675825, 84503046, 89372026, 94061045, 99792074, 105268998, 111403592, 117701966, 124132362, 130788691, 137757564, 145040664, 151578701, 158342091, 164742283, 170972726, 176513693, 181748826, 185230786]
16719A85230786L061907J789554P66402o28786j791714k747535l968872m611705
16711A77100037n795792o602884o492806p185600p056375p034240o993805o967046
16703A22971489o865422o737980o210837n730138n903613n072211n504577m293445
16695G6653266l736858m076134m242678k999386l471646l381039k693581k749874
16687D9302070k773654k088276k024643k217644j745180j766732j681206k090076
16679C2914659q34530j480733j430539j414513r60760p66835r08714j495495q18876
16670B2803664r07799r38833o52901r21203n00327n46958p44152l98508p15341
16661A6477642n81493n70056n74190k84910o81846n59770l19108p51732K13155
$$ y = [185230786, 188292693, 190082247, 190848649, 190219863, 188428149, 185680614, 181711742, 177100037, 171304245, 164701361, 158208555, 151022955, 143966580, 136932340, 129938535, 122971489, 116106067, 109368087, 103157250, 97427112, 91523499, 86451288, 80946711, 76653266, 72916408, 68840274, 64597596, 61598210, 58126564, 54745525, 52051944, 49302070, 46528416, 44440140, 42415497, 40197853, 38452673, 36685941, 35004735, 32914659, 32080129, 30599396, 29168857, 27754344, 26793584, 26026749, 25118035, 23622540, 22803664, 21895865, 20957032, 20304131, 19382928, 18882601, 18335643, 17591491, 17192983, 16477642, 15896149, 15326093, 14751903, 14466993, 13785147, 13225377, 12906269, 12154537, 12367692]
16652A2367692j00958n46457m22470m30066l79702r4305m64523l77161k52823
16643I299227k49099J45076l15642r2108n45890j82108j48293k86108r181m58855
16633G157019L3655k34322k52889r1310j69964J32659n51590O3232l03561j16890
16623E666039j77604m3082K49146m30713R1315j52758k66020k4111K88256l01956
16613D898512k68652q3168l3096k10017M5807l02282J89970k78455K52206j40035
16603D070790m32390J5233J5984K57424l44651j16223l01415K90153j47662j56525
16593C150718J45193k31360J2041N8232j99848M2932j83372K56354n23232L20601
16583B848259j57372o5460R2957r9163o7567j67256o7993J67646o0017l38665
$$ y = [12367692, 12266734, 11720277, 11297807, 10867741, 10488039, 10393734, 9929211, 9552050, 9299227, 9050128, 9195204, 8879562, 8787454, 8241564, 8059456, 7911163, 7625055, 7615874, 7157019, 7190674, 6956352, 6703463, 6612153, 6442189, 6574848, 6023258, 6086490, 5782929, 5666039, 5488435, 5445353, 5694499, 5263786, 5355101, 5202343, 4936323, 4912212, 5200468, 4898512, 4629860, 4546692, 4513596, 4303579, 4349386, 4047104, 4237074, 3958619, 4210825, 4070790, 3638400, 3653633, 3669617, 3927041, 3582390, 3466167, 3164752, 3454905, 3307243, 3150718, 3295911, 3064551, 3076592, 3134824, 2934976, 2977908, 2794536, 3050890, 2527658, 2848259, 2690887, 2625427, 2718384, 2619221, 2551654, 2384398, 2316405, 2484051, 2424034, 2085369]
16573B085369K03201p2769J7231Q270j17470l738r7516J85531k39899n7647j8110
16562A892453j92400K64158k36208J47098J0165J16170k72250Q7812j16895j46745
16552A553358R0917K20267J68242j43676k38786P1855j26106J10682J59725l09462
16542A557016K01291l47376J37678k59754J25821J47109m57626M94731k06562
16533A392328J19055q9877j74307k6243O5033j29391J30698K9042r5686J63547
16523A384199j71968k26900J08498n5418K42400k23794L58131M4836n48384L85467
16513A297067M6321l24541j8603L55894o06635K71909l9394k0605j06549K42069
16503A096933j05023K53207o9502l05511R6407J41179j54088K5580r9203J41968
$$ y = [2085369, 2288570, 2215801, 2233032, 2241302, 2123832, 2120094, 2022578, 2208109, 1968210, 1910563, 1892453, 1700053, 1964211, 1728003, 1875101, 1885266, 2001436, 1729186, 1816998, 1700103, 1553358, 1644275, 1864542, 2032784, 1889108, 1650322, 1722177, 1596071, 1706753, 1866478, 1557016, 1758307, 1410931, 1548609, 1288855, 1414676, 1561785, 1104159, 1598890, 1392328, 1511383, 1421506, 1247199, 1220956, 1285989, 1156598, 1287296, 1316338, 1220652, 1384199, 1212231, 985331, 1093829, 1038411, 1280811, 1057017, 1415148, 1459984, 911600, 1297067, 1343388, 1018847, 1000244, 1356138, 749503, 1021412, 982018, 961413, 854864, 1096933, 991910, 1245117, 1175615, 870104, 966511, 1107690, 953602, 979182, 879979, 1021947]
16493A021947m5814k8329k67517O87187o79458L52543r7949n6009m1526n6356
16483G88719l6567o2804m5697J22010q7938k88571N22422k90699O0408j11612
16473E69671P4606j28179K92997l90980K64742j29007p455N3045L4106J23644
16463G57190j62825J64292j32635J52701k72981K99420k18422j21092J89366k78920
16453C76094O8345K53681j71981N46232m02733j41566j85130m1187K29351n3622
16443D77484J04333A47985M18734K37100C17760K2376l8594L97085k03165j60077
16433C35385K04099j01776j19482N0543n7471m4718N23150l89167J03637J02645
16423F06845j51997o1459M1910J34229J52063j85407O4398K01910C33691O8790
$$ y = [1021947, 976133, 947804, 680287, 1367474, 688016, 1040559, 942610, 886601, 845075, 788719, 752152, 689348, 643651, 765661, 677723, 389152, 911574, 620875, 681283, 569671, 644277, 516098, 809095, 418115, 682857, 553850, 546395, 599440, 633546, 757190, 594365, 758657, 626022, 778723, 505742, 805162, 586740, 465648, 655014, 376094, 444439, 698120, 526139, 1072371, 669638, 528072, 342942, 301755, 531106, 477484, 581817, 147985, 566719, 803819, 317760, 340136, 301542, 698627, 495462, 335385, 539484, 437708, 318226, 368769, 311298, 266580, 789730, 400563, 504200, 606845, 454848, 393389, 435299, 569528, 721591, 536184, 600582, 802492, 333691, 402481]
16413D02481N7842B27557p982J57212J60034k58672K79618k28863J55772A87701
16402C33124q7966j6924o1306J62689J06186j94740p2385N2993Q6856j36050O8048
16391B40525h893E73895B73989K61462J6646j50824I8067A8032M37614j53684
16381C01962L37009C07941J40499k17291l2323K71857B04903J46791r6451A02351
16370E44831j63352j36905L5171k2140j20268J72274P3036A56694K71565A53892
16359A20203K26239k8138K1014a30167B78320M7333A46855L75035A48406K46709
16349C95115j47513J57438L4488e4350B50663P8589q4295L8957R3437A60850O7365
16338B28215J3219m4303J96346j75524L82318p40A66158a09955B83862N0636b7266
$$ y = [402481, 460323, 227557, 219575, 376787, 536821, 278149, 557767, 328904, 484676, 187701, 333124, 245158, 228234, 166928, 329617, 435803, 241063, 168678, 221671, 308527, 172477, 240525, -8893, 573895, 273989, 535451, 552097, 401273, 98067, 18032, 455646, 301962, 638971, 307941, 448440, 231149, 198826, 470683, 204903, 351694, 255243, 102351, 544831, 381479, 244574, 279745, 257605, 137337, 309611, 382647, 156694, 428259, 153892, 120203, 346442, 318304, 339318, -130167, 278320, 325653, 146855, 521890, 148406, 395115, 247602, 405040, 439528, -54350, 250663, 329252, 244957, 283914, 377351, 160850, 228215, 241434, 197131, 393477, 217953, 600271, 599531, 166158, -109955, 283862, 334498, -27266]
16326C11893A22133n4319L95615i436q2994D03165j78692J22401j15177c5436
16315B09396J90646a8485A17505j1965e942C84323J25614b35065G2606L5865A4157
16303C0795N02999A9160J02747a25663A10278C9295g8857c5229A04538J11394
16293B15932d03p8373C16152r8352j07759K9156J13J41062E226J08407D7947K85879
16281C33826a68485A82126e0525o6975B2571M17179k03896Q3670j26707o2281
16271A30536K43989j67922H6894K34739D4489J51559a377A48017K54379f734D3765
16259B6505L28546j53013j4089H6689J51600n0389M6620j03535i358B01445B6229
16247A7281L41433q4332j14726a9570C91055A23985b53448e8996A52312h4961
$$ y = [311893, 122133, 67814, 463429, -9436, -92430, 403165, 224473, 346874, 231697, -35436, 209396, 400042, -18485, 117505, 105540, -5942, 384323, 509937, -235065, 72606, 108471, 14157, 30795, 533794, 19160, 121907, -125663, 110278, 39295, -78857, -35229, 104538, 215932, -403, -78776, 316152, 217800, 110041, 139197, 139310, 280372, 5226, 113633, 47947, 333826, -168485, 182126, -50525, -117500, 22571, 439750, 235854, 319524, 192817, 130536, 374525, 206603, 86894, 321633, 44489, 196048, -1377, 148017, 402396, -6734, 43765, 26505, 355051, 202038, 187949, 86689, 238289, 187900, 234520, 130985, -9358, 201445, 26229, 17281, 358714, 274382, 159656, -19570, 391055, 123985, -253448, -58996, 152312, -84961]
16236A61903A2586K5146M1156f6130B30838a17836a3902E9457a0998A82895E8297
16224a3722E5502J44490D8530J37833G9835M7842B9951M840a95253A91753b1592
16212A30728M7793a33090N5256M7C18609e691A26363B7544L78023j60775a29244
16200b57k47384a04397B50906b46602B96889c2283B8066K59826A03383e8000l7025
16189i5025A50987g160j16827B15953c1627D3907a78534f7790R764n0388A81739
16177a72277e3542E4514B0133b32069B35361J65420A05518a80124A47846R9164
16167B47010d7430G0480C1876K83412a08574G8801a35879k54165D67076a28421
16156I301g678j95404P7017d9651J4414K768j37616g0865B13159k4405i3584b4415
$$ y = [161903, 12586, 37732, 78888, -66130, 230838, -117836, -13902, 59457, -10998, 182895, 58297, -13722, 55502, 199992, 48530, 186363, 79835, 127677, 29951, 34791, -195253, 191753, -21592, 130728, 178521, -133090, -77834, -77787, 318609, -5691, 126363, 27544, 405567, 244792, -129244, -257, -247641, -104397, 250906, -246602, 296889, -32283, 28066, 287892, 103383, -58000, -95025, 150987, -7160, -123987, 215953, -31627, 43907, -178534, -67790, -58026, -108414, 181739, -172277, -53542, 54514, 20133, -232069, 235361, 400781, 105518, -180124, 147846, 247010, -47430, 70480, 31876, 315288, -108574, 78801, -135879, -390044, 467076, -128421, 9301, -7678, -203082, -126065, -49651, -35237, -32469, -170085, -70865, 213159, 188754, -93584, -24415]
16143d3298a2153B734R8650a24501c09E7232h6367c2999q1655A81126G6570P1709
16131A48279E8500M7027J16073m3577b81705B77473e9235C41655G4646i7906A2250
16119C8849N2638K6301b38756e2907n2742q3270B94687h1633q7247C4196J87718
16108B21914o3889b69938d3067C303L45220j28643l3479F0194f2387A23236E6169
16096h9202k4709C4734K9219Q44I222k26a67652f9500j15449g9642L0781H2951
16083a29143r5112C6640j6765R7702m6805a80310C42931r6270e3219H0916h3885
16071a80144C24760b12856A58998b33129P1766j43524I5423R9588c10386J28620
16061a81766A24577b36044O7307B7521d480F5081g1262I0559b67350A06312g1361
$$ y = [-43298, -12153, 2734, 101384, -124501, -309, 57232, -86367, -32999, -114654, 181126, 76570, 148279, 58500, 105527, 221600, 178023, -281705, 277473, -59235, 341655, 74646, -97906, 12250, 38849, 91487, 117788, -238756, -52907, -105649, -188919, 294687, -81633, -168880, 34196, 221914, 158025, -269938, -43067, 3303, 348523, 219880, 186401, 60194, -62387, 123236, 56169, -89202, -113911, 34734, 63953, 64797, 9222, 8996, -167652, -69500, -184949, -79642, -48861, 82951, -129143, -224255, 36640, 19875, 117577, 70772, -180310, 342931, 246661, -53219, 80916, -83885, -180144, 324760, -212856, 158998, -233129, -161363, -304887, 95423, 195011, -310386, -181766, 124577, -236044, -168737, 27521, -4480, 65081, -71262, 90559, -267350, 106312, -71361]
16049B5253c89446J66304A02568a85968Q6740j20511A62861B9796K79709a08249
16038c4670D4372P7579b37865A09365f2006H1035h953A39595c77237A0366J63801
16027A74167i1063o5903b652k6754G0692L15575j42714D9796R7273a50429A55138
16015g650A5585J3536b57872g1041r1060j22120h6648F9682i7425C23835a37942
16003C37664F2868e1037J9684j7779J2279k17805H0084a01476p740p7940l20948
15992e08104a64228B04078a6278q9216A17825l093e0711B05993D6066K77034p374
15981C15726m0700n3236J5228n1483E3316K71021n8124F2357a98289D5994b8865
15969f572o2795E7561J21831J20476a38574M7860a3642l5734j69497N7095A76137
$$ y = [25253, -389446, -223142, 102568, -185968, -99228, -219739, 162861, 29796, 309505, -108249, -34670, 44372, 121951, -237865, 109365, -62006, 81035, -8953, 139595, -377237, 10366, 174167, -91063, -156966, -2652, -29406, 70692, 386267, 243553, 49796, 147069, -150429, 155138, -7650, 15585, 29121, -257872, -71041, -162101, -284221, -86648, 69682, -97425, 323835, -137942, 337664, 62868, -51037, -31353, -49132, -36853, -254658, 80084, -101476, -109216, -187156, -508104, -164228, 204078, -16278, -105494, 117825, 114732, -50711, 205993, 46066, 323100, 315726, 275026, 221790, 237018, 185535, 53316, 324337, 266213, 62357, -198289, 45994, -28865, -6572, -69367, 57561, 179392, 299868, -138574, -90714, -13642, -49376, -218873, -161778, 176137]
15957f9219K0663A26208d29807a07207j49106G623M201P3051a44887j12125j4210
15946b71222A57041E4496R9604a55005F4136e6862H7860K72041i2229A274O9548
15935G0822l1854i4493J2400l36833b033m1546p2658Q6B4936C779K72088a9552
15922b53075i9189I1748e7780j66635o2464J41873A28597J04882J62967b1536
15911A06597Q4787C197j226i0848A13859c15388j32061C6761a26740B05909c63738
15899A59639c4106m4588J2100B3184J17947a36826l25958A05344a39709K2600
15889a17109A97916I667a45564j6527g6904k7715n4934C5597K59667r1160D183
15877I0738D886h7711q3212j62011a01186a9747F6349J37902E2785c0419j23980
$$ y = [-69219, -48556, 126208, -429807, -107207, -256313, 7623, 11824, 84875, -144887, -257012, -271222, 157041, 54496, 154100, -155005, 64136, -56862, 87860, 359901, -92229, 1274, 70822, 38968, -94493, -82093, -418926, -2033, -43579, -116237, -116151, 24936, 3779, 275867, -19552, -253075, -99189, 91748, -57780, -224415, -286879, -145006, 128597, 233479, 396446, -21536, 106597, 191384, 3197, 1971, -90848, 113859, -315388, -447449, 36761, -126740, 205909, -363738, 159639, -34106, -78694, -66594, 23184, 141131, -136826, -462784, 105344, -139709, -117109, 197916, 9667, -145564, -162091, -76904, -104619, -159553, 35597, 295264, 204104, 4183, 90738, 4886, -87711, -170923, -332934, -101186, -19747, 66349, 204251, 52785, -30419, -154399]
15866a54399C2102a48812c9546C85318a82191E9853c6523k10572A35202g6262
15855A20167f8887j39837F2960h2849b0614j31076O2808p2588A37025a46813q5031
15844b31844a10292k43665G8168J9846P0267c62612R5625k68231c6510F6552a61239
15832a58464j51217A15647a2444j68031a9691A27684a01385Q761B48737A06048
15821i8245G576a74037j0597M9184D1733f8924m5882o100K4193D4178a86582A24377
15808C7047a47794I4210L0754a33704n4877A34284K3867K24325c1610j60203j12786
15797c04599J01029R7966M3904j66715a8648o4477c9152B95791h6216D850a20027
15785a48762B60336a9339m7264J506A76933c2244o6440c1363j00040L2842D1340
$$ y = [-154399, 32102, -148812, -39546, 385318, -182191, 59853, -36523, -247095, 135202, -76262, 120167, -68887, -208724, 62960, -82849, -20614, -151690, -88882, -161470, 137025, -146813, -231844, -110292, -353957, 78168, 98014, 168281, -362612, -266987, -535218, -36510, 66552, -161239, -158464, -309681, 115647, -12444, -180475, -19691, 127684, -101385, -92624, 248737, 106048, -98245, 7576, -174037, -184634, -135450, 41733, -68924, -114806, -120906, -96713, 44178, -186582, 124377, 37047, -147794, 94210, 124964, -133704, -188581, 134284, 158151, 382476, -31610, -191813, -304599, -203570, -105604, -61700, -228415, -18648, -83125, -39152, 295791, -86216, 4850, -120027, -148762, 260336, -19339, -66603, -65097, 176933, -32244, -98684, -31363, -131403, -98561, 41340]
15773A70784c22821A80868b26694a9876k9194A10205b25972E5413N3626l395a48538
15761B75926j25206m1067c27499C20222o8665n7523N8035k6945a737B88480a2513
15749C4033D507J52156J33536p7810l8431p5375a88246A56011a79469A14373b09887
15737A67174h6496p8658F0058a45045A65622f1402k21858A43133A2003J02754
15727A14757B5047A0272c72410i968j5342r4232A17128J21906k7572b8752I118
15715d4282m4921M3627k35574p2367A83446F3196b19559B43146e3062A79665r215
15704A70450a24198L2581l9389B0625d6555a717j05490j57042A12047c40600B14006
15692C10368g9743G430A071J42908C5539M40580k25047F0132K0193b65181A00246
$$ y = [170784, -322821, 180868, -226694, -19876, -49070, 110205, -225972, 55413, 109039, 105644, -148538, 275926, 150720, 109653, -327499, 320222, 251557, 194034, 252069, 225124, -1737, 288480, -12513, 34033, 4507, 156663, 290199, 212389, 173958, 98583, -188246, 156011, -179469, 114373, -209887, 167174, -86496, -165154, 60058, -145045, 165622, -61402, -283260, 143133, 12003, 114757, 25047, 10272, -372410, -9968, -25310, -119542, 117128, 239034, 211462, -28752, 9118, -44282, -89203, -45576, -281150, -353517, 183446, 63196, -219559, 243146, -53062, 179665, 170450, -124198, -91617, -131006, 20625, -46555, -1717, -107207, -264249, 112047, -340600, 214006, 310368, -79743, 7430, 1071, 143979, 35539, 476119, 251072, 60132, 80325, -265181, 100246]
15680C0713K7244r381a59967m7802k8856e4843A46773a40972A20918f2174D11298
15668B1509g6817o6275m0620r3804j48395e4147l42452A25834b58366d5133j69492
15657b14625e4313A20907a46821o7582J01664k3318C3032J44859E473K08245b95058
15645C64109a93785q6671C9758c5410A52823B1753K09624e4880k4096A17083j0537
15634A06546J35305N948b60762e4978m1019B85928i0949B63476a59940K500N82
15623a56858l1670h7381g254C7840b23573B8623c15969A4442L00200B2033e7628
15611H7471a60646A05046h044m8258A48020c23163J32965F4107J71027c25152
15600I3723J40734r9717c83361B01566b02983M9768k25950D4440N0154a18773
$$ y = [30713, 57957, 48576, -159967, -207769, -236625, -54843, 146773, -140972, 120918, -62174, 411298, 21509, -76817, -143092, -183712, -277516, -425911, -54147, -396599, 125834, -258366, -45133, -214625, -54313, 120907, -146821, -214403, -112739, -136057, 33032, 177891, 5473, 213718, -295058, 364109, -193785, -280456, 39758, -35410, 152823, 21753, 231377, -54880, -78976, 117083, 106546, 241851, 247799, -260762, -54978, -95997, 285928, -90949, 263476, -159940, -157440, -156858, -188528, -87381, -7254, 37840, -223573, 28623, -315969, 14442, 314642, 22033, -57628, 87471, -160646, 105046, -8044, -56302, 148020, -323163, -190198, 64107, 235134, -325152, 93723, 234457, 134740, -383361, 201566, -202983, -153215, -379165, 44440, 94594, -118773]
15589d2949a6143B54929p2363c64750K8934A0157a42804n0482F2033P7248n7041
15578H2240C7934b53350i9187A34420f0549p8129L3893k6093b9513G0489a01752
15566F0501a71504D36736b47825B96576N4494A00223D6922G846J65719d579A94108
15554d0559A16902e8388a457F643Q192k027K06295c14954B9358a89709E0047P7147
15542A27194l9513l5391g3720I6609M0499D0524K38483I5582M361a01168A18088
15530c46045G643R4829a95233b2833B6781a86963E8959i7510n27010a8078E95441
15518a69383g5769c7665j4053D31237Q78f4571k60882F7095a17190B33203F5059
15506e64k7728j77659B07027b53199f2905A81871L2294k5498b03478k28074J19235
$$ y = [-42949, -16143, 254929, 182566, -364750, -335816, 10157, -142804, -193286, 62033, 139281, 82240, 37934, -253350, -99187, 134420, -60549, -138678, -104785, -130878, -29513, 70489, -101752, 60501, -171504, 436736, -247825, 296576, 351070, 100223, 46922, 7846, 173565, -4579, 194108, -40559, 116902, -58388, -1457, 6643, 14835, 12808, 219103, -314954, 29358, -189709, 50047, 127194, 87681, 52290, -73720, 96609, 137108, 40524, 279007, 95582, 99943, -101168, 118088, -346045, 7643, 102472, -195233, -22833, 26781, -186963, 58959, -97510, -624520, -18078, 595441, -169383, -75769, -37665, -51718, 431237, 432115, -64571, -325453, 67095, -117190, 233203, 65059, -564, -28292, -205951, 207027, -253199, -62905, 181871, 214165, 188667, -203478, -431552, -312317]
15495c12317b7069m616A47095P6909j9985E5981c8431l7409G0485b66492E1399
15483F4605g4603A31480b09552b5839l5631j10016J4916a1397j71684M000l6653
15472b15734C54784a94423e5219k9309C95979A43179J46234b09424A77829b76691
15461D16860A28971A5274b60430a25531E1146K08427A27809C3193Q2185m9307
15451F6071K1771E832a16086k15005f4221I6549a77245A0179h4099A88459c16585
15439A39104J26257e9820I6245K01374l499b24437K4118g177C41558a7521k47028
15428b64549F3476e7603A32528b08884q3232H3423a22261I7339f8570C961L1359
15417C5320a68734k6974K6558j35776A67153K7026N5163n0128b46681A29638b4571
$$ y = [-312317, -27069, -31685, 147095, 224004, 204019, 55981, -38431, -75840, 70485, -266492, 51399, 64605, -74603, 131480, -209552, -25839, -61470, -171486, -156570, -11397, -183081, -179081, -215734, 354784, -194423, -55219, -84528, 395979, 143179, 289413, -209424, 177829, -276691, 416860, 128971, 15274, -260430, -125531, 51146, 259573, 127809, 33193, 115378, 66071, 87842, 5832, -116086, -331091, -64221, 96549, -177245, 10179, -84099, 188459, -316585, 139104, 265361, -59820, 96245, 297619, 294120, -224437, -200319, -7177, 341558, -17521, -264549, 63476, -57603, 132528, -208884, -292116, 83423, -122261, 97339, -68570, 3961, 35320, -168734, -195708, -169150, -304926, 167153, 194179, 249342, 199214, -246681, 129638, -24571]
15405A66084Q3241j10511o3902K03479a67516A45659f0520r2895J3643A33818
15394e4368k65490B56833G4407J23850I040K32559D4311l438j2442a76557A72300
15382e073k10977d6562l9134G962J38550c16492A16698d7128E6433c35645a02262
15370b7636A08087A7710a18668B4983K45276j4781J55084C7457K84880I0423a80393
15358A42354a58313C84594G1432K7634b8046k77693K1460J40873A30959J68852
15348B99811A12586K9156b0983o8971D14755d6838m0918C4673g3204A85401a5185
15336a94946A26669D9060A7839e9657K0451n5723n9920J6572e5372k4035A14974
15324a15739e5289A24313D4479R8894A4545b1172C10965j51236d3783j05664E1389
$$ y = [166084, 249325, 138814, 74912, 278391, -167516, 145659, -60520, -153415, -139772, 133818, -54368, -319858, 256833, 74407, 198257, 9040, 241599, 44311, 40873, 28431, -176557, 172300, -5073, -216050, -46562, -85696, 7962, 146512, -316492, 116698, -47128, 56433, -335645, -102262, -27636, 108087, 17710, -118668, 24983, 270259, 255478, 410562, 37457, 322337, 90423, -180393, 142354, -158313, 384594, 71432, 99066, -28046, -305739, -284279, -143406, 130959, 299811, 112586, 141742, -20983, -89954, 414755, -46838, -87756, 34673, -73204, 185401, -15185, -194946, 126669, 49060, 17839, -59657, -39206, -94929, -154849, -138277, -55372, -79407, 114974, -115739, -55289, 124313, 44479, 143373, 14545, -21172, 310965, 159729, -43783, -149447, 51389]
15312H4178J76444j16224C8641N2444Q1210a2509q3937M2100j01543k33102B01830
15300A37819M8218p6694P0767a0476C78580A82200o2790P7364I0830j317K9956
15289A19469A2519J64801B6939I71g8525B02741G3945C6511G745K88834O6400
15278C62979b869C5543L338d6449I9828K24253N574A7082R1484K2242d3588j07958
15266a51546D6440N7758d17002e1507B3216J73140r1680b5854E6204K97655a2316
15254c00597f4781I558b67909A09177b31370B2333R99608j9768j29316N70317
15244A443174k73821B40009J79409G9341J25716b88505D62405A04846N3758a0784
15233a24732C07147F8511b31125A57596C8148O9215O0578L3471a13279B14629
$$ y = [84178, 260622, 144398, 38641, 91085, 172295, -12509, -96446, -54346, -155889, -388991, 201830, 137819, 186037, 109343, 180110, -10476, 378580, 182200, 119410, 196774, 90830, 89513, 119469, 12519, 177320, 26939, 971, -78525, 202741, 73945, 36511, 7745, 296579, 362979, -2869, 35543, 38881, -46449, 99828, 324081, 329655, 17082, 108566, 130808, -43588, -151546, 46440, 104198, -417002, -51507, 23216, 196356, 104676, -25854, 56204, 353859, -12316, -300597, -64781, 9558, -267909, 109177, -231370, 22333, 1021941, 1002173, 872857, 1443174, 1169353, 240009, 419418, 79341, 205057, -288505, 462405, 104846, 158604, -10784, -124732, 307147, 68511, -231125, 157596, 38148, 107363, 167941, 201412, -113279, 214629]
15222A49620a75109p9524I7162b49899A41500j6214E9068N7217J28747G6176E176
15210B24222d533p3811F24039e3302D41601A13673J1543d7603j89370b367j81673
15199a84040A75928J98906H0990b71284B20814N2601I3169a00469C14876g7472
15188G6838a4473j24936B25142H6925J73428q6851O0722l9264a01875D02446D8319
15176I9032D5014a75191F729Q7827B2181a58437A60118D5814L87433A79133p9707
15165I9426K22553A9988L77952a57789f7577k61432a48902C44901A11578n1863
15155E9715k3767J8629K77657q2890J9843F0758d6918J829A21821g3544A03901
15143C5268a60726C44989q2514F522b05976E72688D4434d4112B21279H3792l8007
$$ y = [149620, -175109, -254633, 97162, -249899, 141500, 125286, 59068, 116285, 245032, 76176, 5176, 224222, -4533, -78344, 624039, -53302, 441601, 113673, 125216, -47603, -236973, -2367, -184040, 175928, 374834, 80990, -271284, 220814, 273415, 93169, -100469, 314876, -77472, 76838, -14473, -139409, 225142, 86925, 260353, 173502, 234224, 194960, -101875, 402446, 48319, 99032, 45014, -175191, 6729, 94556, 22181, -158437, 160118, 45814, 433247, 179133, 99426, 321979, 19988, 397940, -157789, -67577, -329009, -148902, 344901, 111578, 59715, 35948, 54577, 332234, 249344, 269187, 60758, -46918, -45089, 121821, -73544, 103901, 35268, -160726, 344989, 262475, 6522, -205976, 572688, 44434, -44112, 221279, 83792, 45785]
15132D5785c3192C12002a9525I0221d0345E1342J79529l0468H1328b0272G3222
15120A32737k746m7141J83182K604a5473C93216F4128b48287B20373L5836e1688
15108D8253P6450d0252D88910a13094D8498K03827e9569J581F4769i6893j2987
15097a09880j88389D24228a23456I6130a18879A48638f345B84563A39666o0741
15087G8925b8415A71895k0369l4196a60526C07864q2263J230j288F2662a11287
15075A42806Q3772Q7831a31154A62444k5F5721J18036K29790a88818A86882a28824
15063B28282A11003l8792a03992A17624j494J65991j01525J67958q9496A6964
15052E0308J73529J40491f0538B90720a3250I1784K60201j35393J81685A11626
$$ y = [45785, -33192, 312002, -19525, 90221, -40345, 51342, 230871, 200403, 81328, -20272, 73222, 132737, 129991, 82850, 266032, 268636, -15473, 393216, 64128, -248287, 220373, 256209, -51688, 48253, 124703, -40252, 488910, -113094, 48498, 252325, -59569, -57988, 64769, -96893, -109880, -298269, 424228, -123456, 96130, -118879, 148638, -6345, 284563, 139666, 78925, -28415, 171895, 151526, 117330, -160526, 307864, 225601, 226831, 225543, 62662, -111287, 142806, 226578, 314409, -131154, 162444, 162419, 65721, 183757, 413547, -188818, 186882, -128824, 228282, 111003, 72211, -103992, 117624, 116130, 282121, 180596, 348554, 259058, 16964, 50308, 223837, 364328, -60538, 290720, -13250, 91784, 351985, 216592, 398277, 111626]
15041I1799J50609A20963O835m5300C7999J27022L11645j78570j44441m8180E0804
15029C9226K20259a04430B17461J54677j55197O1082L714B7409J64662L4652q7653
15018A39070j5925a62314E17531k45082j2300F4051N04135B26336a652A11323
15007D79604k18926b31011E15178k08618j01983J74808c8824B96558A22223a92345
14996B02992K476l67O5454J08671j31995O0436j0822A28124a98117F36784A57485
14984A70129p1651J51341j16889J89289J37905A5686K40546o9637p5859K6616
14974A37352K9301R7973M385E1048J02293L24298k20647C3144R4041M38116A99797
14962C75657q0484a56270E80605e8386A43110K23216F9079Q1933p374L64997B5097
$$ y = [91799, 242408, 120963, 127798, 82498, 37999, 165021, 476666, 298096, 153655, 105475, 50804, 39226, 259485, -104430, 217461, 372138, 216941, 278023, 281737, 27409, 192071, 226723, 139070, 123145, -162314, 517531, 272449, 260149, 64051, 568186, 226336, -1652, 111323, 479604, 260678, -231011, 515178, 306560, 204577, 379385, -38824, 296558, 122223, -192345, 202992, 205468, 205101, 270555, 379226, 247231, 307667, 296845, 128124, -198117, 636784, 157485, 170129, 98478, 249819, 132930, 322219, 460124, 15686, 256232, 186595, 110736, 137352, 166653, 264626, 269011, 51048, 153341, 477639, 256992, 33144, 127185, 565301, 199797, 375657, 295173, -156270, 580605, -58386, 143110, 366326, 69079, 151012, 143638, 508635, 25097]
14950A03193J51510A23916K6047n590a46850B38065o1844o6439J93034J44617
14940D47433A36684N2242D2261K38546L15830k97681H1226L93043j88092J99464
14930D85641N5020R010B07063M1772r5334J11596q2974J79177A76623K49234A20268
14918B71188l054L2830j2666h6478c1241D08681r6047r976M1936r998j18494q0024
14906A36078C5554M7308L00931J87413K1987B11244J51210G2732K42817A38791
14895A77694J09430K86057r9167j3211j31182R0746j40896k4023q3468J9524K27767
14884D19271L2269K7490A28129Q0419R5977R9156j3568r738K9679J12595A74359
14872B50482M3873L8163Q8634J37643%A37523O99881C97711J12408j05267O5516
$$ y = [103193, 254703, 123916, 149963, 144373, -146850, 238065, 176221, 109782, 302816, 447433, 136684, 188926, 42261, 280807, 596637, 298956, 81226, 474269, 286177, 485641, 540661, 549671, 207063, 248835, 153501, 265097, 182123, 361300, 176623, 425857, 120268, 271188, 268134, 300964, 288298, -86478, -31241, 408681, 312634, 302658, 344594, 334596, 216102, 136078, 35554, 82862, 383793, 571206, 593193, 211244, 362454, 72732, 315549, 138791, 177694, 287124, 573181, 474014, 460803, 329621, 420367, 279471, 255448, 171980, 191504, 419271, 451540, 479030, 128129, 208548, 304525, 403681, 390113, 380375, 410054, 522649, 174359, 250482, 294355, 332518, 421152, 558795, 558795, 137523, 837404, 397711, 510119, 404852, 470368]
14861D70368j36375M17076j02799r3980o0380j78821K88525B51136P9377L3611
14851C64124K37519B96996O8517L0141J13589k1495j67516J41513r9768K04679
14841E66656A50082O54097j97695k26295j187K09990O7996N095j21661j39300
14831D01122J63849K6698k92990o6783j9125L03122A77127P6193P208K1925L36882
14820F19335L13681B53911L93282j34768J5444J38642B33064M74139j72814J5086
14810E49475j17618M06593k15056m4583o5697j42386L55130B78137J32034R2388
14800E02559Q1024K8801j30564J05915j77844a4743F19235l8846o4878K85338
14790H00849H2467L39281K68686j48509I5411N71747j96193O63974n34799k52906
$$ y = [470368, 333993, 751069, 648270, 554290, 493910, 315089, 603614, 251136, 330513, 364124, 601643, 296996, 365513, 395654, 509243, 487748, 320232, 461745, 361977, 566656, 150082, 804179, 606484, 380189, 379002, 588992, 656988, 662083, 540422, 401122, 564971, 591669, 298679, 231896, 212771, 515893, 177127, 253320, 260528, 282453, 619335, 933016, 253911, 647193, 512425, 527869, 666511, 233064, 707203, 534389, 549475, 431857, 838450, 623394, 578811, 513114, 370728, 725858, 278137, 410171, 502559, 583583, 612384, 481820, 587735, 409891, -14743, 619235, 580389, 515511, 800849, 82467, 421748, 690434, 541925, 95411, 667158, 470965, 1134939, 600140, 347234]
14780C47234L03022j5359J17472m2791q3579M09077m01296k10183L37223o8664
14770F92156J24726l71955L48070l10615L28567j71915L7647R8686k99969R5499
14760E70897q7423R1042j5341j1719N27663E13885M271O3708K09851K53177E20854
14748F21209j0983J64989R14j02544J9216J0888l50823L84340J53470l02090K51898
14737H40484N1343C99045J39188K56883J86198C51100L47560r2643N1895K2213
14727F80125L01791l17104Q2239j13181k33267N0698P9902M57253o1898M8083
14717I74641n0192J17784l74695L65081l45218L16958j10009p6240J90091L8191
14707A046392j44585J07575k75655K61489N679n0850n4022J27424k3439q5355
$$ y = [347234, 650256, 634897, 752369, 709578, 625999, 1035076, 633780, 423597, 760820, 692156, 816882, 444927, 792997, 482382, 810949, 639034, 676681, 775367, 475398, 570897, 483474, 574516, 559175, 547456, 1075119, 513885, 518156, 581864, 791715, 1044892, 520854, 621209, 610226, 775215, 776129, 673585, 692801, 703689, 352866, 737206, 890676, 588586, 840484, 891827, 399045, 538233, 795116, 981314, 351100, 698660, 606017, 657912, 680125, 981916, 664812, 747051, 633870, 400603, 451301, 531203, 988456, 926558, 974641, 924449, 1042233, 667538, 1032619, 687401, 1004359, 894350, 818110, 1008201, 1046392, 901807, 1009382, 733727, 995216, 1000895, 950045, 896023, 1023447, 1000008, 914653]
14697I14653k72868j3878K67538l08157N04824N0303k05031J87926j29211J3333
14687A009432J17469J91220l25740j43322j31811K43457l9458k012m27255K61239
14677G53219J76580K72363j52111K67155k88226r1633j48224J87313j9795R5777
14667A052418j39920O3534J25365q7739K37954m33182O3866K02556m1996J11446
14657A154302r4266j37930l7889M45957n9422j61342J5458J89467k48759L13671
14647A379247j36808P9486l2764P3755k15167K59463j06522J58710J0063m05493
14637A063970M30122K541o2801k52409K04668k61255L95323L8154p5272l95311
14627A087730J99996J59835Q6023p4962l44651K69733q115p6393J73071L35621
$$ y = [914653, 641785, 627907, 895445, 587288, 1092112, 1142415, 937384, 1125310, 996099, 1009432, 1126901, 1318121, 992381, 849059, 717248, 960705, 921247, 919235, 491980, 753219, 929799, 1202162, 1050051, 1317206, 1028980, 937347, 789123, 976436, 956641, 1052418, 912498, 976032, 1101397, 1013658, 1251612, 818430, 882296, 1084852, 1042856, 1154302, 1060036, 922106, 884217, 1330174, 1270752, 1109410, 1124868, 1314335, 1065576, 1379247, 1242439, 1321925, 1289161, 1362916, 1147749, 1407212, 1300690, 1459400, 1469463, 1063970, 1494092, 1496633, 1433832, 1181423, 1386091, 1124836, 1520159, 1558313, 1483041, 1087730, 1287726, 1447561, 1533584, 1458622, 1113971, 1383704, 1375589, 1299196, 1472267, 1807888]
14617A807888o11720M8143L2983N16004j49829k82899J5979J82505j55273K37015
14607A640796j45062K78928j57677P426l5035l62471L52264R8183J83225j77328
14597A683249J60629l43379J25866j80174J66054R8564m678J13920K00073m27406
14587A592718L08688k02069J62514L34618q2721k7251R627o4465J70473n7874
14577B144258k08331K28647K14165j97997L1431J6802K74653m50292L38116k24249
14567B167203r3730M694J96166P0184L27714L4846k74422O2718K63111K34063
14557B992547J81251J42991K87094j34976N07323K12836N31600Q05050J617135
14548G142851L876503R203100K5031945j966765B1090940I266698m528382j782109
$$ y = [1807888, 1196168, 1244311, 1277294, 1793298, 1643469, 1360570, 1376549, 1559054, 1403781, 1640796, 1495734, 1774662, 1616985, 1624411, 1589376, 1226905, 1579169, 1677352, 1860577, 1683249, 1843878, 1500499, 1626365, 1446191, 1612245, 1710809, 1706131, 1820051, 2020124, 1592718, 1901406, 1699337, 1861851, 2196469, 2113748, 2086497, 2096124, 2031659, 2202132, 2144258, 1935927, 2164574, 2378739, 2180742, 2212173, 2228975, 2503628, 2053336, 2391452, 2167203, 2073473, 2078167, 2274333, 2344517, 2672231, 2707077, 2432655, 2495373, 2758484, 2992547, 3173798, 3316789, 3603883, 3468907, 3976230, 4189066, 4720666, 5525716, 7142851, 11019354, 20222454, 45254399, 43287634, 21090940, 9266698, 4738316, 2956207]
14540B956207o32985k28247j34615m99753K92306J48754K77532k43931K14757
14531B150025q4675L40622l45188n8411J19807J25257P9056M2923l45332P3059
14521B097143J51611L53872J02408M0132k96474q8849J44645k5969N84741l48450
14511B714810L41885J65510m48615K99373q9657k71796o5800Q15428n32506L64986
14501C293618k71484J25183k63966N01920o8279K8384J36967j8602q4722K22207
14491C601226j84750K6426j59830J35426M70084j76888Q9591j76708K4174J75032
14481C823783L98066j93043j65506J94035j89116K00087R6728k19402L42567M5900
14471D334099j99438J56032L29798l08013K51032J25763r1791K41852m24152N87064
$$ y = [2956207, 2323222, 2094975, 1960360, 1460607, 1752913, 1901667, 2179199, 1935268, 2150025, 2065350, 2405972, 2060784, 2002373, 2122180, 2247437, 2326493, 2369416, 2024084, 2097143, 2248754, 2602626, 2705034, 2745166, 2448692, 2359843, 2504488, 2478519, 3063260, 2714810, 3056695, 3222205, 2773590, 3072963, 2983306, 2711510, 2645710, 3461138, 2928632, 3293618, 3022134, 3147317, 2883351, 3385271, 3316992, 3345376, 3482343, 3463741, 3379019, 3601226, 3416476, 3442902, 3283072, 3418498, 3888582, 3711694, 3801285, 3624577, 3648751, 3823783, 4221849, 4028806, 3863300, 4057335, 3868219, 4068306, 4165034, 3945632, 4288199, 4334099, 4134661, 4290693, 4620491, 4312478, 4563510, 4689273, 4597482, 4839334, 4415182, 5002246]
14461E002246k9314l18455K21099L51477m82894L98455L256L8608J61350L1391
14451E377219j9377k18212N90838j84836j5156n2851L15226J32630P7228j59537
14441E843172K02693J36391k00755N23686j58722J0843J42782j68575N23026p3571
14431F780970m66739R56541k32469O9280J30848J13231k72309N51326P0594L92005
14421H093278l56892J33011K80392K59005n754J09K03469J59540l1474K71965
14411I006649q9747J63291K83306N2845K23831J53598p0331K74455M34050k9725
14401A0402222L27034J45210J16760K44672j21473J98933L6643L48617J50819
14392A1849437L24514P8984J36997O68363l8529J14789K18405J03719P42360J77490
$$ y = [5002246, 4972932, 4654477, 4875576, 5227053, 4744159, 5142614, 5145870, 5184478, 5345828, 5377219, 5357842, 5139630, 5730468, 5545632, 5530476, 5477625, 5792851, 5925481, 6002709, 5843172, 6045865, 6182256, 5981501, 6505187, 6346465, 6357308, 6500090, 6331515, 6854541, 6780970, 6314231, 7270772, 7038303, 7107583, 7238431, 7351662, 7079353, 7630679, 7701273, 8093278, 7736386, 7869397, 8149789, 8408794, 8403040, 8403149, 8606618, 8766158, 8734684, 9006649, 8916902, 9080193, 9363499, 9416344, 9640175, 9793773, 9723442, 9997897, 10431947, 10402222, 10729256, 10874466, 10991226, 11235898, 11114425, 11313358, 11350001, 11698618, 11849437, 12173951, 12252935, 12389932, 13058295, 13019766, 13134555, 13352960, 13456679, 14199039, 14376529]
14382A4376529P5835L73750M73147K7244J29782M37552j30965J83250P97623N1326
14372A6795073P44055L19190J32714O00943K02387L02001K75338M00526P77574
14363B0549801J12149M68117M69077M08068O49409L51682N57817Q43895J82040
14354B4592055L56171O24866R66080L41335J131606P30165M88061O37399O20437
14345C0488175J026036O15513R81638N68415J458529P53923J015377R63541J079989
14336C8951136J140357J317508R68864J179102J470990J594336J277376J224318
14328D9123987J686450J822643J299995J867250J959104K315349J816151K016294
14320F3907223K427891K343419K755461K284483L011377L078858L306496L006684
$$ y = [14376529, 14452364, 14826114, 15299261, 15326505, 15456287, 15893839, 15762874, 15946124, 16743747, 16795073, 17539128, 17858318, 17991032, 18591975, 18794362, 19096363, 19371701, 19772227, 20549801, 20661950, 21130067, 21599144, 22007212, 22656621, 23008303, 23566120, 24410015, 24592055, 24948226, 25573092, 26539172, 26880507, 28012113, 28742278, 29230339, 29867738, 30488175, 31514211, 32129724, 33111362, 33679777, 35138306, 35892229, 36907606, 37871147, 38951136, 40091493, 41409001, 42377865, 43556967, 45027957, 46622293, 47899669, 49123987, 50810437, 52633080, 53933075, 55800325, 57759429, 60074778, 61890929, 63907223, 66335114, 68678533, 71433994, 73718477, 76729854, 79808712, 83115208, 86121892]
14312H6121892L688257L767121L983144L727654M580495M766733M539143N093441
14304A20267880N758401N844701O275429O380939O936855P331353P753454Q354564
14296A74903576Q754336R009383R422172J0434777J0475420J1314311J1710870
14289B46024845J2574581J3116996J3548009J3811724J4555102J4833642J4779005
14282C43243904J5300614J5518428J4917386J5100523J4463858J3428747J2679747
14275D44653207J1435414R837668P126572M023910O97210j129199m237423l120199
14267D69287160m806556o350018q206588j1700087j3165136j4573489j5463222
14260C95022064j6372503j6499660j6482319j6616337j6050732j4905289j4497109
$$ y = [86121892, 89810149, 93577270, 97560414, 101288068, 105868563, 110635296, 115174439, 120267880, 126026281, 131870982, 138146411, 144527350, 151464205, 158795558, 166549012, 174903576, 183657912, 192667295, 202089467, 212524244, 222999664, 234313975, 246024845, 258599426, 271716422, 285264431, 299076155, 313631257, 328464899, 343243904, 358544518, 374062946, 388980332, 404080855, 418544713, 431973460, 444653207, 456088621, 465926289, 473052861, 477076771, 477773981, 476644782, 472407359, 469287160, 464480604, 458130586, 449923998, 438223911, 425058775, 410485286, 395022064, 378649561, 362149901, 345667582, 329051245, 313000513, 298095224, 283598115]
14253B83598115j4432880j3260034j3087364j2189217j1995935j1143825j0294824
14246A97194036r985091r008217q155446q223589p624119o981626p215325o391101
14238A33609522n451786n732889n398537m953428m886026m468363m222969l360633
14230I5134891m279637l386959l477795l294822k946844l112990k782950k351760
14222F9501134k734320k110757j986069k346894j888686k275658j757420j769511
14214E2631819j380389j342281j359972j834407j731377j250058r35276j021293
14206D1776766r53644j227109j365911j521807j095076n08031m42229j092229
14198C3570730j148991n35055j186710o10583n72238n00108j034512r19284m87962
$$ y = [283598115, 269165235, 255905201, 242817837, 230628620, 218632685, 207488860, 197194036, 187208945, 178200728, 170045282, 161821693, 154197574, 147215948, 140000623, 133609522, 128157736, 122424847, 117026310, 112072882, 107186856, 102718493, 98495524, 95134891, 90855254, 87468295, 83990500, 80695678, 77748834, 74635844, 71852894, 69501134, 66766814, 64656057, 62669988, 60323094, 58434408, 56158750, 54401330, 52631819, 51251430, 49909149, 48549177, 46714770, 44983393, 43733335, 42798059, 41776766, 40823122, 39596013, 38230102, 36708295, 35613219, 35105188, 34662959, 33570730, 32421739, 31886684, 30699974, 30089391, 29517153, 29017045, 27982533, 27063249, 26575287]
14189B6575287n27247n76468o24704n61140p45357n59817l30193k23147p21258
14180B1705956n71255o26341k56274l27370m03181l09126o97822l20820n44361
14171A7649406l03081k43588Q5102p63666j79945l48297n93385k28811j22951
14162A4950784j29561l53521o2199m05970O0515o11306j66346n12474J21257k05918
14152A2685261p2950m48173n9431m84201k01392p9949k30004r8066k40634j79607
14142A0590854j15764R0589m13942l16246p3776J87703n78165j50943L75996k96938
14132I299368k32802O0656m55702j03665J72690j62567l08048P0532j51608m08823
14122G780031Q8815K09912m18154N3909j89703l60705l548k2525p5270K58732
$$ y = [26575287, 26048040, 25471572, 24846868, 24285728, 23540371, 22980554, 22650361, 22427214, 21705956, 21134701, 20508360, 20252086, 19924716, 19521535, 19212409, 18514587, 18193767, 17649406, 17346325, 17102737, 17187839, 16424173, 16244228, 15895931, 15302546, 15073735, 14950784, 14821223, 14467702, 14405503, 13999533, 14060048, 13448742, 13282396, 12769922, 12891179, 12685261, 12612311, 12164138, 12104707, 11620506, 11419114, 11339165, 11109161, 11011095, 10770461, 10590854, 10475090, 10565679, 10151737, 9835491, 9761715, 9949418, 9371253, 9220310, 9596306, 9299368, 9066566, 9127222, 8671520, 8567855, 8740545, 8577978, 8269930, 8340462, 8188854, 7780031, 7868846, 8078758, 7660604, 7714513, 7524810, 7164105, 7160557, 7138032, 7062762, 7321494]
14112G321494k0388o70533O9996K14190k10523m1345l41312L45125m08623j04707
14102F153374M75992k87976m93352L75998o01752M53537j26710l46351p9954L9475
14092E562281l8365j44418k4296o8504j2414j04916K59359m39179Q2429l5964
14082E036013l81238K68663k16925p0712l18469M05844O5048k35440J04019j29421
14072D527382m62701M01089j7810m62559L5608M46138m61274L31593l15965l1684
14062C989817o5782J348R6706L19215k21273j39292J04867l46275J50915j36260
14052C753986l0626K3087n57443K11764j06370L27607n1512k49589j38904K16410
14042C398410j08248j78760K38506k12953K16711n69134K75042J10168O2971j37981
$$ y = [7321494, 7301106, 6630573, 6700569, 6914759, 6704236, 6662891, 6321579, 6666704, 6258081, 6153374, 6629366, 6341390, 5848038, 6224036, 5622284, 6075821, 5949111, 5602760, 5522806, 5562281, 5523916, 5379498, 5355202, 5286698, 5274284, 5169368, 5428727, 4989548, 5071977, 5036013, 4654775, 4923438, 4706513, 4635801, 4317332, 4723176, 4788224, 4552784, 4656803, 4527382, 4064681, 4465770, 4447960, 3985401, 4021009, 4467147, 4005873, 4337466, 4021501, 3989817, 3924035, 3925383, 4022089, 4341304, 4120031, 3980739, 4085606, 3739331, 3890246, 3753986, 3723360, 3746447, 3189004, 3400768, 3294398, 3622005, 3570493, 3320904, 3182000, 3398410, 3290162, 3111402, 3349908, 3136955, 3353666, 2784532, 3059574, 3169742, 3232713, 3094732]
14032C094732N4867K7329k21460J98317L4123l33997P0194j7175j80152J66296
14022B893074m38162k4083N15062l41680L7953J70539k05911k01934l71208P20557
14012B754207l26232j81714J78469J0664j83684L66081k99797j84576J59204j16651
14002B175971J60979o5603l06565L36240k03744J17737j99459o1420K79058O0739
13992B293933J59933l2228M78896O59352K351771O432772K4559459J0618019k1898255
13983B5623652j2160606n366497k447035n20426j038111o23139J29969m17662
13975C180145n53080M96960m08388j12428J41289k4810l67365k45774J11265J01918
13965B319732m9372k02801m1116J85595j02006K8666k39792K57038j52982J94812
$$ y = [3094732, 3149599, 3176928, 2955468, 3153785, 3187908, 2853911, 2924105, 2906930, 2726778, 2893074, 2454912, 2430829, 2945891, 2604211, 2642164, 2812703, 2606792, 2404858, 2033650, 2754207, 2427975, 2246261, 2424730, 2435394, 2251710, 2617791, 2317994, 2133418, 2292622, 2175971, 2336950, 2271347, 1964782, 2301022, 2097278, 2215015, 2015556, 1954136, 2233194, 2293933, 2453866, 2421638, 2900534, 3559886, 5911657, 12344429, 36903888, 47521907, 25623652, 13463046, 8096549, 5649514, 5129088, 4090977, 3467838, 3597807, 3180145, 2627065, 3124025, 2715637, 2603209, 2744498, 2719688, 2352323, 2106549, 2217814, 2319732, 2270360, 2067559, 2026443, 2212038, 2110032, 2138698, 1898906, 2155944, 2002962, 2197774]
13955B197774m66101J69510J01948k4245k72230L45035j2197j14258r7098k0246
13945A807892J72132k41998j12555K95799l64858J93493K23034m43793N8450O7331
13935A654927j64974J26287k489j2475J12294n246M2162j88104L42295o72274
13925A232403L80884k76277k32638L80377o3195J23633m14102K86644N2633M1687
13915A512049j08520K5264K96162j52305K8577o78977M65201K32711l77932K39059
13905A481289p2587p127j78981j02438N96327m34071j84992M29821l34292j48473
13895A044476j07270K88083k7960N8070R6943l5131L6650m67858L70249K02778
13885A459030O4272k34401k3207J24236n9344l60879P0568L3839j31289J91959
$$ y = [2197774, 1731673, 1901183, 2003131, 1978886, 1706656, 2051691, 2039494, 1925236, 1828138, 1807892, 1980024, 1738026, 1625471, 1921270, 1556412, 1749905, 1972939, 1529146, 1587596, 1654927, 1489953, 1616240, 1613751, 1601276, 1713570, 1708324, 1750486, 1562382, 1904677, 1232403, 1613287, 1337010, 1104372, 1484749, 1421554, 1545187, 1131085, 1417729, 1470362, 1512049, 1403529, 1428793, 1724955, 1572650, 1601227, 922250, 1387451, 1620162, 1242230, 1481289, 1408702, 1401575, 1222594, 1120156, 1716483, 1282412, 1097420, 1527241, 1192949, 1044476, 937206, 1225289, 1197329, 1255399, 1352342, 1317211, 1353861, 886003, 1256252, 1459030, 1523302, 1288901, 1265694, 1389930, 1330586, 969707, 1040275, 1074114, 942825, 1134784]
13875A134784J96687l71575K26261o3984P220J64411j98734J45062l26699K94328
13865A207761K62945m4053m34809J77528q826J44088l43804j04664L66872K75310
13855A498348k63674j01967j24775n1337m4594K50713j9599j77029L41517k67705
13845A039898j7101j0086o5004J0449O8821j20270N40413n82006K43137j47851
13835I60400p0273L0125J2287l26509K46745K95696j02232n1940K58057m92798
13825G59558M83706k4843j68967l7245L45117n68548J29859J63366q2469j14149
13815H85385J21687j69739k1378J76843l18539N52446m56102j59700k8121K16858
13805G99640C79774L32438j70996L04451l28238K02777J41561k75299J26165L2574
$$ y = [1134784, 1331471, 959896, 1186157, 1122173, 1129393, 1293804, 1095070, 1240132, 913433, 1207761, 1470706, 1426653, 991844, 1169372, 1160546, 1304634, 960830, 856166, 1223038, 1498348, 1234674, 1132707, 1007932, 956595, 912001, 1162714, 1143115, 966086, 1307603, 1039898, 1022797, 1012711, 947707, 958156, 1026977, 906707, 1447120, 865114, 1108251, 960400, 890127, 920252, 932539, 606030, 852775, 1148471, 1046239, 994299, 1252356, 759558, 1243264, 1218421, 1049454, 1012209, 1357326, 788778, 918637, 1082003, 999534, 885385, 1007072, 837333, 815955, 992798, 674259, 1226705, 770603, 610903, 582782, 799640, 379774, 712212, 541216, 845667, 517429, 720206, 861767, 586468, 712633, 745207]
13795G45207K86934C87837O03172k84672l0642k4754R9291j79427J82346j20248
13785F32903M53355j98015j70864L83855n46304o2806K53889K65999k57648o4045
13775F90319J48131j61351q8126J08959k07305K4482N13098l54189J37832C90462
13764F17688j42169J44157o8114K57453j68594R5516k55774K22208j97396K09224
13754G14199j42829J32706j31182k78836N02952l52210P2191K66052k43317o8640
13744D71086M5076K29309k70387A47328J30390J49919j97414M36645j22553J16467
13734F60782p6746p7123J1784A20924N43079j38301K19861C01091K63888L07204
13724H72183D01421M62552k5190O6939m11757r9094k9437l1207O31463l10576
$$ y = [745207, 1032141, 387837, 991009, 706337, 675695, 650941, 750232, 570805, 753151, 632903, 1086258, 888243, 717379, 1101234, 554930, 492124, 746013, 1012012, 754364, 690319, 838450, 677099, 588973, 697932, 490627, 515109, 1028207, 674018, 811850, 390462, 617688, 475519, 619676, 551562, 809015, 640421, 735937, 480163, 702371, 504975, 714199, 571370, 704076, 572894, 294058, 797010, 444800, 516991, 783043, 539726, 471086, 516162, 745471, 475084, 147328, 277718, 427637, 230223, 666868, 544315, 660782, 584036, 506913, 518697, 120924, 664003, 525702, 745563, 301091, 564979, 872183, 401421, 863973, 838783, 905722, 493965, 394871, 365434, 334227, 965690, 655114]
13714F55114K35033l72008J8514R0225m2184J58230o487k09268J95191P1758J08416
13703I02534m24139J19358j60565R5747J11063j80k66518L13595k15116M2143
13693E17922J89807j76838j18243R1740J70697B05428K71368J2048p1351N62416
13683I79909D49168N49979D13914A55458J34053E3837P51563B90158N6216J72786
13673E19160k29483M5908K92246j93708O4009j3074A53787K25567k4579J57075
13663E11850N7690A78430M14011B62125M85262j32373j10286K9275o0787J13545
13653E86761l7348j42031J68014M6226n8372n0873j54976K37261j54268J2928
13643D53322A64250O3442K48789B05659O5065J56362Q7585j45708k8813D5268
$$ y = [655114, 890147, 518139, 536653, 626878, 584694, 742924, 736437, 527169, 722360, 794118, 902534, 478395, 597753, 437188, 532935, 643998, 643818, 377300, 690895, 475779, 517922, 707729, 530891, 412648, 504388, 675085, 205428, 476796, 488844, 417493, 979909, 449168, 999147, 413914, 155458, 289511, 53837, 805400, 290158, 346374, 519160, 289677, 335585, 627831, 434123, 498132, 485058, 153787, 379354, 354775, 511850, 569540, 178430, 592441, 262125, 747387, 615014, 504728, 534003, 473216, 586761, 549413, 407382, 575396, 621622, 563250, 512377, 357401, 594662, 440394, 453322, 164250, 227692, 476481, 205659, 270724, 427086, 514671, 368963, 340150, 45268]
13632C66765m7135J65949j64028R6935l6562J60050K00448k77741q1085o9612
13622C13984K15343j09113j49924n36K712E9030Q3916K12235j66187K56318j59062
13611B86250q6938L57318B45631j3222H5041M86890r4859M7292j24224r4565K43793
13600E49368K4434E2940K85627E9427J86362J32199C8865O3116J94968l6780N5091
13589C15260o0041J82637j18883J28801J14179B42511P2602A09172K18580A53080
13578D02170R8173B21677L4053K57158k47398L31618A98967M30909j43407A73114
13567B89657o7307j06658K17165J14982K27799A67889n5177M2184D7966M40310
13557D88276j5603l2266j41652O1001j19340L38035k25472p7365J46264j53859
$$ y = [366765, 319630, 485579, 321551, 418486, 381924, 541974, 742422, 464681, 383596, 313984, 529327, 420214, 270290, 269754, 272466, 59030, 142946, 355181, 188994, 445312, 286250, 199312, 556630, 245631, 232409, 85041, 571931, 477072, 524364, 400140, 305575, 549368, 573802, 52940, 338567, 59427, 245789, 377988, 38865, 101981, 296949, 260169, 315260, 255219, 437856, 318973, 447774, 561953, 242511, 315113, 109172, 327752, 153080, 402170, 500343, 221677, 255730, 512888, 265490, 597108, 198967, 629876, 486469, 173114, 289657, 222350, 115692, 332857, 447839, 675638, 167889, 112712, 154896, 47966, 488276, 472673, 440407, 298755, 359756, 240416, 578451, 352979, 275614, 421878, 268019]
13547B68019L71477D8492J94704M06407B84035J30137m1223L6135B03876E6858
13536D48827M8554j38950A29767L41266A78076J22683K26338q9357r6651J19363
13526D60452m7118Q5549e2411B97928J14437D4796J81827J68354N4255A19401
13515B16725J25798P8358j45085L45145k92311r983J7500J72428B31815K80654
13505E12469F3152K48404E5539M0051L67832j46048j32349J17090L34021C04127
13494B98782M4604d7875C23732o7032K47240K07229B26532L2150M16188c4601
13483A75464J9783L12011B15685B5922O31950B44472j5983R1071N4928J69793
13473E44281k49592j16085A7017M08008C6769K52665Q2896o9549A24240J19852
$$ y = [268019, 639496, 48492, 243196, 649603, 284035, 414172, 372949, 409084, 203876, 56858, 448827, 497381, 358431, 129767, 471033, 178076, 300759, 527097, 437740, 341089, 460452, 413334, 498883, -52411, 297928, 412365, 44796, 226623, 394977, 449232, 119401, 216725, 342523, 420881, 275796, 620941, 328630, 318647, 336147, 508575, 231815, 512469, 63152, 311556, 55539, 95590, 463422, 317374, 185025, 302115, 636136, 304127, 298782, 343386, -47875, 323732, 256700, 503940, 711169, 226532, 258682, 674870, -34601, 175464, 195247, 507258, 215685, 25922, 657872, 244472, 228489, 319560, 374488, 544281, 294689, 178604, 17017, 425025, 36769, 289434, 372330, 302781, 124240, 244092]
13463B44092L8846a02016A85953J07552Q8988D1421L12804A45192K62334A61139
13452C99254j96616B8474J35557l1881g352C6625J85221n5790L9715J09691K84990
13441F00452A74227C8879R7984d5574D55783m8034A27768J03072c5369C04132
13430B13787q9893K15855f9243I3737K24814A59183J47917J45862I015K84607
13420B93622m2233i2352B31961J46091C8016L2663L79620j71143J71523n3556
13410C97123A34005a62406C11063I1901A5636O02558A46691J15279M5796A22654
13399F8717J84668L863C8053L14583I2624c9116n3215B11612I9771M11872B15888
13387b5209C38484o4301a12737i419E7659a02180C26616I8635M43207F6729a3402
$$ y = [244092, 282938, -102016, 185953, 293505, 382493, 41421, 354225, 145192, 407526, 161139, 399254, 202638, 28474, 164031, 132150, -7352, 36625, 221846, 166056, 205771, 315462, 600452, 174227, 38879, 136863, -45574, 455783, 407749, 127768, 230840, -35369, 304132, 213787, 123894, 339749, -69243, 93737, 318551, 159183, 307100, 452962, 9015, 293622, 251389, -92352, 231961, 378052, 38016, 70679, 450299, 279156, 450679, 397123, 134005, -162406, 311063, 91901, 15636, 618194, 146691, 261970, 307766, 122654, 68717, 253385, 257248, 38053, 352636, 92624, -39116, -92331, 211612, 99771, 511643, 215888, -25209, 338484, 274183, -112737, -9419, 57659, -102180, 326616, 98635, 541842, 66729, -13402]
13375B08417a5760E7657M30655j34055C5778J00176o2900N73990B28810J82186
13365D10996j9415A71984J41814j17729B133O2663K77534a47743B02383l656N3983
13354B52710N4718J2819J1923j21098J36459j4526N5236o0444A04863O2656K71168
13343D38687A00173a84370C23871J93377j20043j81201j4791M5599m1029M1326
13333B47109k4401a05669D3343A9609K64159G1778K12565o6109J07001Q107b26064
13321A54073b2610A33382K50769j75422J12267l6809Q0344D5105K01684A07683
13310A36101L9274P4572F7196L8854K3360H668c79920A17250K77403j88676E9807
13298B92874j16765a4201j78345c6237C38944A04347K19917r7507H5288J3809
$$ y = [208417, -15760, 57657, 488312, 354257, 35778, 135954, 73054, 647044, 228810, 410996, 391581, 171984, 313798, 196069, 2133, 64796, 342330, -147743, 202383, 198727, 252710, 307428, 320247, 332170, 211072, 347531, 333005, 388241, 327797, 104863, 167519, 438687, 100173, -184370, 323871, 517248, 397205, 216004, 201213, 246812, 205783, 247109, 222708, -105669, 43343, 19609, 283768, 71778, 284343, 218234, 325235, 333342, -226064, 154073, -22610, 133382, 384151, 208729, 320996, 284187, 364531, 45105, 246789, 107683, 136101, 175375, 249947, 67196, 106050, 129410, 8668, -379920, 117250, 394653, 205977, 59807, 292874, 176109, -14201, -192546, -36237, 338944, 104347, 324264, 226757, 85288, 99097]
13288I9097N2775l5308D962K94329c6020C7101h6112A21914K40431p2636B2243
13276A71966m074O839o1825J31234l8826A0225L813M4759l272K7127L05281A03390
13263H7829C2633c0667A88417e2310j01650B02941r6403a24141B49793j17374
13253A32419K15581h7139A07846K96604b2492k3408B6271J56220c5595C42730
13242B05139J03259n7936O8481B9225K85722j14654R63J16856d8866r6321C43969
13230C22942g1945A41243o3967c0227B43574M7811J1418h8307r9043K0843C37829
13218b4002k3065o255A30060E1150J43346q7804K79046F673K13394E6703M29714
13207D86417A71769o3927K04558A41700J70553J10399I4576K99998H3486c3363
$$ y = [99097, 151872, 116564, 4962, 299291, -36020, 37101, -86112, 121914, 362345, 289709, 22243, 171966, 167892, 174731, 112906, 244140, 205314, 10225, 14038, 58797, 55525, 82652, 387933, 103390, 87829, 32633, -30667, 188417, -52310, -153960, 202941, 106538, -124141, 249793, 132419, 348000, -87139, 107846, 404450, -22492, -45900, 26271, 182491, -35595, 342730, 205139, 308398, 250462, 318943, 29225, 314947, 200293, 201256, 318112, -48866, -145187, 343969, 322942, -71945, 141243, 77276, -30227, 243574, 291385, 302803, -88307, -187350, -166507, 337829, -24002, -47067, -53322, 130060, 51150, 194496, 106692, 385738, 6673, 220067, 56703, 486417, 171769, 107842, 312400, 141700, 312253, 422652, 94576, 394574, 83486, -33363]
13196C30881F146L9524J78813a05403H4325C9729M7124J83602A7616N3848a760
13184a79686a585B90155a1533k68725g3326c2895q7827e2389B61976b2130A01152
13172A97953J5730n9274F9074k340J2121J65771C3218Q6769D2682f0970A4261
13160G9426L15778A09125J48263F8118K46356A04187b4072I8277P7180J74757
13150C50214H3711A2396a15443q094A92459c01865J02616A28645b52108b0240
13139A30556K45292A35475a11423k06241C61175E5939K26820B6583J24842L2349
13129A83774j4591b01913E3225a73805k6787A20268l5822b24382a02742F71L67835
13118C68506j17750n0795B4098J89248i5535k4855p82A62677C4614K22298f7365
$$ y = [330881, 6146, 45670, 224483, -105403, 84325, 39729, 86853, 270455, 17616, 71464, -1760, -179686, -1585, 290155, -11533, -280258, -73326, -32895, -120722, -52389, 261976, -22130, 101152, 197953, 213683, 154409, 69074, 66734, 78855, 244626, 33218, 119987, 42682, -60970, 14261, 79426, 395204, 109125, 257388, 68118, 314474, 104187, -24072, 98277, 175457, 350214, 83711, 12396, -115443, -123537, 192459, -301865, -199249, 128645, -252108, -20240, 130556, 375848, 135475, -111423, -317664, 361175, 55939, 282759, 26583, 151425, 183774, 169183, -201913, 53225, -173805, -200592, 120268, 84446, -224382, -102742, 671, 368506, 250756, 199961, 24098, 213346, -95535, -120390, -121172, 162677, 34614, 256912, -67365]
13106a28772q6527B01840F7189J5657L57081a61910m6139a01908k7177A61371
13095f5207A16522K49442d1222A12889a86410A28675N7447D7137J6964i2639C2998
13083c00677A09910l3851l676b3470G7410a25841a0326j45735g3771B15387K01368
13072D16755F5212J54233B9235c9555d985F3159a71805E2966M6200J70849D6815
13060h5976I9751b3753A8545L7855g9747B38600J23367a90055A32234Q6060a73884
13048B8795d7319A95187a61893B79928b62739C93498m9702b35874A32785J90153
13038C22938A21527b64647h9433C08442a8013j54898B24655D1941Q2854L6142
13028A60937j3937O5130l369J04153F9265K66107g0690C42595l4604L734n7627
$$ y = [-128772, -215299, 201840, 67189, 82846, 439927, -161910, -208049, -101908, -129085, 161371, -65207, 116522, 365964, -41222, 112889, -186410, 128675, 186122, 47137, 64101, -92639, 32998, -300677, 109910, 76059, 72383, -23470, 77410, -125841, -10326, -156061, -73771, 215387, 416755, 65212, 219445, 29235, -39555, -4985, 63159, -171805, 52966, 99166, 270015, 46815, -85976, 99751, -23753, 18545, 56400, -79747, 238600, 361967, -190055, 132234, 218294, -173884, 28795, -47319, 195187, -161893, 279928, -262739, 393498, 343796, -235874, 132785, 322938, 121527, -264647, -89433, 308442, -18013, -172911, 224655, 41941, 124795, 160937, 147000, 212130, 208761, 312914, 69265, 335372, -70690, 342595, 307991, 311725, 254098]
13017B54098r5622K32835A25006l3790K01700j02900K63318A30817J53601I2175
13006B11632p7057b4272B03962B0015K38041J41012c3397j51396Q7395j85857
12996b83255D0108K80597a8174L418H0878b63112f8991A45161P2410J11052a37300
12984A63126K6570C9292M053K60468a89434A16784m6891L62284a4114l10584C2678
12972A05619E0993a43489e8763A11516J58718F8856J1571B3528a79131e8042j17497
12961a75539A36752b68892b6980j45618B10898a03130B0286a4787A25702Q863
12951A34565i763k12668A68924K8465k0317Q4953b17667G1068L9123b19782B67903
12939a15324m1411G6326O674C9324a50998A53997l0144J14557J2192e2695n8429
$$ y = [254098, 158476, 391311, 125006, 91216, 292916, 190016, 453334, 130817, 284418, 92175, 211632, 134575, -24272, 203962, 20015, 258056, 399068, -33397, -184793, -97398, -283255, 40108, 320705, -18174, -14756, 80878, -263112, -68991, 145161, 217571, 328623, -137300, 163126, 189696, 39292, 43345, 303813, -189434, 116784, 69893, 432177, -14114, -324698, 32678, 105619, 50993, -143489, -58763, 111516, 270234, 68856, 80427, 23528, -179131, -58042, -175539, 136752, -268892, -26980, -172598, 210898, -103130, 20286, -14787, 125702, 134565, -9763, -222431, 168924, 197389, 177072, 262025, -217667, 71068, 110191, -219782, 267903, -115324, -156735, 76326, 83000, 39324, -150998, 153997, 123853, 238410, 250602, -52695, -111124]
12928a11124A68601J59842G4166J14741q3889g2013C7592a02808c848m10014B15562
12916I5266B0653K0604K76304j50597L653c5023C04770A41493K35678F4295O1916
12905A26211n7799h4602A2160J68821a61652A09019D8100K3849q758R0926m3045
12894A11072a65085A28316L7835a2891k22362h10l4853A13218jR1517J90556A75237
12881E35173B40902a3037F4105M5042c688G7808c61490J23896A58693a60409D36088
12869A91151c91091a03315j92106A12420Q3411F6153N305J4149g7441B88384g0979
12857A37536K3234a30026B55450F6942i8615E8270c0537A7509J70640d1989j18103
12846a60092A06990m369l4163J53842i1999A9214c34396E5917R2222g7859K2968
$$ y = [-111124, 168601, 328443, 74166, 188907, 105018, -72013, 37592, -102808, -3848, -413862, 215562, 95266, 20653, 41257, 317561, 166964, 170617, -35023, 304770, 141493, 377171, 64295, 126211, 68412, -84602, 12160, 180981, -161652, 109019, 48100, 71949, 63191, 154117, 111072, -165085, 128316, 166151, -12891, -235253, -810, -35663, 113218, 113217, 204734, 395290, 175237, 535173, 240902, -13037, 64105, 109147, -3688, 77808, -361490, -237594, 158693, -160409, 436088, 191151, -391091, -103315, -295421, 112420, 195831, 66153, 71458, 85607, -77441, 288384, -70979, 137536, 160770, -130026, 255450, 66942, -98615, 58270, -30537, 17509, 188149, -41989, -160092, 106990, 102621, 68458, 222300, -91999, 19214, -334396, 55917, 148139, -77859, -54891]
12835e4891j18477b5809A94357J6455I2837b83895A4297L63381q7807a21913A79038
12823b1758C578c78458J16423g1561o7018l53803B8985J90799h3037d1510j14978
12812a56488C42273f9122C7330e4588H2551K8897b51358R2944G4286i6071A2371
12800A57387N323a92678C30591a41197C4223b5039q6330e579B5826b74720L7863
12789b36857A87741a79531b4630B28854p2775a41763C4174J94241l9602a01179
12778I0104M4376J86897A49669n9182g1648A79269K3237h8649B8822L69128D2237
12766A95001a87214C01769h8085I4997j7706b2448A24675J35079p5145E3296J31173
12755A84469m6729f418j85080D1842f0500D5617d8299B08799e0397A09044a28710
$$ y = [-54891, -173368, -25809, 194357, 210812, 92837, -283895, 14297, 377678, 289871, -121913, 179038, -21758, 3578, -378458, -262035, -71561, -138579, -492382, 28985, 219784, -83037, -41510, -156488, 342273, -69122, 37330, -54588, 82551, 111448, -251358, -158414, 74286, -96071, 12371, 157387, 162710, -192678, 330591, -141197, 34223, -25039, -111369, -5579, 25826, -274720, -236857, 187741, -179531, -24630, 228854, 156079, -141763, 34174, 228415, 188813, -101179, 90104, 134480, 321377, 149669, 90487, -71648, 179269, 202506, -88649, 28822, 397950, 42237, 195001, -187214, 301769, -88085, 94997, 77291, -22448, 124675, 259754, 184609, 53296, 184469, 137740, -6418, -191498, 41842, -60500, 45617, -48299, 208799, -50397, 109044, -128710]
12743e0698m8945K3145j29969f8960A47208G0473A5073J58665L9249a40287O8160
12732g2127c4809A76017n7721L10785a57059R24A28511O5257a79264g6113j64705
12721b40818i2328D5648a01729n2542O9104G4652K50862e6470n9453A54558a70309
12709A81003E4429J14055L04940A24634K40069b19655B33787D4742J11154R378
12699A65274l7422D5169K6040M2858l792a02619F1515N8529c82901I0130a89936
12687B8469a39619E6733B6674J51758a56587B33632m3390k0709J45159M1096j64358
12676A91430K63520i946B73990j04747a10017I2066d0192j22877F5450b2161A54260
12664b09776O9335A30919c9774m146r3800A29738o1021Q6739J65479m3506b20700
$$ y = [-50698, -99643, -76498, -206467, -68960, 147208, 70473, 15073, 173738, 212987, -140287, -72127, -34809, 176017, 118296, 429081, -157059, -156135, 128511, 193768, -179264, -76113, -240818, -92328, 45648, -101729, -154271, -85167, 74652, 325514, -56470, -115923, 154558, -170309, 181003, 54429, 168484, 473424, 124634, 364703, -219655, 233787, 44742, 155896, 165274, 127852, 45169, 71209, 114067, 110275, -102619, 61515, 120044, -382901, 90130, -189936, 28469, -139619, 56733, 26674, 178432, -156587, 233632, 190242, 169533, 314692, 355788, 191430, 454950, -9946, 273990, 169243, -110017, 92066, -40192, -163069, 65450, -22161, 154260, -209776, -140441, 130919, -39774, -43920, -137720, 129738, 68717, 155456, 320935, 277429, -220700]
12652E5969L91422j11734o3653A10075j7890K15969M8322A23524K3442A263b52619
12640B38594a6861l93837J89041C0949b3779j12407A11479l9319M9555J00596
12630B22311c30484E3434J36586G7068K31191j23707g3095m8413A67686J06709
12620B74395A28479L03611A73211J76091c4711k16661L8609d0443A76100a09113
12609c81285B90285F834d635D5857b46694J9860I9822a34565B25997a84007C04998
12597C19349A42779c5589a2283B23559b5177m1236H9648c5652k6366q2783l8816
12586a83617A23885D3339a79486B97537a02242C38360A7529J96334a54621A85739
12575H8230L4323M9492a76267d9079A76431a26083L9849k29346f9967l69454J89130
$$ y = [55969, 447391, 335657, 272004, 110075, 92185, 308154, 356476, 123524, 146966, 1263, -252619, 238594, -16861, -410698, -221657, 30949, -23779, -136186, 111479, 72160, 121715, 222311, -330484, 53434, 190020, 77068, 308259, 184552, -73095, -121508, 167686, 274395, 128479, 432090, 173211, 349302, -34711, -251372, -212763, -40443, 176100, -109113, -381285, 290285, 6834, -4635, 45857, -246694, -226834, 99822, -134565, 225997, -184007, 304998, 319349, 142779, -35589, -12283, 223559, -25177, -66413, 89648, -35652, -62018, -144801, -183617, 123885, 43339, -179486, 297537, -102242, 338360, 17529, 213863, -154621, 185739, 88230, 122553, 172045, -176267, -49079, 176431, -126083, -86234, -315580, -69967, -439421, -250291]
12564b50291b6623a1219B5402P8809K94537a49269A91042c77437a0025B34743
12553A2033L40210g2903A03888K12962J47650B2175J79132d4740B91245C226K73042
12542B76268i169k54841B08648b21099B38859C3349J81031a52576I1659J48808
12532B40467j688q1486J62218A11513F170a45490m9265N413R321A34450L3537
12521A67987i4742I5844k9648K2369g0024I939b24005d1194C14621C6583e9732
12509A5901b74081C19675A354c51961B00413E2421L8737J33881b41447C19688
12498A54491F0016L69065E5343h2036r6526B89914N1126r1160A07269a28493I2137
12486c42272A01568A5084f997k73906H7183J2468L6170n3766R4668a08963B22341
$$ y = [-250291, -26623, -11219, 25402, 104211, 398748, -149269, 191042, -377437, -10025, 234743, 12033, 352243, -72903, 103888, 316850, 464500, 22175, 201307, -44740, 291245, 3226, 276268, -9169, -264010, 208648, -221099, 238859, 33349, 214380, -152576, 91659, 240467, 238779, 157293, 319511, 111513, 6170, -145490, -194755, -189342, -180021, 134450, 167987, -94742, 95844, 66196, 88565, -70024, 9939, -224005, -41194, 314621, 36583, -59732, 15901, -274081, 319675, 1354, -351961, 200413, 52421, 91158, 225039, -241447, 319688, 154491, 60016, 429081, 55343, -82036, -178562, 289914, 341040, 249880, 107269, -128493, 92137, -342272, 101568, 15084, -6997, -280903, 87183, 99651, 135821, 82055, 176723, -108963, 222341]
12474B02241J60454g3753j70103q8366J58697o1127b0186j25874j17823C3218
12463f0453B07447b58763B05741e4671K269C15027B546L4979a85266c7390A01329
12451A2317i0756o0225L0664N5157B27009d00888A23035b07906k74402A0664a36654
12439F918c7894k07491M8675Q6630j43923J10787A91595a80164l45789B0250P6922
12428I7172b46126C0769h2563I668K19414b35090g2031j31738F6568J21921m5161
12417A43328l7145a70j93234i0461A52818g7049c5525j12080k66568a01535K8449
12406g3086B8933P5443P2505a6627D55163B22569a7860j0144A53341A284K52714
12395B53998c08158M1032C10317G8961K32658m0252a94484h9903p0181r0089H4060
$$ y = [202241, 362695, -73753, -243856, -332222, -173525, -234652, -20186, -146060, -263883, 33218, -60453, 207447, -258763, 205741, -54671, -52402, 315027, 2546, 37525, -185266, -37390, 101329, 12317, -90756, -150981, -120317, -65160, 227009, -400888, 123035, -207906, -482308, 10664, -136654, 6918, -37894, -245385, -196710, -110080, -254003, -143216, 191595, -180164, -525953, 20250, 97172, -246126, 30769, -82563, 9668, 229082, -235090, -72031, -203769, 66568, 188489, 143328, 106183, -170, -193404, -90461, 152818, -77049, -35525, -147605, -414173, -101535, -73086, 28933, 104376, 176881, -16627, 455163, 222569, -17860, -28004, 153341, 1284, 253998, -308158, -267126, 310317, 78961, 311619, 271367, -194484, -89903, -160084, -250173, 84060]
12383I4870d09908b1351C59783g717A10478J09197a5683A45392D2783J97842c23933
12371b11943e6335n6036A8382M6344b1964r4109j9428B2549Q3866C5916h0284
12359g5547I4713c5781r0564E5196L9121a98512L5516B27888d8977m8349j94349
12348b91675G7213M99230A67435G5719B1895b80589A76662d3063p893A10356b20977
12336c75492B55271a42261j12884R2972L3148A05717J8577C1326c5866j056C8907
12324C67499A26214a3654B56962a06007D29509b00045k2739A73273f992m6638
12314e3630j74036A40833k3312n4273a34534A30127b76926h9923H6246d5221p46
12303d5967o8710A39636g240B07815A00944A7047b11226e6555k44661G4551b96129
$$ y = [94870, -409908, -21351, 359783, -7717, 110478, 219675, -15683, 145392, 42783, 240625, -323933, -211943, -56335, -112371, 18382, 64726, -21964, -116073, -135501, 22549, 106415, 35916, -80284, -75547, 94713, -35781, -126345, 55196, 94317, -198512, -162996, 227888, -48977, -97326, -291675, 77213, 576443, 167435, 75719, 21895, -280589, 176662, -43063, -50956, 110356, -220977, -375492, 255271, -142261, -255145, -162173, -129025, 105717, 124294, 31326, -35866, -36922, 38907, 367499, 126214, -13654, 256962, -106007, 429509, -200045, -222784, 173273, -6992, -53630, -227666, 140833, 117521, 63248, -134534, 130127, -276926, -89923, 86246, -45221, -45967, -114677, 139636, -7240, 207815, 100944, 17047, -211226, -56555, -301216, 74551, -296129]
12291a56151f589I2399R4756q4201b1514a0500B09359a6190F123g582D01198c40040
12278D22156b60662e3831A51292M10473A70778K85303j99257c80408a3836A10163
12267A61265P5809F6331M39752e384A62714L5148q3401R8077m342a65930A11930
12255G5792e24788a28518A40067b3661F6511k8302N3652P8066P425J42016p7893
12244B41475a2176P15A34038b02229f68G8391L4661e484k58249C5459a66039G2861
12231A80327M5315o5473K9476J56380j5008A37563m3258N5431J28687L56724A38146
12219C08949A32695c7854A24663O6525I150a51681C62916g7095C66520A32353
12208B38620c46031a9448C81975i5369A03659j1612K0570D4802F036c13A02398
$$ y = [-156151, -6589, 92399, 187155, 102954, -21514, -10500, 209359, -16190, 6123, -7582, 401198, -340040, 422156, -260662, -53831, 151292, 561765, 170778, 456081, 256824, -380408, -13836, 110163, 161265, 237074, 66331, 506083, -5384, 162714, 197862, 114461, 212538, 208196, -165930, 111930, 75792, -524788, -128518, 140067, -23661, 66511, 38209, 91861, 169927, 177352, 319368, 241475, -12176, -11461, 134038, -202229, -668, 78391, 113052, -5484, -263733, 35459, -166039, 72861, 180327, 225642, 160169, 189645, 346025, 331017, 137563, 94305, 149736, 278423, 635147, 138146, 308949, 132695, -37854, 124663, 191188, 9150, -151681, 362916, -77095, 366520, 132353, 238620, -346031, -19448, 381975, -95369, 103659, 92047, 112617, 44802, 6036, -313, 102398]
12196H9812J24228r5905J40237I5629K59582J403M6689R283A3597K47114D9620
12184f6242A84442a64761G1118N9250m226C7704b3264A98090f8487C45551E0554
12172C21796D3843L24513A45654q177M50956b23554B20393K3454F7484J72023
12162B39507a53084O0154l1612A24098C3060L19971f7690r301j41796d5441q5969
12151a31410D5081b6965k36273h2543r600j03138b8048A19839E8575N9899R9560
12140B18034F1898L2161K54825a94981A9090a63159a3242B46750p2831G4842L04217
12129C79059j84597i2001A99649p5838C2949d86332a33746d9224A70082b521A09601
12117F7170O2531a01012K3251I9389O7777i4955l7365M1739j7492a7594j23539
$$ y = [89812, 214040, 118135, 258372, 95629, 355211, 356614, 403303, 412586, 13597, 260711, 49620, -66242, 184442, -164761, 71118, 130368, 126142, 37704, -23264, 198090, -68487, 345551, 50554, 321796, 43843, 368356, 145654, 137477, 588433, -223554, 220393, 243847, 67484, 239507, -153084, -92930, -124542, 124098, 33060, 353031, -67690, -76991, -218787, -45441, -131410, 45081, -26965, -263238, -82543, -92143, -195281, -28048, 119839, 58575, 118474, 218034, 61898, 94059, 348884, -194981, 19090, -163159, -13242, 246750, 173919, 74842, 379059, 194462, -92001, 199649, 123811, 32949, -486332, -133746, -49224, 170082, -2521, 109601, 67170, 129701, -101012, -77761, 99389, 167166, -94955, -132320, -90581, -108073, -17594, -141133]
12106a41133A81817H3965R2096a11977l08322B31870B9862b41482E55984b98467
12095g6250B45886j13735e092B38818f4492G1054b46957e0869k02242K1626d6280
12083c1000J2763k99541A61416b38535C16547L54202J15874J567986H48904l88040
12073D60864A57502a90002b8128F1265a02029k1472B12297D0771r027K82702p0598
12062B43848q175G5564f0858A22351c24611N3786f384A18757K2838a36654f1039
12050C25146A40486a84330D6421K2805f6619j07282m6943L3193M0080I5575d3351
12038g2484j92464n6217d3702B63945b16377a04734B55818j09899d4457m89163
12028e33620e6784n8233B61232a07591A46261J13146C2700J492J02064f0320k5272
$$ y = [-141133, 181817, 83965, 176061, -111977, -420299, 231870, 29862, -241482, 555984, -298467, -76250, 245886, 132151, -5092, 238818, -64492, 71054, -246957, -50869, -253111, -231485, -46280, -31000, -18237, -317778, 161416, -238535, 316547, 670749, 786623, 2354609, 848904, 460864, 157502, -190002, -28128, 61265, -102029, -123501, 212297, 40771, 31744, 314446, 243848, 235673, 75564, -60858, 122351, -324611, -270825, -6384, 118757, 141595, -136654, -61039, 325146, 140486, -184330, 46421, 69226, -66619, -173901, -220844, -187651, -147571, 95575, -43351, -72484, -264948, -321165, -43702, 263945, -216377, -104734, 255818, 145919, -44457, -533620, -56784, -115017, 261232, -107591, 146261, 259407, 32700, 34192, 136256, -60320, -85592]
12017h5592B20220I9521b4073q2978C18631b34951E0865K5028J89348a46714D8531
12005a22095O0383K654D6951J31423D1191m372b34253C34859D179a39161o4366
11994b03527F7535f4519A8029L1642P0611N386a11511e1171B0956h5594B7363
11982b03710M0800j38966c7680p4898J3165C1949c02542C095b12947j65529g7747
11970c22862A95121n7759C4973J234L9772a59179N7587L4688j39709F9552N2411
11959A21963J52564b83397e6063E8747b04386b661r5611J0910K4960q4817A83177
11947d174k0226m367p1938d7284l5500p5336E3614a04543e496k81944D4551d8369
11934b75169a31407B0665Q9502J61989b74667A66638g6617A49428b6208k17250
$$ y = [-85592, 220220, 99521, -24073, -107051, 318631, -234951, 50865, 75893, 265241, -146714, 48531, -122095, -61712, -59058, 46951, 178374, 41191, 36819, -234253, 334859, 4179, -139161, -203527, 67535, -64519, 18029, 49671, 120282, 125668, -111511, -51171, 20956, -85594, 27363, -203710, -162910, -301876, -37680, -112578, -99413, 31949, -302542, 3095, -212947, -378476, -77747, -322862, 195121, 137362, 34973, 36207, 75979, -159179, -101592, -66904, -206613, 69552, 121963, 274527, -283397, -56063, 58747, -204386, -2661, -98272, -87362, -62402, -147219, 183177, -4174, -24400, -28767, -100705, -47284, -82784, -158120, 53614, -104543, -5496, -287440, 44551, -48369, -275169, -131407, 20665, 110167, 272156, -274667, 166638, -76617, 149428, -26208, -243458]
11924b43458G9749b58797A4826a96445B15273g6759A81903h4007q3418A54533
11913A83905A4217g7366j42489j56503A38727b36127r6933b885E3279a65823Q1833
11902h3990j33516a1602B23928a09259j57788a16023K1180A84604c77948A57086
11891A64291l3804B7124b06751H7888a70306p1932C1175a60996A36711b16299
11880g2883c5575A08917a11578B6484J16668a538j80509e1720I2505b87865J41987
11869a45878j31021A0190L08362G3041I077e4696F1028i0609j20586d3554j61260
11858b04814N1819d0326q1777B43048n0583a14499A64441a44002B1278b01975
11847h5012A31108m9306g8062B38049H3821l2784R6613c08109C10604a42347m7946
$$ y = [-243458, 79749, -258797, 14826, -196445, 215273, -76759, 181903, -84007, -167425, 154533, 183905, 14217, -77366, -219855, -376358, 138727, -236127, -333060, -2885, 53279, -165823, -83990, -217506, -11602, 223928, -109259, -267047, -116023, -94843, 184604, -377948, 157086, 164291, 130487, 27124, -206751, 87888, -170306, -242238, 31175, -160996, 136711, -216299, -72883, -35575, 108917, -111578, 26484, 143152, -1538, -182047, -51720, 92505, -287865, -145878, -276899, 10190, 318552, 73041, 9077, -54696, 61028, -90609, -211195, -43554, -204814, -152995, -40326, -122103, 243048, 192465, -114499, 164441, -144002, 21278, -201975, -85012, 131108, 81802, -78062, 238049, 83821, 51037, 147650, -308109, 310604, -142347, -190293]
11836a90293R1948L3696K8311F7129B0239d6246B84994c2736l99770C22587B3937
11824A39170C1376b46492B3967c63779a44081N1739n9434F9901Q3931l8795L320
11813A18357J69972i8528C28626J05525D7814A2793R9076N3901a21180A44834
11802G5399K02382E5440P5601A0950J88858H8732F998K68811A8021N743K85400
11791C09164a6331j5767j31869G6165b62398E0032a12286j64304L2002R6044C3876
11779a23690c801F5781L4298i6956A04189c026A77754c03580A04356a87270a8163
11767i4378M5556m419A5100a82445F0644L2797J66343q6561b63380A1584J04638
11756A16222h7295D5672M6224c56195A94548a15481j3552f3467j76824d0747l03158
$$ y = [-190293, -98345, -64649, -36338, 67129, 20239, -46246, 284994, -32736, -432506, 322587, 23937, 139170, 31376, -246492, 23967, -363779, -144081, -92342, -151776, 69901, 153832, 115037, 118357, 288329, -98528, 328626, 434151, 47814, 12793, 111869, 165770, -121180, 144834, 75399, 277781, 55440, 131041, 10950, 199808, 88732, 6998, 275809, 18021, 23764, 309164, -16331, -32098, -163967, 76165, -262398, 50032, -112286, -276590, -244588, -148544, 33876, -123690, -3801, 65781, 100079, -96956, 104189, -3026, 177754, -303580, 104356, -187270, -18163, -94378, -48822, -53241, 15100, -182445, 60644, 93441, 259784, 173223, -263380, 11584, 116222, -87295, 45672, 91896, -356195, 194548, -115481, -129033, -63467, -240291, -40747, -343905]
11745c43905a27058l78854E2963J48767b69945B45367G4777L1666B6510J47948
11735A74458e5450a6281k32817A65981q469a21533k3308A27401E3067b4215A75295
11723C89029A64612b29716D0565R4591l2640N1284g4869D5893g6844B67274a23961
11711a70454A48764R4179a39899J8004C72156a33806l2443A61364F7382J61981
11701B29363c28369J04938e2340H8319a0108E1877a73065I1759f3990o4722B08219
11689b19814M9437B19654b81049a17045A55215n5495e5235R619j0144E5974c05348
11677B85668l5002b2793C33113a86386Q356G4801a8523j29056A49703a23139C36582
11665d0531q8046A08309b11346C1582J97602J6027O1255a99608b6163D35124b09807
$$ y = [-343905, -127058, -505912, 52963, 201730, -269945, 245367, 74777, 106443, 26510, 174458, -55450, -16281, -249098, 165981, 157512, -121533, -144841, 127401, 53067, -24215, 175295, 389029, 164612, -229716, 40565, 135156, 102516, 153800, -74869, 45893, -76844, 267274, -123961, -170454, 148764, 242943, -139899, -121895, 372156, -133806, -166249, 161364, 67382, 229363, -328369, -223431, -52340, 88319, -10108, 51877, -173065, 91759, -63990, -128712, 208219, -219814, -170377, 219654, -281049, -117045, 155215, 99720, -55235, -45616, -55760, 55974, -305348, 285668, 250666, -22793, 333113, -186386, -178030, 74801, -18523, -147579, 149703, -123139, 336582, -40531, -128577, 108309, -211346, 31582, 229184, 245211, 306466, -199608, -26163, 435124, -209807]
11653A51707l487J28598a0273A96832h4700b8582j0568C1573h3331I314l753A279
11640c3721l5131j55422E2966b06880C5785a63932B33828e7581H3981i7290A19390
11628a12701B58643A9355g7713A65204G8473L957k6577L32499d6883B480L43109
11617C45589f3876B40816E464a81592d0109H7468l1282b81263B47558Q8401a01116
11605b60350q488f8522B42982b9052G2893e7355A45795m8928j7606d7231C36412
11593B21163a60336A52631k9726g397B28017A08730J6211J58949J5654P2369A56606
11581C02231j49603i7368B26711j3666f1441B222b09033B83893q9062J1066j4437
11570A91460K38669b57752I0354e4921D96461j16797A23085a66678E4030f8448
$$ y = [151707, 148220, 276818, -10273, 196832, -84700, -28582, -39150, 31573, -83331, 9314, 5561, 1279, -33721, -68852, -224274, 52966, -206880, 35785, -163932, 233828, -57581, 83981, -97290, 119390, -112701, 258643, 19355, -77713, 165204, 78473, 82430, 55853, 388352, -46883, 2480, 345589, -63876, 240816, 5464, -181592, -40109, 87468, 56186, -281263, 247558, 335959, -101116, -260350, -268838, -68522, 242982, -29052, 72893, -57355, 145795, 96867, 79261, -47231, 336412, 221163, -160336, 152631, 122905, -7397, 228017, 108730, 124941, 283890, 299544, 371913, 156606, 302231, 152628, -97368, 226711, 213045, -61441, 2222, -209033, 283893, 194831, 205897, 191460, 430129, -257752, 90354, -54921, 496461, 379664, 123085, -166678, 54030, -68448]
11559b43534C9093J21540G0346L2484b20247A01806a76512g2060k6275A31191
11548D77352k31599j14303K45285j25026B872b5541p901j9757A65549A7343a94523
11536A38128l4194m0565j2202k3727a18551C4808a48939r620B45818C2864L36208
11525C69072a07929k6255A81917b76553A99639K59456G8292l8874k159K90434
11515C27693l9726n1914J33257A09426O8154E2465J84035q0522E5953M0287b5195
11503B2469R8497h7395F3017a60187E19911a28563E641P1102l3061M30656E1257
11491C7380M6733R4795E5242J71672J2025G9577l7660M47826A5946a61364D52419
11479C90111c6267D08159f3042j7592C77794B1335J20849l353J88086F6933L04417
$$ y = [-243534, 39093, 160633, 70346, 102830, -220247, 101806, -176512, -72060, -98335, 131191, 477352, 245753, 131450, 376735, 251709, 2872, -25541, -33442, -53199, 165549, 17343, -194523, 138128, 103934, 63369, 51167, 27440, -118551, 34808, -148939, -158559, 245818, 32864, 369072, -107929, -134184, 181917, -276553, 199639, 459095, 78292, 39418, 37259, 327693, 287967, 236053, 369310, 109426, 177580, 52465, 236500, 155978, 55953, 96240, -25195, 22469, 120966, -87395, 63017, -160187, 519911, -128563, 5641, 76743, 43682, 474338, 51257, 37380, 84113, 178908, 55242, 226914, 238939, 79577, 41917, 489743, 15946, -161364, 452419, 390111, -36267, 408159, -63042, -80634, 377794, 21335, 142184, 138831, 326917, 66933, 371350]
11468C71350A44375n5603L8875O5058h0735B83918E9168L9180B3304L9444R8811
11457A61559c2434A62652d3088B84312A5656d3094I4069K12810E0334e6081I238
11445B1839b4390B48850p7814O2812f0412E6762a40506A51209c8188J6169D7357
11433A60669c0667j78120g0592B54893c2198I3934K45001d5392j64034H9936Q9466
11422A79402c40960f9266A10247D577L99181A57375N3167b22768f8330j54895
11412b23225a09386m0854B6547J00358a12109A01870b41567R381B4447M8380J7133
11401H9960b609A81949d8364G8662C0304L18318f3894A83761a98918a4164B25557
11389C8617L2817J33071c0798A94901b80498B64910j10759n9141a52233B62043
$$ y = [371350, 144375, 88772, 127647, 192705, -80735, 283918, 59168, 98348, 23304, 62748, 161559, -32434, 162652, -43088, 284312, 15656, -43094, 94069, 306879, 50334, -56081, 9238, 21839, -24390, 248850, 171036, 233848, -60412, 56762, -140506, 151209, -38188, -22019, 47357, 160669, -30667, -208787, -70592, 254893, -32198, 93934, 338935, -45392, -209426, 89936, 179402, -340960, -69266, 110247, 4577, 403758, 157375, 210542, -222768, -68330, -223225, -109386, -150240, 26547, 126905, -112109, 101870, -241567, -232186, 24447, 72827, 89960, -2609, 181949, -48364, 78662, 30304, 348622, -63894, 183761, -198918, -14164, 225557, 38617, 71434, 204505, -30798, 194901, -280498, 264910, 154151, 95010, -152233, 262043]
11378B00772N9326b24272G5897d0382D0269c78366F3279b04814K2093H1661L5417
11367A17078a27411n055A15344d8230J0101A1770J5611J7400E498K07077j00918
11356A11657e116A2818a25138C53403q6523b29773F6384J38897c43813J15383
11346b28430a8594k26644B47685q6569e6381r4732H0224a03808K317k06107D9150
11334a06918q2371C8842b07537B49116H8399f4399l21638I255O4268c87504a33794
11322f2780E99K96460j42806J21228g2908A21716n408L0870J68775c24593J57537
11311a67056d4884p8824L8463K5174H4600R0940G0020P4830A7420O66948i4619
11299I1047J3134a8311r9704c2273r6723C9317M5369J77274e4311b0594A01621
$$ y = [200772, 260098, -224272, 75897, -40382, 40269, -378366, 63279, -204814, -182721, 81661, 117078, -127411, -132466, 115344, -48230, -38129, 11770, 27381, 44781, 5498, 212575, 111657, -5116, 12818, -125138, 353403, 266880, -229773, 66384, 205281, -343813, -228430, -18594, -245238, 247685, 161116, -56381, -151113, 80224, -103808, -101491, -307598, 49150, -106918, -189289, 38842, -207537, 249116, 88399, -64399, -386037, 9255, 73523, -387504, -133794, -62780, 599, 297059, 154253, 275481, -72908, 121716, 116308, 147178, 315953, -324593, -167056, -44884, -123708, -85245, -60071, 84600, 175540, 70020, 144850, 17420, 684368, -94619, 91047, 104181, -18311, -118015, -32273, -128996, 39317, 84686, 261960, -54311, -20594, 101621]
11287A68401Q1735j8030j10503k0701K5045n4031L764l3725A9720a20244B42421
11275A67763e7748I7130O2150G2764P0317a11404B2344a6753r0812c1891I2666
11263a66171B1792c14135b9946k46741J10508K8270D3515e4880d468j46602A23939
11251A51975a74338K25E4386a76705q1320j2424o5650a9872l45780a09658n3075
11240a62733c3751j08392O2705B900d44483E8489O7338a62572A07960a79888r3738
11229b73626A45071e546C24145F5201A1287d3878l6807G2870c10595n0812a46916
11217B14532r8342L0527c46500d7870q1483l6240p710H0472b49463I3109a9006
11205D8294d88900K22261f5664F943a5476r11A4694R6736n0463a79038H3235c70538
$$ y = [168401, 250136, 232106, 121603, 100902, 125947, 71916, 75680, 41955, 19720, -120244, 242421, 167763, -57748, 97130, 159280, 72764, 143081, -111404, 22344, -16753, -107565, -31891, 92666, -166171, 21792, -314135, -29946, -276687, -166179, -137909, 43515, -54880, -4468, -151070, 123939, 151975, -174338, -174113, 54386, -176705, -258025, -270449, -336099, -19872, -365652, -109658, -162733, -33751, -142143, -79438, 2900, -444483, 58489, 125827, -162572, 107960, -179888, -273626, 145071, -5546, 324145, 65201, 11287, -43878, -80685, 72870, -310595, -361407, -146916, 214532, 116190, 146717, -346500, -47870, -129353, -165593, -173303, 80472, -249463, 93109, -19006, 48294, -488900, -266639, -65664, 6943, -15476, -16387, 14694, 111430, 60967, -179038, 83235, -370538]
11192g0132j97134A52121f0428B22984a69762j119l1327I8052e4485F0619A6528
11180c17158b3209p0201l49077c0990B33607P3675f6270j21756H9224K6037b86183
11168C864P9057j6774E39d5791I0021b57779E8670b60035i0289B23719a57842
11156B30903d1642l07354h9127k21214G1231a8616A84940A9354F497f0041Q81
11145e9160j18514C8200f8558F3808b8548m1053K8982A83308b35773J00606F8722
11133c20592a05963B56108D9070c11978C1214b41071A04672b65721A7333a66777
11122h4570A07793B2175N8860J27735a07593A94628R9484A3360g9557C01498p1008
11111B30490G0368Q9732M7457I5271M9706L15879A01002J7952D2718J30629b0056
$$ y = [-70132, -267266, 152121, -60428, 222984, -169762, -170881, -202208, 98052, -54485, 60619, 16528, -317158, -23209, -93410, -442487, -30990, 233607, 307282, -66270, -188026, 89224, 115261, -286183, 3864, 82921, 66147, 539, -45791, 90021, -257779, 58670, -260035, -90289, 223719, -157842, 230903, -41642, -348996, -89127, -310341, 71231, -18616, 184940, 19354, 6497, -60041, -59160, -177674, 38200, -68558, 63808, -28548, -69601, -40619, 183308, -235773, -135167, 68722, -320592, -105963, 256108, 49070, -311978, 31214, -241071, 104672, -265721, 17333, -166777, -84570, 107793, 22175, 81035, 208770, -107593, 194628, 294112, 13360, -79557, 301498, 230490, 70368, 160100, 207557, 95271, 144977, 460856, 101002, 118954, 42718, 173347, -20056]
11099B55687m248J60489a09128H1157J38748Q6651a12063D32626A17765e0438
11088A97095e5192r49k2973j67289D05500B3375K37216M6429j47284R0554J84171
11077D34461A60400M60133k83473A31870N31992o8772j34805J20434k14063j55697
11067B10959N4139K56057j53780J84762j76306r8604M86801j48246J75660K7416
11057H18858l5094j41076N0398o7883K9672j7728l1135J87979C70649L32678r087
11046F94240j99987J93508p0370J28695N1328j32785M9873k72324j31274L32139
11036F43043K7442J34432k53836J54963J15170j25936j19097j24015Q826L97050
11026H58042J66839l64769J38774p2937k60817J8261K04998l2963j84679N9188
$$ y = [255687, 251439, 411928, -109128, 81157, 219905, 306556, -112063, 432626, 117765, -50438, 197095, -55192, -56141, -79114, -246403, 405500, 23375, 260591, 307020, 159736, 250290, 434461, 160400, 620533, 337060, 131870, 663862, 595090, 460285, 580719, 366656, 210959, 265098, 521155, 367375, 552137, 375831, 277227, 764028, 615782, 791442, 818858, 783764, 642688, 693086, 625203, 654875, 637147, 606012, 793991, 370649, 703327, 694240, 494253, 687761, 617391, 746086, 797414, 664629, 714502, 442178, 310904, 643043, 670485, 804917, 551081, 706044, 821214, 695278, 576181, 452166, 460992, 858042, 1024881, 660112, 798886, 725949, 465132, 483393, 688391, 655428, 470749, 529937]
11016E29937K89560l06225J98K87751j39204j93219J94186j67654J1941K32413
11006G39684j44588J29423k4958K7228N5193K4274M406j48851J39268j24903k70908
10995D05268K19454M5573L4885j35535O77115D93430M77058o9970J07238q2511
10985I25245l5064J3886K61790k40094j17151L16468J48002k1709J56194M14409
10975A821976J86971P6990L17519J04572O46022p83786K95588n6082k15635p5582
10965B318553p9179m4196R9130k08558j2098J94215J77944J80900P6318j70376
10955B532653l51183J0939m22167k3313q0829l79519l49957Q8808D96283o9264
10945D27019L09876C56232M8462f456n7659A95294R5470p9496C1209J02560j2888
$$ y = [529937, 819497, 513272, 513470, 801221, 662017, 468798, 662984, 495330, 507271, 739684, 595096, 724519, 699561, 726789, 781982, 806256, 810662, 661811, 801079, 676176, 405268, 624722, 670295, 705180, 569645, 1246760, 493430, 970488, 900518, 1007756, 925245, 890181, 904067, 1165857, 925763, 808612, 1125080, 1273082, 1251373, 1407567, 1821976, 2008947, 2085937, 2403456, 2508028, 3154050, 2370264, 2665852, 2609770, 2394135, 2318553, 2239374, 2195178, 2294308, 2085750, 2073652, 2267867, 2445811, 2626711, 2703029, 2532653, 2181470, 2192409, 1770242, 1746929, 1666100, 1286581, 936624, 1025432, 496283, 427019, 736895, 356232, 404694, -6456, -64115, 195294, 290764, 211268, 31209, 133769, 120881]
10934A20881K00660o4375m7498f6822l2154D40080A44342F4681R7492B2181J80967
10923B03148J50491f3903L1938A92274a27053j78475B870a87396C56214b3540
10912A17383A9425a07161o8575A37076a48005B11482f8911a0759A2280a3177C53882
10900a41770p8031h7738C86325i557G2933j8708J11586L4815E2078a95960e6108
10888F8458b21582a02806m78253b35883i5228B9962J01386o4471d5072k9552B13983
10876a15025e5953A62204a01j3602E1879J67027Q315a8857m02514a36478d105
10864C1631K56007a06814b9972A37475C2201J99410B0100a57161f135n4209A07329
10852A21801b49604L582Q3965A15053a98819k8102H406K939e6452l54746A86539
$$ y = [120881, 321541, 257166, 209668, -66822, -98976, 440080, 144342, 64681, 162173, 22181, 203148, 353639, -63903, -31965, 192274, -127053, -305528, 2870, -187396, 356214, -23540, 117383, 19425, -107161, -175736, 137076, -148005, 211482, -68911, -10759, 12280, -13177, 353882, -141770, -219801, -87738, 386325, -9557, 72933, 54225, 165811, 200626, 52078, -195960, -56108, 68458, -221582, -102806, -581059, -235883, -95228, 29962, 131348, 66877, -45072, -74624, 213983, -115025, -55953, 162204, -101, -13703, 51879, 218906, 227221, -18857, -421371, -136478, -4105, 31631, 287638, -106814, -29972, 137475, 32201, 231611, 20100, -157161, -6135, -60344, 107329, 121801, -249604, -246022, -162057, 115053, -198819, -226921, 8406, 11345, -56452, -411198, 186539]
10840b9570j0744A02275a62280a0146B91391A29594a6207A69727c00294g9164
10829e6174k31801a19920c2152j2565j01045D2314b62789B16969G1207c19207
10818b91422e3146A65014b32495M5350g8975j67849C3220a26201j6738k31764
10808c74703J16180a05920j23934c8956k46511a23773B32549b06012i8395A59090
10797d03246a10836A04275b89612H5250b47699D3961J26296m1029C9740a40904
10786d76962c8385j8104p2405L6723K814j01572h202j51781L2792j74732J13561
10775a88362j07814E9458c12419A6619a3234D00635A15766b53504n053H047J68383
10764A76430d08201J22399B79332a59867F7070a5952l05781a31355b3241A09839
$$ y = [-29570, -40314, 102275, -162280, -10146, 291391, 129594, -16207, 169727, -300294, -79164, -56174, -287975, -119920, -32152, -44717, -145762, 42314, -262789, 216969, 71207, -319207, -291422, -53146, 165014, -232495, -187145, -78975, -246824, 33220, -126201, -142939, -374703, -258523, -105920, -229854, -38956, -285467, -123773, 232549, -206012, -98395, 159090, -403246, -110836, 104275, -289612, 85250, -247699, 43961, 170257, 129228, 39740, -140904, -476962, -38385, -56489, -128894, -92171, -89357, -190929, -8202, -159983, -127191, -301923, -188362, -296176, 59458, -312419, 16619, -13234, 400635, 115766, -253504, -258557, 8047, 176430, -408201, -285802, 279332, -159867, 67070, -15952, -321733, -131355, -23241, 109839]
10753c038l4151E6689d58630b6975j79689g201o8920A48271a41872A77102a27105
10741a29970A92211j1256a89867r8059C0874a40139j37601A26254D0504I74N260
10730F234a50103B63034b46599B79156a97915P4989b3009l2218k8559L8319A26105
10718A50493F839a02733e563B2015b060j73738d9116m7693M6756C11054a49769
10706b15283h1330j13776Q0689j8276B14975G9617g9030A75081E363K91328A42145
10694C76760i76A0911g9826q3518J8150k7326m5617l4490A5195p554a88607I416
10681A47266a41205j03419i2843E5491Q972d47707B00425F2922J90032H782a14949
10669a22273J7828k50495B23327D0625R5217a17182N7675k03376D09595F6503
$$ y = [-3038, -37189, 56689, -458630, -26975, -206664, -7201, -76121, 148271, -141872, 177102, -127105, -129970, 192211, 180955, -189867, -287926, 30874, -140139, -277740, 126254, 40504, 974, 6234, -150103, 263034, -246599, 279156, -197915, -122926, -23009, -55227, -83786, -45467, 126105, 150493, 6839, -102733, -5563, 22015, -2060, -175798, -49116, -96809, -50053, 311054, -149769, -215283, -81330, -195106, -114417, -132693, 214975, 79617, -79030, 175081, 5363, 296691, 142145, 376760, -976, 10911, -79826, -163344, -145194, -172520, -218137, -252627, 15195, 7641, -188607, 9416, 147266, -141205, -244624, -92843, 55491, 64463, -447707, 200425, 62922, 252954, 8782, -114949, -122273, -104445, -354940, 223327, 40625, 135842, -117182, -59507, -262883, 409595, 66503]
10658B3912n509O5274b83940C9032K59171a64245C05122H8884e7695B36467a2696
10646B35393E9993A5234O4025C1030b40572f5376A7144b84071C09944I6978b20028
10634A08044b43434A53687b01432J5746A12653c6754k09495B10490a50768G542
10623a5570q9945D0182N2430A7738J57635m5839C8788b22816a09604J7917l4094
10612a25781n470b3054j86179Q6352G5251b52822J174J08946c0157A0472O6619
10601G7091A3244a1580B68166i2949q3682d9484j52796A72856f9236j41770e3701
10589A45304a17142H721e8713G5303c91743a57825A05300R4163j1561F1176O0879
10578A22055g7228A02187b577p5402m0216m37453c881A8953J94143d00089J41401
$$ y = [23912, 18403, 83677, -283940, 39032, 298203, -164245, 305122, 88884, -57695, 236467, -12696, 235393, 59993, 15234, 79259, 31030, -240572, -65376, 17144, -284071, 309944, 96978, -220028, 108044, -243434, 153687, -201432, -185686, 112653, -36754, -246249, 210490, -150768, 7542, -15570, -105515, 40182, 92612, 17738, 175373, 129534, 38788, -222816, -109604, -91687, -125781, -131251, -23054, -209233, -122881, 75251, -252822, -251648, -142702, -30157, 10472, 77091, 13244, -11580, 268166, -92949, -176631, -49484, -202280, 172856, -69236, -211006, -53701, 145304, -117142, 8721, -58713, 75303, -391743, -157825, 105300, 199463, 187902, 61176, 122055, -77228, 102187, -2577, -77979, -118195, -555648, -3881, 18953, 213096, -400089, -258688]
10567b58688l9807B99128j19862d19801J89639J2896b005n2942l68446m9261K05800
10556b66854g660j09359l8566A06780a70028E7588O4026f7694p8555C22747a68031
10544h6163G7291d6705D920f4802F3827f5315j18696B7097e5811B15958E5339
10532e61056i6079F0017R7078o4258i0260F1252K47999C1859b01801B09942J7644
10521B27586b15410A36695Q6624a34595k19275m5403A9259a23466L5532j15925
10511b03859P6766B1353a46279A23819d5948j64207n646j6522O1788k32344C1480
10499a60417C051d96702d9537n2754g335H0555a77665A04832k9936J09456a86813
10487a96848j36599i9642B70941j13611J02518K59494j93948P8184A02504M54557
$$ y = [-258688, -298495, 299128, 179266, -419801, -230162, -217266, -2005, -54947, -423393, -472654, -266854, -7660, -117019, -155585, 106780, -170028, 57588, 121614, -67694, -146249, 322747, -168031, -86163, 77291, -46705, 4920, -64802, 63827, -65315, -184011, 27097, -55811, 215958, 55339, -561056, -96079, 60017, 157095, 92837, -90260, 61252, 309251, 31859, -201801, 209942, 227586, -215410, 136695, 223319, -134595, -353870, -399273, 19259, -123466, -87934, -203859, -127093, 21353, -146279, 123819, -45948, -210155, -215801, -232323, -170535, -402879, 31480, -160417, 3051, -496702, -49537, -102291, -7335, 80555, -177665, 104832, 74896, 184352, -186813, -196848, -333447, -99642, 270941, 157330, 259848, 519342, 325394, 403578, 102504, 557061]
10477E57061B37845b2881A11486L99473A66986f2862A67284o65a26859o3458h0181
10465b4718A72283o7692K64250A61788a60654d3721D6610J51392G458d5847j65893
10454b11740p5290B06335F6220P4816m2932K5146J79666a55996A03609b04650
10443A26084c6680E5939J8713J01120b75353e108G5171a98639j28473e700j50515
10432a56215d482D0724P798J31348b45967I764Q7877i1890L4749F2782f6074a0736
10419D6055b17537E200J30594f6446a0988q99j91791B47702e1690l51792C4731
10407a18865A33419d9741b2532m6073j27688B71944c75270a75407n2068J8564
10397b08911B92536g63B25054A08074L5094B6199P881P9054a92652D8969B2235
$$ y = [557061, 237845, -22881, 111486, 510959, 166986, -62862, 167284, 166619, -126859, -190317, -80181, -24718, 172283, 104591, 368841, 161788, -160654, -43721, 46610, 198002, 7458, -45847, -211740, -287030, 206335, 66220, 141036, 98104, 123250, 302916, -155996, 103609, -204650, 126084, -36680, 55939, 74652, 175772, -275353, -5108, 75171, -198639, -327112, -5700, -156215, -4482, 40724, 48522, 179870, -245967, 9764, 97641, -91890, -57141, 62782, -66074, -10736, 46055, -217537, 5200, 135794, -66446, -10988, -11887, -203678, 247702, -51690, -403482, 34731, -118865, 133419, -49741, -22532, -68605, -196293, 271944, -375270, -175407, -227475, -208911, 292536, -763, 225054, 108074, 143168, 26199, 34080, 113134, -192652, 48969, 22235]
10385B96445A24211E8187J64535r4508c37186a54495q5234c1361C11680N4383
10375C66063j76428B3223e5863D52954j64455M9762J65507r7917j49711M4097
10365C00237j04867L28356B35584J83208g344A53196o1424L33079A20616K02905
10355C23521J5206g7212B15640K42923R1230k4741E2951L62209K13181A73240
10344C95846k3272K71721m2229p1141E0847J84398R9329a2996I1273a2014k984
10333a4998A24973q626M1326G4318e1454n6356A46443D0425K03023K289J05516
10322C51253j2378A12029K65164j57101A07482R3368D3709A1593M0534J32634
10312A84761K0967i2717a8891A75330D9887L33070C5319J16253P9709e5620l21176
$$ y = [296445, 124211, 58187, 222722, 128214, -337186, -154495, -239729, -31361, 311680, 366063, 189635, 23223, -55863, 452954, 288499, 338261, 503768, 405851, 256140, 300237, 195370, 523726, 235584, 418792, -7344, 153196, 91772, 424851, 120616, 323521, 338727, -77212, 215640, 458563, 549793, 525052, 52951, 415160, 628341, 173240, 395846, 372574, 644295, 602066, 530925, 50847, 235245, 334574, -12996, 91273, -12014, -14998, 124973, 116347, 157673, 74318, -51454, -107810, 146443, 40425, 243448, 245737, 351253, 338875, 112029, 377193, 220092, 107482, 200850, 43709, 11593, 52127, 184761, 205728, -92717, -18891, 175330, 49887, 382957, 35319, 151572, 231281, -55620, -376796]
10301c76796a05206j33939b0888A64435d7425a1585C340M1029a15888I5174B4022
10289a47483j13439o226O0672B78151b02461Q0511D18615h1103C50155A24548
10278C19851e1038j44914G575b4098n6410r561H8296a49343j85304C023b26011
10266I7782a52005B3946f6336F0323M8808K06178j04791K52909k20547K38712
10256D81592j2046p5804A24933d8391A93063R7199F2892J02681d82848a48748
10245e85557f9499j25555I4393J18371a6327j22743K2781j49318B16363J30773
10235C47136a21013F0627g2955F6237a71199j81426a51844l80798g3870m11180
10225d85050a24948A48376a74037D1084R5012c03537d1561Q598k63516A19999
$$ y = [-376796, -105206, -239145, -20888, 164435, -47425, -11585, 3340, 44369, -115888, 95174, 24022, -147483, -260922, -267148, -206476, 278151, -202461, -121950, 418615, -81103, 350155, 124548, 319851, -51038, -195952, 7575, -24098, -80508, -90069, 88296, -149343, -334647, 3023, -226011, 97782, -152005, 23946, -66336, 60323, 109131, 315309, 210518, 463427, 242880, 481592, 469546, 393742, 124933, -48391, 193063, 290262, 62892, 165573, -482848, -148748, -585557, -69499, -195054, 94393, 212764, -16327, -139070, -116289, -265607, 216363, 347136, -121013, 60627, -72955, 66237, -171199, -352625, -151844, -532642, -73870, -485050, -124948, 148376, -174037, 41084, 136096, -303537, -41561, -32963, -296479, 119999]
10214F3737a72884B79645b10868J6680A08231A4719b59094G3784c53438J34890
10204b18548K2106H4292a8911j25506I2566J13877a40475q660A51099o0695g4201
10192b96650C41611K134a9997A46709a77593A24447C5161d3468i075n04921K33165
10181b80831a26786K0596F9415A4166K08955p8960e8872n75o2213N6259A40790
10169a44903D787J51863B9773a7942A59316b1347B2743K2132M3315e7735j9796
10158g7531o534J783k17619A57040O4208j03418i7929j6938i60I0995M3449C6231
10145B66135f4738J9525a1743j52737P4676p1024A88630A1782K784b86522G5186
10133a04668q6881k25730E1612b25158B090b6030k26391A34038b7199k1450j74289
$$ y = [63737, -172884, 279645, -210868, -194188, 108231, 14719, -259094, 73784, -353438, -218548, -196442, 84292, -18911, -144417, 92566, 206443, -140475, -149135, 151099, 90404, -74201, -296650, 341611, 343745, -19997, 146709, -177593, 124447, 35161, -43468, -9075, -513996, -280831, -126786, -106190, 69415, 14166, 223121, 144161, -58872, -59447, -121660, -65401, 140790, -144903, 4787, 156650, 29773, -17942, 159316, -21347, 22743, 44875, 88190, -57735, -77531, -84065, -82282, -299901, 157040, 221248, 117830, -97929, -114867, -960, 90995, 134444, 36231, 266135, -64738, -45213, -11743, -164480, -89804, -160828, 188630, 11782, 14566, -286522, 75186, -104668, -191549, -417279, 51612, -225158, 2090, -26030, -252421, 134038, -27199, -48649, -222938]
10122b22938k4772f2743A13126d01054H118L68575d95922b22257F6312b89909
10111a3398l60258e7754l81313a52918G4763a52127P3645C09011a19978k5275
10101a45253D832R0708a96936j12264J27249f0826j79297P6188k39229a02653
10090G6128b39611c0055C0039a47506A22164h882l33518A88418F9716J6949D2926
10078i4484K6138m4851m6352I5150d5606b2128k23858A48179b33314a06772j61517
10067b68289h4740l04880A05555a82223l1919g2165A16536a956G0774f1587j78108
10056b39695j57044C54861c9133a0592r6165j96779c2321q8477k46988C5619b29913
10044a2392A82058c54458J42529A44016b26592m3054C9092a33103F8566e1721
$$ y = [-222938, -247710, -62743, 113126, -401054, 8118, 376693, -495922, -222257, 66312, -289909, -13398, -373656, -57754, -439067, -152918, 74763, -152127, -78482, 309011, -119978, -145253, 4832, 95540, -196936, -309200, -181951, -60826, -240123, -163935, -403164, -102653, 76128, -239611, -30055, 30039, -147506, 122164, -8882, -342400, 188418, 69716, 86665, 42926, -94484, -68346, -113197, -159549, 95150, -45606, -22128, -245986, 148179, -233314, -106772, -268289, -84740, -389620, 105555, -182223, -214142, -72165, 116536, -1956, 70774, -61587, -239695, -396739, 354861, -39133, -10592, -106757, -303536, -32321, -120798, -367786, 35619, -229913, -12392, 182058, -354458, -211929, 144016, -226592, -269646, 39092, -133103, 68566, -51721]
10033A66998o9870a2957j0532m3737C9419q094j1850K2846d26127c4949o7383
10022a02332o3256N0980j5848d4607j35197m5802J0883B58331H5744c02674a47240
10010F1199b08839C6460a46250l52801h513l8370A27091b30955d6983k1542E2875
9998a96539H3337N6105o025b51105j4680o0604P7338B14962a91640B20168H7397
9986a01943m9365A08561a54712L8746C1994K5410k3126g3322E2848m068a44887
9974A56502b75982C7462a74271D504K02054b12536F9138l1919a95233p9470N5943
9963b18760J9381d5862K0251c74m9455k64437a12547E611c37387a28205C2238
9951c45128P0358f3070k28360b4982l3239a1203B8346c09501G6122L2665b1704
$$ y = [166998, 97128, -12957, -23489, -67226, 39419, 31325, 19475, 42321, -426127, -34949, -102332, -165588, -114608, -130456, -44607, -179804, -225606, -214723, 258331, 85744, -302674, -147240, 61199, -208839, 36460, -146250, -499051, -8513, -46883, 127091, -230955, -46983, -68525, 52875, -196539, 83337, 139442, 133417, -251105, -265785, -326389, -249051, 214962, -191640, 220168, 87397, -101943, -151308, 108561, -154712, -115966, 31994, 57404, 34278, -73322, 52848, 48780, -144887, 156502, -275982, 37462, -174271, 4504, 206558, -212536, 69138, 37219, -195233, -274703, -218760, -199379, -45862, -25611, -374, -49829, -314266, -112547, 5611, -337387, -128205, 32238, -345128, -274770, -63070, -291430, -24982, -58221, -11203, 28346, -309501, 76122, 108787, -21704]
9939a54938h933B35732b64833B63747D3512c31725H7283D3395a48834j45624i2278
9927b10057K9924c6061H6896R27c28029m880A95721b15551J2076p6419d6938H2923
9914E1538e5877A61567b0246k09320d7239l02694M7828a27751E1695a11799a1491
9902a91297E517a6942A36787h5466B36337a91149G7642R518h1896A46636c19867
9890b26274a5465H1663C5511b41478H7286A3981e7215j78150i7446C181K28532
9879B31713q3556a82843A20779b012A1954c04331P3904a7111j85244B7069b46315
9867b1381A60876d3794j3008G4697J61230G3041k7623a22516o1272L6334A16294
9855C9829Q9228g4527m8129J4038d6383l05383R0526K1211R3245G3168R654b31935
$$ y = [-154938, -8933, 235732, -264833, 263747, 43512, -331725, 87283, 43395, -148834, -294458, -92278, -210057, -180133, -36061, 86896, 87823, -328029, -332909, 195721, -215551, -203475, -279894, -46938, 82923, 51538, -55877, 161567, -20246, -229566, -47239, -349933, -302105, -127751, 51695, -111799, -11491, -191297, 5517, -16942, 136787, -85466, 236337, -191149, 77642, 87160, -81896, 146636, -319867, -226274, -15465, 81663, 35511, -241478, 87286, 13981, -57215, -235365, -97446, 3181, 231713, 148157, -182843, 120779, -2012, 11954, -304331, -230427, -17111, -202355, 27069, -246315, -21381, 160876, -43794, -56802, 74697, 235927, 73041, 45418, -122516, -183788, -147454, 116294, 39829, 129057, -74527, -122656, -108618, -46383, -351766, -261240, -240029, -146784, 73168, 82822, -231935]
9842H9914b22886r6430h1418a4388A8036c56706I2600c47697A07356b20727J08114
9831a12613p27j1780j56667B14812a38884j42017l7845d0576J2247B24733p9928
9820A44805b46476B94295j14961Q8395a18543k69865A60359b81909B7893P549
9810C5442J21399d47727G0970a74486A11599b31597J5904i1771l61567I7439Q4516
9799A81955L9896a25788j14313g937k69876F3520e689m6761j18210n538A37207
9787g674n4477j09023B28766a02719j95297A5331a17901N8414k7132L5047k69277
9776c20849J06061D0762a21857l2731P3304A48064N7617i7729E0254f8009J0011
9765e7998B12634e0275j98209J21051J3205j55715C4692J02894e14752E1710h911
$$ y = [89914, -222886, -319316, -81418, -14388, 18036, -356706, 92600, -347697, 107356, -220727, -112613, -113340, -125120, -281787, 214812, -138884, -280901, -318746, -40576, -28329, 224733, 144805, -246476, 294295, 179334, 267729, -118543, -388408, 160359, -281909, 27893, 35442, 156841, -447727, 70970, -174486, 111599, -231597, -215693, -91771, -453338, 97439, 181955, 221851, -125788, -240101, -7937, -277813, 63520, -5689, -52450, -170660, -176198, 137207, -7674, -62151, -171174, 228766, -102719, -298016, 15331, -117901, -59487, -86619, -51572, -320849, -214788, 40762, -121857, -154588, -81284, 148064, 205681, -97729, 50254, -68009, -57998, 212634, -50275, -248484, -127433, -114228, -269943, 34692, 137586, -514752, 51710, -8911]
9753A30926E3523K9437b778k3899k53013M9062a05672l8548B38724h9140H9508
9741A7414e6586C03381h8844J9898c2214j79099m0853a470B26072b56822f8756
9729B27388c7808C06657g4341c6720I8042a95281j1793K5768A29230a40255j74745
9718c15000P1768g1036j05979A65849d276k54547m063k8598A54079B6673a63354
9706b4049j92547A62501d2359G3096g8469k39997M1663E647f1977H5427K7149
9695A12576J82789A0364b23024A14409c64836N426J21746J15406C288a5165k8331
9684d3496b088p1462D4637d52878A63280b4224k86496b9271j44540B3412g1378
9672c5362l7475D5240a67537A5531b62679a11941k05027J2294A6863M9730b96916
$$ y = [130926, 53523, 82960, -2778, -26677, -279690, -230628, -105672, -144220, 238724, -89140, 89508, 17414, -56586, 303381, -88844, -68946, -32214, -211313, -252166, -1470, 226072, -256822, -68756, 227388, -37808, 306657, -74341, -36720, 98042, -195281, -207074, -181306, 129230, -140255, -315000, -243232, -71036, -177015, 165849, -4276, -258823, -262886, -291484, 154079, 26673, -163354, -24049, -216596, 162501, -42359, 73096, -78469, -318466, -276803, 5647, -61977, 85427, 112576, 295365, 10364, -223024, 114409, -364836, -359410, -237664, -122258, 3288, -15165, -43496, -2088, -73550, 44637, -452878, 163280, -24224, -310720, -29271, -173811, 23412, -71378, -35362, -72837, 45240, -167537, 15531, -262679, -111941, -316968, -304674, 16863, 66593, -296916]
9660A67108c5373A26113b89989H973a68968c2714l9905G9760l2457f5259j02370
9649a67629B49442o7725g3849r7625P6822j23284A52205c24429J04581A42924
9638b61809a19387c0128k10611O2285e7629j21570k01049a85328G6032e0338j57980
9627b08318A6662a81596f6193E5457h9504c8866m38661A74131E6708a72784B1361
9615A06008j3686a45025l62094A42030J7793f4325A96551c04737P8823h6367G9820
9603a00610r8337n1837i8080H9557a98459f7188H8751f69552a19415j58427A23553
9591a12896C28388a61512A16099R7439a44914A2900J50841G8041K09518a8487
9580h4959r4439L5136F1199J83740b65342a14699e2309k9643j86499L9716J02033
$$ y = [167108, -35373, 126113, -289989, 8973, -168968, -32714, -72619, 79760, 47303, -65259, -167629, 249442, 181717, -73849, -171474, -94652, -217936, 152205, -324429, -219848, 142924, -261809, -119387, -30128, -240739, -178454, -57629, -179199, -380248, -185328, 76032, -50338, -208318, 16662, -181596, -66193, 55457, -89504, -38866, -477527, 174131, 56708, -172784, 21361, 106008, 92322, -145025, -507119, 142030, 159823, -64325, 196551, -304737, -225914, -86367, 79820, -100610, -198947, -250784, -98080, 89557, -198459, -67188, 88751, -669552, -119415, -277842, 123553, -112896, 328388, -161512, 116099, 213538, -144914, 12900, 163741, 78041, 287559, -18487, -84959, -179398, -144262, 61199, 244939, -265342, -114699, -52309, -81952, -268451, -228735, -126702]
9569a26702B21667b15031P7899b8068h23B9983A465J24206J8933K7304I939J62279
9557A72218A9772L6518L20495j79997q1361b28163A60502b93258Q8134k8576L8721
9546a94979e3989o0869B28527c48464A63429b79271A9725c4809m44519a70577
9535b6476D27520f9735A04830E0005c64728B4335M6177a09517K4603j62055J0122
9524b36847E9132a44466A25101a53242O9102a3479A0936a69872P0391G006J24771
9513A31777b80467A35005e4542l32251B25093r4128f1620K4211J181k62831A3616
9501g0351J5559l90768f7090B9825f1098B79025B3271b41110b7452B26733I8163
9489A60871a23675N8214B82956b5043j04369D3761a47698j07355M6249f286A21225
$$ y = [-126702, 221667, -215031, -137132, -28068, -823, 29983, 1465, 125671, 144604, 171908, 9939, 172218, 19772, 56290, 376785, 196788, 115427, -228163, 160502, -293258, -205124, -233700, -194979, -53989, -114858, 228527, -348464, 163429, -279271, 19725, -34809, -479328, -170577, -26476, 427520, -69735, 104830, 50005, -364728, 24335, 70512, -109517, -84914, -246969, -236847, 59132, -144466, 125101, -153242, -84140, -13479, 10936, -169872, -99481, 7006, 131777, -280467, 135005, -54542, -386793, 225093, 130965, -61620, -37409, -36228, -299059, 13616, -70351, -54792, -445560, -67090, 29825, -61098, 279025, 23271, -241110, -27452, 226733, 98163, 160871, -123675, -65461, 282956, -25043, -129412, 43761, -147698, -255053, -208804, -6286, 121225]
9477a53551g1944B10274m4746a81136j00762A29193a56043e8864K5964j12816
9467a45716I9456h5601c395B07384l6653b33349P6492B5653a16010l38697b8871
9455a51451M8459B24662a6667A78985e1513j19211j02084j62173a2760D49182
9444g6760k49724d4099A28054P167A862J4277a20714e415m9783n0074E0265i8051
9431f6735N46j74506P8003C9560a9255j06504r4162J06040I3207l9186a85644
9419b47612B4218q147e2983G8639J2159a173o6106A01466a65925A07031D7045
9407d0056B01974F7730b95244A29915a69966D8207b97362M5434b9427G222a10659
9395A12665a3049k92991F5110a99389f2516G5964C6154h0197d379o643l34839
$$ y = [-153551, -71944, 210274, 165528, -181136, -281898, 129193, -156043, -58864, -32900, -145716, 99456, -85601, -3395, 207384, 170731, -233349, -156857, 25653, -116010, -454707, -28871, -151451, -102992, 224662, -16667, 178985, -51513, -170724, -272808, -434981, -12760, 449182, -76760, -326484, -44099, 128054, 135221, 1862, 16139, -120714, -5415, -55198, -105272, 50265, -98051, -66735, -66189, -240695, -162692, 39560, -19255, -125759, -219921, -113881, 93207, 54021, -185644, -247612, 24218, 16071, -52983, 78639, 90798, -1173, -67279, 101466, -165925, 107031, 47045, -40056, 201974, 67730, -295244, 129915, -169966, 48207, -297362, -251928, -29427, 7222, -110659, 112665, -13049, -306040, 65110, -199389, -62516, 75964, 36154, -80197, -4379, -11022, -345861]
9384c45861J47227E1531c54438f4010D1963b22999e5659j86090a10231A25078
9373b30080a09730M4934k8621q0515A62031a74350h0142j15286C24623c73459
9362A23745h6374B45719c1498A36417B0178J41586b6979n1855L7542C14d7213
9350G6046b09724d4491j87997h456D2498b79977A12365b3191o2158A83366p7232
9339A06134J1304o702B7060a04186r3616a961k631m8103B13478i2202J6955j02586
9327a77833A27942i9411l3905A499R4192c73010N4998A35949a85647G4662J03538
9316A78200o6810a38237b5612A58131g7212B71099a68478a9906j82805A58776
9305a02214G6387b59754N9290A5976b55591a0800A4133K45546c14894N1202M5878
$$ y = [-345861, -198634, 51531, -354438, -64010, 41963, -222999, -55659, -241749, -110231, 125078, -230080, -109730, -64796, -93417, -173932, 162031, -174350, -80142, -195428, 324623, -373459, 123745, -86374, 245719, -31498, 136417, 20178, 161764, -26979, -78834, -41292, 314, -47213, 76046, -209724, -44491, -232488, -8456, 42498, -279977, 112365, -23191, -85349, 183366, 106134, 117438, 110736, 27060, -104186, -197802, -1961, -4592, -52695, 213478, -92202, -75247, -177833, 127942, -99411, -133316, 1499, 95691, -373010, -318012, 135949, -185647, 74662, 178200, 111390, -138237, -25612, 158131, -77212, 271099, -168478, -19906, -202711, 158776, -102214, 76387, -259754, -200464, 15976, -255591, -10800, 14133, 259679, -314894, -263692, -217814]
9294b17814D31477A79246n2033j7966a1360B37623c3123q5320A01250d66918A37562
9282a94012m4103e479n8808k0002A2460a77690j74876C59483b46476e1999o7214
9271a19213j01553J1784M879j33496J38583p4688h4555I9725c18837J29479k638
9260a91996N5335c6490j98761F3774a05784M2725A02532b22867j7064B96746b48403
9248c53227a38805N3720L6246j87682i5427i915C1855O556f5345r8291B016L8012
9236D0028N0258a36634d3753B25716G2454f2603B41714b28788N2031j82385f9573
9224a60229k5289A78674b52840M5950I0570h8218q5544j48205d1846q4398J7736
9213a08508E1338P4027N6400a18251r9101a576k01252i2450l21405K05158q062
$$ y = [-217814, 431477, 179246, 127213, 109247, -11360, 237623, -33123, -118443, 101250, -466918, 137562, -194012, -238115, -5479, -64287, -84289, 12460, -177690, -352566, 359483, -246476, -51999, -119213, -220766, -208982, -204103, -337599, -199016, -273704, -84555, 99725, -318837, -189358, -191996, -136661, -36490, -235251, 63774, -105784, -63059, 102532, -222867, -239931, 296746, -248403, -353227, -138805, -85085, -48839, -236521, -95427, -9915, 31855, 38411, -65345, -163636, 2016, 40028, 90286, -136634, -43753, 225716, 72454, -62603, 241714, -228788, -176757, -359142, -69573, -160229, -185518, 178674, -252840, -206890, 90570, -88218, -173762, -321967, -41846, -126244, -108508, 51338, 125365, 181765, -118251, -217352, -1576, -202828, -92450, -413855, -208697, -216759]
9202b16759q9704A20361j7968b01894c3412j33901J6987l42315a27396B89405
9191B68410a40362b3438j98945L2359C8726a9832C48512A4871a18174e1430b423
9179a99838f1731j05228G9324b71985H8823C9572a33823C10020d39175a0370p1840
9168h2210l5801j2784j68324A31380a43956b332n9672E4534e462r5362L2298A99253
9155a77934D9724i018j5200B46900b86420J25066r8185N9946k0685E7239A9378
9143f4037m9599Q617B67918j10165l8569J66508b09122K4128C18634a72145n1061
9132b23206d9609B10834E5086j5896d16084a45957j2869m4531O8922K6455G3031
9120c44444A8862c54777i4382q7532B68211c2924A03269D6285c18156J19652n1353
$$ y = [-216759, -306463, 120361, 102393, -201894, -33412, -167313, -150326, -492641, -127396, 289405, 268410, -140362, -23438, -222383, -190024, 38726, -19832, 348512, 14871, -118174, -51430, -2423, -199838, -61731, -166959, 79324, -271985, 88823, 39572, -133823, 310020, -439175, -10370, -82210, -118011, -130795, -299119, 131380, -143956, -2332, -62004, 54534, -5462, -100824, -68526, 199253, -177934, 49724, -9018, -24218, 246900, -286420, -161354, -259539, -199593, -220278, 57239, 19378, -64037, -113636, -105019, 267918, 157753, 119184, 285692, -209122, -184994, 318634, -172145, -223206, -49609, 210834, 55086, 39190, -416084, -145957, -158826, -203357, -134435, -107980, 73031, -344444, 18862, -354777, -94382, -181914, 268211, -32924, 103269, 46285, -318156, -198504, -249857]
9109b49857H2581K1553e01635A82040b91998k05243a20030a0879j79053A69677
9098D9514a14092C4341a09728m07016B29258a86605d517A22927a16552G2453M4936
9087A17389a18888k45277d6634l47603h4000j04448P1892p7600k6531A11777L7971
9076A49748b08881m4754h5334c3374k32861h4098F7010b03221f5860k82460J63388
9065a84932n4329C06596b01414m6281l7809e1590C00187o7203b50308A40477d0623
9053a02549k82473B24K93888b21279J4512A55207d379j4658o7220A89362F9139
9041H250d4731A61674E4667a96239f8948j59406d8034f860j46587A51302b0667
9029a95167a4275C5665b95086A73599c0643A2439K41426b13689g5017E8323a21707
$$ y = [-249857, 82581, 104134, -501635, 182040, -291998, -497241, -120030, -10879, -189932, 169677, 49514, -114092, 34341, -109728, -516744, 229258, -186605, -4517, 122927, -116552, 72453, 117389, -118888, -364165, -46634, -394237, -84000, -188448, -116556, -194156, -220687, 111777, 149748, -208881, -253635, -85334, -33374, -266235, -84098, 67010, -203221, -65860, -348320, -184932, -239261, 306596, -201414, -247695, -285504, -51590, 300187, 232984, -250308, 140477, -40623, -102549, -385022, 224, 294112, -221279, -206767, 155207, -4379, -19037, -86257, 189362, 69139, 8250, -44731, 161674, 54667, -196239, -68948, -228354, -48034, -6860, -153447, 151302, -20667, -195167, -14275, 35665, -295086, 173599, -30643, 12439, 253865, -213689, -75017, 58323, -121707]
9017A91246a84500A31326i0003B44210a17238j31151A22391b55769A39415c7221
9006B17477i5875G7772a11295j42841H0660j1121m682k2425O0994R0517b73997
8994D2454K76095a27955k29021E5971a97140A26373a89632J699E953c42348B76636
8982A45930c9735m4175I9945C6021a17965l45752P5902H7251d60206b08498K8911
8971a79587B65013a02435A19166c41440J59361C8463c88395a80305E4435i8765
8960G3394a20810n9589J5653f4547j44436F1333J86970I349J38428i3440F0775
8948a07140p6895B95460a06731H1172A3923d74594h9830A25208N7519C8015L3688
8937G1703J88498A21559J72514A38770a1885B52255a64195A69660a04349b8378
$$ y = [191246, -184500, 131326, -90003, 244210, -117238, -248389, 122391, -255769, 139415, -37221, 217477, -95875, 77772, -111295, -254136, 80660, 69539, 64857, 42432, 103426, 193943, -273997, 42454, 318549, -127955, -356976, 55971, -197140, 126373, -189632, -187933, 5953, -342348, 276636, 145930, -39735, -83910, 99945, 36021, -117965, -463717, -387815, 87251, -460206, -208498, -179587, 265013, -102435, 119166, -341440, -182079, 38463, -388395, -180305, 54435, -98765, 73394, -120810, -180399, -164746, -64547, -208983, 61333, 248303, 9349, 147777, -93440, 60775, -107140, -184035, 295460, -106731, 81172, 13923, -474594, -89830, 125208, 182727, 38015, 71703, 260201, 121559, 294073, 138770, -11885, 252255, -164195, 169660, -104349, -28378]
8926C72184q9963e0024E92063Q38918O019995J440648B535937A022627A83590
8916B31073p5188J80770d930m60828A0267K84209A31911K2345N1849C3898R6262
8905A30160b66395O1539A56108E0452a44051B0298M923n640d02359c333k85951
8894b89284C66752a26948k20167a09982D5063a40908C28111r8252G7221I665a18527
8882a10167j7540B01269a91386A52113a1826H3393j7751d19264J92962A63854
$$ y = [372184, 282221, -50024, 592063, 1430981, 7450976, 8891624, 2535937, 1022627, 183590, 231073, 155885, 336655, -4930, -465758, 10267, 294476, 131911, 154256, 206105, 33898, 130160, -266395, -204856, 156108, 50452, -144051, 20298, 25221, 19581, -402359, -3333, -289284, 366752, -126948, -347115, -109982, 45063, -140908, 328111, 229859, 77221, 9665, -118527, -110167, -127707, 201269, -191386, 152113, -11826, 83393, 65642, -419264, -226302, 163854]
$$ [...]
##END NTUPLES=NMR SPECTRUM
##END=
