##TITLE=AC1633_CENAH_8493798_wJb4DRSKn5
##JCAMPDX= 6.0         $$ Bruker NMR JCAMP-DX V2.0
##DATA TYPE= NMR SPECTRUM
##DATA CLASS= NTUPLES
##ORIGIN= BRUKER
##OWNER= Administrator
$$ 1.72 TOPSPIN		Version 2.1
$$ 2014-02-18 18:15:45.395 -0800  Administrator@X
$$ Compression mode = diff/dup
##.OBSERVE FREQUENCY= 400.02188249412
##.OBSERVE NUCLEUS= ^1H
##.ACQUISITION MODE= SIMULTANEOUS (DQD)
##.ACQUISITION SCHEME= undefined
##.AVERAGES= 64
##.DIGITISER RES= 22
##SPECTROMETER/DATA SYSTEM= spect
##.PULSE SEQUENCE= noesygpps1d.comp
##.SOLVENT NAME= COFFEE_meoh
##.SHIFT REFERENCE= INTERNAL, COFFEE_meoh, 1, 14.96096
##AUDIT TRAIL= $$ (NUMBER, WHEN, WHO, WHERE, PROCESS, VERSION, WHAT)
$$ ##TITLE= Audit trail, TOPSPIN		Version 2.1
$$ ##JCAMPDX= 5.01
$$ ##ORIGIN= Bruker BioSpin GmbH
$$ ##OWNER= Administrator
$$ $$ E:\/data/COFFEE/nmr/AC1633_CENAH_8493798_wJb4DRSKn5/12/pdata/1/auditp.txt
$$ ##AUDIT TRAIL=  $$ (NUMBER, WHEN, WHO, WHERE, PROCESS, VERSION, WHAT)
(   1,<2014-02-18 18:15:40.676 -0800>,<Administrator>,<X>,<go>,<TOPSPIN 2.1>,
      <created by zg
	started at 2014-02-18 18:04:10.005 -0800,
	POWCHK enabled, PULCHK disabled,
       configuration hash MD5:
       C8 4E 4E 5D D3 5C D8 9E 9F 52 82 E0 59 8A DE 15
       data hash MD5: 64K
       49 30 51 CB 39 B2 E0 7A 36 73 C5 54 9E CF 18 DE>)
(   2,<2014-02-18 18:15:43.551 -0800>,<Administrator>,<X>,<proc1d>,<TOPSPIN 2.1>,
      <Start of raw data processing
       efp LB = 0.3 FT_mod = 6 PKNL = 1 PHC0 = 0 PHC1 = 0 SI = 128K 
       data hash MD5: 128K
       DA 18 E1 6A 26 91 98 1B 3F 1F 9F 75 02 C7 31 5B>)
(   3,<2014-02-18 18:15:44.489 -0800>,<Administrator>,<X>,<proc1d>,<TOPSPIN 2.1>,
      <pk PHC0 = -81.80969 PHC1 = 0 
       data hash MD5: 128K
       61 0A 43 DF 6F 58 C4 E1 05 43 25 8B 38 84 E6 F7>)
(   4,<2014-02-18 18:15:44.880 -0800>,<Administrator>,<X>,<proc1d>,<TOPSPIN 2.1>,
      <abs ABSG = 1 
       data hash MD5: 128K
       B5 E9 A6 B9 F1 8C 85 F5 C8 58 4E FB 4B D2 D6 A5>)
(   5,<2014-02-18 18:15:44.989 -0800>,<Administrator>,<X>,<proc1d>,<TOPSPIN 2.1>,
      <abs ABSG = 2 
       data hash MD5: 128K
       89 8C B0 1F 89 53 74 EA F0 AD 5F 50 5D 93 22 D8>)
(   6,<2014-02-18 18:15:45.067 -0800>,<Administrator>,<X>,<proc1d>,<TOPSPIN 2.1>,
      <abs ABSG = 3 
       data hash MD5: 128K
       66 20 5F 07 90 3A 91 25 E7 6D B3 12 89 AE EB 89>)
(   7,<2014-02-18 18:15:45.161 -0800>,<Administrator>,<X>,<proc1d>,<TOPSPIN 2.1>,
      <abs ABSG = 4 
       data hash MD5: 128K
       8D 6A BA 97 2A 89 68 5D 0B 10 E6 E4 F3 0F 4C 12>)
(   8,<2014-02-18 18:15:45.223 -0800>,<Administrator>,<X>,<proc1d>,<TOPSPIN 2.1>,
      <abs ABSG = 5 
       data hash MD5: 128K
       BA 7D EA 41 58 17 BD E4 F5 E7 69 C0 AA 04 AE 07>)
$$ ##END=
$$ 
$$ $$ hash MD5
$$ $$ B1 79 86 B1 DB A6 F6 D6 95 54 31 98 FB 3E 57 82
##$RELAX= 
##$RELAX= 
##$RELAX= 
##$RELAX= 
##$RELAX= 
##$RELAX= 
##$RELAX= 
##$RELAX= 
$$ Bruker specific parameters
$$ --------------------------
##$DU= <E:\>
##$EXPNO= 12
$$ [...]
150 150 150 150 150 150 150 150
##$TP07= 0
##$TPNAME0= <>
##$TPNAME1= <>
##$TPNAME2= <>
##$TPNAME3= <>
##$TPNAME4= <>
##$TPNAME5= <>
##$TPNAME6= <>
##$TPNAME7= <>
##$TPOAL= (0..7)
0.5 0.5 0.5 0.5 0.5 0.5 0.5 0.5
##$TPOFFS= (0..7)
0 0 0 0 0 0 0 0
##$TUNHIN= 0
##$TUNHOUT= 0
##$TUNXOUT= 0
##$USERA1= <user>
##$USERA2= <user>
##$USERA3= <user>
##$USERA4= <user>
##$USERA5= <user>
##$V9= 5
##$VALIST= <valist>
##$VCLIST= <CCCCCCCCCCCCCCC>
##$VD= 0
##$VDLIST= <DDDDDDDDDDDDDDD>
##$VPLIST= <PPPPPPPPPPPPPPP>
##$VTLIST= <TTTTTTTTTTTTTTT>
##$WBST= 2048
##$WBSW= 25
##$XGAIN= (0..3)
0 0 0 0
##$XL= 0
##$YL= 0
##$YMAX_a= 6422350
##$YMIN_a= -13767566
##$ZGOPTNS= <>
##$ZL1= 120
##$ZL2= 120
##$ZL3= 120
##$ZL4= 120
##$ABSF1= 14.96096
##$ABSF2= -5.597221
##$ABSG= 5
##$ABSL= 3
##$ALPHA= 0
##$AQORDER= 0
##$ASSFAC= 0
##$ASSFACI= 0
##$ASSFACX= 0
##$ASSWID= 0
##$AUNMP= <proc_prof1d_extract.lims>
##$AXLEFT= 0
##$AXNAME= <>
##$AXNUC= <1H>
##$AXRIGHT= 0
##$AXTYPE= 0
##$AXUNIT= <>
##$AZFE= 0.1
##$AZFW= 0.1
##$BCFW= 0
##$BC_mod= 0
##$BYTORDP= 0
##$COROFFS= 0
##$CY= 15
##$DATMOD= 1
##$DC= 0
##$DFILT= <>
##$DTYPP= 0
##$F1P= 0
##$F2P= 0
##$FCOR= 0.5
##$FTSIZE= 131072
##$FT_mod= 6
##$GAMMA= 0
##$GB= 0
##$INTBC= 1
##$INTSCL= 1
##$ISEN= 128
##$LB= 0.3
##$LEV0= 0
##$LPBIN= 0
##$MAXI= 10000
##$MC2= 0
##$MEAN= 0
##$ME_mod= 0
##$MI= 0
##$NCOEF= 0
##$NC_proc= -2
##$NLEV= 6
##$NOISF1= 0
##$NOISF2= 0
##$NSP= 0
##$NTH_PI= 0
##$NZP= 0
##$OFFSET= 14.96096
##$PC= 1
##$PHC0= -81.80969
##$PHC1= 0
##$PH_mod= 1
##$PKNL= yes
##$PPARMOD= 0
##$PPDIAG= 0
##$PPIPTYP= 0
##$PPMPNUM= 2147483647
##$PPRESOL= 1
##$PSCAL= 4
##$PSIGN= 0
##$PYNMP= <proc.py>
##$REVERSE= no
##$SF= 400.0200096534
##$SI= 131072
##$SIGF1= 0
##$SIGF2= 0
##$SINO= 400
##$SIOLD= 131072
##$SPECTYP= <>
##$SREGLST= <1H.CDCl3>
##$SSB= 0
##$STSI= 131072
##$STSR= 0
##$SW_p= 8223.68421052631
##$SYMM= 0
##$S_DEV= 0
##$TDeff= 65536
##$TDoff= 0
##$TI= <>
##$TILT= no
##$TM1= 0
##$TM2= 0
##$TOPLEV= 0
##$USERP1= <user>
##$USERP2= <user>
##$USERP3= <user>
##$USERP4= <user>
##$USERP5= <user>
##$WDW= 1
##$XDIM= 131072
##$YMAX_p= 469710399
##$YMIN_p= -13496
##$CURPLOT= <Network HP LaserJet P1505>
##$CURPRIN= <$Network HP LaserJet P1505>
##$DFORMAT= <normdp>
##$LAYOUT= <+/1D_H.xwp>
##$LFORMAT= <normlp>
##$PFORMAT= <normpl>
##$SURQMSG= 1
$$ End of Bruker specific parameters
$$ ---------------------------------
##NTUPLES= NMR SPECTRUM
##VAR_NAME=  FREQUENCY,     SPECTRUM/REAL,   SPECTRUM/IMAG
##SYMBOL=    X,             R,               I
##VAR_TYPE=  INDEPENDENT,   DEPENDENT,       DEPENDENT
##VAR_FORM=  AFFN,          ASDF,            ASDF
##VAR_DIM=   131072,        131072,          131072
##UNITS=     HZ,            ARBITRARY UNITS, ARBITRARY UNITS
##FACTOR=    0.0627417313425164, 1,          1
##FIRST=     8223.62146879497, -583,         -66950
##LAST=      0,             1364,            -67564
##MIN=       0,             -13496,          0
##MAX=       8223.62146879497, 469710399,    0
$$ Real data points
##PAGE= N=1
##DATA TABLE= (X++(R..R)), XYDATA
$$ [...]
67806 95724 92504 90391 89791 90344 90741 89746 87383 84816 83028 81928 80756 79080 77196 75679 74779 74339
67790 74339 74185 74406 75198 76540 78109 79485 80468 81259 82342 83928 85447 85865 84772 82935 81491 80758
67774 80758 80156 79179 77991 77102 76862 77338 78359 79527 80460 81147 81911 82978 84265 85519 86439 86790 86766
67757 86766 87176 88744 91128 93072 93695 93269 92584 92085 91896 92170 92864 93472 93495 93097 92935 93402 94330 95326
67739 95326 96065 96324 96002 95206 94179 93177 92375 91722 90805 89189 87040 85082 83667 82289 80435 78529
67723 78529 77456 77300 77240 76729 76156 76150 76753 77579 78404 79146 79499 79006 77555 75537 73473 71631 70068 68891
67705 68891 68258 68092 68011 67756 67635 68238 69635 71131 71967 72052 71831 71741 72052 72932 74229 75313 75594 75223 74938
67686 74938 75252 76077 77082 78014 78666 78939 79071 79445 80109 80823 81655 83079 85234 87487 89054 89833 90380
67669 90380 91240 92554 94130 95629 96807 97768 98947 100632 102600 104296 105264 105328 104543 103213 101799 100609
67653 100609 99608 98624 97590 96465 95103 93482 91986 91217 91459 92328 92922 92339 90322 87552 85134 83695
67637 83695 83034 82667 82403 82286 82352 82699 83535 84803 86031 86876 87597 88616 89903 91257 92983 95561 98659
67620 98659 101125 102203 102290 102283 102639 103297 104054 104687 105012 105192 105723 106852 108239 109418 110295 110874 110871 110050 108756
67601 108756 107593 106702 105765 104567 103105 101253 98909 96526 94870 94088 93520 92621 91507 90326 88725
67586 88725 86452 84045 82251 81120 80330 80116 80922 82158 82357 81036 79623 79792 81354 82541 82166 80793
67570 80793 79782 79847 80674 81430 81371 80311 78764 77489 76809 76610 76906 77909 79408 80591 80888 80626 80376
67553 80376 79973 78788 76902 75382 75199 76255 77647 78544 78625 77991 77059 76428 76459 76868 76929 76189 74936 73902
67535 73902 73532 73607 73568 73106 72384 71765 71475 71513 71738 71952 72007 71915 71780 71597 71242 70703 70145 69708 69418 69375 69739
67514 69739 70371 70746 70503 69892 69419 69290 69442 69813 70182 70084 69485 69274 70367 72393 74026 74592 74539 74264 73528
67495 73528 72447 72029 72897 74150 74415 73536 72405 71552 70872 70469 70657 71142 71224 70991 71303 72363 73184 72932
67477 72932 71944 70901 69799 68406 67060 66168 65408 64327 63445 63732 65026 65909 65469 64430 64169 65136 66700
67460 66700 68118 69150 69925 70696 71701 72976 74227 75119 75663 76160 76783 77383 77712 77682 77358 76810 76050 75096
67442 75096 74057 73120 72395 71761 71026 70319 70174 70935 72149 72903 72882 72756 73213 73891 73769 72597 71403 71314
67424 71314 72216 72963 72743 71819 70900 70176 69244 67841 66313 65243 64708 64183 63349 62771 63383 65254 67299
67407 67299 68449 68752 68999 69589 70259 70729 71003 71031 70669 70139 70014 70490 71053 71142 70827 70590 70724 71166 71644
67388 71644 71779 71324 70581 70244 70593 71163 71480 71681 71919 71687 70434 68631 67377 67012 66907 66706 66931 67946
67370 67946 69066 69289 68533 67544 66879 66492 66221 66146 66369 66844 67481 68187 68721 68767 68327 67905 68121 69123 70452
67351 70452 71468 71934 72104 72288 72451 72347 71915 71317 70636 69841 69118 68861 69156 69530 69520 69373 69841 71250 73014
67332 73014 74194 74420 74224 74512 75786 77894 80407 83045 85552 87398 88049 87639 87013 86889 87174 87334 87191
67315 87191 86999 86864 86467 85431 83797 82080 80926 80621 80774 80643 79935 79176 79121 79987 81515 83526 85926
67298 85926 88217 89543 89472 88410 87146 86228 85858 85988 86326 86515 86546 86741 87185 87500 87450 87437 87967 88815 89165
67279 89165 88567 87406 86361 85700 85204 84590 83891 83514 83913 85130 86694 88082 89149 89970 90439 90391 90044
67262 90044 89885 90024 89987 89367 88416 87768 87754 88170 88629 88861 88745 88300 87758 87535 87956 88882 89669 89643 88793 87874
67242 87874 87569 87630 87216 86104 85153 85308 86520 88004 89284 90415 91300 91387 90341 88672 87403 87226 88087
67225 88087 89387 90464 91034 91381 92054 93226 94471 95265 95553 95614 95566 95291 94819 94436 94370 94608 95122 96034 97356
67206 97356 98747 99729 100077 99841 99157 98277 97744 98074 99100 99909 99712 98680 97650 97124 96931 96892 97386 98883
67188 98883 101082 102927 103609 103320 102910 102932 103215 103304 103109 103013 103399 104226 105089 105636 105829 105862 105953 106250 106765 107299
67168 107299 107550 107458 107380 107799 108863 110347 111952 113403 114324 114376 113751 113274 113732 115124 116781 118104 119001
67151 119001 119634 120044 120140 119915 119568 119495 120107 121459 122986 123801 123474 122447 121565 121262 121356 121589 122092 123230
67133 123230 125037 126978 128295 128626 128320 128132 128570 129527 130543 131328 131933 132492 133012 133474 133960 134605 135526
67116 135526 136886 138839 141250 143591 145373 146639 147780 148885 149561 149522 149061 148750 148853 149306 150103 151382
67100 151382 153080 154833 156344 157689 159060 160317 161027 160974 160506 160228 160388 160721 160960 161318 162260 163847 165602
67083 165602 167132 168611 170416 172508 174486 176178 177763 179256 180267 180512 180384 180760 182280 184888 188000
67068 188000 191002 193657 196169 198793 201393 203518 205001 206273 207864 209725 211259 212017 212145 212129 212320
67053 212320 212819 213655 214935 216769 219087 221527 223588 225029 226108 227278 228642 229875 230816 231915 233832
67038 233832 236650 239759 242638 245474 248746 252342 255460 257484 258715 260082 262288 265402 269081 272869
67024 272869 276303 279029 281002 282518 284057 286106 289017 292800 297015 301086 304791 308293 311717 314971
67010 314971 318020 321038 324103 327048 329879 333141 337459 342710 347984 352461 356160 359736 363729 368145
66996 368145 372689 377237 381932 386843 391649 395872 399470 403024 407214 412163 417413 422467 427266 432157
66982 432157 437446 442968 448184 452803 457238 462186 467784 473553 479267 485339 491984 498480 503904 508483
66968 508483 513535 519984 527479 535155 542720 550448 558464 566543 574459 582185 589771 597432 605747 615420
66954 615420 626536 638151 648881 657992 665926 673811 682576 692578 703772 715847 728131 739774
66942 739774 750405 760547 771198 783012 795998 809774 823809 837567 850853 864126 878209
66931 878209 893563 910086 927593 946082 965289 984332 1002281 1019163 1036160 1054615 1074870
66920 1074870 1096132 1117482 1138896 1161113 1184527 1208575 1232429 1256029 1279982 1304582 1329441
66909 1329441 1354235 1379345 1405475 1432900 1461336 1490375 1519831 1549773 1580379 1611723 1643635
66898 1643635 1675915 1708651 1742043 1775893 1809628 1843022 1876496 1910421 1944540 1978478 2012535
66887 2012535 2047396 2083117 2118930 2154075 2188348 2221704 2253866 2284702 2314598 2343974 2372525
66876 2372525 2399419 2424350 2447981 2471070 2493315 2513497 2530771 2545457 2558304 2569347 2577994
66865 2577994 2584125 2588471 2591611 2593113 2592165 2588766 2583675 2577210 2568701 2557407 2543439 2527387 2509360
66852 2509360 2489008 2466452 2442601 2418223 2393130 2366648 2338661 2309687 2279988 2249152 2216667
66841 2216667 2182467 2146692 2109449 2071230 2033152 1996181 1960306 1924968 1890091 1855993 1822409
66830 1822409 1788433 1753695 1718900 1684854 1651576 1618736 1586417 1554802 1523543 1492123 1460688
66819 1460688 1429944 1400244 1371217 1342257 1313068 1283805 1255050 1227560 1201661 1176925 1152707
66808 1152707 1128890 1105805 1083539 1061776 1040244 1018957 997997 977428 957370 937846 918630
66797 918630 899608 881183 863844 847366 830946 814192 797460 781057 764740 748328 732370
66786 732370 717697 704458 692040 679857 667970 656831 646558 636513 625711 613804 601618
66775 601618 590412 580484 570815 560242 548795 537650 527858 519343 511171 502660 494099 486313 479605
66762 479605 473399 467019 460443 453930 447287 440130 432761 426008 420030 413998 407379 400921 395763 391868
66748 391868 387979 383076 377394 371948 367414 363587 359703 355173 350037 344800 339890 335438 331481 328012
66734 328012 324680 320838 316179 311187 306676 303068 300283 298024 295815 292961 289005 284265 279621 275709
66720 275709 272545 269869 267545 265510 263546 261283 258405 254931 251299 248008 245081 242067 238746 235573
66706 235573 233132 231431 230099 228995 228073 226749 224160 220261 216081 212595 209798 207290 205249 204219
66692 204219 204087 203891 202769 200724 198378 196256 194454 192731 190799 188638 186618 185082 183767 181927 179234
66677 179234 176280 173889 172137 170450 168564 166869 165688 164712 163480 162064 160865 159963 159155 158479 158153
66662 158153 157944 157137 155364 153108 151166 149912 149283 149103 149028 148468 147066 145206 143706 142946 142587 142170 141658
66645 141658 141261 140918 140205 138798 136953 135450 134901 135109 135259 134780 133832 132892 132157 131604 131339 131491 131853 132008
66627 132008 131819 131477 131030 130183 128673 126633 124466 122541 121037 119947 119153 118583 118264 118102 117746 116941 115963
66610 115963 115370 115297 115314 115043 114598 114294 114186 114073 113697 112811 111292 109417 107786 106779 106253 105929 105793 105852
66592 105852 105759 105095 103986 103048 102671 102599 102334 101779 101331 101381 101796 101966 101483 100716 100443 100850 101179 100640 99359
66573 99359 98089 97226 96636 96319 96571 97281 97699 97290 96455 95927 95694 95054 93630 91861 90417 89591 89410 89865
66555 89865 90724 91381 91360 90918 90777 91250 91909 92187 92033 91806 91735 91727 91592 91242 90764 90504 90921 92067 93256 93629
66535 93629 93136 92566 92478 92514 92095 91456 91356 91895 92203 91550 90306 89486 89586 90227 90787 91003 90892 90395 89375
66516 89375 87903 86405 85376 84889 84500 83741 82675 81798 81418 81373 81451 81759 82417 83042 82905 81654 79677 77745
66498 77745 76466 76077 76472 77321 78246 79002 79482 79640 79519 79363 79511 80164 81319 82809 84214 84873 84414 83323
66480 83323 82573 82521 82517 81886 80902 80429 80798 81543 82140 82528 82859 83176 83505 83916 84245 84008 82925 81468 80602
66461 80602 80908 82046 83059 83110 81966 79982 77877 76498 76461 77650 79085 79648 79151 78484 78530 79180 79666
66444 79666 79558 78976 77988 76491 74799 73790 74031 75116 76182 76805 77061 76997 76603 76146 76016 76119 75904 75134
66426 75134 74195 73452 72708 71725 70980 71337 72943 74919 76290 76876 76991 76706 75848 74618 73640 73213 72853 71899
66408 71899 70409 69198 68971 69584 70237 70277 69803 69467 69699 70224 70419 70040 69425 69000 68901 69160 69917 71170 72548
66389 72548 73597 74221 74613 74876 74957 74842 74572 74167 73786 73809 74448 75341 75902 76039 76223 76859 77905 79073 80069
66370 80069 80644 80731 80564 80330 79791 78666 77337 76630 76775 77117 77038 76668 76389 76153 75654 74868 74032 73397 73255
66351 73255 73926 75362 76987 78195 78807 78864 78334 77316 76181 75173 74177 73134 72308 71836 71464 71108 71157
66334 71157 71692 71956 71335 70516 70738 72121 73580 74346 74679 74990 75153 75024 74885 74989 75197 75407 75857 76642
66316 76642 77345 77476 77008 76235 75464 75003 75019 75216 75112 74887 75397 76909 78388 78616 77732 76997 77211 78001 78689
66297 78689 79217 80000 81226 82619 83747 84368 84503 84278 83706 82685 81224 79599 78170 77124 76443 76090
66281 76090 76063 76286 76533 76509 76068 75371 74738 74291 73865 73386 73170 73544 74293 74849 75012 75121 75406 75618 75498 75311
66261 75311 75587 76478 77588 78393 78677 78603 78385 77909 76842 75305 74162 74189 75068 75759 75834 75793 75953 75852 75142
66242 75142 74350 74119 74275 74360 74669 75882 77868 79654 80558 80631 79967 78383 76059 73853 72588 72382 72922
66225 72922 74001 75465 76979 78212 79051 79410 79083 78131 77235 77257 78384 79920 80969 81196 80946 80778 80978
66208 80978 81426 81809 81878 81543 80869 80126 79775 80211 81440 83070 84588 85585 85827 85358 84604 84211 84545 85360
66190 85360 85973 85811 84793 83306 81873 80818 80200 79966 80093 80543 81161 81724 82141 82553 83221 84298 85675
66173 85675 87067 88196 88856 88768 87650 85671 83681 82656 82843 83695 84617 85379 85795 85583 84871 84406 84772
66156 84772 85615 86103 85978 85681 85496 85106 84087 82517 80912 79826 79603 80294 81675 83399 85150 86621
66140 86621 87570 88006 88145 87961 87079 85498 84141 84105 85452 87279 88951 90643 92556 94274 95218 95255 94546
66123 94546 93244 91752 90816 90878 91546 92130 92498 92932 93413 93611 93570 93810 94559 95266 95156 94101 92816 92268
66105 92268 92956 94627 96580 98250 99516 100478 101105 101259 100961 100448 99986 99806 100141 101086 102379 103544 104366
66088 104366 105050 105839 106624 107077 107058 106737 106310 105786 105106 104361 103755 103377 103130 102885 102595 102287 102093 102337 103272
66069 103272 104556 105281 104927 104116 103941 104550 104966 104442 103398 102723 102689 103101 104054 105760 107803 109293 109894
66052 109894 110118 110507 111023 111441 111771 112008 111922 111467 111050 110983 110925 110334 109300 108546 108678 109772 111612 113910
66034 113910 116266 118261 119740 120775 121406 121622 121645 121923 122722 123933 125258 126390 127015 126995 126713 126928 128087
66017 128087 129911 131768 133276 134394 135138 135492 135517 135445 135707 136809 138894 141369 143340 144681 146390 149513
66001 149513 153923 158496 162358 165548 168602 172018 176149 181141 186711 192250 197338 201932 205985 209135
65987 209135 210943 211244 210133 207820 204659 201111 197502 193878 190203 186485 182653 178539 174212 170105
65973 170105 166564 163403 160153 156686 153333 150422 147947 145752 143815 142247 141084 140270 139817 139884 140530
65958 140530 141389 141765 141317 140568 140558 141880 144171 146519 148236 149262 150102 151433 153501 155780 157458 158401
65942 158401 159417 161383 164284 167304 169708 171406 172758 174098 175463 176753 178057 179715 181836 183905
65928 183905 185257 185983 186951 188755 191096 193484 196122 199604 204010 208789 213442 217948 222618 227854 233930
65913 233930 240654 247294 253146 258078 262326 265996 269092 271741 273919 275132 274944 273715 272313 271184
65899 271184 270218 269399 268875 268361 267176 265111 262635 260027 256847 252550 247135 240901 234132 227349 221316
65884 221316 216250 211400 205955 200089 194624 189902 185503 180951 176260 171859 168363 166269 165428 164863 163504
65869 163504 161170 158548 156287 154467 152893 151478 150200 149011 147931 147068 146464 146149 146354 147385 149135
65854 149135 150947 152149 152648 152903 153425 154409 155684 156850 157510 157561 157319 157284 157689 158357 159049 159854 161042 162560
65836 162560 163969 165033 166127 167750 169743 171432 172530 173517 174988 177047 179613 182972 187582 193438
65822 193438 199987 206644 213129 219362 225369 231326 237421 243407 248435 251444 251823 249747 246014 241500
65808 241500 236701 231679 226413 221072 215875 210832 205824 200941 196517 192782 189596 186684 184091 182223
65794 182223 181363 181211 181053 180387 179287 178178 177448 177434 178556 181123 184938 189280 193395 196971 200242 203812
65778 203812 208327 214126 221126 229086 237747 246529 254383 260434 264697 267681 269266 268496 264657 258086
65764 258086 249782 240725 231815 223864 217119 211148 205667 201190 198415 197331 197562 199313 203243 209448
65750 209448 217293 226353 236830 248855 261983 275783 290367 305804 321285 335459 347527 357521
65738 357521 365434 370513 371698 368628 361968 352818 341938 329570 315766 300808 285361 270324 256414
65725 256414 243784 232130 221203 211099 201882 193214 184745 176779 170097 165057 161236 157999 155034
65712 155034 152217 149456 146918 144967 143595 142306 140898 139911 139857 140402 140806 140857 140791 140573 139975 139268 139142
65695 139142 139833 140879 141819 142642 143487 144379 145403 146700 148169 149565 150959 152684 154757 156820 158804
65680 158804 161179 164332 168147 172469 177548 183757 191165 199717 209516 220650 233034 246736 262162
65667 262162 279501 298097 316702 334289 350488 365415 379272 391974 402963 411543 417545 421493
65655 421493 423976 425170 425190 424567 423993 423810 424149 425353 427792 431255 434972 438290 440999 442893 443336 441389
65639 441389 436190 427146 414100 397568 378710 358821 338773 318927 299503 280886 263521 247585
65627 247585 232907 219367 207254 197002 188513 181031 173897 167251 161727 157604 154528 152001 149788
65614 149788 147787 145850 143959 142405 141529 141296 141262 140980 140348 139565 138856 138273 137701 136979 136061 135155 134736 135264
65596 135264 136720 138459 139697 140229 140535 141165 142156 143225 144353 145959 148407 151517 154713 157679 160747
65581 160747 164578 169477 175155 181270 188091 196441 206919 219310 232835 246875 261348 276468 292289
65568 292289 308522 324623 339920 353588 364645 372158 375644 375300 371788 365763 357539 347125 334508
65555 334508 319985 304269 288270 272693 257847 243748 230324 217544 205633 195205 186833 180302
65543 180302 174581 168910 163667 159797 157569 156461 156140 156855 158689 161008 163065 164740 166339 167971 169507
65528 169507 170912 172144 172845 172466 170739 167843 164227 160475 157137 154355 151692 148623 145185 141900 139169
65513 139169 136983 135199 133842 133084 133122 134003 135357 136371 136409 135707 135219 135680 136965 138348 139139 139077 138428
65496 138428 137894 138217 139623 141689 143833 145898 148252 151465 155871 161256 166863 171893 176144 180067 184107
65481 184107 188065 191215 193001 193568 193676 194075 194839 195287 194672 192908 190424 187392 183537 178879 174185 170208
65465 170208 166740 162934 158526 154190 150656 147990 145932 144425 143392 142384 140962 139333 138156 137738
65451 137738 137794 137972 138221 138547 138838 139138 139805 141094 142739 144193 145235 146190 147581 149661 152257 154997
65435 154997 157688 160457 163482 166722 170093 173777 177958 182231 185643 187493 187740 186535 183820 179790
65421 179790 175328 171414 168234 165295 162283 159364 156721 154375 152533 151668 152036 153377 155180 157029 158652
65406 158652 159889 160737 161281 161600 161892 162518 163679 165186 166969 169556 173495 178392 183207 187544 191911
65391 191911 196501 200471 202930 203960 204072 203190 200947 197709 194447 191594 188715 185535 182677 180983 180406
65376 180406 180010 179041 177736 176914 176953 177390 177625 177720 178233 179431 181066 182931 185186 187974 191136 194543 198386
65359 198386 202911 208184 214344 221707 230355 239920 250168 261420 273852 286502 297482 305267 309603
65346 309603 311314 311551 311084 309947 307704 304189 299803 294921 289375 282886 275700 268247 260420 251823 242706
65331 242706 234028 226435 219638 212983 206193 199426 192982 187224 182488 178851 176139 174241 173158 172666
65317 172666 172225 171388 170101 168488 166601 164552 162617 160973 159434 157712 155876 154352 153444 152978 152538
65302 152538 152000 151720 152102 153138 154613 156660 159637 163332 166797 169417 171782 174909 178684 181666 182530
65287 182530 181236 178674 175607 172314 168988 166088 164156 163341 163174 162942 162346 161571 160693 159346 157274 154909
65271 154909 152991 151813 151210 151066 151294 151482 151189 150625 150492 151121 152224 153449 154569 155125 154655 153553 153000
65254 153000 153648 154851 155600 155703 155603 155479 155088 154282 153194 152011 150869 149847 148868 147780 146630 145605
65238 145605 144641 143553 142682 142811 144037 145272 145468 144918 144698 145173 145842 146435 147313 148637 149902 150572 150730
65221 150730 150729 150598 150056 148953 147501 146205 145621 145905 146518 146647 146149 145873 146717 148465 149883 150076 149523 149513
65203 149513 150650 152266 153409 153955 154359 154671 154488 153854 153431 153518 153559 153073 152520 152630 153293 153842 154239 155215
65185 155215 157187 159628 161657 162831 163268 163475 164186 165950 168602 171369 173590 175136 176101 176507 176488 176467
65169 176467 176863 177701 178674 179537 180394 181681 183843 186918 190413 193748 196721 199418 201826 203863 205703
65154 205703 207751 210325 213664 218247 224654 233022 242967 254205 267067 282319 300679 322524 347743
65141 347743 375739 405695 436786 467905 497462 524176 548281 571355 594655 617897 639868
65130 639868 659604 676472 689504 697413 699422 695872 688044 677524 665484 652200 637254 620256
65118 620256 601089 579439 554672 526771 497077 467511 439190 412280 386948 363741 342965
65107 342965 324347 307487 292152 278017 264665 252149 241074 231839 224171 217659 212312 208186
65095 208186 204851 201670 198389 195017 191446 187711 184499 182780 182793 183831 185094 186435 188108 190123 192046
65080 192046 193295 193505 192735 191377 189797 188058 186111 184136 182502 181466 181208 182003 183885 186087 187348
65065 187348 187089 185971 185036 184596 184307 184004 183946 184316 184918 185474 185971 186637 187689 189086 190387 190938 190397 188999
65047 188999 187178 185083 182702 180237 177929 175636 173103 170721 169469 169807 171009 171904 172000 171527 170649 169180
65031 169180 167105 164885 162981 161340 159600 157728 156147 155206 154759 154458 154330 154802 156100 157876 159525
65016 159525 160707 161384 161546 161128 160143 158740 157186 155972 155779 157044 159635 163146 167351 172075 176852
65001 176852 181205 185200 189147 192685 194804 195067 194292 193627 193360 193064 192570 192223 192323 192828 193619 194681 196009
64984 196009 197595 199515 201764 204050 205962 207266 207814 207344 205776 203629 201737 200399 199158 197475 195354
64969 195354 193135 190972 188786 186564 184474 182680 181229 180133 179429 179052 178741 178214 177507 176959 176717 176423
64953 176423 175668 174665 174026 173822 173350 172125 170691 170003 170237 170652 170505 169722 168738 168060 167939 168136 168075 167509
64935 167509 166915 166901 167359 167700 167824 168272 169318 170441 170941 170666 169887 168844 167747 166934 166679 166881 167087 166803
64917 166803 165812 164394 163232 162842 163122 163724 164779 166771 169686 172870 175928 179213 183059 187086 190803
64902 190803 194508 199030 204741 211333 218396 225701 232948 239724 245803 251185 255828 259624 262622 265021
64888 265021 266960 268558 270091 271816 273649 275245 276330 276717 276107 274290 271500 268192 264442 259947 254650
64873 254650 249015 243696 239287 236403 235389 235732 236275 236405 236632 237605 238880 239224 237963 235505 232580 229452
64857 229452 225998 222096 217744 213018 208184 203672 199765 196399 193416 190890 189012 187651 186262 184410
64843 184410 182332 180790 180247 180342 180382 180258 180552 181709 183448 185178 186646 187833 188492 188327 187610 187145 187482
64826 187482 188516 189918 191579 193432 195273 197041 198988 201276 203709 206241 209489 214253 220652 228156
64812 228156 236367 245288 254925 265209 276406 288933 302444 315526 326715 335507 342018 345977 346601
64799 346601 343431 336908 328097 318070 307560 296953 286567 276886 268333 260764 253583 246706 241024
64786 241024 237388 235312 233315 230577 227663 225549 224545 224440 225116 226517 228369 230444 232983 236449 241018
64771 241018 246616 253258 260888 268992 276932 284839 293676 304049 315155 325269 333268 339503 345151
64758 345151 350898 356328 360446 362615 362923 361911 360209 358418 356969 355821 354433 352254 349197 345433
64744 345433 340889 335214 328261 320261 311482 302053 292311 283013 274927 268293 262900 258527 255040 252212
64730 252212 249808 247839 246413 245335 244259 243308 243128 244022 245409 246551 247595 249373 252285 255866 259488
64715 259488 263016 266540 269915 272862 275296 277202 278374 278554 277732 276035 273442 269857 265361 260138 254234
64700 254234 247751 241264 235632 231191 227407 223549 219587 216223 214094 213197 213110 213587 214711 216436 218318
64685 218318 219935 221511 223737 226911 230609 234404 238546 243578 249572 256231 263612 272226 282389 293922
64671 293922 306555 320111 334052 347206 358237 366146 370228 370017 365749 358588 349878 340217 329574
64658 329574 318235 307135 297173 288640 281531 276060 272390 269938 267490 264366 261292 259731 260324 262310
64644 262310 264642 267395 271732 278633 287931 298571 309557 320740 332954 347298 363943 381616
64632 381616 398540 413763 427179 438503 446922 451929 453777 452845 449125 442760 434456 424856 414044
64619 414044 402296 390749 380493 371276 362011 352421 343310 335293 328273 322358 318261 316193 315097
64606 315097 313643 311528 309267 307134 304948 302577 300029 297122 293612 289517 284941 279736 273858 267878
64592 267878 262575 258037 253730 249441 245578 242439 239833 237675 236376 236291 237326 239486 243284 248874 255165
64577 255165 260585 264697 268298 271876 274825 276530 277456 278471 279538 279798 278809 276998 274844 272251 268833
64562 268833 264328 258572 251665 244464 238447 234516 232167 230215 228101 226019 224057 221988 219956 218590
64548 218590 218113 217900 217401 217035 217515 218545 218962 218273 217392 217523 218733 220082 220851 221209 221680 222386 222956 222995
64530 222995 222524 221971 221681 221417 220528 218808 217016 216212 216670 217747 218809 219869 221218 222867 224621 226409
64514 226409 228284 230323 232755 235955 239984 244354 248566 252675 257051 261869 267301 273931 282270 291899
64500 291899 301792 311642 322199 333962 346137 357289 366472 373227 376928 376927 373332 367009 358764 348946
64486 348946 337978 326863 316951 309328 304374 301539 299466 296677 292572 287743 283234 279454 275869 271719
64472 271719 266970 262451 258916 256090 252972 249230 245918 244471 245163 247005 248995 250936 252931 254741
64458 254741 256112 257418 259381 262095 264685 266090 266027 265066 263934 262949 262133 261601 261585 262136 263085 264450 266630
64441 266630 269910 273935 278036 282120 286899 293064 300560 308912 318026 328211 339477 351322 363486
64428 363486 376667 392142 410730 432447 457188 485509 518643 558088 605416 662261 729914
64417 729914 808582 896967 992434 1091433 1190124 1285313 1375277 1459542 1537571 1607668 1667217
64406 1667217 1713702 1745361 1761174 1760948 1745642 1717350 1678446 1630455 1573513 1506926 1430376 1344879
64394 1344879 1252838 1157425 1061998 969711 883058 803493 731658 667987 612726 565287 524208
64383 524208 488272 457319 431509 410172 392079 376622 363843 353271 343641 334180 325492 318580
64371 318580 313364 308710 303680 298238 292877 288020 283812 280058 276262 271998 267420 263241 260192 258527
64357 258527 258032 258344 259264 260881 263451 267132 271835 277371 283642 290662 298465 307060 316304 325631 333947
64342 333947 339969 342791 342228 338819 333583 327605 321617 315904 310514 305415 300471 295581 291054 287605
64328 287605 285700 285008 284789 284779 285372 286900 288941 290456 290514 289003 286793 285095 284375 283966 282996 281605 280725
64311 280725 280628 280317 278717 275965 272925 269766 265770 260554 254770 249345 244621 240554 237329 235210 234029
64296 234029 233310 232798 232434 231963 231149 230492 231112 233600 237348 241361 245377 249763 254586 259454 264312 269829
64280 269829 276689 284811 293508 302181 310560 318545 326223 334005 342310 350993 359364 366870 373450 378979
64266 378979 382728 383827 382242 378934 375033 371193 367795 365290 364052 364055 364913 366035 366600 365716 362954 358487
64250 358487 352439 344425 334237 322758 311524 301404 292276 283965 276729 270665 265369 260571 256520
64237 256520 253304 250408 247544 245424 244971 246013 247496 248800 250183 251962 253947 255739 257058 257673 257545
64222 257545 257101 256904 256930 256659 255943 255218 254710 254024 252771 251065 249046 246477 243294 240174 237926 236576
64206 236576 235639 235198 236067 238712 242440 245915 248254 249449 249953 250210 250631 251802 254408 258876 265166 273027
64190 273027 282307 292899 304612 317475 332134 349430 369275 390146 409913 427028 440733 450385
64178 450385 455014 453699 446238 433488 417182 399385 381811 365387 350344 336676 324451 313773
64166 313773 304577 296635 289744 283759 278358 273007 267487 262382 258611 256349 254802 253303 252181 252104 252993
64151 252993 254239 255773 258162 261572 265387 269104 272995 277496 282386 286941 290557 292916 293913 293820 293294
64136 293294 292809 292224 291156 289564 287676 285608 283377 281182 279385 278263 277901 278120 278396 278249 277994 278821
64120 278821 281753 286712 292905 299819 307403 315610 324415 334261 345892 359514 374458 389698 404418
64107 404418 417964 429603 438557 444302 446882 447156 446617 446730 448378 451977 457850 466101 476182 486988
64093 486988 497420 506678 514115 519198 521706 521763 519686 515950 511142 505583 499051 491223 482255 472472
64079 472472 461680 449461 436324 423844 413235 404276 396035 388152 380826 373950 367135 360580 355173
64066 355173 351458 349040 347247 345927 345178 344697 343986 343102 342637 342927 343770 345095 347379 350985 355465 360024
64050 360024 364542 369657 375873 383138 391421 401180 412870 426318 440983 456759 474163 493670 514976
64037 514976 536884 557899 577000 593869 608279 619429 626257 628496 627008 622857 616420 607731 597374
64024 597374 586561 576435 567602 560213 554083 548705 543449 537812 531394 523804 514840 504619 493313
64011 493313 480992 468049 455515 444390 434688 425610 416700 408408 401437 395972 391698 388214 385229
63998 385229 382670 380814 380067 380382 381114 381693 382292 383620 386141 389638 393494 397181 400523 403676 407026
63983 407026 411066 416183 422444 429573 437315 445723 454908 464608 474339 484049 494206 505063 516320
63970 516320 527824 540220 554453 570909 589534 610439 633721 658829 684854 711479 739004
63959 739004 767340 795743 823903 852774 883987 918881 958426 1003698 1055984 1116627 1187174
63948 1187174 1269595 1366137 1479043 1610495 1762479 1936313 2132209 2349292 2585908 2839936
63938 2839936 3109112 3391181 3683489 3982206 4282004 4576402 4858138 5119359 5352330
63929 5352330 5550752 5710564 5829432 5905672 5937819 5924864 5866555 5763657 5618360 5434539
63919 5434539 5217545 4973770 4710327 4434591 4153410 3872472 3596307 3328632 3072474
63910 3072474 2830202 2603807 2395102 2205369 2034746 1882063 1745460 1623313 1514808
63901 1514808 1419765 1337843 1267760 1207353 1154409 1107423 1065644 1028533 995254 964564 935209
63890 935209 906516 878572 851716 825937 800921 776533 752934 730381 709268 690264 673923
63879 673923 660152 648506 639048 632348 628529 626900 626843 628547 632516 638845 647442 658553 672438 688656
63865 688656 706121 723936 741909 760398 779836 800251 821015 841190 860259 878229 894834
63854 894834 909113 920205 928289 934186 938164 939622 937973 933431 926770 918480 908234 895113 878409
63841 878409 858248 835335 810232 783254 755047 726704 698968 671719 644558 617565 591199
63830 591199 565877 541994 519923 499561 480279 461820 444802 429778 416222 403220 390816
63819 390816 379830 370508 362186 354278 346756 339634 332827 326687 321878 318366 315208 311709 308210 305404
63805 305404 303398 301836 300480 299209 297784 296038 294140 292372 290785 289217 287455 285222 282264 278581
63791 278581 274415 269992 265561 261577 258382 255697 252982 250336 248419 247312 246288 245061 244496 245371 247037
63776 247037 248085 247987 247299 246493 245401 243820 241953 240122 238599 237829 238247 239681 241280 242233 242291 241622 240573
63759 240573 239600 238976 238401 237381 236181 235896 237142 239021 239855 238912 237062 235804 235959 237257 238836 240063
63743 240063 241057 242480 244710 247315 249619 251682 254272 257720 261265 263911 265638 267265 269276 271293
63729 271293 272786 273789 274704 275828 277356 279514 282343 285569 288978 292671 296607 300254 303184 305806
63715 305806 308853 312199 314819 316004 315993 315233 313715 311427 308948 307005 305744 304812 303943 303076 302187 301479
63699 301479 301483 302504 304105 305663 307290 309625 312732 315798 318055 319523 320683 321937 323644 326125 329172
63684 329172 331820 333099 332897 331809 330357 328712 327012 325447 323981 322441 321016 320323 320732 321864 323055
63669 323055 324169 325633 327625 329527 330409 330009 329029 328327 327918 326932 324592 321033 317039 313170 309428 305692
63653 305692 302061 298644 295316 292022 289164 287340 286661 286575 286402 285886 285241 284812 284791 285093 285450 285752 286358
63636 286358 287891 290645 294245 297992 301420 304509 307520 310775 314462 318468 322443 326201 330090 334850
63622 334850 341047 348669 357231 366264 375729 386023 397580 410479 424472 439304 454926 471512
63610 471512 489494 509513 532036 556937 583652 611750 640951 670451 698540 723195 742846
63599 742846 756533 763879 765421 762758 757782 751679 744884 737770 730920 724717 718994 713001 705478 694987
63585 694987 680822 663628 644751 624992 604403 583178 562053 541767 522744 505566 491091
63574 491091 479745 471098 464460 459464 455864 453356 452068 452668 455463 459806 464913 470711 477181 483383
63560 483383 488214 491948 495943 500726 505465 509702 514592 521732 531524 543495 557759 575204 596486
63547 596486 621692 651049 685072 723611 765017 806361 844100 874586 894849 903783 902696 894459
63535 894459 882130 868282 854966 843487 834109 826415 820065 814870 810008 803585 793395 778082 757518
63522 757518 732391 703813 673311 642698 613559 586669 561858 538481 516164 495219 476302
63511 476302 459665 444926 431608 419672 409305 400386 392443 385138 378544 372947 368526 365162 362427
63498 362427 359871 357559 356156 356167 357173 358175 358603 358545 358056 356880 355147 353744 353503 354248 355074 355369 355227
63481 355227 355077 355348 356401 358340 360895 363815 367318 371688 376410 380210 382131 382221 380951 378425 374604
63466 374604 370019 365657 362017 358666 354890 350593 346427 343202 341323 340648 340626 340552 339955 338941 338151 338292
63450 338292 339672 342138 345333 348888 352453 355807 359054 362589 366722 371412 376599 382759 390834 401448
63436 401448 414502 429936 448757 472644 502109 535204 568347 598244 622856 641111 652787
63425 652787 659033 662309 665084 668664 673493 680213 689919 703548 721565 744110 770883 800781 832195
63412 832195 863835 894836 923871 948655 966854 977433 980967 978898 972796 964157 954379 944676 935879
63399 935879 928189 920905 912489 901193 885867 866327 843118 817025 788782 759057 728582 698219
63387 698219 668883 641351 616047 592888 571424 551387 533210 517785 505571 496104 488610 482878
63375 482878 479311 478287 479775 483403 488540 494465 500867 508083 516425 525423 534316 543299 553645 566434
63361 566434 581680 598881 617857 638769 661866 687567 716308 747858 781078 814626 847465
63350 847465 878304 905129 926015 940232 948126 950250 947211 940212 930965 920863 910571 900363
63338 900363 890414 880592 870269 858414 843834 825539 803293 777881 750676 722994 695901 670235
63326 670235 646409 624347 604000 585837 570621 558938 551247 547968 548766 551726 553742 551977 544908
63313 544908 532487 516031 497906 480497 465020 451439 439431 428995 420213 412966 407087 402423
63301 402423 398717 395785 393852 393256 393767 394626 395255 395515 395280 394312 392645 390561 388057 384862 381120 377467
63285 377467 374291 371504 369211 367881 367500 367264 366584 365776 365154 364081 361704 358291 355044 352791 351554
63270 351554 351241 351935 353388 354927 356149 357323 358938 361118 363575 365896 367881 369805 372268 375483 378914
63255 378914 382011 385139 389182 394253 399478 404264 409127 414867 421470 428407 435666 443812 453108 463219
63241 463219 473949 485777 499410 515095 532642 551908 572933 595689 620026 645899 673451
63230 673451 702766 733645 765663 798281 830890 862982 894435 925576 956811 988337 1020255
63219 1020255 1052786 1086153 1120343 1155214 1190700 1226668 1262563 1297421 1330155 1359582 1384242
63208 1384242 1402590 1413517 1416485 1411171 1397350 1375308 1346111 1311227 1272003 1229658 1185602 1141529
63196 1141529 1099191 1060072 1025115 994625 968539 946852 929691 917042 908639 904280 904113 908492
63184 908492 917615 931287 948919 969833 993758 1020853 1050974 1083010 1115447 1147589 1179770 1212335
63172 1212335 1245020 1277514 1309958 1342408 1374279 1404774 1433436 1459733 1482379 1499635 1510122
63161 1510122 1512895 1507057 1492036 1468210 1436721 1398605 1354624 1305936 1254360 1201675 1148961 1096763
63149 1096763 1045648 996462 950191 907621 869033 834314 803427 776547 753495 733391 715360
63138 715360 699341 685691 674186 664108 655259 648141 642889 638667 634500 630297 626717 624375 623519
63125 623519 624190 626372 630091 635467 642488 650592 658773 666254 672850 678630 683597 687861 691725 695317
63111 695317 698381 700602 701952 702615 702878 703158 703716 704204 704052 703504 703635 704826 705838 705113 702684 700063
63095 700063 698363 697263 695844 693754 691334 689067 687247 685959 685214 685163 686098 688011 690289 692229 693859
63080 693859 695888 698834 702552 706687 711185 716203 721838 728164 735374 743716 753337 764173 775860 787899
63066 787899 800220 813510 828683 846001 865055 885610 908040 932877 960369 990639 1023898
63055 1023898 1060334 1100153 1143930 1192400 1245635 1302840 1363369 1427548 1495960 1568236 1643151
63044 1643151 1719778 1797895 1877208 1956772 2035496 2112936 2189411 2265598 2342176 2419635 2498180
63033 2498180 2577797 2658276 2738900 2818076 2893506 2962742 3023266 3072064 3105690 3121334 3117866
63022 3117866 3095664 3055611 2998570 2925848 2839816 2743857 2641708 2536796 2431997 2329800
63012 2329800 2232558 2142508 2061507 1990764 1930804 1881640 1843017 1814668 1796593 1789114 1792470 1806193
63000 1806193 1828909 1858905 1894977 1936660 1983562 2034663 2088452 2143760 2200265 2258174 2317640
62989 2317640 2378551 2440548 2502915 2564575 2624431 2681631 2735279 2783948 2825640 2858083 2878782
62978 2878782 2885093 2874992 2848044 2805235 2747718 2676224 2592004 2497789 2397182 2293185 2187806
62967 2187806 2082868 1980498 1882554 1789975 1702994 1621767 1546589 1477664 1414896 1357849 1305808
62956 1305808 1257938 1213499 1171951 1132884 1095933 1060811 1027332 995367 964862 935882 908552
62945 908552 882928 858989 836709 816019 796715 778550 761490 745702 731258 717999 705787
62934 705787 694786 685322 677534 671270 666320 662589 659934 657947 656055 653970 651880 650066 648342 646143
62920 646143 643212 639895 636542 632891 628429 623205 617873 612937 608321 603737 599050 594176 589065 583991
62906 583991 579482 575603 571639 566935 561831 557330 553949 551334 548977 546804 544947 543372 542008 540961
62892 540961 540318 539862 539196 538095 536652 535208 534203 533913 534212 534712 535215 535817 536471 536800 536664 536632 537377 538597
62874 538597 539083 538079 536228 534895 534771 535376 535739 535202 533658 531388 528874 526596 524860 523734 523104 522728
62858 522728 522429 522373 522993 524371 525792 526354 526050 525890 526742 528409 530064 531255 532065 532511 532308 531288 529657
62841 529657 527698 525525 523255 521136 519283 517501 515574 513583 511772 510230 508963 508194 508260 509140 510322
62826 510322 511302 512083 513030 514356 515970 517845 520273 523606 527876 532844 538320 544177 550083 555539 560367
62811 560367 564925 569690 574792 580160 585965 592551 599969 607847 615830 623947 632471 641620 651520 662301
62797 662301 674094 686926 700650 715006 729869 745642 763349 784041 808054 835045 864867
62786 864867 898112 935606 977753 1024822 1077788 1138243 1207196 1284302 1368672 1460299 1560222
62775 1560222 1669232 1786699 1910781 2039375 2170471 2301650 2429674 2550681 2660653
62766 2660653 2755841 2833161 2890476 2926463 2940200 2931113 2899440 2846583 2774917 2687480 2587755
62755 2587755 2479263 2364927 2246934 2127352 2008533 1892590 1780766 1673686 1572095
62746 1572095 1477028 1389402 1309693 1237736 1172500 1112495 1057017 1006775 962632 923940 888967
62735 888967 856895 828449 804304 783784 765617 749226 734723 722253 712012 704408 699417 696100
62723 696100 693484 691757 691860 693939 696966 700012 703355 708060 714906 724033 735316 748722 764308 782192
62709 782192 802625 826069 853079 884011 918929 957962 1001710 1051109 1106922 1169636 1239672
62698 1239672 1317199 1401721 1492572 1590129 1695828 1810316 1931972 2057776 2185079 2311663
62688 2311663 2434387 2548950 2651273 2738322 2807392 2855507 2880259 2880843 2857787 2812098 2745276
62677 2745276 2659971 2559849 2448643 2329677 2206343 2082360 1960964 1843888 1731516 1624058
62667 1624058 1522259 1426931 1338334 1256458 1181572 1113909 1052965 997779 947928 903557 864273
62656 864273 828841 796422 767428 742432 720754 700874 681907 663895 646901 630748 615596
62645 615596 601933 589814 578759 568560 559588 552121 545985 541010 537260 534605 532557 530786 529260
62632 529260 527705 525440 522072 517934 513616 509513 505972 503201 500741 497684 493938 490768 489531 490260
62618 490260 492003 494036 496189 498437 500995 504569 509706 515890 521982 527575 533269 539615 546454 553559
62604 553559 561288 570351 581362 594911 611638 631810 655064 680976 709766 742250 779241 821251
62592 821251 868568 921249 978909 1040651 1105165 1170864 1236010 1298862 1357608 1410061 1453663
62581 1453663 1486204 1506706 1515461 1513212 1500468 1477633 1445476 1405205 1358239 1306149 1250720 1193781
62569 1193781 1136960 1081670 1029100 979787 933275 888778 846392 807262 772370 741667 714713
62558 714713 691601 672549 656838 642998 630102 618278 607805 598318 589266 580715 573284 567415
62546 567415 562951 559363 556263 553747 552227 551763 551719 551379 550826 550818 551756 553219 554598 555736 556821 558098
62530 558098 559930 562749 566670 571471 577195 584482 594091 606351 621183 638265 657059 677271 699688
62517 699688 726062 757698 794486 835739 881547 932694 989568 1051815 1118914 1190380 1265259
62506 1265259 1341842 1417848 1490618 1557364 1615883 1665053 1704195 1732067 1747101 1748762 1738148
62495 1738148 1717192 1687958 1652971 1615523 1578818 1544772 1514008 1487005 1464947 1449427 1441550
62484 1441550 1441512 1449031 1464055 1486826 1517154 1553646 1593656 1633820 1670626 1700898 1722387 1734273
62472 1734273 1737088 1731954 1719493 1698993 1668475 1626100 1571987 1508686 1439734 1367964 1295280 1223332
62460 1223332 1153585 1086871 1023624 964641 911018 863237 820908 783651 751644 725026 703268
62449 703268 685552 671364 660307 651700 644980 640296 638066 637931 638785 640081 642621 647554 654875 663443
62435 663443 672388 681765 691469 700135 705874 707968 707117 704009 698437 690172 679886 668552 656398 643229
62421 643229 629455 616001 603260 590876 578631 566880 555987 545882 536403 527566 519336 511602
62409 511602 504558 498635 493834 489599 485569 482022 479269 477066 474978 472993 471428 470506 470357 471146 472925
62394 472925 475526 478787 482566 486407 489627 492068 494290 496656 498735 500128 501426 503591 506676 509972
62380 509972 513350 517630 523471 530583 538293 546238 554214 561894 569240 576834 585312 594582 604038 613387
62366 613387 622887 632907 643721 655851 670162 687333 707466 730454 756530 786144 819485 856576
62354 856576 897790 943667 993850 1046546 1099378 1150432 1198043 1240022 1274108 1299446 1316984
62343 1316984 1328119 1333476 1333236 1327978 1318491 1305002 1287189 1264881 1238426 1208679 1177075 1145401
62331 1145401 1114898 1085684 1057582 1031320 1008160 988354 970728 954015 937897 922384 906859
62320 906859 890316 872211 852649 831948 810362 788025 764869 740962 717208 695271 676233
62309 676233 659563 644011 629298 616309 605779 597532 591100 586303 582877 580246 578163 577193 578041
62296 578041 580702 584670 589684 595702 602342 609038 615788 623267 631974 641605 651354 660497 668571 675367
62282 675367 681021 685919 690310 694072 696894 698439 698391 696713 694057 691510 689648 688144 686627 685549 685726
62267 685726 687239 689454 692139 696024 702084 710724 721846 735405 751660 771178 794850 823592 857738
62254 857738 896850 940415 988519 1041381 1098049 1155774 1210934 1260709 1303989 1340842 1371275
62243 1371275 1394647 1410190 1417808 1418029 1411221 1397156 1375398 1345896 1309175 1266267 1218666 1168111
62231 1168111 1116180 1064193 1013648 966404 924041 886972 854434 825321 798897 774882 753238
62220 753238 734052 717406 703188 691017 680353 670645 661460 652719 644844 638496 634001 630984 628573
62207 628573 625978 623033 620318 618682 618510 619465 621087 623452 626955 631500 636370 641075 645938 651523 657740
62192 657740 663943 669825 675743 682092 688811 695725 703043 711160 720102 729531 739241 749287 759582 769669
62178 769669 779065 787569 795056 801169 805553 808393 810563 813286 817704 824616 834341 846888 862427 881553
62164 881553 904881 932456 963870 998881 1037461 1078933 1121337 1161934 1198275 1228741 1252413
62153 1252413 1268910 1278484 1282055 1280908 1276127 1268035 1256119 1239729 1218973 1194790 1168183 1139737
62141 1139737 1110167 1080851 1053338 1028460 1006373 987320 971735 959581 950128 942581 936471 931267
62129 931267 926210 920916 915727 910957 906123 900454 893982 887534 881746 876702 872672 870611 871514 875568
62115 875568 882144 890333 899148 907352 913483 916282 915212 910793 904454 897777 891624 886015 880785 876027
62101 876027 871696 867179 861713 855157 848106 841319 835318 830435 826883 824749 824095 825026 827396 830601 834024
62086 834024 837643 841863 846822 852275 858131 864553 871466 878537 885909 894432 904807 916874 930030
62073 930030 943898 958229 972620 986861 1001222 1015842 1030097 1043217 1055445 1067981 1081902
62062 1081902 1097637 1115350 1135094 1156435 1178461 1200282 1220993 1239130 1252877 1261267 1264789 1264615
62050 1264615 1261571 1255972 1247788 1236491 1221137 1201043 1176258 1147184 1114218 1078128 1040321 1002120
62038 1002120 963969 925875 888438 852909 820232 790531 763517 738893 716296 695355 676069
62027 676069 658841 643900 630894 619215 608559 598963 590432 582739 575546 568528 561367 553804 545851
62014 545851 537882 530374 523511 517203 511541 507021 504064 502433 501402 500490 499738 499311 499262 499790 501315 504013
61998 504013 507573 511597 515959 520491 524656 527892 530160 531827 533156 534101 534367 533377 530489 525720 520001
61983 520001 514241 508258 501196 492880 484146 475792 467914 460514 454148 449406 446057 443181 440111 436888
61969 436888 433830 430936 427916 424722 421906 420231 419845 419988 419746 418928 417982 417205 416493 415857 415613 415893 416411
61952 416411 417066 418369 420861 424281 427746 430729 433547 436933 441457 447432 455118 464745 476266 489088
61938 489088 502170 514621 526306 537701 549125 560335 571050 581465 591843 601786 610458 617614
61926 617614 623904 629869 635005 638226 639041 637861 635178 630948 625046 618015 610948 604694 599479 595327
61912 595327 592484 591230 591576 593489 597281 603390 611713 621442 631718 642228 652982 663691 673532
61899 673532 681453 686579 688537 687645 684721 680493 675191 668854 661930 655229 649253 643838 638623 633565
61885 633565 628805 624233 619521 614535 609363 603893 597645 590225 581803 572959 564083 555117 545939 536843
61871 536843 528512 521472 515737 511135 507878 506451 506767 507702 507910 507156 506639 507967 511958 518293 525940
61856 525940 533842 541666 550137 560414 572909 586997 602037 618247 636181 655670 675827 695922
61844 695922 715746 735168 753808 771095 786241 798221 806328 810799 812361 811176 806907 799954 791892
61831 791892 784181 776972 769756 762867 757733 755691 756929 760619 765846 772418 780806 791073 801893 810974
61817 810974 816603 818395 816517 810873 801558 789498 775969 761724 747124 732782 719383 707005
61805 707005 695230 683870 673043 662658 652354 641938 631366 620490 609430 599112 590673 584203
61793 584203 578721 573488 568649 564460 560684 557127 554087 551771 549799 547758 545799 544205 542859 541657
61779 541657 541077 541623 542867 543670 543390 542398 541403 540657 539925 538893 537552 536433 536423 538061 540906 543850 546170
61762 546170 548151 550648 554245 558843 563937 569143 574542 580491 587061 593693 599535 604076 607261 609038
61748 609038 609075 607067 603258 598407 593174 587597 581286 574164 566848 560141 554198 548462 542564 537101 533199
61733 533199 531275 530482 529603 528390 527727 528418 530065 531454 531931 532060 532890 534903 537823 541067 544022 546104
61717 546104 547060 547299 547681 548839 550717 552683 553976 554221 553734 553224 552975 552456 550930 548296 545030 541493
61701 541493 537709 533693 529564 525395 521376 518010 515652 513878 511859 509351 506703 503860 500214 495711
61687 495711 491311 487747 484484 480594 476248 472537 470010 468110 466071 463715 461301 459104 457350 456143
61673 456143 455245 454184 452752 451223 450008 449280 449004 449137 449557 449920 449772 448937 447806 447131 447424 448569 450127
61656 450127 451962 454416 457870 462353 467458 472359 476015 477885 478603 479441 480898 482265 482875 483186 484114
61641 484114 485748 487447 488959 490583 492296 493541 494147 494765 495981 497444 498350 498470 498205 497773 496828 494964
61625 494964 492229 488971 485368 481333 476786 471874 466946 462420 458648 455679 453140 450579 448052 446041
61611 446041 444595 442884 440062 436323 432511 428806 424549 419497 414432 410162 406623 403522 401218 400155
61597 400155 399810 399007 397208 394832 392433 390206 388229 386513 384702 382322 379403 376368 373275 369868 366461
61582 366461 364059 363219 363337 363469 363341 363120 362647 361557 360001 358694 358206 358546 359371 360314 361122 361751 362362
61565 362362 363062 363694 364114 364571 365591 367409 369674 371716 373046 373620 373811 374099 374711 375517 376283 376891 377300
61548 377300 377443 377432 377724 378787 380557 382426 383854 384805 385514 386107 386693 387637 389345 391741 394245 396420
61532 396420 398353 400245 401920 403045 403667 404067 404101 403153 400887 397747 394574 392000 390316 389509 389124 388457
61516 388457 387298 386287 386130 386601 386776 386197 385344 384891 384963 385276 385635 385963 386043 385608 384739 383970 383836 384326 384913
61497 384913 385216 385558 386637 388666 391089 393239 394974 396435 397554 398226 398773 399808 401588 403799 405913
61482 405913 407515 408453 409077 410242 412688 416336 420552 424917 429284 433128 435580 436354 436116 435645 435064 434190
61466 434190 433126 432056 430792 429088 427172 425447 423807 421812 419524 417661 416723 416445 416284 416158 416397
61451 416397 417159 418202 419092 419448 419014 417831 416415 415538 415636 416492 417581 418651 419806 421158 422635 424101
61435 424101 425373 426086 425921 425114 424452 424444 424736 424674 424259 424163 424893 426318 428018 429713 431308 432886 434715 436933
61417 436933 439184 440929 442181 443541 445316 447023 448102 448785 449819 451434 452988 453685 453377 452544 451667
61402 451667 450754 449504 447820 446060 444682 443796 443189 442702 442310 441889 441300 440833 441203 442800 445104 447143
61386 447143 448453 449367 450403 451664 452905 454001 455105 456361 457661 458902 460473 463135 467214 472084
61372 472084 476740 480797 484618 488533 492274 495226 496981 497612 497744 498321 499881 501956 503507 504130 504421
61357 504421 505063 506031 507045 508318 510329 513086 516173 519470 523271 527581 531712 534842 536836 538286 539757
61342 539757 541130 541792 541521 541009 541272 542561 544134 545168 545599 545908 546403 546942 547180 546821 545787 544348 542909
61325 542909 541527 539919 538150 537001 537233 538714 540682 542717 545038 547971 551658 556239 561846 568311
61311 568311 575330 583041 592079 602925 615604 630134 646814 665688 685977 706380 725824 743600
61299 743600 758985 771216 780008 785840 789513 791390 791111 788063 782114 773846 764086 753339 741792
61286 741792 729733 717656 705952 694726 684001 673787 663868 653870 643934 635135 628789 625268 623757
61273 623757 623196 623128 623513 624100 624374 624082 623509 623187 623428 624184 625217 626366 627801 630074 633883 639654 647188
61256 647188 655572 663426 669501 673350 675425 676389 676408 675315 673371 671383 669926 668737 667181 665097 662916
61241 662916 661077 659618 658317 657023 655780 654749 653996 653366 652760 652484 652985 654123 655232 656296 658595
61226 658595 663482 670770 679025 687354 696059 705478 715123 724456 733790 743758 754323 764971 775556
61213 775556 786294 797034 807134 816121 823987 830777 836316 840535 843807 846811 850161 854156 858716
61200 858716 863571 868760 874989 883306 894393 908212 924299 942142 961253 980997 1000440 1018317
61188 1018317 1033259 1044283 1051215 1054667 1055632 1055084 1053720 1051771 1048915 1044464 1037750 1028481 1016953 1003965
61174 1003965 990346 976374 961656 945717 928661 911169 893952 877298 861043 844796 828268
61163 828268 811545 795080 779373 764652 750886 737936 725669 714086 703515 694497 687333 681848
61151 681848 677856 675708 676016 678768 682937 687040 689917 690959 689904 686761 681935 676172 670222 664534
61137 664534 659367 655085 652171 650887 651060 652385 654867 658764 664162 670863 678777 688143 699213 711902
61123 711902 726051 741943 760203 781104 804172 828691 854438 881620 910177 939589 969594
61112 969594 1000598 1032833 1065356 1096615 1125969 1153817 1180085 1203652 1223899 1241876 1258796
61101 1258796 1274015 1285710 1293200 1297163 1297587 1293127 1283057 1268545 1251240 1231609 1209532 1185603
61089 1185603 1160783 1135393 1109546 1084155 1060496 1038932 1019029 1000824 985044 971997 961053
61078 961053 951434 942924 935680 929891 925815 923791 924024 926624 931761 939417 949013 959695 971056 983308
61064 983308 996810 1011724 1028018 1045417 1063408 1081704 1100733 1121370 1144153 1168883 1194831
61053 1194831 1221065 1246872 1272265 1297971 1324562 1351770 1378937 1405843 1432586 1458918 1484329
61042 1484329 1508617 1531825 1553712 1573856 1592273 1609382 1625375 1640191 1654108 1667776 1681510
61031 1681510 1694965 1707632 1719369 1730527 1741967 1754853 1769892 1786645 1803905 1820729 1836894
61020 1836894 1852712 1869008 1887230 1909093 1936187 1970184 2012919 2065400 2126947 2196121 2272622
61009 2272622 2357932 2454789 2567218 2701117 2863995 3064271 3311611 3617639 3995596 4460734
60999 4460734 5034150 5748046 6647758 7789343 9231079 11008551 13085677 15304626 17388323
60990 17388323 19028977 20023858 20367017 20236471 19902292 19629141 19613955 19943108 20551411
60981 20551411 21212345 21605615 21452489 20638389 19242044 17466170 15535451 13628019 11856348
60972 11856348 10276111 8902186 7725155 6725618 5882213 5173461 4578364 4078448 3659001
60963 3659001 3307804 3013340 2764707 2552621 2369870 2210927 2071416 1947872 1837916
60954 1837916 1740438 1655097 1581259 1517596 1462806 1416068 1376321 1341538 1309309 1277911 1246431
60943 1246431 1214329 1181486 1148281 1115043 1081736 1048679 1016965 987402 959482 932301 906083
60932 906083 881770 859368 837918 817156 798102 781680 767626 755144 743905 733975 725280 717569
60920 717569 710591 704092 697883 691989 686451 681097 675912 671458 668371 666560 665479 665041 665550 666783 667978
60905 667978 668850 669834 671180 672535 673665 674729 675551 675366 673754 671134 667794 663088 656241 647547 638120
60890 638120 628744 619496 610284 601210 592435 584038 576013 568188 560335 552520 545163 538550 532490 526604
60876 526604 520782 515226 510255 506142 502854 499871 496628 493286 490745 489762 490410 492446 495688 499765 503994
60861 503994 507937 511743 515678 519684 523745 528214 533295 538464 542899 546322 549030 551312 553309 555280
60847 555280 557534 560081 562681 565144 567324 568904 569576 569307 568089 565492 560949 554590 547442 540546 534042
60832 534042 527348 520192 513243 507542 503405 500156 497008 493814 490659 487168 482978 478724 475608 473750
60818 473750 471773 468480 464195 459820 455356 450319 445154 441071 438435 436240 433420 429944 426372 422984
60804 422984 419802 417040 415073 414100 413992 414281 414237 413333 411865 410870 411178 412644 414413 415726 416367 416584 416807
60787 416807 417385 418396 419728 421310 423177 425313 427600 429907 432042 433670 434543 434853 435046 435253 435204 434832
60771 434832 434575 434845 435456 435918 436070 436067 435827 434999 433589 432304 431949 432626 433739 434687 435292 435537 435262 434382
60753 434382 433216 432194 431247 429907 428139 426712 426443 427328 428736 430194 431561 432559 432672 431618 429544
60738 429544 426663 422984 418469 413195 407357 401417 396202 392365 389696 387450 385459 384375 384574 385504 386558
60723 386558 387927 389858 391627 392235 391963 392214 393665 395432 396434 396792 397434 398868 400945 403394 405963
60708 405963 408259 410074 411819 414136 417035 419869 422162 424060 425793 427094 427465 426860 425840 425057 424706
60693 424706 424483 423969 423058 422090 421572 421686 421956 421479 419690 417042 414785 413889 414266 415230 416534 418567 421568
60676 421568 425203 429057 433084 437302 441413 445098 448309 450929 452491 452740 452135 451211 449724 447139 443838
60661 443838 440981 439051 437268 434717 431465 428258 425719 424220 423986 424867 426369 428380 431418 435753 440645
60646 440645 444975 448344 450997 453021 454228 454640 454364 453081 450378 446653 442983 439946 437171 434224 431302
60631 431302 428707 426263 423802 421832 421126 421779 423163 424650 425973 426973 427555 427994 428801 430078 431356
60616 431356 432229 432800 433273 433461 433156 432641 432298 431842 430665 429097 428521 429721 431649 432494 431648 429939 428201
60599 428201 426605 425406 425287 426396 427829 428817 429951 432440 436363 440420 443469 445691 448037 450976 453985
60584 453985 456044 456521 455749 454829 454676 455258 455840 455910 455632 455493 455827 456747 458340 460847 464678 470194 477386
60567 477386 485961 495841 507293 520359 534476 549002 563782 578569 592066 602265 607985 609634
60555 609634 608298 604527 598334 590081 580961 572555 565930 561078 557264 554015 551758 551386 553358 557437
60541 557437 563066 569672 576783 584425 593483 605225 620286 638315 658537 680206 702424 723949
60529 723949 743389 759400 770786 776930 778236 775763 770316 762246 752163 741255 730639 720764 711623
60516 711623 703062 694704 686173 677834 670910 666421 664200 663217 662583 661998 661674 662239 664444 668643 674833
60501 674833 683513 696011 713535 736274 763910 796564 834541 877459 924423 974849 1028264 1083280
60489 1083280 1137670 1189773 1239068 1284924 1325463 1358333 1382253 1397097 1402570 1397503 1380643 1351748
60477 1351748 1311753 1262304 1205583 1144397 1081819 1020391 961754 907024 857157 812641 773160
60466 773160 738009 706834 679611 656078 635700 618215 603627 591519 580887 570963 561761 553494
60454 553494 545946 538819 532265 526520 521352 516401 511810 507940 504601 501182 497487 493875 490587 487530
60440 487530 484836 483099 482755 483508 484487 484792 483931 482048 479768 477544 475241 472694 470467 469391 469305 468977
60424 468977 467585 465768 464843 465439 467324 470086 473325 476390 478635 480069 481298 482635 483657 483881 483655
60409 483655 483997 485549 487950 490347 492383 494408 496758 499127 500864 501695 501899 501914 502147 503142 505420 508887
60393 508887 512720 516123 519090 522207 525851 529844 533773 537404 540747 543948 547182 550479 553631 556379
60379 556379 558772 561283 564510 568727 573703 578887 583763 588048 591635 594489 596723 598610 600265 601316
60365 601316 601276 600417 599978 601092 603562 606021 607388 607910 608785 611017 614780 619690 625483 632452 641253 652233
60349 652233 664946 678412 691756 704314 715191 723261 727871 729170 727468 722679 714890 705116 694762
60336 694762 684429 673921 663449 653961 646034 639128 632401 625724 619386 613363 607439 601667 596095
60323 596095 590387 584397 578857 574753 572152 570284 568762 568024 568651 570932 575115 581336 589129 597726 607118
60308 607118 618194 631546 646677 662624 678795 694871 710422 725022 738349 749846 758703 764416
60296 764416 766882 765734 760197 750014 736054 719704 702212 684912 669286 656087 644920 635221
60284 635221 627142 620853 615665 610744 606237 602731 599868 596468 591959 586811 581661 576811 572494 568763
60270 568763 565047 560645 555753 551268 547519 543955 540197 536578 533481 530985 529382 529152 529993 530668 530447
60255 530447 530063 530698 532494 534656 536631 538561 540775 543383 546285 549206 551750 553634 554744 554967 554251
60240 554251 552910 551456 549965 548099 545957 544343 543775 543784 543755 544023 545418 547938 550627 552775 554631 556818
60224 556818 559612 562991 566953 571480 576426 581709 587497 594069 601633 610419 620695 632339 644409
60211 644409 655620 665578 675384 686555 699312 712288 724028 734300 743702 752546 760743 768429 775906
60198 775906 783025 789321 794782 799779 804144 807108 808433 808792 808561 806998 803300 797907 791920 785547 778123
60183 778123 769588 761047 753543 746874 740084 732743 725357 718626 712679 707099 701543 696173 691491 687867
60169 687867 685332 683659 682394 680834 678375 675036 671389 667856 664349 660773 657505 655061 653504 652516
60155 652516 651870 651597 651931 653356 656388 660777 665061 667483 667520 666256 665187 664989 665491 666416 667795 669751
60139 669751 672165 674784 677665 681403 686656 693412 700946 708568 716154 723788 731214 737992 743993 749324
60125 749324 753918 757603 760599 763546 766966 770929 775270 779843 784486 789056 793664 798714 804479 810666
60111 810666 816430 820826 823288 823810 822720 820319 816784 812382 807443 801967 795512 787841 779514 771480
60097 771480 764159 757377 751194 746200 742760 740379 738244 736177 734596 733645 732822 731566 729841 727908 725761
60082 725761 723117 719950 716749 714129 712258 710683 708602 705336 700743 695227 689195 682551 675027 667044
60068 667044 659690 653454 647434 640416 632541 625245 619618 615526 612351 609769 607490 604999 602156 599607
60054 599607 598017 597243 596732 596458 596921 598425 600869 604146 608309 613472 619835 627533 636077 644322 651543
60039 651543 658282 665482 673020 679735 684733 687913 689336 689071 687774 686443 685188 682993 679167 674283
60025 674283 669186 663731 657214 649522 641037 631683 620978 609019 596781 585270 574830 565352 556748
60012 556748 549108 542697 537846 534602 532436 530556 528509 526272 523908 521500 519342 517802 516889 516306 515996
59997 515996 516267 517302 518929 520998 523642 526949 530711 534763 539306 544557 550258 555819 560813 565115
59983 565115 568699 571570 573805 575414 576161 575680 573641 569837 564425 558311 552843 548645 545044 541148 537221
59968 537221 534228 532211 530083 527288 524833 524091 525173 527045 528865 530572 532447 534668 537189 539652
59954 539652 541566 542921 544364 546344 548378 549734 550622 552005 554323 556994 559216 560652 561275 561124 560361
59939 560361 559137 557329 554874 552335 550527 549502 548543 547351 546606 547111 549017 552275 557174 563815 571399
59924 571399 578617 584596 589207 592676 595244 596959 597554 596783 595020 593145 591708 590668 590142 590666 592272
59909 592272 593964 594805 595074 595716 597098 598995 601343 604112 606657 608123 608475 608363 608086 607492 606901 607219
59893 607219 608897 611525 614684 618483 622953 627647 632340 637523 643618 650033 655677 660316 664966 670889
59879 670889 678447 687005 695732 704334 712869 720998 727822 732697 735819 737600 737800 735947 732470 728618
59865 728618 725145 721787 718255 715031 712682 710909 708830 705945 702402 698584 694878 691688 689219 687265
59851 687265 685439 683633 682162 681566 682367 684809 688781 694143 700987 709076 716910 722156 723609 722370 720542
59836 720542 719084 717707 716671 717552 721625 727987 734021 737722 739156 739598 739722 739055 737003 733821 730239
59821 730239 726435 721875 716181 709763 703494 698032 693598 690095 687224 684659 682245 679891 677256 673855
59807 673855 669691 665433 661746 658681 655969 653594 651615 649643 647026 643583 639789 636208 633096 630521
59793 630521 628447 626585 624558 622418 620619 619215 617509 614870 611651 608745 606349 603802 600751 597879
59779 597879 596044 595119 594253 593096 592181 592076 592781 594175 596575 600354 605224 610323 615016 619317 623618
59764 623618 628245 633298 638661 644085 649375 654553 659793 665315 671379 678192 685684 693520 701528 709901
59750 709901 718675 727194 734454 739976 744064 747378 750608 754422 759133 764222 768567 771391 772886 773888
59736 773888 775206 777178 779491 781324 782037 781886 781753 782109 782590 782766 782988 784182 786977 791143 795668 799270
59720 799270 801153 801503 801121 800524 799738 798916 798562 798773 798721 797467 795096 792664 791184 790979 791830 793221 794477
59703 794477 795107 795160 795074 795255 796038 797854 800952 804894 808770 812086 815124 818298 821454 824033 825621 826018
59687 826018 824964 822299 818475 814526 811213 808352 805260 801784 798453 795507 792128 787084 780025 771815
59673 771815 763604 755851 748274 740442 732295 724293 717182 711434 706897 703151 700195 698384 697710 697665 698074
59658 698074 699608 703020 708152 714175 720573 727376 734495 741446 747846 753667 758768 762577 764599 764913
59644 764913 763784 760944 755743 748055 738620 728352 717666 706723 696055 686460 678338 671525 665808
59631 665808 661176 657440 654020 650444 646720 642867 638380 632679 625971 619174 612958 607289 601962 597111
59617 597111 592992 589639 586873 584398 581802 578817 575707 573103 571334 570248 569783 570258 571854 574192 576743
59602 576743 579258 581475 582826 583011 582679 582980 584368 586266 587840 588746 589094 589147 589280 589938 591294 592976
59586 592976 594286 594748 594423 593645 592497 590658 587873 584505 581380 579062 577510 576483 575969 575988 576242 576314
59570 576314 576175 576182 576542 576996 577142 576922 576595 576236 575453 573840 571707 570015 569365 569238 568618 567217 565733 564961
59552 564961 565095 565939 567315 569054 570963 573016 575314 577723 579926 582038 584847 589228 595661 604513 616503
59537 616503 632575 653403 678800 706837 733271 752736 761677 760470 752695 742579 733201 726122
59525 726122 721587 718927 717446 717115 718175 720172 721795 721684 719146 714241 707545 699773 691309 682167 672522
59510 672522 662998 654096 645696 637534 629829 622869 616337 609730 603265 597558 592508 587363 582013 577365
59496 577365 574211 572459 571798 572323 573926 575739 576890 577466 578127 579055 579959 580941 582674 585608 589554 594160
59480 594160 599351 605092 611070 616953 622800 628955 635557 642389 649172 655791 662119 667761 672158 675002
59466 675002 676518 677326 677987 678632 679006 679020 679294 680893 684321 688974 693974 699379 706054 714255 722921 730708
59450 730708 737375 743785 750738 758160 765269 771099 774819 775830 773751 768485 760481 750875 741075 732088
59436 732088 724440 718545 714574 711871 709214 706056 702996 700703 699045 697852 697854 699999 704276 710073 717441
59421 717441 727042 738941 752408 767020 783167 801304 821394 843325 867396 894298 924954 959769
59409 959769 996633 1029439 1050096 1053440 1040437 1016797 989206 962975 941778 928083 923618 929688
59397 929688 946343 970325 994306 1009559 1010397 996549 972028 942456 912947 886943 865740 848902
59385 848902 835366 824393 815721 809183 804431 801067 799003 798505 799602 801483 802822 802931 802334 801992 802240
59370 802240 802708 802988 802950 802612 802175 802177 803129 804924 807005 809312 812699 818104 825445 833674 841941 850490 860330
59353 860330 872108 885488 899680 914487 930649 949040 969543 990868 1011534 1030958 1049462
59342 1049462 1067326 1084116 1099023 1111528 1121396 1128204 1131386 1130800 1126801 1119597 1109031 1095373 1079886
59329 1079886 1063996 1048031 1031289 1013341 994793 976709 959722 943859 928832 914298 900038
59318 900038 886145 872939 860579 848802 837118 825200 813183 801589 790864 780862 770946 760751
59306 760751 750703 741641 734163 728566 725128 724004 725074 728432 734958 745789 760855 778032 793695
59293 793695 804121 806986 802372 792531 780239 767198 754116 741862 731618 723859 718024 713644 711245
59280 711245 711625 714663 719361 724960 731633 740122 750925 763911 778686 795219 813816 834184 854799
59267 854799 873689 889849 903504 915062 924368 930984 934681 935504 933756 930028 924794 917894 908857
59254 908857 897869 886015 874512 864156 855450 848561 843061 838393 834836 833324 834093 836284 839236
59241 839236 843340 849074 855957 863233 870981 879591 888429 895923 901018 903914 905318 905478 904077 900730
59227 900730 895423 888596 880721 871800 861485 849803 837418 825020 812822 800887 789507 778966
59215 778966 769246 760297 752261 745107 738380 731705 725241 719342 714133 709761 706683 705193 704923 705236 705904
59200 705904 707080 708922 711532 714931 718709 722084 724714 727082 729787 732970 736823 741985 748650 755785
59186 755785 762094 767522 773044 779201 785634 791867 797675 802766 806906 810397 813708 816586 818328 818973
59172 818973 819484 820556 821959 823348 825059 827663 831157 834912 838120 840116 840630 839931 838440 836016 831956
59157 831956 825808 817888 808806 798808 787810 775911 763637 751701 740562 730177 720288 710960 702577
59144 702577 695139 687925 680202 672030 664004 656440 649287 642597 636544 631061 625959 621362 617620 614904
59130 614904 613242 612696 613029 613580 614129 615578 618857 623361 627563 631263 636095 643449 652914 663291 674194
59115 674194 685831 697957 710049 722201 734884 747831 759851 769894 777871 784360 789798 794089
59103 794089 796817 797805 797507 796667 795546 793670 790499 786086 780926 775430 769866 764667 760450 757588 755846
59088 755846 754458 752626 750169 747654 745762 744535 743437 742011 740074 737267 733005 727224 720842 715065
59074 715065 710312 705988 701184 695479 689288 683638 679394 676501 674042 671205 668029 665086 662597 660100
59060 660100 656942 652973 648788 645313 642999 641397 639683 637587 635574 634134 633222 632514 631837 631186 630613
59045 630613 630369 630854 632100 633551 634632 635358 635986 636236 635380 633205 630473 628262 627087 626776 626962 627433
59029 627433 628190 629461 631678 635210 640070 646033 653086 661547 671615 682955 694869 706742 718070
59016 718070 728152 736055 741022 742867 742044 739462 736073 732349 728182 723545 719067 715512 712827 710412
59002 710412 708488 708423 711256 716424 722472 728543 734616 740654 746308 751314 755557 758800 760890 762218 763424
58987 763424 764609 765254 764972 763936 762609 761436 760828 761032 762026 763867 767087 772325 779590 788317 798156
58972 798156 809367 822435 837614 854719 872962 891103 908264 924665 941178 958255 975568
58961 975568 992478 1008235 1021839 1032356 1039451 1043170 1043299 1039528 1032209 1022230 1010098 995732 979253
58948 979253 961363 942828 924209 906153 889253 873436 858160 843445 830051 818468 808464
58937 808464 799843 792912 787763 783786 780353 777437 775142 773289 771912 771502 772218 773367 774239 774886 775475
58922 775475 775518 774551 773209 772690 773258 773998 773999 773119 771664 769992 768623 768147 768742 770026 771544 773308 775887
58905 775887 780139 786748 795846 807076 820064 834689 850811 867992 885606 903016 919554 934695
58893 934695 948492 961575 974630 988193 1002984 1019784 1038588 1058364 1078075 1097518 1116717
58882 1116717 1134979 1151143 1164481 1174780 1181787 1185250 1185407 1182869 1178105 1171449 1163451 1154631 1145028
58869 1145028 1134623 1124154 1114892 1107512 1101717 1097011 1093150 1089587 1085134 1078717 1070202 1060099 1048678
58856 1048678 1035856 1021840 1007337 992967 978774 964534 950335 936495 922938 909124 894813
58845 894813 880614 867391 855288 843755 832460 821655 811489 801474 790959 779886 768792
58834 768792 758247 748518 739629 731530 724277 718164 713592 710739 709486 709639 710961 712999 715309 717990
58820 717990 721670 726761 733000 739849 746976 754124 760823 766568 771206 774988 778408 781977 785801 789335
58806 789335 791895 793470 794538 795038 794108 791147 786598 781272 775439 768963 761839 754034 745206 735223 724781
58791 724781 714934 706133 698169 690967 685042 681137 679659 680311 682178 684395 686930 690386 694966 700127
58777 700127 705533 711634 718694 725720 731046 733668 733427 730266 724210 715972 706797 697502 688159 678752
58763 678752 669601 661107 653511 647035 641897 638057 635158 632779 630639 628760 627641 627922 629445 630947
58749 630947 631225 630503 630111 630919 632648 634701 637094 640405 645244 651972 660575 670529 680886 690605 698933
58734 698933 705776 711948 718744 726836 735607 743820 750869 757172 763553 770570 778233 785970 793008 799206
58720 799206 805450 812908 822019 832495 844088 856861 870711 885064 899063 911787 922366 930189
58708 930189 934966 936467 934386 928735 920044 908779 894765 877589 857377 834770 810390 784889
58696 784889 759372 735147 712964 692911 675029 659554 646502 635428 625725 616906 608593 600530
58684 600530 592677 585137 578051 571653 566209 561621 557314 552794 548228 544245 541397 539968 539937 540770 541686
58669 541686 542588 544417 548120 553653 560525 568890 579224 591087 602973 613409 621604 627051 629328
58656 629328 628525 625363 620617 614749 608118 601093 593862 586488 579225 572500 566543 561314 556754 552827
58642 552827 549412 546451 544166 542847 542530 543068 544314 545944 547402 548417 549364 550757 552587 554444 555953
58627 555953 556740 556375 554893 553030 551479 550230 549100 548370 548293 548496 548714 549747 552790 558006 564567 571816
58611 571816 579517 587157 593987 599843 605120 609920 613970 617367 620657 624115 627546 630676 633105 634095
58597 634095 633225 631169 629046 627133 625024 622873 621530 621552 623031 626335 632003 639834 649107 659729 672183
58582 672183 686234 700725 714828 728457 741347 752837 762893 772262 781214 789134 795823 802290
58570 802290 809776 818939 830418 845303 864394 887690 915081 946802 982714 1021801 1062830 1104810
58558 1104810 1146280 1184808 1217717 1242976 1259337 1266522 1265709 1259132 1248755 1235889 1222178 1209837
58546 1209837 1200270 1193144 1187243 1181492 1174707 1165284 1151864 1133854 1111003 1083333 1051992 1019250
58534 1019250 986952 955593 925402 897439 872873 851948 834355 819838 807620 796070 784040
58523 784040 772180 762077 754444 748818 744453 740623 736523 731817 727105 723104 719624 716049 712497 709671
58509 709671 707797 706432 705160 703783 701999 699741 697785 697238 698206 699517 699960 699392 698454 697546 696496 695163
58493 695163 694160 694638 697238 701493 706551 712230 718941 726828 735671 745561 756964 770028 784573 800885
58479 800885 819780 841601 865680 890895 916046 939575 959734 975267 985303 988656 984449 973776
58467 973776 959643 944659 929644 914820 901159 889739 880813 874451 871354 872152 876589 884314 895839
58454 895839 911808 931678 953798 976270 997043 1013821 1024868 1029648 1028223 1020551 1007083 989422
58442 989422 969591 948939 928319 908753 891189 876015 863459 854012 847823 844212 842455 842532 844512
58429 844512 847814 851857 856955 863813 872621 883286 895918 910091 924011 935317 942589 945593 944517
58416 944517 939743 931941 921708 909437 896026 883081 871567 860747 849319 837285 825901 816129
58404 816129 807995 801261 795922 792053 789657 788570 788250 787991 787733 788179 789785 792131 794695 797565 800898
58389 800898 804341 807604 810986 814776 818669 822382 826216 830419 834621 838483 842424 847103 852720 859239
58375 859239 866683 874800 883093 891559 900660 910299 919734 928783 938046 947723 957539 968245 981556 997849
58361 997849 1015440 1032968 1050874 1069462 1087241 1102513 1115145 1125342 1132240 1135361 1136048 1135699 1133853
58348 1133853 1129889 1125335 1122442 1121482 1121519 1122880 1126637 1132314 1138411 1144859 1152963 1163206 1175029 1188480
58334 1188480 1204171 1221795 1240468 1260326 1282021 1304797 1326682 1346425 1363648 1377417 1386492
58323 1386492 1391029 1392505 1391943 1389558 1385960 1382282 1379100 1376334 1373911 1371489 1368193 1363844 1359807 1357407
58309 1357407 1356450 1356721 1359831 1367728 1380334 1396570 1416801 1442128 1471976 1504562 1539180 1575863
58297 1575863 1613393 1649916 1685149 1719822 1753370 1784418 1813086 1840564 1866775 1890872 1913823
58286 1913823 1938122 1964888 1993284 2022545 2052516 2082543 2112112 2142408 2175108 2209850 2245027
58275 2245027 2280621 2318063 2357782 2399264 2443042 2490124 2539821 2590617 2642824 2697959 2756013
58264 2756013 2815870 2877856 2943216 3011671 3082172 3155277 3231767 3309703 3386160 3461277 3537308
58253 3537308 3614374 3690858 3767524 3847368 3931496 4018833 4109737 4206129 4308237 4415080 4528072
58242 4528072 4650175 4781554 4920024 5065575 5220256 5383916 5554730 5734048 5925964
58233 5925964 6131834 6349823 6580023 6825140 7085904 7360957 7651718 7962263 8293996
58224 8293996 8645751 9019625 9421270 9854071 10318696 10818715 11360551 11947480 12580122
58215 12580122 13263527 14007502 14819902 15707021 16681142 17760125 18959174 20291510 21778305
58206 21778305 23450059 25338553 27477909 29915579 32713801 35941984 39682396 44049578
58198 44049578 49199700 55328869 62684358 71588566 82454104 95800836 112306230 132870966
58190 132870966 158635528 190879789 230673209 278066053 330878546 383842473 429238426
58183 429238426 459380998 469710399 460457511 435856526 401746130 363314477 324093234
58176 324093234 286097813 250410245 217658587 188229695 162292780 139784009 120454444
58169 120454444 103968187 89974567 78129222 68104544 59611560 52409219 46291264
58162 46291264 41077041 36617665 32795952 29511817 26674383 24208976 22059256 20176501
58154 20176501 18514416 17036781 15720191 14544094 13485108 12524216 11651629 10860106
58146 10860106 10139646 9482087 8884436 8343568 7852551 7405281 6999788 6633852 6301713
58137 6301713 5997349 5716599 5454189 5203636 4962589 4733989 4519842 4318078 4127223
58128 4127223 3949235 3785069 3631732 3486312 3349107 3220358 3097856 2980404 2870146
58119 2870146 2768726 2674203 2584189 2499138 2420213 2346615 2277239 2212444 2152139 2094504 2038357
58108 2038357 1984411 1932751 1881692 1830745 1781940 1736440 1692442 1648245 1604844 1563570 1523599
58097 1523599 1483867 1445373 1409608 1376475 1345366 1316426 1289261 1262438 1235727 1210924 1189010
58086 1189010 1168505 1148010 1128154 1109443 1090359 1069474 1047543 1025740 1003684 981044 959315
58075 959315 939997 922533 905970 891280 880143 872623 867865 866034 867804 872699 879391 886865 894030
58062 894030 899077 900423 897645 890709 879346 863952 845862 825808 803409 779106 755189 733745
58050 733745 714856 697934 683453 672083 663257 655882 649478 643576 637128 629656 621957 614630 607024
58037 607024 598671 590614 584146 579197 574963 571027 566861 561297 553628 544339 534011 522711 511210
58024 511210 501251 493381 485939 477493 469004 462175 456961 452220 447694 443747 440073 436296 433002 430652
58010 430652 428235 424593 420442 417527 416261 415612 414818 413862 412694 411361 410569 410892 411740 412201 412469 413259
57994 413259 414286 414549 413853 412960 412407 412114 411853 411290 409911 407722 405519 403684 401369 397795 393692 390358
57978 390358 387854 385325 382591 380187 378152 376083 374251 373553 374266 375643 376721 376930 376217 375197 374871
57963 374871 375569 376579 377270 377895 378693 379056 378498 377577 376806 375416 372452 368472 364804 361569 357786 353133
57947 353133 348336 344033 340486 338243 337863 339006 340845 343307 346918 351651 357054 363358 371283 380725
57933 380725 390702 400596 410375 419611 427433 433630 438701 442494 443755 441443 435784 427778 418382 408400
57919 408400 398460 388789 379412 370691 363138 356645 350472 344139 337916 332470 328499 326597 326887 328699
57905 328699 331031 333209 334807 335295 334414 332678 330802 328793 326278 323534 321475 320692 321164 322781 325380
57890 325380 328414 331330 334339 338169 343039 348484 354054 359544 364637 369065 373139 377443 381953 386012
57876 386012 389105 391036 391544 390538 388721 387189 386301 385558 384584 383515 382431 381191 379956 379118 378508 377369
57860 377369 375398 373280 371999 372060 373469 375854 378461 380584 382258 384141 386629 389501 392388 395050 397136
57845 397136 398319 398816 399230 399665 399506 398272 396301 394398 393143 392600 392344 391755 390715 390072 390972 393640
57829 393640 397202 400696 403779 406420 408374 409230 408807 407430 405933 405059 404532 403091 399991 396128 392977
57814 392977 390722 388319 385213 381893 378570 374405 368552 361179 352945 344132 334859 325691 317420 310477
57800 310477 304894 300498 296808 293112 289085 285171 282036 279859 278415 277584 277405 277775 278382 278912 279172 279131
57784 279131 279036 279392 280642 282877 286002 290146 295751 303078 311599 320017 327135 332733 337416 341667 345360
57769 345360 348168 349950 350571 349941 348565 347527 347378 347388 346420 344263 341578 338938 336587 334909 334320 334755
57753 334755 335787 337254 339241 341613 344130 346938 350320 354054 357602 360873 364143 367276 369732 371355
57739 371355 372492 373259 373378 372821 371949 370852 369177 366872 364553 362891 362054 361915 362322 362955 363404 363596 363813
57722 363813 364182 364544 364889 365418 366052 366372 366212 365884 365652 365394 364932 364293 363389 361848 359484 356801 354774
57705 354774 354053 354266 354143 352634 350093 347912 346737 345668 343747 341503 340082 339357 338119 335881 333224
57690 333224 330374 326876 322988 320093 319002 318805 318144 316911 316034 316203 317479 319733 322899 327122 332968
57675 332968 341107 351729 364980 382272 406315 439402 482479 536526 603884 686641 782878 884129
57663 884129 976100 1042656 1071806 1060765 1016427 950743 875060 797584 723757 656914 598515
57652 598515 548790 507505 473846 446098 422401 401935 384798 370874 359527 350331 343316 338267
57640 338267 334380 330951 327988 325895 324832 324611 324930 325433 325712 325526 325023 324549 324147 323383 321876 319929
57624 319929 318308 317208 315825 313328 309933 306529 303437 300334 297304 295002 293448 291542 288379 284463
57610 284463 281001 278542 277037 276752 278125 280683 282967 283853 283513 282845 282329 281732 280703 279256 277594 275651
57594 275651 273069 269730 266065 262625 259482 256405 253477 251030 248852 246047 241999 237182 232719 229432
57580 229432 227502 226657 226235 225288 223173 220154 217212 215109 213718 212230 210006 207207 204506 202246 200161
57565 200161 198053 196291 195226 194515 193655 192894 192843 193330 193548 193380 193616 194608 195647 196111 196399 197223 198741
57548 198741 200993 204454 209290 214499 218548 220679 221144 220580 219793 219779 221148 223487 225723 227036 227217 226436
57532 226436 225134 223892 223044 222531 222297 222397 222516 221958 220580 219198 218586 218579 218759 219441 221192 223775 226368
57515 226368 228606 230624 232323 233455 234351 235724 237662 239495 240765 241722 242742 243773 244501 244675 244253
57500 244253 243577 243311 243739 244183 243566 241532 238550 235067 231174 227141 223656 221274 219993 219482 219383 219319 218964
57483 218964 218249 217257 215944 214214 212278 210622 209590 209193 209239 209456 209589 209602 209637 209574 208899 207333 205263 203231
57465 203231 201352 199734 198962 199429 200438 200865 200604 200508 200890 201077 200694 200435 200980 201932 202516 202859 203708 205086
57447 205086 206031 205833 205014 204746 205595 207105 208527 209595 210501 211369 212114 212768 213644 215007 216779 218676 220454
57430 220454 221892 222776 223082 223015 222771 222388 221942 221638 221648 222118 223300 225213 227126 227949 227485 226737 226617 226962
57412 226962 227310 228027 229925 233108 236973 241036 245008 248240 249975 250218 249698 248934 247916 246673 245505
57397 245505 244511 243523 242738 242896 244533 247281 250117 252161 253266 253992 254981 256305 257675 259407 262595 267829
57381 267829 274130 279743 283697 286104 287392 288061 288911 290528 292501 293876 294397 294582 294667 294323 293563 293089
57365 293089 293458 294499 295741 296927 298016 299200 300950 303458 306069 307957 309275 310862 312832 314473
57351 314473 315640 317201 319672 322416 324738 326858 329194 331480 333390 335364 337982 340996 343754 346168
57337 346168 348522 350684 352370 353944 356148 359060 362033 364696 367332 370111 372544 374022 374618 375106 376307
57322 376307 378541 381563 385011 388852 393344 398485 403760 408647 413200 417891 422960 428192 433318 438330
57308 438330 443327 448228 452823 457112 461447 466284 471790 477781 484025 490405 496781 502981 509089 515505
57294 515505 522449 529615 536620 543574 550821 558301 565630 572791 580245 588349 597073 606352 616249 626627
57280 626627 637066 647291 657471 667969 678981 690411 701859 712803 723094 733234 743867
57269 743867 755090 766654 778690 791624 805358 819178 832736 846638 861743 878215 895494
57258 895494 912907 930118 947263 964824 983127 1001842 1020238 1038039 1055758 1074113 1093430
57247 1093430 1113760 1135229 1157975 1181855 1206409 1231148 1255961 1281335 1308007 1336222 1365517
57236 1365517 1395441 1426171 1458031 1490706 1523591 1556837 1591419 1628074 1666611 1706280 1746417
57225 1746417 1786785 1827747 1870123 1914364 1959918 2005842 2051972 2098858 2146585 2194362 2241431
57214 2241431 2287800 2333932 2380328 2427709 2477090 2529306 2584700 2643377 2705436 2770849 2839356
57203 2839356 2910502 2983527 3057390 3131267 3204853 3277760 3348959 3417413 3483071 3546585 3608379
57192 3608379 3668772 3728789 3789789 3852214 3915537 3979424 4043983 4108830 4173026 4236267 4299274
57181 4299274 4362685 4426415 4490432 4555365 4621926 4690321 4760422 4831805 4903422 4974025 5043191
57170 5043191 5111249 5178173 5243510 5307609 5371720 5436312 5500104 5561258 5618777 5672239 5720973
57159 5720973 5764127 5801027 5831145 5854367 5871568 5884223 5893162 5898487 5900866 5901900 5902823 5903882 5905488
57146 5905488 5908954 5915349 5924527 5935946 5949646 5965624 5982896 5999919 6015429 6028262 6036930 6040099
57134 6040099 6037336 6029119 6016532 6001133 5984664 5968542 5953932 5941965 5933172 5926809 5921528 5916527
57122 5916527 5911281 5904708 5896013 5886155 5877131 5870040 5865311 5864395 5869343 5880874 5898915 5925082 5962467
57109 5962467 6012822 6076242 6153974 6249409 6366312 6508954 6684658 6903733 7176610 7514202
57099 7514202 7931869 8450252 9091959 9881332 10848366 12028630 13457345 15166126 17184457
57090 17184457 19536938 22234904 25272886 28630843 32270144 36126314 40118135 44165418
57082 44165418 48171205 51958644 55235941 57668071 59022312 59262140 58516171 56976373
57074 56976373 54822716 52204049 49242515 46037821 42675834 39240593 35815797 32474649
57066 32474649 29272888 26251145 23438120 20850275 18493523 16367988 14469664 12788292
57058 12788292 11307894 10011079 8881124 7900398 7050116 6312713 5672601 5114821 4625540
57049 4625540 4194340 3813939 3477507 3178203 2911206 2673648 2462086 2272058 2100483
57040 2100483 1946318 1808256 1683637 1570314 1467917 1376561 1295597 1224191 1161831 1107877
57030 1107877 1061816 1024392 997324 981591 977160 984450 1004174 1034350 1067911 1094031 1102223 1086383
57018 1086383 1046981 990332 925055 858257 794331 735929 684410 639434 599505 563525 531291
57007 531291 502646 477074 454195 433832 415476 398493 382844 368935 356809 346201 337176 329829
56995 329829 323527 317376 311388 306336 302568 299846 298244 298304 300424 305084 313506 326853 344472 363726
56981 363726 381595 395632 403701 404268 397537 385454 370223 353406 336376 320440 306038 292653
56969 292653 279992 268597 259050 251339 245391 241577 240276 241414 244867 250989 260576 274483 293014
56956 293014 314883 336641 353728 362509 361324 350317 331281 307579 282910 259496 237846 218260
56944 218260 201711 189002 179957 174015 171098 171463 175163 182148 192618 207017 225967 250365 281038
56931 281038 317757 358368 398743 433461 457110 466081 459957 441351 414439 383520 352193 322789
56919 322789 296150 272193 250772 231937 215697 202007 190887 182107 174868 168214 161686 155278
56907 155278 149091 143494 139257 136799 135521 134495 133624 133522 134448 136092 138266 141099 144640 149011 154785
56892 154785 162578 172360 183967 198118 216096 238377 264131 291765 318966 342399 358617 365796
56880 365796 364217 355245 340761 323388 305916 290008 276143 264811 256791 252167 250219 250757 254640
56867 254640 262631 274748 291273 313521 343080 381037 428346 485682 551557 620577 684160 733248
56855 733248 761076 765075 747472 713949 671022 624308 578487 537300 502689 474587 452359 436197
56843 436197 426885 424958 430827 445245 469069 502993 548152 606644 680731 771247 876107 988722
56831 988722 1096835 1184213 1236229 1245949 1216036 1155806 1076795 989613 902374 820202 745814
56820 745814 680695 625780 581347 546871 521430 504358 495633 495794 505566 525599 556681 600073
56808 600073 657023 727073 806015 884986 951722 994039 1004229 981843 933043 867244 793663
56797 793663 719438 649172 585273 528894 480854 441679 410989 387498 369906 357593 350505 348896
56785 348896 353459 365324 385546 414559 451794 495032 539586 578545 604679 613050 602694 576545
56773 576545 539745 497418 453361 410200 369893 333525 301068 272154 247063 226394 209899
56762 209899 196370 184718 174566 165763 158020 151132 145006 139278 133462 127618 122415 118470 116025
56749 116025 115088 115252 115502 115003 114113 113885 114559 115400 115936 116350 116476 115571 113541 111420 110106 109431 108995 109037
56731 109037 109841 111018 112045 112947 113827 114324 114198 113950 114260 115186 116405 117766 119129 120146 120753 121488 122807
56714 122807 124435 125809 126740 127285 127430 127346 127484 128059 128917 130231 132606 135962 138982 140393 140350 139958 139838
56697 139838 139844 139801 139835 140041 140325 140502 140375 139990 139886 140588 141673 142058 141514 141175 142122 144213 146735 149403 152029
56678 152029 154017 155000 155412 155644 155244 153761 151872 150732 150558 150626 150337 149542 148178 146425 144985 144484 144786
56661 144786 145431 146334 147489 148505 149183 150074 151632 153310 154373 155175 156610 158623 160315 161321 161995 162342
56645 162342 161858 160579 159407 159175 159973 161328 162435 162431 161224 159925 159665 160155 160266 159759 159375 159307 158835 157664
56627 157664 156498 155848 155269 154281 153183 152366 151563 150411 149210 148413 147777 146646 144946 143394 142793 143403
56611 143403 144848 146348 147130 146927 146178 145626 145669 146041 146149 145771 145375 145568 146296 146895 146997 146897 146891 146824 146650
56592 146650 146876 147893 149294 150433 151360 152560 154060 155401 156345 156972 157207 156861 156080 155260 154671 154529 155187
56575 155187 156709 158504 159943 161134 162509 163981 165234 166543 168439 170713 172673 174449 177217 181969
56561 181969 188786 197447 208024 220573 234668 249333 262956 273394 279024 280075 278403 275772 272730
56548 272730 269205 265430 261870 258660 255563 252315 248868 245444 242405 239828 237194 233808 229583 225237
56534 225237 221697 219376 217886 216335 214164 211840 210344 209831 209353 208237 207054 206587 206520 206002 205015 204218
56518 204218 203771 203333 202993 203140 203466 203122 201921 200461 199023 197298 195311 193645 192520 191516 190456 189693
56502 189693 189269 188607 187426 186192 185322 184633 183971 183652 183857 184215 184440 184792 185449 185980 186022 186095 187145 189419
56484 189419 192160 194357 195572 196149 196784 197860 199247 200767 202507 204365 205643 205710 204884 204090 203824 204104
56468 204104 205137 207114 209317 210437 210041 208989 208045 206922 205120 203028 201580 201149 201296 201442 201493 201895
56452 201895 203115 204972 206596 207372 207737 208567 209935 211081 211514 211453 211134 210393 209176 207927 207171 207048 207351
56435 207351 207748 207955 207984 208106 208301 208117 207483 207188 207845 208767 208777 207850 206967 206542 205996 204915 203598 202458
56417 202458 201840 202457 204856 208237 210826 211730 211570 211117 210337 209105 207839 206963 206508 206604 207547 209080 210435
56400 210435 211348 212266 213328 214104 214550 215182 215955 216097 215538 215433 216623 218555 220391 222211 224333 226289
56384 226289 227398 227731 227753 227527 227018 226680 226990 227759 228468 228991 229627 230774 232818 235750 238638 240165 240102
56367 240102 239616 239760 240337 240656 240700 241019 242022 243802 246091 248102 249025 249018 249074 249792 251045 252897 255662 258759
56349 258759 260858 261765 262890 265081 267259 268222 268594 269661 271251 272217 272498 273246 275153 277847 280842 284076
56333 284076 287545 291172 295034 299035 302497 304699 305804 306847 308963 312812 318244 324098 328746 331409
56319 331409 332666 333438 333975 334115 333851 333211 332187 331240 331225 332367 333996 335705 337972 341110 344517 347658
56303 347658 350929 354786 358804 362519 366459 371418 377221 383070 388606 393880 398842 403708 409319 416310
56289 416310 424310 432601 441052 449713 458202 466382 475150 485631 497893 511086 524377 537213 549292
56276 549292 561021 573434 586987 601021 615020 629591 645514 662688 680914 700814 722964
56265 722964 746845 771827 798565 828327 861499 897809 937430 980794 1027950 1079402 1137135
56254 1137135 1203597 1279909 1366143 1462973 1571917 1694192 1830405 1981083 2146443 2325726
56244 2325726 2517619 2721060 2934728 3155999 3381061 3605552 3824219 4030555 4217976
56235 4217976 4381196 4515739 4616837 4680147 4703590 4687909 4635869 4551634 4440069 4305458
56225 4305458 4151113 3980823 3799746 3612801 3423037 3232698 3044950 2862995 2688259
56216 2688259 2521090 2362751 2214969 2077814 1949776 1829921 1718559 1615844 1521219 1434297
56206 1434297 1354963 1282506 1215805 1154408 1098435 1047551 1001090 958929 921132 887041 855906
56195 855906 827980 803706 782209 762083 743386 727278 713881 702088 691392 682291 674720 667666
56183 667666 660600 653932 647794 641719 635776 630797 627182 624502 622443 621046 619965 618630 617243 616498
56169 616498 616303 615910 615363 615634 617212 619676 622690 626403 630793 635701 641450 648384 655937 663308 670897
56154 670897 679881 690498 702087 714758 729634 747329 767431 789661 814444 842411 874452 912205
56142 912205 957316 1010259 1070988 1140456 1220076 1309588 1406448 1506909 1606433 1699524 1781193
56131 1781193 1849274 1904757 1950426 1990170 2028408 2067610 2105892 2138417 2161254 2172996 2173763 2165050
56119 2165050 2150454 2134107 2117429 2098357 2073392 2038934 1991361 1928501 1851726 1765210 1673155
56108 1673155 1579203 1487835 1403642 1328693 1262532 1204937 1156656 1117255 1084526 1056735 1033731
56097 1033731 1015459 1001111 990085 982117 976273 971537 968369 967761 968846 969594 969847 971385 974817 978829
56083 978829 982765 987438 992954 998239 1003331 1009691 1017471 1024767 1030354 1035003 1039466 1043360 1046728 1050554
56069 1050554 1055175 1060498 1068314 1081851 1102203 1127521 1156382 1189360 1226386 1265147 1303314 1340132
56057 1340132 1374902 1406237 1433841 1458843 1481498 1500796 1517009 1532156 1547255 1561731 1576279
56046 1576279 1593366 1613816 1635638 1657443 1680322 1705212 1731177 1757538 1785039 1813746 1842590
56035 1842590 1872095 1904630 1940713 1978086 2015666 2055263 2097977 2142234 2187079 2234080 2284006
56024 2284006 2334755 2384708 2435246 2487967 2542235 2597520 2655355 2716969 2781564 2848699 2919647
56013 2919647 2994780 3072528 3152496 3236662 3326040 3419294 3515947 3617398 3723423 3831673 3942289
56002 3942289 4058929 4183418 4313661 4448807 4591847 4744771 4905772 5073863 5251659
55993 5251659 5440960 5640320 5849879 6073719 6314321 6569459 6837677 7121911 7424653
55984 7424653 7744884 8083342 8445633 8836679 9257391 9710028 10200894 10734069 11308849
55975 11308849 11927373 12598682 13331742 14131881 15008311 15977461 17054389 18249357 19578294
55966 19578294 21068576 22750109 24651272 26810786 29285331 32141863 35456836 39333840
55958 39333840 43915571 49378736 55938724 63875932 73556202 85440080 100119188 118383359
55950 118383359 141256753 169938942 205560191 248546883 297504116 348146040 393413521
55943 393413521 425479649 438811197 432310996 409179007 374939943 335227752 294489608
55936 294489608 255670097 220392070 189292983 162393409 139401139 119885822 103367040
55929 103367040 89384826 77546476 67522614 59024017 51801412 45653648 40415185
55922 40415185 35938560 32096867 28790996 25939602 23466678 21306732 19412950 17749185
55914 17749185 16279144 14970857 13804220 12764755 11834609 10996459 10240260 9558554 8939879
55905 8939879 8373287 7854441 7380925 6946130 6543544 6172385 5833041 5521211 5232077
55896 5232077 4965862 4723487 4500614 4291626 4095978 3915283 3747503 3589299 3441121
55887 3441121 3304779 3178577 3059661 2948748 2848091 2756939 2672980 2595670 2524066 2453889
55877 2453889 2381042 2306193 2232287 2159771 2087812 2017741 1951182 1886667 1821922 1757935 1697383
55866 1697383 1640708 1586954 1536664 1490746 1448142 1407734 1370721 1338061 1307341 1275452 1242787
55855 1242787 1211727 1182608 1154307 1127170 1102107 1078007 1053162 1028107 1004204 980599 955475
55844 955475 929228 903578 878579 853195 827893 804065 781830 760847 742320 727772 716812
55833 716812 708424 703336 702692 705517 710039 716495 726091 738080 750305 761685 771648 778026 778267 772308
55819 772308 761934 747920 730096 709555 688359 667446 646941 628039 612321 599651 588875
55808 588875 580211 574790 572277 571184 571412 574441 580974 590191 601230 613784 627252 640582 652717
55795 652717 662080 666359 664297 657093 646725 633773 618310 601789 586143 571777 558336 546642
55783 546642 537834 531131 524343 516131 506135 493802 479222 464570 452610 444152 438834 437702 442764
55770 442764 454362 471015 491160 512491 529950 537529 533103 519706 501729 481736 461160 441566
55758 441566 423960 408223 394176 382111 371836 362407 353310 344924 337451 330400 323386 316564 310051
55745 310051 303748 297817 292579 288045 284280 281861 281122 281379 281825 282557 283594 283650 281442 277668 274104 271122
55729 271122 267763 263863 260224 256826 252717 247831 243155 238925 234330 229265 224776 221442 218861 217059
55715 217059 216846 218285 220308 222472 225826 231407 238932 247425 256010 263573 268752 270946 270700 268727 265213
55700 265213 260182 253783 246155 237856 230257 224511 220135 215728 211052 207197 204742 203143 202119 202260
55686 202260 203801 205987 208143 210381 212899 215576 218623 222696 227967 233854 239803 245427 249854 252079
55672 252079 252286 251780 251357 250687 249423 247847 246185 244451 243222 243365 244630 245598 245524 245237 245881 247738 250682
55655 250682 254642 259075 262965 265958 268698 271625 274254 275957 276564 275863 273503 269788 265565 260899 254833
55640 254833 246938 238085 229172 220112 210708 201506 193075 185328 178271 172537 168389 164979 161424 157960
55626 157960 155256 153194 151149 149044 147353 146305 145706 145248 144605 143466 141810 139858 137577 134753 131724
55611 131724 129425 128439 128522 129225 130215 130813 130075 127856 125115 122760 120814 119048 117642 116712 115885 114845
55595 114845 113766 112806 111880 111245 111490 112409 112729 111627 109832 108541 107924 107426 106965 106970 107586 108529 109524 110351
55577 110351 110740 110690 110611 110791 111091 111443 112189 113631 115688 118224 121113 123754 125322 125927 126740 128411 130062
55560 130062 130480 129628 128293 126898 125486 124338 123726 123327 122611 121630 120921 120865 121554 122867 124193 124639 124057
55543 124057 123476 123971 125548 127605 129871 132227 134218 135639 137188 139703 142950 145839 147523 147724 146464
55528 146464 144268 142216 140887 139513 137012 133562 130265 127537 124882 122108 119647 117523 115128 112343
55514 112343 109929 108325 106829 104595 101921 99903 99062 98845 98422 97579 96725 96182 95658 94607 93068 91853
55498 91853 91641 92101 92253 91546 90238 88888 87855 87260 87002 86730 86080 85090 84216 83979 84645 86105 87814
55481 87814 88979 89094 88336 87335 86647 86479 86692 86951 87065 87361 88395 90165 91907 92890 93043 92591 91541
55464 91541 89936 88200 86716 85408 84244 83725 84234 85124 85270 84453 83505 83116 83210 83592 84396 85568 86511
55447 86511 86730 86449 86203 86095 85847 85407 85085 85098 85291 85398 85424 85656 86290 87106 87600 87529 87277 87535 88606 90101
55427 90101 91351 91990 92087 91779 90993 89608 87831 86199 85153 84729 84725 85005 85485 86052 86671 87407 88067 88110 87244
55408 87244 85930 84812 83857 82631 81305 80625 80801 81185 81314 81564 82347 83342 84053 84620 85466 86456 87018 86900
55390 86900 86270 85251 83832 82187 80631 79327 78306 77633 77268 76931 76382 75714 75128 74653 74383 74678 75741
55373 75741 77171 78354 79151 79811 80400 80729 80801 80880 81064 81074 80593 79725 79086 79386 80718 82316 83324 83822
55355 83822 84636 86058 87386 87986 88159 88464 88766 88587 87977 87314 86594 85647 84790 84520 84642 84444 83714 82883
55337 82883 82165 81279 80180 79422 79441 79896 80006 79306 77984 76731 76331 77039 78281 79145 79182 78599 77895 77628
55319 77628 78342 80116 82189 83496 83700 83373 83171 83212 83300 83325 83328 83443 83843 84487 85001 85134 85218 85720 86370 86291
55299 86291 85144 83693 83008 83440 84511 85466 85779 85423 84894 84788 85212 85737 85873 85410 84378 83077 82112
55282 82112 81957 82390 82719 82628 82402 82272 82121 82033 82525 83755 84891 84882 83716 82458 82046 82465 83106 83550 83810
55263 83810 84042 84286 84455 84465 84335 84216 84325 84770 85380 85804 85902 85973 86466 87475 88778 90274 92018 93729
55245 93729 94726 94683 94121 93710 93365 92490 90921 89138 87640 86627 86237 86549 87217 87614 87510 87251 87165 87185 87197
55226 87197 87285 87415 87228 86447 85215 83810 82363 81112 80608 81254 82718 84171 85041 85361 85474 85682 86106
55209 86106 86662 87124 87337 87349 87260 87041 86633 86133 85731 85580 85866 86854 88582 90570 92117 92968 93426 93738 93650
55190 93650 92809 91388 90021 89168 88819 88800 89038 89386 89518 89282 89001 89119 89642 90204 90608 90961 91306 91429 91187
55171 91187 90778 90519 90567 90908 91440 91963 92263 92296 92179 92029 91996 92393 93445 94811 95716 95693 94975 94086 93405 93176
55151 93176 93475 93968 94102 93805 93577 93621 93321 92048 90102 88374 87355 86938 86952 87311 87788 88182 88671 89546
55133 89546 90614 91290 91303 90963 90773 91114 92187 93874 95597 96657 96770 96112 94981 93758 93002 93140 94020
55116 94020 95098 96031 96788 97287 97340 97013 96727 96944 97844 99197 100330 100559 99989 99692 100627 102564 104469 105702
55098 105702 106300 106321 105690 104711 104043 103977 104217 104512 104930 105372 105381 104746 103883 103360 103349 103781 104673 105983 107398 108544
55078 108544 109356 110147 111317 112887 114191 114304 113078 111575 111084 111841 113136 114375 115383 115903 115699 115253
55062 115253 115434 116158 116193 114751 112577 110900 109881 108838 107597 106835 107110 108161 109253 109861 109926 109697 109418
55045 109418 109093 108559 107756 106824 105917 105099 104410 103846 103258 102550 101962 101844 102124 102353 102353 102468 103029 103919 104816
55026 104816 105566 106141 106508 106650 106519 105985 105181 104755 105230 106075 106128 105166 104325 104545 105302 105490 105027 104809 105358
55007 105358 106301 107141 107864 108664 109551 110374 110886 110682 109440 107448 105696 105183 106107 107744 109193 110204 111252
54990 111252 112720 114203 114879 114483 113549 112673 111966 111334 110859 110599 110405 110232 110380 111086 112103 113047 113961 115182
54972 115182 116757 118322 119467 119928 119549 118461 117322 117002 117763 118978 119852 120313 120904 121821 122430 122024 120848
54955 120848 119913 119784 120070 120309 120710 121555 122328 122205 121243 120363 120167 120410 120672 120878 121034 121040 120949 120900 120705 120055
54935 120055 119270 119161 119876 120532 120327 119513 118942 119200 120477 122757 125689 128753 132011 136324 142476 150443
54919 150443 159726 169854 180203 189910 198426 205619 210915 213043 211301 206535 200155 192719 184310 175789
54905 175789 168497 162690 157265 151265 145022 139610 135695 133167 131536 130400 129659 129316 129067 128387 127226
54890 127226 126312 126399 127384 128478 129052 129121 129325 130683 133924 138653 143588 148030 152670 158528 165711 173824
54874 173824 182872 192662 201756 208230 211504 212432 211550 208361 202651 195511 188425 181893 175460 168685 161644
54859 161644 154809 148785 144079 140879 139056 138291 138068 137700 136710 135109 133064 130533 127600 124828 122686
54844 122686 120870 118806 116695 115278 114694 114386 114177 114552 115627 116644 116933 116739 116666 116761 116603 115976 115129
54827 115129 114600 114888 115952 116967 117022 116192 115447 115409 115753 116024 116345 116928 117437 117439 117147 117253 118164 119723 121460
54808 121460 122838 123465 123358 122866 122229 121426 120499 119685 119089 118599 118236 118171 118279 118174 117915 118124 119093 120278
54790 120278 121087 121652 122346 123032 123356 123475 123798 124239 124370 124221 124333 125030 126126 127353 128584 129565 129971 130013
54772 130013 130629 132755 136511 141259 146389 151918 158307 165799 174036 182419 190711 198998 206993 213758
54758 213758 218339 220439 220194 217602 212576 205514 197373 189117 181318 174271 168142 162881 158231 154067
54744 154067 150627 148247 146891 146098 145405 144778 144480 144555 144608 144216 143459 142851 142780 143233 144061 145289 147034 149266
54726 149266 151796 154490 157498 161316 166506 173177 180778 188555 196035 202827 208144 211097 211569 210305
54712 210305 207883 204048 198379 191322 184087 177636 172104 167130 162403 157874 153676 149965 146805 144211
54698 144211 142261 141020 140291 139600 138582 137235 135737 134166 132519 130846 129214 127656 126268 125202 124416
54683 124416 123574 122397 121031 119929 119402 119344 119297 118700 117285 115446 114174 114417 116352 119139 121380 121962
54667 121962 120805 118898 117484 117151 117759 118950 120394 121653 122336 122506 122514 122326 121527 120169 119066 118857 119223
54650 119223 119479 119542 119804 120344 120905 121456 122126 122606 122264 121017 119594 118687 118295 118139 118371 119465 121486 123783
54632 123783 125431 125912 125424 124606 123913 123228 122131 120523 118861 117747 117426 117719 118313 118975 119577 120080 120567
54615 120567 121246 122274 123512 124476 124684 124106 123234 122665 122680 123211 124046 124944 125650 125977 125894 125505 125005 124682 124810
54596 124810 125392 126045 126335 126254 126260 126747 127512 127843 127212 125897 124823 124749 125647 126909 128039 128935 129605 129827 129254
54577 129254 127745 125587 123438 122062 121877 122685 123852 124780 125172 124970 124234 123162 122096 121444 121533 122388 123582
54560 123582 124505 124970 125384 126107 126859 127105 126897 126850 127319 128059 128773 129550 130606 132000 133677 135438 136752
54543 136752 137077 136608 136276 136716 137577 138128 138227 138305 138653 139104 139289 138949 138075 136901 135664 134345 132915 131844
54525 131844 131850 132940 134159 134631 134418 134036 133653 133334 133630 135057 137092 138359 137979 136266 134102 132173 130913
54508 130913 130662 131518 133179 135132 136821 137670 137282 135850 134230 133343 133422 133829 133630 132439 130804 129679
54492 129679 129543 130073 130677 131115 131528 132098 132842 133579 133997 133987 133945 134455 135570 136720 137481 138093 139031 140456
54474 140456 142299 144426 146432 147751 148395 149132 150452 151803 152393 152373 152517 153042 153491 153624 153665 153735 153716 153639
54456 153639 153586 153218 152112 150527 149176 148230 147246 146124 145318 144957 144566 143977 143713 144107 144727 145139 145576 146221
54438 146221 146459 145626 144157 143257 143462 144182 144653 144829 145187 145982 146858 147074 146118 144258 142519 141994 143092
54421 143092 145305 147542 148845 149108 149194 150026 151514 152643 152681 151878 150888 149971 149072 148269 147721 147353 146969 146505
54403 146505 145980 145416 145084 145561 147161 149399 151342 152470 153018 153677 155108 157490 160181 161994 162220 161358
54387 161358 160571 160506 160880 161060 160625 159416 157577 155730 154753 155027 155957 156382 155554 153768 152194 152090 153974
54370 153974 157359 161162 164434 166871 168901 171377 174930 179413 184064 188330 192367 196516 200464 203303
54356 203303 204459 204214 203130 201225 198129 193976 189734 186380 183905 181489 178653 175853 173811 172540
54342 172540 171397 169841 167781 165347 162843 160939 160313 160785 161220 160668 159325 158107 157479 157139 156740 156449
54326 156449 156649 157294 157750 157294 155811 153988 152684 152095 151765 151453 151627 152739 154311 155225 154924 153879 152757
54309 152757 151589 150104 148544 147652 147751 148214 148131 147334 146504 146314 146784 147598 148683 150126 151656 152639 152686 152029
54291 152029 151219 150682 150631 151112 151938 152729 153227 153572 154130 155099 156323 157393 157936 157885 157483 156949 156263 155486 155132
54272 155132 155749 157040 157812 157141 155387 153851 153603 154776 156710 158461 159341 159340 159081 159244 160048 161286 162611
54255 162611 163697 164405 164999 165954 167294 168383 168673 168421 168297 168443 168345 167609 166484 165496 164873 164420 163802 162905
54237 162905 162031 161694 162079 162824 163462 163943 164521 165344 166459 168048 170163 172229 173285 172940 171894 171325 171814
54220 171814 172896 173524 172983 171523 170099 169396 169157 168636 167466 165829 163993 162145 160648 159955 160106 160707
54204 160707 161491 162550 163834 164826 165008 164413 163462 162517 161784 161421 161428 161624 161948 162649 163889 165363 166596 167459
54186 167459 168041 168149 167445 166136 165110 165101 165946 166886 167446 167806 168371 169282 170373 171434 172311 172830 172798 172144
54168 172144 170974 169451 167782 166352 165644 165709 165809 165016 163293 161701 161323 162173 163317 163792 163167 161575
54152 161575 159693 158555 158784 159853 160535 160213 159385 158738 158277 157734 157299 157337 157648 157670 157403 157438 157992 158543 158708
54133 158708 158913 159745 161051 162138 162615 162613 162404 162304 162804 164207 166088 167571 168231 168415 168641 169119 169963 171439
54115 171439 173657 176227 178441 179775 180192 180180 180510 181717 183710 186049 188574 191474 194842 198563 202581
54100 202581 206735 210308 212449 213281 213854 214561 214291 211844 207639 203232 199606 196849 195200 195209 196714 198657
54084 198657 200338 202097 204346 206534 207601 207061 205258 202926 200838 199553 199073 198994 199179 199872 200895 201357
54068 201357 200751 199882 199934 200849 201471 201320 201325 202469 204334 205546 205334 204160 202968 202282 202126 202449 203350 204910
54050 204910 206937 209013 210817 212411 214184 216519 219539 223117 227071 231382 236262 241984 248616 256017
54036 256017 264105 272988 282682 292857 303035 312943 322451 331242 338835 344977 349795 353521 356330 358551
54022 358551 360666 362825 364610 365598 366059 366650 367370 367258 365351 361691 357037 351746 345355 337386 328265
54007 328265 319183 311137 304269 297981 291484 284294 276584 269263 263463 259642 257150 254825 252104 249455
53993 249455 247740 247274 247511 247510 246614 244817 242657 240785 239484 238507 237397 235974 234441 233026 231664 230240
53977 230240 229008 228471 228746 229379 230054 231241 233684 237334 241331 245231 249851 256611 266403 279365 295233
53962 295233 313062 330578 344571 352441 353364 348199 338856 327843 317553 309171 302348 296290 290957
53949 290957 286864 284095 282166 280814 280309 280947 282693 285425 289065 293372 298076 303327 309576 316877 324755
53934 324755 332939 341511 350069 357377 362539 366075 369204 372408 375440 378469 382246 387035 392195 397153
53920 397153 402194 407980 414805 422609 431227 440206 448832 456881 465072 474272 484361 494317 503276 510976
53906 510976 517164 521144 522319 521024 518519 516097 514172 512181 509293 505163 500054 494394 488424 482237
53892 482237 475826 468884 460777 450959 439463 426832 413713 400606 387889 375844 364633 354380
53880 354380 345188 336971 329394 322227 315688 310175 305675 301712 297950 294535 291652 289006 286061 282690
53866 282690 279237 275930 272571 269004 265565 262682 260098 256968 252906 248653 245436 243761 243054 242354 241134
53851 241134 239462 237628 235736 233690 231594 230010 229535 230024 230574 230521 230101 229880 229860 229625 229027 228222 227221
53834 227221 226022 225012 224571 224365 223795 223137 223419 224980 226979 228560 229638 230250 230131 229559 229703 231212
53818 231212 233168 234370 235095 236571 239118 241922 244451 246976 249679 252334 255028 258323 262453 267123
53804 267123 272347 278687 286338 294669 303018 311338 319681 327643 334721 340808 346011 350411 354302 358163
53790 358163 362042 365358 367705 369443 371153 372877 374245 374924 374544 372570 368826 363869 358365 352250 344975
53775 344975 336447 327307 318349 310045 302575 295930 289954 284537 279755 275648 271982 268421 264804 261057
53761 261057 257066 252965 249364 246839 245208 243641 241564 239187 237064 235398 233910 232283 230563 229115
53747 229115 228171 227540 226857 226048 225351 224897 224537 224144 223771 223407 222932 222442 222298 222542 222654 222244 221729 221867 222787
53728 222787 223880 224585 224797 224562 223870 222947 222399 222783 224126 226021 228157 230625 233664 237083 240085 241891
53712 241891 242572 242961 243615 244191 244166 243831 244037 245116 246573 247892 249135 250624 252502 254913 258284 262990
53696 262990 268764 274715 279916 283880 286541 288071 288850 289460 290413 291768 293073 293809 293870 293537 293108 292700
53680 292700 292319 291869 291121 289958 288671 287714 287115 286447 285530 284736 284423 284440 284544 284941 285956 287384 288637
53663 288637 289468 290114 290761 291252 291348 290981 290246 289419 288992 289362 290425 291627 292411 292517 292045 291463 291401 292097 293165
53644 293165 294193 295328 296872 298533 299706 300470 301630 303618 305922 307865 309478 311236 313299 315361
53630 315361 317052 318285 319374 320935 323431 326607 329647 332040 333985 335846 337619 339220 340899 342935
53616 342935 345163 347195 348932 350454 351597 352165 352542 353629 355947 359150 362564 365942 369405 372823 375641
53601 375641 377464 378619 379876 381583 383281 384301 384562 384547 384632 384800 385033 385539 386402 387356 388156 388890 389592
53584 389592 389775 388817 386789 384553 382931 382030 381389 380562 379415 378099 376875 375949 375354 374955 374580 374133 373618
53567 373618 373155 372870 372710 372375 371595 370542 369855 370195 371717 373904 375844 376692 376121 374550 372994 372454 373222
53550 373222 374720 376118 377169 378315 379978 381988 383839 385304 386499 387561 388613 389998 392120 394964
53536 394964 398151 401577 405574 410255 415099 419551 423750 428264 433257 438395 443616 449583 457151 466527
53522 466527 477024 487615 497715 507465 517320 527520 538168 549645 562493 576691 591566 606784
53510 606784 623003 641023 660613 680850 701479 723109 745880 768755 790594 811386 831919
53499 831919 852591 873163 893438 913505 933227 952017 969436 985734 1001609 1017557 1033592
53488 1033592 1049520 1065327 1081286 1097659 1114319 1130787 1146785 1162705 1179320 1196971 1215264
53477 1215264 1233589 1251698 1269564 1286841 1302756 1316593 1328119 1337566 1345341 1351697 1356372 1358435
53465 1358435 1356794 1351216 1342829 1333406 1324128 1315143 1306192 1297256 1288465 1279723 1270718 1261184 1250900 1239497
53451 1239497 1226577 1212149 1196814 1181423 1166471 1151767 1136600 1120323 1102973 1085360 1068533
53440 1068533 1053225 1039874 1028942 1020837 1015446 1011959 1009293 1006594 1003432 999843 996355 993693 992180
53427 992180 991503 991290 991741 993434 996545 1000579 1004953 1009618 1015038 1021766 1030203 1040594 1053039 1067491
53413 1067491 1083791 1101638 1120456 1139446 1158096 1176756 1196596 1218750 1243414 1269776 1296816
53402 1296816 1324161 1352166 1381394 1412214 1444884 1479707 1516895 1556398 1598015 1641511 1686366
53391 1686366 1731644 1776680 1821935 1868530 1916656 1964969 2012087 2058184 2104333 2150545 2195493
53380 2195493 2238249 2279308 2319401 2358071 2394215 2427397 2457797 2485154 2508661 2527840 2542713
53369 2542713 2553118 2558709 2559741 2556915 2550001 2537496 2518291 2493203 2464215 2432704 2399086 2363715
53357 2363715 2327126 2289456 2250514 2210622 2170726 2131551 2093324 2056529 2022218 1991074 1962553
53346 1962553 1935334 1908246 1880452 1851242 1820266 1787872 1754780 1721614 1689018 1657874 1628738
53335 1628738 1601147 1574121 1547542 1522645 1500974 1483048 1468071 1454561 1441219 1427505 1413514
53324 1413514 1399152 1383564 1365788 1345978 1325440 1305284 1285513 1265724 1246116 1227341 1209717
53313 1209717 1193187 1177900 1164252 1152338 1141835 1132549 1124665 1118394 1113634 1110109 1107563 1105793 1104751
53300 1104751 1104738 1106266 1109617 1114759 1121664 1130444 1141073 1153303 1167070 1182716 1200630 1220792 1242759
53287 1242759 1265851 1289221 1312038 1333851 1354604 1374157 1392083 1408198 1422937 1436763 1449384
53276 1449384 1459958 1467968 1473438 1476406 1476735 1474595 1470593 1465166 1458138 1449074 1437780 1424284 1408681
53263 1408681 1391261 1372619 1353316 1333592 1313607 1293718 1274160 1254615 1234518 1213812 1193089
53252 1193089 1172952 1153490 1134450 1115643 1097116 1079134 1062027 1045789 1029734 1012781 994324
53241 994324 974633 954360 933924 913586 893768 874819 856592 838692 821224 804850 789966
53230 789966 776224 763190 751237 741339 733948 728310 722998 716954 709939 702043 692925 681746 667940
53217 667940 651956 634869 617277 598937 579690 560338 542186 525948 511554 498776 487460
53206 487460 477213 467583 458707 451145 444803 438688 432106 425478 419308 412919 405129 395948 386632 377951
53192 377951 369332 360115 350890 342931 336668 331335 326022 320568 315390 310783 306610 302566 298654 295309
53178 295309 292910 291213 289500 287377 285138 283147 281187 278825 276279 274449 273967 274532 275321 275804 275921
53163 275921 275607 274522 272451 269792 267388 265762 264665 263523 262236 261297 261137 261578 262077 262311 262382 262565
53147 262565 262972 263376 263272 262281 260645 259182 258542 258581 258612 258168 257254 256016 254591 253397 253171 254358 256555
53130 256555 258778 260273 260986 261372 261900 262695 263495 263943 264050 264322 265278 266820 268303 269261 269911 270813 272250
53113 272250 274137 276347 278804 281274 283379 284914 285890 286173 285395 283466 280891 278254 275582 272621 269643
53098 269643 267493 266685 266891 267488 268239 269082 269532 268867 266925 264396 262134 260431 259106 258125 257834 258516 259898
53081 259898 261266 262098 262447 262689 262993 263220 263270 263326 263571 263837 263729 263171 262627 262589 262848 262509 260947 258656 256819
53062 256819 255995 255592 254835 253863 253447 253833 254461 254885 255411 256569 258296 259979 261075 261493 261567 261863 262813 264284
53044 264284 265667 266572 267169 267631 267574 266501 264579 262519 260755 259252 258145 257967 258978 260642 262182 263435
53028 263435 264833 266595 268293 269274 269364 269011 268844 269157 269801 270460 270914 271128 271197 271266 271402 271505 271445 271341 271529
53009 271529 272146 272919 273510 273896 274201 274301 273947 273267 272818 273020 273718 274346 274406 273817 272980 272541 272860 273655 274259
52990 274259 274266 273809 273303 273130 273501 274327 275149 275524 275636 276291 278192 281360 285220 288929 291602 292759 292863
52973 292863 292999 293635 294039 293339 291837 290652 290337 290569 291160 292463 294467 296300 297267 297843 298912 300297
52957 300297 300825 299862 298060 296405 295135 293945 292795 292017 291770 291789 291596 290723 288900 286375 283966 282452
52941 282452 281862 281586 281152 280577 280039 279610 279414 279632 280085 280119 279273 277880 276692 275971 275218 273784 271586 269225
52923 269225 267541 266974 267241 267662 267921 268355 269419 271049 272790 274289 275305 275453 274504 273030 272170 272452
52907 272452 273200 273392 272827 272046 271377 270548 269326 268085 267466 267624 268060 268177 267907 267694 267913 268442 268934 269449
52889 269449 270531 272555 275137 277436 278977 279979 280841 281491 281426 280375 278818 277712 277662 278381 279074 279339
52873 279339 279613 280646 282641 285070 287277 289111 290885 292881 295057 297212 299241 301070 302459 303107 302998
52858 302998 302456 301682 300417 298297 295418 292246 288983 285357 281111 276371 271364 266151 261006 256740 254146
52843 254146 253116 252727 252246 251673 251233 250813 250205 249490 248794 247865 246388 244679 243633 243853 245097 246694 248196
52826 248196 249456 250327 250625 250373 249879 249517 249485 249741 250147 250693 251533 252635 253490 253532 252982 252880 253944 255689
52808 255689 257130 258121 259353 261040 262369 262536 261752 260703 259469 257644 255341 253358 252247 251809 251681
52793 251681 251921 252602 253206 252964 251810 250577 250116 250472 251064 251420 251539 251660 252041 252993 254780 257233 259651
52776 259651 261407 262557 263539 264260 263994 262369 260114 258462 257934 258040 258021 257524 256542 255162 253578 252191
52760 252191 251406 251320 251643 251913 251872 251749 252122 253375 255280 257272 259093 260941 262990 265023 266734 268217
52744 268217 269955 272302 275098 277802 279973 281623 283091 284587 285898 286651 286802 286741 286936 287611 288761 290262
52728 290262 291820 292983 293433 293237 292671 291749 290111 287530 284424 281662 279756 278451 277310 276497 276561 277399
52712 277399 277960 277316 275782 274590 274562 275487 276663 277614 278175 278309 278050 277439 276481 275399 274888 275670 277539
52695 277539 279262 279726 278991 277908 277032 276363 275970 276200 277082 278052 278629 279031 279716 280539 280901 280666 280286 279793
52677 279793 278329 275350 271929 270009 270274 271523 272328 272531 272582 272228 270877 268978 267928 268419 269637 270382
52661 270382 270350 270032 269944 270396 271534 273116 274553 275662 277117 279725 283403 287248 290476 292843 294285 294658
52645 294658 293904 292183 289782 287088 284580 282583 281042 279795 279058 279294 280578 282405 284280 286298 289052
52630 289052 293184 299158 307321 317909 330811 345157 359045 369847 375207 374126 367292 356552 344104
52617 344104 331877 321161 312451 305638 300358 296219 292854 290006 287627 285781 284407 283310 282363 281586
52603 281586 281020 280655 280486 280475 280479 280450 280746 281886 283778 285432 285807 284868 283557 282736 282473 282350 282114 281831 281714
52584 281714 282066 283147 284810 286458 287691 288856 290559 292739 294717 296149 297342 298428 298852 298165 296890
52569 296890 295980 295631 295239 294431 293597 293338 293862 294990 296325 297320 297552 297068 296190 294964 293205 291128 289434
52552 289434 288562 288228 287921 287538 287293 287295 287437 287532 287455 287374 287807 289009 290289 290513 289466 288123 287259 286488 285214
52533 285214 283922 283743 285027 287088 289145 290826 291843 292003 291721 291907 293056 294792 296445 297737 298823
52518 298823 300004 301530 303373 305075 306075 306349 306576 307603 309947 313710 318649 324191 329580 334136 337302
52503 337302 338565 337640 334751 330557 325776 321045 316909 313530 310441 306973 303097 299553 297021 295427
52489 295427 294188 292929 291799 291224 291478 292430 293640 294713 295555 296240 296831 297466 298422 299833 301388 302552
52473 302552 303061 303130 303336 304355 306471 309100 311163 312350 313734 316645 321178 326324 331276 335910 340087
52458 340087 343313 345225 345828 345088 342871 339474 335648 331888 328140 324324 320620 317112 313775 310965 309281
52443 309281 308576 307758 306013 303703 301631 299984 298532 297414 297005 297272 297819 298420 298975 299158 298659 297749 297128
52426 297128 297223 297957 299129 300566 301895 302593 302447 301841 301503 301976 303216 304666 305903 307277 309632 313259
52410 313259 317474 321442 325147 329340 334881 342475 352598 365101 378882 392275 403721 411975 416129
52397 416129 415938 412015 405329 396624 386578 376234 366813 359163 353588 349950 347614 345652 343573 341691
52383 341691 340411 339508 338648 338223 338961 340939 343668 346969 350978 355319 359241 362774 366941 372498 379085
52368 379085 385877 392392 398332 403265 407019 409884 411963 412720 411691 409286 406427 403687 401312 399778
52354 399778 399624 400702 402141 403232 404051 405127 406794 409073 411953 415501 419614 423805 427466 430474 433453
52339 433453 437253 442213 448075 454512 461489 469102 477387 486388 496212 507045 519255 533346 549462
52326 549462 567022 585360 604664 625745 648798 673013 697600 722462 747472 771869 795102
52315 795102 817808 841158 865530 890546 916127 942526 969347 995540 1020735 1045824 1071736
52304 1071736 1098132 1123798 1147977 1170822 1192834 1214348 1235426 1255724 1274371 1290311 1302902
52293 1302902 1312008 1317541 1319216 1316904 1311072 1302668 1292598 1281394 1269335 1256671 1243645 1230428
52281 1230428 1217247 1204599 1193247 1183941 1177161 1173053 1171413 1171740 1173596 1177113 1182974 1191705 1202997
52268 1202997 1215845 1229258 1242776 1256583 1271358 1287833 1306162 1325695 1345612 1365629 1385847
52257 1385847 1406137 1426194 1446149 1466537 1487482 1508375 1528574 1547942 1566278 1582620 1595619
52246 1595619 1604464 1609074 1609587 1606218 1599659 1591092 1581530 1571220 1559729 1546498 1531328 1514630 1497285
52233 1497285 1480156 1463666 1447865 1432718 1418144 1403915 1389866 1376229 1363503 1352069 1342219
52222 1342219 1334448 1329173 1326000 1323765 1321597 1319680 1318724 1319009 1320380 1322909 1327034 1332911 1339975 1347287
52208 1347287 1354250 1360941 1367808 1375021 1382106 1388393 1393843 1399146 1404911 1411079 1417407 1424150 1431806 1440374
52194 1440374 1449375 1458547 1468083 1478162 1488660 1499299 1509597 1518604 1525281 1529404 1531619 1532238 1530433
52181 1530433 1525091 1516265 1505223 1493194 1480582 1467503 1454595 1442830 1432613 1423387 1414326 1405318
52169 1405318 1397062 1390160 1384364 1379022 1374191 1370925 1370331 1372557 1376751 1381744 1386669 1391225 1395575 1399795
52155 1399795 1403291 1405012 1404497 1402516 1400369 1398717 1397364 1396030 1394905 1394400 1394681 1395591 1396852 1398205 1399436
52140 1399436 1400358 1400814 1400672 1399878 1398528 1396986 1395943 1396224 1398280 1402003 1407320 1414867 1425613 1439809 1456798
52125 1456798 1476058 1497862 1522660 1550369 1580670 1613446 1648300 1684101 1719738 1755095 1790623
52114 1790623 1826169 1860994 1894687 1927119 1957510 1984581 2007982 2028732 2047831 2065195 2080431
52103 2080431 2093975 2106736 2119014 2130398 2140474 2149094 2156086 2161093 2163567 2162606 2157057 2146144 2129857
52090 2129857 2108606 2083034 2054576 2025568 1997941 1971928 1946748 1922393 1899980 1880392 1863466
52079 1863466 1848723 1836214 1826253 1818920 1814269 1812544 1813756 1817388 1822980 1830762 1841319 1854804 1870946
52066 1870946 1889582 1910648 1933557 1957118 1980308 2002913 2025228 2047333 2068899 2089657 2109755
52055 2109755 2129498 2148675 2166278 2180981 2191951 2199114 2202630 2202291 2197539 2187913 2173341 2154117
52043 2154117 2130880 2104581 2076237 2046570 2016007 1984995 1954067 1923534 1893334 1863344 1833758
52032 1833758 1805065 1777823 1752515 1729409 1708292 1688380 1668720 1648710 1628266 1607706 1587620
52021 1587620 1568566 1550555 1532998 1515541 1498766 1483540 1469720 1456115 1441870 1427305 1413085
52010 1413085 1399158 1384970 1370201 1354662 1337781 1318951 1298251 1276241 1253101 1228637 1203182
51999 1203182 1177772 1153263 1129860 1107796 1087828 1070530 1055397 1041106 1026501 1011014 994446
51988 994446 976818 958417 939603 920525 901166 881613 862139 843094 824797 807310 790156
51977 790156 772535 754115 735471 717553 700938 685968 673244 663357 656174 651084 648183 648580 653033
51964 653033 660668 669577 678509 687378 696121 703766 709040 711451 711247 708568 703240 695464 686122 676190
51950 676190 666332 657335 650409 646421 645106 645682 648150 653375 661903 673340 687072 703000 721307
51937 721307 742005 765055 790429 817619 845333 871945 895811 914771 925949 926963 917504 899423
51925 899423 875326 847369 817079 785662 754215 723813 695346 669131 644983 622973 603795
51914 603795 587919 574674 562855 552110 543062 536148 531156 528061 527414 529449 533401 538237 543648
51901 543648 549826 556584 563194 568820 572628 573662 571120 564873 555412 543351 529278 514004 498644
51888 498644 484303 471784 461537 453687 448133 444734 443387 443894 445856 448857 452723 457530 463476 470740
51874 470740 479292 488705 498260 507312 515352 521729 525674 526849 525701 522997 519231 514708 510015 506033
51860 506033 503511 502794 503849 506322 509711 513733 518395 523578 528736 533255 536886 539441 540242 538368 533450
51845 533450 526000 517043 507749 499167 491709 484823 477635 470029 462755 456496 451373 447417 444942 444189
51831 444189 444999 447067 449990 452836 454283 453745 452025 450353 449033 447512 445505 443397 441625 440225 439093
51816 439093 438247 437722 437495 437605 438123 439021 440263 441877 443650 444892 444954 443910 442377 440767 439234 438271
51800 438271 438602 440228 442161 443500 444371 445446 446871 448064 448309 447210 444825 441731 438808 436611 435091
51785 435091 434161 434180 435423 437271 438543 438718 438419 438554 439317 440215 440878 441658 443418 446727 451314 456470 462055
51768 462055 468736 477053 486558 496270 505644 514551 522437 528177 530856 530245 526468 519744 510627 500039
51754 500039 488813 477514 466774 457236 449000 441606 434898 429320 424922 420684 415597 410155 406029
51741 406029 404303 404713 406592 409733 414009 418784 423366 427826 432835 438615 444343 448684 450781 450701 449156
51726 449156 447034 445267 444872 446612 450308 454582 457638 458493 457414 455261 452604 449607 446534 444041 442770
51711 442770 442627 442576 441379 438702 435443 432941 431926 432350 434032 437075 441489 446621 451239 454279 455448
51696 455448 455129 453805 451738 449192 446821 445568 446078 448200 451045 453412 454164 452542 448481 442756 436620
51681 436620 431120 426678 423259 420820 419448 419053 419119 419013 418630 418576 419535 421563 424206 427145 430410 434020
51665 434020 437846 442007 446946 452695 458327 462524 464689 465096 464059 461415 457093 451906 447428 445116
51651 445116 445726 449503 456495 466319 477594 487991 495181 497871 496034 490477 482496 473700 465542 458762
51637 458762 453439 449576 447277 446302 445888 445323 444370 442940 440762 437801 434669 432175 430606 429806 429611 429667
51621 429667 429036 426728 422797 418376 414441 410946 407359 403621 400280 397887 396457 395356 393668 390954
51607 390954 387852 385616 384868 384982 384935 384609 385016 387324 391859 398053 405182 413079 422199 433082 445756
51592 445756 459459 472664 483384 489886 491538 488984 483405 475870 467548 460018 454566 451180 448806
51579 448806 446839 445910 447177 451298 458353 468254 480731 495101 510425 525997 541699 558022 575707
51566 575707 594986 615022 634463 652780 670897 690401 712524 738060 767789 802361 841659
51555 841659 884377 928021 969209 1004394 1030916 1047610 1054460 1051900 1040588 1021459 995562 963930
51543 963930 927906 889433 850609 812989 777584 745427 717626 694684 676048 660539 647121
51532 647121 635141 624043 613145 601804 589735 577105 564359 552002 540513 530194 520945 512306
51520 512306 503951 496052 488879 482151 475190 467776 460463 453911 448324 443697 440171 437712 435734 433490
51506 433490 430712 427590 424265 420735 417172 413960 411412 409726 409174 409977 411890 414153 416010 417154 417717
51491 417717 418052 418662 420096 422620 425898 429190 431977 434264 436057 436740 435493 432531 429390 427471 426637
51476 426637 425790 424493 423214 422096 420519 418075 415027 411436 406679 400502 393776 387579 382116 377250
51462 377250 373442 371185 369939 368694 367412 366934 367515 368361 368776 368983 369616 371075 373539 377002 381105 385446
51446 385446 390237 396199 403790 413035 424087 437290 452465 468575 484157 497631 507319 512184 512941
51433 512941 511853 511009 511039 511434 511250 509251 504253 496125 486152 475976 466487 457927 450490 444276 439022
51418 439022 434386 430271 426639 423292 420169 417499 415399 413682 412302 411497 411262 411197 411235 411892 413397 415201
51402 415201 416877 418808 421320 423830 425756 427743 430911 435225 439699 444008 448754 454197 460031 466626
51388 466626 475239 486393 499060 512268 526773 544366 566119 592293 623500 660787 704338 753043
51376 753043 805909 863357 926284 993542 1060643 1121264 1170217 1205106 1225588 1231775 1223803 1202535
51364 1202535 1169892 1128165 1079410 1025668 969302 912564 856835 802637 750535 701809 658088
51353 658088 620326 588242 560746 536787 515735 497200 480937 466992 455565 446507 439226 433322
51341 433322 428933 426083 423977 421530 418513 415667 413717 412734 412457 412666 413024 413054 412576 411887 411342 410959 410546
51324 410546 409859 408497 406063 402679 399029 395655 392461 389188 386090 383819 382830 383148 384524 386544 388823
51309 388823 391365 394542 398373 401975 404103 404209 402742 400570 398441 396845 395902 395204 394055 392050 389407
51294 389407 386726 384543 382997 381766 380385 378807 377586 377303 377907 378829 379674 380612 382169 384924 389306
51279 389306 395270 402118 408904 415059 420346 424336 426524 427145 427379 428246 429571 430462 430652 430893 432071 434333
51263 434333 437191 440111 442762 444835 445902 445517 443484 440059 435922 431840 428347 425663 423696 421917
51249 421917 419402 415410 410125 404623 399967 396397 393488 390881 388651 387032 386025 385338 384662 383974 383638
51234 383638 384121 385535 387556 389805 392133 394350 395915 396276 395540 394468 393692 393172 392521 391596 390563 389568
51218 389568 388620 387739 387032 386589 386419 386502 386828 387421 388385 389848 391859 394352 397191 400130 402795 404951 406901
51201 406901 409424 413111 417872 423143 428318 432807 436011 437616 437858 437246 436129 434779 433660 433157 433027
51186 433027 432545 431313 429669 428200 427139 426319 425511 424693 424150 424317 425311 426635 427609 428100 428539 429206 429836
51169 429836 430004 429555 428484 426835 424914 423340 422586 422705 423653 425505 428046 430477 432048 432826 433399 433927
51153 433927 433909 432948 431238 429165 426767 423868 420619 417633 415522 414375 413672 412756 411430 410120 409488 409937
51137 409937 411407 413488 415637 417441 418789 419736 420245 420221 419791 419284 418876 418504 418241 418496 419607 421460 423632
51120 423632 425672 427201 428168 429250 431538 435298 439392 442470 444508 446584 449313 452161 454339 455682
51106 455682 456445 456825 457034 457506 458676 460686 463444 466739 470199 473434 476369 479213 481991 484341 485925
51091 485925 486806 487258 487440 487393 487203 486986 486834 486817 486897 486819 486281 485242 483942 482700 481856 481724 482184 482454 481841
51072 481841 480743 480360 481244 482743 484180 485961 489063 493863 500063 507494 516499 527677 541734 559406
51058 559406 580903 605236 630365 654054 674535 690668 702070 709393 714363 719355 726574 736920
51046 736920 749196 760647 768921 773686 776204 777396 776621 772335 763780 752081 739891 729942 723627
51033 723627 720603 719285 717351 712141 701622 685780 666864 647824 630552 615691 603496 594146
51021 594146 587432 582901 580430 580256 582558 587333 594569 604016 614947 626650 639077 652439 666320
51008 666320 679843 692686 705154 717090 727485 735536 741516 746164 749718 751965 752853 752577 751246
50995 751246 748866 745625 742012 738732 736528 735823 736444 737983 740461 744367 750082 757786 767980 781416
50981 781416 798203 817533 838649 861593 886485 912593 938734 964337 989579 1014840 1040786
50970 1040786 1068885 1101081 1138662 1181820 1230416 1284736 1345303 1412285 1485350 1564061 1648220
50959 1648220 1737713 1831888 1929114 2027088 2123735 2217611 2307379 2391293 2467577 2535184 2593870
50948 2593870 2643680 2684672 2717121 2741681 2759382 2771680 2780412 2787369 2793730 2799948 2805979 2811464
50936 2811464 2815836 2818566 2819336 2817864 2813711 2806410 2795571 2780593 2760439 2733975 2700405 2659167 2609633
50923 2609633 2551366 2484619 2410264 2329323 2242940 2152835 2061377 1971017 1883657 1800450 1721984
50912 1721984 1648717 1581311 1520334 1465452 1415269 1368509 1325170 1286018 1250999 1218771 1187977
50901 1187977 1158506 1131237 1106876 1085289 1065845 1048190 1032650 1019803 1009615 1001221 993795 987323
50889 987323 982171 978118 974447 970889 967951 966238 965971 967214 969943 973665 977627 981773 987149 994908
50875 994908 1005228 1017458 1031045 1045931 1062293 1080250 1099686 1120145 1141077 1162524 1185366
50864 1185366 1210605 1238498 1268654 1300860 1335502 1373254 1414715 1460483 1511408 1568593 1633129
50853 1633129 1705923 1787777 1879619 1982465 2097046 2223655 2362496 2513991 2678425 2855375
50843 2855375 3043897 3243182 3452529 3670454 3893986 4118834 4339801 4551028 4746398
50834 4746398 4920376 5068723 5188819 5279781 5342400 5378527 5390437 5381169 5355437 5319401 5279051
50823 5279051 5239113 5203643 5176902 5162806 5163497 5178650 5205690 5240028 5275318 5304221 5319514 5314982
50811 5314982 5286110 5230606 5148138 5039192 4904388 4745105 4564286 4366035 4154665 3934647
50801 3934647 3711115 3489439 3274053 3068071 2873952 2693910 2529481 2381207 2248910
50792 2248910 2131956 2029223 1939368 1861393 1794679 1738349 1691015 1651316 1618381 1591481 1569499
50781 1569499 1551029 1534906 1520474 1507420 1495446 1484073 1472693 1460847 1448406 1435422 1421964
50770 1421964 1408214 1394461 1380636 1366080 1350181 1333236 1316200 1299593 1283159 1266673 1250527
50759 1250527 1235198 1220580 1206332 1192704 1180675 1171282 1164998 1161631 1160626 1161503 1164259 1169447 1177926
50746 1177926 1190489 1207531 1228796 1253480 1280969 1311668 1346843 1387488 1433467 1483920 1538349
50735 1538349 1597181 1661421 1731987 1809185 1892606 1981462 2075146 2173450 2276227 2382879 2492262
50724 2492262 2603028 2714062 2824657 2934193 3041434 3143935 3238131 3319974 3385559 3431551
50714 3431551 3455729 3457660 3438941 3402821 3353697 3296855 3238084 3182789 3135064 3097419 3071194
50703 3071194 3057027 3054901 3063893 3082014 3106361 3133461 3159462 3180081 3190556 3185973 3161998 3115767
50691 3115767 3046676 2956729 2849976 2731208 2604884 2475069 2345824 2220961 2103168 1993596
50681 1993596 1892465 1800062 1717243 1645160 1584375 1534022 1491961 1456232 1426434 1403470 1388056
50670 1388056 1379935 1378387 1382686 1391635 1403300 1415857 1428493 1440998 1452748 1462761 1470792 1477800
50658 1477800 1485108 1493355 1502387 1511799 1521374 1531200 1541584 1552806 1564830 1577335 1590114 1603351
50646 1603351 1617478 1632968 1650482 1671067 1695679 1724325 1755962 1789658 1825703 1865175 1908400
50635 1908400 1954332 2001571 2049330 2097051 2143688 2188243 2230930 2273178 2316530 2362129 2410900
50624 2410900 2462659 2513995 2557627 2585142 2591301 2576397 2545460 2505728 2464036 2425084 2391181
50613 2391181 2363297 2342071 2327618 2318895 2314021 2311479 2310725 2311617 2313532 2314996 2313820 2307564 2294316
50600 2294316 2273278 2244460 2207804 2162894 2109795 2049976 1986061 1920535 1854742 1789091 1724032
50589 1724032 1660507 1599407 1540957 1485054 1432014 1382471 1336578 1293969 1254810 1220183 1190854
50578 1190854 1166103 1144486 1125425 1109361 1096541 1086595 1079367 1075308 1074761 1077559 1083645 1093330 1106369
50565 1106369 1121340 1136642 1151902 1167875 1185207 1203891 1223708 1244498 1265928 1287559 1309376
50554 1309376 1331845 1355245 1379195 1403002 1426278 1449056 1471496 1493565 1514873 1534879 1553492
50543 1553492 1571506 1590125 1610046 1631348 1654327 1679967 1709277 1742567 1779764 1821093 1866883
50532 1866883 1916816 1969906 2025328 2083020 2143638 2208446 2279125 2356992 2442118 2533603 2630774
50521 2630774 2733451 2840640 2949663 3057251 3161128 3259837 3351312 3432606 3501206 3555906
50511 3555906 3596085 3620688 3628418 3618707 3592123 3549858 3493055 3422695 3340290 3248885 3153274 3058821
50499 3058821 2969837 2889123 2818790 2760887 2717090 2688269 2674697 2676258 2692196 2720870 2759916
50488 2759916 2806180 2855096 2900609 2936429 2957576 2960764 2943933 2906163 2848145 2772221 2681833
50477 2681833 2580986 2473961 2364913 2257407 2154224 2057241 1967048 1882822 1803133 1727174
50467 1727174 1655200 1587963 1526055 1469645 1418408 1371664 1329009 1290853 1258042 1230909 1209040
50456 1209040 1191997 1179801 1172570 1170112 1172063 1178070 1187592 1199860 1214374 1231288 1251140 1274443
50444 1274443 1301644 1333068 1368501 1406949 1446965 1486933 1524790 1557929 1584099 1602478 1613560
50433 1613560 1618152 1617005 1611319 1602856 1593075 1582482 1571138 1559502 1548378 1538223 1528970 1520522 1513040
50420 1513040 1506732 1501793 1498765 1498661 1502438 1510492 1522886 1539904 1562043 1589495 1621958 1659015 1700394
50407 1700394 1745733 1794259 1844926 1896753 1948947 2000756 2051373 2099956 2145624 2187437 2224379
50396 2224379 2255260 2278627 2292917 2296844 2289634 2270909 2240552 2198937 2147398 2088336 2024714 1959203
50384 1959203 1893630 1829314 1767947 1711891 1663246 1622732 1589957 1564791 1547941 1539942 1540144 1547204
50372 1547204 1560107 1577994 1599030 1620052 1637594 1649000 1652603 1647325 1632560 1608501 1576517 1539129
50360 1539129 1499278 1459241 1420218 1383009 1348793 1318886 1293885 1273488 1257015 1243500 1231231
50349 1231231 1217701 1200503 1178250 1150864 1119544 1086599 1054654 1025442 999439 976816 958255
50338 958255 944441 935095 929188 926086 925910 928705 933781 940255 947880 956884 967154 978042 989060
50325 989060 1000370 1012330 1024855 1037639 1050818 1064944 1080213 1096098 1111872 1127075 1141288
50314 1141288 1153823 1164088 1172035 1177953 1181963 1184056 1184425 1183426 1181456 1179318 1178429 1179962 1183733 1188575
50300 1188575 1193968 1200741 1210005 1221992 1236372 1253364 1274076 1299980 1332411 1372334 1419846 1473145
50288 1473145 1527431 1574843 1606487 1616243 1603876 1574772 1536575 1495835 1456990 1422799 1394560
50277 1394560 1372070 1354271 1340271 1329663 1322126 1317184 1314343 1313172 1313225 1314094 1315555 1317397 1319214 1320617
50263 1320617 1321710 1323164 1325750 1329837 1335284 1341728 1349096 1357862 1368672 1381484 1395231 1408541 1420808
50250 1420808 1432519 1444672 1458047 1472930 1489125 1506005 1522464 1536943 1547736 1553590 1554224 1550348
50238 1550348 1543229 1534252 1524656 1515414 1507341 1501400 1498658 1499461 1502577 1505344 1504653 1497683 1482341 1458114
50224 1458114 1426795 1391620 1355158 1318309 1281464 1245812 1212840 1182957 1155365 1129163 1104147
50213 1104147 1080651 1059088 1039641 1022143 1006256 991848 978878 966911 955267 943914 933632
50202 933632 924854 917021 909619 903202 898521 895128 891852 888367 885252 882701 880214 877626 875275 872899
50188 872899 869366 864022 857480 850662 843794 836807 830026 823782 817947 812381 807353 802885 798162 792411
50174 792411 786183 781073 778175 777263 777337 777425 776908 775655 774075 772782 772130 772127 772660 773543 774498 775444 776711 778653
50156 778653 781156 783969 787556 793168 801781 813183 826306 840307 855076 870763 887174 904010
50144 904010 921677 941514 964792 991484 1020226 1049545 1078854 1108260 1137905 1167962 1199172
50133 1199172 1232851 1270108 1311033 1354626 1399302 1443195 1483914 1518283 1542966 1555891 1557128
50122 1557128 1548226 1530800 1506089 1475627 1441577 1406005 1370173 1334878 1301158 1270239 1242918
50111 1242918 1219311 1199079 1181619 1166105 1151698 1137772 1123810 1109244 1093680 1077340 1061080
50100 1061080 1045905 1032406 1020446 1009216 997751 985693 973594 962427 952865 945144 939403 935943
50088 935943 935138 937211 941975 948755 956791 965827 976081 987504 999473 1011523 1024043 1037727 1052502
50075 1052502 1067497 1082038 1096146 1110034 1123534 1136171 1147453 1156968 1164524 1170288 1174543 1177217
50063 1177217 1178015 1177050 1174904 1171891 1167660 1161860 1154918 1147736 1140722 1133463 1125351 1116382 1107299 1099086
50049 1099086 1092301 1086951 1083035 1081030 1081504 1084312 1088701 1094414 1102266 1113263 1127377 1143488 1160262
50036 1160262 1176818 1192902 1208966 1225896 1244093 1262789 1280677 1297230 1313021 1328862 1345059
50025 1345059 1361408 1377307 1391820 1404314 1415303 1426048 1436990 1447130 1455365 1461803 1467165 1471421
50013 1471421 1473971 1475003 1475822 1477629 1480494 1483507 1485234 1483810 1477198 1463932 1443559 1416497 1383992
50000 1383992 1348394 1312761 1279529 1249588 1222671 1198267 1175914 1155198 1136052 1118873 1103909
49989 1103909 1090650 1078192 1065899 1053273 1039467 1023706 1006229 988188 970421 952800 934946
49978 934946 917001 899343 882062 865249 849569 835953 824672 815122 806575 798819 791887 785489
49966 785489 779089 772514 766143 760395 755193 750191 745431 741500 738983 738008 738512 740750 745260 752298 761521
49951 761521 772255 783905 796021 808027 819074 828306 835381 840669 844870 848425 851395 853664 854951
49938 854951 854697 852439 848365 843038 836371 827400 815479 801253 785979 770322 754477 739165 725590
49925 725590 714289 704679 695947 687903 680857 675144 670975 668343 666919 666392 666983 669133 672608 676424
49911 676424 679913 683300 686996 690870 694664 698779 704206 711891 722332 735368 749987 764764 778919
49898 778919 792633 806034 818364 828715 837120 844188 849823 853071 853147 849954 843593 834172 822339
49885 822339 809310 795933 782146 767762 753429 740317 728936 718691 708655 698480 688458
49874 688458 678948 670083 662058 655346 650332 646828 644327 642803 642846 644765 647953 651584 655730 661281 668832
49859 668832 678124 688706 700670 714440 730090 747121 764757 782182 798441 812348 822754 829218
49847 829218 832506 834288 835987 837771 838611 837187 832648 824771 813908 800957 787064 773080 759352
49834 759352 746166 734157 723993 715785 709129 703834 700212 698413 697731 697100 696276 696143 697711 701282
49820 701282 706827 714610 724783 736572 748628 760264 771760 783301 794210 803588 811252 817694
49808 817694 823419 828704 833687 838195 841475 842407 840140 834604 826677 817856 809410 801666 794257 786943
49794 786943 779666 771784 762125 750304 737495 725376 714718 705462 697641 691474 686829 683314 680802
49781 680802 679305 678486 677877 677477 677578 678161 679023 680431 683074 687410 693532 701459 710905 720850 730004 737740
49765 737740 744090 749085 752791 755843 759010 762177 764569 766012 766994 767300 765621 760979 753755 744814 734432
49750 734432 722714 710411 698612 688022 679057 672169 667519 664658 663010 662321 662234 661919 660761 659058
49736 659058 657582 656802 657029 658807 662436 667397 672924 678879 685364 691692 696674 700054 703091 707561 714651
49721 714651 724763 737735 752894 769169 785482 801049 815436 828478 839893 848755 853604 853536
49709 853536 849056 841521 831923 820670 808317 795802 783985 773550 765407 760540 759140 760210 762202
49696 762202 763723 763694 761466 757192 751814 746425 741788 738469 736939 737270 739104 742269 747164 754190 763020
49681 763020 772770 782833 793246 804450 817103 832233 851118 874572 902063 931293 958461 979291
49669 979291 990681 992310 986930 978764 971112 965121 960597 957564 956909 959769 966605 976587 987256 994762
49655 994762 995225 986726 970235 948603 924790 900960 878611 858775 841849 827487 814950 803808
49643 803808 794475 787986 784967 784851 786431 789087 792914 797506 801406 803286 803153 801759 799291 795399 790197
49628 790197 784324 778019 770971 763148 755074 747145 739402 732165 726185 721819 718644 716239 714753 714258
49614 714258 714115 713565 712592 711771 711581 712304 714110 716566 718447 718854 718456 718808 720397 722112 722898 723200 724296
49597 724296 726728 730002 733418 736530 738806 739651 739058 737904 737196 737239 737757 738584 739788 741162 742094 742167 741632
49580 741632 741029 740527 739938 739291 738986 739333 740269 741702 743922 747393 752230 758117 764751 772208 780910 791370
49564 791370 803934 818422 833848 848662 861595 872237 880634 886484 889140 888444 885037 879610 872273
49551 872273 863242 853837 846070 841021 838094 836058 834373 833297 833150 833952 835548 837602 839473 840398 839994
49536 839994 838610 837300 837447 840060 845221 852334 860941 871009 882435 894824 908160 923366 941843
49523 941843 964663 992350 1024716 1060015 1094371 1122979 1142477 1152394 1154691 1152383 1148270 1144231
49511 1144231 1141346 1140745 1143947 1151769 1162996 1174775 1184410 1190340 1191470 1186482 1174404 1155657 1132222
49498 1132222 1106891 1082238 1059812 1039914 1022191 1006358 992230 979395 967480 956720 947681
49487 947681 940377 934234 928975 924832 921737 919140 916989 916138 917160 919306 921329 922898 924466 926123
49473 926123 927459 928494 929929 932238 935074 937829 940394 943056 945942 948864 951644 954326 957058 959893
49459 959893 962825 965921 969204 972353 974749 976056 976516 976370 975228 972566 968802 965218 962582 960381 957684
49444 957684 954363 951097 948621 947385 947673 949580 952921 957344 962433 967637 972509 977270 982755 989519
49430 989519 997365 1006097 1016315 1029042 1044840 1063608 1084855 1107735 1131265 1155096 1179706 1204975
49418 1204975 1228521 1246048 1253630 1249769 1235891 1215725 1194047 1175001 1160867 1152226 1148978 1150876
49406 1150876 1157404 1167878 1181726 1198316 1216661 1235883 1255851 1276769 1298216 1319275 1339616
49395 1339616 1359668 1379568 1398703 1416502 1432941 1447842 1460369 1469731 1475794 1478439 1476900 1470568
49383 1470568 1460207 1447564 1433693 1418342 1401118 1382716 1364697 1348329 1333936 1321208 1309871
49372 1309871 1300077 1292278 1286882 1284021 1283524 1284933 1287511 1290452 1293210 1295585 1297370 1298105 1297356 1295136 1291754
49357 1291754 1287150 1280638 1271617 1260546 1248931 1238208 1228862 1220789 1214204 1209546 1206536 1204027 1201194
49344 1201194 1198386 1196229 1194272 1191212 1186322 1179994 1172863 1165084 1156688 1148037 1139543 1131406 1124003 1118213
49330 1118213 1114917 1114387 1116543 1121719 1130735 1144213 1162139 1184083 1209389 1236680 1263191 1285053
49318 1285053 1298908 1303766 1301412 1294834 1286112 1275630 1262931 1247881 1231023 1213250 1195478 1178491
49306 1178491 1162849 1148874 1136786 1126852 1119346 1114354 1111583 1110453 1110549 1112045 1115502 1121081 1128034 1135068
49292 1135068 1141021 1145197 1147485 1148526 1149415 1150588 1151000 1148847 1143198 1134674 1124704 1114594 1105282 1097356
49278 1097356 1091026 1086413 1084069 1084925 1089494 1097278 1107025 1117383 1127401 1136786 1145711 1154082 1161016 1165456
49264 1165456 1167251 1167166 1165783 1162926 1158268 1151985 1144741 1137709 1132918 1132842 1138943 1150759 1166703 1185452
49250 1185452 1206216 1227960 1248710 1265540 1275327 1276195 1268643 1254970 1237424 1217336 1196049 1175582
49238 1175582 1157565 1142138 1128711 1117384 1108830 1103169 1099976 1099249 1101479 1106634 1113766 1121768 1130036
49225 1130036 1138399 1146989 1156188 1166138 1176312 1186097 1195754 1206147 1217566 1229527 1241739 1254397
49213 1254397 1267209 1279038 1289036 1297591 1305709 1313987 1322750 1332692 1344726 1359326 1376480 1396067
49201 1396067 1417790 1440921 1464613 1488403 1512085 1535267 1557527 1578932 1599861 1620176 1639054
49190 1639054 1655859 1670839 1684659 1697495 1708945 1718779 1727422 1735615 1743885 1752599 1762421 1774406
49178 1774406 1789508 1808159 1830400 1856329 1886410 1921626 1963572 2014116 2074251 2142647 2215001
49167 2215001 2284757 2344899 2390127 2418551 2432008 2434793 2431740 2426928 2423245 2422173 2423621 2426328 2428853
49154 2428853 2430331 2430524 2429580 2428015 2426704 2426539 2428049 2431423 2436790 2444397 2454496 2467142 2482031 2498559
49140 2498559 2516175 2534756 2554523 2575534 2597410 2619677 2642274 2665538 2689668 2714359 2739034
49129 2739034 2763332 2787284 2811009 2834413 2857309 2879739 2902011 2924435 2947231 2970731 2995434
49118 2995434 3021689 3049469 3078697 3109724 3143376 3180659 3222623 3270594 3326690 3394579 3479869
49107 3479869 3588921 3725428 3886266 4059861 4229953 4384449 4524202 4663426 4817541
49098 4817541 4985492 5142040 5249752 5282880 5243551 5157342 5053649 4947746 4837051 4710849
49088 4710849 4563099 4398365 4228673 4066591 3920712 3795110 3690302 3604124 3533126 3474537
49078 3474537 3426993 3389312 3359213 3333827 3311038 3289766 3269329 3249253 3229673 3211271 3194555
49067 3194555 3179416 3165373 3151998 3139169 3127125 3116181 3106153 3096143 3085115 3072707 3059403
49056 3059403 3046109 3033695 3022730 3013278 3004943 2997204 2989673 2982144 2974889 2969112 2966516 2967771 2971422
49043 2971422 2974680 2975170 2971711 2963921 2951967 2936873 2920460 2904550 2890335 2878497 2869611 2864161 2862218
49030 2862218 2863098 2865321 2867142 2867465 2866204 2863570 2859219 2852497 2843421 2832945 2822155 2811591 2801438
49017 2801438 2792015 2783843 2777412 2772961 2770280 2768632 2767138 2765360 2763422 2761623 2760188 2759382 2759459 2760335 2761479
49002 2761479 2762309 2762584 2762379 2761840 2760997 2759733 2757904 2755569 2752929 2749867 2745802 2740341 2733888 2727130 2720058
48987 2720058 2712086 2703152 2694089 2685731 2678187 2671138 2664325 2657490 2650458 2643569 2637520 2632418 2627540 2622309
48973 2622309 2616848 2611122 2604319 2595984 2587193 2579567 2573399 2567775 2562341 2557850 2554883 2553235 2552980 2555128
48959 2555128 2560538 2568877 2579308 2591649 2606146 2622512 2639953 2658002 2676775 2696559 2717666 2740447
48947 2740447 2764804 2789668 2813495 2835373 2855321 2873630 2890513 2906508 2922653 2939980 2959116
48936 2959116 2980517 3004739 3032233 3063096 3097165 3134159 3173642 3215257 3259205 3306181 3356563
48925 3356563 3409961 3465874 3524440 3586098 3650690 3717430 3785791 3855879 3927701 4000440 4072697
48914 4072697 4143331 4211901 4278490 4343258 4406013 4466026 4522389 4574721 4623504 4669607 4713505
48903 4713505 4755020 4793727 4829428 4862366 4893072 4921934 4948639 4972075 4990987 5004825 5013893
48892 5013893 5018818 5020241 5019027 5016260 5012591 5007708 5000884 4992095 4982245 4972173 4961685 4949768 4935611
48879 4935611 4919204 4901014 4881330 4859960 4836405 4810056 4780202 4746020 4706969 4663397 4616586
48868 4616586 4567868 4517641 4465498 4411408 4356430 4302062 4249139 4197648 4147475 4098900 4052380
48857 4052380 4008115 3965943 3925491 3886379 3848455 3811863 3776793 3743252 3711323 3681559 3654791
48846 3654791 3631427 3611199 3593734 3579076 3567428 3558562 3551705 3546062 3541426 3538451 3538350 3542111 3549802
48833 3549802 3560701 3574056 3589506 3606683 3624786 3642906 3660600 3677879 3694721 3710866 3726122
48822 3726122 3740682 3755092 3769918 3785361 3801132 3816806 3832333 3847979 3863713 3878993 3893371
48811 3893371 3907018 3920370 3933474 3946104 3958417 3971080 3984742 3999647 4015792 4033222 4052142
48800 4052142 4072905 4095825 4120743 4146767 4172603 4197117 4219519 4239263 4256071 4270051 4281548
48789 4281548 4290966 4298908 4306236 4313626 4321036 4327723 4332610 4334512 4332413 4326040 4315971 4302804 4286493
$$ [...]
##END NTUPLES=NMR SPECTRUM
##END=
