##TITLE=AC1634_CENAH_8493886_MCCc2BPXdY
##JCAMPDX= 6.0         $$ Bruker NMR JCAMP-DX V2.0
##DATA TYPE= NMR SPECTRUM
##DATA CLASS= NTUPLES
##ORIGIN= BRUKER
##OWNER= Administrator
$$ 1.72 TOPSPIN		Version 2.1
$$ 2014-02-18 18:35:24.801 -0800  Administrator@X
$$ Compression mode = diff/dup
##.OBSERVE FREQUENCY= 400.02188249412
##.OBSERVE NUCLEUS= ^1H
##.ACQUISITION MODE= SIMULTANEOUS (DQD)
##.ACQUISITION SCHEME= undefined
##.AVERAGES= 8
##.DIGITISER RES= 22
##SPECTROMETER/DATA SYSTEM= spect
##.PULSE SEQUENCE= zg30
##.SOLVENT NAME= COFFEE_meoh
##.SHIFT REFERENCE= INTERNAL, COFFEE_meoh, 1, 14.98509
##AUDIT TRAIL= $$ (NUMBER, WHEN, WHO, WHERE, PROCESS, VERSION, WHAT)
$$ ##TITLE= Audit trail, TOPSPIN		Version 2.1
$$ ##JCAMPDX= 5.01
$$ ##ORIGIN= Bruker BioSpin GmbH
$$ ##OWNER= Administrator
$$ $$ E:\/data/COFFEE/nmr/AC1634_CENAH_8493886_MCCc2BPXdY/10/pdata/1/auditp.txt
$$ ##AUDIT TRAIL=  $$ (NUMBER, WHEN, WHO, WHERE, PROCESS, VERSION, WHAT)
(   1,<2014-02-18 18:35:18.270 -0800>,<Administrator>,<X>,<go>,<TOPSPIN 2.1>,
      <created by zg
	started at 2014-02-18 18:34:12.520 -0800,
	POWCHK enabled, PULCHK disabled,
       configuration hash MD5:
       C8 4E 4E 5D D3 5C D8 9E 9F 52 82 E0 59 8A DE 15
       data hash MD5: 64K
       93 59 4B 27 B9 E1 1A 69 9B 86 AD D7 5A C0 F8 40>)
(   2,<2014-02-18 18:35:21.130 -0800>,<Administrator>,<X>,<proc1d>,<TOPSPIN 2.1>,
      <Start of raw data processing
       efp LB = 0 FT_mod = 6 PKNL = 1 PHC0 = 0 PHC1 = 0 SI = 32K 
       data hash MD5: 32K
       5A 71 D9 B1 0D 2A 74 B5 3E C1 AA E2 40 FA 97 51>)
(   3,<2014-02-18 18:35:21.411 -0800>,<Administrator>,<X>,<proc1d>,<TOPSPIN 2.1>,
      <pk PHC0 = 95.00427 PHC1 = 0 
       data hash MD5: 32K
       0D 0D B8 60 2F 99 04 F5 AE 2F 67 9B 24 6D 9D FD>)
(   4,<2014-02-18 18:35:21.505 -0800>,<Administrator>,<X>,<proc1d>,<TOPSPIN 2.1>,
      <abs ABSG = 1 
       data hash MD5: 32K
       00 75 9E 46 9E 14 0A 1B FF DA 32 AA 6B 5A 2A F3>)
(   5,<2014-02-18 18:35:21.583 -0800>,<Administrator>,<X>,<proc1d>,<TOPSPIN 2.1>,
      <abs ABSG = 2 
       data hash MD5: 32K
       B3 6D 78 04 B2 21 65 73 5C 62 AF 62 3B 9D EC 77>)
(   6,<2014-02-18 18:35:21.645 -0800>,<Administrator>,<X>,<proc1d>,<TOPSPIN 2.1>,
      <abs ABSG = 3 
       data hash MD5: 32K
       D9 D6 81 C1 EB 68 34 D3 B2 FF BF 08 22 74 ED E7>)
(   7,<2014-02-18 18:35:21.708 -0800>,<Administrator>,<X>,<proc1d>,<TOPSPIN 2.1>,
      <abs ABSG = 4 
       data hash MD5: 32K
       53 26 64 7F D5 03 36 13 0F B0 2D C1 F1 BC 21 7E>)
(   8,<2014-02-18 18:35:21.755 -0800>,<Administrator>,<X>,<proc1d>,<TOPSPIN 2.1>,
      <abs ABSG = 5 
       data hash MD5: 32K
       27 9C 0C 34 9B D6 2A 86 D3 FF 8C 81 F6 90 BB 25>)
$$ ##END=
$$ 
$$ $$ hash MD5
$$ $$ 7A 53 14 B5 58 CB DE 2F B0 D7 69 CF 9B A4 1E 66
##$RELAX= 
##$RELAX= 
##$RELAX= 
##$RELAX= 
##$RELAX= 
##$RELAX= 
##$RELAX= 
$$ Bruker specific parameters
$$ --------------------------
##$DU= <E:\>
##$EXPNO= 10
##$NAME= <AC1634_CENAH_8493886_MCCc2BPXdY>
##$PROCNO= 1
$$ [...]
##$TP= (0..7)
150 150 150 150 150 150 150 150
##$TP07= 0
##$TPNAME0= <>
##$TPNAME1= <>
##$TPNAME2= <>
##$TPNAME3= <>
##$TPNAME4= <>
##$TPNAME5= <>
##$TPNAME6= <>
##$TPNAME7= <>
##$TPOAL= (0..7)
0.5 0.5 0.5 0.5 0.5 0.5 0.5 0.5
##$TPOFFS= (0..7)
0 0 0 0 0 0 0 0
##$TUNHIN= 0
##$TUNHOUT= 0
##$TUNXOUT= 0
##$USERA1= <user>
##$USERA2= <user>
##$USERA3= <user>
##$USERA4= <user>
##$USERA5= <user>
##$V9= 5
##$VALIST= <valist>
##$VCLIST= <CCCCCCCCCCCCCCC>
##$VD= 0
##$VDLIST= <DDDDDDDDDDDDDDD>
##$VPLIST= <PPPPPPPPPPPPPPP>
##$VTLIST= <TTTTTTTTTTTTTTT>
##$WBST= 2048
##$WBSW= 25
##$XGAIN= (0..3)
0 0 0 0
##$XL= 0
##$YL= 0
##$YMAX_a= 599993
##$YMIN_a= -511004
##$ZGOPTNS= <>
##$ZL1= 120
##$ZL2= 120
##$ZL3= 120
##$ZL4= 120
##$ABSF1= 14.98509
##$ABSF2= -5.573092
##$ABSG= 5
##$ABSL= 3
##$ALPHA= 0
##$AQORDER= 0
##$ASSFAC= 0
##$ASSFACI= 0
##$ASSFACX= 0
##$ASSWID= 0
##$AUNMP= <proc_prof1d_extract_pilot.lims>
##$AXLEFT= 0
##$AXNAME= <>
##$AXNUC= <1H>
##$AXRIGHT= 0
##$AXTYPE= 0
##$AXUNIT= <>
##$AZFE= 0.1
##$AZFW= 0.1
##$BCFW= 0
##$BC_mod= 0
##$BYTORDP= 0
##$COROFFS= 0
##$CY= 15
##$DATMOD= 1
##$DC= 0
##$DFILT= <>
##$DTYPP= 0
##$F1P= 0
##$F2P= 0
##$FCOR= 0.5
##$FTSIZE= 32768
##$FT_mod= 6
##$GAMMA= 0
##$GB= 0
##$INTBC= 1
##$INTSCL= 1
##$ISEN= 128
##$LB= 0
##$LEV0= 0
##$LPBIN= 0
##$MAXI= 10000
##$MC2= 0
##$MEAN= 0
##$ME_mod= 0
##$MI= 0
##$NCOEF= 0
##$NC_proc= -8
##$NLEV= 6
##$NOISF1= 0
##$NOISF2= 0
##$NSP= 0
##$NTH_PI= 0
##$NZP= 0
##$OFFSET= 14.98509
##$PC= 1
##$PHC0= 95.00427
##$PHC1= 0
##$PH_mod= 1
##$PKNL= yes
##$PPARMOD= 0
##$PPDIAG= 0
##$PPIPTYP= 0
##$PPMPNUM= 2147483647
##$PPRESOL= 1
##$PSCAL= 4
##$PSIGN= 0
##$PYNMP= <proc.py>
##$REVERSE= no
##$SF= 400.02
##$SI= 32768
##$SIGF1= 0
##$SIGF2= 0
##$SINO= 400
##$SIOLD= 32768
##$SPECTYP= <>
##$SREGLST= <1H.CDCl3>
##$SSB= 0
##$STSI= 32768
##$STSR= 0
##$SW_p= 8223.68421052631
##$SYMM= 0
##$S_DEV= 0
##$TDeff= 65536
##$TDoff= 0
##$TI= <>
##$TILT= no
##$TM1= 0
##$TM2= 0
##$TOPLEV= 0
##$USERP1= <user>
##$USERP2= <user>
##$USERP3= <user>
##$USERP4= <user>
##$USERP5= <user>
##$WDW= 1
##$XDIM= 32768
##$YMAX_p= 474126771
##$YMIN_p= -671237
##$CURPLOT= <Network HP LaserJet P1505>
##$CURPRIN= <$Network HP LaserJet P1505>
##$DFORMAT= <normdp>
##$LAYOUT= <+/1D_H.xwp>
##$LFORMAT= <normlp>
##$PFORMAT= <normpl>
##$SURQMSG= 1
$$ End of Bruker specific parameters
$$ ---------------------------------
##NTUPLES= NMR SPECTRUM
##VAR_NAME=  FREQUENCY,     SPECTRUM/REAL,   SPECTRUM/IMAG
##SYMBOL=    X,             R,               I
##VAR_TYPE=  INDEPENDENT,   DEPENDENT,       DEPENDENT
##VAR_FORM=  AFFN,          ASDF,            ASDF
##VAR_DIM=   32768,         32768,           32768
##UNITS=     HZ,            ARBITRARY UNITS, ARBITRARY UNITS
##FACTOR=    0.250966925370066, 1,           1
##FIRST=     8223.43324360094, 50649,        14552
##LAST=      0,             4563,            48248
##MIN=       0,             -671237,         0
##MAX=       8223.43324360094, 474126771,    0
$$ Real data points
##PAGE= N=1
##DATA TABLE= (X++(R..R)), XYDATA
$$ [...]
19578a27279A690J10730c07494E195a76386F6394a19710r0807j99467a69180P6089
19567i3091j45477f0089J8257j50870H3887K7659Q499h0445j90796C10067q1802
19556B28265c3971B22107n9354n9963C0015b26454J48J05623b1392q5040H8327
19544I0026B3437a32887A00688K7652d97G2302D74b15084n6712e0230I3033b1045
19531B44925a37754A43506E4898a25803j3507j23016Q7254l18124a63554K5895
19521a37659B87411D0671J44487b38130e4684A98235m6140b05549A20300J40852
19511B61152o9616c79155A38096b81493B0326J85142C3053a86989d022j63618
19501a67640P9433D025e8528C0030c30463A02467k0715h0825b9934k05101C31207
$$ y = [-127279, 1690, 112420, -307494, 5195, -176386, 66394, -119710, -210517, -409984, -169180, -93091, -238568, -60089, -41832, -192702, 83887, 111546, 120045, -80445, -271241, 310067, 228265, -33971, 222107, 162753, 102790, 30015, -226454, -226306, -120683, -21392, -106432, 88327, 90026, 23437, -132887, 100688, 128340, -497, 72302, 474, -215084, -271796, -50230, 93033, -21045, 244925, -137754, 143506, 54898, -125803, -139310, -262326, -175072, -493196, -163554, -137659, 287411, 40671, 185158, -238130, -54684, 198235, 152095, -205549, 120300, 261152, 191536, -379155, 138096, -281493, 20326, 205468, 33053, -186989, -4022, -167640, -88207, 4025, -58528, 30030, -330463, 102467, 81752, -80825, -29934, -235035, 331207]
19489B07003R752a47030d2550A48911b57628l00218b26217A81885f1901J029j02316
19478a63188p7509I6978b20986K4366D5771K10641D2067f5332j01634f1595E9776
19466D1083a37921a5529k46032C4007d48978A62681O940b14832A3975N2426a45191
19454d5170J9119B7311j1700f6983o2245K2032A68266g6191j25360c92B8715b8332
19441b18795d2759k6216o7450j79105J45573N7500p7489R2447j17432k12607b12976
19429a98028E7753i8635D7573R1645a31453G508K7648a09401j54641N3919k12696
19418d22819c5475j8158j44851A8443a58653e4927I3328d3759l4454j6338l3971
19407a28522b1890p1684b4223j85781i0434k91373a60138f7916A36022c45787
$$ y = [207003, 216755, -147030, -42550, 148911, -257628, -557846, -226217, 181885, -61901, -60872, -163188, -240697, 96978, -220986, -196620, 45771, 256412, 42067, -65332, -166966, -61595, 59776, 41083, -137921, -15529, -261561, 34007, -448978, 162681, 169621, -214832, 13975, 66401, -145191, -45170, -26051, 27311, 15611, -66983, -129228, -107196, 168266, -76191, -201551, -392, 28715, -28332, -218795, -42759, -68975, -136425, -315530, -169957, -112457, -189946, -97499, -214931, -427538, -212976, -198028, 57753, -98635, 47573, 139218, -131453, 7508, 35156, -109401, -264042, -210123, -422819, -35475, -53633, -198484, 18443, -158653, -54927, 93328, -43759, -78213, -94551, -128522, -21890, -93574, -24223, -210004, -90434, -381807, -160138, -67916, 136022, -345787]
19396B45251d15499H9743g4536k53162i8696l21269a71774j3823A38397P6962
19386B15359i652H3329B0495K88369a01946l7359j04978D5190d45928A02697m2294
19375F0403a04738k1144e8481A00348M9240b76405B4759O245b41638i1338j1164
19364a02502k0095K4268o8052A12303R2220a05137l9621B39608i3924m6361A27643
19352e2821B60622d30298a17889a0275C5871Q9519a13603D6061K4404J25235b65125
19340f1758o0189c006j01921A40770a53434p5010Q7028E5202a85057Q9807A26156
19328h1493m96976a50708o383f5713B24450a92143h590j80353E2759o916e9371
19316B36210a74453A93954i4794j36307i0684l08870a24871e1677A2814b77730
$$ y = [245251, -415499, 89743, -74536, -327698, -98696, -419965, -171774, -185597, 138397, 215359, -9652, 83329, 20495, 308864, -101946, -139305, -244283, 45190, -445928, 102697, 60403, -104738, -125882, -58481, 100348, 149588, -276405, 24759, 31004, -241638, -91338, -102502, -122597, -98329, -166381, 112303, 204523, -105137, -144758, 239608, -93924, -140285, 127643, -52821, 260622, -430298, -117889, -10275, 35871, 125390, -113603, 46061, 70465, 195700, -265125, -61758, -121947, -3006, -104927, 140770, -153434, -228444, -141416, 55202, -185057, -95250, 126156, -81493, -578469, -150708, -157091, -65713, 224450, -192143, -8590, -188943, 52759, 45843, -59371, 236210, -174453, 193954, -94794, -231101, -90684, -399554, -124871, -51677, 12814, -277730]
19305I5121P0537p6056h7440r5953C6320M5857a25175k8981G6518b07797P1897
19294a35900M6966m477A05112a3722A93224a6853m73898b2665j44664B19152A8729
19282b9973l3466B65574b00311a22G2167B0209i6270c2468L364k72075J37511
19271a63668N6633O200a044q625C8242a93287D5243M6255m2249N1329g2831D5575
19258c6602o960q967k3338H7438a73109C08125c15653A69821J74612B2756a41113
19246D5185P0504h7036d33B1287a62476A00948a83964Q6185k81727a86711B3690
19234b37613A55622J28015h4505k3724c9331n2437K9134q3881L3817o3042A88585
19222a92877O5300C8404e662A20494m5425a47421A1355J93913c63264J26319A56556
$$ y = [95121, 165658, 89602, -87440, -183393, 36320, 82177, -125175, -154156, 76518, -207797, -135900, -88934, -93411, 105112, -13722, 193224, -16853, -490751, -22665, -167329, 219152, 18729, -29973, -63439, 265574, -200311, -122, 72167, 20209, -96270, -32468, -29104, -301179, -163668, -107035, -100835, -1044, -9669, 38242, -193287, 45243, 91498, 49249, 100578, -72831, 45575, -36602, -43562, -52529, -75867, 87438, -173109, 308125, -315653, 169821, 344433, 22756, -141113, 45185, 115689, -87036, -433, 21287, -162476, 100948, -183964, -97779, -379506, -186711, 23690, -237613, 155622, 283637, -84505, -108229, -39331, -91768, -62634, -146515, -112698, -175740, 188585, -192877, -127577, 38404, -5662, 120494, 75069, -147421, 11355, 205268, -363264, -236945, 156556]
19210i774j45142j1768A53653c19446A73475a91093A88109B0441J1354a47739
19199f1179K1778B70970a87147F4804g5913E308O3821d14340a17075B460a86873
19187a18909A05585b7416B0631b55172I4890J93285j26574c90819A1313i8215
19176E1636B3353b26105j93839A27620b8201B64260e1280j43039B82942B0010
19165a27954B2608R001M48A1670g2836k09973A33455c31900a6438k80462J32240
19154a64660L0718a7271E6122b34810M954a07325A14816b54557C81303H8502a11926
19142b11121f4324p5796J570A86418d62550J48957e7269C7370b04493D5292g7701
19130g4188C9146J047c7645r7660d5508A71069b05371A75557A5685b94379c4442
$$ y = [-9774, -154916, -166684, 153653, -319446, 173475, -191093, 188109, 20441, 31795, -147739, -61179, -39401, 270970, -187147, 64804, -75913, 5308, 69129, -414340, -117075, 2460, -186873, -118909, 105585, -27416, 20631, -255172, 94890, 288175, 161601, -390819, 11313, -98215, 51636, 23353, -226105, -419944, 127620, -28201, 264260, -51280, -194319, 282942, 20010, -127954, 22608, 31609, 32057, 11670, -72836, -282809, 133455, -331900, -16438, -296900, -164660, -133942, -17271, 56122, -234810, -229856, -107325, 114816, -254557, 381303, 88502, -111926, -211121, -64324, -140120, -138550, 186418, -462550, -313593, -57269, 37370, -204493, 45292, -77701, -74188, 39146, 40193, -37645, -135305, -45508, 171069, -205371, 175557, 15685, -294379, -34442]
19118c30656B33803F3802f6435K9748m29440i2847j10412o037H8480a15592L0537
19107h5055L7909A63036b08061P5034N4295L3652A87672Q802e1858B54372c48032
19095c17649a30529l68541f5471G837a16201H3304K2885k0132J70260C885b72207
19083H4438a87079N4474m7113A56672a4341B83245D7796a99938A59128a73047
19072a3538B11235b04699G0262b00083A87243A6254a08073L2390F2779A8d63041
19060b22441D18184a51717J8669H9372B6392c7761o5983K4013l37248K05664J7398
19049a93917P3062k5600a9639B0826b65344F9376B4956d89248C04430b25374C4076
19037a56763A60464A6461a4927F2471d02127A83073H3478L39978A10723L42479
$$ y = [-330656, 233803, 63802, -66435, -36687, -466127, -92847, -203259, -209296, 88480, -115592, -85055, -47146, 163036, -208061, -133027, -78732, -45080, 187672, 196474, -51858, 254372, -348032, -317649, -130529, -499070, -65471, 7837, -116201, 83304, 106189, 86057, 256317, 3885, -272207, 84438, -187079, -132605, -179718, 156672, -14341, 283245, 47796, -199938, 159128, -173047, -13538, 211235, -204699, 70262, -200083, 187243, 16254, -108073, -75683, 62779, 18, -463041, -222441, 418184, -151717, -133048, 89372, 26392, -37761, -103744, -79731, -416979, -211315, -193917, -120855, -146455, -19639, 20826, -265344, 69376, 24956, -489248, 304430, -225374, 34076, -156763, 160464, 16461, -14927, 62471, -402127, 183073, 83478, 423456, 110723, 453202]
19027D53202j97717c5385A63579a43766A00613l3579f114j08382r4486O0822N5415
19016i2745B59126F658c01947J20654A54839b1922j04972j38903j0282J25502
19006a50577f5719j52403J06899F9070J73618b30765I1345a22688r920F5991a78554
18994a47502H9487b54643A07052J3758J13936H1004d0118j56672R0426j74878
18984b81242A04786b16750c8025k42034k9499g7646J5775I703R3626K5815c01705
18972c4645D3419J13079J2050q3036a30114l3540k2746j99079C9055e2209j0921
18961f3130C89715a11165F9281c7871q5453B05094g000l40874a48415p8247C4607
18949b51969c6519c642j64830F8380b5964B2445N3778d1595j30891A41865b73019
$$ y = [453202, 255485, -35385, 163579, -143766, 100613, 67034, -6114, -114496, -208982, -148160, -92745, 259126, 6658, -301947, -181293, 154839, -21922, -126894, -265797, -276079, -150577, -65719, -218122, -111223, 69070, 242688, -230765, 91345, -122688, -132608, 65991, -178554, -147502, 89487, -254643, 107052, 120810, 234746, 81004, -40118, -196790, -106364, -281242, 104786, -216750, -38025, -280059, -309558, -77646, -61871, 9703, 103329, 129144, -301705, -34645, 43419, 156498, 168548, 85512, -130114, -163654, -186400, -385479, 39055, -52209, -63130, 389715, -111165, 69281, -37871, -123324, 205094, -7000, -347874, -148415, -226662, 34607, -251969, -36519, -3642, -168472, 68380, -25964, 22445, 76223, -41595, -172486, 141865, -273019]
18937e70324C588a63655D48181a31608a5295j38984A38025d5222C80039p2120
18927C07919a27886r6156k15921b12385C3991d5536A77949b25481B58944b72550
18916e6524j88755i9721H8950c41105a14381B59028a37714r5061G90P8834K37771
18905C17395B4637a82865L7886A843i6506A64267b39878D51e9444j18535G912
18893a31493A32566a29333A42995J78597a19369j30233A33017k4397a46564B65023
18882A766a12352k53365a0988B31056a42979q1461L2823k62647a60456I366L8627
18871D7993a49639L3161K1363k24335e096G1077h7328K4504B17385F8659i0538
18859D48256a72424c3578A0014K8890d21900G3027K15284e4726A49170m6864h4528
$$ y = [-570324, 3588, -163655, 448181, -131608, -15295, -154279, 138025, -45222, 380039, 307919, -127886, -224042, -439963, -212385, 33991, -45536, 177949, -225481, 258944, -272550, -56524, -245279, -99721, 88950, -341105, -114381, 259028, -137714, -232775, 790, 79624, 317395, 24637, -182865, -144979, 1843, -96506, 164267, -239878, 451, -59444, -177979, 7912, -131493, 132566, -129333, 142995, 321592, -119369, -249602, 133017, 108620, -146564, 265023, 1766, -112352, -365717, -10988, 231056, -142979, -224440, -191617, -454264, -160456, 9366, 47993, -149639, -116478, -95115, -319450, -5096, 71077, -87328, -62824, 217385, 68659, -90538, 448256, -172424, -33578, 10014, 38904, -421900, 73027, 288311, -54726, 149170, 102306, -84528]
18847e8949a1455H855M29881d5955F9400e499H9276b62753A64237B2345a45835
18835f507F7635J38070f9524j51108e5682A33862b62430c4013q4091n9284j6004
18824a93392l7798k9375R9106L6796D9144J67191B84d985A49863n2250k7937J77281
18812B46957N0981R269j3514e2707A03329J69566D3653b27667e963m76510a82326
18800h7105C9590e1829q7804K2058m31309A14453k7011a91397B3911d12236g1328
18788a2426P57j61663B12428G336a59459B70429c16704a24449j94297F9811b2454
18776a25215r2193i8954p6477I0278a82999n1716R4047n4467J7916N9152C8829
18764c20184G8789b75650A81618b38867A01287N8937a56263O9006A04802L41J46109
$$ y = [-58949, -11455, 8855, 438736, -45955, 69400, -5499, 89276, -262753, 164237, 22345, -145835, -6507, 67635, 205705, -69524, -220632, -55682, 133862, -262430, -34013, -118104, -177388, -193392, -231190, -260565, -161459, -124663, 49144, 216335, 284, -4985, 149863, 97613, 69676, 246957, 297938, 307207, 293693, -52707, 103329, 272895, 43653, -227667, -5963, -482473, -182326, -87105, 39590, -51829, -139633, -117575, -548884, 114453, 87442, -191397, 23911, -412236, -71328, -12426, -11669, -173332, 212428, 7336, -159459, 270429, -316704, -124449, -318746, 69811, -22454, -125215, -217408, -98954, -175431, 90278, -182999, -234715, -140668, -195135, -177219, -118067, 38829, -320184, 78789, -275650, 181618, -238867, 101287, 160224, -156263, -87257, 104802, 105143, 251252]
18753B51252h1437r1613A58012c30563A34610H768K51323a04817A79715a03572
18742G7304f9270J0391l57215A48023a21543M5484A094Q2917a24304n898k1532
18731a51734a4461j16743o7586M1974b9085j99846B70024a44108N271C85737e32704
18719F8549N4265k0757b41668N1815C333K6705g0262D5961h3145E6459F506a58641
18706b43093R2114B07519c4377l60986e5012k63468b7272j09576H4350d76351
18695h6782A46314C1896C870O2618c33319A55742a03976C3547J13335K28902B9987
18683A33999c31507J21097g2126j00731C20727b40983g0593B41771c1420B35815
18672b59914j01192Q5906k29205a79745h3323B12283G3797a90748C3487N6243
$$ y = [251252, -81437, -173050, 158012, -330563, 134610, 8768, 260091, -104817, 179715, -103572, 77304, -69270, -58879, -416094, 148023, -121543, -76059, 1094, 84011, -124304, -130202, -151734, -14461, -131204, -198790, -156816, -29085, -228931, 270024, -144108, -138837, 385737, -532704, 68549, 122814, 102057, -241668, -189853, 3333, 30038, -70262, 45961, -83145, 56459, 6506, -158641, -243093, -150979, 207519, -34377, -395363, -55012, -318480, -27272, -136848, 84350, -476351, -86782, 146314, 31896, 3870, 66488, -333319, 155742, -103976, 33547, 146882, 375784, 29987, 133999, -331507, -210410, -72126, -172857, 320727, -240983, -70593, 241771, -31420, 235815, -259914, -361106, -275200, -504405, -179745, -83323, 212283, 73797, -190748, 33487, 89730]
18662H9730a06944A6327a826A28771b72706A02405f0865j41065A69277n6603B413
18650c4568A00536qe13821a50081A3081O9987k4252a17404k5611C49974a11283
18638b86178g9401j34721B06949a45497A12088j4102A7539f5796j38226A60576
18627a84678M7267j23523a1935p4266j24034d9461D6618J06895R271a04207M4727
18616e9480A2867J76592G6840G877J0097K31379B6838J17875N0532H3693a97181
18604B53097a87046N9358a2363C2462G896a29582f1810j21349B29243a57983E093
18592a27777C4506N4615j0766c89216E9859R1494b61436h2574j44233J6391A80279
18580c65138a75773g7431E6327f1350j56413j39418H8973O0878a36217f2715J7373
$$ y = [89730, -106944, 16327, -1826, 128771, -272706, 102405, -60865, -201930, 169277, 112674, 2413, -34568, 100536, 100528, -513821, -150081, 13081, 83068, 58816, -117404, -143015, 349974, -111283, -286178, -79401, -214122, 206949, -145497, 112088, 97986, 17539, -65796, -204022, 160576, -184678, -137411, -260934, -11935, -86201, -210235, -49461, 46618, 153513, 162784, -104207, -59480, 12867, 189459, 76840, 7877, 17974, 249353, 26838, 144713, 195245, 83693, -197181, 253097, -187046, -127688, -12363, 32462, 7896, -129582, -61810, -183159, 229243, -157983, 5093, -127777, 34506, 89121, 78355, -389216, 59859, 151353, -261436, -82574, -226807, -210416, 180279, -365138, -175773, -77431, 56327, -61350, -217763, -357181, 88973, 149851, -136217, -62715, -45342]
18569d5342C7907A4737a31380C768f2754j90466a16148I5521J58425c6494A5221
18557b41994B6661c00743o2108A23636J86621f2151A72778d23279H3445a29289
18546b37460A68179a30556k68939A3547d08062a01349B5294b00275K3957C30633
18535F7052j5107b3008I5880L0950C1883A5393R2564K7337a34093B18196r3406
18524A24790C9449O2034a64509a7406j88875D4832K78661i6783n6278B54011o6207
18513A87804e1064B10775g3013K7077D0600D7Q860J91656d274j36629n9568j95652
18501c96123f436m2789J7708I8383d9500l35546E3541b2012j62555l9398A85672
18489C23591c6855A94661C1483a54907N8847A48595a73521J7624B08223c23115
$$ y = [-45342, 37907, 14737, -131380, 3768, -62754, -253220, -116148, 95521, 253946, -36494, 15221, -241994, 26661, -300743, -362851, 123636, 310257, -62151, 172778, -423279, 83445, -129289, -237460, 168179, -130556, -399495, 13547, -408062, -101349, 25294, -200275, -176318, 330633, 67052, 51945, -23008, 95880, 126830, 31883, 15393, 107957, 135294, -134093, 218196, 124790, 39449, 101483, -164509, -17406, -206281, 44832, 323493, -96783, -153061, 254011, 187804, -51064, 210775, -73013, -45936, 40600, 47, 8907, 200563, -4274, -140903, -200471, -396123, -6436, -49225, -31517, 98383, -49500, -385046, 53541, -22012, -184567, -223965, 185672, 323591, -36855, 194661, 31483, -154907, -96060, 148595, -173521, -155897, 208223, -323115]
18478C1451a39015b1696l39000F9815K37288A51705a7253A51047B7519a94164
18467a68849J7625j46220I3934a92707B28475a8106B17062b47515g0220J6527
18457e3693j1548k55778A47587a82228N2159j31389d3089F6075N283B6942i6695
18445A55827a31745B17814I3317g2476A9595a29492j7444p5636a07218F6988d62215
18433h6348B52676F642b9713A69627P883p5165a9713j31930A83735a10096I6630
18421b68335a2349j48148j26589A20666M8376b11679I7213C4175Q2303b20771
18410A17592K15825A66460R5563D1814a42494B78867j15435j7855a03722A81360
18399a33852n3189A60821p6292a32675N3009k03007J02170A98465e0496o4747
$$ y = [31451, -139015, -21696, -360696, 69815, 307103, 151705, -17253, 151047, 27519, -194164, -168849, -151224, -297444, 93934, -192707, 228475, -18106, 217062, -247515, -70220, -53693, -65241, -321019, 147587, -182228, -130069, -261458, -43089, 66075, 71358, 26942, -96695, 155827, -131745, 217814, 93317, -72476, 19595, -129492, -146936, -222572, -107218, 66988, -462215, -86348, 252676, 6642, -29713, 169627, 177510, 102345, -19713, -151643, 183735, -110096, 96630, -268335, -12349, -160497, -287086, 120666, 169042, -211679, 97213, 34175, 116478, -220771, 117592, 333417, 166460, 262023, 41814, -142494, 278867, 163432, 145577, -103722, 181360, -133852, -187041, 160821, 84529, -132675, -79666, -282673, -180503, 198465, -50496, -115243]
18389a15243d7741A08213a04122k01292J50641f3304A47477e6866l05798A83480
18378a62883c0475A6881N4967d2269d798A3585a90205A69574f4305j19595E6272
18366I4619f2718o83C39311H8099b8868B21883l7793E7231a94896B8155a52785
18354b46469d1414k856G5649c29598b5601r8906A4805a8712B90916A6029J29614
18343A45643E4341b14382a7137k0090C212J23434D77b48699c5254o8415j5252
18332a18921A25954c02698h009B99126b90162B836b98663D192f9826j66001a4928
18320c73422B2354J05199k7044c4056A32551c3331R757B02542o3021n6741a24449
18308b00700a3445j4214o2929m7469j85584a30333k04608a13427C6707a21710
$$ y = [-115243, -47741, 108213, -104122, -305414, -154773, -63304, 147477, -56866, -362664, 183480, -162883, -30475, 16881, 71848, -42269, -4798, 13585, -190205, 169574, -64305, -183900, 56272, 94619, -62718, -63401, 339311, 88099, -28868, 221883, 184090, 57231, -194896, 28155, -152785, -246469, -41414, -44270, 75649, -329598, -25601, -124507, 14805, -18712, 290916, 16029, 145643, 54341, -214382, -17137, -37227, 3212, 126646, 477, -248699, -35254, -103669, -118921, 125954, -302698, -8009, 299126, -290162, 2836, -298663, 4192, -69826, -235827, -14928, -373422, 22354, 127553, 100509, -34056, 132551, -33331, -23574, 202542, 139521, 82780, -124449, -200700, -13445, -27659, -90588, -138057, -323641, -130333, -334941, -113427, 36707, -121710]
18297a17615P683H2458a20541o4308M769A07147B3470D779h9004o2597j04514
18286b56115D4902b77338k9973J33289j35237B4056i6938k1866c9665D8366c95831
18274I1156a62774D5643K22777C5611b63170A53853C8853c1453A72350b25640
18263c34773a66684E5846a66872m9485e5683l45915A59266K5331f0864j01241
18253a62105D0950b1823n8169D0770b32924L0770e085k2389A00376a22160Q51
18242a21309A10498a16389j23608J10405j12406R1138D7232e8518A22502c0857
18231g0362j09454B91913a11636C6138a57935k16128f3575A40568m3148d3070
18220a20459j30317A79823h7144H3124d77248H7743a53645E105J48773i2143B8323
$$ y = [-117615, -109932, 82458, -120541, -184849, -180080, 107147, 23470, 4779, -89004, -151601, -256115, 44902, -277338, -307311, -174022, -309259, 24056, -96938, -118804, -39665, 48366, -395831, 91156, -162774, 45643, 268420, 35611, -263170, 153853, 38853, -31453, 172350, -225640, -334773, -166684, 55846, -166872, -216357, -55683, -401598, 159266, 184597, -60864, -162105, 40950, -21823, -79992, 40770, -232924, -202154, -5085, -27474, 100376, -122160, -121309, 110498, -116389, -239997, -129592, -241998, -150860, 47232, -58518, 122502, -30857, -70362, -179816, 291913, -111636, 36138, -157935, -374063, -63575, 140568, 97420, -43070, -120459, -250776, 179823, -87144, 83124, -477248, 87743, -153645, 5105, 153878, -92143, 28323]
18208G6740c65497J46379A5584J35478M4249b07089C00811j26439n5790a0286
18197b08009j36676e9021I2178C5570b89428A90769o2113a03873H807L2875J84449
18186B26131a59249d4921A83147a82511g2111A79926a43443k58755a67339f9343
18175A99869k3010J08927b30249R2140e5986l50500A31410c6819l29999a56869
18164D8305J22843A8163J04392O699o3064Q8594g9172r1420I0842a5023A00784
18152a00088k3866k24039a62098A12665N6501a11166C53144j17579G5063f1587
18141f9705B08199a41765M0381B55548A16357A969d42614a0879A19982m6935J3514
18130H6561d956j41540N3014m3846D9204i9007A61641b70673g3529o3668C29994
$$ y = [76740, -365497, -219118, 15584, 151062, 195311, -207089, 300811, 174372, 118582, -10286, -208009, -344685, -59021, 92178, 35570, -289428, 190769, 128656, -103873, 8807, 41682, 226131, -159249, -44921, 183147, -182511, -72111, 179926, -143443, -402198, -167339, -69343, 199869, 176859, 285786, -230249, -138109, -55986, -406486, 131410, -36819, -366818, -156869, 48305, 171148, 18163, 122555, 129254, 66190, 154784, -79172, -170592, 90842, -15023, 100784, -100088, -123954, -347993, -162098, 112665, 169166, -111166, 353144, 235565, 75063, -61587, -69705, 208199, -141765, -101384, 255548, 116357, 1969, -442614, -10879, 119982, 73047, 86561, -4956, -146496, -93482, -137328, 49204, -99007, 161641, -270673, -73529, -137197, 329994]
18118a9145H3296b06262o5421g4809E347J2788A770b1453A95325b07433A60195
18106A51510g8425J7877A4090e28136b29810q9637K3046E7560b32824a02175j89977
18095b92152H6500a71548Q3550A16527a8940m8386j91782F184a31185r3957A24174
18083C8319J72532g747j75435j1049a0536j5917j47916e7509C01981g0356k8057
18072i8413D9158L7657b94143a09543F1893a79934g2364m59360b39316E6742a65631
18060B26799b9548j70455K7635A64975p6172M3627a84804g3759n162l40865J76024
18049b43762N4013A10940A8641d2397j06996A69660N1182B7131L155a08681l7869
18038a46550J6324M5740F7745k0819b25899I8894e2268b2935j474A25886g8206
$$ y = [-19145, 83296, -206262, -271683, -74809, 5347, 18135, 1770, -21453, 195325, -207433, 160195, 151510, -78425, -60548, 14090, -528136, -229810, -319447, -296401, 57560, -232824, -102175, -292152, 86500, -171548, -87998, 116527, -18940, -67326, -259108, 6184, -131185, -225142, 124174, 38319, 210851, -7747, -183182, -194231, -10536, -26453, -174369, -57509, 301981, -70356, -98413, 49158, 86815, -294143, -109543, 61893, -179934, -72364, -531724, -239316, 56742, -165631, 226799, -29548, -200003, -172368, 164975, 88803, 132430, -184804, -73759, -78921, -419786, -243762, -189749, 110940, 18641, -42397, -149393, 169660, 220842, 27131, 30286, -108681, -146550, -130226, -84486, 67745, 46926, -225899, 98894, -52268, -22935, -24409, 125886, -78206]
18026a02434i787j84448B65694f3886K3687j40773l25489a44819f047A10814B238
18014b29736h0127C1504c0588j39438C9821a79835Q3703C84624b37574N7002G0660
18002A50774a34488A18751a28715B44853k2843D9504i359j75453C11777a01171
17991A28579l4575C413c35442Q7518B08562G2689a53779A25503e6530G323i7533
17979b26591B11859J05898b87378G1037J01717b59700f6336k05807A10449R1275
17969B01724a74309A70102b25758b1139C7502c11723a41661A6218d36884O7391
17959c69493C9649J87501J17759j4682a6317F8608A606a66145I2314b06449i9554
17947B0790i6809d779B22346m9454b48523N8917A7260e5296l0559H8973B2995
$$ y = [-102434, -9787, -194235, 265694, -63886, -40199, -180972, -506461, -144819, -6047, 110814, 2238, -229736, -80127, 31504, -30588, -170026, 39821, -179835, -96132, 384624, -237574, -180572, 70660, 150774, -134488, 118751, -128715, 244853, 222010, 49504, -9359, -184812, 311777, -101171, 128579, 94004, 3413, -335442, -247924, 208562, 72689, -153779, 125503, -56530, 7323, -97533, -226591, 211859, 317757, -287378, 71037, 172754, -259700, -66336, -272143, 110449, 201724, -174309, 170102, -225758, -21139, 37502, -311723, -141661, 16218, -436884, -369493, 39649, 227150, 344909, 330227, -16317, 68608, 1606, -166145, 92314, -206449, -99554, 20790, -96809, -4779, 222346, 172892, -248523, -189606, 17260, -55296, -85855, 88973, 22995]
17935A64779b11651i613B19365h0861o6910G6448f4617a1062H2320a78593C0195
17923B5490J41114g8512A76455J1037E6940h0045D2613b00849R7462C32447A13559
17911a95477E7753c6804H2215J24501c62825D6356J94363c12654q1652a33156
17900a71811K3555G9306J16497n6237c7238r478A44381H272a33879B94081j32557
17889A61524a10043j79446N1319K6688d0054A46626l670c75762A81350j8102Q7620
17878B50868f5443F9321J4520b75342H6645a52789A24030c4587r2909k39853d6774
17866C24608a0636k2326B99513f0762l4585j8989k741N4807b403o1325o145E7334
17853b64572B02138Q9342C662a89386e3201A70145D1363a77899E0396d2908I5768
$$ y = [164779, -211651, -9613, 219365, -80861, -147771, 76448, -64617, -11062, 82320, -178593, 30195, 25490, 166604, -78512, 176455, 187492, 56940, -80045, 42613, -200849, -103387, 332447, 113559, -195477, 57753, -36804, 82215, 206716, -362825, 46356, 240719, -312654, -394306, -133156, -171811, -148256, 79306, 195803, 139566, -37238, -46716, 144381, 8272, -133879, 294081, 161524, -110043, -289489, -238170, -211482, -40054, 146626, 142956, -375762, 181350, 163248, 250868, -65443, 69321, 83841, -275342, 86645, -152789, 124030, -34587, -127496, -367349, -46774, 324608, -10636, -32962, 299513, -60762, -95347, -114336, -117077, -62270, -2403, -63728, -69873, 57334, -264572, 202138, 291480, 3662, -189386, -53201, 170145, 41363, -177899, 50396, -42908, 95768]
17841B32347f9506A57332r925a50722j00422B97612a60676F4056c22559B23136
17830B93413a45739A1985c5395p9078j51520a8035A81992a08222b1768q3809j02448
17819b08025A13126B2641b07232h0358K6039H3220i6813B27395f9330j30269C4244
17807A50294H713N0441k2754L1661L1548a32402A36940B5619J80897b44899B3073
17795f9503j60292P8776l0238C110L7218A1039a7669D06438a74070a7649j45020
17784a62669o8306B47500B7096f9025C3813e8276C7845e1712j06330B34671a63616
17772E6867p969b079j56132A8974b4546j48444A1652J35149K9474a1299A23806
17760C0617c97519A79135h8752K576J4645A08327f1176l8236l2068B05807B2403
$$ y = [232347, -69506, 157332, 147407, -150722, -251144, 297612, -160676, 64056, -322559, 223136, 293413, -145739, 11985, -35395, -114473, -265993, -18035, 181992, -108222, -21768, -105577, -208025, 113126, 22641, -207232, -80358, -54319, 83220, -96813, 227395, -69330, -199599, 34244, 150294, 8713, 59154, 36400, 68061, 99609, -132402, 136940, 25619, 206516, -244899, 23073, -69503, -229795, -151019, -181257, 3110, 40328, 11039, -17669, 406438, -174070, -17649, -162669, -230975, 247500, 27096, -69025, 33813, -58276, 37845, -51712, -158042, 234671, -163616, 56867, 48898, -2079, -158211, 18974, -24546, -172990, 11652, 146801, 176275, -11299, 123806, 30617, -397519, 179135, -88752, -86176, -71531, 108327, -61176, -99412, -131480, 205807, 22403]
17748H7713B55J95485b14492l7672g0714H8134D430b0670A33044F257R8240a35816
17735a76080I2915i9032H6107c12278f0671B56192a84283c4682K047k2158a1830
17723c9497j1393k7936E9520e5433l56553C8307a39410F4462J76330j827b16580
17711A97617a04082N1803D2869P5263c23325P0063B0821a68338B2561a91529a8744
17699B0101a33768C22683a18702k13636B38245L9035b13501f8667j57746b4041
17688c28346Q2672B4567b19701A23724a03955B25864b55349h6212B34971a38286
17677b87447E7457a53239e6206A26220e609I2237M1128K22803a72457B21809C3872
17665E6316J27458a30841j28965G3132R5488B7773b6935A75840J7805a1693j00314
$$ y = [87713, 255, 195740, -214492, -252164, -70714, 88134, 4430, -20670, 133044, 6257, 104497, -135816, -176080, 92915, -99032, 86107, -312278, -60671, 256192, -184283, -34682, -32635, -54793, -11830, -39497, -50890, -78826, 59520, -55433, -411986, 38307, -139410, 64462, 240792, 238965, -216580, 197617, -104082, -52279, 42869, 118132, -323325, -253262, 20821, -168338, 22561, -191529, -18744, 20101, -133768, 322683, -118702, -332338, 238245, 277280, -213501, -68667, -226413, -24041, -328346, -245674, 24567, -219701, 123724, -103955, 225864, -255349, -86212, 234971, -138286, -287447, 57457, -153239, -56206, 126220, -5609, 92237, 133365, 356168, -172457, 221809, 33872, 56316, 183774, -130841, -259806, 73132, 168620, 27773, -26935, 175840, 193645, -11693, -112007]
17654a12007d2513B99980a97717C9358J4825L0469a63870e6606n1664L2081E8333
17642D6968h1292j9753G4812g0087j11261B4524J18655A7348g259b304A93848
17630a37069N8853A66099e9888A01425K81228a80870D36152A1342b87045A15753
17619a01538l2232K7415l5532f0911K4970B0598O8930O3914b40131d0352j04274
17608a44626B29806n1502o7951d0641J3850H409J00483k3726J38513J55085a08892
17596f341k5090C66210j34664j02481N8946p9219b07878Q1178A64409A8683O1240
17585G9923J7493J30345A8641a47636A13796C1467G562a15072A13532a24650b7717
17573A89756f4097A79454Q1446J84171a44295c4683j24280E9072b8689A34077
$$ y = [-112007, -42513, 299980, -197717, 39358, 54183, 84652, -163870, -56606, -108270, -76189, 58333, 46968, -81292, -101045, 74812, -70087, -181348, 24524, 143179, 17348, -7259, -2304, 193848, -137069, -78216, 166099, -59888, 101425, 382653, -180870, 436152, 11342, -287045, 115753, -101538, -133770, -106355, -141887, -60911, -35941, 20598, 89528, 153442, -240131, -40352, -144626, 229806, 178304, 110353, -40641, -26791, 8409, 108892, 85166, 223679, 378764, -108892, -6341, -31431, 366210, 231546, 129065, 188011, 108792, -207878, -126700, 164409, 18683, 79923, 97416, 227761, 18641, -147636, 113796, 31467, 7562, -115072, 113532, -124650, -27717, 189756, -64097, 179454, 260900, 445071, -144295, -34683, -158963, 59072, -28689, 134077]
17562i0465B84955m131a75371j32990C15177a32741B50821H2521F895b701B32864
17550b13646C20887j24096K09777H1979b86444B49770E7638j0825f6779n3182
17540a19961j16415e0145A10568C1914a72905N4724k13404J23265A23018L23686
17530D46704A09220c0725B41207c5091j9539r0276A7336l21a48107L62A08118
17518B75133a16761E6686L9832a02322E9632a64650a6759A07879R0837r0119J4713
17507A23310C6544Q1810A1865J45904b52408C21242l3487D6060J01361C5488J8728
17496E4216K25815a55084C37866i9395B09943K1857p7904K57106A35337r282a6914
17484A9724O2666J71787c9929B69565P599j16614C0485b59245D17798j02528A3364
$$ y = [-90465, 284955, 280824, -175371, -308361, 315177, -132741, 250821, 82521, 6895, -2701, 232864, -213646, 320887, 196791, 406568, 81979, -286444, 249770, 57638, 46813, -66779, -119961, -236376, -50145, 110568, 31914, -172905, -118181, -331585, -208320, 123018, 446704, 109220, -30725, 241207, -35091, -54630, -144906, 17336, 17015, -148107, -147745, 108118, 275133, -116761, 56686, 96518, -102322, 59632, -164650, -16759, 107879, 198716, 108597, 123310, 36544, 118354, 11865, 157769, -252408, 321242, 287755, 46060, 147421, 35488, 54216, 280031, -155084, 337866, -99395, 209943, 231800, 153896, 411002, 135337, 126055, -16914, 19724, 82390, 254177, -39929, 269565, 277164, 160550, 30485, -259245, 417798, 315270, 13364]
17472C08304r7853a16077P528F60M7353f5654A00341f1007A15264a02387F3117
17460C29106p1637F2635J12697k9334k548N3391p6207N9593L0919n3590O7672
17449B25228n5586a4657D10960B5592a63662G887P3706M3398J01833o7686Q4348
17438B43486A05066K88345A21844P6183N7325j3051A5351M75131B31059J97188
17428D28247j21219j23350C9417L35367j62909r9904K53424l996C561J10589n997
17417A08153J67569j23120J23187J69361j93410F2692J69549b8706A36081J55693
17407B91774H0074J26246K10711A58778A450e6751A68019k8780K3218J50037d71695
17395a10715D88936h8139j96298j35213b6833B16389q4512J33280F881N1493b03908
$$ y = [308304, 210451, -116077, -108549, 660, 48013, -65654, 100341, -61007, 115264, -102387, 63117, 329106, 257469, 62635, 175332, 145998, 143450, 196841, 120634, 180227, 211146, 157556, 225228, 169642, -14657, 410960, 25592, -163662, 7887, 81593, 124991, 226824, 159138, 243486, 105066, 393411, 121844, 198027, 255352, 242301, 15351, 490482, 231059, 428247, 307028, 183678, 39417, 374784, 211875, 111971, 365395, 361399, 3561, 114150, 108153, 275722, 152602, 275789, 445150, 251740, 62692, 232241, -28706, 136081, 291774, 80074, 206320, 417031, 158778, 1450, -56751, 168019, 139239, 162457, 312494, -471695, -110715, 488936, -88139, -284437, -419650, -26833, 216389, 131877, 265157, 6881, 58374, -203908]
17383D75320i2188j21135H8815a97989D4353m584K69403l2184q5788C2469c1406
17371c3113C35883C1477J65890Q5115J11183A00721c12126A56872p4074L7292
17361A20090m2305A815J85732l3364N6138K15619A67272J38359b29121f2574a6338
17349A62153C738L4171K02116l790r6848K21853F2704K37276j34560a86079Q3080
17338a02999B39980k4381K34380j19671j45603Q3362a1345p0504C45739a46598
17327D1413b819E29026e4703C9409b35842A62947o4932C5803d8415E9181n439
17316E3742k047Q346J53064c3112A35374J0072c62170c592B10518F9706B8960
17304B62078M4402k8633F0377K7607J15286f4843D47463k15446A15463e796B15023
$$ y = [475320, -92188, -213323, 88815, -197989, 44353, 39769, 309172, 276988, 191200, 32469, -31406, -33113, 335883, 31477, 197367, 282482, 393665, 100721, -312126, 156872, 82798, 120090, 77785, 1815, 187547, 154183, 210321, 425940, 167272, 305631, -229121, -62574, -16338, 162153, 3738, 37909, 240025, 236235, 139387, 361240, 62704, 299980, 165420, -186079, -102999, 239980, 215599, 449979, 330308, 184705, 268067, -11345, -81849, 345739, -146598, 41413, -2819, 529026, -54703, 39409, -235842, 162947, 98015, 35803, -48415, 59181, 53742, 51695, 60041, 213105, -33112, 135374, 145446, -362170, -3592, 210518, 69706, 28960, 262078, 306480, 277847, 60377, 87984, 203270, -64843, 447463, 232017, 115463, -5796, 215023]
17292A80535Q4264G9176K1643b7536k05551A78768k9779K3867B8171K90120a05998
17280D70831a01222A26178L32021A40966M4897B5970J80152J64637a95367C17162
17269F0597O3863J61216Q8462l5850j5132F7599K71630J83238A56019F6280l36
17258F5944k6340K57205F7313c6132C59384j51449e7398C92857A61136J97753
17248C58889p202i4612a1808C14085r3650a15183F1264J88337o6668G9119L0943
17237A10062m1937J3495J45762K4913A06219O3854P9976A16866J28457G0165J23109
17226A93274K45167o6934K57014B89002A10524J93195m6944E1865F926L82162
17216C89088j10880f8094B76771o8409J57605j43361o8265L69115A54094a31789
$$ y = [180535, 264799, 79176, 100819, -27536, -233087, 178768, 148989, 172856, 28171, 318291, -105998, 470831, -101222, 126178, 458199, 140966, 185863, 25970, 206122, 370759, -195367, 317162, 60597, 124460, 285676, 374138, 338288, 323156, 67599, 339229, 522467, 156019, 66280, 65944, 39604, 296809, 67313, -36132, 359384, 207935, -57398, 392857, 161136, 358889, 351687, -94612, -11808, 314085, 220435, -115183, 61264, 249601, 182933, 79119, 110062, 68125, 81620, 227382, 252295, 106219, 170073, 250049, 116866, 245323, 70165, 193274, 438441, 371507, 628521, 289002, 110524, 303719, 256775, 51865, 6926, 389088, 278208, -68094, 276771, 208362, 365967, 222606, 154341, 523456, 154094, -131789]
17205A88845J39271A25455K38329k8080a27064E23315A68849R2587J07227m6323
17195C22340p4316o0356a70968B08084K94342A55903C7387J63094D8458L88665
17185D37123q0755b8348C93961k6076j46531J44268H3419Q6093a8177B70469K82296
17174E52765j82979j18918B5781J7140J03529M37282r3491K3785A58840L25263
17164D84103k02235O9025O7242i6883B76396M6423a3437A15332C8958K02638j14858
17153A26738m861b00661F03833B92019J83919j24340n8998J26044O4093B09910
17142C10431K74415E8688c6520B25212a59191B54167L48980B61547J4086A07515
17131B02714J11218j01128M32514k93446k0603j06532K604q7646J51776J1200
$$ y = [188845, 328116, 125455, 363784, 335704, -127064, 523315, 168849, 261436, 368663, 322340, 248024, 187668, -170968, 208084, 502426, 155903, 37387, 200481, 48458, 437123, 356368, -28348, 393961, 367885, 221354, 365622, 83419, 169512, -18177, 270469, 552765, 369786, 250868, 25781, 42921, 146450, 583732, 490241, 514026, 158840, 484103, 281868, 350893, 418135, -96883, 276396, 322819, -13437, 115332, 38958, 241596, 126738, 121877, -200661, 603833, 292019, 475938, 351598, 292600, 418644, 482737, 209910, 310431, 584846, 58688, -36520, 225212, -159191, 254167, 603147, 261547, 275633, 107515, 202714, 313932, 212804, 645318, 351872, 331269, 224737, 227341, 139695, 291471, 302671]
17121C02671L57774B83582l2745q5651C2553K80529L89435A94199K47960A10458
17110c0145B99936N0425N0404j091J7940j16947L34348E7193L98511J21393o0053
17099E17044j87680k0079J4970L2245M8189k0595m3093M4887L3894j49083J53851
17088D24550H0330M20331r7495I7935Q3706N40562k53001B13119p5554M87387
17078F24952k00910k4231p4147J69663j65395P1648A16648K36214J51156m4586
17068D59432j13231j60632L40571A92867J64143R5530J3571K1258k08899L04259
17058E82729j05262J97018n0628B16673M5838p4622K32710L19261j9377B91588
17047E17311J34922B80136J24809k3821L5866N8347a4849D72177J29198p3778
$$ y = [302671, 660445, 283582, 250837, 165186, 32553, 313082, 702517, 194199, 442159, 110458, -30145, 299936, 350361, 400765, 399674, 417614, 300667, 635015, 57193, 455704, 577097, 517044, 329364, 309285, 324255, 356500, 404689, 384094, 341001, 385888, 419782, 270699, 424550, 80330, 500661, 403166, 97935, 181641, 722203, 469202, 213119, 137565, 624952, 424042, 399811, 325664, 495327, 329932, 401580, 116648, 352862, 504018, 459432, 346201, 185569, 526140, 192867, 357010, 452540, 466111, 487369, 278470, 582729, 477467, 674485, 623857, 216673, 262511, 187889, 420599, 739860, 720483, 291588, 517311, 652233, 280136, 404945, 381124, 416990, 475337, -14849, 472177, 601375, 527597]
17037E27597k32434J8058L32616B04339J66325A49767L21771O7718R9645o5957
17027E72944B47276N5352K88182j03783j62729L46761l18881K33292p1673K2094
17017E35891K10273j66282L2341q6247l5137Q798Q9211L357B12877N25866k80519
17006D58224J02542L8614j9215o2004n9909K28665p3k4878L299R3489o9540n5720
16994F33494m2270J29121j03534J61131j32030K28301K25043E17413M32145k51020
16984F98538J35663j83523j52324N80721k20073j48536P7535m1519L3008r9526
16974F79964M7755M290j3382j29233J4631K31711q4176j4768j03911l1932K77268
16963H78217R4398k52467N444J68570j01181P8807K52039n55042K29748M08016
$$ y = [527597, 295163, 313221, 645837, 204339, 370664, 149767, 471538, 539256, 638901, 572944, 247276, 302628, 590810, 487027, 324298, 671059, 352178, 585470, 513797, 535891, 746164, 579882, 612223, 525976, 490839, 499637, 588848, 592205, 212877, 738743, 458224, 560766, 599380, 580165, 518161, 458252, 686917, 686844, 661966, 665265, 758754, 689214, 633494, 591224, 720345, 616811, 777942, 645912, 874213, 1099256, 517413, 949558, 698538, 834201, 650678, 498354, 1079075, 859002, 710466, 788001, 746482, 779490, 679964, 727719, 732009, 718627, 589394, 604025, 835736, 751560, 736792, 632881, 600949, 878217, 972615, 720148, 725592, 894162, 792981, 871788, 1123827, 568785, 798533, 1206549]
16953A206549P148n24841L24194j42635N8134j97301Q4237M29386j73080j14610
16943I57181M6349P4373j87308m02050K59608J39414J09024j0259N5576L20483
16933A362391j99677k5174J60223O7981m02422k36561L75975j24559K98526K2371
16923A299074N9773n7767j88612J44547j70888L10915l08141K72443k33080L81489
16913A509753j25189J9595j16318J76200k83732M89054p81045N54867j83903j8694
16903A240588J05712M89707l92039J28511M7167k75724K00243R6854J40081k25140
16893A555960M5078J00381j50368K31962L31785l24510k19260L61026P960j35545
16883A804469K45354m10367M04319o6124k76289L98162n488n6001j30856O7556
$$ y = [1206549, 1213697, 688856, 1013050, 870415, 928549, 731248, 815485, 1244871, 1071791, 957181, 1003530, 1077903, 890595, 488545, 748153, 887567, 996591, 986332, 1041908, 1362391, 1162714, 1137540, 1297763, 1365744, 963322, 726761, 1102736, 978177, 1276703, 1299074, 1358847, 1301080, 1112468, 1257015, 1086127, 1397042, 1088901, 1361344, 1128264, 1509753, 1384564, 1404159, 1287841, 1464041, 1180309, 1669363, 888318, 1443185, 1259282, 1240588, 1346300, 1836007, 1443968, 1572479, 1619646, 1343922, 1544165, 1641019, 1781100, 1555960, 1601038, 1701419, 1551051, 1783013, 2114798, 1790288, 1571028, 1932054, 1940014, 1804469, 2049823, 1639456, 2043775, 1977651, 1701362, 2099524, 2094036, 2038035, 1907179, 1974735]
16873A974735N2013J33427m4954k36798K06622L06776l11761L59908R1302m7351
16863B483919m0646j11385K88237k04962J50596j47580K86053L46368q4496j56371
16853B809733n1855L81087l73594J56883N1289j74958L84287k04384L3746L85821
16843C398055n39069K95262K66516J40264j38127J80238k14516L05610O2356k02802
16833C553787J93249j0875L51342m40404J56157l3438L60354M03332k27703J872
16823D307673L29166J98883l50786K72317R2015J77137P6623J31011Q8588j72444
16813E150183L35314j68063K53406K40377l1666J04312O10741j40159Q6655J83512
16803F624612k84548M89187K14515L22055k61588L52241O7903J98478K82080K92296
$$ y = [1974735, 2026748, 2160175, 2115221, 1878423, 2085045, 2391821, 2080060, 2439968, 2531270, 2483919, 2443273, 2331888, 2620125, 2415163, 2565759, 2418179, 2704232, 3050600, 2966104, 2809733, 2757878, 3138965, 2765371, 2922254, 2973543, 2798585, 3182872, 2978488, 3012234, 3398055, 2858986, 3154248, 3420764, 3561028, 3422901, 3603139, 3388623, 3694233, 3756589, 3553787, 3747036, 3736161, 4087503, 3647099, 3803256, 3769818, 4130172, 4533504, 4305801, 4307673, 4636839, 4835722, 4484936, 4757253, 4849268, 5026405, 5103028, 5234039, 5322627, 5150183, 5485497, 5317434, 5570840, 5811217, 5779551, 5883863, 6494604, 6354445, 6441100, 6624612, 6340064, 6829251, 7043766, 7365821, 7104233, 7456474, 7524377, 7722855, 8004935, 8297231]
16793H297231n9353L96623K40481Q7005K67323M80742L04342j92761N55585J58279
16783A0535497M77043N49347n0651L41632L44666M58099L21974N04044N66352
16774A4048003L20035L37755Q92713M57076J40920Q50798Q47278K53954P82847
16765A8931379M49978R24090O19741R26179J014224P19273Q95737J375901R64365
16756B6820867J417120J031406J243863J384171J503297J889431J747845J794246
16748C8832246J839882J991722K376476K450928K476549K897069K975500L150994
16740E8991366L268831L730926M197368M288686M670183M851707N094823N924291
16732I5018181N817222O373703O707131P201720P514233P064650P514214P199981
$$ y = [8297231, 8237878, 8634501, 8874982, 8961987, 9229310, 9710052, 10014394, 9821633, 10377218, 10535497, 11012540, 11561887, 11511236, 11852868, 12197534, 12655633, 12977607, 13481651, 14048003, 14368038, 14705793, 15598506, 16055582, 16196502, 17047300, 17894578, 18148532, 18931379, 19381357, 20305447, 20925188, 21851367, 22865591, 23584864, 24480601, 25856502, 26820867, 28237987, 29269393, 30513256, 31897427, 33400724, 35290155, 37038000, 38832246, 40672128, 42663850, 45040326, 47491254, 49967803, 52864872, 55840372, 58991366, 62260197, 65991123, 70188491, 74477177, 79147360, 83999067, 89093890, 95018181, 100835403, 107209106, 113916237, 121117957, 128632190, 135696840, 143211054, 150411035]
16724A50411035P300599P171635O291484N494458M838659L770690K048865J094285
16716A88421710l54563j613108l020885m310657n153155o013590o449586p353633
16708A54152533p304356p904491p375254p700347o908077o806831o855679o500735
16700I6796763n658049n747051n120600m869925m488379m193111l843833l601938
16692E9273877l802963k774825l190723k465841k846486k331733j868392k315279
16684C7677635j717494k008004j493607j726116j102141j376925j107103j247252
16676B5898993j201785r30290j248543o88391q73324j093851p16912n10602o97880
16667A7937415q49591m83315q47571l14177m18186j332274J09187l05307o96399
$$ y = [150411035, 157711634, 164883269, 171174753, 176669211, 181507870, 185278560, 187327425, 188421710, 188067147, 186454039, 183433154, 179122497, 173969342, 167955752, 161506166, 154152533, 146848177, 138943686, 131568432, 123868085, 116960008, 110153177, 103297498, 96796763, 91138714, 85391663, 80271063, 75401138, 70912759, 66719648, 62875815, 59273877, 55470914, 52696089, 49505366, 47039525, 44193039, 41861306, 39992914, 37677635, 35960141, 33952137, 32458530, 30732414, 29630273, 28253348, 27146245, 25898993, 24697208, 23766918, 22518375, 21829984, 20956660, 19862809, 19145897, 18635295, 17937415, 17087824, 16604509, 15756938, 15442761, 15024575, 13692301, 13801488, 13496181, 12799782]
16658A2799782k73106m70109k81323n94801k69874K799o78771L8573m52489o07424
16648I213257r1892l37260k13511J6188l10221m25055J16334m65684j48931J52793
16638G506018n84790j66417J7343j85789m40355M76285n94013k06342J99708l49187
16628E672461m05017J10682k38577P0162l26115J00830j08611n7041k62630L9231
16618D595375k12386q4240j40302k3012J9226m3255m28427J97502j48809J12526
16608C844198j52274J71785l68197n1312k19944K55516K67994l16854m51621J83452
16598C162743m27000J65561N2931j39772k96459K82997L04531n75096J78735n9802
16588B649369k63950k942O8160l50524J28347J41178k26874J59323j08071M6128
$$ y = [12799782, 12526676, 12056567, 11775244, 11180443, 10910569, 10913368, 10234597, 10273170, 9820681, 9213257, 9121365, 8784105, 8570594, 8586782, 8276561, 7851506, 7967840, 7502156, 7353225, 7506018, 6921228, 6754811, 6772154, 6586365, 6146010, 6622295, 6028282, 5821940, 6021648, 5672461, 5267444, 5378126, 5139549, 5209711, 4883596, 4984426, 4875815, 4818774, 4556144, 4595375, 4382989, 4298749, 4158447, 4135435, 4154661, 4111406, 3682979, 3880481, 3731672, 3844198, 3691924, 3863709, 3495512, 3444200, 3224256, 3479772, 3747766, 3430912, 2979291, 3162743, 2735743, 2901304, 2954235, 2814463, 2518004, 2801001, 3105532, 2530436, 2709171, 2649369, 2385419, 2382477, 2450637, 2100113, 2228460, 2369638, 2142764, 2302087, 2194016, 2240144]
16578B240144K71987l30673j12936J05621q6652K3342j88666K29292l66468j61870
16568A623121M12352P717l69165Q8261l83384L56740r6275K3334K04998k25276
16558A642423k31090Q2787L47301j10882j84096K64729m44719J17101L42481j21417
16548A704618m63920K09148k18637M64297n18059j23858O36259m63762L2105K46491
16538A504682m39509j9135p062O9525K68238j61050J96104F93429M64034j07442
16528A050021r5164L89480k79454k54096K39260J48803R1239m83612K98255j41277
16518I63455L70273k41886l31931k17924N72205K03316l68638M4022k56981J69814
16508I05725K48869K0834j64934j27527j23941J83432n9808K6930J59196n0664
$$ y = [2240144, 2512131, 2181458, 2068522, 2174143, 2087491, 2110833, 1922167, 2151459, 1784991, 1623121, 2035473, 2043190, 1674025, 1762286, 1378902, 1735642, 1639367, 1662701, 1867699, 1642423, 1411333, 1494120, 1841421, 1730539, 1546443, 1811172, 1366453, 1483554, 1826035, 1704618, 1240698, 1449846, 1231209, 1695506, 1177447, 1053589, 1689848, 1226086, 1258191, 1504682, 1065173, 1046038, 1038976, 1108501, 1376739, 1215689, 1411793, 693429, 1157463, 1050021, 954857, 1344337, 1064883, 810787, 1050047, 1198850, 1290089, 806477, 1104732, 963455, 1333728, 1091842, 759911, 541987, 1114192, 1317508, 948870, 992892, 735911, 905725, 1154594, 1175428, 1010494, 882967, 759026, 942458, 882650, 909580, 1068776, 1018112]
16498A018112k39254J07754k28700o4266L00785B97498M11340o1375p7832L96062
16488I65693D76732K93540M6489l24984K76991q5897r437r3369L81142m43516
16478E17691O007J32340j78176K57209k96587L92410C18252L82499j49622N4732
16468F05861M05301E04781K00982q4502O0062C02586E9751M26008N1668k3863
16458E13564j1959J32812K80454l99856J4435R278j92504J04830k06268N11633
16448G56419n0203j80917K45084p9799A87887K06250J28102j85481K16122A66975
16437F39015o7849M13435B05807P52497A73630L6776l6751N56708C51475j20928
16427B30547j1145l4193L36844k1959A08949R6868m6232K38814l8922A65188L8662
$$ y = [1018112, 778858, 886612, 657912, 593646, 894431, 297498, 708838, 647463, 569631, 965693, 476732, 770272, 816761, 491777, 768768, 682871, 673434, 580065, 961207, 517691, 523698, 656038, 477862, 735071, 438484, 830894, 318252, 700751, 551129, 605861, 1011162, 504781, 705763, 621261, 681323, 302586, 59751, 485759, 537427, 513564, 501605, 634417, 914871, 515015, 529450, 538728, 346224, 451054, 244786, 756419, 706216, 525299, 770383, 690584, 187887, 394137, 522239, 336758, 552880, 166975, 639015, 571166, 984601, 205807, 958304, 173630, 210406, 173655, 730363, 351475, 230547, 219402, 185209, 522053, 500094, 108949, 205817, 159585, 398399, 359477, 165188, 203850]
16416B03850M0222F4559L07580j10858j19111K72617j37781L39838C05404Q5446
16406C90850E4286O6166J23213J65850M1J99074a32299A2337c8095F58287A37222
16394C83283L2721j51816N11957C48405A38087M70269k48j64257B19449O1352
16384B80801I7157J22479L138d0144D00967A44076A0909L89496A35961J1885J37098
16373B84944K74588N0032f2856A88789R1528r1081B0106K71677K56920n4834J0699
16362E04568k14344R3511F9308J3370K95383g288C06681A35591K77983B06361
16351A32273J95123N6343A6343J7797N53842a16932l3518B82353e4137C52047
16340A78787k2526M5048E1629J11561J01855p2593F2744A2964K93945h5479B56751
$$ y = [203850, 244072, 64559, 372139, 261281, 142170, 414787, 277006, 616844, 305404, 390850, 54286, 120452, 243665, 409515, 409556, 608630, -132299, 12337, -38095, 658287, 137222, 383283, 416004, 264188, 776145, 348405, 138087, 608356, 608108, 443851, 219449, 280801, 97157, 219636, 222774, -40144, 400967, 144076, 10909, 400405, 135961, 147846, 284944, 559532, 609564, -62856, 188789, 280317, 189236, 20106, 291783, 548703, 493869, 504568, 290224, 383735, 69308, 82678, 378061, -7288, 306681, 135591, 413574, 206361, 132273, 327396, 383739, 16343, 34140, 587982, -116932, -150450, 282353, -54137, 352047, 178787, 156261, 201309, 51629, 163190, 265045, 192452, 62744, 12964, 306909, -85479, 256751]
16328B99303P237j20002m8118M2819a47258L8356B04517M5156c9177G7291M26265
16317E03556H4561O8918J33816a2238j11001D6924J80541H6278c9440C35209H0581
16305C35616Q608a05508B76700l3664j383b28185B28318E8714e554B7455Q950
16294C6405J34501m18m8034L12584Q207n8218b4747C49305g5965c6841A05227
16282I5389K63291i9161d7706l8284j056A52373B7982O2729K01527F3125a2127
16270B904K45425A0892L61442a2478C01211r8614k2212J94856H8132J98662q6888
16259A99906E4879K8911O1929R3762Q3145A50130c7590J3776A05400J72050A14580
16247a08396F435e6844C0126N0694i6214A52305d6131B4540K52587J39896j81935
$$ y = [299303, 306540, 186538, 138420, 181239, -147258, -108902, 204517, 249673, -39177, 77291, 503556, 84561, 153479, 287295, -12238, -123239, 46924, 227465, 86278, -39440, 335209, 80581, 335616, 344224, -105508, 276700, 243036, 241653, -228185, 228318, 58714, -5554, 27455, 36405, 170906, 170488, 122454, 435038, 443245, 385027, -24747, 349305, -75965, -36841, 105227, 95389, 358680, -99161, -47706, -85990, -87046, 152373, 27982, 90711, 292238, 63125, -12127, 2904, 248329, 10892, 372334, -12478, 301211, 202597, 180385, 375241, 88132, 286794, 199906, 54879, 83790, 145719, 239481, 322626, 150130, -37590, -23814, 105400, 277450, 114580, -108396, 6435, -56844, 30126, 80820, -96214, 152305, -46131, 24540, 277127, 417023, 235088]
16236B35088H5868i7064p6377f495j02672N3207H754a16900j69461R5523f784
16224B97756A40565O79c41172G1147B945i3763b233A74397Q0333h6905n7995N0158
16212i4742E469K4960J55399G6767a53493F6151e9989k1200Q003B01262a50909
16200B13705f8950j9549G791R7705b02085E6027b5588o3952c7655I439h120A62198
16187e0534l4288C85993A23053K2583l5640m2648j0494c737A15306e5724A91777
16175g9582A15040L35016b2492A93764H9944c0220C22311h9055m3212B30051p8914
16164A51137E6876R2020b0948r6588B77030c08071f2133B60525a06793B02643
16153g3395n042k6709G3509b72760e968E34K6324J93994a64722i818m1596B40958
$$ y = [235088, 85868, -97064, -173441, -6495, -109167, -55960, 8754, -116900, -286361, -190838, -6784, 297756, 140565, 141244, -341172, 71147, 2945, -93763, -2233, 174397, 254730, -86905, -144900, -94742, 5469, 30429, 185828, 76767, -153493, 66151, -59989, -81189, -73186, 201262, -150909, 213705, -68950, -88499, 7791, 105496, -202085, 56027, -25588, -89540, -37655, 9439, -8120, 162198, -50534, -84822, 385993, 123053, 145636, 109996, 67348, 56854, -3737, 115306, -55724, 191777, -79582, 115040, 450056, -22492, 193764, 89944, -30220, 322311, -89055, -132267, 230051, 151137, 56876, 148896, -20948, -117536, 277030, -308071, -62133, 260525, -106793, 202643, -73395, -78437, -105146, 73509, -272760, -5968, 534, 26858, 220852, -164722, -9818, -51414, 240958]
16140B69365b59044L019a3322j73226C65556j40325b77934a20679J6161C79083
16129a22708A21206A8361a31079A53394J11121f4108l2953j51889H1878b36877
16118E6181K0065e962A9225a5547A77964Q4128b3391H9099A5914J9821c33542
16106h6319L3699H1380J1540J92377a33717b004j20612a86H8612g7801J1256k48955
16094c15500M1313G9364i0467B40814a29570O0986C7668J85493b07681q1509D0537
16082a00712K1621c4020B13172p0062J7168b77335H0175J58221G8243a67271A35163
16070d5398D1265e016A60746l9628c1856k53641B19832a2053j97619B73323p1808
16059B01515I6437a51197C22889a58191j07683L8390A16490D2306R921a83406
$$ y = [269365, -259044, -256025, -13322, -186548, 365556, 225231, -277934, -120679, -104518, 379083, -122708, 121206, 18361, -131079, 153394, 264515, -64108, -97061, -248950, 81878, -236877, 56181, 76246, -5962, 19225, -15547, 177964, 262092, -23391, 89099, 15914, 35735, -333542, -86319, -52620, 81380, 92920, 285297, -133717, -2004, -122616, -186, 88612, -77801, -66545, -315500, -274187, 79364, -90467, 240814, -129570, -68584, 37668, 223161, -207681, -289190, 40537, -100712, -79091, -34020, 213172, 143110, 160278, -277335, 80175, 238396, 78243, -167271, 135163, -45398, 41265, -5016, 160746, 121118, -31856, -285497, 219832, -12053, -209672, 273323, 201515, 96437, -151197, 322889, -158191, -265874, -227484, 116490, 42306, 52227, -183406]
16048b35241B59795G0276K21817c19326h6664m8140E5258J2782c79m9972C96039
16036G6017J672k4668B741e1390k6417j47212L9575P5439A28391i2009q0522P7749
16024i4782E4915b255B27670d0621r5807H5604a37976a4117j66620A29651d5632
16012a50208G2423a48357r2414f9636B08506a05667B34199b91615E5710J60817
16002B16527Q2646a94706E530a61997j068C2530a20266G8895c9786l2022j22975
15991a94783A90766a35564j0947C22857h4529r0759a9576F810K15135f589B94709
15979B61496a3737B89197k9485r3297a28239l7308B04934O1037A6695J51515a08320
15967E8249a00628b0627A83015b4029A93659q7702c672A22783b26392e8546e085
$$ y = [-235241, 259795, 70276, 292093, -319326, -86664, -134804, 55258, 68040, -379, -50351, 396039, 76017, 77689, 53021, 2741, -51390, -77807, -225019, -185444, -110005, 128391, -92009, -172531, -94782, 54915, -2255, 227670, -40621, -136428, 85604, -137976, -14117, -180737, 129651, -45632, -150208, 72423, -148357, -240771, -69636, 208506, -105667, 234199, -291615, 55710, 216527, 299173, -194706, 5530, -161997, -163065, 32530, -120266, 78895, -39786, -71808, -194783, 190766, -135564, -146511, 322857, -84529, -175288, -19576, 6810, 221945, -6589, 294709, 261496, -13737, 289197, 259712, 166415, -128239, -165547, 204934, 265971, 16695, 168210, -108320, 58249, -100628, -20627, 183015, -24029, 193659, 105957, -3672, 122783, -226392, -58546, -5085]
15955a81245o7456J23273A71820f4470q3271B0209N8243C1182J33148d421B6593
15943h7897F547b09096B00883a74172B9195R0307c61190J61584A09082D772c43652
15931G2595B5999o518c14695h2905K1679j95418H4330b87528o5964a09615j06420
15920b16035A13508i8993b70E9744A4207i1398M600m66631R5825a89317M7149
15909a42168q8541d5593H6331d94485B08453a19453m5931O7061a3956A37508a02609
15897c51511C54992h8167D7160J02143a19914A98386e3898A14325E1035b2134
15886A81243d9567m3742l4093F0696J7735h9418j3066A62122a17428A33892l508
15875A30384h2840A0791i4586C5139L00960H7312b81237A68348a93636h4074b0958
$$ y = [-181245, -248701, -125428, 171820, -64470, -147741, 20209, 78452, 31182, 164330, -4421, 26593, -87897, 6547, -209096, 200883, -174172, 29195, 119502, -361190, -199606, 109082, 4772, -343652, 72595, 25999, 19481, -314695, -82905, -61226, -256644, 84330, -287528, -353492, -109615, -216035, 113508, -98993, -270, 59744, 14207, -91398, -86798, -553429, -457604, -189317, -142168, -230709, -45593, 86331, -494485, 208453, -119453, -165384, -98323, -13956, 137508, -102609, -351511, 354992, -88167, 47160, 149303, -119914, 198386, -53898, 114325, 51035, -22134, 181243, -49567, -93309, -127402, 60696, 78431, -89418, -102484, 162122, -117428, 133892, 130384, -82840, 10791, -94586, 35139, 336099, 87312, -281237, 168348, -193636, -84074, -20958]
15863h1516A09607a03892k6617o9357i4738C50773o9589b1892m8488J5881C3305
15851g1514n4158C38737r373e0600M002n1628m4032A0299a73747O8774r7502E6625
15838f3042A65111f6144j68367B9675b15297i5722j1181C8137a19217j85705h0281
15826a32523j49806a00566B0211i7966A07551J26151K1102a46115j67739B00511
15815a58569H772b8191J2568C1970J92912b67267A6202J14899a37557B90943B1247
15803A45675b85105i1290D6888P6642B8103c13775B75533A9169c45155J69459
15793a75696c2351F5049P4895n3697B5606f6752C6909F606a26600c0656E9202
15781b20385A45N4849a6347B06885F6816a14972N6210a0333D06719a20140A22614
$$ y = [-81516, 109607, -103892, -130509, -199866, -94738, 350773, 281184, -21892, -70380, -54499, 33305, -71514, -125672, 338737, 329364, -50600, -46598, -98226, -142258, 10299, -173747, -104973, -202475, 56625, -63042, 165111, -66144, -234511, 29675, -215297, -95722, -106903, 38137, -119217, -304922, -80281, -132523, -282329, -100566, 20211, -97966, 107551, 233702, 254804, -146115, -313854, 200511, -158569, 8772, -28191, -15623, 31970, 224882, -267267, 16202, 131101, -137557, 290943, 21247, 145675, -285105, -91290, 46888, 123530, 28103, -313775, 275533, 19169, -345155, -175696, -32351, 65049, 139944, 86247, 25606, -66752, 36909, 6606, -126600, -30656, 59202, -220385, 145, 54994, -16347, 206885, 66816, -114972, -58762, -10333, 406719, -120140, 122614]
15769I514b56370M6371Q5054F2865J591N692a69955G6092M0693L5172N7210e4251
15756e7397B67498k5155R8282j00233i0891B07196a8774j40004F6093a19980M5354
15745g4626L0381D57001a22525Q037k40794h6914M917A86515d0394J932O144k8876
15733f1194C4237K34428A30622f4615j14844o4757g5980A91575K6160a70154A07822
15721A16335b22057F9079c33083D2970a52433M8494l7541H7425Q4576d378j4142
15710a8520A20338c73262A91549d47655h3254A03878d35k91254J8620b7064j3613
15699d0677j81921F8887b7539k09961C2003d49326A99880a17591A93148A1716
15688G163L6136M0979d450j78127C3169a72115e9401B18951b68877L4687C8928
$$ y = [9514, -256370, -209999, -124945, 62865, 64456, 70148, -169955, 76092, 116785, 151957, 209167, -54251, -57397, 267498, 242343, 340625, 240392, -90891, 207196, -18774, -158778, 66093, -119980, -74626, -44245, 457001, -122525, -114488, -355282, -86914, -81997, 186515, -40394, -38462, -32318, -61194, 34237, 268665, 130622, -64615, -179459, -244216, -75980, 191575, 217735, -170154, 107822, 116335, -222057, 69079, -333083, 42970, -152433, -103939, -141480, 87425, 172001, -4378, -18520, 120338, -373262, 191549, -447655, -83254, 103878, -435, -291689, -273069, -27064, -40677, -222598, 68887, -27539, -237500, 32003, -449326, 199880, -117591, 193148, 11716, 7163, 43299, 84278, -4450, -182577, 33169, -172115, -59401, 218951, -268877, -234190, 38928]
15676G6882h2229j76888A62000J87881j22696r2419L0888c1221B00573G8857b30938
15664A01584N2291e1258F9299b0065j16009A49156e3150A02933j4006J51667b62422
15652a13304c23j79345d8032j00340q3443B19802b0843j55722E1860i7938j12831
15641b10769d9964C17348e6789m694A44630D2901J27262d5132A28494c40532f5426
15629h2666B27147b5437C3059c6190j06322d2111n3413B999K41816j4382Q6941
15618C17374a80783b0397B02339b07558I0663J47901B7342N1773c61578J05255
15608b56323A3145J54748a05051a0706r7637A17310l1484c74609a83482g0218
15597B93994k2185e1631a5454j7899A88612a33305g539j25714A27783a6760j25841
$$ y = [76882, -82229, -259117, 162000, 349881, 227185, 134766, 165654, -31221, 200573, 78857, -230938, 101584, 153875, -51258, 69299, -20065, -136074, 149156, -53150, 102933, 88927, 240594, -262422, -113304, -323, -179668, -48032, -148372, -231815, 219802, -20843, -176565, 51860, -97938, -210769, -49964, 317348, -56789, -61483, 144630, 42901, 170163, -45132, 128494, -340532, -65426, -82666, 227147, -25437, 33059, -36190, -142512, -42111, -95524, 2999, 244815, 230433, 317374, -180783, -20397, 202339, -207558, 90663, 238564, 27342, 79115, -361578, -256323, 13145, 167893, -105051, -10706, -108343, 117310, 85826, -374609, -183482, -70218, 293994, 271809, -51631, -15454, -33353, 188612, -133305, -7539, -133253, 127783, -16760, -142601]
15586a42601B60400b55971E0691b8897B29429a0308l7341A76167b80338C28263
15575f8116A37014c9066f713B00379b79056g6301D6017J66693c99853i1166l247
15564i4413j54250i5750c0706E1130J38019a05156A14172a34503e4516l56798
15554d11314A58434J14773D3908a88146A75517E523O5928P4018k9134f7658D2526
15542a8866j9749l56949h506D01038j99002E2599P5045K34928A08641C6069N6963
15531I3032J22966d9284c525D0452d3772o6902i099a842C26825I4827a94316B11655
15518e4489G6438a9395B40455o0532b53613A87757c51756J13064h2751A1212R6878
15507A08090L3996a23487C70964h274j52683a8823B35725q944a19568n7645K4236
$$ y = [-142601, 260400, -255971, 50691, -28897, 229429, -10308, -47649, 176167, -280338, 328263, -68116, 137014, -39066, -6713, 200379, -279056, -76301, 46017, 212710, -399853, -91166, -94413, -248663, -95750, -30706, 51130, 189149, -105156, 114172, -134503, -54516, -411314, 158434, 273207, 43908, -188146, 175517, 5523, 71451, 145469, 116335, -67658, 42526, -18866, -38615, -395564, -8506, 401038, 202036, 52599, 127644, 362572, 108641, 36069, 93032, 215998, -49284, -3525, 40452, -43772, -110674, -9099, -1842, 326825, 94827, -194316, 211655, -54489, 76438, -19395, 240455, 179923, -253613, 187757, -351756, -238692, -82751, 11212, 108090, 142086, -123487, 370964, -8274, -160957, -18823, 235725, 226781, -119568, -177213, -152977]
15496a52977H5939b4688C1464J63732b28597a3729k25554R6882k77772h0284J1400
15485f8884D3910b214l15135i937m2840A00946B1253J88801B7926o905f1566m1255
15473a02821B20537a74056O5287A15613d9463l9064B81863m4199A1319J28813
15463A40132e6374k5575q8418h3672B18554a46982C4775L07004F7197P9881g3933
15451A48876a04662l3637o7969J9616j89288J79602C06674b60620f9390A3522
15440a99554c9761j13004j34864D9135b0879j80015a4745k6972A20042h6829j31937
15429b18766N4915A16867O8910L3138b6755j00315B32123c2677q4404L3260I9463
15417d854j03314F7520B3043a17481C82730a46885A60821l4248M9493c205A79315
$$ y = [-152977, 85939, -24688, 31464, 195196, -228597, -13729, -239283, -142401, -420173, -80284, -68884, 43910, -2214, -317349, -9937, -52777, 100946, 21253, 210054, 27926, 21021, -61566, -102821, 220537, -174056, -108769, 115613, -49463, -88527, 281863, 237664, 11319, 140132, -56374, -81949, -170367, -83672, 218554, -146982, 34775, 341779, 67197, 147078, -73933, 148876, -104662, -138299, -206268, -186652, -375940, -196338, 306674, -260620, -69390, 13522, -199554, -39761, -152765, -287629, 49135, -20879, -200894, -14745, -41717, 120042, -86829, -218766, -163851, 116867, 185777, 218915, -26755, -127070, 232123, -32677, -117081, -83821, 99463, -4854, -108168, 67520, 23043, -117481, 382730, -146885, 160821, 126573, 176066, -3205, 179315]
15405C74280c10082E1417a92547A64832G1140J154J18236L6199a73083B8022J69710
15394A97732D3808a74911H7846e1266B8268M8694a52280D9773a14612j64595a29242
15382h9720J4810j08111P6419b851k00182A28874a58008A42545a28289o5059C1114
15370A61205N2773a27729A10196b3816q8279n7753A64939b35608h8870G0449M5824
15359A16273C1848P0803a6754A11214b0444k60802C74849F9704L7074m2073M01645
15348D66350F6346J52217d7686A69236J09955k6673A09587k0629b50368L8023
15338b12345A19546R9284N7889a32051L4691d580j72222B57a89299j1717A69258
15326d0664j78825D02200b79614C82970A5486Q9916a54753B4817i7009A57132
$$ y = [374280, -310082, 51417, -192547, 164832, 71140, 72294, 190530, 226729, -173083, 28022, 197732, 43808, -174911, 87846, -51266, 28268, 76962, -152280, 49773, -114612, -279207, -129242, -89720, -74910, -183021, -106602, -2851, -203033, 128874, -158008, 142545, -128289, -193348, 31114, 161205, 213978, -127729, 110196, -23816, -112095, -169848, 164939, -235608, -88870, 70449, 116273, 31848, 102651, -16754, 111214, -20444, -281246, 374849, 69704, 106778, 64705, 466350, 66346, 218563, -47686, 169236, 279191, 252518, 109587, 88958, -250368, -212345, 119546, 218830, 276719, -132051, -97360, -4580, -176802, 257, -189299, -201016, 169258, -40664, -219489, 402200, -279614, 382970, 15486, 105402, -154753, 24817, -97009, 157132]
15315D1540k462i2434B1717a26925d5160k41084f3954a175F3787p769h2696n7602
15303a40298C48976o2089N9404n2221D2127a96789o2334B62280b606p854q3213
15292i3673p1635B92544p5288h36B62563a54867D7159P5440l4661j6814a76352
15280h5151g042j34770D3383N5932f7196A5781a83470B26546h1123G4992c16037
15268b86729b8363I0510a85219m8460D4620J62812a8135A22544Q3785N385Q222
15257B19936a96527B73920d6175C7137L4194M9780a54242B92395J11232K98502
15247G02129N98933l98017K03715L28545D89625A43171J6805P3754j02573d2366
15236b24257B04195I3614j3054j8219K44575h1086D85924c4430j6654r0990A17171
$$ y = [41540, 39078, -92434, 21717, -126925, -45160, -286244, -63954, -1175, 63787, 56018, -82696, -140298, 348976, 286887, 346291, 294070, 42127, -196789, -259123, 262280, -2606, -10460, -93673, -165308, 292544, 217256, -836, 262563, -154867, 47159, 122599, 87938, 71124, -176352, -85151, -7042, -141812, 43383, 99315, -67196, 15781, -183470, 226546, -81123, 74992, -316037, -286729, -28363, 90510, -185219, -233679, 44620, 207432, -18135, 122544, 206329, 211714, 219936, -196527, 273920, -46175, 37137, 71331, 121111, -154242, 292395, 403627, 702129, 1301062, 903045, 1106760, 1435305, 489625, 143171, 159976, 233730, 131157, -42366, -224257, 204195, 93614, 80560, 62341, 306916, -81086, 485924, -34430, -51084, -142074, 117171]
15224a51B3236N6017L25795f3248C7015L21818p1282d8109j72503g034B09836
15212a59669G6460a7129j4144j18179B3359a17631E8058J15811f1278g906B22325
15200e0924q0162M4075l882j26710A11673a72141i322q3408H7216q35a69087N376
15188a63711E3928d4945A97674J63651F2227a45286F3353Q5401g2838G739l300
15177D439a86264B6355d5290j65141f8893B74726j26493L9581i4408A68880K41500
15166D10380A42380K42381A03426M1661o553c41202a33752H4770a74216E0863
15155E7400a99318g8575A58323A9248b61776c997B75239j10479D0722e8792G9601
15143C43581N9032m7437G7824a85725B63433N8774g660I49J07220J01338N6938
$$ y = [-151, 23236, 79253, 405048, -63248, 37015, 358833, 287551, -48109, -220612, -7034, 209836, -159669, 76460, -17129, -31273, -149452, 23359, -117631, 58058, 173869, -61278, -7906, 222325, -50924, -131086, -87011, -90893, -217603, 111673, -172141, -9322, -92730, 87216, 86381, -169087, -163711, 53928, -44945, 197674, 361325, 62227, -145286, 63353, 148754, -72838, 7739, 4439, -186264, 26355, -45290, -210431, -68893, 274726, 148233, 187814, -94408, 168880, 410380, 142380, 384761, 103426, 145087, 138534, -341202, -133752, 84770, -174216, 50863, 57400, -199318, -78575, 158323, 19248, -261776, -3997, 275239, 164760, 40722, -58792, 79601, 343581, 402613, 355176, 77824, -185725, 263433, 322207, -7660, 949, 108169, 209507, 266445]
15132B66445b08748C58137I8729m2973L06986a19648C71999a58508g4101B69238
15121B05578O9594f5736b9819A39462J13269q1462G044b58047I7414l7063a54779
15109a26732I3068d8417j72031a9002A55614J642m3188j4598f4782B48063J87103
15098D35166a49560C53020e5578A15056c375B19285c4398A37683c7698I6191a68533
15086C7200L4787Q9225K8123J2068K10517B3046K26931i0255K6653A40851A6776
15074a26637J6609A19340J96376A9853L17759a93262C23756a16314C25617j28581
15064A97036N0460b0470B07525G7488e42m8567j42673b1291C40427j59701K50646
15053D31372j21524d7305A66754M2013L5789m4211J90197I6109L43595b04327
$$ y = [266445, -208748, 358137, 98729, 55756, 362742, -119648, 371999, -158508, -74101, 269238, 205578, 275172, -65736, -29819, 139462, 252731, 171269, 7044, -258047, 97414, 60351, -154779, -126732, 93068, -48417, -220448, -19002, 155614, 157256, 114068, 99470, -64782, 248063, 435166, -149560, 353020, -55578, 115056, -3375, 219285, -34398, 137683, -37698, 96191, -168533, 37200, 71987, 161212, 189335, 201403, 411920, 23046, 249977, -90255, -63602, 140851, 16776, -126637, -110028, 119340, 315716, 19853, 337612, -193262, 323756, -116314, 325617, 197036, 247496, -20470, 207525, 77488, -542, -49109, -191782, -21291, 340427, 180726, 431372, 309848, -47305, 166754, 208767, 244556, 200345, 390542, 96109, 439704, -204327]
15042F3203a11572c700D93060a9739p2176D01505c7640C88994a1908A17924C4220
15030C39283A63027M9289C4998Q7022P9152l7511a0361B12850J0091a4613A24525
15018A68616L11H3581B3209L03903j12954d7057C04669e784A94867q6222D8570
15006c9403D9399Q8010J03925k6635k1891J69461j73919j4859F4337J17471M7051
14995B28859p1205n6194K44172B7797J24544f2684A30235L14305b44118B49150
14984C62200a51853B82950q7631Q7044O231o1955I0906k9844J53639F8283R3800
14973A62083f8945B21581n0309O4553N0377O6821J2982n1284d9727B09911j7434
14962A92477j139m5837J28179A23042M25713q8499d3950q8914A39104b9140B21803
$$ y = [63203, -111572, -3700, 493060, -19739, -91915, 401505, -37640, 388994, -11908, 117924, 34220, 339283, 163027, 212316, 34998, 122020, 201172, 163661, -10361, 212850, 222941, -14613, 124525, 168616, 168927, 83581, 23209, 327112, 214158, -47057, 304669, -5784, 194867, 108645, 48570, -39403, 49399, 137409, 241334, 214699, 192808, 362269, 188350, 173491, 64337, 181808, 228859, 157654, 101460, 345632, 27797, 152341, -62684, 130235, 444540, -244118, 249150, 362200, -151853, 282950, 195319, 282363, 288594, 226639, 90906, 61062, 214701, 68283, 162083, -68945, 221581, 171272, 235825, 286202, 353023, 366005, 314721, -49727, 209911, 192477, 191338, 145501, 273680, 123042, 548755, 460256, -43950, -132864, 139104, -29140, 221803]
14950e853k08642B97471l0575F8064Q9784L43157B23617p1471K41341n140q3088
14939C05259L26133j08877h921A92939D8888K39869n0480O8197J27190j91168
14929B42496P1358A42969K90001k02952Q509G5113k9640R0213N2039G4351J16976
14918A91327k5748J74198n6174O8726A35947K88007A6683N61465j3670A16981
14907F68328a0000B32198P8713o4477J65199j6757j82564J44524D8934K06608
14897B55542P4394K2912j25655J74483j30985c8712E35635k38355l6220k0883
14887B40177P6928q0043K238o3058m1504O14996B55704E5319K01056a71329D78242
14875B35194K07207e7039D42987D1617L16720J42646A61251M95907A676N32940
$$ y = [-5853, -214495, 297471, 266896, 68064, 157848, 501005, 223617, 152146, 393487, 388347, 305259, 631392, 522515, -8921, 192939, 48888, 288757, 238277, 306474, 433664, 242496, 313854, 142969, 432970, 230018, 238527, 75113, 45473, 135686, 187725, 74351, 191327, 165579, 339777, 283603, 352329, 135947, 423954, 16683, 578148, 564478, 116981, 668328, -10000, 232198, 310911, 246434, 411633, 394876, 212312, 356836, 48934, 255542, 329936, 352848, 227193, 401676, 270691, -38712, 535635, 297280, 261060, 240177, 317105, 237062, 239300, 176242, 134738, 749734, 255704, 55319, 256375, -171329, 478242, 235194, 442401, -57039, 442987, 41617, 358337, 500983, 161251, 657158, 1676, 534616]
14865E34616a4408B53421q4164N50890A46251L06342j41035P4603j70243J99207
14855D15125J38010k16909K09270B24324L8330H1914J39276K18058I6219J38714
14845B34933Q9853k7672L75577B17560K46615A22048M4995O6910K90772B60962
14834E93886k67710p702q177L19512k41122J74624A64398K75920j73112M32421
14824F99627B59929J48227R3857j63278J83982o3009J95649l13933p3857L1864
14814B99431L21574B80447J94778M8882k030K02001j84147B59033J54399p6333
14804C37099J31613O0458K90729l84848p912A06246M73330O7532B91601N7555
14794C49156J34023M0978K90956A22698K35826l5932J53550J20712N6761j12545
$$ y = [534616, -14408, 253421, 169257, 720147, 146251, 452593, 311558, 386161, 215918, 415125, 553135, 336226, 545496, 224324, 262654, 81914, 221190, 439248, 96219, 234933, 324786, 297114, 672691, 217560, 464175, 122048, 167043, 233953, 524725, 260962, 593886, 326176, 318474, 310297, 629809, 388687, 563311, 164398, 440318, 267206, 699627, 259929, 408156, 502013, 338735, 522717, 459708, 655357, 341424, 267567, 299431, 621005, 280447, 475225, 524107, 522077, 724078, 539931, 259033, 413432, 337099, 468712, 529170, 819899, 435051, 427139, 106246, 579576, 647108, 291601, 349156, 483179, 524157, 815113, 122698, 358524, 322592, 476142, 596854, 653615, 541070]
14784E41070R7097J39798k58471L86252l32661j86564P6509j67246J47084r1993
14774C50875M02958k37892r7307L05428q0572J18927j21596C17531q308K45042
14764E54265j86726J47620R0225K17832P7057B54310Q8123L30048k50005M73l3292
14753C89657L75579k71197K02715j43009j29229K61639k96292M36243j86168o8914
14743E71024L40466l22351J76350m0313j25915B07975L77297o2360N8115j0406
14733E70621K83996l55978o6573J03476j19859K32739J0360C20036M10412j12659
14723F17789J96638k02066l6479J77774L16299C60665L0449J12075K88760J15474
14713I07423m01527R2305r5198N1588n2145M2885M9040J19348o5312Q845J24168
$$ y = [541070, 638167, 777965, 519494, 905746, 573085, 386521, 463030, 295784, 442868, 350875, 753833, 515941, 418634, 724062, 643490, 762417, 640821, 317531, 309223, 554265, 367539, 515159, 605384, 823216, 900273, 254310, 342433, 672481, 422476, 422949, 389657, 765236, 494039, 696754, 553745, 424516, 686155, 389863, 826106, 639938, 571024, 911490, 589139, 765489, 725176, 599261, 207975, 585272, 522912, 581027, 570621, 854617, 498639, 432066, 535542, 415683, 648422, 658782, 320036, 730448, 617789, 814427, 612361, 575882, 753656, 1069955, 360665, 391114, 503189, 791949, 907423, 505896, 598201, 503003, 554591, 502446, 545331, 594371, 713719, 648407, 657252, 781420]
14702G81420B47854N01025j5787L55044j93230l36316M19399k76998Q2201K56530
14692A039722n04708J08763J92272j76782K80363J5462j7159m7319p1487K1143
14682H40270l80835J00614K93720k03550Q1482k10902N43515j09037L6261q651
14672I82887l66096M02709j57391K72529l52657M8718L7577K39959J2770k8375
14662A092630q4603j92611n3612J79216N108j77271M6818k16609N62370J7495
14652A178931k50908N1124J50005o2670J10995j69009J0506p2489K27206j28091
14642A045600r8901p6826K46490J9324m26727L47200P4059l7818q6290M13721
14632A419832n16234J47083K19114j62413L26107o628n55137K89011k8057n0286
$$ y = [781420, 247854, 748879, 733092, 1088136, 894906, 558590, 977989, 700991, 783192, 1039722, 535014, 643777, 836049, 659267, 939630, 955092, 937933, 890614, 819127, 840270, 459435, 560049, 853769, 650219, 731701, 520799, 1064314, 955277, 991538, 982887, 616791, 1019500, 862109, 1134638, 781981, 830699, 868276, 1108235, 1121005, 1092630, 1008027, 815416, 761804, 941020, 946128, 768857, 815675, 599066, 1161436, 1178931, 928023, 979147, 1129152, 1066482, 1177477, 1008468, 1018974, 946485, 1173691, 1045600, 946699, 869873, 1116363, 1135687, 708960, 1056160, 1130219, 1092401, 1006111, 1419832, 903598, 1050681, 1269795, 1107382, 1433489, 1426861, 871724, 1160735, 1132678, 1082392]
14622A082392l5390K35896j80564p4198O8945J13234J55468q3906P6426k42369
14612A115934L50948q1338r8861j23907J8115n5591J80766l870M7944k70443L44426
14601A424123k94627N03151k36026p9567J81169J16365m18937L18049K36856j61682
14591A588874l31368K09533j1262n9025J02465J92915j71188o3812k59250L50014
14581A547896m0708K62806j79571J1866K0668J8830K19227K66820o853m10044
14571A710937K04289j66726K60188j54745j07045o7806O41398m22976J95613J20934
14561B214061l12482J76898O8604K54346L0817K51936n5384L09260K83063J65127
14551C386246L28780J358579J595370M103605Q664751J8693412N596665B0659235
$$ y = [1082392, 1047002, 1282898, 1102334, 1028136, 1097081, 1210315, 1365783, 1281877, 1358303, 1115934, 1466882, 1385544, 1286683, 1162776, 1180891, 1125300, 1306066, 1302196, 1350140, 1079697, 1424123, 1129496, 1632647, 1396621, 1317054, 1498223, 1614588, 1195651, 1513700, 1750556, 1588874, 1257506, 1467039, 1455777, 1396752, 1499217, 1692132, 1520944, 1457132, 1197882, 1547896, 1507188, 1769994, 1590423, 1602289, 1622957, 1641787, 1861014, 2127834, 2120981, 1710937, 1915226, 1748500, 2008688, 1853943, 1746898, 1679092, 2320490, 1897514, 2093127, 2214061, 1901579, 2078477, 2147081, 2401427, 2432244, 2684180, 2628796, 2938056, 3221119, 3386246, 3715026, 5073605, 6668975, 10772580, 19437331, 38130743, 43727408, 20659235]
14542I323519D050741j794594l56290m80317K73591j48643N09011o2095o3948
14533A927456j74121j10693r626j306J38392k18817M76991k01779J18939q8245
14523A857191Q8475j87594L68802j20871L23803j94341q0078N8024L15954Q0625
14513B509990l36148L61710p6738m8019k62681l4113P4697L40983Q9596K15858
14503B835135k30328n1484K1459J69380j69097N0766k40889M68454j16827J25703
14493B862272r199L0279M0624o3765K7022R2472L74416m81307K13040J737J30866
14482C218457l39122K71780J92829P153k57915M87662m47597L08717Q8376n8224
14472C472116J6716J01757k2926M03103j72498j87790J71669P445N33559n75209
$$ y = [9323519, 4050741, 2256147, 1899857, 1419540, 1693131, 1544488, 2053499, 1991404, 1927456, 1753335, 1642642, 1633016, 1631710, 1770102, 1551285, 2028276, 1826497, 1945436, 1857191, 1945666, 1758072, 2126874, 2006003, 2329806, 2135465, 2055387, 2113411, 2429365, 2509990, 2173842, 2535552, 2458814, 2410795, 2148114, 2114001, 2188698, 2529681, 2619277, 2835135, 2604807, 2553323, 2574782, 2744162, 2575065, 2625831, 2384942, 2853396, 2736569, 2862272, 2853073, 2883352, 2923976, 2860211, 2887233, 2979705, 3354121, 2872814, 3085854, 3087591, 3218457, 2879335, 3151115, 3343944, 3351097, 3093182, 3580844, 3133247, 3441964, 3530340, 3472116, 3488832, 3590589, 3567663, 3970766, 3798268, 3610478, 3782147, 3789592, 4323151, 3747942]
14462C747942N46437l34666o4434J36690J42914o8881o6694L13698K30871l65211
14452D218666L90947k10583J79569m1727R1652L13955k0537j92143L14439k13475
14442D830763J09932K69686l21497o945N49777M3331k70061J35053K8170N47723
14432E915932l07470j03712O01327j62573j15156K81388m62235O63632j66471
14423F144662J68703K20201J70000O5406M2713j73370M17267k06776O94542j14950
14413G428398r9767J81441j62702O46329n31697K05644K97751K70976K09431j63431
14403H282373J39770J87344K10881J2012j4717M92676J6899L33741M17101k51289
14393I826791k69408L38944M54554M04947o9847M69960j8490l32530O27627L237
$$ y = [3747942, 4294379, 3959713, 3895279, 4031969, 4174883, 4106002, 4039308, 4353006, 4583877, 4218666, 4609613, 4399030, 4578599, 4536872, 4628524, 4942479, 4921942, 4729799, 5044238, 4830763, 4940695, 5210381, 4888884, 4881939, 5431716, 5475047, 5204986, 5340039, 5368209, 5915932, 5608462, 5504750, 6106077, 5943504, 5828348, 6109736, 5647501, 6311133, 6144662, 6313365, 6533566, 6703566, 6768972, 6811685, 6638315, 7055582, 6848806, 7543348, 7428398, 7328631, 7510072, 7347370, 7993699, 7462002, 7667646, 7965397, 8236373, 8445804, 8282373, 8422143, 8609487, 8820368, 8832380, 8817663, 9310339, 9327238, 9660979, 10078080, 9826791, 9557383, 9896327, 10350881, 10755828, 10685981, 11155941, 11137451, 10804921, 11432548, 11435785]
14383A1435785O39814J18902N50941k58904L16532K05193J24937O02987J17642
14374A3853829K42289n4531M70297M43064J37905N09022L92546j8074M26448M47725
14364A6850520L76346J92933L63835K73649M23287N26619K3061O78771Q53696
14355B0562717K90023N06270L05944O87398L07528P18601M88742P64962O68209
14346B5300394N37207N65714R13668P35265P09931Q96264Q82535N79078R79822
14337C2099878R22700P70150J084857Q94920J535878P42281J411970R52057J347306
14328D1761997J513838J391088J376880J533098J753211J414423K224996J750831
14320E4720362J883732K251033J749934K502745K305792K463195K965948K878363
$$ y = [11435785, 12075599, 12194501, 12745442, 12486538, 12803070, 13008263, 13133200, 13736187, 13853829, 14096118, 14041587, 14511884, 14954948, 15092853, 15601875, 15994421, 15976347, 16402795, 16850520, 17226866, 17419799, 17783634, 18057283, 18480570, 19007189, 19030250, 19709021, 20562717, 20852740, 21359010, 21664954, 22352352, 22659880, 23378481, 23867223, 24632185, 25300394, 25837601, 26403315, 27316983, 28052248, 28762179, 29658443, 30540978, 31120056, 32099878, 33022578, 33792728, 34877585, 35772505, 37308383, 38050664, 39462634, 40414691, 41761997, 43275835, 44666923, 46043803, 47576901, 49330112, 50744535, 52969531, 54720362, 56604094, 58855127, 60605061, 63107806, 65413598, 67876793, 70842741, 73721104]
14312G3721104L147261L068753L307149M002627L864456L902377M491288M135250
14304A03640265N177609N341187N399906O156054O566015O364596P409823P688813
14296A53744268Q177231Q541646R815626R737914J0689578J1728246J1629809
14289B24064318J2860084J3901171J4290917J4959373J5584685J6844217J6485144
14282C28989909J7615226J7526142J7529339J7079988J7000403J5597105J4806661
14275D46144773J2040149R857459N153869R30521o22980j469657j093310m605550
14267D66335274l507483q515256j1623919j3302316j4214121j6041998j7647126
14260C81483055j7598783j7726828j7780799j6955942j6705569j5643610j4767238
$$ y = [73721104, 76868365, 79937118, 83244267, 87246894, 91111350, 95013727, 99505015, 103640265, 108817874, 114159061, 119558967, 125715021, 132281036, 138645632, 146055455, 153744268, 161921499, 170463145, 180278771, 190016685, 200706263, 212434509, 224064318, 236924402, 250825573, 265116490, 280075863, 295660548, 312504765, 328989909, 346605135, 364131277, 381660616, 398740604, 415741007, 431338112, 446144773, 458184922, 468042381, 473196250, 474126771, 473503791, 472034134, 470940824, 466335274, 462827791, 454312535, 442688616, 429386300, 415172179, 399130181, 381483055, 363884272, 346157444, 328376645, 311420703, 294715134, 279071524, 264304286]
14253B64304286j4193749j3672597j2810398j2602904j1232089j0882309j0181313
14246A78728927r373970q850906p891075p469506p344695o901195o174791o102929
14238A18619860n086033n227526m873164m597593m218545m390373l789348l189136
14230H3248142l345600l764195k929250k478178l050730k686226k601143j908076
14222F0484744k302771j939577j809774k085830j966088j681177j461727j803251
14214D5434549j023861j449183j440115j218771j406362j386411n73740o60290
14206C6275816j049454j214005j346499r44643j009787j86961p81134n05876j473552
14197B7763905p05750j065784l01057k64697p35126p51802n94952m47104q83501
$$ y = [264304286, 250110537, 236437940, 223627542, 211024638, 199792549, 188910240, 178728927, 169354957, 160504051, 152612976, 145143470, 137798775, 130897580, 124722789, 118619860, 113533827, 108306301, 103433137, 98835544, 94616999, 90226626, 86437278, 83248142, 79902542, 76138347, 73209097, 70730919, 67680189, 64993963, 62392820, 60484744, 58181973, 56242396, 54432622, 52346792, 50380704, 48699527, 47237800, 45434549, 44410688, 42961505, 41521390, 40302619, 38896257, 37509846, 36936106, 36275816, 35226362, 34012357, 32665858, 31721215, 30711428, 30524467, 29743333, 29237457, 27763905, 27058155, 25992371, 25691314, 25426617, 24691491, 23939689, 23344737, 22897633, 22014132]
14188B2014132l92303j97618q84381k41122l27030p22718k75389k55312q96956
14179A7821303j08924l90639r5397k46974o41250l60047k10970n80629J95124
14170A5381597n05498n44241m05173p1683k64546j19678k07182l31404l58022
14161A2574170J74845q24628P6279r1891k88943o7639k93543k77554j79743m14105
14151A0387248L46463m49364j45217j63331m30771Q5113n35607L32309k59569
14142I167274q736O8157j85881m53082M7279k07413j84035q2749k6213k07166
14132G927435k5794m03043R0455k59265l2566k58081L73567o7254j43856m84732
14122F716866L37103j80783q3950q4737k46530J01394m00408M20741m76050k56766
$$ y = [22014132, 21621829, 21424211, 20539830, 20298708, 19971678, 19248960, 18973571, 18718259, 17821303, 17712379, 17321740, 17226343, 16979369, 16338119, 15978072, 15767102, 15186473, 15381597, 14876099, 14331858, 13926685, 13855002, 13590456, 13470778, 13263596, 12932192, 12574170, 12749015, 11924387, 12000666, 11908775, 11619832, 11552193, 11258650, 10981096, 10801353, 10387248, 10733711, 10284347, 10139130, 9975799, 9545028, 9630141, 9094534, 9426843, 9167274, 9158538, 9226695, 9040814, 8587732, 8635011, 8427598, 8243563, 8160814, 8134601, 7927435, 7901641, 7498598, 7589053, 7329788, 7297222, 7039141, 7412708, 7345454, 7201598, 6716866, 7053969, 6873186, 6789236, 6704499, 6457969, 6559363, 6158955, 6579696, 6103646, 5846880]
14112E846880j1950N260j08990r2656J63291k1414m39710L8790k5695K84061k45682
14101E392185m7725k81473J44110j48530k02043k08955l692M9370K03263m12015
14091D484495L97811l07154R9337K99557k73973m16248M6774r9021j20480J10509
14081D221607m4324o5642Q6171J04180j45544j45799j53333L544m6405m8121O5096
14070C831430J0922k42482L31219n46778K06578n7522j468k01999M91082m10761
14060C410221J15237k83709J18308K96226J662R7365o01118L1427J29344l13766
14050C001197J50953l7399n2427R2803o8739l37341O7262p559p6265J59406J310
14039B893201k40682M75289k89328k15527J80595m57085M29350L42775q11632
$$ y = [5846880, 5834930, 5840190, 5731200, 5638544, 5801835, 5780421, 5340711, 5379501, 5353806, 5637867, 5392185, 5344460, 5062987, 5207097, 5058567, 4856524, 4647569, 4643877, 4693247, 4896510, 4484495, 4882306, 4575152, 4674489, 4974046, 4700073, 4283825, 4330599, 4231578, 4111098, 4221607, 4177283, 4111641, 4197812, 4301992, 4156448, 4010649, 3857316, 3860860, 3814455, 3766334, 3831430, 3842352, 3599870, 3931089, 3384311, 3590889, 3533367, 3531899, 3329900, 3820982, 3410221, 3525458, 3241749, 3360057, 3656283, 3657945, 3755310, 3154192, 3185619, 3314963, 3001197, 3152150, 3114751, 3062324, 3155127, 3086388, 2749047, 2816309, 2808750, 2732485, 2891891, 2893201, 2652519, 3127808, 2838480, 2622953, 2803548, 2346463, 2775813, 3118588, 2306956]
14030B306956O54683l10312j60876J07622o565j94466j82544K76482j34610r7049
14020B259321k65562R14508m85679O7435j80357k78600J01296M3102p4324J57107
14010B258247q9826j34635p4963J88434k78421J6765k00503K90594l25478L78799
14000B029013l10766j80984K65026K23245l97322L81249j40163j00961j08287
13991A660050J62827L64812J021660K839713O919004J8216886J4163555j9834399
13983B5514108A1879394n045418j604133j096476o46313l86032l65636k85194
13975B450192m8016r4672j95021J65136m70102J90643L6736K01804k09606j58272
13965A868822J16715J32565j64581k52778n0183L69265r2829k40629j10457k6250
$$ y = [2306956, 2961639, 2651327, 2490451, 2598073, 2591508, 2397042, 2214498, 2490980, 2356370, 2259321, 1993759, 2908267, 2422588, 2490023, 2309666, 2031066, 2132362, 2175464, 2101140, 2258247, 2168421, 2033786, 1958823, 2147257, 1868836, 1885601, 1685098, 1975692, 1650214, 2029013, 1718247, 1537263, 1802289, 2025534, 1628212, 2009461, 1869298, 1768337, 1660050, 1822877, 2187689, 3209349, 6049062, 12968066, 31184952, 45348507, 25514108, 11879394, 6833976, 5229843, 4133367, 3487054, 3101022, 2735386, 2450192, 2402176, 2307504, 2112483, 2277619, 1807517, 1998160, 2034896, 2236700, 2027094, 1868822, 1985537, 2118102, 1953521, 1700743, 1650560, 2019825, 1926996, 1686367, 1575910, 1549660]
13955A549660M50072n19965K01006j75768R456J09757j84542l7242k02271N37324
13945A737487l69988K56672j13254M74420m16538J40295l43424k97997M68151
13936A535824k16874N74107k63618l25137J29945L2307M8175l54867M70558l91564
13926A238856J26300K10622l47811M85529n73134J62783j98358K8732J14445l4626
13916A213338K68537k41382j53267L74578m45078L50351j92543r6062M76566n33083
13906A021955K6759J36851m2791J23030j10636n0404k67473K18079J01799Q7084
13896A244253L2611j82573J5025P0999j86178k02042R9497K98272K63631n28845
13886I24650N44671l20670k52102L2110m7947J47853N7360l86741J63960J70987
$$ y = [1549660, 1999732, 1479767, 1680773, 1505005, 1514461, 1624218, 1439676, 1402434, 1200163, 1737487, 1367499, 1624171, 1510917, 1985337, 1568799, 1709094, 1365670, 1067673, 1535824, 1318950, 1893057, 1629439, 1304302, 1434247, 1466554, 1514729, 1159862, 1630420, 1238856, 1365156, 1575778, 1227967, 1713496, 1140362, 1303145, 1104787, 1133519, 1247964, 1213338, 1481875, 1240493, 1087226, 1461804, 1016726, 1367077, 1174534, 1078472, 1555038, 1021955, 1048714, 1185565, 1142774, 1265804, 1155168, 1104764, 837291, 1055370, 1157169, 1244253, 1276864, 1094291, 1109316, 1180315, 994137, 792095, 891592, 1189864, 1453495, 924650, 1469321, 1148651, 896549, 928659, 880712, 1028565, 1085925, 699184, 863144, 1034131]
13876A034131J52946k14333j62887K63906j81034K3501Q6587j81288k75242P56368
13866A302655k68667P9803j0437k95960L08161j02482m51968L23621k17000J70853
13856H38579k16646J08729J34423m0172J05384O4994n6649k41731K35933l59301
13846E73543J24667M13282n8336j94594r2661j34203K52062p1261m4048J0434
13836G78885r3292J64538L81162m9748n52704O7560j71183K02292j30346m7139
13826E50025M7134J97893k44785K08883p7728j57655M5276K12423J16603l05031
13816E93038N1987M41579E30618N26460C76174L72377J13710m5293o0036R1292
13806H48224r0756p7763L34196k29411P6468o5317j90553J36078j63253J07698
$$ y = [1034131, 1187077, 972744, 809857, 1073763, 892729, 916230, 1002817, 821529, 546287, 1302655, 1033988, 1113791, 1103354, 807394, 1115555, 1013073, 561105, 884726, 667726, 838579, 621933, 730662, 865085, 824913, 930297, 995291, 938642, 696911, 932844, 573543, 698210, 1111492, 1053156, 858562, 765901, 631698, 883760, 812499, 768451, 778885, 685593, 850131, 1231293, 1181545, 628841, 696401, 525218, 727510, 597164, 550025, 597159, 795052, 550267, 759150, 681422, 523767, 569043, 781466, 898069, 593038, 645025, 1086604, 530618, 1057078, 376174, 748551, 862261, 816968, 756932, 848224, 757468, 679705, 1013901, 784490, 860958, 795641, 605088, 741166, 577913, 685611]
13796F85611q649J13815C59534j05790L64139R6767q8922j21522P0389o6805P7890
13785E85680L64741j82617k39842N35463D43576L67341p3j46876k28893K08788
13775F43863J3121k4043k37776Q8229J55909k30374K97617k46870J89798Q0495
13765G29969j5095l38668j33173M71138l13666K88898j35668R2038C08101K53941
13755E62042k79733L49609k93212P055M02050p8512k34201K66850j22978k3949
13745E55021O561k2939K21678l39188L9978M2715l648m3988P093J90718C18969
13733E70474q0604J1646j6918R4384M4293r2249q0640n8015D4205J90776O3020
13722B98001M24822A18332K77513K73881l26352M50662l82735K50525j76492M1432
$$ y = [685611, 676962, 790777, 359534, 253744, 617883, 714650, 625728, 504206, 574595, 507790, 585680, 950421, 767804, 527962, 1063425, 443576, 810917, 810844, 663968, 435075, 643863, 656984, 632941, 395165, 483394, 639303, 408929, 706546, 459676, 649474, 729969, 714874, 376206, 243033, 714171, 400505, 689403, 553735, 645773, 308101, 562042, 282309, 631918, 338706, 345761, 747811, 669299, 435098, 701948, 578970, 555021, 561582, 538643, 760321, 421133, 461111, 503826, 500178, 456190, 463283, 654001, 318969, 570474, 489870, 501516, 484598, 578982, 623275, 531026, 450386, 392371, 44205, 234981, 298001, 722823, 118332, 395845, 669726, 343374, 794036, 411301, 661826, 485334, 526766]
13712E26766K68548k31206K07958j47056k33319M65729D11223H7532N26006k02460
13702D11078j85693K14946k7781j80384J09852J70433A21867M44583Q4059A46787
13691C84002L5607j37105J58215J87911o3155q4894A91906K07757j3013K2246
13681D08896j29736K23664P3163k77050r7764J25062j3032J00961N4019k06915
13671B61268K60017R2249n329k47480m4179l6277J89985k1880N9653J63854B44182
13659B93429L9181p9257O5495J74085B38697G9114O40380k63532l9856L4482j15950
13648C34638J53130J01631k26080A44275J46856j05491m9960J97830M8200n1554
13638C30156j656l402q4611m6887J52061r2153A08320K00626J24520j18013P5020
$$ y = [526766, 795314, 564108, 772066, 625010, 391691, 857420, 411223, 87532, 613538, 411078, 225385, 440331, 412550, 232166, 342018, 512451, 121867, 566450, 650509, 146787, 384002, 419609, 282504, 440719, 628630, 565475, 480581, 191906, 399663, 386650, 408896, 279160, 502824, 575987, 298937, 201173, 326235, 313203, 414164, 468183, 261268, 521285, 613534, 608205, 360725, 316546, 280269, 470254, 448374, 508027, 671881, 244182, 293429, 332610, 253353, 318848, 492933, 238697, 79114, 719494, 455962, 416106, 450588, 334638, 487768, 589399, 363319, 144275, 291131, 185640, 135680, 333510, 381710, 330156, 328500, 325098, 240487, 193600, 345661, 253508, 108320, 308946, 433466, 315453, 390473]
13627C90473j45449Q8382l6228K55J27514r81A84867r1754K49353K0577j13358
13616B49685E4968J67870E5803J72012R8922M3269j17284N812K54885B44238J1228
13605B55466J67110a15256q720L059B97498R2699K20409k38175J83282p2800j6539
13594D66374k6082A21238L82954r0099j40634J29335R3384A51788O465j5190K36769
13583C79832m6442Q7194N6507c04101B69874M35870A36380J28766j26769J84106
13573C22483J19654A34387J96724l5518J02679M6945j5079B05785c35684A2982
13562f8932C7149L30182p6796P7470I8561J21364n6407P6261k8372j1318K52311
13551D52400k9846A98306J09025A23811M49032A66841a23884A55564J37704L68114
$$ y = [390473, 245024, 333406, 297178, 297433, 424947, 423966, 184867, 93113, 342466, 363043, 249685, 54968, 222838, 55803, 227815, 326737, 370006, 252722, 258534, 513419, 244238, 255466, 422576, -115256, -123976, -120917, 297498, 390197, 610606, 372431, 555713, 482913, 466374, 440292, 121238, 504192, 414093, 273459, 402794, 496178, 151788, 158253, 143063, 379832, 333390, 420584, 477091, -304101, 269874, 705744, 136380, 265146, 138377, 322483, 442137, 134387, 331111, 295593, 398272, 445217, 430138, 205785, -335684, 12982, -68932, 37149, 367331, 290535, 368005, 98561, 219925, 163518, 239779, 211407, 200089, 452400, 422554, 198306, 307331, 123811, 572843, 166841, -123884, 155564, 293268, 661382]
13541F61382k53443K02786B04981M7934I4277J68997H2484J32673D1221L00724
13531C41945j09760R5769j14952K5424A06934Q0504R4857j02888N0812L6212P1944
13520C38375p3209P2033J59449m0054n1831q3191j44858j73J37577j19815o1657
13509A32646K56876j32939J24074D0445J52063J31431A1599M0555c18190G7847
13498C34036j14183k9901K98735r1682A14780k2576J92947m1850l516M5733M2020
13487C27538j03265r022d1269R314A06152O9825J91406j06283C4489M11033d0329
13475E63515A97552f2552B899N83207k55078I0908J44191r4092F7138N56010C0601
13463D67072A62874J12203a09829B22617q3181k356J14964n6384L27107B03006
$$ y = [661382, 407939, 610725, 204981, 252915, 94277, 263274, 82484, 215157, 41221, 341945, 232185, 327954, 213002, 238426, 106934, 187438, 282295, 179407, 230219, 266431, 338375, 265166, 337199, 496648, 456594, 404763, 321572, 176714, 176541, 314118, 194303, 132646, 389522, 256583, 380657, 40445, 192508, 323939, 11599, 52154, -318190, 77847, 334036, 219853, 189952, 488687, 397005, 114780, 92204, 285151, 243301, 239785, 285518, 327538, 224273, 215251, -41269, -31955, 106152, 175977, 367383, 261100, 34489, 445522, -40329, 563515, 197552, -62552, 2899, 586106, 331028, 90908, 235099, 141007, 67138, 623148, 30601, 467072, 162874, 275077, -109829, 222617, 139436, 137080, 252044, 195660, 522767, 203006]
13452A90366I3860J25071j04416J35592p5597E5172h9312C50344F0292L11912
13442C72204A00698g4587A96045J45570A51218L47922A22094O3849n8978L80217
13432E07182j74436A27769J6426n8784K38203J2013I3166J48549p5853P2420p0421
13421A67861J83910N05A04397P3808n9043a39533B82869e3070A8963J64569J3595
13410A97127I5178O4474M7231J44511j57059J87150j2432L7881h128A28035b71362
13398D31761A64223J6780L28850B17519j8721I0540J56708K2957R1725J8609g6561
13386B92357A36499P1330H1218R2777J36506a28890E13065A86260L28444A93722
13375a96642I2759O1549M90940d0289D42379r4392J14872A65878O3838a54259
$$ y = [190366, 93860, 218931, 114515, 250107, 174510, 55172, -89312, 350344, 60292, 372204, 100698, -74587, 196045, 341615, 151218, 499140, 122094, 185943, 126965, 507182, 332746, 127769, 144195, 85411, 323614, 335627, 93166, 241715, 165862, 238282, 167861, 351771, 352276, 104397, 178205, 119162, -139533, 282869, -53070, 18963, 183532, 197127, 95178, 159652, 206883, 351394, 194335, 381485, 369053, 406934, -8128, 128035, -271362, 431761, 164223, 181003, 509853, 217519, 198798, 90540, 247248, 270205, 361930, 380539, -76561, 292357, 136499, 207829, 81218, 173995, 310501, -128890, 513065, 186260, 514704, 193722, -196642, 92759, 154308, 645248, -40289, 442379, 347987, 462859, 165878, 229716, -154259]
13364c0972C70180H5647J51870b5065C79253c6402n0453D73237A96556J7090l7520
13353A76126J11769A15664K28747b5826o1800I9817K02915H7326K53412H0005
13342E46536j97102A54655j0781P1669n5481a2985G5679K41773e7587J5891n2764
13331i4460C08623K06622B34317F7330N2728l9402c61110d4255l9141B49100h1831
13319C18766A52354J98965j62130K23590A72300K24587L8222A77540O3253L18172
13309E58965a80399R0082a0363C61479A12916A8646P42923A96110h8336A37666
13298A70748O2075h177C7845g728B14398Q7745b00091b5251r2895b2361A79790
13286I7749J46241D6859M8118E930Q9104k2191g3664B30675f5043B19143K24735
$$ y = [-30972, 370180, 85647, 237517, -25065, 379253, -36402, -86855, 473237, 196556, 213646, 176126, 287895, 115664, 344411, -25826, -87626, 99817, 302732, 87326, 340738, 80005, 546536, 349434, 154655, 143874, 215543, 160062, -12985, 75679, 317452, -57587, -41696, -94460, 308623, 515245, 234317, 67330, 120058, 80656, -361110, -44255, -83396, 249100, -81831, 318766, 152354, 351319, 189189, 412779, 172300, 396887, 435109, 177540, 240793, 558965, -180399, -90317, -10363, 361479, 112916, 18646, 761569, 196110, -88336, 137666, 170748, 232823, -8177, 37845, -7728, 214398, 302143, -200091, -25251, -118146, -22361, 179790, 97749, 243990, 46859, 94977, 5930, 95034, 72843, -73664, 230675, -65043, 219143, 443878]
13275D43878A30065K16697b14929D866J30236b6201A72542F3254a30502B82975
13264B7850J2514c6437I6871J04768a56924H8593K83287a58808B36099J62596
13254C98695d2814E4560c1420G3471L0183L75610D157a25427k04873a30821G335
13242B49024o1443N0136J91329l7536c8535l3199I2138g5478A55997J09319r3747
13231A71569a21174c3784G3542L69494c1452I9536P7129E1016K61242n2213c2539
13219a81146A39780q029M50517a17699c3105m7669A01125D939c4699B9694I978
13207c24611A02615j6300B507K91558b09889G9036J7889a05536C020J22296E5388
13195d6709k14619A37718J9037h491k03360A00967J13445H7379a34687D49441
$$ y = [443878, 130065, 346762, -214929, 4866, 135102, -26201, 172542, 63254, -130502, 282975, 27850, 40364, -36437, 96871, 201639, -156924, 88593, 371880, -158808, 236099, 398695, -42814, 54560, -31420, 73471, 103654, 479264, 4157, -125427, -330300, -130821, 7335, 249024, 187581, 237717, 429046, 391510, -38535, -71734, 92138, -75478, 155997, 265316, 171569, -121174, -33784, 73542, 443036, -31452, 99536, 176665, 51016, 312258, 260045, -32539, -181146, 139780, 131751, 582268, -117699, -33105, -80774, 101125, 4939, -34699, 29694, 9978, -324611, 102615, 86315, 2507, 294065, -209889, 79036, 96925, -105536, 3020, 125316, 55388, -46709, -261328, 137718, 156755, -8491, -211851, 100967, 214412, 87379, -134687, 449441]
13184C53318d5221J9024r3806B05126b24233G5535J82890i4710j26598C35981
13173C2479K01128E2719j4367J50336h9246F085c05252C7665a92328J5311B19830
13161a6750B04886a01372A68201R6565g1758A97831c95632a54899P6450A63241
13150A57087m6922g8866I4039G545K33451B0630b68665A57515b48994C59026H2357
13138A38411E433a2428A7218b5849B17683a59785e5571C4363d9359j44761j15297
13127c09417A74944P3566a10107A64532a91432D5804j3266q233b10118C88862
13116D7632O1921a42863I2640J28559G2067N0960J50724q5541a20963C25697l9206
13105B86491j00408Q4237r6107i7376B38332i0406K8299A27753b3767A57628d4445
$$ y = [353318, -45221, -26197, -120003, 205126, -224233, 75535, 258425, -94710, -221308, 335981, 32479, 233607, 52719, 38352, 188688, -89246, 6085, -305252, 37665, -192328, -177017, 219830, -16750, 204886, -101372, 168201, 264766, -71758, 197831, -395632, -154899, -78449, 163241, 157087, 110165, -78866, 94039, 7545, 240996, 20630, -268665, 157515, -248994, 359026, 82357, 138411, 5433, -12428, 17218, -25849, 217683, -159785, -55571, 34363, -49359, -194120, -309417, 174944, 248510, -110107, 164532, -191432, 45804, 32538, 24305, -210118, 388862, 47632, 109553, -142863, 92640, 221199, 72067, 123027, 273751, 188210, -120963, 325697, 286491, 186083, 270320, 174213, -97376, 238332, -90406, -62107, 127753, -23767, 157628, -44445]
13093e0003I4994a85170F7935A3183g1063J9985l0523B72220a93793j1082C03474
13081c2042j46303F8599R1809m4676r846b72480A54633K26834f8527B03614p6480
13070A27134h7476j19811H1114C2213J22882E8106J8953K79702h1822A30539O889
13059A37428Q1909J48366f960p3837A87615l7416b09847A73481c4637j16837B71463
13047C34416f574B42690f4346H652Q3004e7804B07649a77323G1941h983A42990
13035b17020a2105A51642O9511b30853O9171H3527C5073J92671Q2686q1438l9703
13024A89289l0305k0000F3710d4176A48226P1851I6081J89357a79431B53392B8507
13012B40326n2294P0218J63970a19847C18721e913l1739B11977e067j19213B22726
$$ y = [-50003, 94994, -185170, 67935, 13183, -71063, -51078, -81601, 272220, -193793, -204875, 303474, -32042, -178345, 68599, 160408, 115732, 105886, -272480, 154633, 381467, -68527, 203614, 127134, -87476, -207287, 81114, 32213, 155095, 58106, 77059, 356761, -81822, 130539, 137428, 219337, 367703, -6960, -80797, 187615, 150199, -209847, 173481, -34637, -151474, 271463, 334416, -6574, 242690, -64346, 8652, 91656, -57804, 207649, -177323, 71941, -8983, 142990, -217020, -12105, 151642, 221153, -230853, -161682, 83527, 35073, 227744, 310430, 228992, 189289, 158984, 138984, 63710, -44176, 148226, 220077, 96081, 285438, -179431, 253392, 28507, 240326, 188032, 258250, 422220, -119847, 318721, -5913, -37652, 211977, -5067, -124280, 222726]
13000b29A52274J22210D2094a22939o1749A52948E2352J61699b1071q9156A97283
12988H348b12062a00602A60779J21600a81274A43887K3976K53229q4196c23347
12977e1j9380C70372a62219A67937M6856m2386J63743b62734h5672b2462l45568
12966c68030a48003A89052J6536P3086K17548F7840a64068B7753f7129B06847
12955c08542H5789L9575b76223A55827n9463a12768a8330l72503B09606G6381
12944A5922J41152p122K0398J09301J22134a14870j74106m994I652a07039k17282
12933c24321J35226b4129j8522F249L08002b13322M445Q7192G7109a71238A06573
12921B63823A25598J00270b9407i386G4064P83a20159J7333D9741c30077A34776
$$ y = [-229, 152274, 274484, 42094, -122939, -184688, 152948, 52352, 214051, -21071, -110227, 197283, 8348, -212062, -100602, 160779, 282379, -181274, 143887, 167863, 421092, 336896, -323347, -51, -19431, 370372, -162219, 167937, 214793, 172407, 336150, -262734, -85672, -22462, -368030, -148003, 189052, 205588, 278674, 496222, 67840, -164068, 27753, -67129, 206847, -308542, 85789, 125364, -276223, 155827, 96364, -112768, -18330, -390833, 209606, 76381, 15922, 157074, 149952, 170350, 279651, 401785, -114870, -288976, -293970, 9652, -107039, -324321, -189095, -24129, -42651, 6249, 314251, -213322, -208877, -121685, 77109, -171238, 106573, 263823, 125598, 225868, -29407, -9386, 74064, 74847, -120159, -102826, 49741, -330077, 134776]
12909a40936O3448A34638Q2076G3985A6002c5619o0496D0652J99403e0967B26898
12897b21732A69427b33406B96020L9420h4243k26456D3325a55336D3169b00417
12886H6290K48112I4950K00951A30503A0830a4454n1960l5343A37345O6963a2468
12874C27674d3262k14794C08592r7839C6653K28598a77524B85563a89606F9802
12863a16557B87765A7373b07662A11552P6876b8593G3674g156H1572l0015d5498
12851b97072c4249H9709B6215J09939B1364d3599j5565j2033F039b04637B35491
12839b781D082O455d7571G3961Q0838b90291B5342K60557B3839g3127C60968B8743
12826A97323a0630B30283A8153c4593J1813k07223m5280B28072a40798A23164
$$ y = [-140936, -77488, 134638, 216714, 73985, 16002, -35619, -96115, 40652, 240055, -50967, 226898, -221732, 169427, -233406, 296020, 335440, -84243, -310699, 43325, -155336, 43169, -200417, 86290, 334402, 94950, 295901, 130503, 10830, -14454, -66414, -101757, 137345, 204308, -12468, 327674, -43262, -258056, 308592, 210753, 36653, 265251, -177524, 285563, -189606, 69802, -116557, 287765, 17373, -207662, 111552, 188428, -28593, 73674, -7156, 81572, 51557, -45498, -297072, -34249, 89709, 26215, 136154, 21364, -43599, -59164, -71197, 6039, -204637, 235491, -2781, 4082, 10537, -47571, 73961, 154799, -290291, 25342, 285899, 23839, -73127, 360968, 28743, 197323, -10630, 230283, 18153, -34593, -22780, -230003, -275283, 228072, -140798, 123164]
12815a34748j54145A95718a96903N4835B3138a62983A67100f4519D5509R2314
12805A37823Q0437a40668q8509C43237c1372k19770P1832d5127A7965J65767J9681
12794B03413D0990K18801G556K13789a72379j30611Q1387B70049j30446a42540
12783a5856k20797J12950N8720A45469C2682J10918h6395B76933j11264e3428
12772E8208a53853E4017b32130A84674a82621H9707a44351G2978i7413I9915D248
12760D29J96832O3027k261E3017J50513o0004j5589i2393j68870J06485F4385
12748A7212J84805e0345m0057k2715M8730k5825j21577e4292j24215A65101J51618
12737C16719A23820E9247J72617J03253E7577L8542D1851J63179C5758P6731e0048
$$ y = [-134748, -288893, 195718, -196903, -142068, 23138, -162983, 167100, -64519, 45509, 137823, 218260, -140668, -229177, 343237, -31372, -251142, -179310, -45127, 17965, 183732, 203413, 40990, 259791, 7556, 221345, -172379, -302990, -221603, 270049, 139603, -142540, -15856, -236653, -123703, -64983, 145469, 32682, 143600, -86395, 276933, 165669, -53428, 58208, -153853, 54017, -232130, 184674, -182621, 89707, -144351, 72978, -97413, 99915, 4248, 429, 197261, 260288, 258027, 53017, 203530, 143526, 127937, -92393, -261263, -154778, 64385, 17212, 202017, -50345, -90402, -113117, -64387, -90212, -211789, -54292, -178507, 165101, 316719, 123820, 59247, 231864, 335117, 57577, 96119, 41851, 205030, 35758, 112489, -50048]
12725A5281J8263c7974o1071A13302b4312j59014a3842j40560B4207a63762f60
12713F6416J17905R7346K81459I2955b3052C06847J7196P4667c64329B44876D20
12701A43044N08213H1007K04492b07892k3987O8864A87156H7003b76793d1574
12690A66155D2224K73165A47817b20586B7416i9428j517I0712a6285C65598j42133
12679B23465K0013d8019E34018k43785G552R5633J52843b6298F0677C0242b72965
12667c72888E1079b36975C51030A67885o2684J57212h086A09335d3924p1311b1746
12655C31893k6956G7058k0202B1735b61893G4335P357A1448J2085J21306f628
12643A26613d1117l9761j02603h4580C53204n9071P3814d8512A03915O3406l9342
$$ y = [15281, 33544, -37974, -99045, 113302, -24312, -183326, -13842, -154402, 24207, -163762, -660, 66416, 184321, 281667, 563126, 92955, -23052, 306847, 324043, 398710, -364329, 244876, 420, 143044, 651257, 81007, 285499, -207892, -231879, -163015, 187156, 87003, -276793, -41574, 166155, 42224, 315389, 147817, -220586, 27416, -99428, -100945, 90712, -16285, 365598, 223465, 243478, -48019, 534018, 290233, 7552, 103185, 256028, -26298, 60677, 30242, -272965, -372888, 51079, -236975, 351030, 167885, 105201, 262413, -8086, 109335, -43924, -115235, -21746, 331893, 304937, 77058, 56856, 21735, -261893, 74335, 81692, 11448, 23533, 144839, -6628, 126613, -41117, -80878, -183481, -84580, 353204, 294133, 367947, -48512, 103915, 167321, 127979]
12632A27979C2446J13662k1595J48496h7627B3507K1737M4123m3155k0983h099
12620B87770a20334A8162L8034b74022A07713c18327A23056N1910b07352n6620
12610b63972A09039H892J40623j9129a710j24790c2038C23677A46562a48516A23107
12598D00871b88923B12442J80463j19734o9890a66540j06070C0299p910b66062
12587A61886J65740A09133b62426J17401B67726K3341A08069P1219R2022g6785
12576h2815p6151I5760J07683f596B2113J5798a23878A70519a90802b0493C18419
12564G9325O1984k3893B168K32300f941A50217b5232B91241H475M1144a0041j6017
12552b6058A1462R0283b55583k29235F5265a98324C61424A68345n2271a11545
$$ y = [127979, 32446, 146108, 124513, 273009, -87627, 23507, 45244, 89367, 46212, 25229, -8099, 287770, -120334, 18162, 56196, -274022, 107713, -318327, 123056, 174966, -207352, -263972, 109039, 8892, 149515, 130386, -1710, -126500, -32038, 323677, 146562, -148516, 123107, 400871, -288923, 212442, 392905, 273171, 203281, -166540, -272610, 30299, 22389, -266062, 161886, 327626, 109133, -262426, -145025, 267726, 291067, 108069, 179288, 271310, -76785, -82815, -158966, 95760, 203443, -6596, 22113, 37911, -123878, 170519, -190802, -20493, 318419, 79325, 141309, 117416, 2168, 234468, -6941, 150217, -25232, 291241, 8475, 49619, -10041, -26058, 11462, 101745, -255583, -484818, 65265, -198324, 361424, 168345, 116074, -111545]
12541D794b17715c49k83764C4452a51117B15080H6582K03838a96248Q3369B6746
12529a80031I8357b91101B65051b63939a16622I739K68618a61939H0365e6122
12518d04485a10357C85147A46353l3770B9028J21760i6050n1707f1502B4882b98550
12506I9222E737a18174L4081B03918A3048K54417J7633E1884d097F423f2889l5625
12494i8514B49609G051J23765b41643K6270k01783A77782a88492A73849b2025
12483B93543a61981e3523b1068l5067A32705a56612B0172h1323A1173K4594J36661
12472A72428D7268J87221a40830A31982m4096a95117L6926M5163j12074B39754
12461E3083J8349c7908E9298b17547N5682P7550K2782D51174c07705J20154b7406
$$ y = [4794, -217715, -349, -284113, 34452, -151117, 215080, 86582, 290420, -196248, -112879, 26746, -180031, 98357, -291101, 265051, -263939, -116622, 9739, 278357, -161939, 80365, -56122, -404485, -110357, 385147, 146353, 112583, 29028, 150788, -96050, -147757, -61502, 24882, -298550, 99222, 5737, -118174, -84093, 203918, 13048, 267465, 285098, 51884, -4097, 6423, -62889, -98514, 249609, 7051, 130816, -241643, -215373, -417156, 177782, -188492, 173849, -22025, 293543, -161981, -53523, -21068, -56135, 132705, -156612, 20172, -81323, 11173, 35767, 172428, 47268, 234489, -140830, 131982, 87886, -195117, -158191, -113028, -225102, 239754, 53083, 71432, -37908, 59298, -217547, -161865, -84315, -61533, 451174, -307705, -187551, -27406]
12449A7595b9328C38825a58606k721C21571a05549D9853J9820A4197J33615g1181
12437C6897J18713b12723C48674A01728h1250j26020R9248J2452J9373A22117
12426F1303b43311g4645I427b05156D78742D5996K77218a84884G8135b94173B10071
12414C99209A13257j980a02838E0275a4937j3868A02719J5613k149m7597b96324
12402b90254A39809l0357k3502k598O4000e02931e1774A63782a35704L3913B94540
12390c3025G3030Q2954b49746B58403a01216A69226a59659J1706N4158d6837C2919
12378C448M2601a51859a9730A00802k345R254a81262K8024j53676E8350a95576
12366a07996A54984j1438d6196j96541k0400J17321A81394f5658B15870a54929
$$ y = [17595, -29328, 338825, -158606, -161327, 321571, -105549, 49853, 69673, 14197, 147812, -71181, 36897, 155610, -212723, 348674, 101728, -81250, -207270, -108022, -95570, -76197, 122117, 61303, -243311, -74645, 9427, -205156, 478742, 45996, 323214, -184884, 78135, -294173, 210071, 399209, 113257, 111277, -102838, 50275, -14937, -28805, 102719, 118332, 116183, 68586, -296324, -290254, 139809, 109452, 85950, 83352, 147352, -502931, -51774, 163782, -135704, -101791, 294540, -33025, 73030, 155984, -249746, 258403, -101216, 169226, -159659, -147953, -93795, -46837, 32919, 3448, 46049, -151859, -19730, 100802, 98457, 107711, -181262, -153238, -306914, 58350, -195576, -107996, 154984, 143546, -46196, -242737, -263137, -145816, 181394, -65658, 215870, -154929]
12355b3689j52309g4310B39962a9905n6510j37844c9738G5964B3464R7940C4547
12343b12933A88281f802C64912q9124A26754n4291a85494C8606d44469d5337j51396
12332a96733G253g5205o0573j60956A64172a70174d6715B57964H1968K9427a39254
12320A63487g8898E1053c3101A00150J3449f5371k73939B30460l8520f0495A05180
12308G6817J00861B8881N323K95630j56497H518h4255A88038c90293J57073i5174
12296a45251B43102l0987B3202a44474g148o9469j19820A28285J21925B5074a27943
12284B5481a03277D33688B09152o8788F9809N9657q123L9812K40859p6358C6456
12272B11570a45633D08409K3745j91710n3769O5295K2500j02048H4717j9129A3499
$$ y = [-23689, -175998, -74310, 239962, -19905, -76415, -214259, -39738, 75964, 23464, 121404, 34547, -212933, 188281, -6802, 364912, 275788, 126754, 72463, -185494, 38606, -444469, -45337, -196733, 7253, -75205, -135778, -296734, 164172, -170174, -46715, 257964, 81968, 111395, -139254, 163487, -78898, 51053, -33101, 100150, 113599, -65371, -339310, 230460, 191940, -60495, 105180, 76817, 177678, 28881, 34204, 329834, 173337, 8518, -84255, 188038, -390293, -233220, -95174, -145251, 243102, 212115, 23202, -144474, -7148, -76617, -196437, 128285, 250210, 25074, -127943, 25481, -103277, 433688, 209152, 140364, 69809, 129466, 121343, 161155, 402014, 325656, 36456, 211570, -145633, 408409, 432154, 240444, 186675, 251970, 274470, 172422, 84717, 65588, 13499]
12260B80118J11497A71509C7249J52012o5961K15232e4390B31161p7937O5503
12250B18727g7737C27161g3329k1548j66398c3015j00248a5590A81607B0972b47817
12238A39783b4397D4768a41256f4165k10683A541c4233o4174B94325d5271o8706
12227a13977B27572Q6869G4975Q157f6719A64568J56558a80766b8223F4695K81622
12216C46317A38822J97655a07232D4287J52522E4970M9503C4749J27394n0488
12206A11655b0787A29371C3588j0408R0821K27203C3432A5129b749l8690E81764
12194g3349p2052A74051B9747i6634B0437K34940A8221b1516A55263L49569p8912
12183D25920A1630K03934r3153J51617G3010e5471B77824b43215A65794Q3084
$$ y = [280118, 391615, 171509, 37249, 189261, 123300, 338532, -54390, 231161, 153224, 218727, -77737, 327161, -73329, -94877, -261275, -33015, -133263, -15590, 181607, 20972, -247817, 139783, -24397, 44768, -141256, -64165, -274848, 1541, -34233, -98407, 294325, -45271, -113977, 227572, 314441, 74975, 83132, -66719, 164568, 321126, -180766, -28223, 64695, 346317, 138822, 336477, -107232, 44287, 196809, 54970, 104473, 34749, 162143, 111655, -20787, 129371, 33588, 23180, 114001, 341204, 33432, 15129, -2749, -41439, 581764, -73349, -145401, 174051, 29747, -96634, 20437, 255377, 18221, -21516, 155263, 504832, 425920, 11630, 215564, 122411, 274028, 73010, -55471, 277824, -243215, 165794, 248878]
12173B48878f8160l0586A12781J35848p2804I316L35886j10615l4044a09966G1785
12161b37031E974M03737A30833c4056A00807L3361J64107E5608B3555J401b43072
12149A3898b54893C5804J4299a28876D6889M5952J03302m0624P9403f5167A65494
12137B58730A03941A6967R9665a39059l9516F1889b43718J05160m3351G9445J52107
12126B31552i8495E5259J2685c9030F9150B2926L3027a47196q2380Q2139C47445
12114A24439e3317j0566j7439p396k6331B24971a23114K1027A94229B219Q132
12103A0351L8342a45461A06619a26931I1032K63779b4523j39997k4428P495A59459
12091d6269N27C82508j87649D0726J41055O7069F9465c21362E9598d3722P934
$$ y = [248878, -68160, -98746, 112781, 248629, 175825, 9316, 345202, 234587, 200543, -109966, 71785, -237031, 5974, 409711, 130833, -34056, 100807, 134168, 298275, 55608, 23555, 24956, -243072, 13898, -254893, 35804, 50103, -128876, 46889, 92841, 196143, 155519, 234922, -65167, 165494, 258730, 103941, 16967, 116632, -139059, -178575, 61889, -243718, -138558, -181909, 79445, 231552, -98495, 55259, 67944, -39030, 69150, 22926, 55953, -147196, -229576, -147437, 347445, 124439, -53317, -63883, -81322, -88718, -115049, 224971, -123114, -102087, 194229, 2219, 10351, 48693, -145461, 106619, -126931, 91032, 354811, -24523, -164520, -188948, -181453, 159459, -46269, -45742, 382508, 194859, 40726, 181781, 248850, 69465, -321362, 59598, -43722, -35788]
12080c5788C92459a23141I933O8623d9479i131A18823M09615R73270O89529G00693
12068A66054k7329o9191b93913A64299b79715G9624a38532j33084A32080a89053
12057C55456m5163j54940c9164B68694a9814E6059g3719C99819A02447b01091
12046B8220g8986H2938A2933h696k31272J12379A23317a32624D886e09412A87437
12034c1678F9789b72262i5165k17820J00658E8772L153F248L26882E2444K14074
12023B66518G6008j5147e8285l05229f4587j2667K3911A37686C4132J43736b70784
12011A96768F5336a76032H0206b73435j6430d3289C52265a71829o4765A4813a35234
11999b66659j0541a34442E8987a76272B4400J75833r9707a09781c5844j91369
$$ y = [-35788, 392459, -123141, 9933, 78556, -49479, -9131, 118823, 528438, 1501708, 2191237, 700693, 166054, 138725, 69534, -293913, 164299, -279715, 79624, -138532, -271616, 132080, -189053, 355456, 310293, 155353, -39164, 268694, -19814, 56059, -73719, 399819, 102447, -201091, 28220, -78986, 82938, 12933, -8696, -239968, -127589, 123317, -132624, 4886, -509412, 187437, -31678, 69789, -272262, -95165, -312985, -212327, 58772, 61925, 6248, 333130, 52444, 266518, 76008, 60861, -58285, -363514, -64587, -77254, -53343, 137686, 34132, 177868, -270784, 196768, 65336, -176032, 80206, -273435, -289865, -43289, 352265, -171829, -236594, 14813, -135234, -266659, -277200, -134442, 58987, -176272, 24400, 200233, 100526, -109781, -35844, -227213]
11989b27213G737b16822f2817B4723O3166J38391b5745j67898h3226B14724j04110
11978A10614I18b39493b7452k08792n1469a20139d6489k26812b4800B283K90333
11967B92616b42405C67726B726a62994k56781B1675p551J27185F0385a08768j82099
11956b90867A77613F6359c23116J13799f8155b4998k32418F5597O8187D0345a40611
11944C0506K76529j48514o4329a21980B6809N15693a10627j15771A56688b0835
11933b07085B30019c32240A26187b06689H98g5879n7249j19704N520J17980C02440
11921A39169B1636b9162b311A47869i0619K4648l3531H1414g0880k9361d7759
11909A31628b62775H708h9552A41308a16604D577d53711B01098L4003B4324l891
$$ y = [-227213, 7737, -216822, -62817, 24723, 87889, 226280, -25745, -193643, -83226, 214724, 110614, 918, -239493, -27452, -236244, -287713, -120139, -46489, -273301, -24800, 2283, 292616, -242405, 367726, 2726, -162994, -419775, 21675, 14124, 141309, 60385, -108768, -290867, 177613, 66359, -323116, -209317, -68155, -24998, -257416, 65597, 133784, 40345, -140611, 30506, 307035, 158521, 94192, -121980, 26809, 542502, -110627, -226398, 156688, -20835, -207085, 230019, -332240, 126187, -206689, 898, -75879, -133128, -252832, -247312, -129332, 302440, 139169, 21636, -29162, -2311, 147869, -90619, -65971, -99502, 81414, -70880, -100241, -47759, 131628, -262775, 8708, -89552, 141308, -116604, 4577, -453711, 201098, 235101, 24324, 20433]
11898B0433n371R7451J63159G5358a43268I7825L0083e1734C65995a70573J7915
11887a52658B34352A08483d31622A35570l4452K43273F9802R082b64632a1386
11876B05260A01166C3862a48783a209n8814k631B8548e5335k14624F179J66232
11865A72411a78308C66208H5487O9770a53510E04733c8829j63963f6747j15990
11855a82737k39350G6944a61063g7368A85586a15656A2820K279K09320E7054a14205
11843a91889D6715q540I807a27877j047B70038A28471K07011b54180E079Q6216
11832I1295b43257h3917j1508A11998b13170A10758m1772b4419A21984d9490k9791
11821g9281K887A54903C6030a01182A04360C1167g4332p3036p9626C7828c4715
$$ y = [20433, 15062, 112513, 275672, 75358, -143268, 97825, 127908, -51734, 365995, -170573, -152658, 234352, 108483, -431622, 135570, 101118, 344391, 69802, 78884, -264632, -11386, 205260, 101166, 33862, -148783, -1209, -60023, -62654, 28548, -55335, -269959, 6179, 172411, -178308, 366208, 85487, 155257, -153510, 504733, -38829, -202792, -66747, -182737, -422087, 76944, -161063, -77368, 185586, -115656, 12820, 15099, 224419, 57054, -114205, -191889, 46715, 38175, 9807, -127877, -128924, 270038, 128471, 335482, -254180, 5079, 91295, -243257, -83917, -95425, 111998, -213170, 110758, 68986, -24419, 121984, -49490, -79281, -76394, 154903, 36030, -101182, 104360, 31167, -74332, -147368, -226994, 37828, -34715]
11809B78218C5500a68759E7048a8440j08444l6648k47572h6739j73365a19122
11798A33940a88895B4796c0793k86807C244i4293j73788h6642B46197A1915h828
11786A42512P5596B3431J68120c11651C16205a18891A24055d6556j0098n324l5070
11775i7048A93455a02319H7130a21637l18595H2813Q2826e3445m4572k7183E8002
11763b151l92352h7730R353C33130h6186B89012h2212j41853A85259b75772E7741
11751A6024a2075A24061L5892C3195g1737D71764A3290M3837a45595M1775c6675
11739B64417L31299F983a65954j84287a12073A18214b29620k06226B51787h1651
11728d235C93533a45016D976N7667h2997B4408K30447C4546J12845E8771a61354
$$ y = [278218, 35500, -168759, 57048, -18440, -126884, -163532, -411104, -86739, -260104, -119122, 133940, -188895, 24796, -30793, -317600, 3244, -94293, -268081, -86642, 246197, 11915, -8828, 142512, 218108, 23431, 191551, -311651, 316205, -118891, 124055, -46556, -56654, -61978, -97048, 193455, -102319, 87130, -121637, -440232, 82813, 165639, -53445, -98017, -125200, 58002, -2151, -394503, -87730, -78377, 333130, -86186, 289012, -82212, -224065, 185259, -275772, 57741, 16024, -12075, 124061, 159953, 33195, -71737, 471764, 13290, 57127, -145595, -103820, -36675, 264417, 595716, 6983, -165954, -350241, -112073, 118214, -229620, -435846, 251787, -81651, -4235, 393533, -145016, 4976, 62643, -82997, 24408, 254855, 34546, 147391, 58771, -161354]
11716b3209B4502J69554C3541P5346h9232F1844K6169i6437A49619a44317c6794
11704a844A05266a6494N06A77406J50441A1707Q6200a28548A96473c08485B88480
11692C35317A21331D1086c20522P6095Q806f6271j91109O1017N743C66405a08245
11680D7486b7768B95041a68224E2364J91408n5007a5810m14319a20113A30600
11669I736b75948J20136d4794m7814D3603g590B98182D7434a15963d2083B22444
11657B38438B6883d2325m958j94856B24875n130D6184P7580J23864a4709B6307
11645E3383b43921e8835G7970I340O3678a25319A59525h2692B20256c62329C9366
11633b06882d7732j57115B75796e4674C03855A16513n0235J33964a20286C1053
$$ y = [-23209, 24502, 194056, 33541, 108887, -89232, 61844, 88013, -96437, 149619, -144317, -36794, -1844, 105266, -16494, -15988, 177406, 327847, 11707, 97907, -128548, 196473, -308485, 288480, 335317, 121331, 41086, -320522, -244427, -235621, -66271, -257380, -196363, -190620, 366405, -108245, 47486, -27768, 295041, -168224, 52364, 243772, 188765, -15810, -430129, -120113, 130600, 9736, -275948, -155812, -44794, -92608, 43603, -7590, 298182, 47434, -115963, -42083, 222444, 238438, 26883, -42325, -47283, -242139, 224875, 219745, 46184, 123764, 247628, -14709, 26307, 53383, -243921, -58835, 77970, 9340, 73018, -125319, 159525, -82692, 220256, -362329, 39366, -206882, -47732, -204847, 275796, -54674, 303855, 116513, 66278, 200242, -120286, 31053]
11622c1163G0873j6644b91009A74990r610m976R8087l1959O0326J04513a30636
11610e556o6889A65869e3539A09052M4632K6722H2199k0850N9130l9328J47379
11599B28530n6962J45819F3401f3709I9141h1333n6629A74568R8165A11093L4096
11588A45189d5241C48082a04092j11541J00081E1231J53321K53478k20934o9399
11578A67697o9517J4620o187d5217C27633A59655C9494j0561L26748A3229K33171
11567B46400M3973J56338H54J03058a35572E4781a37680A20850r10k3984b71279
11555A89380e7905j73463B55038I6957e237B91249o667j19052b6941A00511J32690
11544B33201n6600K3725k0758n0845K36171A38685b68006A31049J5879L47877
$$ y = [-31163, 70873, 54229, -291009, 174990, 165380, 160404, 258491, 226532, 286858, 391371, -130636, -5556, -72445, 165869, -53539, 109052, 153684, 180406, 82199, 61349, 120479, 81151, 228530, 171568, 317387, 63401, -63709, 99141, -81333, -137962, 174568, 272733, 111093, 145189, -45241, 348082, -104092, -215633, -115552, 51231, 204552, 458030, 237096, 167697, 98180, 112800, 106613, -45217, 327633, 159655, 39494, 28933, 355681, 13229, 246400, 290373, 446711, 854, 103912, -135572, 54781, -137680, 120850, 119940, 95956, -271279, 189380, -57905, -231368, 255038, 96957, -5237, 291249, 284582, 165530, -26941, 100511, 233201, 176601, 200326, 179568, 128723, 364894, 138685, -268006, 131049, 146928, 494805]
11534D94805F9598b3924B4363M5686A9005L0672i5571j23668B23816j06649J0694
11523A27861J52302b58206H0257K44392A0276a0195j39974p6423B62239j12346
11513A49893j378j980e5505J3500B98243A03764J886l4118J71074J2195f0248
11501A53764L41358k45247L3738B9211L47611a00189C0870b5150j01464b8124
11490F4778J9480P666J66927A27350J9949d1939B3258i0927j14791B49011j01789
11479A47222M2403a74708B0828c4615B49363h9493A50624R7327L0123m9143P6100
11468C05031J25322i2949C01215A659P2769K41459p3114A09427D498a97185A15180
11456B80154h514H5409J71559c436C13123a23214C55517c4989B5903N7426L6342
$$ y = [494805, 69598, -23924, 24363, 70049, 19005, 49677, -95571, -219239, 223816, 117167, 127861, 280163, -258206, 80257, 324649, 10276, -10195, -150169, -226592, 262239, 149893, 148515, 146535, -55505, -42005, 298243, 103764, 105650, 71532, 242606, 254801, -60248, 153764, 495122, 249875, 283613, 29211, 376822, -100189, 30870, -25150, -126614, -28124, 64778, 84258, 91924, 258851, 127350, 147299, -41939, 23258, -90927, -205718, 249011, 147222, 189625, -174708, 20828, -34615, 249363, -89493, 150624, 247951, 278074, 228931, 305031, 430353, -92949, 301215, 1659, 74428, 315887, 242773, 109427, 4498, -197185, 115180, 280154, -8514, 85409, 256968, -3436, 313123, -123214, 355517, -34989, 25903, 83329, 119671]
11445A19671J39792H1789A1689J13131c8901A1669K22695n206m076C9149J17195
11434A56344m2403a47229B60970D7997M59253b9416h954A26791a78295B47408
11423A00033l402e1271J1590j1466A68222a4465A81968b8781B46450B3094h758
11411a01057A33148l1732a17742j69831C6014b38784d5285j19725A23281o1290
11401F1991A6229K35677I8242j1112j1552a83158k9533b0665r6660F9259Q9294
11390A58553A1413a17636K6878m2710O6019j6534d0636B07401i1668j25964F9684
11378a28015j76611G6755A5065f9882B7070d9162P314C74065G5463g6676D38120
11366C0388J82562I4531e2256C0134L9526J67011h7563j19236M0000O0072N0273
$$ y = [119671, 259463, 81789, 11689, 124820, -38901, 11669, 234364, 229158, 225082, 39149, 156344, 113941, -147229, 260970, 47997, 507250, -29416, -8954, 126791, -178295, 247408, 100033, 96631, -51271, -39681, -51147, 168222, -14465, 181968, -28781, 246450, 23094, -8758, -101057, 133148, 101416, -117742, -287573, 36014, -238784, -45285, -165010, 123281, 61991, 16229, 251906, 98242, 87130, 75578, -183158, -212691, -20665, -117325, 69259, 158553, 11413, -117636, -90758, -133468, -67449, -83983, -40636, 207401, -91668, -217632, 69684, -128015, -304626, 76755, 15065, -69882, 27070, -49162, -41848, 374065, 75463, -76676, 438120, 30388, 212950, 94531, -52256, 30134, 69660, 236671, -87563, -206799, -166799, -106727, -56454]
11355e6454k1284m7443k07244A61984c350p4848A18571f6355j36581K6794k04405
11344c80547A06692B6107L07906j55158O0919f9442j36891j5491d2747E868J19938
11333A25806d2322O122A9444D140a79897A70776k0209a29471E634a2863C92377
11321a89489E8668n099a77510A41337C8424a37899A51021j5338J01555G4216f6876
11309E9869b68304A19702a60828C9653g8192c7454A56960B3718i8553A85760b04355
11297B76383f8456l48616J55103F6101b11228N6037q4444p523g4561A89184J5125
11286B04309a74763Q3028A45720M9163a2782o9858j74413C9708a17484k66013
11276c83497E8190a5135j21105e8845A47962b24696P0641n3429J3313L0691A73837
$$ y = [-56454, -77738, -125181, -332425, 161984, -3350, -78198, 118571, -66355, -202936, -176142, -380547, 106692, 26107, 334013, 178855, 239774, -69442, -206333, -221824, -42747, 5868, 125806, -42322, -36200, 19444, 4140, -179897, 170776, 150567, -129471, 5634, -12863, 392377, -189489, 58668, 53569, -177510, 141337, 38424, -137899, 151021, 135683, 237238, 74216, -66876, 59869, -268304, 119702, -160828, 39653, -78192, -37454, 156960, 23718, -98553, 185760, -204355, 276383, -68456, -417072, -261969, 66101, -211228, -155191, -239635, -247158, -74561, 189184, 204309, -174763, -91735, 145720, 194883, -12782, -82640, -257053, 39708, -117484, -383497, 58190, -15135, -136240, -58845, 147962, -224696, -154055, -207484, -194171, -163480, 173837]
11264e8269A58238J72172b95254a33085h247m9037k84041h2638A18253b77224
11253a82252h7279J8609o6771B3088L0599b09219C60027b81345G0393a47285M9692
11242i7593C28060F4289J01770c55172b1007G8910A7559J23034a81265C5131a84352
11230D3287N1836b6282l29079e841C41666c26134B66497a01591o4151C3053b05872
11218f1395e250m8835B68275B85J03026c41116a39068O1166N975j40544A27312
11206b6378d957k3179A49885F6803B8425c00098J05174B71771g4114A10196G4
11194C2489g9412A20433g1686q8883P5419k30613a30650A25783d5692A9636c15157
11182d27149I2222b49994b3890D3767a80993k3876E9540b53860A20129a70808
$$ y = [-58269, 158238, 330410, -295254, -133085, -8247, -57284, -341325, -82638, 118253, -277224, -182252, -87279, -68670, -135441, 23088, 53687, -209219, 360027, -281345, 70393, -147285, -97593, 328060, 64289, 166059, -355172, -21007, 78910, 17559, 140593, -181265, 35131, -184352, 43287, 95123, -26282, -355361, -5841, 341666, -326134, 266497, -101591, -165742, 33053, -205872, -61395, -5250, -54085, 268275, 285, 103311, -341116, -139068, -77902, -71927, -212471, 127312, -26378, -4957, -28136, 149885, 66803, 28425, -300098, -194924, 271771, -74114, 110196, 74, 32489, -79412, 120433, -71686, -160569, -85150, -315763, -130650, 125783, -45692, 19636, -315157, -427149, 92222, -249994, -23890, 43767, -180993, -204869, 59540, -253860, 120129, -170808]
11171H6248c0987C36854b36894f0685A6299N9643a14417l59411J84154I5703b04437
11159h8364E0478K7040g0778P742j29963B02d4402j83782C8795a64310G751J63305
11147A71056i109G5174J56272n8003g4590A04992B4903O1516R7960b02905H9647
11135a04010A6749P7258k1920N9539b14997i2193A1925L9250a84987c2489C62702
11123b88290J28196B56417c18531i3631C44604A39116b23901D1114a64721a4064
11112b06911N3112P0629j1209B87793f8426j12579A72821b05938C48359e6478
11101B3900J82035K9382n4642J49298B4522b50152E18684A85776g6075A26613
11090D59479j86109A18673a31793B41284q1744J54185d3868B92050e2748B32601
$$ y = [86248, -30987, 336854, -236894, -60685, 16299, 75942, -114417, -473828, -289674, 95703, -204437, -88364, 50478, 77518, -70778, -63036, -192999, 202, -44402, -228184, 38795, -164310, 7751, 171056, -9109, 75174, 231446, 173443, -74590, 104992, 24903, 86419, 184379, -202905, 89647, -104010, 16749, 94007, 72087, 131626, -214997, -92193, 11925, 51175, -184987, -32489, 362702, -288290, -160094, 256417, -318531, -93631, 344604, 139116, -223901, 41114, -164721, -14064, -206911, -153799, -83170, -94379, 287793, -68426, -181005, 172821, -205938, 348359, -56478, 23900, 205935, 235317, 180675, 329973, 24522, -250152, 518684, 185776, -76075, 126613, 459479, 273370, 118673, -131793, 241284, 159540, 313725, -43868, 292050, -52748, 232601]
11079B74520G5122d9160N189D01795j06395O4986p5255I1660K3801L05225A19148
11067D68519l6101c1716D84993A60326M4150N63229A60359M28328O7137p5967
11057E79857r6926j1811M13224m16732l4814J7899n7011L07007J17787P0414k79056
11046F09838J26702k77489k20038O26207k34477j8431o7313J96760k46318L41300
11036H36741k90927J68029j40675Q3000r1595J24959j44248L5302J12525K84743
11026I77854j28966j40942j27063K5112j37446O64774l48949C33444L47265r6255
11016E84454l4179L64089l65452Q0666k39552J15958J32422j38537J71471B58613
11005G39912k96440L37073l18793J26463j57719L51877m634j40581J24647O5548
$$ y = [274520, 75122, -49160, -43971, 401795, 295400, 360386, 285131, 91660, 115461, 420686, 119148, 468519, 432418, -31716, 484993, 160326, 204476, 767705, 160359, 588687, 655824, 579857, 482931, 471120, 884344, 467612, 432798, 450697, 393686, 700693, 818480, 888894, 609838, 736540, 459051, 239013, 865220, 630743, 612312, 544999, 741759, 495441, 836741, 545814, 713843, 573168, 656168, 564573, 689532, 545284, 580586, 693111, 977854, 848888, 707946, 580883, 605995, 468549, 1133323, 784374, 333444, 680709, 584454, 550275, 914364, 548912, 629578, 390026, 505984, 638406, 499869, 671340, 258613, 739912, 443472, 780545, 461752, 588215, 430496, 782373, 777739, 637158, 761805, 827353]
10995H27353J3665l33391K40196k73126j6291J59078J30376J49008L2124p2198
10985H56794O6416N4724o8495j1630m5240L35674j29113M6856L15525K49102j80277
10974A490336M38556K19441N91701l88515K34398K34119l48907q9504o9120k84324
10964B028181m97079Q3699K15582j68079M3956J40751K66409j4463k64616K24328
10954B058669K12938m27018k80006k74340k04389L1409l32401J29559m08690L58035
10944H63766l9726B73452K41242A21523C5691K58525j7473J01808H9871h2222
10933a82585A56362o8984a06060B15903E6150Q3194k2134b5153B8441b05993A2496
10921A79307Q1366r0511a21112M1285F0735b72377j48826A41932P2755j00338
$$ y = [827353, 841018, 507627, 747823, 474697, 458406, 617484, 747860, 896868, 928992, 856794, 923210, 977934, 909439, 897809, 852569, 1188243, 1059130, 1105986, 1421511, 1670613, 1490336, 1928892, 2148333, 2740034, 2351519, 2585917, 2820036, 2471129, 2381625, 2312505, 2028181, 1531102, 1614801, 1830383, 1662304, 1706260, 1847011, 2113420, 2098957, 1834341, 2058669, 2271607, 1844589, 1564583, 1290243, 1085854, 1117263, 784862, 914421, 505731, 863766, 824040, 273452, 514694, 121523, 35691, 294216, 276743, 378551, 89871, -82222, -182585, 156362, 87378, -106060, 215903, 56150, 139344, 117210, -25153, 28441, -205993, 12496, 179307, 260673, 170162, -121112, -79827, 60735, -272377, -421203, 141932, 214687, 114349]
10911A14349K1114E1847g8286A14846l999J59603p4135h6562r4608A40105b3336
10899a69452e9746q7263e4540B15782q2843a00391m8787j63248i0769L3741K0109
10888c6919q5375A3957L2227L7142c13431G5299f2776p9570c0061a1990j17956
10877a29946p873C2773g3811A68505n2432b44275J6544I48a06881B81037E8390
10865B38742p472m6584d44950i8356m27590B23544e8978J5155A83074C5966M6715
10854H2681B8558b58083B85704L39729c47638A01285b513j55314A22309h61r114
10843i975C8687a48824A55339F4236e00346G8448M8352C0146L3257a51336A3214
10831D7547L85677A33352L6337c38282A37332h089A06612a19777H0859b10882
$$ y = [114349, 135463, 51847, -78286, 114846, 110847, 270450, 196315, -86562, -181170, 140105, -23336, -169452, -59746, -147009, -54540, 215782, 132939, -100391, -149178, -312426, -90769, -57028, -36919, -122294, 13957, 46184, 83326, -313431, 75299, -62776, -142346, -30061, -11990, -129946, -137819, 32773, -73811, 168505, 116073, -244275, -227731, 948, -106881, 281037, 58390, 238742, 231270, 184686, -444950, -98356, -525946, 223544, -58978, -43823, 183074, 35966, 82681, 28558, -258083, 285704, 625433, -347638, 101285, -2513, -157827, 122309, -861, -9975, 38687, -148824, 155339, 64236, -500346, 78448, 126800, 30146, 63403, -151336, 13214, 47547, 433224, 133352, 169689, -338282, 137332, -8089, 106612, -119777, 80859, -210882]
10820B85104b14863j28910l9258i1570q556C02300a04202n1504J040d7253m7229
10809i4482j78415A09431g3714A74709a1935k20916a1543B54848b51005d2809
10798C1470c9445E6836a88311A13626B9728a68751k92332C04091b48220a02125
10787A14848e4169A42468d7911k13233Q1432D8323F761c45882C05071b56359a7953
10775F6110d12806J58775R2747E4476i9683I6541d6701q4198A33042k1113c04633
10763a51236a8024A37193J9033J15206c64985a72792F5486e24785I8079N8735
10753A56814m1056b13661j20300J37916n722B06890g0916B6212b37283K1206B03673
10741A0114L1235c12017a1674j8052m89741i1391A53877a32801k1998G653b64991
$$ y = [285104, -214863, -343773, -383031, -91570, -100126, 302300, -104202, -155706, -154666, -47253, -94482, -272897, 109431, -73714, 174709, -11935, -232851, -11543, 254848, -251005, -42809, 31470, -39445, 56836, -188311, 113626, 29728, -168751, -461083, 304091, -248220, -102125, 114848, -54169, 142468, -47911, -261144, -179712, 48323, 6761, -345882, 305071, -256359, -17953, 66110, -412806, -254031, -161284, 54476, -99683, 96541, -46701, -130899, 133042, 111929, -304633, -151236, -18024, 137193, 156226, 271432, -364985, -172792, 65486, -524785, 98079, 156814, 115758, -213661, -333961, -196045, -201767, 206890, -70916, 26212, -237283, -216077, 203673, 10114, 41349, -312017, -11674, -29726, -519467, -91391, 153877, -132801, -154799, 7653, -264991]
10729i899D1426J2320a05315j83266a23130B08823c2666E7719e7882l1876j7518
10718a07276A12465a15517A96010a88060B5110k170f2519A04918a66853C89000
10707b4064l39905a78206F6263a36390c3005r7650B13689a93592D3780b32525
10696a13687o6623B07250b79233B53483a83385L0514j06911F9320d3655J6087
10686b7568A95481d4752k5537b9040C18124c170j18479o5104m7961h1669k9698
10675a11367A50478c00583A95927b50705b0060j90982A70044b05133j22473i085
10664a68778A65277d97320a2588B53332I158a92726R5138q4310a9382k40442g1682
10652b88280a43169q7766A5416c75053A2605a46631A01629a81583P4731j3312
$$ y = [-9899, 41426, 53746, -105315, -288581, -123130, 208823, -32666, 57719, -57882, -89758, -107276, 112465, -115517, 196010, -188060, 25110, 22940, -62519, 104918, -166853, 389000, -24064, -363969, -178206, 66263, -136390, -33005, -130655, 213689, -193592, 43780, -232525, -113687, -180310, 207250, -279233, 253483, -183385, -152871, -259782, 69320, -43655, -27568, 195481, -44752, -70289, -29040, 318124, -3170, -121649, -186753, -234714, -81669, -111367, 150478, -300583, 195927, -250705, -20060, -211042, 170044, -205133, -327606, -9085, -168778, 165277, -497320, -12588, 253332, 9158, -192726, -97588, -181898, -19382, -259824, -71682, -288280, -143169, -230935, 15416, -375053, 12605, -146631, 101629, -181583, -106852, -120164]
10642a20164M7729k16594A62982q1055b30651E8636J24234a55667E5481J14923
10632A70404M7562a8772C2573b9209q9770N8132H986K55434b50781l174A11522
10620a16715E0266a24321b3614r4629r5267A82331q9109O0717P7772a36313a3744
10608d8297m0532j6849q4393A70456a65282a0704o0934A53351b17299E7048a59698
10596b98005A03757D5694P7330n1036d2709D756a27771c5074B42353j6039b05460
10584b19520c5693j92984B10188b42051C4944J74697b4108C3215d0979j51551
10574a92530q2380C5113b42808Q7204P4668b365A29294R9029h8084p8717C7318
10562e5114G0396J77478G8212a78733A32915M8489a59529A31148b15654F3410
$$ y = [-120164, -72435, -289029, 162982, 81927, -230651, 58636, 182870, -155667, 55481, 170404, 217966, -18772, 32573, -29209, -118979, -60847, 8986, 264420, -250781, -253955, 111522, -116715, 50266, -124321, -23614, -118243, -213510, 182331, 93222, 153939, 231711, -136313, -13744, -48297, -88829, -105678, -190071, 170456, -165282, -10704, -71638, 153351, -217299, 57048, -159698, -298005, 103757, 45694, 123024, 71988, -42709, 4756, -127771, -35074, 242353, 226314, -205460, -219520, -35693, -228677, 210188, -242051, 34944, 209641, -24108, 33215, -40979, -192530, -274910, 35113, -242808, -155604, -80936, -2365, 129294, 228323, -88084, -166801, 37318, -55114, 70396, 247874, 78212, -178733, 132915, 181404, -159529, 131148, -215654, 63410]
10551a3048C38058G5237c1034p916o7839m20311a69995A18587O784b6228r2071
10540a18299B39842a53067F4190b1620B1317K15024b25036i9474A63895a62124
10529a42848B6353a62487f0148j56378J07175j3882a5194m4837A08370m4557c78188
10517D40916i5591d5463B72180c29779C77759F5877J92627c1608j21616C6838
10506f8085k59048I0874f0873b8485A39460a19387A79466q2884L8058h856A13997
10494A11127a41485M6239F8551J0204C5898d4356E4796K35914A12557E4007J57959
10483B11966P4549M5136J6893K48862K45792C66130p0169j0018b7583j4030A60558
10471c4504D7463J933A1585K0751J22362n9305b45538A35720c37864A97216D1305
$$ y = [-13048, 338058, 75237, -31034, -38950, -106789, -527100, -169995, 118587, 125371, -26228, -118299, 239842, -153067, 64190, -21620, 21317, 236341, -225036, -99474, 163895, -162124, -142848, 26353, -162487, -60148, -216526, -109351, -123233, -15194, -60031, 108370, 63813, -378188, 440916, -95591, -45463, 272180, -329779, 377759, 65877, 258504, -31608, -153224, 36838, -68085, -327133, 90874, -60873, -28485, 139460, -119387, 179466, 96582, 134640, -8856, 113997, 111127, -141485, -95246, 68551, 78755, 35898, -44356, 54796, 290710, 112557, 54007, 211966, 286515, 331651, 348544, 597406, 843198, 366130, 295961, 285943, -27583, -41613, 160558, -34504, 47463, 49396, 11585, 32336, 154698, 95393, -245538, 135720, -337864, 197216, 41305]
10459e2475k43832J26992O5772F5735i9359r6368f321A91926P1416A2075J0968
10448B3043a94505B63567a20268C0584a27615A05798J23577a34383d2169l33259
10438c75428g3721b4564A87429f2856F366a86552D0086c11251k38268a60864A26490
10426a34618n9602Q8437q9213C76198E9349k9191a32446A54887b50127H7114a76612
10414a90886K1971K3793f4467b7588j39993h0259L9505I8457f3761a3638B55234
10402F4942f2719F8667a47161n788I7516J49546a35202k7191A01872C8480J7708
10391E6188A4638K07845a29906Q731A36281e75226A72096q0752a83771E78298
10380F7945J85745G3690j5910J20813o1728P3389G155L25346A8020J50389L16666
$$ y = [-52475, -296307, -169315, -103543, 65735, -99359, -195727, -6321, 191926, 263342, 12075, 23043, -194505, 263567, -120268, 30584, -127615, 105798, 229375, -134383, -42169, -375428, -73721, -24564, 187429, -62856, 6366, -186552, 40086, -311251, -549519, -160864, 126490, -134618, -194220, -105783, -194996, 376198, 59349, 30158, -132446, 154887, -250127, 87114, -176612, -190886, -168915, -145122, -64467, -27588, -167581, -80259, -40754, 98457, -63761, -13638, 255234, 64942, -62719, 68667, -147161, -152949, 97516, 247062, -135202, -162393, 101872, 38480, 56188, 14638, 222483, -129906, -121175, 136281, -575226, 172096, 91344, -183771, 578298, 67945, 253690, 73690, 57780, 178593, 116865, 190254, 7155, 332501, 18020, 168409, 485075]
10369D85075K9481J1354K45896l29272j82523n3692m795n0660K45842j56323H2934
10357A87031J1924K93811j00592J3830J01815p2978i6139D71646j32704J75751
10347E14693B47551A10313J69630K82022l6520Q1212p1895A81591g7185B53953
10336B76634j32377F5726O3628a20855D4724K79395d9668q1285K0969C59896p0162
10325B89734P4739e561j96818A99231I4881f2605C23402m1075J56205a8762B30355
10313B49754b27505I137a07420G1099C5339A2912h0982j148I6879J85681D9931
10301B07894i5844j49930C04400A00751b84925A9694c9515A77095g8285B208K42162
10290B44370c6981H3849R0143C9572b51351m0922h7653j2982J8576j85709j49462
$$ y = [485075, 514556, 525910, 771806, 442534, 260011, 206319, 201524, 150864, 396706, 240383, 82934, 187031, 198955, 492766, 392174, 406004, 507819, 434841, -96139, 471646, 338942, 514693, 247551, 110313, 279943, 561965, 525445, 606657, 534762, 181591, -77185, 253953, 276634, 144257, 65726, 129354, -120855, 44724, 324119, -49668, -130953, -109984, 359896, 289734, 364473, -5561, -202379, 199231, 94881, -62605, 323402, 282327, 438532, -18762, 230355, 249754, -227505, 9137, -107420, 71099, 35339, 12912, -80982, -82130, 96879, 282560, 49931, 207894, -95844, -245774, 304400, 100751, -284925, 19694, -39515, 177095, -78285, 2208, 244370, -36981, 83849, 173992, 39572, -251351, -292273, -87653, -100635, -82059, -267768, -417230]
10279d17230G4184b8909j86452a6386A98755b24653e3582D6634A2318K28967o336
10268B34949e3771b6077C43891b87635p2098a43206C798R6110J54384j01545M6734
10257A99481J23181J16947B16445D347b67024f5377C380a189j17959B1375b29106
10245d18009J26424A05326J38908a53636p5427k4582A59354o8522a64612O8264
10235i6348j23330A33289F4263b18943Q6187M4065m4122k94107A942c61480d9895
10223d2250P144a1978B43993B4673b70763G3046A6128m48b93284h6090G4730b39922
10210a80902O4199G476J0581b0666E3005K66765i5478k3074C430a1825n0995j09754
10198a72574k28006B61550b32811I0365a31480B11520P4329a31601e4611A13912
$$ y = [-417230, 74184, -28909, -215361, -16386, 198755, -224653, -53582, 46634, 12318, 241285, 234949, -53771, -26077, 343891, -287635, -359733, -143206, 3798, 99908, 254292, 152747, 199481, 322662, 439609, 216445, 4347, -267024, -65377, 3380, -1189, -119148, 21375, -229106, -418009, -291585, 105326, 244234, -153636, -229063, -253645, 159354, 90832, -164612, -96348, -219678, 133289, 64263, -218943, -132756, -88691, -132813, -426920, 1942, -361480, -49895, -42250, -35106, -11978, 243993, 24673, -270763, 73046, 16128, 15680, -293284, -86090, 74730, -239922, -180902, -116703, 7476, 18057, -20666, 53005, 319770, -95478, -118552, 3430, -11825, -62820, -172574, -400580, 261550, -232811, 90365, -131480, 211520, 285849, -131601, -54611, 113912]
10187c07697a10693E6244d433B10750J20148d36564C4459H618b10779b1995B15238
10175a89212M0873P1991o6336B56228a12333A36125n1403L2422N1023a28707N6241
10164g2466F0628J1517h5088D0683i4602A30601a93205L7914B41276C3481a30648
10152a5408k86173P1217k6589j28769B53888a26962A31813c49657c4797B48899
10141f2016b915A5834h2283G8268l5435a68781F70J03051i2658k00130A6776J04316
10129A21092L6147Q4901g8005A15J28130g9985A23699b43677K75P5487r9441J08053
10117a59303E0865J31429b06903h8359a4980j08371L6440c9158A52968k1825i1929
10105A41255a76733f563I3719a29603A84714a00288m9053J3572P505A9778d85118
$$ y = [-307697, -110693, 56244, -4433, 210750, 330898, -436564, 34459, 8618, -210779, -21995, 215238, -189212, -148339, -76348, -142684, 256228, -112333, 136125, 84722, 117144, 168167, -128707, -72466, 60628, 72145, -85088, 40683, -94602, 130601, -193205, -155291, 241276, 33481, -130648, -15408, -301581, -230364, -256953, -385722, 253888, -126962, 131813, -349657, -34797, 248899, -62016, -2915, 15834, -82283, 78268, 42833, -168781, 670, 103721, -92658, -292788, 16776, 121092, 157239, 242140, -78005, 115, 128245, -79985, 123699, -243677, -243402, -167915, -267356, -159303, 50865, 182294, -206903, -88359, -14980, -123351, -86911, -39158, 152968, 131143, -91929, 141255, -176733, -6563, 93719, -129603, 184714, -100288, -149341, -135769, -128264, 19778, -485118]
10093d6652Q305k50881a23158B57208c08769C21340D1673J40180g9123j048A1143
10081A5171a67772d7221l5754A31144i7271k0875e5929k81129a61896r0402i350
10069c26066a52076A22959a1357G0577c2001J93m355A32123J71798j9120a14606
10057A56045N0865r473d97281G2941b61238E3747b2048j08261I4863J34060a1693
10045h1840j7344K6045l4876J9614H4572a04990F9139b40429o7146f1413D8553
10033E0342b29166A85177p0524a12574q3369L4242A45717a69743H9801b85889
10022b04165p2496C24547A41835R922a2471m16578a18230o3644h0016k02449j87360
10011d69825A04911b82034B22759b96716a15598j21537g5625A86847I1719F480
$$ y = [-46652, -38347, -289228, -123158, 257208, -308769, 321340, 41673, 181853, -79123, -80171, 11143, 15171, -167772, -47221, -82975, 131144, -97271, -118146, -55929, -337058, -161896, -252298, -9350, -326066, -152076, 122959, -11357, 70577, -32001, -31808, -36163, 132123, 303921, 284801, -114606, 156045, 206910, 197437, -497281, 72941, -261238, 53747, -22048, -130309, 94863, 228923, -11693, -81840, -99184, -73139, -108015, -88401, 84572, -104990, 69139, -240429, -307575, -61413, 48553, 50342, -229166, 185177, 114653, -112574, -195943, -161701, 145717, -169743, 89801, -285889, -204165, -276661, 324547, 141835, 151757, -12471, -429049, -118230, -181874, -80016, -282465, -469825, 104911, -282034, 222759, -296716, -115598, -237135, -75625, 186847, 91719, 6480]
10000E9176e8773j39724A0037c37812a01234k25991b4214A74415c51613g5838
9989a02633j91388B4983R0484J43981l1302a46791j01147A33509N053E1882c48199
9977b58172M3881e9148A66421a57804b2573A62817a26684A39105h2010K2934A96347
9965i3499q1745C2845d50694C0317a7884A43035c07023K4075Q0493N205A70286
9953G4284a47582n91O7877A16100b65679J17827j26849k2550j3689I334b39585
9941c9400q93p1619M5165I8216m936b49990b7263B5112P3706b59462B31748a11767
9928B5063J24425J23076j18550b04463j6492F908M1910b88544f4291q4155M0762
9917a07684A17162a15679E0196b39634g2191o1504j24369A36832a69182K6864
$$ y = [59176, -58773, -198497, 10037, -337812, -101234, -327225, -24214, 174415, -351613, -75838, -102633, -294021, 24983, 115467, 259448, 228146, -146791, -247938, 133509, 138562, 51882, -348199, -258172, -214291, -59148, 166421, -157804, -22573, 162817, -126684, 139105, -82010, -59076, 196347, -93499, -175244, 32845, -450694, 30317, -17884, 143035, -307023, -282948, -202455, -197250, 170286, 74284, -147582, -148173, -80296, 116100, -265679, -147852, -274701, -297251, -310940, 9334, -239585, -39400, -40293, -111912, -66747, 98216, 93280, -249990, -27263, 25112, 98818, -259462, 231748, -111767, 25063, 149488, 272564, 154014, -204463, -220955, 6908, 48818, -288544, -64291, -148446, -107684, 117162, -115679, 50196, -239634, -72191, -133695, -258064, 136832, -169182, -142318]
9907a42318A09552E0194a85547Q2043D9348a28089q018l49742K03744n3672a66589
9895a53409G518g5937p5827B58851I8449e9791A13878A7726J27503J41147F7711
9883b54258R0649b8244j77431h0753j25811Q2993B4933b65228F1750K24410F9735
9871d90214B33273b80604h9924n891r3035A79963d2907B10611b81172a19007F6095
9859a53226ck62773f4115A18211A8420a4076j1409D2798M2404O3646D7637c0895
9846i0743l7337B45769n0007b48835J15332p4375B36570O9372b00046h6086B68174
9834i1215b3783r7399j7015L3183j50956J04743K2378D2989j6561L7491i3463
9822B8322d26825B9662f5399c1264A95776J15828a88091O3449A94283a50554A67921
$$ y = [-142318, 109552, 50194, -185547, -103504, 49348, -128089, -136107, -485849, -282105, -335777, -166589, -153409, 7518, -75937, -151764, 258851, 98449, -59791, 113878, 17726, 145229, 286376, 67711, -254258, -163609, -28244, -205675, -80753, -206564, -123571, 24933, -265228, 61750, 286160, 69735, -490214, 233273, -280604, -89924, -95815, -188850, 179963, -42907, 210611, -281172, -119007, 66095, -153226, -3, -262776, -64115, 118211, 18420, -14076, -25485, 42798, 85202, 148848, 47637, -30895, -90743, -128080, 245769, 195762, -248835, -133503, -207878, 236570, 305942, -200046, -86086, 268174, -91215, -23783, -121182, -138197, -105014, -255970, -151227, -128849, 42989, 26428, 63919, -93463, 28322, -426825, 29662, -65399, -31264, 195776, 311604, -188091, -124642, 194283, -150554, 167921]
9810F4001b76503h3177j64504A73316h2009j47204D21084f353j78380c8619q30
9799c9449p3219l09097B80974h4549p7212K136d2746J1613I7466a4072A30707
9787B3951K93470f3643A38789A4154c64113C6351c66087Q97P8854p4068c8906
9775b14836l0362j55750H2102a04058B09064q4544b1566j67315b5735A7486o026
9764A1460c36981J27459k26195B00152a29832H8595J39088a39135j43462A65344
9753g3265j79236a01556m3950A3872c1557O498L770j19111L3664R219j65693q5228
9741c48438F0622a95220K8772q4007a8004N377B66797a21145A75634C0085d50586
9729b99394B28138N592G0804l0550a46272A75367H6183b3439j6316p6030A37029
$$ y = [64001, -276503, -83177, -247681, 173316, -82009, -229213, 421084, -6353, -184733, -38619, -39449, -112668, -421765, 280974, -84549, -161761, -159625, -42746, -31133, 97466, -14072, 130707, 23951, 317421, -63643, 138789, 14154, -364113, 36351, -366087, -365190, -286336, -360404, -38906, -214836, -245198, -400948, 82102, -104058, 209064, 124520, -21566, -188881, -25735, 17486, 11460, -336981, -209522, -435717, 200152, -129832, 88595, 227683, -139135, -282597, 165344, -73265, -252501, -101556, -145506, 13872, -31557, -25059, -21289, -140400, -106736, -97517, -263210, -348438, 60622, -195220, -166448, -250455, -18004, -12627, 266797, -121145, 175634, 30085, -450586, -299394, 228138, 233730, 70804, 40254, -146272, 175367, 86183, -23439, -39755, -115785, 137029]
9717a52636k1c8904j51746j743n373H2072b38205a4185j12246d9259q3394C0028
9704a68216A30902d08437J43746b8686I4275a34743E5260a57647C85284E9073
9693c03243f8924n1402B91297E9864k9708b4195j90110j80442E8801a36518j53383
9682b89901P2660A0626D197J39447a1239o3801n9378m0634D05799g7094q724c19
9669c56953i1953j98813I5382J16875c18862a09709K4490B15895j2962O4815b88166
9657a4612F8436a82333D3135a0376k1830a5446q6354p6752H2739J24561c17427
9645a66715A55780B1665J16099d33630g0972F8151a34735c3201m35364a60402
9634b72166K074A88026o8514a85941B12059j2121p1343a5682j75093j37277J57144
$$ y = [-152636, -152657, -38904, -190650, -192393, -197766, 82072, -238205, -14185, -126431, -49259, -132653, 30028, -168216, 130902, -408437, -264691, -28686, 94275, -134743, 55260, -157647, 385284, 59073, -303243, -68924, -120326, 291297, 59864, 30156, -24195, -214305, -394747, 58801, -136518, -289901, -217241, 10626, 4197, 143644, -11239, -75040, -134418, -175052, 405799, -77094, -85818, -319, -356953, -91953, -290766, 95382, 212257, -318862, -109709, -85219, 215895, 202933, 267748, -288166, -14612, 68436, -182333, 43135, -10376, -32206, -15446, -101800, -178552, 82739, 207300, -317427, -166715, 155780, 21665, 137764, -433630, -70972, 68151, -134735, -33201, -468565, -160402, -272166, -270092, 188026, 119512, -185941, 212059, 199938, 128595, -15682, -190775, -328052, -170908]
9623a70908e5799k7667j23762a1265B31082h19B20814a53226f082k18857C3123
9611a76015k51804A29606b8305j49543D4285P2513A349J0166a95855j38637B8121
9599c84103h85q6540J00n0120e1670l33814i9082J0504C12703b52935I2855K51363
9587C44218E0493a15563a2069A09142a24546n4284Q8674j00316f7831l15965F6120
9575A74555d7381k50016R4925J1939I9930b82801E2766M8067b61177d3484k48410
9564b91894A5236a10567C24760L1285E3963f0095k35584B45903b44779Q8328H6734
9552b28773f3649j33890f4878G45b42005E29517C322J27303b8272k17635f438
9540b89295J2313B39548N0772h0909r9405a167k4218A7227J53474a73346D8718
$$ y = [-170908, -55799, -83466, -207228, -11265, 231082, -819, 220814, -153226, -6082, -224939, 33123, -176015, -427819, 129606, -28305, -177848, 44285, 116798, 1349, 11515, -195855, -334492, 28121, -384103, -885, -87425, -87325, -137445, -51670, -385484, -99082, -88578, 312703, -252935, 92855, 344218, 50493, -115563, -12069, 109142, -124546, -178830, -90156, -190472, -67831, -383796, 66120, 174555, -47381, -297397, -202472, -190533, 99930, -282801, 52766, 100833, -261177, -43484, -291894, 15236, -110567, 324760, 356045, 53963, -60095, -295679, 245903, -244779, -156451, 86734, -228773, -63649, -197539, -64878, 745, -242005, 529517, 3322, 130625, -28272, -245907, -6438, -289295, -276982, 239548, 290320, -80909, -180314, -1167, -25385, 17227, 170701, -173346, 48718]
9528a23011G4696J33749b22603M5702o5823n9128d8542j04165d7868j58992A40008
9516B47432d7840A21090D6095c36909j5342D850b56048H0008a50573N9563a6549
9504A1752a34718A43067N6158J71728G497a08922B0791a35098d1415k26113a10501
9492a96060p1998i8637m7196n8799p9054a12407j32950j06781A98415b91854a39733
9480B02022J407h3147q7252C9463j3469N1498B4115a3962k58765J09115E7263
9468D2515L6833M1437B2795a80935M6930d8090K537l40109A38323a71224N5442
9457a15782A10530k7577O6523B2461a15633G601N5094K0861J79254M2581a7027
9445b60873J21831g864A95515a63755e6601j82870B1481c33248Q7358A1109a97954
$$ y = [-123011, 74696, 208445, -222603, -176901, -242724, -301852, -48542, -152707, -47868, -206860, 140008, 247432, -47840, 121090, 46095, -336909, -352251, 4850, -256048, 80008, -150573, -91010, -16549, 11752, -134718, 143067, 199225, 370953, 7497, -108922, 20791, -135098, -41415, -267528, -110501, -196060, -268058, -98637, -145833, -204632, -283686, -112407, -245357, -352138, 198415, -291854, -139733, 202022, 203429, -83147, -170399, 39463, 25994, 77492, 24115, -13962, -272727, -163612, 57263, 42515, 79348, 120785, 22795, -180935, -134005, -48090, -45553, -385662, 138323, -171224, -115782, 110530, 82953, 149476, 22461, -115633, 7601, 62695, 83556, 262810, 305391, -17027, -260873, -139042, -7864, 195515, -163755, -56601, -239471, 21481, -333248, -245890, 11109, -197954]
9433d7553j01843J4159a5208j39668j0639A50123b8815j41659E6341N4924a83010
9421d06548B37975g1738j46982M9110b6935n5944A58910f71237a06046j88389
9411b94435G1635J46229a811D9171N3937a09187k49767J21370A42591P0653b26781
9399C4520i6035H1741K9871b46387A90382c963n9586b7544A83923m1014a61141
9387D1490H212b54929O3069k05471A22610E8285c7315l9804B24932i4952L7336
9376e7616B7899a60193M7387j089b9069k59924k7973h9145k1852M7209j11863
9365a75651c3300A63487e2980a1017k8127C1698c3908c443j25505l8010m34706
9354f01664B85116j13477a35921d8041A29298a69150A5852J53333i2409k73731
$$ y = [-47553, -149396, -135237, -15208, -154876, -165515, 150123, -28815, -170474, 56341, 111265, -183010, -406548, 237975, -71738, -218720, -169610, -26935, -82879, 158910, -671237, -106046, -294435, 71635, 217864, -1811, 49171, 103108, -109187, -358954, -237584, 142591, 213244, -226781, 34520, -96035, 81741, 111612, -246387, 190382, -3963, -63549, -27544, 183923, 142909, -161141, 41490, 8212, -254929, -191860, -397331, 122610, 58285, -37315, -77119, 224932, -94952, -57616, 27899, -160193, -112806, -113895, -29069, -288993, -316966, -89145, -110997, -63788, -175651, -33300, 163487, -52980, -11017, -39144, 31698, -33908, -3443, -128948, -166958, -601664, 285116, 171639, -135921, -48041, 129298, -169150, 15852, 169185, -92409, -366140]
9344c66140D618a15002l05979B244a63403B25777J73459j43385a24860L122B49456
9332B457K07512A04296K5162c75471G8965k1030J21485e3307B37938a26023l4876
9321a60899N8939j9456j53424j31954f0334A74281f6411o6445L6971A50531a63353
9309A38261b09989A12228Q7552C7608c0750A74494B5784L9691i8288b7760k2686
9298e0446l05186J05960p619A77672i449k55827b9922A5433a17458c9334a9532
9286b34574b4153B84565a96730b7665B88428c45172a23453j04664A6564a63635
9275c44936a50553G795P4579a15996k27572a05336k5079j3985n1908j00530F3833
9263a2610A26373N068a8396k63382o6752J73575J0723A0727Q4891c29059L3894
$$ y = [-366140, 4618, -115002, -420981, 2244, -163403, 225777, 399236, 255851, -124860, -121738, 249456, 2457, 209969, 104296, 129458, -375471, 78965, 57935, 179420, -53307, 237938, -126023, -160899, -101960, -121416, -274840, -406794, -60334, 174281, -66411, -132856, -95885, 150531, -163353, 138261, -209989, 112228, 199780, 37608, -30750, 174494, 25784, 65475, -98288, -27760, -50446, -355632, -249672, -257291, 177672, -9449, -265276, -29922, 15433, -117458, -39334, -19532, -234574, -24153, 284565, -196730, -27665, 288428, -345172, -123453, -228117, 16564, -163635, -344936, -150553, 7795, 82374, -115996, -343568, -105336, -130415, -144400, -196308, -296838, 63833, -12610, 126373, 131441, -18396, -281778, -348530, -174955, -164232, 10727, 95618, -329059, -295165]
9252b95165E1997J04851A4244a99191J3971F9459A7526g1102G7519K7573a39482
9240A4859J94604o2473b14947G7388b19090C27315a96376D5624g0851j08219A20030
9228c55771J75768f7553n20096C3063O9771L8274g7084E3251J68296c13334a46394
9216A31738J5368j1066g8331G2519J48857E5302d0705j63470O0829A07681a54425
9204a05473j60236a03560a1055F3569a79676B03870h0987A99438a34875A09068
9193C2065h9223B5907J24056a09703F563f1128n8169j94060J1814I6732J30790
9182B27522q3301e35191a56674e4118j50738j62623G559f0021k21168H7653K89777
9171C77430d73570A82661b24613E6817J92481a34858B06717b86539A53054c35940
$$ y = [-295165, 51997, 156848, 14244, -199191, -185220, 69459, 17526, -71102, 77519, 105092, -139482, 14859, 209463, 146990, -214947, 77388, -219090, 327315, -196376, 45624, -70851, -179070, 120030, -355771, -180003, -67553, -587649, 33063, 102834, 141108, -77084, 53251, 221547, -313334, -146394, 131738, 147106, 136040, -78331, 72519, 221376, 55302, -40705, -204175, -143346, 107681, -154425, -105473, -265709, -103560, -11055, 63569, -179676, 203870, -80987, 199438, -134875, 109068, 32065, -89223, 25907, 149963, -109703, 6563, -61128, -119297, -313357, -301543, 96732, 227522, 144221, -535191, -156674, -54118, -204856, -367479, 7559, -60021, -281189, 87653, 377430, -473570, 182661, -224613, 56817, 249298, -134858, 206717, -286539, 153054, -335940]
9160A11028D5074I152d4097D4493a33620C601J16338K61699a41734f0615o3481
9149a24096e9755a7389F8678b6660E0993g6941l16029D4659b05062R4927l41674
9138d51809J2504a24821p1173e1044B00457h5030k5074k57244Q4938f2606C24616
9126b50021A16114b73944B1909J62118a85960O9894b7002j2369n5392l67995i9815
9114a7516B76059a09279A4028f11953B82756l3287b20330A61020a10734A42748
9103C630b75570f1824a2697m9002D04968h0881l15919M490Q3532B5401c0901k13449
9091b44350P3960k6527f8564C433h080G7772b13858G4107J4417a56541E6051K11830
9079B67881h9731a7829r8161M1919I3003b10113B07999b6592A66942a59493j18232
$$ y = [111028, 45074, 9152, -44097, 44493, -133620, 3601, 119939, 381638, -141734, -60615, -124096, -59755, -17389, 68678, -26660, 50993, -76941, -392970, 44659, -205062, -110135, -451809, -439305, -124821, -195994, -51044, 200457, -85030, -110104, -367348, -282410, -62606, 324616, -250021, 116114, -273944, 21909, 184027, -185960, -116066, -27002, -39371, -94763, -462758, -99815, -17516, 276059, -109279, 14028, -611953, 282756, 249469, -220330, 161020, -110734, 142748, 3630, -275570, -61824, -12697, -61699, 404968, -80881, -396800, -392310, -308778, 25401, -30901, -244350, -170390, -196917, -68564, 3433, -8080, 77772, -213858, 74107, 88524, -156541, 56051, 267881, -89731, -17829, -115990, -74071, 93003, -210113, 207999, -26592, 166942, -159493, -277725]
9068b77725A5318J95935G8944b65852J32112e7025n9962D3358c76889f9041a3982
9056b8036B10613r4201g885A58397c55279D9964h760l01267g2318j28085c3715
9044b25119H8817a68928h3011c655j45300N8260L3656l4705C6705a1476o3701
9033g5177k55865J54106j81556J39408B89474A8445b8685l74690h7170n5258c24
9021d6076G769a7557k23737A27126Q4499E2415i9793E3778a73774E5232a03969
9009a01508k50079a3302F1149A130c56998i0055b3549j07639A9592R3601E1856
8997a9519B1846a79967G6512b60841M9569h8294j07726A98159G2367a75065A36271
8985C40341G8878b36391N0613C7808A3607e2025K4011j89469K2780G6823f1557
$$ y = [-277725, 15318, 211253, 78944, -265852, -133740, -57025, -116987, 43358, -376889, -69041, -13982, -28036, 210613, 116412, -7885, 158397, -355279, 49964, -8760, -310027, -72318, -200403, -33715, -225119, 88817, -168928, -83011, -3655, -148955, -90695, -57039, -91744, 36705, -11476, -75177, -331042, -176936, -358492, -219084, 289474, 18445, -28685, -403375, -87170, -142428, -324, -46076, 7769, -17557, -241294, 127126, 211625, 52415, -99793, 53778, -173774, 55232, -103969, -101508, -351587, -13302, 61149, 1130, -356998, -90055, -23549, -131188, 19592, 113193, 51856, -19519, 21846, -179967, 76512, -260841, -211272, -88294, -196020, 198159, 72367, -175065, 136271, 340341, 78878, -236391, -185778, 37808, 13607, -52025, -28014, -217483, -194703, 76823, -61557]
8973b7640k29413e952k00818D5770I386a34322L733j11367B9681J78289g4621
8961A2620P0803M1401b4876A41866h297j35394M7934B05859f3443j48465e1752
8949i2680a9765C1496b48051D32641C9408b42805f2231F1061a63165j19099a0758
8937C9114R4647c1301I7967J27194A2695e9151n38924K72287a42406H0125J36705
8926B16830r8276J44209Q04076J002978N326184J367210B122019D72533A39333
8916G0654K88656f1153m607m5138l685A6321J92324q6313J59067G8871b24029
8904d2039m1514H8750a88099k2362F7689i9543j9703c0517B81102j10193q185
8893A62724a78590G0708f0274A35042D4376J11176a40506l70638d4519o3767B65344
$$ y = [-27640, -257053, -5952, -206770, 45770, 9386, -134322, -130589, -241956, 29681, 207970, -74621, 12620, 83423, 124824, -24876, 141866, -8297, -143691, -95757, 205859, -63443, -211908, -51752, -92680, -19765, 31496, -248051, 432641, 39408, -242805, -62231, 61061, -163165, -282264, -10758, 39114, 133761, -31301, 97967, 225161, 12695, -59151, -598075, -325788, -142406, 80125, 216830, 118554, 262763, 1066839, 2069817, 7396001, 8763211, 2122019, 472533, 139333, 70654, 359310, -61153, -65760, -110898, -114583, 16321, 208645, 122332, 281399, 78871, -224029, -42039, -83553, 88750, -188099, -210461, 67689, -99543, -119246, -30517, 281102, 170909, 162724, -178590, 70708, -60274, 135042, 44376, 155552, -140506, -511144, -44519, -108286, 265344]
8881B62907B2193K35161b60608i1600D1979a60559o2754n741j5172L4992F9220
8869A43459a07563r6227c8903k94597B7492l213d14959c2091A73830c9461A70288
8857a42243A9294K0221c21439a26100B7536J31842a14620c786A10417b4269q9939
8846a14208j10570j02455e162A56882e2570j39790c706k00446G5490L2781e0742
8834a10442j06334B16645a80974Q2448G3736N4938b48267E4026J74848a43269
$$ y = [262907, 22193, 257354, -260608, -91600, 41979, -160559, -223313, -229054, -244226, -209234, 69220, 143459, -107563, -203790, -38903, -333500, 27492, 24279, -414959, -32091, 173830, -39461, 170288, -142243, 19294, 39515, -321439, -126100, 27536, 159378, -114620, -3786, 110417, -24269, -114208, -224778, -327233, -5162, 156882, -52570, -192360, -3706, -204152, 75490, 108271, -50742, -110442, -216776, 216645, -180974, -98526, 73736, 128674, -248267, 54026, 228874, -143269]
$$ [...]
##END NTUPLES=NMR SPECTRUM
##END=
