##TITLE=AC1634_CENAH_8493886_MCCc2BPXdY
##JCAMPDX= 6.0         $$ Bruker NMR JCAMP-DX V2.0
##DATA TYPE= NMR SPECTRUM
##DATA CLASS= NTUPLES
##ORIGIN= BRUKER
##OWNER= Administrator
$$ 1.72 TOPSPIN		Version 2.1
$$ 2014-02-18 18:48:23.116 -0800  Administrator@X
$$ Compression mode = diff/dup
##.OBSERVE FREQUENCY= 400.02188249412
##.OBSERVE NUCLEUS= ^1H
##.ACQUISITION MODE= SIMULTANEOUS (DQD)
##.ACQUISITION SCHEME= undefined
##.AVERAGES= 64
##.DIGITISER RES= 22
##SPECTROMETER/DATA SYSTEM= spect
##.PULSE SEQUENCE= noesygpps1d.comp
##.SOLVENT NAME= COFFEE_meoh
##.SHIFT REFERENCE= INTERNAL, COFFEE_meoh, 1, 14.96098
##AUDIT TRAIL= $$ (NUMBER, WHEN, WHO, WHERE, PROCESS, VERSION, WHAT)
$$ ##TITLE= Audit trail, TOPSPIN		Version 2.1
$$ ##JCAMPDX= 5.01
$$ ##ORIGIN= Bruker BioSpin GmbH
$$ ##OWNER= Administrator
$$ $$ E:\/data/COFFEE/nmr/AC1634_CENAH_8493886_MCCc2BPXdY/12/pdata/1/auditp.txt
$$ ##AUDIT TRAIL=  $$ (NUMBER, WHEN, WHO, WHERE, PROCESS, VERSION, WHAT)
(   1,<2014-02-18 18:48:17.944 -0800>,<Administrator>,<X>,<go>,<TOPSPIN 2.1>,
      <created by zg
	started at 2014-02-18 18:36:48.255 -0800,
	POWCHK enabled, PULCHK disabled,
       configuration hash MD5:
       C8 4E 4E 5D D3 5C D8 9E 9F 52 82 E0 59 8A DE 15
       data hash MD5: 64K
       EE 8E 1F C6 8F 39 93 60 99 48 1A AD 39 F1 D1 A9>)
(   2,<2014-02-18 18:48:21.044 -0800>,<Administrator>,<X>,<proc1d>,<TOPSPIN 2.1>,
      <Start of raw data processing
       efp LB = 0.3 FT_mod = 6 PKNL = 1 PHC0 = 0 PHC1 = 0 SI = 128K 
       data hash MD5: 128K
       4B C4 52 A8 C8 01 77 A6 F7 D7 2A 54 58 19 F5 11>)
(   3,<2014-02-18 18:48:22.055 -0800>,<Administrator>,<X>,<proc1d>,<TOPSPIN 2.1>,
      <pk PHC0 = -82.43591 PHC1 = 0 
       data hash MD5: 128K
       FE 4B C1 82 2A AF 05 84 70 7D FA B4 B5 E5 41 56>)
(   4,<2014-02-18 18:48:22.493 -0800>,<Administrator>,<X>,<proc1d>,<TOPSPIN 2.1>,
      <abs ABSG = 1 
       data hash MD5: 128K
       8E 6A E0 6F 1A EA 97 55 93 66 A2 1D D0 0A B6 35>)
(   5,<2014-02-18 18:48:22.611 -0800>,<Administrator>,<X>,<proc1d>,<TOPSPIN 2.1>,
      <abs ABSG = 2 
       data hash MD5: 128K
       1C 79 37 D5 2D 90 9C D1 98 AD AB 9B CC 38 F1 67>)
(   6,<2014-02-18 18:48:22.695 -0800>,<Administrator>,<X>,<proc1d>,<TOPSPIN 2.1>,
      <abs ABSG = 3 
       data hash MD5: 128K
       2C 2C 0C 78 0E 2F 6B 71 24 88 6E 3A 87 5E 7C F9>)
(   7,<2014-02-18 18:48:22.796 -0800>,<Administrator>,<X>,<proc1d>,<TOPSPIN 2.1>,
      <abs ABSG = 4 
       data hash MD5: 128K
       F1 35 A8 01 6B 01 F0 D5 B2 07 D4 88 0F EB 2E 3D>)
(   8,<2014-02-18 18:48:22.897 -0800>,<Administrator>,<X>,<proc1d>,<TOPSPIN 2.1>,
      <abs ABSG = 5 
       data hash MD5: 128K
       FD 7F 86 A3 7B BD 74 63 FC F4 9D 6A 97 83 A4 7F>)
$$ ##END=
$$ 
$$ $$ hash MD5
$$ $$ B5 E4 C3 3A C3 BE 53 AC A1 F7 4F 77 2B A8 02 A2
##$RELAX= 
##$RELAX= 
##$RELAX= 
##$RELAX= 
##$RELAX= 
##$RELAX= 
##$RELAX= 
##$RELAX= 
$$ Bruker specific parameters
$$ --------------------------
##$DU= <E:\>
##$EXPNO= 12
$$ [...]
##$TP07= 0
##$TPNAME0= <>
##$TPNAME1= <>
##$TPNAME2= <>
##$TPNAME3= <>
##$TPNAME4= <>
##$TPNAME5= <>
##$TPNAME6= <>
##$TPNAME7= <>
##$TPOAL= (0..7)
0.5 0.5 0.5 0.5 0.5 0.5 0.5 0.5
##$TPOFFS= (0..7)
0 0 0 0 0 0 0 0
##$TUNHIN= 0
##$TUNHOUT= 0
##$TUNXOUT= 0
##$USERA1= <user>
##$USERA2= <user>
##$USERA3= <user>
##$USERA4= <user>
##$USERA5= <user>
##$V9= 5
##$VALIST= <valist>
##$VCLIST= <CCCCCCCCCCCCCCC>
##$VD= 0
##$VDLIST= <DDDDDDDDDDDDDDD>
##$VPLIST= <PPPPPPPPPPPPPPP>
##$VTLIST= <TTTTTTTTTTTTTTT>
##$WBST= 2048
##$WBSW= 25
##$XGAIN= (0..3)
0 0 0 0
##$XL= 0
##$YL= 0
##$YMAX_a= 5878753
##$YMIN_a= -12596166
##$ZGOPTNS= <>
##$ZL1= 120
##$ZL2= 120
##$ZL3= 120
##$ZL4= 120
##$ABSF1= 14.96098
##$ABSF2= -5.597201
##$ABSG= 5
##$ABSL= 3
##$ALPHA= 0
##$AQORDER= 0
##$ASSFAC= 0
##$ASSFACI= 0
##$ASSFACX= 0
##$ASSWID= 0
##$AUNMP= <proc_prof1d_extract.lims>
##$AXLEFT= 0
##$AXNAME= <>
##$AXNUC= <1H>
##$AXRIGHT= 0
##$AXTYPE= 0
##$AXUNIT= <>
##$AZFE= 0.1
##$AZFW= 0.1
##$BCFW= 0
##$BC_mod= 0
##$BYTORDP= 0
##$COROFFS= 0
##$CY= 15
##$DATMOD= 1
##$DC= 0
##$DFILT= <>
##$DTYPP= 0
##$F1P= 0
##$F2P= 0
##$FCOR= 0.5
##$FTSIZE= 131072
##$FT_mod= 6
##$GAMMA= 0
##$GB= 0
##$INTBC= 1
##$INTSCL= 1
##$ISEN= 128
##$LB= 0.3
##$LEV0= 0
##$LPBIN= 0
##$MAXI= 10000
##$MC2= 0
##$MEAN= 0
##$ME_mod= 0
##$MI= 0
##$NCOEF= 0
##$NC_proc= -2
##$NLEV= 6
##$NOISF1= 0
##$NOISF2= 0
##$NSP= 0
##$NTH_PI= 0
##$NZP= 0
##$OFFSET= 14.96098
##$PC= 1
##$PHC0= -82.43591
##$PHC1= 0
##$PH_mod= 1
##$PKNL= yes
##$PPARMOD= 0
##$PPDIAG= 0
##$PPIPTYP= 0
##$PPMPNUM= 2147483647
##$PPRESOL= 1
##$PSCAL= 4
##$PSIGN= 0
##$PYNMP= <proc.py>
##$REVERSE= no
##$SF= 400.020009644577
##$SI= 131072
##$SIGF1= 0
##$SIGF2= 0
##$SINO= 400
##$SIOLD= 131072
##$SPECTYP= <>
##$SREGLST= <1H.CDCl3>
##$SSB= 0
##$STSI= 131072
##$STSR= 0
##$SW_p= 8223.68421052631
##$SYMM= 0
##$S_DEV= 0
##$TDeff= 65536
##$TDoff= 0
##$TI= <>
##$TILT= no
##$TM1= 0
##$TM2= 0
##$TOPLEV= 0
##$USERP1= <user>
##$USERP2= <user>
##$USERP3= <user>
##$USERP4= <user>
##$USERP5= <user>
##$WDW= 1
##$XDIM= 131072
##$YMAX_p= 410029634
##$YMIN_p= -12516
##$CURPLOT= <Network HP LaserJet P1505>
##$CURPRIN= <$Network HP LaserJet P1505>
##$DFORMAT= <normdp>
##$LAYOUT= <+/1D_H.xwp>
##$LFORMAT= <normlp>
##$PFORMAT= <normpl>
##$SURQMSG= 1
$$ End of Bruker specific parameters
$$ ---------------------------------
##NTUPLES= NMR SPECTRUM
##VAR_NAME=  FREQUENCY,     SPECTRUM/REAL,   SPECTRUM/IMAG
##SYMBOL=    X,             R,               I
##VAR_TYPE=  INDEPENDENT,   DEPENDENT,       DEPENDENT
##VAR_FORM=  AFFN,          ASDF,            ASDF
##VAR_DIM=   131072,        131072,          131072
##UNITS=     HZ,            ARBITRARY UNITS, ARBITRARY UNITS
##FACTOR=    0.0627417313425164, 1,          1
##FIRST=     8223.62146879497, -687,         -62887
##LAST=      0,             2173,            -64023
##MIN=       0,             -12516,          0
##MAX=       8223.62146879497, 410029634,    0
$$ Real data points
##PAGE= N=1
##DATA TABLE= (X++(R..R)), XYDATA
$$ [...]
$$ plain form
63888 799224 778296 757793 737386 717594 699223 682422 666523 651012 636448 624084 614714 608220
63876 608220 604180 602474 603267 606783 613261 622833 635216 649775 666135 684545 705422 728747 754136
63863 754136 781264 809777 838940 867888 896260 924151 951396 977369 1001628 1024175 1044760
63852 1044760 1062485 1076640 1087496 1095642 1100740 1101721 1098124 1090501 1079377 1064526 1045611 1022886
63840 1022886 996792 967370 934724 899793 864028 828287 792479 756364 720265 684888 650793
63829 650793 618254 587444 558550 531748 507141 484703 464222 445377 427953 411951 397464
63818 397464 384458 372708 361972 352203 343573 336282 330373 325742 322169 319211 316190 312529 308240
63805 308240 303975 300505 298171 296787 295910 295030 293601 291171 287663 283541 279509 275895 272376 268458 264192
$$ packed form
63888G99224k0928k0503k0407j9792j8371j6801j5899j5511j4564j2364r370o494
63876F08220m040j706P93L516O478R572J2383J4559J6360J8410K0877K3325K5389
63863G54136K7128K8513K9163K8948K8372K7891K7245K5973K4259K2547K0585
63852A044760J7725J4155J0856Q146N098R81l597p623j1124j4851j8915k2725
63840A022886k6094k9422l2646l4931l5765l5741l5808l6115l6099l5377l4095
63829F50793l2539l0810k8894k6802k4607k2438k0481j8845j7424j6002j4487
63818C97464j3006j1750j0736r769q630p291n909m631l573k958l021l661m289
63805C08240m265l470k334j384q77q80j429k430l508m122m032l614l519l918m266
$$ plain form
63790 264192 260179 256903 254341 252294 250710 249459 248167 246644 245218 244242 243544 242789 242137 241939 241949 241488
63774 241488 240432 239316 238371 237132 235288 233295 231726 230541 229458 228672 228654 229453 230594 231576 232157 232335
63758 232335 232341 232532 233021 233495 233511 232879 231712 230384 229533 229704 230783 232091 233241 234502 236070 237509 238292
63741 238292 238557 238857 239486 240493 242064 244360 247106 249784 252123 254087 255650 257000 258712 261157 263924
63726 263924 266318 268400 270988 274681 279267 284035 288296 291783 294966 298797 303621 308474 311954 313649
63712 313649 314164 314014 313212 311892 310421 308749 306376 303306 300394 298408 297231 296284 295262 294210 293380
63697 293380 293348 294772 297608 300887 303634 305758 307771 309989 312359 314815 317416 320208 323123 325844 327779
63682 327779 328529 328486 328540 329049 329555 329666 329623 329714 329773 329702 329902 330552 330965 330403 329188 328291 328022 327886 327591 327370
$$ packed form
63790B64192m013l276k562k047j584j251j292j523j426r76o98p55o52j98J0m61
63774B41488j056j116r45j239j844j993j569j185j083p86j8P99J141R82N81J78
63758B32335OJ91M89M74J6o32j167j328q51J71J079J308J150J261J568J439P83
63741B38292K65L00O29J007J571K296K746K678K339J964J563J350J712K445K767
63726B63924K394K082K588L693M586M768M261L487L183L831M824M853L480J695
63712C13649N15j50q02j320j471j672k373l070k912j986j177r47j022j052q30
63697B93380l2J424K836L279K747K124K013K218K370K456K601K792K915K721J935
63682C27779P50m3N4N09N06J11m3R1N9p1K00O50M13n62j215q97k69j36k95k21
$$ plain form
63662 327370 327323 327173 326774 326169 325055 322875 319655 316132 312761 309191 305036 300574 296311 292383 288891
63647 288891 286296 284840 283900 282610 281021 280041 280255 281378 282935 284917 287525 290682 294057 297387 300577
63632 300577 303655 306703 309698 312392 314667 317063 320592 325747 331913 338020 343608 349033 354849 361429
63618 361429 369171 378601 390000 403074 417152 431718 446738 462628 480030 499481 521138 544769
63606 544769 570042 596739 624523 652523 679297 703400 724010 740922 753985 762713 766644 766022
63594 766022 761996 756082 749473 742744 735950 728868 721208 712625 702557 690217 675049 657170 637216
63581 637216 615858 593823 572254 552321 534194 517014 500339 485151 472832 463554 456398 450810
63569 450810 447109 445612 446073 448080 451262 454909 458152 460858 463767 467407 471525 475945 481268 488096
$$ packed form
63662C27370m7j50l99o05j114k180l220l523l371l570m155m462m263l928l492
63647B88891k595j456r40j290j589r80K14J123J557J982K608L157L375L330L190
63632C00577L078L048K995K694K275K396L529N155O166O107N588N425N816O580
63618C61429P742R430J1399J3074J4078J4566J5020J5890J7402J9451K1657K3631
63606E44769K5273K6697K7784K8000K6774K4103K0610J6912J3063Q728L931o22
63594G66022m026n914o609o729o794p082p660q583j0068j2340j5168j7879j9954
63581F37216k1358k2035k1569j9933j8127j7180j6675j5188j2319r278p156n588
63569D50810l701j497M61K007L182L647L243K706K909L640M118M420N323O828
$$ plain form
63555 488096 496096 504546 513565 524161 537267 553271 572283 594241 618765 645533 674960 708061
63543 708061 745301 785506 825757 862285 891786 912334 923310 924835 917886 905037 890124 876301
63531 876301 864503 854145 844779 836343 828207 819040 807795 794139 777775 758016 734344 707064
63519 707064 677256 646396 616022 587271 560540 535788 513115 492657 474059 456625 440132
63508 440132 425069 412032 401252 392721 386168 380736 375203 368904 362226 356098 351248 347963 346129
63495 346129 345288 344950 344944 345223 345416 345026 344106 343253 342845 342713 342654 342733 342973 343252 343702 344692 346247 348010 349977
63476 349977 352615 355970 359248 361730 363567 365233 366645 367322 367075 366045 364388 362303 360006 357272 353431
63461 353431 348289 342699 337704 333549 330061 327515 326316 326070 325863 325408 325160 325299 325472 325707 326858 329744
$$ packed form
63555D88096Q000Q450R019J0596J3106J6004J9012K1958K4524K6768K9427L3101
63543G08061L7240M0205M0251L6528K9501K0548J0976J525o949j2849j4913j3823
63531H76301j1798j0358r366q436q136r167j1245j3656j6364j9759k3672k7280
63519G07064k9808l0860l0374k8751k6731k4752k2673k0458j8598j7434j6493
63508D40132j5063j3037j0780q531o553n432n533o299o678o128m850l285j834
63495C46129q41l38oK79J93l90r20q53m08j32n9P9K40K79M50R90J555J763J967
63476C49977K638L355L278K482J837J666J412O77k47j030j657k085k297k734l841
63461C53431n142n590m995m155l488k546j199k46k07m55k48J39J73K35J151K886
$$ plain form
63445 329744 334345 340115 346650 353719 361079 368706 377048 386746 398268 411979 428386 448029 471206
63432 471206 497889 527712 559747 592280 622948 649257 669230 682078 688595 690846 691229 691653 693470
63419 693470 697850 705878 718135 734425 754149 777036 803192 832208 862338 891022 916283 937321
63407 937321 953637 964210 968160 966018 959742 951352 941953 932062 922177 912533 902592 891281 877719
63394 877719 861436 842009 819025 792629 763792 733756 703332 673024 643637 616244 591402
63383 591402 568806 548085 529639 514263 502019 491992 483243 475682 469845 466196 464814 465461 467658
63370 467658 470843 474742 479602 485896 493873 503448 514433 526770 540626 556371 574381 594823 617666
63357 617666 642812 669951 698403 727503 757224 787949 819405 850183 878559 903395 923882
$$ packed form
63445C29744M601N770O535P069P360P627Q342R698J1522J3711J6407J9643K3177
63432D71206K6683K9823L2035L2533L0668K6309J9973J2848O517K251L83M24J817
63419F93470M380Q028J2257J6290J9724K2887K6156K9016L0130K8684K5261K1038
63407I37321J6316J0573L950k142o276q390r399r891r885r644r941j1311j3562
63394H77719j6283j9427k2984k6396k8837l0036l0424l0308k9387k7393k4842
63383E91402k2596k0721j8446j5376j2244j0027q749p561n837l649j382O47K197
63370D67658L185L899M860O294P977R575J0985J2337J3856J5745J8010K0442K2843
63357F17666K5146K7139K8452K9100K9721L0725L1456L0778K8376K4836K0487
$$ plain form
63346 923882 938942 947631 950111 947674 941752 933338 923325 912808 902610 892686 882212 870187 855929
63333 855929 839182 819914 798060 773582 746855 718866 690795 663553 637941 615028 595793
63322 595793 580331 567882 557904 550793 547224 547021 548863 550783 550549 545931 535514 519774 501065
63309 501065 482076 464232 447635 432232 418547 407282 398640 392312 387785 384412 381477 378644 376220
63296 376220 374565 373318 371668 369453 367462 366382 365800 364642 362446 359812 357634 356113 354670 352681
63282 352681 350194 347847 346142 344987 344084 343485 343429 343729 343801 343331 342548 341756 341028 340489 340453 341037 342037 343460
63264 343460 345749 349065 352662 355535 357595 359750 362838 366758 370678 373938 376725 380000 384628 390569
63250 390569 397047 403579 410475 418217 426773 435892 445723 456701 468944 482164 496133 510996 527254
$$ packed form
63346I23882J5060Q689K480k437n922q414j0013j0517j0198r924j0474j2025j4258
63333H55929j6747j9268k1854k4478k6727k7989k8071k7242k5612k2913j9235
63322E95793j5462j2449r978p111l569k03J842J920k34m618j0417j5740j8709
63309E01065j8989j7844j6597j5403j3685j1265q642o328m527l373k935k833k424
63296C76220j655j247j650k215j991j080n82j158k196k634k178j521j443j989
63282C52681k487k347j705j155r03n99n6L00P2m70p83p92p28n39l6N84J000J423
63264C43460K289L316L597K873K060K155L088L920L920L260K787L275M628N941
63250C90569O478O532O896P742Q556R119R831J0978J2243J3220J3969J4863J6258
$$ plain form
63237 527254 545641 566774 590666 616709 644347 673491 704085 735741 768252 802127 837952
63226 837952 875301 912732 948864 983192 1016040 1048172 1080384 1113048 1146059 1179379 1213358
63215 1213358 1248201 1283412 1318162 1351817 1383460 1411240 1432881 1446881 1452682 1449943 1438345 1418059
63203 1418059 1389717 1353927 1311489 1264050 1213839 1162653 1111683 1062167 1015370 971852 931668
63192 931668 895522 864788 839987 820021 803435 789814 779538 772828 769622 769876 773426 779895 789043
63179 789043 800741 814266 828290 842078 856141 871160 886808 902238 917166 931730 945758
63168 945758 958939 971363 983040 993167 1000693 1005385 1007453 1006337 1000827 990518 976180 958573
63156 958573 937752 913848 887680 860128 831540 802267 773170 745062 718078 692220 668229
$$ packed form
63237E27254J8387K1133K3892K6043K7638K9144L0594L1656L2511L3875L5825
63226H37952L7349L7431L6132L4328L2848L2132L2212L2664L3011L3320L3979
63215A213358L4843L5211L4750L3655L1643K7780K1641J4000N801k739j1598k0286
63203A418059k8342l5790m2438m7439n0211n1186n0970m9516m6797m3518m0184
63192I31668l6146l0734k4801j9966j6586j3621j0276o710l206K54L550O469R148
63179G89043J1698J3525J4024J3788J4063J5019J5648J5430J4928J4564J4028
63168I45758J3181J2424J1677J0127P526M692K068j116n510j0309j4338j7607
63156I58573k0821k3904k6168k7552k8588k9273k9097k8108k6984k5858k3991
$$ plain form
63145 668229 647236 629605 614586 601143 588792 577677 568189 560562 554552 549456 544634 540084 536320
63132 536320 533667 531877 530547 529729 529982 531825 535232 539676 544577 549684 555088 560956 567292 573820 580015
63117 580015 585338 589667 593492 597502 601906 606295 610265 613936 617669 621436 624777 627387 629427 631204
63103 631204 632822 634266 635582 636717 637344 637165 636336 635372 634654 634253 634137 634177 633962 633082 631799 631034 631397
63086 631397 632567 633975 635756 638532 642451 647034 651913 657121 662556 667812 672873 678488 685412 693578
63072 693578 702472 712044 722731 734652 747293 760113 773085 786543 800894 816789 835256 857196
63060 857196 882677 911017 941708 975075 1011948 1052859 1097824 1146823 1200171 1258343 1321662
63049 1321662 1390293 1464249 1543101 1625726 1710685 1796882 1883724 1970708 2057196 2142675 2227007
$$ packed form
63145F68229k0993j7631j5019j3443j2351j1115r488p627o010n096m822m550l764
63132E36320k653j790j330q18K53J843L407M444M901N107N404N868O336O528O195
63117E80015N323M329L825M010M404M389L970L671L733L767L341K610K040J777
63103F31204J618J444J316J135O27j79q29r64p18m01j16M0k15q80j283p65L63
63086F31397J170J408J781K776L919M583M879N208N435N256N061N615O924Q166
63072F93578Q894R572J0687J1921J2641J2820J2972J3458J4351J5895J8467K1940
63060H57196K5481K8340L0691L3367L6873M0911M4965M8999N3348N8172O3319
63049A321662O8631P3956P8852Q2625Q4959Q6197Q6842Q6984Q6488Q5479Q4332
$$ plain form
63038 2227007 2310225 2392246 2472952 2552487 2631245 2709515 2787134 2863449 2937434 3007713 3072369
63027 3072369 3128823 3174031 3204923 3218733 3213186 3186926 3140158 3074767 2993434 2898590 2792399
63016 2792399 2677592 2557839 2437002 2318165 2203494 2094779 1993802 1902153 1820886 1750405
63006 1750405 1690563 1640835 1600528 1569036 1545974 1530961 1523268 1521882 1526051 1535555 1550093 1568517
62994 1568517 1589123 1610752 1633203 1656543 1680584 1705301 1731022 1757601 1783789 1808068 1829858
62983 1829858 1849299 1866115 1879343 1888028 1891366 1888225 1877417 1858678 1832722 1800129 1760877 1715244
62971 1715244 1664488 1610241 1553824 1496573 1440152 1385873 1334067 1284711 1238285 1195424 1156002
62960 1156002 1119276 1084859 1052917 1023429 995825 969519 944434 920836 898917 878580 859466
$$ packed form
63038B227007Q3218Q2021Q0706P9535P8758P8270P7619P6315P3985P0279O4656
63027C072369N6454M5208L0892J3810n547k6260m6768o5391q1333r4844j06191
63016B792399j14807j19753j20837j18837j14671j08715j00977r1649q1267p0481
63006A750405n9842m9728m0307l1492k3062j5013p693j386M169R504J4538J8424
62994A568517K0606K1629K2451K3340K4041K4717K5721K6579K6188K4279K1790
62983A829858J9441J6816J3228Q685L338l141j0808j8739k5956l2593l9252m5633
62971A715244n0756n4247n6417n7251n6421n4279n1806m9356m6426m2861l9422
62960A156002l6726l4417l1942k9488k7604k6306k5085k3598k1919k0337j9114
$$ plain form
62949 859466 841066 822966 804965 786978 768963 751104 733788 717183 701060 685323 670500
62938 670500 657284 645773 635585 626616 619184 613361 608649 604485 600739 597507 594744 592329 590275
62925 590275 588632 587300 586135 585082 583994 582510 580426 578262 577028 577149 577734 577275 575122 572037 569152
62910 569152 566692 564011 560625 556656 552270 547291 541747 536427 532414 530064 528743 527531 525966 524213
62896 524213 522790 522218 522674 523836 525093 525917 525983 525044 522967 520044 517120 515163 514526 514677 514731 514359 514118
62879 514118 514858 516837 519453 521770 523217 523826 523926 523675 522901 521455 519602 517858 516373 514794 512889
62864 512889 510988 509481 508182 506631 504872 503463 502748 502530 502434 502212 501766 501348 501669 503238 505555 507518
62848 507518 508743 509913 511651 513652 515217 516056 516178 515482 513919 511733 509206 506484 503894 501958 500679
$$ packed form
62949H59466j8400j8100j8001j7987j8015j7859j7316j6605j6123j5737j4823
62938F70500j3216j1511j0188q969p432n823m712m164l746l232k763k415k054
62925E90275j643j332j165j053j088j484k084k164j234J21N85m59k153l085k885
62910E69152k460k681l386l969m386m979n544n320m013k350j321j212j565j753
62896E24213j423n72M56J162J257Q24O6r39k077k923k924j957o37J51N4l72k41
62879E14118P40J979K616K317J447O09J00k51p74j446j853j744j485j579j905
62864E12889j901j507j299j551j759j409p15k18r6k22m46m18L21J569K317J963
62848E07518J225J170J738K001J565Q39J22o96j563k186k527k722k590j936j279
$$ plain form
62833 500679 499264 497071 494517 492601 491813 491969 492796 494120 495628 496952 497992 498883 499836 501231 503522
62818 503522 506705 510219 513777 517863 522890 528313 533335 538255 544264 551897 560388 568586 575987 582864
62804 582864 590005 598356 608336 619399 630784 642658 655927 670927 687091 704031 722123 741606
62792 741606 761926 782628 804504 829221 858063 891557 930044 974014 1023912 1080138 1143280
62781 1143280 1214001 1292635 1379223 1473977 1577318 1689270 1809032 1935323 2066929 2202645
62771 2202645 2340728 2478615 2613154 2740944 2858472 2962260 3049150 3116431 3161714 3183033
62761 3183033 3179436 3151439 3100650 3029056 2938947 2833358 2715937 2590130 2458772 2324560
62751 2324560 2190410 2058973 1931996 1810420 1694920 1586158 1484742 1391148 1305544 1227595
$$ packed form
62833E00679j415k193k554j916p88J56Q27J324J508J324J040Q91R53J395K291
62818E03522L183L514L558M086N027N423N022M920O009P633Q491Q198P401O877
62804E82864P141Q351R980J1063J1385J1874J3269J5000J6164J6940J8092J9483
62792G41606K0320K0702K1876K4717K8842L3494L8487M3970M9898N6226O3142
62781A143280P0721P8634Q6588R4754J03341J11952J19762J26291J31606J35716
62771B202645J38083J37887J34539J27790J17528J03788Q6890O7281M5283K1319
62761C183033l597k7997n0789p1594r0109j05589j17421j25807j31358j34212
62751B324560j34150j31437j26977j21576j15500j08762j01416r3594q5604p7949
$$ plain form
62741 1227595 1156650 1092242 1034136 981870 934715 892254 854472 821005 790813 763076 737947
62730 737947 715953 697019 680624 666572 654923 645338 637084 629635 622917 617109 612599 609872 608972
62717 608972 609288 610348 612538 616484 622016 628419 635533 643903 653996 665954 680103 696969 716708
62704 716708 739130 764373 792998 825321 861186 900517 943604 990710 1041737 1096261 1153609
62693 1153609 1213075 1274469 1338144 1403823 1469691 1533295 1593032 1647869 1695884 1734356 1761472
62682 1761472 1776950 1780796 1772540 1752067 1720146 1677684 1625422 1564957 1499121 1430581 1360749 1290666
62670 1290666 1222070 1156654 1094838 1036224 980908 929522 882322 839099 799813 764549 732951
62659 732951 704358 678427 655051 633799 614094 595931 579849 566126 554407 544121 534810 526104
$$ packed form
62741A227595p0945o4408n8106n2266m7155m2461l7782l3467l0192k7737k5129
62730G37947k1994j8934j6395j4052j1649r585q254p449o718n808m510k727r00
62717F08972L16J060K190L946N532O403P114Q370J0093J1958J4149J6866J9739
62704G16708K2422K5243K8625L2323L5865L9331M3087M7106N1027N4524N7348
62693A153609N9466O1394O3675O5679O5868O3604N9737N4837M8015L8472K7116
62682A761472J5478L846q256k0473l1921m2462n2262o0465o5836o8540o9832p0083
62670A290666o8596o5416o1816n8614n5316n1386m7200m3223l9286l5264l1598
62659G32951k8593k5931k3376k1252j9705j8163j6082j3723j1719j0286r311q706
$$ plain form
62647 526104 517791 509972 502842 496352 490404 485288 481453 478802 476597 474199 471682 469598 468369 467993
62633 467993 468181 468639 469199 469697 469847 469386 468339 466956 465416 463818 462409 461405 460545 459245 457404 455669
62617 455669 454775 454994 456466 459551 464462 470883 478363 486745 495889 505343 514732 524260 534422 545576
62603 545576 558154 572977 590771 611596 635172 661553 691044 723820 760308 801647 848970
62592 848970 902137 959799 1020730 1084423 1150340 1217289 1283840 1348750 1410567 1467240 1516526
62581 1516526 1556559 1585821 1602939 1607032 1598148 1577162 1545341 1504167 1455315 1400446 1341045 1278632
62569 1278632 1215011 1151995 1090893 1032424 977054 925168 876954 832494 792090 756183 724690
62558 724690 696693 671165 647957 627656 610517 595981 583275 571951 561574 551524 541667 532830
$$ packed form
62647E26104q313p819p130o490n948n116l835k651k205k398k517k084j229l76
62633D67993J88M58N60M98J50m61j047j383j540j598j409j004q60j300j841j735
62617D55669q94K19J472L085M911O421P480Q382R144R454R389R528J0162J1154
62603E45576J2578J4823J7794K0825K3576K6381K9491L2776L6488M1339M7323
62592H48970N3167N7662O0931O3693O5917O6949O6551O4910O1817N6673M9286
62581A516526M0033K9262J7118M093q884k0986l1821m1174m8852n4869n9401o2413
62569A278632o3621o3016o1102n8469n5370n1886m8214m4460m0404l5907l1493
62558G24690k7997k5528k3208k0301j7139j4536j2706j1324j0377j0050r857q837
$$ plain form
62546 532830 525885 520572 515927 511765 508890 507673 507239 506409 504852 502914 500885 499000 497672 497106 496801
62531 496801 495952 494305 492318 490668 489939 490645 493112 497295 502888 509655 517606 527001 538310 551965
62517 551965 568034 586326 606914 630248 656655 686051 718314 753509 791429 831258 872034
62506 872034 913239 954615 995541 1034876 1071235 1103294 1130075 1151185 1166569 1176053 1179541 1177780
62494 1177780 1172275 1164211 1154149 1143230 1133911 1128616 1128063 1131742 1139722 1153078 1172616 1198070 1228686
62481 1228686 1263901 1303253 1346102 1391559 1438218 1483806 1525438 1560367 1586443 1602312 1607781
62470 1607781 1603780 1591145 1569304 1536686 1492589 1438229 1376007 1308391 1237647 1165930 1095080
62459 1095080 1026460 961198 900345 844711 794792 750878 712868 680020 651362 626538 605935
$$ packed form
62546E32830o945n313m645m162k875j217m34q30j557j938k029j885j328n66l05
62531D96801q49j647j987j650p29P06K467M183N593O767P951R395J1309J3655
62517E51965J6069J8292K0588K3334K6407K9396L2263L5195L7920L9829M0776
62506H72034M1205M1376M0926L9335L6359L2059K6781K1110J5384R484L488j761
62494A177780n505q064j0062j0919r319n295n53L679P980J3356J9538K5454L0616
62481A228686L5215L9352M2849M5457M6659M5588M1632L4929K6076J5869N469
62470A607781m001j2635k1841l2618m4097n4360o2222o7616p0744p1717p0850
62459A095080o8620o5262o0853n5634m9919m3914l8010l2848k8658k4824k0603
$$ plain form
62448 605935 589892 578146 570097 565124 562462 561222 560927 561758 564039 567684 572387 578071 584814 592407
62434 592407 600198 607337 613075 616927 618708 618453 616199 611842 605161 596040 584824 572467 560088 548229
62420 548229 536762 525616 515172 505661 496627 487572 478818 471116 464578 458679 453187 448306 443892
62407 443892 439395 434863 431204 428966 427454 425595 423246 421070 419531 418610 418344 418984 420516 422493 424442
62392 424442 426180 427668 428831 429679 430452 431483 432957 434871 437246 440307 444333 449315 454847 460439 465862
62377 465862 471142 476439 482046 488305 495268 502589 509992 517648 525813 534360 543127 552542 563301 575471
62363 575471 588541 602537 618435 637216 658987 683466 710934 742233 778005 818226 862300
62352 862300 909259 957915 1007092 1055673 1102311 1145258 1182712 1213297 1236251 1251423 1259294 1260773
$$ packed form
62448F05935j6043j1746q049m973k662j240k95Q31K281L645M703N684O743P593
62434E92407P791P139N738L852J781k55k254m357o681r121j1216j2357j2379j1859
62420E48229j1467j1146j0444r511r034r055q754p702o538n899n492m881m414
62407D43892m497m532l659k238j512j859k349k176j539r21k66O40J532J977J949
62392D24442J738J488J163Q48P73J031J474J914K375L061M026M982N532N592N423
62377D65862N280N297N607O259O963P321P403P656Q165Q547Q767R415J0759J2170
62363E75471J3070J3996J5898J8781K1771K4479K7468L1299L5772M0221M4074
62352H62300M6959M8656M9177M8581M6638M2947L7454L0585K2954J5172P871J479
$$ plain form
62340 1260773 1256684 1247523 1233749 1215986 1194598 1169356 1140057 1107607 1074155 1041938 1012059 984446
62328 984446 958741 934953 913258 893465 875006 857489 841014 825677 810842 795160 777525
62317 777525 757919 737162 715892 694077 671677 649537 629106 611126 595035 579980 566081
62306 566081 554096 544066 535114 526710 519342 513557 509004 505000 501506 498864 496993 495610 495002 495742
62292 495742 497629 499651 501146 502473 504372 507116 510391 513635 516366 518552 520734 523499 526803 530072
62278 530072 532845 535011 536552 537553 538365 539333 540451 541739 543759 547169 551902 557413 563646 571054 579808
62263 579808 589816 601558 615983 633409 653422 676135 702636 733776 769389 809122 853160
62252 853160 901446 952892 1006031 1059763 1112779 1162973 1208318 1247895 1281276 1307505 1325711
$$ packed form
62340A260773m089r161j3774j7763k1388k5242k9299l2450l3452l2217k9879k7613
62328I84446k5705k3788k1695j9793j8459j7517j6475j5337j4835j5682j7635
62317G77525j9606k0757k1270k1815k2400k2140k0431j7980j6091j5055j3899
62306E66081j1985j0030q952q404p368n785m553m004l494k642j871j383o08P40
62292D95742J887K022J495J327J899K744L275L244K731K186K182K765L304L269
62278E30072K773K166J541J001Q12R68J118J288K020L410M733N511O233P408Q754
62263E79808J0008J1742J4425J7426K0013K2713K6501L1140L5613L9733M4038
62252H53160M8286N1446N3139N3732N3016N0194M5345L9577L3381K6229J8206
$$ plain form
62241 1325711 1336337 1340558 1338472 1328906 1311143 1286018 1255052 1219360 1179748 1137260 1093167 1048831
62229 1048831 1005859 965915 929899 897536 868081 841234 817115 795575 775948 757489 739831
62218 739831 722895 706534 690454 674528 659012 644291 630407 617012 603859 591145 579349
62207 579349 568893 560025 552756 546782 541725 537595 534758 533229 532344 531440 530651 530609 531580 533307 535581
62192 535581 538456 541917 545800 550177 555404 561625 568546 575875 583685 592027 600525 608722 616702 624885
62178 624885 633124 640415 645819 649500 652565 656010 660160 665115 671306 679341 689592 702266 717755
62165 717755 736603 759154 785438 815352 848657 884705 922271 959717 995293 1027451 1055090
62154 1055090 1077527 1094322 1105363 1111228 1113005 1111347 1105841 1095672 1080695 1061552 1039026 1013830
$$ packed form
62241A325711J0626M221k086r566j7763k5125l0966l5692l9612m2488m4093m4336
62229A048831m2972l9944l6016l2363k9455k6847k4119k1540j9627j8459j7658
62218G39831j6936j6361j6080j5926j5516j4721j3884j3395j3153j2714j1796
62207E79349j0456q868p269n974n057m130k837j529q85r04p89m2R71J727K274
62192E35581K875L461L883M377N227O221O921P329P810Q342Q498Q197P980Q183
62178F24885Q239P291N404L681L065L445M150M955O191Q035J0251J2674J5489
62165G17755J8848K2551K6284K9914L3305L6048L7566L7446L5576L2158K7639
62154A055090K2437J6795J1041N865J777j658n506j0169j4977j9143k2526k5196
$$ plain form
62142 1013830 986909 959372 932099 905788 881277 859327 840192 823911 810915 801692 795922 792621
62130 792621 791180 791528 793227 795284 797156 799233 801982 805271 808904 813151 818323 824379 831371 839743
62116 839743 849728 860908 872735 884885 896704 906884 914267 918488 919497 917097 911592 904320 896809
62103 896809 889781 883500 878457 874879 872048 869080 866175 864315 864006 865126 867738 872044 877549 883299
62089 883299 889132 895879 904004 912661 920438 926615 931484 935883 940600 945833 951086 955848 960414 965668
62075 965668 972113 979620 988124 997891 1008809 1020002 1030619 1040776 1051223 1062251 1073426 1084540
62063 1084540 1096488 1110779 1128104 1147652 1167993 1188349 1208552 1227873 1244632 1257293 1265520
62052 1265520 1269807 1270511 1267709 1261648 1252649 1240547 1224588 1203984 1178443 1148339 1114599 1078306
$$ packed form
62142A013830k6921k7537k7273k6311k4511k1950j9135j6281j2996r223n770l301
62130G92621j441L48J699K057J872K077K749L289L633M247N172O056O992Q372
62116H39743R985J1180J1827J2150J1819J0180P383M221J009k400n505p272p511
62103H96809p028o281n043l578k831k968k905j860l09J120K612M306N505N750
62089H83299N833O747Q125Q657P777O177M869M399M717N233N253M762M566N254
62075I65668O445P507Q504R767J0918J1193J0617J0157J0447J1028J1175J1114
62063A084540J1948J4291J7325J9548K0341K0356K0203J9321J6759J2661Q227
62052A265520M287P04k802o061q999j2102j5959k0604k5541l0104l3740l6293
$$ plain form
62040 1078306 1040280 1001171 961917 923616 886788 851304 817297 785517 756335 729066 702981
62029 702981 678492 656591 637476 620506 605287 591960 580549 570745 562356 555298 549174 543384
62017 543384 537624 531800 525650 519119 512918 508010 504523 501799 499435 497641 496638 496429 497200 499240 502387
62002 502387 506154 510452 515525 521198 526915 532611 538712 545076 550646 554549 556959 558572 559755 560468
61988 560468 560549 559743 557830 554894 551076 545981 538937 530097 520747 512158 504517 497233 489930 482814 476352
61973 476352 470907 466534 462928 459690 456653 453864 451356 449182 447459 446079 444671 443200 442238 442058 441901
61958 441901 440963 439771 439568 440500 441564 442346 443576 445686 448084 450427 453484 457953 463271 468474 473583
61943 473583 479394 486395 494593 503915 514107 524617 535213 546339 558288 570427 581823 592310
$$ packed form
62040A078306l8026l9109l9254l8301l6828l5484l4007l1780k9182k7269k6085
62029G02981k4489k1901j9115j6970j5219j3327j1411r804q389p058o124n790
62017E43384n760n824o150o531o201m908l487k724k364j794j003k09P71K040L147
62002E02387L767M298N073N673N717N696O101O364N570L903K410J613J183P13
61988E60468Q1q06j913k936l818n095p044q840r350q589p641p284p303p116o462
61973D76352n445m373l606l238l037k789k508k174j723j380j408j471r62j80j57
61958D41901r38j192k03R32J064P82J230K110K398K343L057M469N318N203N109
61943D73583N811P001Q198R322J0192J0510J0596J1126J1949J2139J1396J0487
$$ plain form
61931 592310 602366 612218 621550 629799 636345 640882 644020 646995 650184 652377 652153 649542 645698 641401
61917 641401 636703 631646 626441 621154 616057 612127 610361 610705 612454 615575 620758 628165 637103 647048
61903 647048 658006 669487 680011 688185 693693 696785 697447 695708 692237 687883 682755 676378 668631 660001
61889 660001 650921 641426 631617 622084 613593 606542 600854 596208 592097 587804 582659 576442 569440 562031
61875 562031 554374 546615 539238 532954 528188 524839 522601 521445 521638 523276 525864 528570 531050 533974
61861 533974 538482 545021 553000 561662 570943 581223 592571 604750 617762 631865 647155 663582
61849 663582 681333 700602 720947 741429 761527 781392 800955 819337 835526 849220 860571
61838 860571 869334 874694 875875 872720 865842 856404 845657 834507 823594 813721 805877 800696 798158
$$ packed form
61931E92310J0056R852R332Q249O546M537L138K975L189K193k24k611l844m297
61917F41401m698n057n205n287n097l930j766L44J749L121N183P407Q938R945
61903F47048J0958J1481J0524Q174N508L092O62j739l471m354n128o377p747q630
61889F60001r080r495r809r533q491p051n688m646m111m293n145o217p002p409
61875E62031p657p759p377o284m766l349k238j156J93J638K588K706K480K924
61861E33974M508O539P979Q662R281J0280J1348J2179J3012J4103J5290J6427
61849F63582J7751J9269K0345K0482K0098J9865J9563J8382J6189J3694J1351
61838H60571Q763N360J181l155o878r438j0747j1150j0913r873p844n181k538
$$ plain form
61825 798158 797981 800058 804367 810679 818573 827514 836703 844923 850707 852790 850543 844137 834167 821036
61811 821036 804918 786391 766599 746357 725553 704079 682863 663098 644747 626923 609742
61800 609742 594583 582229 571825 562095 552641 543635 535289 528236 523439 520846 518879 516078 512611
61787 512611 509419 506654 503945 501542 500022 499207 498405 497520 496958 496658 496201 495781 496115 497277 498440 498881
61771 498881 498659 498281 498259 498988 500466 502191 503855 505902 508814 512112 514920 517332 520277 524047 527948
61756 527948 531500 535044 538793 542240 544950 547230 549399 550918 550885 549146 546456 543661 540998 538100 534548
61741 534548 530493 526699 523721 521251 518644 516002 514137 513433 513384 513415 513583 514187 515189 516365 517618 518829
61725 518829 519774 520510 521516 523126 525109 527153 529402 532072 534779 536805 538040 539200 540916 542911 544331
$$ packed form
61825G98158j77K077M309O312P894Q941R189Q220N784K083k247o406r970j3131
61811H21036j6118j8527j9792k0242k0804k1474k1216j9765j8351j7824j7181
61800F09742j5159j2354j0404r730r454r006q346p053m797k593j967k801l467
61787E12611l192k765k709k403j520q15q02q85n62l00m57m20L34J162J163M41
61771D98881k22l78k2P29J478J725J664K047K912L298K808K412K945L770L901
61756E27948L552L544L749L447K710K280K169J519l3j739k690k795k663k898l552
61741E34548m055l794k978k470k607k642j865p04m9L1J68O04J002J176J253J211
61725E18829R45P36J006J610J983K044K249K670K707K026J235J160J716J995J420
$$ plain form
61710 544331 544733 544466 544059 543473 542216 540048 537288 534406 531656 529214 527298 525812 524159 521827 519085
61695 519085 516727 515152 513960 512450 510291 507730 505296 503262 501317 498949 496261 494038 492760 491869
61681 491869 490402 488083 485394 482899 480996 480080 480244 480807 480704 479419 477242 474694 472156 469935 468150
61666 468150 466549 464842 463167 461806 460607 459234 457909 457234 457292 457539 457646 457823 458235 458744 459378 460415
61650 460415 461808 463136 464299 465680 467372 468935 470221 471774 473937 476152 477696 478683 479712 480822
61636 480822 481397 481031 480035 479105 478702 478678 478365 477292 475860 474972 474818 474495 473086 470636 467675 464294 460325
61619 460325 456128 452490 449814 447939 446680 445900 445065 443343 440471 437070 433805 430530 426550 421558 415978
61604 415978 410500 405550 401212 397383 393868 390455 387068 383816 380841 378185 375858 373890 372152 370239
$$ packed form
61710E44331M02k67m07n86j257k168k760k882k750k442j916j486j653k332k742
61695E19085k358j575j192j510k159k561k434k034j945k368k688k223j278q91
61681D91869j467k319k689k495j903r16J64N63j03j285k177k548k538k221j785
61666D68150j601j707j675j361j199j373j325o75N8K47J07J77M12N09O34J037
61650D60415J393J328J163J381J692J563J286J553K163K215J544R87J029J110
61636D80822N75l66r96r30m03k4l13j073j432q88j54l23j409k450k961l381l969
61619D60325m197l638k676j875j259p80q35j722k872l401l265l275l980m992n580
61604D15978n478m950m338l829l515l413l387l252k975k656k327j968j738j913
$$ plain form
61590 370239 367801 364975 362194 359632 357171 354884 352993 351230 348882 345869 343174 341587 340512 338747
61576 338747 336115 333471 331324 329409 327608 326320 325620 324924 323935 323210 323303 323931 324508 324985 325513 325681 324849
61559 324849 323159 321616 321064 321439 322114 322707 323414 324686 326639 328842 330744 332216 333509 334762 335811
61544 335811 336448 336573 336155 335470 335290 336272 338088 339763 341050 342783 345457 348182 349735 350209 350766 351956
61528 351956 353088 353329 352714 351792 350780 349467 347719 345735 343837 342214 340873 339736 338759 337978 337454 337169
61512 337169 337008 336878 336873 337249 338129 339234 340060 340394 340420 340200 339385 337791 336029 335028 334960 335109 334885 334501 334494
61493 334494 334998 335844 337080 338984 341571 344323 346516 347771 348287 348481 348471 348105 347538 347337 347709 348002 347534
61476 347534 346704 346661 347932 349977 352092 354095 356009 357689 359020 360026 360560 360376 359666 359092 359037 359250 359379
$$ packed form
61590C70239k438k826k781k562k461k287j891j763k348l013k695j587j075j765
61576C38747k632k644k147j915j801j288p00o96r89p25R3O28N77M77N28J68q32
61559C24849j690j543n52L75O75N93P07J272J953K203J902J472J293J253J049
61544C35811O37J25m18o85j80R82J816J675J287J733K674K725J553M74N57J190
61528C51956J132K41o15r22j012j313j748j984j898j623j341j137r77p81n24k85
61512C37169j61j30nL76Q80J105Q26L34K6k20q15j594j762j001o8J49k24l84p
61493C34494N04Q46J236J904K587K752K193J255N16J94j0l66n67k01L72K93m68
61476C47534q30m3J271K045K115K003J914J680J331J006N34j84p10n74n5K13J29
$$ plain form
61459 359379 359393 359354 359243 359174 359313 359445 359215 358880 359142 360047 360804 361030 361329 362196 363168 363714 364177 365037 365932 366356
61439 366356 366793 368106 370089 371663 372500 373492 375547 378663 382312 385984 389160 391373 392649 393562 394654
61424 394654 395968 397193 398030 398499 399134 400732 403594 407203 410876 414385 417547 419687 420324 420124 420346 421269
61408 421269 421917 421388 419762 417554 415051 412493 410261 408423 406516 404164 401537 398897 396139 393215 390659
61393 390659 389123 388539 388162 387415 386329 385201 384291 383962 384657 386335 388091 388807 388319 387685 388091 389662 391577
61376 391577 393189 394637 396384 398528 400743 402630 403972 404863 405757 407171 409214 411569 413998 416570 419297
61361 419297 421889 424081 425905 427469 428826 430305 432559 435946 440136 444647 449449 454691 460217 465819
61347 465819 471707 478165 484900 491207 496741 501772 506754 511986 517465 522719 526993 529994 532308 534674
$$ packed form
61459C59379J4l9j11o9J39J32k30l35K62R05P57K26K99Q67R72N46M63Q60Q95M24
61439C66356M37J313J983J574Q37R92K055L116L649L672L176K213J276R13J092
61424C94654J314J225Q37M69O35J598K862L609L673L509L162K140O37k00K22R23
61408D21269O48n29j626k208k503k558k232j838j907k352k627k640k758k924k556
61393C90659j536n84l77p47j086j128r10l29O95J678J756P16m88o34M06J571J915
61376C91577J612J448J747K144K215J887J342Q91Q94J414K043K355K429K572K727
61361D19297K592K192J824J564J357J479K254L387M190M511M802N242N526N602
61347D65819N888O458O735O307N534N031M982N232N479N254M274L001K314K366
$$ plain form
61333 534674 537087 538998 540135 540628 540531 539812 538644 537162 535141 532527 530080 528739 528501 528699 529302 530965
61317 530965 533678 536436 538722 541433 545731 551623 558354 565675 573867 582832 592012 601219 610991 621997
61303 621997 634534 648635 664107 680162 695312 708131 718153 725851 731609 734904 734665 730409 722831
61290 722831 713241 702641 691483 679984 668302 656450 644357 632130 620090 608565 597818 588165
61278 588165 579990 573508 568501 564396 560752 557836 556583 557621 560368 563561 566744 570585 575442 580348
61264 580348 584118 587019 590471 595256 600843 606532 612475 619361 627600 637073 647185 656905 665068 670961
61250 670961 674566 676260 676494 675749 674465 672905 671162 669188 666703 663387 659478 655874 653226 651253 649407
61235 649407 647854 647109 646947 646556 645690 644924 644752 645254 646728 649765 654447 660250 666984 675105 684713 694987
$$ packed form
61333E34674K413J911J137M93r7p19j168j482k021k614k447j341k38J98O03J663
61317E30965K713K758K286K711M298N892O731P321Q192Q965R180R207R772J1006
61303F21997J2537J4101J5472J6055J5150J2819J0022P698N758L295k39m256p578
61290G22831r590j0600j1158j1499j1682j1852j2093j2227j2040j1525j0747r653
61278E88165q175o482n007m105l644k916j253J038K747L193L183L841M857M906
61264E80348L770K901L452M785N587N689N943O886Q239R473J0112R720Q163N893
61250F70961L605J694K34p45j284j560j743j974k485l316l909l604k648j973j846
61235F49407j553p45j62l91q66p66j72N02J474L037M682N803O734Q121R608J0274
$$ plain form
61219 694987 705059 714891 724799 734695 744246 753385 762211 770775 779228 787710 795752 802360 807104 810675
61205 810675 813957 817090 819890 822580 825518 828716 832316 837149 844036 852819 862782 873883 886889 902384
61191 902384 920160 939439 959119 977892 994724 1009262 1021403 1030720 1036811 1040059 1041388 1041290 1039702
61178 1039702 1036731 1032802 1027996 1021911 1014341 1005531 995557 984062 970846 956188 940334 923226 905105
61165 905105 886856 869203 851941 834486 816877 799611 782699 765648 748471 732078 717392
61154 717392 704536 693174 683274 675145 668926 664448 661492 659877 659342 659579 660338 661231 661523 660474 657896
61139 657896 654059 649133 643190 636834 631243 627290 625014 624184 624881 627132 630539 634947 641127 650056 661658
61124 661658 674957 689398 705326 723163 742898 764545 788359 814300 841901 871026 902132
$$ packed form
61219F94987J0072R832R908R896R551R139Q826Q564Q453Q482Q042O608M744L571
61205H10675L282L133K800K690K938L198L600M833O887Q783R963J1101J3006J5495
61191I02384J7776J9279J9680J8773J6832J4538J2141R317O091L248J329r8j588
61178A039702k971l929m806o085p570q810r974j1495j3216j4658j5854j7108j8121
61165I05105j8249j7653j7262j7455j7609j7266j6912j7051j7177j6393j4686
61154G17392j2856j1362r900q129o219m478k956j615n35K37P59Q93K92j049k578
61139F57896l837m926n943o356n591l953k276q30O97K251L407M408O180Q929J1602
61124F61658J3299J4441J5928J7837J9735K1647K3814K5941K7601K9125L1106
$$ plain form
61113 902132 935321 969624 1003741 1037143 1069933 1101854 1132025 1159568 1184131 1205803 1224790
61102 1224790 1241116 1254496 1264529 1271116 1274426 1274358 1270275 1261503 1247795 1229170 1205632 1177486 1145775
61089 1145775 1112035 1077609 1043252 1009184 975325 941720 908900 877660 848361 820770 794739
61078 794739 770653 748884 729185 711099 694707 680533 668792 659127 651028 644137 638234 633241
61066 633241 629277 626411 624446 623143 622594 623162 625057 628148 632103 636617 641655 647562 654740 663068 671936
61051 671936 681040 690836 701983 714692 728977 745185 763722 784400 806532 829640 853738 878969
61039 878969 905307 932552 960347 988289 1016321 1044873 1074379 1104752 1135585 1166601 1197614
61028 1197614 1228372 1258967 1290169 1322818 1356909 1391682 1426508 1461273 1496101 1531257 1567294
$$ packed form
61113I02132L3189L4303L4117L3402L2790L1921L0171K7543K4563K1672J8987
61102A224790J6326J3380J0033O587L310o8m083q772j3708j8625k3538k8146l1711
61089A145775l3740l4426l4357l4068l3859l3605l2820l1240k9299k7591k6031
61078G94739k4086k1769j9699j8086j6392j4174j1741r665q099o891n903m993
61066F33241l964k866j965j303n49N68J895L091L955M514N038N907P178Q328Q868
61051F71936R104R796J1147J2709J4285J6208J8537K0678K2132K3108K4098K5231
61039H78969K6338K7245K7795K7942K8032K8552K9506L0373L0833L1016L1013
61028A197614L0758L0595L1202L2649L4091L4773L4826L4765L4828L5156L6037
$$ plain form
61017 1567294 1604871 1644603 1687649 1736289 1793168 1859929 1937160 2025743 2127764 2246317 2385403
61006 2385403 2550349 2747705 2984589 3268740 3609148 4015830 4499489 5073421 5756892
60997 5756892 6575493 7557427 8730103 10117446 11728459 13530488 15421547 17230917
60989 17230917 18762429 19861064 20466137 20628110 20489984 20243680 20070194 20077000 20256815
60980 20256815 20489605 20588403 20367000 19702058 18570552 17052772 15300100 13481017 11731891
60971 11731891 10135126 8725914 7510547 6480421 5618895 4905441 4318976 3839445 3448098
60962 3448098 3128141 2865494 2648438 2466785 2312197 2179196 2064846 1966937 1882766 1809646
60952 1809646 1745949 1691185 1645276 1607923 1578382 1555548 1538236 1525357 1515680 1507593 1499523 1490783
$$ packed form
61017A567294L7577L9732M3046M8640N6879O6761P7231Q8583J02021J18553J39086
61006B385403J64946J97356K36884K84151L40408M06682M83659N73932O83471
60997E756892Q18601R81934J172676J387343J611013J802029J891059J809370
60989A7230917J531512J098635O05073J61973j38126k46304j73486O806J79815
60980B0256815K32790R8798k21403o64942j131506j517780j752672j819083j749126
60971A1731891j596765j409212j215367j030126q61526p13454n86465m79531l91347
60962C448098l19957k62647k17056j81653j54588j33001j14350r7909q4171p3120
60952A809646o3697n4764m5909l7353k9541k2834j7312j2879r677q087q070q740
$$ plain form
60940 1490783 1481810 1473514 1466603 1461498 1458383 1457047 1456947 1457735 1459495 1462228 1465340 1468041 1470054 1471509
60926 1471509 1472210 1471542 1469142 1465192 1459745 1452146 1441491 1427509 1410607 1391186 1369276 1344952 1318722
60913 1318722 1291234 1262733 1233110 1202577 1172101 1142967 1115910 1090718 1066684 1043341 1020791
60902 1020791 999541 980158 962848 947136 932056 916919 901882 887498 873782 860090 845977
60891 845977 831789 818246 805732 794188 783388 773059 762937 752950 743163 733457 723612 713840
60879 713840 704747 696408 687933 678509 668540 659182 651011 643723 636898 630256 623306 615588 607431 599756
60865 599756 592980 586730 580754 575366 570745 566542 562613 559481 557544 556336 555057 553373 551239 548409
60851 548409 544739 540682 536901 533612 530749 528476 526962 525837 524379 522146 519027 514958 510128 505266
$$ packed form
60940A490783q973q296o911n105l115j336j00P88J760K733L112K701K013J455
60926A471509P01o68k400l950n447p599j0655j3982j6902j9421k1910k4324k6230
60913A318722k7488k8501k9623l0533l0476k9134k7057k5192k4034k3343k2550
60902A020791k1250j9383j7310j5712j5080j5137j5037j4384j3716j3692j4113
60891H45977j4188j3543j2514j1544j0800j0329j0122r987r787r706r845r772
60879G13840r093q339q475r424r969r358q171p288o825o642o950p718q157p675
60865E99756o776o250n976n388m621m203l929l132j937j208j279j684k134k830
60851E48409l670m057l781l289k863k273j514j125j458k233l119m069m830m862
$$ plain form
60837 505266 501060 497336 493317 488694 483930 479504 475398 471502 468085 465642 464501 464635 465678 467072
60823 467072 468461 469953 471838 474142 476673 479373 482270 485204 487887 490177 491970 492931 492795 491901 491021
60808 491021 490604 490475 490281 489863 489122 487913 486221 484223 482132 480176 478635 477549 476410 474524 471729
60793 471729 468460 465101 461635 457974 454179 450263 446156 442010 438143 434495 430563 426078 421426 417137
60779 417137 413314 409842 406829 404418 402387 400396 398506 397038 395917 394575 392674 390618 389149 388641
60765 388641 388992 390052 391897 394618 398062 401926 406029 410329 414682 418714 422107 425009 428124 432225
60751 432225 437377 442605 446535 448579 449459 450423 452103 454360 456968 459858 462608 464226 463787 461035 456239
60736 456239 449859 442575 435179 427996 420686 413011 405481 398788 392903 387288 381847 377017 373005 369559
$$ packed form
60837E05266m206l724m019m623m764m426m106l896l417k443j141J34J043J394
60823D67072J389J492J885K304K531K700K897K934K683K290J793R61j36q94q80
60808D91021m17j29j94m18p41j209j692j998k091j956j541j086j139j886k795
60793D71729l269l359l466l661l795l916m107m146l867l648l932m485m652m289
60779D17137l823l472l013k411k031j991j890j468j121j342j901k056j469n08
60765C88641L51J060J845K721L444L864M103M300M353M032L393K902L115M101
60751D32225N152N228L930K044Q80R64J680K257K608K890K750J618m39k752m796
60736D56239o380p284p396p183p310p675p530o693n885n615n441m830m012l446
$$ plain form
60722 369559 366641 364662 363736 363160 362067 360397 358852 357958 357439 356590 355131 353531 352422 351879 351485 351061
60706 351061 350923 351260 351703 351861 351942 352377 353104 353769 354455 355597 357192 358722 359996 361498 363657 366218 368667
60689 368667 370940 373375 376193 379373 382947 387084 391802 396781 401617 406284 411222 416823 422902 428932
60675 428932 434788 440914 447578 454337 460498 465767 470156 473583 476025 477697 478540 477796 474770 469982 464902
60660 464902 460434 456213 451475 446131 440792 436172 432637 430062 427997 426199 424915 424371 424177 423779 423374
60645 423374 423683 424691 425272 424368 422062 419205 416428 413847 411269 408286 404433 399724 394988 391373 389451
60630 389451 388801 388424 387692 386979 387234 388744 390638 391943 392786 393998 395751 397343 398260 398690 398913 398949 399001
60613 399001 399490 400357 400962 400987 400871 401061 401421 401696 401899 401859 401036 399325 397560 396662 396695 397198 397982 399087 400350
$$ packed form
60722C69559k918j979r26n76j093j670j545q94n19q49j459j600j109n43l94m24
60706C51061j38L37M43J58Q1M35P27O65O86J142J595J530J274J502K159K561K449
60689C68667K273K435K818L180L574M137M718M979M836M667M938N601O079O030
60675D28932N856O126O664O759O161N269M389L427K442J672Q43p44l026m788n080
60660D64902m468m221m738n344n339m620l535k575k065j798j284n44j94l98m05
60645D23374L09J008N81r04k306k857k777k581k578k983l853m709m736l615j922
60630C89451o50l77p32p13K55J510J894J305Q43J212J753J592R17M30K23L6N2
60613C99001M89Q67O05K5j16J90L60K75K03m0q23j711j765q98L3N03P84J105J263
$$ plain form
60594 400350 401587 402873 404180 405099 405494 406032 407453 409553 411525 413063 414489 415902 416925 417312 417262 417015
60578 417015 416588 416046 415682 415810 416608 418152 420399 423197 426518 430654 436005 442849 451433 462023 474434
60563 474434 487719 500708 512859 524294 535055 544665 552348 557435 559564 558761 555384 549942 543080
60550 543080 535754 529099 523891 520294 518311 518165 519999 523549 528500 534942 543071 552639 563127 574347
60536 574347 586450 599371 612595 625482 637558 648563 658371 666765 673043 676018 674806 669667 661929
60523 661929 653208 644742 637111 630279 624043 618676 614825 612527 610737 608320 605206 602099 599371 596983
60509 596983 595354 595414 597525 600977 604972 609760 616424 625764 637721 651905 668517 688616 713442
60496 713442 743467 778199 816936 859494 906030 956311 1009269 1062977 1114867 1162214 1202717
$$ packed form
60594D00350J237J286J307R19L95N38J421K100J972J538J426J413J023L87n0k47
60578D17015m27n42l64J28P98J544K247K798L321M136N351O844Q584J0590J2411
60563D74434J3285J2989J2151J1435J0761R610P683N087K129q03l377n442o862
60550E43080p326o655n208l597j983j46J834L550M951O442Q129R568J0488J1220
60536E74347J2103J2921J3224J2887J2076J1005R808Q394O278K975j212n139p738
60523F61929q721q466p631o832o236n367l851k298j790k417l114l107k728k388
60509E96983j629O0K111L452L995M788O664R340J1957J4184J6612K0099K4826
60496G13442L0025L4732L8737M2558M6536N0281N2958N3708N1890M7347M0503
$$ plain form
60485 1202717 1234508 1255588 1263817 1257999 1238794 1208166 1168197 1120879 1068718 1014657 961195 909920
60473 909920 861812 817486 777122 740687 708330 680155 655585 633466 613007 594244 577522
60462 577522 562887 550102 538786 528342 518162 508222 499173 491572 485173 479197 473108 466988 461307
60449 461307 456457 452412 448765 445227 442070 439765 438216 436724 434866 433021 431784 431144 430593 429911 429461
60434 429461 429632 430210 430455 429813 428538 427506 427260 427365 426947 425814 424700 424274 424344 424350 424328 424866 426167 427703
60416 427703 429037 430539 432857 435849 438547 440236 441168 441999 442840 443278 443168 442988 443287 444061 444814 445165 445287
60399 445287 445747 446865 448266 449319 450058 451299 453596 456504 459379 462423 466133 469944 472541 473640 474508
60384 474508 476281 478687 480972 483262 486162 489624 492998 495851 497994 499199 499714 500686 503068 506248 508702
$$ packed form
60485A202717L1791K1080Q229n818j9205l0628l9969m7318n2161n4061n3462n1275
60473I09920m8108m4326m0364l6435l2357k8175k4570k2119k0459j8763j6722
60462E77522j4635j2785j1316j0444j0180r940r049p601o399n976o089o120n681
60449D61307m850m045l647l538l157k305j549j492j858j845j237o40n51o82m50
60434D29461J71N78K45o42j275j032k46J05m18j133j114m26P0Ok2N38J301J536
60416D27703J334J502K318K992K698J689R32Q31Q41M38j10j80K99P74P53L51J22
60399D45287M60J118J401J053P39J241K297K908K875L044L710L811K597J099Q68
60384D74508J773K406K285K290K900L462L374K853K143J205N15R72K382L180K454
$$ plain form
60369 508702 509936 510853 512168 513532 514497 515327 516246 516716 516241 515415 515363 516331 517497 518166 518608 519536 521259
60352 521259 523603 526362 529442 532644 535771 539117 543448 549139 555479 561294 566088 570027 572892 573868
60338 573868 572681 570211 567437 564326 560393 555872 551622 548099 545150 542589 540303 537884 534882 531396
60324 531396 527808 524003 519543 514665 510428 507625 506026 504874 503652 502308 501213 501068 502454 505274
60310 505274 508906 512923 517368 522475 528606 536449 546677 559316 573897 590199 608187 626995 644671
60297 644671 659305 670095 677037 680003 678491 672175 661480 647740 632747 617877 603639 590307
60285 590307 578762 570228 565175 562951 562403 562299 561316 558521 554183 549506 545227 540989 536260 531185 526113
60270 526113 520927 515438 510072 505642 502563 500599 499155 497538 495267 492457 489694 487377 485458 483972
$$ packed form
60369E08702J234R17J315J364R65Q30R19M70m75q26n2R68J166O69M42R28J723
60352E21259K344K759L080L202L127L346M331N691O340N815M794L939K865R76
60338E73868j187k470k774l111l933m521m250l523k949k561k286k419l002l486
60324E31396l588l805m460m878m237k803j599j152j222j344j095j45J386K820
60310E05274L632M017M445N107O131P843J0228J2639J4581J6302J7988J8808J7676
60297F44671J4634J0790O942K966j512o316j0695j3740j4993j4870j4238j3332
60285E90307j1545q534n053k224n48j04r83k795m338m677m279m238m729n075n072
60270E26113n186n489n366m430l079j964j444j617k271k810k763k317j919j486
$$ plain form
60256 483972 483327 483706 484552 485108 485219 485300 485743 486727 488329 490450 492684 494610 496137 497378 498329 498887 499065
60239 499065 499011 498885 498782 498592 497906 496382 494346 492732 492210 492623 493449 494554 496272 498978 502801 507549
60223 507549 512739 517847 522632 527085 531074 534405 537362 540834 545718 552357 560573 569901 579742 589737
60209 589737 600165 611528 623572 635145 645359 654504 663492 672677 681599 689615 696435 702179 707267
60196 707267 712187 717169 722010 726158 728932 729866 729208 727883 726544 724731 721449 716439 710252 703238 695365
60181 695365 687088 679357 672367 665237 657450 649773 643101 637162 631151 625033 619356 614313 609876 606387
60167 606387 604036 602053 599445 596504 594624 594518 595380 596009 596068 595991 596210 596769 597453 598058 598694 599770 601517
60150 601517 603662 605817 607922 609993 611752 612982 614040 615497 617416 619480 621699 624421 627782 631768
$$ packed form
60256D83972o45L79Q46N56J11Q1M43R84J602K121K234J926J527J241R51N58J78
60239D99065n4j26j03j90o86j524k036j614n22M13Q26J105J718K706L823M748
60223E07549N190N108M785M453L989L331K957L472M884O639Q216R328R841R995
60209E89737J0428J1363J2044J1573J0214R145Q988R185Q922Q016O820N744N088
60196G07267M920M982M841M148K774R34o58j325j339j813l282n010o187p014p873
60181F95365q277p731o990p130p787p677o672n939o011o118n677n043m437l489
60167F06387k351j983k608k941j880j06Q62O29N9p7K19N59O84O05O36J076J747
60150F01517K145K155K105K071J759J230J058J457J919K064K219K722L361L986
$$ plain form
60136 631768 636772 643421 651705 660761 669658 677973 685603 692510 698766 704411 709165 712706 715329 717853
60122 717853 720685 723373 725313 726561 727757 729512 732069 735333 738976 742597 745883 748544 750208 750612
60108 750612 749874 748349 746207 743388 739874 735636 730299 723295 714584 705007 695770 687716 681102 675776
60094 675776 671355 667379 663518 659718 656194 653299 651278 649984 648900 647651 646493 646143 647122 649315 652035
60079 652035 654355 655540 655414 654288 652439 649804 646302 642201 637829 633098 627634 621265 614085 606217
60065 606217 597961 590110 583616 578769 575002 571578 568221 565002 561912 558787 555502 552170 549227 547251
60051 547251 546545 546859 547717 548977 550949 553985 558185 563470 569701 576658 584027 591500 598883 606171 613543
60036 613543 621079 628357 634484 638752 641101 641779 640798 638063 633852 628748 623041 616503 608834 600168 591106
$$ packed form
60136F31768N004O649Q284R056Q897Q315P630O907O256N645M754L541K623K524
60122G17853K832K688J940J248J196J755K557L264L643L621L286K661J664M04
60108G50612p38j525k142k819l514m238n337p004q711r577r237q054o614n326
60094F75776m421l976l861l800l524k895k021j294j084j249j158l50R79K193K720
60079F52035K320J185j26j126j849k635l502m101m372m731n464o369p180p868
60065F06217q256p851o494m847l767l424l357l219l090l125l285l332k943j976
60051E47251p06L14Q58J260J972L036M200N285O231O957P369P473P383P288P372
60036F13543P536P278O127M268K349O78r81k735m211n104n707o538p669q666r062
$$ plain form
60021 591106 582352 574282 566728 559306 552014 545355 539724 534896 530314 525650 520797 515560 509735 503460
60007 503460 497147 491145 485657 480912 477141 474404 472651 471836 471828 472384 473375 474777 476334 477563 478376 479350
59991 479350 481097 483777 487600 493114 500224 507348 512605 515885 518890 522960 527519 530886 531943 530714
59977 530714 527853 524067 519800 515188 510299 505368 500608 495940 491299 487091 483827 481368 479076 476800
59963 476800 475159 474642 474897 475213 475355 475703 476814 478951 481831 484729 487099 489071 491079 493075 494564
59948 494564 495381 495948 496713 497785 499156 500734 502036 502470 502157 501944 502271 502533 501934 500528 499001 497774
59932 497774 496809 496111 495955 496609 498097 500210 502677 505470 508982 513710 519666 526340 533286 540459 547937
59917 547937 555670 563664 571983 580365 588103 594521 599342 602584 604514 605759 606839 607302 605933 602291
$$ packed form
60021E91106q754q070p554p422p292o659n631m828m582m664m853n237n825o275
60007E03460o313o002n488m745l771k737j753q15qN56R91J402J557J229Q13R74
59991D79350J747K680L823N514P110P124N257L280L005M070M559L367J057j229
59977E30714k861l786m267m612m889m931m760m668m641m208l264k459k292k276
59963D76800j641n17K55L16J42L48J111K137K880K898K370J972K008J996J489
59948D94564Q17N67P65J072J371J578J302M34l13k13L27K62n99j406j527j227
59932D97774r65o98j56O54J488K113K467K793L512M728N956O674O946P173P478
59917E47937P733P994Q319Q382P738O418M821L242J930J245J080M63j369l642
$$ plain form
59903 602291 597557 593307 589874 586569 583217 580613 579402 579231 579241 578997 578683 578761 579657 581554 584219 587184
59887 587184 590299 594016 598929 604990 611337 617074 622217 627661 634046 640825 646742 651223 654950 658927
59873 658927 663287 667252 670031 671423 671635 670816 668818 665307 660143 653733 646985 640737 635192 629920 624421
59858 624421 618669 613137 608303 604135 600175 596235 592884 591005 590970 592492 595218 599108 604140 610087 616806
59843 616806 624425 632861 641266 648300 652994 655245 655593 654845 653882 653543 654422 656705 660170 664227 667977
59828 667977 670450 671046 669891 667626 664739 661134 656492 650957 645257 640089 635590 631459 627376 623282
59814 623282 619493 616633 615056 614143 612584 609684 606081 602813 600038 597190 594003 590659 587090 583023
59800 583023 578803 575406 573258 571584 569323 566288 563107 560395 558359 556892 555602 553917 551566 548994
$$ packed form
59903F02291m734m250l433l305l352k604j211j71J0k44l14P8Q96J897K665K965
59887E87184L115L717M913O061O347N737N143N444O385O779N917M481L727L977
59873F58927M360L965K779J392K12q19j998l511n164o410o748o248n545n272n499
59858F24421n752n532m834m168l960l940l351j879l5J522K726L890N032N947O719
59843F16806P619Q436Q405P034M694K251L48p48r63l39Q79K283L465M057L750
59828F67977K473N96j155k265k887l605m642n535n700n168m499m131m083m094
59814F23282l789k860j577r13j559k900l603l268k775k848l187l344l569m067
59800E83023m220l397k148j674k261l035l181k712k036j467j290j685k351k572
$$ plain form
59786 548994 546974 545764 544790 543281 541153 539183 538246 538458 539190 539822 540166 540120 539442 538234 537253 537238 538175
59769 538175 539714 542002 545394 549517 553402 556619 559632 562894 566278 569505 572548 575329 577625 579522
59755 579522 581525 584028 587153 591160 596348 602339 608156 613308 618132 622748 626527 629163 631526 634657
59741 634657 638428 642005 645207 648542 652124 655378 657815 659397 660182 660238 660013 660191 661002 662009 662661 662787
59725 662787 662626 662739 663773 665861 668266 670029 671016 671927 673291 674891 676199 676888 676765 675676 673795 671735
59709 671735 670021 668611 667198 665840 664985 664858 665037 664827 664005 663123 663036 664128 666045 668161 670295 672954
59693 672954 676842 682009 687433 691584 693630 694047 693881 693518 692457 690273 687362 684494 681933 679362 676518
59678 676518 673570 670741 667783 664041 659075 653103 646705 640183 633411 626343 619351 612892 607151 602277
$$ packed form
59786E48994k020j210r74j509k128j970r37K12P32O32L44m6o78j208r81j5R37
59769E38175J539K288L392M123L885L217L013L262L384L227L043K781K296J897
59755E79522K003K503L125M007N188N991N817N152M824M616L779K636K363L131
59741F34657L771L577L202L335L582L254K437J582P85N6k25J78Q11J007O52J26
59725F62787j61J13J034K088K405J763R87R11J364J600J308O89j23j089j881k060
59709F71735j714j410j413j358q55j27J79k10q22q82q7J092J917K116K134K659
59693F72954L888N167N424M151K046M17j66l63j061k184k911k868k561k571k844
59678F76518k948k829k958l742m966n972o398o522o772p068o992o459n741m874
$$ plain form
59664 602277 598645 596394 594909 593297 591387 589857 589400 590222 592292 595487 599323 603004 606068 608776 611806
59649 611806 615643 620137 624355 627092 627985 627892 627609 626477 623091 617341 610755 604680 599051 593267 587353
59634 587353 581783 576955 573387 571650 571456 571456 570631 569307 568125 566671 564044 560299 556334 552569 548673
59619 548673 544589 540985 538441 536712 534950 532443 529176 525955 523822 523066 523035 523187 523906 525853 528910
59604 528910 532361 535799 539173 542166 544267 545500 546478 547650 548896 549839 550172 549718 548616 547413 546643
59589 546643 546366 546403 546756 547430 548020 547986 547190 545796 543865 541493 539117 537115 535279 533251 531260 529763
59573 529763 528506 526756 524548 522888 522479 522810 522889 522387 521760 521541 521829 522341 522778 523189 523890 524885 525603 525548
59555 525548 525035 524788 524909 524851 524448 524419 525588 527996 530993 533893 536407 538727 541425 545140 550236 556842
$$ packed form
59664F02277l632k251j485j612j910j530m57Q22K070L195L836L681L064K708L030
59649F11806L837M494M218K737Q93r3k83j132l386n750o586o075n629n784n914
59634E87353n570m828l568j737j94%q25j324j182j454k627l745l965l765l896
59619E48673m084l604k544j729j762k507l267l221k133p56l1J52P19J947L057
59604E28910L451L438L374K993K101J233R78J172J246R43L33m54j102j203p70
59589E46643k77L7L53O74N90l4p96j394j931k372k376k002j836k028j991j497
59573E29763j257j750k208j660m09L31P9n02o27k19K88N12M37M11P01R95P18n5
59555E25548n13k47J21n8m03k9J169K408K997K900K514K320K698L715N096O606
$$ plain form
59539 556842 565129 575342 587638 602169 619152 638294 657954 675287 687599 693691 694120 690561
59527 690561 684974 679050 674053 670955 670419 672393 675895 679593 682697 685067 686522 686375 683811 678578 671197
59512 671197 662535 653136 642934 631663 619564 607485 596205 585894 576389 567743 560266 554193 549480
59499 549480 545731 542263 538591 535062 532590 531500 531035 530403 529814 529973 530952 532256 533773 535893 538709
59484 538709 541741 544659 547787 551679 556434 561622 566785 572059 578244 585950 594554 602515 609039 614924
59470 614924 621276 627851 633365 637069 639260 640457 640940 641132 641706 643082 645273 648251 652045 656558 661811
59455 661811 668297 676539 686295 696729 707335 718155 729069 739462 748733 756729 763562 769262 773514
59442 773514 775396 773609 767496 757761 745838 732824 719526 707035 696301 687174 678769 670817 663892
$$ packed form
59539E56842Q287J0213J2296J4531J6983J9142J9660J7333J2312O092M29l559
59527F90561n587n924m997l098n36J974L502L698L104K370J455j47k564n233p381
59512F71197q662r399j0202j1271j2099j2079j1280j0311r505q646p477o073m713
59499E49480l749l468l672l529k472j090m65o32n89J59R79J304J517K120K816
59484E38709L032K918L128L892M755N188N163N274O185P706Q604P961O524N885
59470F14924O352O575N514L704K191J197M83J92N74J376K191K978L794M513N253
59455F61811O486Q242R756J0434J0606J0820J0914J0393R271P996O833N700M252
59442G73514J882j787o113r735j1923j3014j3298j2491j0734r127q405p952o925
$$ plain form
59429 663892 658287 653595 649655 647140 646808 648763 652760 658749 666882 677388 690579 706511 724609
59416 724609 744101 764815 786972 810248 833868 857677 882123 906706 929007 945615 953519 950777
59404 950777 937149 915008 888967 863734 842383 826775 818555 818552 825306 834990 842913 844970 838382
59391 838382 822415 798909 771585 744069 718325 694837 673945 656495 643065 633028 625070 618704
59379 618704 614677 613593 614734 616835 619505 623115 627608 632338 637016 641836 646633 650818 654495 658822
59365 658822 664837 672429 680820 689548 698626 708186 718334 729127 740461 752283 764895 778690 793500
59352 793500 808710 824099 840098 857162 875359 894636 914855 935432 955425 974210 991606
59341 991606 1007308 1020692 1031260 1038693 1042469 1042071 1037698 1030102 1019656 1006265 990262 972527 953514
$$ packed form
59429F63892n605m692l940k515l32J955L997N989Q133J0506J3191J5932J8098
59416G24609J9492K0714K2157K3276K3620K3809K4446K4583K2301J6608P904k742
59404I50777j3628k2141k6041k5233k1351j5608q220lO754R684P923K057o588
59391H38382j5967k3506k7324k7516k5744k3488k0892j7450j3430j0037p958o366
59379F18704m027j084J141K101K670L610M493M730M678M820M797M185L677M327
59365F58822O015P592Q391Q728R078R560J0148J0793J1334J1822J2612J3795J4810
59352G93500J5210J5389J5999J7064J8197J9277K0219K0577J9993J8785J7396
59341I91606J5702J3384J0568P433L776l98m373p596j0446j3391j6003j7735j9013
$$ plain form
59328 953514 932986 911042 888606 866592 845382 825438 807583 792142 778596 766585 756499
59317 756499 748564 742157 736651 732199 728984 726319 723363 720223 717613 715782 714495 713724 713679 714423 716038
59302 716038 718905 723279 728804 734967 741810 749833 759443 770706 783106 795087 804230 808375 806422
59289 806422 798160 784237 766757 748821 732549 718002 704668 693255 685056 680153 677472 676386
59277 676386 677239 680427 685962 693930 704409 716839 730291 744506 759912 776379 792701 807670
59265 807670 821044 833024 843184 850463 854101 854171 851040 844597 834387 820707 805254 790161 776327
59252 776327 763130 749864 736919 725251 715250 706604 699024 692624 687755 684718 683544 683900 685447
59239 685447 688299 692754 698532 704866 711469 718744 726704 734374 740718 745545 748999 750776 750482 748301
$$ packed form
59328I53514k0528k1944k2436k2014k1210j9944j7855j5441j3546j2011j0086
59317G56499p935o407n506m452l215k665k956l140k610j831j287p71m5P44J615
59302G16038K867M374N525O163O843Q023R610J1263J2400J1981R143M145j953
59289H06422q262j3923j7480j7936j6272j4547j3334j1413q199m903k681j086
59277F76386Q53L188N535P968J0479J2430J3452J4215J5406J6467J6322J4969
59265H07670J3374J1980J0160P279L638P0l131o443j0210j3680j5453j5093j3834
59252G76327j3197j3266j2945j1668j0001q646p580o400m869l037j174L56J547
59239F85447K852M455N778O334O603P275P960P670O344M827L454J777k94k181
$$ plain form
59225 748301 744696 739779 733581 726569 719304 711924 704515 697624 691804 686860 682097 677132 672068 667216
59211 667216 663034 659962 657872 656061 654236 653006 652914 653559 654252 655013 656207 657747 659432 661545 664217
59196 664217 666635 667859 668117 668315 668523 668078 667088 666620 667166 667912 667951 667458 667210 667478 667833 667803 667463 667519 668821
59177 668821 671604 675302 679315 683717 688873 694678 700696 706887 713652 721293 729875 739526 750386 762315
59163 762315 774942 787827 800265 811257 820122 826861 831462 833266 831593 826689 819472 810663 800796
59150 800796 790667 780919 771333 761321 751006 741064 731620 722129 712338 702590 693049 683395 673498
59137 673498 663812 654857 646754 639434 632925 627299 622609 618866 615843 613016 610095 607502 605984 605887 607110
59122 607110 609477 612753 616543 620685 625594 631819 639434 648184 657843 668077 678427 688921 700137
$$ packed form
59225G48301l605m917o198p012p265p380p409o891n820m944m763m965n064m852
59211F67216m182l072k090j811j825j230r2O45O93P61J194J540J685K113K672
59196F64217K418J224K58J98K08m45r90m68N46P46L9m93k48K68L55l0l40N6J302
59177F68821K783L698M013M402N156N805O018O191O765P641Q582R651J0860J1929
59163G62315J2627J2885J2438J0992Q865O739M601J804j673m904p217q809r867
59150H00796j0129r748r586j0012j0315r942r444r491r791r748r541r654r897
59137F73498r686q955q103p320o509n626m690l743l023k827k921k593j518r7J223
59122F07110K367L276L790M142M909O225P615Q750R659J0234J0350J0494J1216
$$ plain form
59109 700137 712018 723137 731940 738259 742866 746086 747866 748750 749599 750418 750517 749733 748503 746845 744370
59094 744370 741319 738489 735918 732659 728224 723397 719305 716360 714351 712903 711561 709910 707821 705153
59080 705153 701407 696277 690422 684906 679906 674728 668960 662786 656219 649138 642231 636861 633550 631329
59066 631329 628961 626111 623037 619833 616360 612423 607829 602747 598095 594904 593140 591732 589855 587606
59052 587606 585428 583613 582487 582288 582669 582930 582888 582902 582977 582593 581507 580055 578549 577079 575901 575207 574524
59035 574524 573240 571817 571406 572074 572512 571880 570947 570957 572322 575001 579211 585014 591872 599370 607895 617996
59019 617996 629482 641498 653039 663049 670712 676095 680019 682887 684202 683578 681615 679303 677156
59006 677156 675413 674478 674563 675314 676337 677753 679904 682914 686938 692318 699017 706278 713335 720171 727219
$$ packed form
59109G00137J1881J1119Q803O319M607L220J780Q84Q49Q19R9p84j230j658k475
59094G44370l051k830k571l259m435m827m092k945k009j448j342j651k089k668
59080G05153l746n130n855n516n000n178n768o174o567p081o907n370l311k221
59066F31329k368k850l074l204l473l937m594n082m652l191j764j408j877k249
59052E87606k178j815j126j99L81K61m2J4P5l84j086j452j506j470j178o94o83
59035E74524j284j423m11O68M38o32r33J0J365K679M210N803O858P498Q525J0101
59019F17996J1486J2016J1541J0010P663N383L924K868J315o24j963k312k147
59006F77156j743r35Q5P51J023J416K151L010M024N380O699P261P057O836P048
$$ plain form
58991 727219 734583 741924 748800 754752 759320 762315 763914 764337 763670 762117 760159 758351 757151 756904 757695
58976 757695 759326 761882 766134 772847 781806 792207 803888 817409 832936 849866 867606 885867
58964 885867 904084 921447 937783 953582 968875 982920 995186 1005665 1013817 1018127 1017452 1012087
58952 1012087 1002996 990607 974964 956564 936395 915403 894239 873205 852302 831747 812486
58941 812486 795583 781043 768012 756258 746597 739528 734328 729943 726026 722689 719913 717642 715872
58928 715872 714288 712468 710686 709763 709868 710234 710288 710157 709798 708727 707135 706204 706649 707850 709050 710426
58912 710426 712243 713956 715121 716428 718841 722314 726330 731116 737336 744935 753282 762287 772640 785054
58898 785054 799764 816510 834557 853010 871502 890235 909146 927711 945982 965126 986375
$$ packed form
58991G27219P364P341O876N952M568K995J599M23o67j553j958j808j200k47P91
58976G57695J631K556M252O713Q959J0401J1681J3521J5527J6930J7740J8261
58964H85867J8217J7363J6336J5799J5293J4045J2266J0479Q152M310o75n365
58952A012087r091j2389j5643j8400k0169k0992k1164k1034k0903k0555j9261
58941H12486j6903j4540j3031j1754r661p069n200m385l917l337k776k271j770
58928G15872j584j820j782r23J05L66N4j31l59j071j592r31M45J201J200J376
58912G10426J817J713J165J307K413L473M016M786O220P599Q347R005J0353J2414
58898G85054J4710J6746J8047J8453J8492J8733J8911J8565J8271J9144K1249
$$ plain form
58887 986375 1009958 1035455 1062441 1090149 1117203 1142392 1165205 1185072 1200730 1211040 1215953 1216058
58875 1216058 1211699 1203126 1190914 1175618 1157539 1137375 1116504 1096031 1076125 1056907 1039236 1023851
58863 1023851 1010376 997959 986360 975629 965228 954307 942512 929909 916537 902610 888629
58852 888629 874735 860542 846185 832793 821126 810427 799446 788029 776916 766561 757009 748337
58840 748337 740338 732192 723324 714142 705210 696294 687061 678039 669947 662651 655822 650056 646171 643780
58826 643780 641745 639829 638829 639259 640985 644046 648761 654871 661432 667754 673900 680318 687390 695167
58812 695167 703033 709881 715111 719153 722637 725553 727704 729291 730339 730195 728412 725591 722499 718880
58798 718880 714058 708231 702175 696069 689540 682578 675519 668435 661404 655030 649826 645378 640966 636731
$$ packed form
58887I86375K3583K5497K6986K7708K7054K5189K2813J9867J5658J0310M913J05
58875A216058m359q573j2212j5296j8079k0164k0871k0473j9906j9218j7671j5385
58863A023851j3475j2417j1599j0731j0401j0921j1795j2603j3372j3927j3981
58852H88629j3894j4193j4357j3392j1667j0699j0981j1417j1113j0355r552q672
58840G48337p999q146q868r182q932q916r233r022q092p296o829n766l885k391
58826F43780k035j916j000M30J726L061M715O110O561O322O146O418P072P777
58812F95167P866O848N230M042L484K916K151J587J048j44j783k821l092l619
58798G18880m822n827o056o106o529o962p059p084p031o374n204m448m412m235
$$ plain form
58784 636731 633469 631686 631629 633679 637682 642312 646173 649323 652770 656766 660495 663134 664262 663510 660722
58769 660722 656331 650748 643742 635219 626130 617656 609931 602544 595804 590337 585858 581648 578003 575935
58755 575935 575569 576070 577098 579107 582105 585252 587839 589848 591505 593209 595782 599887 605113 610479 615758
58740 615758 621581 628396 636183 644912 654356 663647 672018 679835 687973 696314 703838 710076 715529 720753
58726 720753 725985 731572 737845 744599 751420 758295 765218 771719 777725 784327 792481 801417 809677 817376
58712 817376 825916 835569 844849 852309 857565 860388 860223 856994 851255 843197 832497 819379 804706 788760
58698 788760 770933 750965 729636 707951 686441 665536 645926 628302 613165 600755 590618
58687 590618 581546 572752 564759 558362 553129 547925 542486 537286 532194 526633 520902 516046 512454 509792
$$ packed form
58784F36731l262j783n7K050M003M630L861L150L447L996L729K639J128p52k788
58769F60722m391n583p006q523r089q474p725p387o740n467m479m210l645k068
58755E75935l66N01J028K009K998L147K587K009J657J704K573M105N226N366N279
58740F15758N823O815P787Q729R444R291Q371P817Q138Q341P524O238N453N224
58726G20753N232N587O273O754O821O875O923O501O006O602Q154Q936Q260P699
58712H17376Q540R653R280P460N256K823j65l229n739q058j0700j3118j4673j5946
58698G88760j7827j9968k1329k1685k1510k0905j9610j7624j5137j2410j0137
58687E90618r072q794p993o397n233n204n439n200n092n561n731m856l592k662
$$ plain form
58673 509792 508205 508245 509600 511267 513151 516278 521216 527418 534376 542384 551964 563230 575775 588351
58659 588351 598921 606067 610115 611956 611329 607607 601742 595706 590066 583741 576161 568125 560402 553027
58645 553027 546163 540281 535275 530736 527130 525371 525222 525577 526297 528195 531235 534441 537647 541542 545812
58630 545812 549140 551338 553577 556033 557229 556414 554756 553411 552216 551207 551652 554312 558032 561324 564278
58615 564278 567936 572800 578859 586123 594146 601802 608383 614259 619922 625097 629256 632206 633772 633742 632487
58600 632487 630808 628906 626291 622823 618951 614940 610857 607263 604773 603072 601624 601140 602839 606468
58586 606468 610783 615948 623483 633708 645247 657382 670836 685644 700253 713520 725769 737210
58574 737210 747112 755365 763116 771106 779069 787480 797992 811333 826636 843725 864182 889069 917460
$$ packed form
58673E09792j587M0J355J667J884L127M938O202O958Q008R580J1266J2545J2576
58659E88351J0570P146M048J841o27l722n865o036n640o325p580q036p723p375
58645E53027o864n882n006m539l606j759j49L55P20J898L040L206L206L895M270
58630E45812L328K198K239K456J196q15j658j345j195j009M45K660L720L292K954
58615E64278L658M864O059P264Q023P656O581N876N663N175M159K950J566l0j255
58600F32487j679j902k615l468l872m011m083l594k490j701j448m84J699L629
58586F06468M315N165P535J0225J1539J2135J3454J4808J4609J3267J2249J1441
58574G37210R902Q253P751P990P963Q411J0512J3341J5303J7089K0457K4887K8391
$$ plain form
58561 917460 948318 981865 1017756 1053602 1086770 1116243 1141505 1161162 1174067 1180467 1180868 1175267
58549 1175267 1164776 1152443 1140919 1130463 1120423 1111260 1103644 1096733 1088827 1078806 1065879 1048996
58537 1048996 1027689 1002626 974629 944379 913640 884988 859326 835337 812473 792611 777446
58526 777446 766102 756940 750001 745882 743666 741865 740243 739068 737755 735943 734692 734911 735566 735038 733237
58511 733237 730907 728024 724469 721142 718693 716109 712260 707915 704616 702360 699987 697090 694096 691241
58497 691241 688803 687509 687349 686889 685076 682901 681978 682446 683557 685329 688229 692180 697200 704144 713599
58482 713599 725013 738061 753677 772481 793335 814765 836607 858934 880559 899858 915910
58471 915910 927608 933139 931773 924949 914365 900531 884430 868701 855342 843858 833445 825346
$$ packed form
58561I17460L0858L3547L5891L5846L3168K9473K5262J9657J2905O400M01n601
58549A175267j0491j2333j1524j0456j0040r163p616o911p906j0021j2927j6883
58537A048996k1307k5063k7997l0250l0739k8652k5662k3989k2864j9862j5165
58526G77446j1344r162o939m119k216j801j622j175j313j812j251K19O55n28j801
58511G33237k330k883l555l327k449k584l849m345l299k256k373k897k994k855
58497F91241k438j294j60m60j813k175r23M68J111J772K900L951N020O944R455
58482G13599J1414J3048J5616J8804K0854K1430K1842K2327K1625J9299J6052
58471I15910J1698N531j366o824j0584j3834j6101j5729j3359j1484j0413q099
$$ plain form
58459 825346 821112 820149 821139 824493 831293 841105 852911 866868 882944 899004 912447 922615 929647
58446 929647 932253 928928 920263 907983 892838 875500 858172 842912 829481 817056 806809 800364
58434 800364 796882 794290 792372 792179 793370 794820 797102 801779 808877 817349 827290 839314 852523 865377
58420 865377 877716 889569 898978 903606 903762 901344 896705 889090 879232 868648 857060 843362 828636
58407 828636 815459 804626 795035 786285 778738 771630 763855 756267 750667 746962 743836 741537 741229 742203
58393 742203 742620 742655 744016 746652 748815 750236 752397 755652 758702 761016 763295 765543 767001 767933 769417
58378 769417 771625 774318 778328 784333 790954 796531 801935 809062 817519 825634 833920 844366 856931 869798
58364 869798 882581 896288 910604 924339 938161 953783 970739 986821 1001270 1014605 1025985
$$ packed form
58459H25346m234r63R90L354O800R812J1806J3957J6076J6060J3443J0168P032
58446I29647K606l325q665j2280j5145j7338j7328j5260j3431j2425j0247o445
58434H00364l482k592j918j93J191J450K282M677P098Q472R941J2024J3209J2854
58420H65377J2339J1853R409M628J56k418m639p615r858j0584j1588j3698j4726
58407H28636j3177j0833r591q750p547p108p775p588n600l705l126k299l08R74
58393G42203M17L5J361K636K163J421K161L255L050K314K279K248J458R32J484
58378G69417K208K693M010O005O621N577N404P127Q457Q115Q286J0446J2565J2867
58364H69798J2783J3707J4316J3735J3822J5622J6956J6082J4449J3335J1380
$$ plain form
58353 1025985 1033884 1038863 1042519 1044376 1043035 1039695 1036975 1034908 1031765 1028354 1027627 1030271 1034425 1039569
58339 1039569 1046931 1056170 1065482 1075004 1086509 1099818 1113251 1127380 1144354 1163528 1181744 1198035
58327 1198035 1214018 1229484 1241721 1249587 1254422 1256582 1254973 1250356 1245293 1240519 1235058 1229889 1227479
58314 1227479 1227647 1228022 1228676 1232071 1238375 1245244 1252441 1262107 1274258 1286681 1299692 1316225 1336545
58301 1336545 1357440 1377254 1397124 1416796 1434073 1449204 1465095 1482439 1499213 1515487 1533814
58290 1533814 1554286 1574196 1593248 1614054 1636898 1659133 1680389 1703066 1727215 1750493 1773666
58279 1773666 1800247 1829937 1858599 1885595 1914874 1947809 1981496 2015337 2052470 2093040 2132996
58268 2132996 2171554 2213053 2259197 2306234 2352149 2399867 2450858 2502374 2553740 2608703 2668669
$$ packed form
58353A025985P899M979L656J857j341l340k720k067l143l411p27K644M154N144
58339A039569P362R239R312R522J1505J3309J3433J4129J6974J9174J8216J6291
58327A198035J5983J5466J2237P866M835K160j609m617n063m774n461n169k410
58314A227479J68L75O54L395O304O869P197R666J2151J2423J3011J6533K0320
58301A336545K0895J9814J9870J9672J7277J5131J5891J7344J6774J6274J8327
58290A533814K0472J9910J9052K0806K2844K2235K1256K2677K4149K3278K3173
58279A773666K6581K9690K8662K6996K9279L2935L3687L3841L7133M0570L9956
58268B132996L8558M1499M6144M7037M5915M7718N0991N1516N1366N4963N9966
$$ plain form
58257 2668669 2729903 2790004 2850720 2912105 2970780 3026541 3083828 3144265 3204799 3265413 3331086
58246 3331086 3403691 3479769 3558823 3645532 3741045 3840618 3942900 4052818 4172313 4297344
58236 4297344 4427230 4567354 4719145 4877392 5041215 5217368 5408730 5610455 5821864
58227 5821864 6050704 6300706 6566730 6847608 7151765 7484403 7841677 8223718 8640499
58218 8640499 9098361 9594256 10130169 10719185 11370354 12082979 12863794 13733890 14710737
58209 14710737 15801151 17021847 18409288 20000782 21828359 23945608 26441901 29419284
58201 29419284 32977531 37231708 42315104 48351105 55457209 63799145 73611449 85156457
58193 85156457 98726279 114728757 133716389 156269669 182876539 213894623 249341766
$$ packed form
58257B668669O1234O0101O0716O1385N8675N5761N7287O0437O0534O0614O5673
58246C331086P2605P6078P9054Q6709R5513R9573J02282J09918J19495J25031
58236D297344J29886J40124J51791J58247J63823J76153J91362K01725K11409
58227E821864K28840K50002K66024K80878L04157L32638L57274L82041M16781
58218H640499M57862M95895N35913N89016O51169P12625P80815Q70096R76847
58209A4710737J090414J220696J387441J591494J827577K117249K496293K977383
58201B9419284L558247M254177N083396O036001P106104Q341936R812304J1545008
58193H5156457J3569822J6002478J8987632K2553280K6606870L1018084L5447143
$$ plain form
58186 249341766 288273572 328095392 364561906 392768958 408623888 410029634 397392210
58179 397392210 373399020 342114539 307670788 273175836 240379282 210027366 182381903
58172 182381903 157527957 135483440 116231535 99695831 85683575 73890385 63986504
58165 63986504 55684677 48732061 42889849 37953116 33767646 30206899 27151337 24503699
58157 24503699 22201751 20197771 18440035 16885356 15510865 14298303 13219910 12250664
58149 12250664 11379910 10599279 9891853 9243615 8653250 8120343 7635036 7188469 6781981
58140 6781981 6416549 6083519 5774771 5491952 5236704 5001164 4776841 4564176 4365073
58131 4365073 4174598 3988474 3810956 3647023 3493780 3346962 3208863 3082382 2963944
$$ packed form
58186B49341766L8931806L9821820L6466514K8207052J5854930J405746j2637424
58179C97392210k3993190l1284481l4443751l4494952l2796554l0351916k7645463
58172A82381903k4853946k2044517j9251905j6535704j4012256j1793190r903881
58165F3986504q301827o952616n842212m936733m185470l560747l055562k647638
58157B4503699k301948k003980j757736j554679j374491j212562j078393r69246
58149A2250664q70754p80631p07426o48238n90365n32907m85307m46567m06488
58140F781981l65432l33030l08748k82819k55248k35540k24323k12665j99103
58131D365073j90475j86124j77518j63933j53243j46818j38099j26481j18438
$$ plain form
58122 2963944 2849626 2742125 2644696 2554096 2466185 2382758 2306430 2234417 2163754 2097298 2038207
58111 2038207 1983487 1929013 1876151 1827593 1781321 1734412 1688399 1645387 1603193 1559548 1516812
58100 1516812 1477489 1439347 1400024 1362146 1328768 1297831 1266160 1235003 1206761 1180160 1153591
58089 1153591 1129388 1109835 1092443 1074014 1055898 1040581 1026529 1011091 995140 980211 964348
58078 964348 945473 925752 907997 890752 871442 851425 833323 816193 797932 779979 765171
58067 765171 753438 743770 737859 737420 740161 742572 744481 747038 748729 747530 744637 741952 738143 731188
58053 731188 722526 714551 706181 695136 682560 671248 661165 650768 640885 633148 626309 618241 609951
58040 609951 603617 598183 590902 581866 573137 564781 555643 546674 539526 532987 524730 515538 507947 501617
$$ packed form
58122B963944j14318j07501r7429r0600q7911q3427p6328p2013p0663o6456n9091
58111B038207n4720n4474n2862m8558m6272m6909m6013m3012m2194m3645m2736
58100A516812l9323l8142l9323l7878l3378l0937l1671l1157k8242k6601k6569
58089A153591k4203j9553j7392j8429j8116j5317j4052j5438j5951j4929j5863
58078I64348j8875j9721j7755j7245j9310k0017j8102j7130j8261j7953j4808
58067G65171j1733r668n911m39K741K411J909K557J691j199k893k685l809o955
58053G31188q662p975q370j1045j2576j1312j0083j0397r883p737o839q068q290
58040F09951o334n434p281r036q729q356r138q969p148o539q257r192p591o330
$$ plain form
58026 501617 493855 484051 474001 464474 454958 446226 439705 434692 429257 423489 418970 415722 412543 409656
58012 409656 408116 407311 405832 404052 403091 402168 399854 396999 395430 394597 392569 389619 387756 387354 387265 387633
57996 387633 389470 391877 392769 392194 392133 393184 394079 394234 394174 393681 392060 389997 388771 387873 385701 382248 378813
57979 378813 375587 371870 368188 365751 364183 362125 359635 357693 355896 353109 349921 348047 347625 347476 347534
57964 347534 348564 349933 350207 349780 350467 352628 354941 356810 358735 360502 361188 360821 360044 358524 355720 352723
57948 352723 351114 350526 349503 348222 348029 348835 349474 350216 352459 356239 360499 365480 372320 380583 388733
57933 388733 396880 406440 417140 426930 434881 441687 447319 450701 451851 451913 450877 447678 442687 437720
57919 437720 433383 428701 423524 418924 415023 410860 406618 403548 401462 398858 395901 394640 395565 396490 395715
$$ packed form
58026E01617p762r804j0050r527r516q732o521n013n435n768m519l248l179k887
58012D09656j540q05j479j780r61r23k314k855j569q33k028k950j863m02q9L68
57996C87633J837K407Q92n75o1J051Q95J55o0m93j621k063j226q98k172l453l435
57979C78813l226l717l682k437j568k058k490j942j797k787l188j874m22j49N8
57964C47534J030J369K74m27O87K161K313J869J925J767O86l67p77j520k804k997
57948C52723j609n88j023j281j93Q06O39P42K243L780M260M981O840Q263Q150
57933C88733Q147R560J0700R790P951O806N632L382J150O2j036l199m991m967
57919D37720m337m682n177m600l901m163m242l070k086k604k957j261R25R25p75
$$ plain form
57904 395715 394039 392650 391106 388440 384486 379228 372494 365036 358324 352657 347001 341095 336048 332436
57890 332436 329638 327531 326995 328101 329515 330316 330858 331346 331208 330384 329687 329350 328797 328155 328284 328902 328447
57873 328447 326373 323917 322080 320493 318825 317610 317063 316616 316244 316743 318269 320117 322361 326021 331080
57858 331080 336049 340155 344331 349349 354533 359078 363143 366911 369888 371871 373361 374524 374978 374972 375317
57843 375317 375765 374941 372337 368886 365138 360488 354743 348864 343481 338149 332685 327785 323760 320118 316904
57828 316904 314922 314099 313164 311533 309965 308854 307612 306333 306216 307487 308658 308809 308916 309936 311201
57813 311201 311821 312151 312675 312791 311863 310180 307798 303766 297744 291245 286075 282522 280030 278498 277809 277121
57797 277121 275763 274102 272658 271336 270343 270794 273385 277287 281247 284969 288700 292444 296331 300876 306071
$$ packed form
57904C95715j676j389j544k666l954n258o734p458o712n667n656n906n047l612
57890C32436k798k107n36J106J414Q01N42M88j38q24o97l37n53o42J29O18m55
57873C28447k074k456j837j587j668j215n47m47l72M99J526J848K244L660N059
57858C31080M969M106M176N018N184M545M065L768K977J983J490J163M54oL45
57843C75317M48q24k604l451l748m650n745n879n383n332n464m900m025l642l214
57828C16904j982q23r35j631j568j111j242j279j17J271J171J51J07J020J265
57813C11201O20L30N24J16r28j683k382m032o022o499n170l553k492j532o89o88
57797B77121j358j661j444j322r93M51K591L902L960L722L731L744L887M545N195
$$ plain form
57782 306071 311097 315509 319751 323976 327547 330357 333451 337457 341528 344634 346843 348567 349669 350109
57768 350109 350331 350259 349082 346763 344439 342469 339479 334410 328169 322137 316300 310161 304304 299689 296316
57753 296316 293846 292593 292686 293243 293708 295081 298344 302493 305665 307652 309840 313083 316983 320942 324629
57738 324629 327597 329584 331138 333033 335202 336895 337677 337694 337366 337351 338284 339934 341189 341361 340844 340003 338333
57721 338333 335502 332293 329592 327189 324447 321443 318462 315059 310686 305768 301186 297077 292974 288683
57707 288683 284286 279645 274608 269348 264005 258489 253066 248444 244817 241581 238472 236091 234722 233606
57693 233606 232064 230445 229205 228032 226694 225803 225877 226514 227360 228929 231613 234855 238357 243103 250113
57678 250113 259009 268972 280329 294181 311275 332338 358694 391386 430402 475861 529131 591494
$$ packed form
57782C06071N026M412M242M225L571K810L094M006M071L106K209J724J102M40
57768C50109K22p2j177k319k324j970k990n069o241o032n837o139n857m615l373
57753B96316k470j253R3N57M65J373L263M149L172J987K188L243L900L959L687
57738C24629K968J987J554J895K169J693P82J7l28j5R33J650J255J72n17q41j670
57721C38333k831l209k701k403k742l004k981l403m373m918m582m109m103m291
57707B88683m397m641n037n260n343n516n423m622l627l236l109k381j369j116
57693B33606j542j619j240j173j338q91P4O37Q46J569K684L242L502M746P010
57678B50113Q896R963J1357J3852J7094K1063K6356L2692L9016M5459N3270O2363
$$ plain form
57666 591494 662092 737763 813544 881924 932986 957869 952933 920452 866412 798688 725761 654471
57654 654471 588375 528923 477496 435055 400691 372374 349022 330502 316069 304317 294509 286530
57642 286530 279795 273575 268207 264504 262099 259709 256956 254577 252957 251829 251450 252581 255026 257383
57628 257383 258522 258377 257233 255270 252963 250922 249071 246772 243850 240845 238255 236241 234908 234229 233853
57613 233853 233545 233456 233298 231957 228888 225297 222818 221595 220825 220544 221338 222647 223072 222372 221679 221610 221505
57596 221505 220680 219171 217020 214056 210620 207512 204937 202438 199902 197631 195337 192151 187876 183382
57582 183382 179603 176904 175349 174710 174296 173615 173042 172944 172451 170284 166574 162693 159410 156513 154061 152502
57566 152502 151427 149701 147169 144908 143433 141943 139828 137749 136646 136659 137527 139091 140928 142310 143084
$$ packed form
57666E91494P0598P5671P5781O8380N1062K4883m936l2481n4040o7724p2927p1290
57654F54471o6096n9452n1427m2441l4364k8317k3352j8520j4433j1752r808p979
57642B86530o735o220n368l703k405k390k753k379j620j128l79J131K445K357
57628B57383J139j45j144j963k307k041j851k299k922l005k590k014j333o79l76
57613B33853l08q9j58j341l069l591k479j223p70k81P94J309M25p00o93o9j05
57596B21505q25j509k151k964l436l108k575k499k536k271k294l186m275m494
57582A83382l779k699j555o39m14o81n73r8m93k167l710l881l283k897k452j559
57566A52502j075j726k532k261j475j490k115k079j103J3Q68J564J837J382P74
$$ plain form
57551 143084 143962 145674 148379 151946 156014 159705 162164 163409 163831 163005 160211 156227 153310 152984 154823
57536 154823 157637 160716 163547 165488 166346 166490 166001 164553 162384 160454 159273 158447 157658 157161 157026 156921
57520 156921 156971 157846 159581 161326 162700 164388 166854 169453 171423 172886 174284 175585 176611 177484 178243
57505 178243 178657 178803 179122 179647 179901 179749 179451 178663 176498 173010 169473 166679 164007 160793 157509 154817
57489 154817 152484 150113 148071 146758 145670 144064 141986 139856 137690 135483 133772 133031 132981 133142 133433
57474 133433 133626 132958 131165 129234 128206 127752 126883 125574 124598 124056 123223 121812 120437 119630 119119 118353 117235
57457 117235 116131 115477 115503 116117 116960 117601 117697 117088 116015 115167 115099 115575 115889 115812 115746 116006 116612 117740 119556
57438 119556 121471 122440 122295 121887 121639 120962 119587 118474 118543 119364 120001 120471 121408 122783 123985 124823 125518
$$ packed form
57551A43084Q78J712K705L567M068L691K459J245M22q26k794l984k917l26J839
57536A54823K814L079K831J941Q58J44m89j448k169j930j181q26p89m97j35j05
57520A56921N0Q75J735J745J374J688K466K599J970J463J398J301J026Q73P59
57505A78243M14J46L19N25K54j52k98p88k165l488l537k794k672l214l284k692
57489A54817k333k371k042j313j088j606k078k130k166k207j711p41n0J61K91
57474A33433J93o68j793j931j028m54q69j309r76n42q33j411j375q07n11p66j118
57457A17235j104o54K6O14Q43O41R6o09j073q48o8M76L14p7o6K60O06J128J816
57438A19556J915R69j45m08k48o77j375j113O9Q21O37M70R37J375J202Q38O95
$$ plain form
57421 125518 125918 125639 124857 124109 123351 122064 120401 119400 119726 120759 121324 121028 120548 120738 121748 123060 124215
57404 124215 125264 126434 127562 128176 128111 127670 127147 126488 125529 124315 123120 122373 122515 123639 125304 126976
57388 126976 128485 129798 130677 131075 131628 133020 135083 137235 139630 142937 146950 150409 152422 153246 153496
57373 153496 153409 153136 152799 151911 149621 145999 142296 139474 137229 134978 133001 131881 131419 130900 130125 129563
57357 129563 129588 129981 130106 129472 128341 127719 128378 129966 131561 132871 134169 135317 135897 136268 137299 138825
57341 138825 139547 138870 137721 137072 136702 135984 134961 133977 133101 132513 132662 133460 134025 133761 132932 131863 130475
57324 130475 129059 128456 128834 129220 128873 128204 127807 127556 127291 127339 127689 127704 127353 127625 128950 130346 130997 131467
57306 131467 132394 133231 133436 133694 134645 135495 135351 134920 135400 136531 137279 137649 138220 138592 138012 137049 136948 137668
$$ packed form
57421A25518M00k79p82p48p58j287j663j001L26J033N65k96m80J90J010J312J155
57404A24215J049J170J128O14o5m41n23o59r59j214j195p47J42J124J665J672
57388A26976J509J313Q79L98N53J392K063K152K395L307M013L459K013Q24K50
57373A53496q7k73l37q88k290l622l703k822k245k251j977j120m62n19p75n62
57357A29563K5L93J25o34j131o22O59J588J595J310J298J148N80L71J031J526
57341A38825P22o77j149o49l70p18j023r84q76n88J49P98N65k64q29j069j388
57324A30475j416o03L78L86l47o69l97k51k65M8L50J5l51K72J325J396O51M70
57306A31467R27Q37K05K58R51Q50j44m31M80J131P48L70N71L72n80r63j01P20
$$ plain form
57288 137668 138149 138174 138398 138794 138728 138445 138904 140179 141510 142806 144605 146603 147829 148360 149244 150605 151408
57271 151408 151430 151873 153541 155783 157796 159653 161469 162817 163713 165064 167318 169514 170425 170007 169107 168305
57255 168305 167661 167090 166525 166049 166052 166859 168121 169216 170305 172214 175107 178052 180223 181811 183379 185037
57239 185037 186708 188635 191134 194152 197371 200478 203166 205314 207376 210205 214234 219040 223833 228161
57225 228161 232127 236146 240435 244623 248041 250607 253056 256005 259197 262108 264763 267341 269441 270486
57211 270486 270531 269956 268620 266138 262695 258823 254594 249838 244945 240620 236972 233554 230081 226436 222333
57196 222333 217842 213907 211440 210154 209206 208627 209087 210570 212443 214724 218048 222414 227077 231715 236690
57181 236690 242134 247759 253498 259377 264879 269519 273879 278916 284359 289103 293138 297737 303696 310715
$$ packed form
57288A37668M81K5K24L96o6k83M59J275J331J296J799J998J226N31Q84J361Q03
57271A51408K2M43J668K242K013J857J816J348Q96J351K254K196R11m18r00q02
57255A68305o44n71n65m76LQ07J262J095J089J909K893K945K171J588J568J658
57239A85037J671J927K499L018L219L107K688K148K062K829M029M806M793M328
57225B28161L966M019M289M188L418K566K449K949L192K911K655K578K100J045
57211B70486M5n75j336k482l443l872m229m756m893m325l648l418l473l645m103
57196B22333m491l935k467j286r48n79M60J483J873K281L324M366M663M638M975
57181B36690N444N625N739N879N502M640M360N037N443M744M035M599N959P019
$$ plain form
57167 310715 318599 327622 337446 347092 356401 366290 377229 388749 400722 413712 427635 441475 454967
57154 454967 469226 485075 501931 519003 536379 554237 572185 590206 609218 629903 651951
57143 651951 675124 700011 726930 755094 783743 813275 844433 877255 911720 948648 988983
57132 988983 1032619 1078661 1126474 1176019 1227719 1282349 1340434 1401564 1465048 1531396 1602065
57121 1602065 1677472 1756538 1838728 1925280 2017775 2116761 2222577 2336303 2459062 2591662
57111 2591662 2736196 2897113 3079481 3286615 3519854 3779688 4066539 4381994 4731049
57102 4731049 5123137 5570994 6090245 6701330 7430594 8307724 9362115 10621944 12115572
57093 12115572 13872982 15926620 18310228 21052981 24171142 27665341 31527039 35745956
$$ packed form
57167C10715P884R023R824R646R309R889J0939J1520J1973J2990J3923J3840J3492
57154D54967J4259J5849J6856J7072J7376J7858J7948J8021J9012K0685K2048
57143F51951K3173K4887K6919K8164K8649K9532L1158L2822L4465L6928M0335
57132I88983M3636M6042M7813M9545N1700N4630N8085O1130O3484O6348P0669
57121A602065P5407P9066Q2190Q6552R2495R8986J05816J13726J22759J32600
57111B591662J44534J60917J82368K07134K33239K59834K86851L15455L49055
57102D731049L92088M47857N19251O11085P29264Q77130J054391J259829J493628
57093A2115572J757410K053638K383608K742753L118161L494199L861698M218917
$$ plain form
57085 35745956 40306675 45168483 50227723 55270509 59946159 63808134 66438652 67600979
57077 67600979 67321153 65844676 63506708 60605801 57343802 53833148 50136739 46307079
57069 46307079 42408157 38518191 34720346 31091079 27691924 24565582 21735546 19208587
57061 19208587 16978584 15029792 13339169 11878842 10619200 9531724 8590595 7773003
57053 7773003 7058791 6430254 5872543 5374115 4926368 4522717 4158127 3829293 3534335
57044 3534335 3271562 3038341 2831120 2646231 2480477 2331218 2196317 2074087 1963119
57035 1963119 1862142 1770067 1686226 1610533 1543304 1484769 1434749 1392844 1358827 1332649 1314344
57024 1314344 1304232 1302823 1309404 1320245 1328816 1328356 1314206 1284146 1238034 1178262 1109865 1038714
$$ packed form
57085C5745956M560719M861808N059240N042786M675650L861975K630518J162327
57077F7600979k79826j476477k337968k900907l261999l510654l696409l829660
57069D6307079l898922l889966l797845l629267l399155l126342k830036k526959
57061A9208587k230003j948792j690623j460327j259642j087476r41129q17592
57053G773003p14212o28537n57711m98428m47747m03651l64590l28834k94958
57044C534335k62773k33221k07221j84889j65754j49259j34901j22230j10968
57035A963119j00977r2075q3841p5693o7229n8535n0020m1905l4017k6178j8305
57024A314344j0112j409O581J0841Q571m60j4150l0060m6112n9772o8397p1151
$$ plain form
57012 1038714 969147 903425 842806 788173 739753 697162 659992 627881 600056 575387 553045
57001 553045 532719 514218 497236 481504 466835 452990 439713 426791 413991 401264 389253
56990 389253 379219 372042 367663 365796 366662 370486 376767 384687 393752 403165 410893 414313 411927 403994
56976 403994 391773 376827 360809 344935 329435 314027 298984 285310 273977 265497 260070 257600
56964 257600 257694 260285 266075 275825 289364 305957 325343 347490 371285 394235 413579 427175 433452
56951 433452 431486 421553 405228 384786 362695 341232 321765 304406 289004 276397 267947 263922
56939 263922 263267 265157 270006 278662 291402 308090 328776 353640 382430 413888 445239 472326
56927 472326 490974 498659 494866 480324 456758 427178 395260 363828 334295 307551 284523 265520
$$ packed form
57012A038714o9567o5722o0619n4633m8420m2591l7170l2111k7825k4669k2342
57001E53045k0326j8501j6982j5732j4669j3845j3277j2922j2800j2727j2011
56990C89253j0034p177m379j867Q66L824O281P920R065R413P728L420k386p933
56976D03994j2221j4946j6018j5874j5500j5408j5043j3674j1333q480n427k470
56964B57600R4K591N790R750J3539J6593J9386K2147K3795K2950J9344J3596O277
56951D33452j966r933j6325k0442k2091k1463j9467j7359j5402j2607q450m025
56939B63922o55J890M849Q656J2740J6688K0686K4864K8790L1458L1351K7087
56927D72326J8648P685l793j4542k3566k9580l1918l1432k9533k6744k3028j9003
$$ plain form
56915 265520 249845 236571 225275 215671 207147 199222 192019 185771 180090 174319 168506 163593 160518
56902 160518 159294 159080 159169 159784 161685 164996 168869 172651 177000 183317 192397 204169 218490 235355
56888 235355 254403 275055 297273 321364 346626 370635 390225 402903 407390 403555 392436 376172
56876 376172 357532 339215 323193 310277 300370 293431 290033 290684 295097 302839 314542 331694 355304
56863 355304 385493 422362 466347 517326 573736 632360 688192 734653 765383 776916 769707 746746
56851 746746 712027 670363 627188 587078 552418 523908 502043 487555 480768 481383 489188 504726
56839 504726 529113 563269 607493 661841 726797 802965 889357 981649 1072000 1150430 1206691
56828 1206691 1232454 1223901 1183382 1118425 1038649 953103 869197 792285 725275 668920 622931
$$ packed form
56915B65520j5675j3274j1296r604q524p925p203o248n681n771n813m913l075
56902A60518j224k14Q9O15J901L311L873L782M349O317R080J1772J4321J6865
56888B35355J9048K0652K2218K4091K5262K4009J9590J2678M487l835j1119j6264
56876C76172j8640j8317j6022j2916r907o939l398O51M413P742J1703J7152K3610
56863C55304L0189L6869M3985N0979N6410N8624N5832M6461L0730J1533p209k2961
56851G46746l4719m1664m3175m0110l4660k8510k1865j4488o787O15P805J5538
56839E04726K4387L4156M4224N4348O4956P6168Q6392R2292R0351P8430N6261
56828A206691K5763q553m0519o4957p9776q5546q3906p6912o7010n6355m5989
$$ plain form
56817 622931 586920 560627 543918 536746 538835 549501 568307 595789 633000 680276 736699 800044
56805 800044 865903 926626 972419 994782 989570 957740 904483 837714 765848 695488 630552 573052
56793 573052 523826 482637 448746 422032 402924 391070 385033 383940 388649 400499 419440 444151
56781 444151 473487 506686 541971 575459 601769 615758 614223 596860 566210 526706 483244 439748
56769 439748 398313 359570 324030 292811 266765 245414 227501 212463 200563 191664 184682 178425
56757 178425 172309 166193 160265 155249 151924 150069 148430 145960 142638 139046 135773 133385 132198 131788
56743 131788 131280 130336 129296 128329 127164 125804 124711 124095 123741 123710 124333 125288 125591 124877 123851 123145 122600
56726 122600 122101 122121 122840 123567 123763 123946 124896 126581 128513 130528 132572 134277 135494 136789 138726 140992
$$ packed form
56817F22931l6011k6293j6709p172K089J0666J8806K7482L7211M7276N6423O3345
56805H00044O5859O0723M5793K2363n212l1830n3257o6769p1866p0360o4936n7500
56793E73052m9226m1189l3891k6714j9108j1854o037j093M709J1850J8941K4711
56781D44151K9336L3199L5285L3488K6310J3989j535j7363l0650l9504m3462m3496
56769D39748m1435l8743l5540l1219k6046k1351j7913j5038j1900q899o982o257
56757A78425o116o116n928n016l325j855j639k470l322l592l273k388j187m10
56743A31788n08r44j040r67j165j360j093o16l54l1O23R55L03p14j026p06n45
56726A22600m99K0P19P27J96J83R50J685J932K015K044J705J217J295J937K266
$$ plain form
56710 140992 142772 143723 144128 144468 145257 146843 148967 150878 152174 153051 153526 153151 151918 150717 150365 150732
56694 150732 151365 152299 153687 155156 156181 156667 156633 155843 154263 152461 151037 150073 149464 149270 149330 149141 148632
56677 148632 148438 148943 149647 149937 149864 149683 149346 148992 149170 149973 150696 151036 151853 153920 156634 158873 160542 162302
56659 162302 164290 166102 167728 169588 171757 173833 175426 176296 176370 176087 176206 176824 177178 176930 176924 178008 179851
56642 179851 181687 183486 185421 186895 187226 186832 186686 186927 186965 186596 186037 185183 183795 182183 180822 179552
56626 179552 177917 175996 174116 172153 169998 168269 167606 167587 167275 166466 165478 164195 162402 160724 160028 160156
56610 160156 160372 160788 162070 163872 164879 164522 163435 162098 160226 157775 155530 154277 154130 154853 156088
56595 156088 157167 157556 157640 158329 159716 160922 161375 161439 161564 161606 161312 160836 160490 160433 160769 161472 162237 162848 163625
$$ packed form
56710A40992J780R51M05L40P89J586K124J911J296Q77M75l75j233j201l52L67
56694A50732O33R34J388J469J025M86l4p90j580j802j424r64o09j94O0j89n09
56677A48632j94N05P04K90p3j81l37l54J78Q03P23L40Q17K067K714K239J669J760
56659A62302J988J812J626J860K169K076J593Q70P4k83J19O18L54k48oJ084J843
56642A79851J836J799J935J474L31l94j46K41L8l69n59q54j388j612j361j270
56626A79552j635j921j880j963k155j729o63j9l12q09r88j283j793j678o96J28
56610A60156K16M16J282J802J007l57j087j337j872k451k245j253j47P23J235
56595A56088J079L89Q4O89J387J206M53O4J25M2k94m76l46n7L36P03P65O11P77
$$ plain form
56576 163625 164908 166256 166873 166809 166987 167968 169455 171104 173147 175886 179160 182568 185954 189619 194324
56561 194324 200925 209590 219527 229802 240124 250335 259538 266473 270560 271984 271096 268448 265103 262003
56547 262003 259115 255908 252431 249162 246091 242929 240024 238085 236937 235524 233217 230323 227272 224157
56533 224157 221198 218809 217003 215351 213704 212345 211398 210683 210145 209860 209632 209144 208417 207569 206311 204342
56517 204342 202083 200389 199646 199674 200175 200605 200052 198156 195853 194388 193877 193674 193647 194000 194249 193638 192387
56500 192387 191271 190175 188414 186428 185663 186511 187660 187897 187404 186876 186448 186012 185704 185589 185508 185540 185969 186630
56482 186630 186967 186884 186857 187198 187881 189023 190738 192572 193914 194872 195951 197098 197994 198968 200480 201933 202320
56465 202320 201971 202217 203232 203654 202615 200837 199358 198423 198088 198734 200352 202219 203701 204698 205191 205171 205046
$$ packed form
56576A63625J283J348O17o4J78R81J487J649K043K739L274L408L386L665M705
56561A94324O601Q665R937J0275J0322J0211R203O935M087J424q88k648l345l100
56547B62003k888l207l477l269l071l162k905j939j148j413k307k894l051l115
56533B24157k959k389j806j652j647j359r47p15n38k85k28m88p27q48j258j969
56517B04342k259j694p43K8N01M30n53j896k303j465n11k03k7L53K49o11j251
56500A92387j116j096j761j986p65Q48J149K37m93n28m28m36l08j15q1L2M29O61
56482A86630L37q3k7L41O83J142J715J834J342R58J079J147Q96R74J512J453L87
56465B02320l49K46J015M22j039j778j479r35l35O46J618J867J482R97M93k0j25
$$ plain form
56448 205046 205179 205131 204479 204195 205817 209217 212613 214897 216426 217382 217102 215536 213762 212437 211152 209853
56432 209853 209320 209658 209818 209356 209144 209583 209674 208849 208215 208829 210057 210888 211642 213114 214992 216393 217138 217397
56414 217397 216883 215560 214395 214289 214812 214960 214601 214290 214276 214500 215022 215659 215813 215390 215273 216192 217794 219423
56396 219423 221048 222691 223765 223841 223466 223438 223834 224402 225196 226243 227262 228325 229991 232146 233594 233577 232950
56379 232950 233010 233911 235023 236105 237215 238099 238498 238654 238877 239167 239761 241270 243645 245847 247281 248792
56363 248792 251337 254325 256249 256527 255948 255552 255698 256004 255882 255383 255512 257093 259402 260851 261067 261172 261937
56346 261937 262968 263973 265351 267012 268071 268389 269068 270649 272267 273408 275019 277909 281378 284493 287417
56331 287417 290403 292801 294294 295925 298629 301828 304653 307436 310761 314207 317337 320834 325197 329321
$$ packed form
56448B05046J33m8o52k84J622L400L396K284J529R56k80j566j774j325j285j299
56432B09853n33L38J60m62k12M39R1q25o34O14J228Q31P54J472J878J401P45K59
56414B17397n14j323j165j06N23J48l59l11j4K24N22O37J54m23j17R19J602J629
56396B19423J625J643J074P6l75k8L96N68P94J047J019J063J666K155J448j7o27
56379B32950O0R01J112J082J110Q84L99J56K23K90N94J509K375K202J434J511
56363B48792K545K988J924K78n79l96J46L06j22m99J29J581K309J449K16J05P65
56346B61937J031J005J378J661J059L18O79J581J618J141J611K890L469L115K924
56331B87417K986K398J493J631K704L199K825K783L325L446L130L497M363M124
$$ plain form
56317 329321 331800 332838 333527 334127 334389 334697 335471 336201 336434 336899 338342 340135 341481 343166 346547 351511
56301 351511 356947 362592 368815 375146 380638 385416 390437 395942 401320 406195 410564 414259 417317 420449
56287 420449 424179 428052 431568 435217 439610 444495 449674 456024 464383 474175 484334 494744 505673
56274 505673 516763 527880 539970 553632 567844 581613 596032 613083 633131 655176 678824
56263 678824 704403 731850 761177 793505 830067 870759 915169 964436 1020526 1084270 1155661
56252 1155661 1235487 1325143 1425394 1536753 1660350 1796804 1944887 2102881 2270494 2447784
56242 2447784 2632957 2822896 3015029 3206748 3393623 3570199 3732121 3875726 3996256
56233 3996256 4088621 4149741 4178582 4174630 4138382 4072766 3981843 3868378 3734570 3584615 3424149
$$ packed form
56317C29321K479J038O89O00K62L08P74P30K33M65J443J793J346J685L381M964
56301C51511N436N645O223O331N492M778N021N505N378M875M369L695L058L132
56287D20449L730L873L516L649M393M885N179O350Q359R792J0159J0410J0929
56274E05673J1090J1117J2090J3662J4212J3769J4419J7051K0048K2045K3648
56263F78824K5579K7447K9327L2328L6562M0692M4410M9267N6090O3744P1391
56252A155661P9826Q9656J00251J11359J23597J36454J48083J57994J67613J77290
56242B447784J85173J89939J92133J91719J86875J76576J61922J43605J20530
56233C996256R2365O1120K8841l952l6248o5616r0923j13465j33808j49955j60466
$$ plain form
56222 3424149 3257233 3086039 2913382 2743281 2578628 2420201 2268298 2123872 1987916
56213 1987916 1861167 1744381 1637557 1539242 1447971 1363926 1287649 1217912 1152769 1092107 1037111
56202 1037111 987699 942544 901186 863920 830018 798360 769601 745366 725327 707277 690103
56191 690103 674470 660599 647641 635470 624944 616122 608098 600699 594490 589139 583713 578522 574645
56178 574645 571680 568106 563850 560398 558314 556801 555759 556068 557611 559108 560127 561360 562861 563974
56164 563974 565035 567138 570176 573117 576120 580390 586051 592224 598977 607013 615693 623729 631633 641080
56150 641080 652143 663682 676281 692052 711557 733601 758130 786621 819626 856731 898954
56139 898954 948261 1004585 1066376 1134215 1210466 1294607 1381912 1467516 1548892 1623848 1689523
$$ packed form
56222C424149j66916j71194j72657j70101j64653j58427j51903j44426j35956
56213A987916j26749j16786j06824r8315r1271q4045p6277o9737o5143o0662n4996
56202A037111m9412m5155m1358l7266l3902l1658k8759k4235k0039j8050j7174
56191F90103j5633j3871j2958j2171j0526q822q024p399o209n351n426n191l877
56178E74645k965l574m256l452k084j513j042L09J543J497J019J233J501J113
56164E63974J061K103L038K941L003M270N661O173O753Q036Q680Q036P904R447
56150F41080J1063J1539J2599J5771J9505K2044K4529K8491L3005L7105M2223
56139H98954M9307N6324O1791O7839P6251Q4141Q7305Q5604Q1376P4956O5675
$$ plain form
56128 1689523 1744906 1791949 1833124 1869896 1903751 1935730 1964045 1984746 1995617 1997367 1991049 1977293
56116 1977293 1958265 1936976 1913598 1885137 1849173 1805031 1751235 1685794 1610188 1529743 1448847
56105 1448847 1368927 1291871 1221646 1160821 1108633 1063985 1027378 998461 974787 954689 938768
56094 938768 927202 918337 911150 906338 903827 901995 900346 900035 900904 901177 900958 902597 906572 910558 913677
56079 913677 917966 924297 930632 935853 941639 948978 956547 964161 973967 986413 998846 1010083 1022702
56066 1022702 1038826 1057341 1077180 1099482 1124272 1148776 1171288 1193187 1215130 1234998 1251680
56055 1251680 1267018 1281866 1294199 1303382 1312316 1322973 1333805 1343884 1355403 1369586 1384407 1398971
56043 1398971 1415884 1436496 1458098 1478725 1500461 1525093 1550866 1576561 1604342 1635312 1666515
$$ packed form
56128A689523N5383M7043M1175L6772L3855L1979K8315K0701J0871J750o318j3756
56116A977293j9028k1289k3378k8461l5964m4142n3796o5441p5606q0445q0896
56105A448847p9920p7056p0225o0825n2188m4648l6607k8917k3674k0098j5921
56094I38768j1566q865p187m812k511j832j649l11Q69K73k19J639L975L986L119
56079I13677M289O331O335N221N786P339P569P614R806J2446J2433J1237J2619
56066A022702J6124J8515J9839K2302K4790K4504K2512K1899K1943J9868J6682
56055A251680J5338J4848J2333R183Q934J0657J0832J0079J1519J4183J4821J4564
56043A398971J6913K0612K1602K0627K1736K4632K5773K5695K7781L0970L1203
$$ plain form
56032 1666515 1695605 1724367 1754621 1785078 1815267 1847920 1884202 1921185 1957156 1994616 2034992
56021 2034992 2075657 2115526 2158013 2204811 2252466 2299049 2348334 2403092 2460195 2516892 2576001
56010 2576001 2640129 2706806 2774284 2846018 2924201 3005120 3086239 3171540 3264311 3361283 3459769
55999 3459769 3563794 3676876 3795678 3917399 4046504 4187180 4336202 4490374 4653832
55990 4653832 4830631 5017639 5212559 5421253 5648997 5892519 6149205 6425827 6729167
55981 6729167 7056726 7406269 7785501 8202177 8654277 9140851 9672824 10261839 10909130
55972 10909130 11617828 12405145 13289372 14277305 15379691 16627252 18056955 19698150 21592674
55963 21592674 23817427 26470128 29647874 33457477 38026473 43480939 49936097 57539287
$$ packed form
56032A666515K9090K8762L0254L0457L0189L2653L6282L6983L5971L7460M0376
56021B034992M0665L9869M2487M6798M7655M6583M9285N4758N7103N6697N9109
56010B576001O4128O6677O7478P1734P8183Q0919Q1119Q5301R2771R6972R8486
55999C459769J04025J13082J18802J21721J29105J40676J49022J54172J63458
55990D653832J76799J87008J94920K08694K27744K43522K56686K76622L03340
55981F729167L27559L49543L79232M16676M52100M86574N31973N89015O47291
55972A0909130P08698P87317Q84227R87933J102386J247561J429703J641195J894524
55963B1592674K224753K652701L177746L809603M568996N454466O455158P603190
$$ plain form
55955 57539287 66502403 77069814 89501800 104149184 121513808 142165467 166608189
55948 166608189 195236181 228204203 264900708 303197949 339210731 368068600 385361030
55941 385361030 388446113 377108133 353502206 321459090 285319851 248768322 214229023
55934 214229023 182966720 155496983 131894597 111945205 95268807 81433443 70004101
55927 70004101 60554891 52704464 46150827 40657324 36020106 32069271 28683050 25771675
55919 25771675 23251206 21047312 19110725 17407685 15901622 14558990 13363051 12304585
55911 12304585 11365263 10523868 9770903 9102396 8505445 7963293 7469035 7021694 6614089
55902 6614089 6236450 5887098 5568091 5274607 4999140 4741733 4505870 4288304 4082809
$$ packed form
55955E7539287Q963116J0567411J2431986J4647384J7364624K0651659K4442722
55948A66608189K8627992L2968022L6696505L8297241L6012782K8857869J7292430
55941C85361030L085083j1337980k3605927l2043116l6139239l6551529l4539299
55934B14229023l1262303k7469737k3602386j9949392j6676398j3835364j1429342
55927G0004101r449210p850427o553637n493503m637218l950835l386221k911375
55919B5771675k520469k203894j936587j703040j506063j342632j195939j058466
55911A2304585r39322q41395p52965o68507n96951n42152m94258m47341m07605
55902F614089l77639l49352l19007k93484k75467k57407k35863k17566k05495
$$ plain form
55893 4082809 3890053 3714194 3553186 3401476 3258933 3128327 3007222 2890976 2780969
55884 2780969 2681645 2592026 2507834 2429381 2359606 2296525 2234904 2173402 2113401 2053086 1989469
55873 1989469 1924285 1861465 1800659 1739225 1678404 1621440 1567685 1514550 1463225 1416561 1373227
55862 1373227 1329887 1287393 1249165 1215088 1182492 1151485 1123901 1098567 1072979 1048161 1026690
55851 1026690 1007411 987147 966128 946671 927997 907434 885422 864331 843666 821411 798927
55840 798927 779482 762900 746449 730061 715925 703793 691363 678618 667269 656629 644544
55829 644544 631905 621926 615431 610946 608781 610744 616022 621277 624597 625909 624185 618083 608921 599442
55815 599442 590087 579802 569683 562145 557104 552535 548141 545002 542425 538879 535413 534469 535868 537608
$$ packed form
55893D082809j92756j75859j61008j51710j42543j30606j21105j16246j10007
55884B780969r9324q9619q4192p8453o9775o3081o1621o1502o0001o0315o3617
55873A989469o5184o2820o0806o1434o0821n6964n3755n3135n1325m6664m3334
55862A373227m3340m2494l8228l4077l2596l1007k7584k5334k5588k4818k1471
55851A026690j9279k0264k1019j9457j8674k0563k2012k1091k0665k2255k2484
55840G98927j9445j6582j6451j6388j4136j2132j2430j2745j1349j0640j2085
55829F44544j2639r979o495m485k165J963N278N255L320J312j724o102r162r479
55815E99442r355j0285j0119p538n041m569m394l139k577l546l466r44J399J740
$$ plain form
55801 537608 540041 545430 553693 562190 569536 576202 581673 584425 584466 582619 577743 568039 554720 541040
55787 541040 528115 515090 502803 493448 486770 480261 473161 466763 460874 453646 445111 437373 431016
55774 431016 424690 418570 414860 414530 416738 421715 430783 442895 454269 462131 465938 464730 456757 442717
55760 442717 426352 410698 396063 382218 369791 358703 347814 337042 327712 320158 313178 306300
55748 306300 300320 295193 289673 283485 277707 272657 267595 262699 259053 256508 253917 251656 251397 253130
55734 253130 254904 255818 256668 257289 256007 252464 248463 245209 241931 237922 233690 229439 224648 219835 216578
55719 216578 215085 213790 211957 210643 210551 211046 211872 213794 216911 220346 224086 229141 235424 241432 246374
55704 246374 250553 253423 253694 251755 249538 247396 243591 237574 231249 226038 221145 215811 210985 207461
$$ packed form
55801E37608K433N389Q263Q497P346O666N471K752M1j847m876r704j3319j3680
55787E41040j2925j3025j2287r355o678o509p100o398n889p228q535p738o357
55774D31016o326o120l710l30K208M977R068J2112J1374P862L807j208p973j4040
55760D42717j6365j5654j4635j3845j2427j1088j0889j0772r330p554o980o878
55748C06300n980n127n520o188n778n050n062m896l646k545k591k261k59J733
55734B53130J774R14Q50O21j282l543m001l254l278m009m232m251m791m813l257
55719B16578j493j295j833j314r2M95Q26J922L117L435L740N055O283O008M942
55704B46374M179K870K71j939k217k142l805o017o325n211m893n334m826l524
$$ plain form
55690 207461 204465 201412 199247 198799 199434 200393 201826 203601 204857 205779 208134 212990 219368 225919 232343
55675 232343 238350 242983 245887 247716 248557 247595 245118 243036 242478 242503 242099 241740 242036 242477 242541 242559 242621 242150
55657 242150 241387 241679 243376 245095 245962 246977 249115 251683 253632 255004 255978 255896 254300 251636 248004 242603
55641 242603 235322 227472 220001 212412 204348 196750 190360 184519 178612 173331 169382 166156 162815 159595
55627 159595 156994 154733 152473 150508 148952 147291 145427 143947 142739 140728 137719 135021 133417 131993
55613 131993 129845 127483 125570 123748 121807 120589 120577 120884 120721 120619 121167 121828 122031 122164 122425 122059 120815
55596 120815 119820 119826 119924 119145 118071 117591 117350 116724 116138 116090 115978 115214 114473 114534 114892 114716 114222 113944 113644 113019
55576 113019 112463 112040 110940 109081 107991 108835 110761 112509 114354 116961 119595 121252 122527 124630 127308
$$ packed form
55690B07461k996l053k165m48O35R59J433J775J256R22K355M856O378O551O424
55675B32343O007M633K904J829Q41r62k477k082n58K5m04l59K96M41O4J8O2m71
55657B42150p63K92J697J719Q67J015K138K568J949J372R74q2j596k664l632n401
55641B42603p281p850p471p589q064p598o390n841n907n281l949l226l341l220
55627A59595k601k261k260j965j556j661j864j480j208k011l009k698j604j424
55613A31993k148k362j913j822j941j218j2L07j63j02N48O61K03J33K61l66j244
55596A20815r95OR8p79j074m80k41o26n86m8j12p64p41O1L58j76m94k78l00o25
55576A13019n56m23j100j859j090Q44J926J748J845K607K634J657J275K103K678
$$ plain form
55561 127308 129429 130890 132241 133069 132478 130806 129358 128678 128382 128322 128660 129090 129177 129173 129533 130062 130456 131103
55543 131103 132398 133822 134647 134987 135316 135670 136192 137568 139901 142012 142882 142961 143092 143162 142904 142905 143472 143459 141647
55524 141647 138434 134906 131210 127265 123935 121843 119893 116742 112952 109973 107792 105473 103338 102529
55510 102529 102783 102583 101386 99954 98717 97538 96911 97549 98815 99260 98711 98219 98037 97349 95998 94787
55494 94787 93954 93031 92331 92829 94253 94987 94371 93632 93977 95133 96311 97302 98007 98052 97535 97230 97517 97949
55476 97949 98212 98560 98984 98960 98469 98297 98792 99190 98727 97683 96784 96142 95363 94249 92957 91726 90722 89962
55458 89962 89334 88834 88647 88733 88703 88479 88607 89282 89622 88759 87265 86506 86864 87596 88261 89174 90463 91687 92553
55439 92553 93142 93410 93208 92883 93034 93673 94283 94630 94801 94671 94186 93970 94667 95794 96190 95575 94729 94244 94137
$$ packed form
55561A27308K121J461J351Q28n91j672j448o80k96o0L38M30Q7mL60N29L94O47
55543A31103J295J424Q25L40L29L54N22J376K333K111Q70P9J31P0k58JN67j3j812
55524A41647l213l528l696l945l330k092j950l151l790k979k181k319k135q09
55510A02529K54k00j197j432j237j179o27O38J266M45n49m92j82o88j351j211
55494I4787q33r23p00M98J424P34o16p39L45J156J178R91P05M5n17l05K87M32
55476I7949K63L48M24k4m91j72M95L98m63j044q99o42p79j114j292j231j004p60
55458H9962o28n00j87Q6l0k24J28O75L40q63j494p59L58P32O65R13J289J224Q66
55439I2553N89K68k02l25J51O39O10L47J71j30m85k16O97J127L96o15q46m85j07
$$ plain form
55420 94137 94594 95949 97760 99012 99425 99650 100060 100400 100745 101638 102879 103206 101725 98866 95599 92448
55404 92448 89730 87911 87136 86877 86573 86297 86530 87545 89147 90677 91325 90864 90034 89803 90368 91322 92378
55387 92378 93269 93321 92121 90425 89474 89510 89847 90174 90685 91108 90897 90536 91306 93379 95307 95854 95298 94470
55369 94470 93583 92656 92097 92099 92178 92011 92110 92965 94060 94458 93955 93088 92285 91571 90919 90448 90328 90662 91271 91585
55349 91585 91094 90038 89253 89279 89977 91029 92284 93503 94323 94649 94656 94354 93615 92700 92213 92338 92659 92855 93084
55330 93084 93576 94265 94995 95620 95846 95424 94582 93895 93677 93870 94390 95050 95323 94825 94014 93762 94277 95030 95625
55311 95625 96022 96040 95490 94797 94575 94533 93763 92310 91497 92365 94623 97423 100235 102524 103482 102879 101612 100791
55293 100791 100612 100582 100417 100262 100328 100695 101250 101606 101430 100959 100794 101085 101387 101451 101558 101877 102086 101914 101567 101254
$$ packed form
55420I4137M57J355J811J252M13K25M10L40L45Q93J241L27j481k859l267l151
55404I2448k718j819p75k59l04k76K33J015J602J530O48m61q30k31N65R54J056
55387I2378Q91N2j200j696r51L6L37L27N11M23k11l61P70K073J928N47n56q28
55369I4470q87r27n59KP9j67R9Q55J095L98n03q67q03p14o52m71j20L34O09L14
55349I1585m91j056p85K6O98J052J255J219Q20L26Pl02p39r15m87J25L21J96K29
55330I3084M92O89P30O25K26m22q42o87k18J93N20O60K73m98q11k52N15P53N95
55311I5625L97J8n50o93k22m2p70j453q13Q68K258K800K812K289R58o03j267q21
55293A00791j79l0j65j55O6L67N55L56j76m71j65K91L02O4J07L19K09j72l47l13
$$ plain form
55273 101254 100783 100020 99362 99339 99943 100588 100635 99869 98686 97893 98042 98979 100217 101552 102932 103920 103871 102665
55255 102665 100865 99231 98401 98777 100123 101478 102052 101982 101714 101042 99623 98018 97140 96799 95934 94270 92665
55238 92665 91739 91274 91167 91772 92948 93793 93807 93466 93326 93404 93755 94695 96038 96985 97224 97288 97469 97315 96658
55219 96658 96203 96429 96767 96517 95911 95642 95927 96488 96908 96632 95348 93784 93341 94489 96226 97549 98553
55202 98553 99621 100509 100951 101391 102274 103280 103864 103937 103418 101951 99756 97980 97400 97463 97355 97205 97328 97079
55184 97079 95708 93875 93108 93937 95533 96996 98029 98475 98222 97693 97685 98468 99501 100089 100041 99777 100011 101067
55166 101067 102260 102417 101361 100372 100669 101925 102863 102869 102337 101831 101610 101760 102136 102331 102170 102071 102485 103271 104008
55147 104008 104540 104801 104567 103877 103280 103152 103266 103462 104148 105450 106542 106662 106228 106027 105830 104903 103547 102899
$$ packed form
55273A01254m71p63o58k3O04O45M7p66j183p93J49R37J238J335J380R88m9j206
55255A02665j800j634q30L76J346J355N74p0k68o72j419j605q78l41q65j664j605
55238I2665r26m65j07O05J176Q45J4l41j40P8L51R40J343R47K39O4J81j54o57
55219I6658m55K26L38k50o06k69K85N61M20k76j284j564m43J148J737J323J004
55202I8553J068Q88M42M40Q83J006N84P3n19j467k195j776n80O3j08j50J23k49
55184I7079j371j833p67Q29J596J463J033M46k53n29qP83J033N88m8k64K34J056
55166A01067J193J57j056r89K97J256R38On32n06k21J50L76J95j61r9M14P86P37
55147A04008N32K61k34o90n97j28J14J96O86J302J092J20m34k01j97r27j356o48
$$ plain form
55129 102899 103265 103841 104210 105009 106725 108721 109938 110007 109263 108116 106823 105548 104343 103175 102082 101174
55113 101174 100551 100374 100883 102057 103379 104246 104584 104870 105660 107263 109564 111848 113102 112959 112237 112170 113158
55096 113158 114537 115418 115486 115086 114783 114822 114964 115000 115279 116297 117839 119149 119984 120691 121109 120468 118820 117577
55078 117577 117796 118794 119304 119225 119194 119115 118436 117527 117548 118938 120999 122888 124119 124216 122948 121009 119544 118861
55060 118861 118367 117772 117536 117990 118876 119937 121179 122251 122251 120571 117530 113986 110712 108337 107306 107603
55044 107603 108714 109992 110921 111203 111009 111040 111803 112812 112956 111712 109635 107665 106336 105629 105240 104988 105188
55027 105188 106364 108318 109909 110326 110190 110654 111681 112087 111137 109245 107090 104993 103406 103105 104383 106524
55011 106524 108475 109758 110574 111368 112436 113629 114362 114216 113524 113000 112922 113126 113597 114431 115279 115552 115278 115141
$$ packed form
55129A02899L66N76L69P99J716J996J217O9p44j147j293j275j205j168j093r08
55113A01174o23j77N09J174J322Q67L38K86P90J603K301K284J254j43p22o7R88
55096A13158J379Q81O8m00l03L9J42L6K79J018J542J310Q35P07M18o41j648j243
55078A17577K19R98N10p9l1p9o79r09K1J390K061J889J231R7j268j939j465o83
55060A18861m94n95k36M54Q86J061J242J072%j680l041l544l274k375j031K97
55044A07603J111J278R29K82j94L1P63J009J44j244k077j970j329p07l89k52K00
55027A05188J176J954J591M17j36M64J027M06r50j892k155k097j587l01J278K141
55011A06524J951J283Q16P94J068J193P33j46o92n24p8K04M71Q34Q48K73k74j37
$$ plain form
54993 115141 115535 116194 116892 117820 119043 120154 120790 121039 121096 120964 120756 120824 121286 121816 122163 122513 123102 123776 124199
54974 124199 124208 123770 122912 121882 121098 120699 120429 120144 120115 120580 121272 121709 121863 122203 123040 124035 124477 124058 123258
54955 123258 122906 123395 124520 125994 127746 129625 131190 132035 132070 131342 129987 128556 127873 128162 128741 128940 128863
54938 128863 128860 128874 128870 129310 130362 131181 130919 130090 129950 130802 131996 133441 135885 139591 143869 148251 153129 158822
54920 158822 164914 170997 177360 184399 191821 198780 204384 207872 208880 207814 205438 201947 196943 190436
54906 190436 183201 175918 168730 161922 156304 152332 149423 146645 143767 141244 139544 138761 138583 138414 137909
54891 137909 137515 137978 139219 140319 140809 141293 142434 144105 145967 148280 151456 155288 159245 163233 167576
54876 167576 172529 178205 184655 191516 197871 202936 206643 209171 210262 209527 207192 203926 199929 194737
$$ packed form
54993A15141L94O59O98R28J223J111O36K49N7j32k08O8M62N30L47L50N89O74M23
54974A24199Rm38q58j030p84l99k70k85k9M65O92M37J54L40Q37R95M42m19q00
54955A23258l52M89J125J474J752J879J565Q45L5p28j355j431o83K89N79J99p7
54938A28863lJ4mM40J052Q19k62q29j40Q52J194J445K444L706M278M382M878N693
54920A58822O092O083O363P039P422O959N604L488J008j066k376l491n004o507
54906A90436p235p283p188o808n618l972k909k778k878k523j700p83j78j69n05
54891A37909l94M63J241J100M90M84J141J671J862K313L176L832L957L988M343
54876A67576M953N676O450O861O355N065L707K528J091p35k335l266l997n192
$$ plain form
54862 194737 188008 180236 172545 165904 160502 155769 151033 146198 141769 138359 136319 135607 135567 134994 133041
54847 133041 130188 127814 126715 126499 126414 126077 125177 123346 120868 118863 118163 118364 118557 118589 119004 120053 121403
54830 121403 122729 124003 125198 126109 126491 126181 125206 124005 123298 123425 123941 124116 123662 122745 121593 120501 120008
54813 120008 120534 121797 122913 123192 122732 122198 122120 122388 122435 121999 121575 121887 122978 124265 125506 127155 129508
54796 129508 131971 133588 134011 133579 132720 131709 130862 130594 131188 132651 134722 136888 138567 139457 139688 139615 139595
54779 139595 139961 140926 142383 144050 145821 147803 149973 152128 154222 156463 159068 162246 166390 171891 178704
54764 178704 186453 194866 203558 211482 217426 221259 223957 226045 226712 224855 220393 214073 206575 198433
54750 198433 190349 182883 176074 169880 164702 160987 158531 156681 155002 153402 151885 150647 150136 150510 151226
$$ packed form
54862A94737o729p772p691o641n402m733m736m835m429l410k040p12m0n73j953
54847A33041k853k374j099k16q5l37r00j831k478k005p00K01J93L2M15J049J350
54830A21403J326J274J195R11L82l10r75j201p07J27N16J75m54r17j152j092m93
54813A20008N26J263J116K79m60n34p8K68M7m36m24L12J091J287J241J649K353
54796A29508K463J617M23m32q59j011q47k68N94J463K071K166J679Q90K31p3k0
54779A39595L66R65J457J667J771J982K170K155K094K241K605L178M144N501O813
54764A78704P749Q413Q692P924N944L833K698K088O67j857m462o320p498q142
54750A98433q084p466o809o194n178l715k456j850j679j600j517j238n11L74P16
$$ plain form
54735 151226 151616 151631 151590 151453 150930 150229 150165 151432 154052 157503 161173 164807 168761 173663 179670 186234 192667
54718 192667 198577 203614 207325 209599 210769 210837 209105 205131 199566 193427 186962 180044 173307 167852 163828
54703 163828 160263 156553 153310 151356 150500 149863 149021 148299 148053 148117 148053 147645 146967 146073 144872 143379 141886
54686 141886 140632 139536 138502 137836 137827 138036 137634 136586 135750 135574 135375 134420 133067 132165 131771 131202 130104
54669 130104 128834 127900 127560 127834 128430 128800 128701 128514 128631 128828 128786 128851 129560 130624 131167 130968 130733 130989 131350
54650 131350 131094 130020 128554 127350 126883 127088 127312 126940 126088 125450 125476 126023 126706 127214 127329 127017 126590 126431
54632 126431 126598 126903 127350 128096 129095 130082 130913 131572 131914 131740 131143 130538 130405 131098 132592 134114 134467 133265
54614 133265 131582 130746 130724 130388 129231 128016 127613 127969 128521 129046 129736 130849 132470 134319 135627 135673 134663
$$ packed form
54735A51226L90J5m1j37n23p01o4J267K620L451L670L634L954M902O007O564O433
54718A92667N910N037L711K274J170O8j732l974n565o139o465o918o737n455m024
54703A63828l565l710l243j954q56o37q42p22k46O4o4m08o78q94j201j493j493
54686A41886j254j096j034o66rK09m02j048q36j76j99r55j353r02l94n69j098
54669A30104j270r34l40K74N96L70r9j87J17J97m2O5P09J064N43j99k35K56L61
54650A31350k56j074j466j204m67K05K24l72q52o38K6N47O83N08J15l12m27j59
54632A26431J67L05M47P46R99R87Q31O59L42j74n97o05j33O93J494J522L53j202
54614A33265j683q36k2l36j157j215m03L56N52N25O90J113J621J849J308M6j010
$$ plain form
54597 134663 133689 133654 134537 135810 137080 138095 138530 138190 137310 136383 135818 135805 136248 136692 136610 136014 135610 136074 137239
54578 137239 138129 137845 136300 134201 132363 131076 130165 129542 129447 130070 131215 132521 133766 134742 135142 134953 134742
54561 134742 135111 135950 136613 136771 136729 136944 137545 138305 138818 138751 138220 137819 138023 138746 139694 140850 142178 143212
54543 143212 143556 143645 144324 145706 147094 148057 148911 149936 150765 150908 150444 149839 149327 148811 148198 147636 147377 147428
54525 147428 147352 146657 145469 144469 143907 143158 141744 140287 139764 140159 140691 141145 141954 143061 143751 143860 144100
54508 144100 144785 145135 144360 142675 140724 138742 136939 136082 136844 138856 140983 142408 142954 142719 141932 141025
54492 141025 140332 139830 139434 139304 139459 139436 138856 138141 138110 138918 139883 140379 140480 140647 141148 141968 143007 144168 145279
54473 145279 146055 146243 145899 145521 145677 146444 147365 148040 148498 148881 149081 148994 148915 149344 150374 151542 152273 152315 151759
$$ packed form
54597A34663r74l5Q83J273J270J015M35l40q80r27n65j3M43M44q2n96m04M64J165
54578A37239Q90k84j545k099j838j287r11o23r5O23J145J306J245R76M00j89k11
54561A34742L69Q39O63J58m2K15O01P60N13o7n31m01K04P23R48J156J328J034
54543A43212L44Q9O79J382J388R63Q54J025Q29J43m64o05n12n16o13n62k59N1
54525A47428p6o95j188j000n62p49j414j457n23L95N32M54Q09J107O90J09K40
54508A44100O85L50p75j685j951j982j803q57P62K012K127J425N46k35p87r07
54492A41025o93n02l96j30J55k3n80p15l1Q08R65M96J01J67N01Q20J039J161J111
54473A45279P76J88l44l78J56P67R21O75M58L83K00q7p9M29J030J168P31M2n56
$$ plain form
54454 151759 150843 149804 148824 148008 147429 147168 147244 147459 147392 146680 145401 144060 143007 142024 140800 139798 140101
54437 140101 142136 144953 147128 148109 148361 148547 149030 149875 150689 150647 149326 147545 146833 147941 150194 152246
54421 152246 153098 152621 151649 151434 152469 153916 154713 154945 155355 155806 155361 153950 152758 152618 153022 153243 153456
54404 153456 154119 155047 155882 156775 157900 158878 159401 159864 160617 161182 161063 160847 161471 162714 163538 163810 164569 166344
54386 166344 168227 169108 169108 169176 169677 170002 169491 168295 167215 166862 167127 167456 167503 167308 166971 166504 166123 166258 166998
54367 166998 167822 168254 168508 169122 170113 170998 171651 172679 174789 177991 181583 184836 187669 190650 194306 198475
54351 198475 202535 206168 209562 212765 215257 216379 215894 213922 210707 206734 202714 199064 195605 192055
54337 192055 188544 185287 182113 178802 175655 173206 171433 169810 168138 166862 166443 166743 167180 167327 167246 167339
$$ packed form
54454A51759r16j039r80q16n79k61P6K15o7p12j279j341j053r83j224j002L03
54437A40101K035K817K175R81K52J86M83Q45Q14m2j321j781p12J108K253K052
54421A52246Q52m77r72k15J035J447P97K32M10M51m45j411j192j40M04K21K13
54404A53456O63R28Q35Q93J125R78N23M63P53N65j19k16O24J243Q24K72P59J775
54386A66344J883Q81%O8N01L25n11j196j080l53K65L29M7j95l37m67l81J35P40
54367A66998Q24M32K54O14R91Q85O53J028K110L202L592L253K833K981L656M169
54351A98475M060L633L394L203K492J122m85j972l215l973m020l650l459l550
54337A92055l511l257l174l311l147k449j773j623j672j276m19L00M37J47q1R3
$$ plain form
54321 167339 167801 168232 167986 167016 166069 165827 166162 166542 166831 167231 167628 167572 166873 165772 164516 163172 161904 161007
54303 161007 160501 160019 159250 158310 157515 156998 156682 156526 156642 157112 157726 158061 157990 158050 158973 160722 162264 162524 161443
54284 161443 159938 159011 159044 159805 160927 162375 164430 167000 169091 169528 168333 166834 166081 165713 164813 163355
54268 163355 162140 161625 161562 161664 161978 162571 163369 164333 165400 166289 166807 167272 168150 169359 170436 171312 172327
54251 172327 173405 173883 173420 172537 171935 171712 171591 171571 171849 172278 172377 171902 171117 170429 170034 169973 170262 170672 170539
54232 170539 169268 167160 165407 164843 165024 164976 164647 164885 166027 167346 168230 169069 170417 171910 172811 173238 174018
54215 174018 175469 177042 178112 178502 178230 177352 176106 174765 173292 171603 170139 169663 170376 171641 172619 172877
54199 172877 172425 171637 171090 171061 171155 170815 170120 169542 169044 168041 166370 164647 163485 162900 162681 162761 162942 162815
$$ packed form
54321A67339M62M31k46r70r47k42L35L80K89M00L97n6o99j101j256j344j268q97
54303A61007n06m82p69r40p95n17l16j56J16M70O14L35p1O0R23J749J542K60j081
54284A61443j505r27L3P61J122J448K055K570K091M37j195j499p53l68r00j458
54268A63355j215n15o3J02L14N93P98R64J067Q89N18M65Q78J209J077Q76J015
54251A72327J078M78m63q83o02k23j21k0K78M29R9m75p85o88l95o1K89M10j33
54232A70539j271k108j753n64J81m8l29K38J142J319Q84Q39J348J493R01M27P80
54215A74018J451J573J070L90k72q78j246j341j473j689j464m76P13J265R78K58
54199A72877m52p88n47k9R4l40o95n78m98j003j671j723j162n85k19Q0J81j27
$$ plain form
54181 162815 162361 162202 162835 163932 164805 165290 165755 166415 167044 167353 167339 167242 167275 167407 167371 166974 166401 166042 166032 166090
54161 166090 165874 165276 164380 163378 162565 162237 162537 163534 165302 167588 169523 170132 169292 167828 166591 165850 165645
54144 165645 166188 167553 169301 170802 171737 172078 171863 171339 171130 171801 173217 174598 175260 175189 174923 175014 175582 176255
54126 176255 176451 175842 174663 173652 173510 174223 174893 174541 173258 172281 172682 174218 175812 176942 178022 179486
54110 179486 181044 182037 182155 181605 180809 180176 179959 180270 181240 183051 185600 188262 190302 191528 192296 192979 193718
54093 193718 194529 195215 195292 194473 193192 192218 191787 191633 191765 192575 194132 196056 198247 201067 204555 208171 211738
54076 211738 215992 221669 228521 235732 242881 249918 256469 261682 264673 264808 261904 256582 250164 243767
54062 243767 237663 231811 226638 222682 219705 216833 213700 210968 209587 209757 210689 211248 210917 210339 210763 212734
$$ packed form
54181A62815m54j59O33J097Q73M85M65O60O29L09j4r7L3J32l6l97n73l59j0N8
54161A66090k16n98q96j002q13l28L00R97J768K286J935O09q40j464j237p41k05
54144A65645N43J365J748J501R35L41k15n24k09O71J416J381O62p1k66R1N68O73
54126A76255J96o09j179j011j42P13O70l52j283r77M01J536J594J130J080J464
54110A79486J558R93J18n50p96o33k17L11R70J811K549K662K040J226P68O83P39
54093A93718Q11O86P7q19j281r74m31j54J32Q10J557J924K191K820L488L616L567
54076B11738M254N677O852P211P149P037O551N213K991J35k904n322o418o397
54062B43767o104n852n173l956k977k872l133k732j381J70R32N59l31n78M24J971
$$ plain form
54046 212734 215480 217862 219742 222064 225685 230481 235570 240163 244193 248435 253959 261232 269709 278397
54032 278397 286716 294664 302361 309781 316886 323729 330405 336964 343271 348819 352946 355516 357247 359068
54018 359068 361273 363498 365289 366291 366100 364539 362127 359835 358102 356372 353770 350027 345582 340904
54004 340904 335852 329794 322347 313991 305720 298066 290728 283367 276326 270177 264836 259741 254814 250618
53990 250618 247401 244521 241160 237256 233472 230540 228836 228310 228457 228512 228035 227261 226686 226407 226104 225554 224823
53973 224823 223962 222880 221641 220610 220109 220127 220567 221490 222790 223814 223856 223086 222537 222934 223968 224963 225836
53956 225836 226923 228233 229491 230732 232258 234081 236094 238731 242647 247581 252355 256352 260208 264559
53942 264559 268933 272712 276598 282087 289690 298621 308116 318045 328132 337610 346169 354512 363444 372899
$$ packed form
54046B12734K746K382J880K322L621M796N089M593M030M242N524P273Q477Q688
54032B78397Q319P948P697P420P105O843O676O559O307N548M127K570J731J821
54018C59068K205K225J791J002j91j561k412k292j733j730k602l743m445m678
54004C40904n052o058p447q356q271p654p338p361p041o149n341n095m927m196
53990B50618l217k880l361l904l784k932j704n26J47N5m77p74n75k79l03n50p31
53973B24823q61j082j239j031n01J8M40R23J300J024M2p70n49L97J034R95Q73
53956B25836J087J310J258J241J526J823K013K637L916M934M774L997L856M351
53942B64559M374L779L886N489P603Q931R495R929J0087R478Q559Q343Q932R455
$$ plain form
53928 372899 382488 392616 404378 418522 435019 453531 473601 494104 512949 527813 537241 540995
53916 540995 539644 534179 526117 517525 510375 505641 503138 502281 502706 504053 505521 506157 505601 504175 502167
53901 502167 499334 495253 489971 484072 478211 472662 467286 461796 456021 449855 442976 434854 425259 414720
53887 414720 404172 394184 384670 375382 366337 357698 349534 341907 334979 328811 323200 317945 313143 308984
53873 308984 305276 301438 297034 292197 287408 282935 278593 274055 269340 264859 260998 257768 254976 252570
53859 252570 250583 248802 246836 244595 242403 240494 238705 236967 235726 235431 235702 235570 234618 233443 232735
53844 232735 232342 231606 230362 229101 228242 227668 227102 226570 226316 226454 226853 227224 227241 226727 225894 225265 225261 225912 226948
53825 226948 228022 228774 228981 228834 228842 229294 229965 230574 231264 232288 233401 234076 234349 235031 236925 240120 244154
$$ packed form
53928C72899R589J0128J1762J4144J6497J8512K0070K0503J8845J4864R428L754
53916E40995j351n465q062q592p150m734k503q57M25J347J468O36n56j426k008
53901E02167k833m081n282n899n861n549n376n490n775o166o879q122r595j0539
53887D14720j0548r988r514r288r045q639q164p627o928o168n611n255m802m159
53873C08984l708l838m404m837m789m473m342m538m715m481l861l230k792k406
53859B52570j987j781j966k241k192j909j789j738j241k95K71j32r52j175p08
53844B32735l93p36j244j261q59n74n66n32k54J38L99L71J7n14q33o29mO51J036
53825B26948J074P52K07j47QM52O71O09O90J024J113O75K73O82J894L195M034
$$ plain form
53808 244154 248537 252946 257212 261502 266413 272589 280076 288126 295701 302271 308179 314193 320596 326836
53794 326836 332217 336774 341138 345571 349500 352126 353208 353148 352604 352178 352127 352121 351410 349500 346550 342934 338677
53777 338677 333532 327518 321081 314825 309209 304413 300239 296201 291890 287242 282339 277109 271470 265753
53763 265753 260762 257263 255346 254223 252721 250206 247101 244319 242160 240111 237786 235625 234216 233310
53749 233310 232040 230076 228041 226706 226192 226030 225687 224836 223493 222140 221504 221961 223143 224267 224766 224576
53733 224576 223991 223433 223275 223657 224383 225047 225257 224791 223746 222664 222392 223496 225690 227995 229596 230490 231171
53716 231171 231842 232192 231983 231559 231622 232639 234575 236975 239162 240561 241190 241745 242937 244756 246606 248107
53700 248107 249461 251112 253349 256248 259718 263522 267506 271749 276128 279811 281757 281903 281386 281305 281689
$$ packed form
53808B44154M383M409M266M290M911O176P487Q050P575O570N908O014O403O240
53794C26836N381M557M364M433L929K626J082o0n44m26n1op11j910k950l616m257
53777C38677n145o014o437o256n616m796m174m038m311m648m903n230n639n717
53763B65753m991l499j917j123j502k515l105k782k159k049k325k161j409r06
53749B33310j270j964k035j335n14j62l43q51j343j353o36M57J182J124M99j90
53733B24576n85n58j58L82P26O64K10m66j045j082k72J104K194K305J601Q94O81
53716B31171O71L50k09m24O3J017J936K400K187J399O29N55J192J819J850J501
53700B48107J354J651K237K899L470L804L984M243M379L683J946J46n17q1L84
$$ plain form
53685 281689 281984 282054 282191 282417 282382 281947 281376 280941 280624 280246 279605 278495 276861 275022 273565 272957 273299 274361
53667 274361 275686 276751 277240 277193 276835 276351 275924 275814 276178 276858 277526 277978 278239 278391 278399 278052 277158 275997 275513
53648 275513 276618 279086 281485 282547 282418 282265 282855 283876 284586 284779 285069 286321 288769 291639 293800 294878
53632 294878 295499 296376 297477 298277 298469 298144 297632 297548 298655 301164 304306 307038 309064 310834 312711 314661
53616 314661 316661 318921 321623 324735 328191 331964 335931 339880 343618 346951 349726 352108 354661 357914
53602 357914 361986 366779 372251 378211 384186 389850 395219 400041 403418 404767 404833 404959 405428 405306 403893
53587 403893 401482 398579 395259 391726 388788 387112 386401 385719 384435 382481 379980 377069 374053 371389 369435
53572 369435 368263 367718 367624 367941 368621 369298 369401 368744 367739 366770 365747 364657 364185 365061 367008 369020 370631
$$ packed form
53685B81689K95P0J37K26l5m35n71m35l17l78o41j110j634j839j457o08L42J062
53667B74361J325J065M89m7l58m84m27j10L64O80O68M52K61J52Ql47q94j161m84
53648B75513J105K468K399J062j29j53N90J021P10J93K90J252K448K870K161J078
53632B94878O21Q77J101Q00J92l25n12q4J107K509L142K732K026J770J877J950
53616C14661K000K260K702L112L456L773L967L949L738L333K775K382K553L253
53602C57914M072M793N472N960N975N664N369M822L377J349O6J26M69j22j413
53587D03893k411k903l320l533k938j676p11o82j284j954k501k911l016k664j954
53572C69435j172n45r4L17O80O77J03o57j005r69j023j090m72Q76J947K012J611
$$ plain form
53555 370631 372161 373774 375114 376071 377045 378139 378767 378521 377874 377546 377664 377990 378569 379695 381556 384246
53539 384246 387867 392209 396630 400575 404019 407191 410226 413377 417182 422024 427766 434139 441197 449100
53525 449100 457730 466908 476717 487192 497913 508318 518346 528440 539034 550344 562528 575731
53513 575731 589993 605354 622004 640071 659272 678981 698753 718752 739594 761617 784215
53502 784215 806156 826783 846715 866967 887594 907755 926903 945187 962696 979208 994961
53491 994961 1010861 1027439 1044246 1060715 1076960 1093204 1109102 1124306 1139209 1154405 1169862
53480 1169862 1185341 1201195 1217854 1234810 1250974 1265940 1280043 1293161 1304343 1312782 1318578 1322320
53468 1322320 1324440 1325069 1324017 1320692 1314559 1305896 1295786 1285240 1274588 1263802 1252949 1242203 1231650
$$ packed form
53555C70631J530J613J340R57R74J094O28k46o47l28J18L26N79J126J861K690
53539C84246L621M342M421L945L444L172L035L151L805M842N742O373P058P903
53525D49100Q630R178R809J0475J0721J0405J0028J0094J0594J1310J2184J3203
53513E75731J4262J5361J6650J8067J9201J9709J9772J9999K0842K2023K2598
53502G84215K1941K0627J9932K0252K0627K0161J9148J8284J7509J6512J5753
53491I94961J5900J6578J6807J6469J6245J6244J5898J5204J4903J5196J5457
53480A169862J5479J5854J6659J6956J6164J4966J4103J3118J1182Q439N796L742
53468A322320K120O29j052l325o133q663j0110j0546j0652j0786j0853j0746j0553
$$ plain form
53455 1231650 1221170 1210297 1198233 1184354 1168788 1152263 1135447 1118706 1102386 1086811 1071949
53444 1071949 1057432 1043037 1028883 1015192 1002260 990676 981094 973575 967483 962280 958153 955714
53432 955714 955217 956227 957883 959458 960825 962459 964897 968265 972398 977205 982645 988572 995055 1002676
53418 1002676 1012047 1023069 1035184 1048323 1063036 1079589 1097502 1116216 1135664 1155985 1177206
53407 1177206 1199623 1223979 1250697 1279150 1308199 1337344 1366999 1397842 1430362 1464954 1501911
53396 1501911 1541127 1582084 1624329 1667858 1712907 1759382 1806531 1853199 1898597 1942959 1987345
53385 1987345 2032643 2078788 2124961 2170314 2214262 2256304 2295958 2332928 2367030 2397912 2425148
53374 2425148 2448657 2468666 2485089 2497266 2504700 2507710 2506859 2501835 2491554 2475496 2454349 2429038
$$ packed form
53455A231650j0480j0873j2064j3879j5566j6525j6816j6741j6320j5575j4862
53444A071949j4517j4395j4154j3691j2932j1584r582p519o092n203m127k439
53432I55714m97J010J656J575J367J634K438L368M133M807N440N927O483P621
53418A002676R371J1022J2115J3139J4713J6553J7913J8714J9448K0321K1221
53407A177206K2417K4356K6718K8453K9049K9145K9655L0843L2520L4592L6957
53396A501911L9216M0957M2245M3529M5049M6475M7149M6668M5398M4362M4386
53385A987345M5298M6145M6173M5353M3948M2042L9654L6970L4102L0882K7236
53374B425148K3509K0009J6423J2177P434L010q51n024j0281j6058k1147k5311
$$ plain form
53362 2429038 2399705 2366201 2329162 2289820 2248864 2206320 2162589 2118815 2075879 2033683 1991942
53351 1991942 1951218 1912639 1876811 1843493 1812094 1781985 1752438 1722775 1692717 1662460 1632526
53340 1632526 1603657 1576545 1551272 1527272 1504182 1482509 1462981 1445563 1429738 1415665 1404225
53329 1404225 1395700 1388988 1382412 1374929 1366306 1356558 1345618 1333337 1319523 1304130 1287640 1271109
53317 1271109 1255573 1241435 1228471 1216230 1204276 1192302 1180394 1169283 1160103 1153523 1149019 1145138
53305 1145138 1140804 1136405 1133337 1132405 1133032 1134217 1135861 1138739 1143570 1150683 1160393 1172944 1188020 1204843
53291 1204843 1222944 1242376 1263131 1284842 1307168 1329908 1352446 1373638 1392676 1409789 1425791
53280 1425791 1441164 1455743 1468931 1479907 1487938 1492860 1495110 1495081 1492656 1487588 1479962 1469996 1457658
$$ packed form
53362B429038k9333l3504l7039l9342m0956m2544m3731m3774m2936m2196m1741
53351A991942m0724l8579l5828l3318l1399l0109k9547k9663l0058l0257k9934
53340A632526k8869k7112k5273k4000k3090k1673j9528j7418j5825j4073j1440
53329A404225q525o712o576p483q623r748j0940j2281j3814j5393j6490j6531
53317A271109j5536j4138j2964j2241j1954j1974j1908j1111r180o580m504l881
53305A145138m334m399l068r32O27J185J644K878M831P113R710J2551J5076J6823
53291A204843J8101J9432K0755K1711K2326K2740K2538K1192J9038J7113J6002
53280A425791J5373J4579J3188J0976Q031M922K250k9k425n068p626r966j2338
$$ plain form
53267 1457658 1442909 1426167 1408170 1389484 1370325 1350623 1329937 1307569 1283313 1258092 1233477
53256 1233477 1210466 1188843 1167612 1145809 1123108 1100075 1077871 1057340 1038330 1020079 1002139
53245 1002139 984527 967042 949093 930457 911758 893800 876698 860073 843938 828866 815251
53234 815251 802814 791006 779606 768753 758653 749566 741836 735519 729953 724089 717364 709936 701980
53221 701980 693188 683273 672553 661443 649530 635776 619772 602329 584646 567373 550771 535352
53209 535352 521815 510394 500619 491776 483352 475087 466811 458386 449739 440903 432001 423139 414364 405726
53195 405726 397237 388641 379464 369649 360085 351989 345683 340377 335308 330519 326285 322347 318347 314566
53181 314566 311483 308756 305404 301090 296660 293250 291297 290492 290165 289504 287950 285774 283931 282978 282442
$$ packed form
53267A457658j4749j6742j7997j8686j9159j9702k0686k2368k4256k5221k4615
53256A233477k3011k1623k1231k1803k2701k3033k2204k0531j9010j8251j7940
53245A002139j7612j7485j7949j8636j8699j7958j7102j6625j6135j5072j3615
53234H15251j2437j1808j1400j0853j0100r087p730o317n566n864o725p428p956
53221G01980q792r915j0720j1110j1913j3754j6004j7443j7683j7273j6602j5419
53209E35352j3537j1421r775q843q424q265q276q425q647q836q902q862q775q638
53195D05726q489q596r177r815r564q096o306n306n069m789m234l938m000l781
53181C14566l083k727l352m314m430l410j953q05l27o61j554k176j843r53n36
$$ plain form
53166 282442 281559 280295 279195 278474 277780 276814 275674 274563 273513 272507 271568 270620 269572 268587 267953 267590
53150 267590 266993 265887 264611 263668 263157 262954 263134 263794 264568 264831 264429 263886 263810 264353 265249 266081 266456 266318
53132 266318 266215 266906 268469 270153 271297 272052 272846 273520 273533 272888 272290 272328 272932 273682 274294 274696 274984 275456
53114 275456 276409 277728 278960 279858 280508 280828 280412 279248 278148 277924 278297 278221 277267 276080 275291 274576 273236
53097 273236 271296 269436 267941 266359 264390 262574 261705 261826 262226 262361 262343 262502 262880 263328 263828 264388 264778
53080 264778 264663 263981 263003 262050 261372 261278 262081 263668 265267 265940 265455 264530 264020 263981 263765 263044 262330 262271 262741
53061 262741 263035 262833 262475 262329 262366 262426 262454 262286 261650 260634 259805 259618 260004 260697 261564 262340 262581 262267 262081
53042 262081 262606 263620 264611 265537 266431 266706 265734 264031 262960 263159 263984 264571 264745 264632 264125 263166 262133
$$ packed form
53166B82442q83j264j100p21o94r66j140j111j050j006r39r48j048r85o34l63
53150B67590n97j106j276r43n11k03J80O60P74K63m02n43p6N43Q96Q32L75j38
53132B66318j03O91J563J684J144P55P94O74J3o45n98L8O04P50O12M02K88M72
53114B75456R53J319J232Q98O50L20m16j164j100k24L73p6r54j187p89p15j340
53097B73236j940j860j495j582j969j816q69J21M00J35j8J59L78M48N00N60L90
53080B64778j15o82r78r53o78r4Q03J587J599O73m85r25n10l9k16p21p14n9M70
53061B62741K94k02l58j46L7O0K8j68o36j016q29j87L86O93Q67P76K41l14j86
53042B62081N25J014R91R26Q94K75r72j703j071J99Q25N87J74j13n07r59j033
$$ plain form
53025 262133 261510 261452 261826 262359 262599 262176 261341 260911 261416 262606 263906 265044 266061 267131 268482 270147 271597
53008 271597 272095 271614 270978 270924 271453 272289 273375 274528 275167 274949 274257 273579 272727 271263 269404 267881 267054
52991 267054 266719 266753 267402 268885 271031 273413 275641 277584 279490 281775 284509 287240 289467 291103 292319
52976 292319 293316 294465 296338 299115 302252 305071 307435 309426 310725 310916 310215 309331 308634 307961 307177 306437
52960 306437 305945 305893 306525 307764 308843 308877 307800 306227 304450 302241 299640 297201 295168 293091 290639 288251
52944 288251 286486 285189 283833 282394 281305 280682 280144 279457 278974 279217 280209 281330 281804 281241 279770 277757
52928 277757 275617 273945 273468 274392 275858 276516 275840 274519 273475 272877 272379 271840 271387 271056 270857 271017 271688
52911 271688 272440 272570 272034 271612 271921 272554 272511 271324 269465 267768 266740 266492 267057 268451 270389 272156 273021
$$ packed form
53025B62133o23n8L74N33K40m23q35m30N05J190J300J138J017J070J351J665J450
53008B71597M98m81o36n4N29Q36J086J153O39k18o92o78q52j464j859j523q27
52991B67054l35L4O49J483K146K382K228J943J906K285K734K731K227J636J216
52976B92319R97J149J873K777L137K819K364J991J299J91p01q84o97o73p84p40
52960C06437m92n2O32J239J079L4j077j573j777k209k601k439k033k077k452k388
52944B88251j765j297j356j439j089o23n38o87m83K43R92J121M74n63j471k013
52928B77757k140j672m77R24J466O58o76j321j044n98m98n39m53l31j99J60O71
52911B71688P52J30n36m22L09O33m3j187j859j697j028k48N65J394J938J767Q65
$$ plain form
52894 273021 272831 272127 271585 271462 271703 272357 273535 274886 275584 275163 274152 273497 273448 273406 272809 271688 270289 268684
52876 268684 267096 266145 266265 267176 268354 269823 271907 274325 276178 276991 277287 278005 279694 282351 285597 288837
52860 288837 291629 294018 296165 297624 297578 295959 293784 292031 290661 289062 286896 284116 280751 277245 274438
52845 274438 272491 270252 266578 262061 258541 256922 256319 255448 254054 252715 251928 251797 252083 252204 251579 250371
52829 250371 249529 249763 250677 251203 250753 249713 248923 248849 249175 249163 248529 247869 247987 248930 250072 251068 252205 253717
52811 253717 255346 256878 258588 260716 262904 264634 265982 267435 269079 270419 270905 270251 268258 264857 260486
52796 260486 256117 252654 250375 249036 248296 247927 247758 247628 247404 246993 246386 245787 245657 246454 248244 250599 252969
52779 252969 255093 257024 258834 260468 261846 262950 263763 264272 264525 264501 263927 262526 260538 258719 257601 257046
$$ packed form
52894B73021j90p04n42j23K41O54J178J351O98m21j011o55m9m2n97j121j399j605
52876B68684j588r51J20R11J178J469K084K418J853Q13K96P18J689K657L246L240
52860B88837K792K389K147J459m6j619k175j753j370j599k166k780l365l506k807
52845B74438j947k239l674m517l520j619o03q71j394j339p87j31K86J21o25j208
52829B50371q42K34R14N26m50j040p90p4L26j2o34o60J18R43J142R96J137J512
52811B53717J629J532J710K128K188J730J348J453J644J340M86o54j993l401m371
52796B60486m369l463k279j339p40l69j69j30k24m11o07n99j30P97J790K355K370
52779B52969K124J931J810J634J378J104Q13N09K53k4n74j401j988j819j118n55
$$ plain form
52763 257046 256711 256606 256816 256989 256621 255720 254723 253878 253222 253122 254157 256293 258690 260566 261834 262731 263319
52746 263319 263732 264438 265773 267394 268662 269401 269932 270484 271023 271684 272948 275163 278076 281025 283496 285398
52730 285398 286891 288128 289226 290305 291324 291918 291629 290413 288699 286826 284736 282512 280843 280297 280282
52715 280282 279423 277222 274748 273347 273067 272826 271805 270205 268757 267944 267747 267853 268022 268384 269337 271014
52699 271014 272978 274608 275694 276490 277277 278144 279087 279980 280409 279898 278549 277298 277205 278429 280019 280803 280406
52682 280406 279343 278273 277410 276617 275789 274955 274176 273595 273407 273569 273599 272978 271747 270485 269700 269495 269773 270397
52664 270397 271009 271013 270062 268506 267239 267032 267942 269298 270305 270791 271361 272724 275010 277820 280645 282996
52648 282996 284398 284777 284688 284655 284439 283546 282366 281979 282614 283179 282796 282079 282179 283100 283854 284144 284999 287541
$$ packed form
52763B57046l35j05K10J73l68r01r97q45o56j00J035K136K397J876J268Q97N88
52746B63319M13P06J335J621J268P39N31N52N39O61J264K215K913K949K471J902
52730B85398J493J237J098J079J019N94k89j216j714j873k090k224j669n46j5
52715B80282q59k201k474j401k80k41j021j600j448q13j97J06J69L62R53J677
52699B71014J964J630J086P96P87Q67R43Q93M29n11j349j251r3J224J590P84l97
52682B80406j063j070q63p93q28q34p79n81j88J62L0o21j231j262p85k05K78O24
52664B70397O12Mr51j556j267k07R10J356J007M86N70J363K286K810K825K351
52648B82996J402L79q9l3k16q93j180l87O35N65l83p17J00R21P54K90Q55K542
$$ plain form
52630 287541 291767 296779 301902 307245 313387 320671 328705 336380 342387 345777 346060 343019 336746 327972
52616 327972 318147 308895 301219 295184 290407 286763 284453 283364 282764 281946 280973 280353 280127 279785 279114 278525
52600 278525 278370 278439 278439 278519 278942 279531 279846 279730 279368 278963 278641 278538 278751 279290 280141 281170 281920 281911 281383 281285 282207
52579 282207 283641 284708 285209 285522 285790 285837 285708 285673 285679 285333 284484 283484 282818 282762 283373 284417 285299 285408 284683
52560 284683 283634 282811 282370 282089 281579 280571 279226 278042 277275 276617 275663 274427 273120 271748 270396 269635
52544 269635 270016 271242 272428 273138 273613 273974 273913 273385 272969 273203 273957 274852 275900 277340 279081 280705 281889
52527 281889 282564 282706 282288 281553 281129 281722 283526 285927 287958 289259 290465 292412 295087 297718 299854 301901
52511 301901 304452 307456 310393 313043 315732 318746 321703 323679 324048 323059 321372 319086 315693 311205 306805
$$ packed form
52630B87541M226N012N123N343O142P284Q034P675O007L390K83l041o273q774
52616C27972r825r252p676o035m777l644k310j089o00q18r73o20k26l42o71n89
52600B78525j55O9%Q0M23N89L15j16l62m05l22j03K13N39Q51J029P50rn28r8R22
52579B82207J434J067N01L13K68M7j29l5Ol46q49j000o66n6O11J044Q82J09p25
52560B84683j049q23m41k81n10j008j345j184p67o58r54j236j307j372j352p61
52544B69635L81J226J186P10M75L61o1n28m16K34P54Q95J048J440J741J624J184
52527B81889O75J42m18p35m24N93J804K401K031J301J206J947K675K631K136K047
52511C01901K551L004K937K650K689L014K957J976L69r89j687k286l393m488m400
$$ plain form
52496 306805 303811 302194 300683 298306 295296 292493 290411 289026 288015 286995 285852 284924 284590 284741 285092
52481 285092 285881 287561 289692 291032 291113 291028 291996 293756 295114 295682 296149 296980 297787 298264 299017 300973 304309
52464 304309 308373 312477 316426 320355 324314 328098 331295 333428 334183 333570 331867 329364 326174 322370 318169
52449 318169 313854 309520 305160 301064 297832 295809 294710 293999 293426 292883 292075 290808 289480 288690 288407 288033
52433 288033 287329 286646 286108 285319 284196 283458 283697 284481 285019 285380 286313 287974 289557 290312 290385 290458 290961 291846
52415 291846 292891 294041 295537 297811 301096 305130 309426 313780 318394 323611 329844 337720 347803 359871
52401 359871 372615 384269 393495 399646 402403 401508 396985 389466 380190 370529 361454 353454 346830 341845
52387 341845 338430 335921 333458 330776 328482 327438 327895 329302 330845 332131 333349 334914 337017 339515
$$ packed form
52496C06805k994j617j511k377l010k803k082j385j011j020j143r28l34J51L51
52481B85092P89J680K131J340Q1q5R68J760J358N68M67Q31Q07M77P53J956L336
52464C04309M064M104L949L929L959L784L197K133P55o13j703k503l190l804m201
52449C18169m315m334m360m096l232k023j099p11n73n43q08j267j328p90k83l74
52433B88033p04o83n38p89j123p38K39P84N38L61R33J661J583P55P3P3N03Q85
52415B91846J045J150J496K274L285M034M296M354M614N217O233P876J0083J2068
52401C59871J2744J1654R226O151K757q95m523p519r276r661r075q000o624m985
52387C41845l415k509k463k682k294j044M57J407J543J286J218J565K103K498
$$ plain form
52373 339515 342192 345052 348372 352534 357781 364015 370731 377140 382406 385871 387291 387050 386031 385028
52359 385028 384173 383064 381462 379649 378114 377153 376871 377357 378617 380458 382579 384737 386817 388952 391589
52344 391589 395151 399471 403852 407909 411964 416392 420938 425201 429506 434663 440966 448071 455914 465059
52330 465059 475881 487994 500874 514604 529533 545567 562362 580032 599066 619550 640928
52319 640928 662640 684588 706847 729269 751648 774053 796770 820021 843842 868180 892990
52308 892990 918279 944093 970341 996628 1022434 1047566 1072258 1096734 1120754 1143715 1165033
52297 1165033 1184393 1201780 1217323 1230811 1241202 1247065 1247928 1244976 1239932 1233389 1224771 1213875 1201730
52284 1201730 1189697 1178271 1167151 1156073 1145125 1134545 1124694 1116099 1109075 1103407 1098741 1095230
$$ packed form
52373C39515K677K860L320M162N247O234O716O409N266L465J420k41j019j003
52359C85028q55j109j602j813j535r61k82M86J260J841K121K158K080K135K637
52344C91589L562M320M381M057M055M428M546M263M305N157O303P105P843R145
52330D65059J0822J2113J2880J3730J4929J6034J6795J7670J9034K0484K1378
52319F40928K1712K1948K2259K2422K2379K2405K2717K3251K3821K4338K4810
52308H92990K5289K5814K6248K6287K5806K5132K4692K4476K4020K2961K1318
52297A165033J9360J7387J5543J3488J0391N863Q63k952n044o543q618j0896j2145
52284A201730j2033j1426j1120j1078j0948j0580r851q595p024n668m666l511
$$ plain form
52272 1095230 1093454 1093784 1096218 1100820 1107915 1117663 1129684 1143212 1157498 1172057 1186799 1201999 1217969
52259 1217969 1234720 1252101 1270201 1289338 1309596 1330634 1351964 1373126 1393508 1412289 1428721
52248 1428721 1442309 1452640 1459288 1462093 1461303 1457254 1450081 1439956 1427417 1413161 1397501 1380340
52236 1380340 1361794 1342602 1323628 1304921 1285549 1264680 1242725 1221003 1200230 1179812 1158986
52225 1158986 1138222 1118941 1102052 1087388 1074454 1062948 1052432 1042337 1032805 1024938 1019564 1016078
52213 1016078 1013133 1010265 1008233 1007822 1008905 1010834 1013186 1015848 1018694 1021519 1024228 1026912 1029777 1033068
52199 1033068 1036947 1041336 1045939 1050507 1055087 1059946 1065310 1071200 1077422 1083656 1089554 1094916 1099796 1104293
52185 1104293 1108122 1110520 1110787 1108911 1105424 1100643 1094408 1086647 1077772 1068172 1057732 1046476 1035491
$$ packed form
52272A095230j776L30K434M602P095R748J2021J3528J4286J4559J4742J5200J5970
52259A217969J6751J7381J8100J9137K0258K1038K1330K1162K0382J8781J6432
52248A428721J3588J0331O648K805p90m049p173j0125j2539j4256j5660j7161
52236A380340j8546j9192j8974j8707j9372k0869k1955k1722k0773k0418k0826
52225A158986k0764j9281j6889j4664j2934j1506j0516j0095r532p867n374l486
52213A016078k945k868k032m11J083J929K352K662K846K825K709K684K865L291
52199A033068L879M389M603M568M580M859N364N890O222O234N898N362M880M497
52185A104293L829K398K67j876l487m781o235p761q875r600j0440j1256j0985
$$ plain form
52172 1035491 1026433 1019882 1014763 1009710 1004584 1000276 997462 996111 996006 997147 999482 1002694 1006491 1010939
52158 1010939 1016235 1022142 1027880 1032665 1036305 1039077 1041076 1042014 1041819 1041091 1040664 1040952 1042086 1044400 1048126
52143 1048126 1052666 1056889 1060415 1064029 1068508 1073553 1078214 1081932 1084765 1087033 1089348 1092802 1098507 1106895
52129 1106895 1117745 1130854 1146416 1164802 1186247 1210657 1237575 1266412 1296936 1329377 1363937
52118 1363937 1400345 1438004 1476242 1514221 1550965 1585849 1618823 1649888 1678680 1704910 1728863
52107 1728863 1750952 1771069 1788876 1804572 1818817 1832009 1844115 1855090 1864952 1873489 1880335 1885285
52095 1885285 1888071 1887961 1884091 1876178 1864412 1848746 1828911 1805137 1778289 1749218 1718596 1687488
52083 1687488 1657447 1629778 1605099 1583675 1565571 1550310 1537106 1525804 1517018 1510975 1506849 1503897
$$ packed form
52172A035491r058o551n119n053n126m308k814j351j05J141K335L212L797M448
52158A010939N296N907N738M785L640K772J999R38j95p28m27K88J134K314L726
52143A048126M540M223L526L614M479N045M661L718K833K268K315L454N705Q388
52129A106895J0850J3109J5562J8386K1445K4410K6918K8837L0524L2441L4560
52118A363937L6408L7659L8238L7979L6744L4884L2974L1065K8792K6230K3953
52107A728863K2089K0117J7807J5696J4245J3192J2106J0975R862Q537O846M950
52095A885285K786j10l870p913j1766j5666j9835k3774k6848k9071l0622l1108
52083A687488l0041k7669k4679k1424j8104j5261j3204j1302q786o043m126k952
$$ plain form
52071 1503897 1502774 1504998 1511237 1520711 1532246 1545426 1560556 1577820 1596704 1616281 1636129 1656755
52059 1656755 1678780 1701688 1723923 1744462 1763790 1782988 1802266 1820838 1837770 1852280 1863474
52048 1863474 1870545 1873367 1872375 1867802 1859443 1847211 1831420 1812509 1790972 1767679 1743647 1719198
$$ packed form
52071A503897j123K224O239R474J1535J3180J5130J7264J8884J9577J9848K0626
52059A656755K2025K2908K2235K0539J9328J9198J9278J8572J6932J4510J1194
52048A863474P071K822r92m573q359j2232j5791j8911k1537k3293k4032k4449
$$ [...]
##END NTUPLES=NMR SPECTRUM
##END=
