##TITLE=AC1635_CENAH_8493933_VXAgfACdkY
##JCAMPDX= 6.0         $$ Bruker NMR JCAMP-DX V2.0
##DATA TYPE= NMR SPECTRUM
##DATA CLASS= NTUPLES
##ORIGIN= BRUKER
##OWNER= Administrator
$$ 1.72 TOPSPIN		Version 2.1
$$ 2014-02-18 19:08:01.553 -0800  Administrator@X
$$ Compression mode = diff/dup
##.OBSERVE FREQUENCY= 400.02188249412
##.OBSERVE NUCLEUS= ^1H
##.ACQUISITION MODE= SIMULTANEOUS (DQD)
##.ACQUISITION SCHEME= undefined
##.AVERAGES= 8
##.DIGITISER RES= 22
##SPECTROMETER/DATA SYSTEM= spect
##.PULSE SEQUENCE= zg30
##.SOLVENT NAME= COFFEE_meoh
##.SHIFT REFERENCE= INTERNAL, COFFEE_meoh, 1, 14.98509
##AUDIT TRAIL= $$ (NUMBER, WHEN, WHO, WHERE, PROCESS, VERSION, WHAT)
$$ ##TITLE= Audit trail, TOPSPIN		Version 2.1
$$ ##JCAMPDX= 5.01
$$ ##ORIGIN= Bruker BioSpin GmbH
$$ ##OWNER= Administrator
$$ $$ E:\/data/COFFEE/nmr/AC1635_CENAH_8493933_VXAgfACdkY/10/pdata/1/auditp.txt
$$ ##AUDIT TRAIL=  $$ (NUMBER, WHEN, WHO, WHERE, PROCESS, VERSION, WHAT)
(   1,<2014-02-18 19:07:54.991 -0800>,<Administrator>,<X>,<go>,<TOPSPIN 2.1>,
      <created by zg
	started at 2014-02-18 19:06:49.131 -0800,
	POWCHK enabled, PULCHK disabled,
       configuration hash MD5:
       C8 4E 4E 5D D3 5C D8 9E 9F 52 82 E0 59 8A DE 15
       data hash MD5: 64K
       21 37 C9 23 F9 9F 28 C3 75 ED 33 17 36 23 BC 83>)
(   2,<2014-02-18 19:07:57.866 -0800>,<Administrator>,<X>,<proc1d>,<TOPSPIN 2.1>,
      <Start of raw data processing
       efp LB = 0 FT_mod = 6 PKNL = 1 PHC0 = 0 PHC1 = 0 SI = 32K 
       data hash MD5: 32K
       5D E5 08 0C DC 02 C0 5A 6A 42 D7 6F 61 63 96 D9>)
(   3,<2014-02-18 19:07:58.147 -0800>,<Administrator>,<X>,<proc1d>,<TOPSPIN 2.1>,
      <pk PHC0 = 95.39429 PHC1 = 0 
       data hash MD5: 32K
       53 54 68 B9 F7 30 1D A1 F7 96 43 F6 E8 4D EA 9A>)
(   4,<2014-02-18 19:07:58.225 -0800>,<Administrator>,<X>,<proc1d>,<TOPSPIN 2.1>,
      <abs ABSG = 1 
       data hash MD5: 32K
       18 04 91 AC E3 CA B4 0A E7 9D EB 34 9C BE 17 E4>)
(   5,<2014-02-18 19:07:58.288 -0800>,<Administrator>,<X>,<proc1d>,<TOPSPIN 2.1>,
      <abs ABSG = 2 
       data hash MD5: 32K
       B2 ED 75 03 ED 0B 7E A7 D1 7D AD E6 F9 A6 99 BF>)
(   6,<2014-02-18 19:07:58.350 -0800>,<Administrator>,<X>,<proc1d>,<TOPSPIN 2.1>,
      <abs ABSG = 3 
       data hash MD5: 32K
       40 C7 44 84 D3 C9 E6 33 CE 15 A4 64 9C 18 AF 07>)
(   7,<2014-02-18 19:07:58.397 -0800>,<Administrator>,<X>,<proc1d>,<TOPSPIN 2.1>,
      <abs ABSG = 4 
       data hash MD5: 32K
       7E 98 A6 07 DF 79 D3 00 C7 33 F8 9C 30 46 6B 89>)
(   8,<2014-02-18 19:07:58.459 -0800>,<Administrator>,<X>,<proc1d>,<TOPSPIN 2.1>,
      <abs ABSG = 5 
       data hash MD5: 32K
       EA 68 32 B9 59 AD AB BD BA FA 34 A0 1F 28 7C 8E>)
$$ ##END=
$$ 
$$ $$ hash MD5
$$ $$ D0 BA F2 1C BD F6 8B 24 8D 4F B4 B2 BA 17 3C 8B
##$RELAX= 
##$RELAX= 
##$RELAX= 
##$RELAX= 
##$RELAX= 
##$RELAX= 
##$RELAX= 
$$ Bruker specific parameters
$$ --------------------------
##$DU= <E:\>
##$EXPNO= 10
##$NAME= <AC1635_CENAH_8493933_VXAgfACdkY>
##$PROCNO= 1
$$ [...]
##$TP= (0..7)
150 150 150 150 150 150 150 150
##$TP07= 0
##$TPNAME0= <>
##$TPNAME1= <>
##$TPNAME2= <>
##$TPNAME3= <>
##$TPNAME4= <>
##$TPNAME5= <>
##$TPNAME6= <>
##$TPNAME7= <>
##$TPOAL= (0..7)
0.5 0.5 0.5 0.5 0.5 0.5 0.5 0.5
##$TPOFFS= (0..7)
0 0 0 0 0 0 0 0
##$TUNHIN= 0
##$TUNHOUT= 0
##$TUNXOUT= 0
##$USERA1= <user>
##$USERA2= <user>
##$USERA3= <user>
##$USERA4= <user>
##$USERA5= <user>
##$V9= 5
##$VALIST= <valist>
##$VCLIST= <CCCCCCCCCCCCCCC>
##$VD= 0
##$VDLIST= <DDDDDDDDDDDDDDD>
##$VPLIST= <PPPPPPPPPPPPPPP>
##$VTLIST= <TTTTTTTTTTTTTTT>
##$WBST= 2048
##$WBSW= 25
##$XGAIN= (0..3)
0 0 0 0
##$XL= 0
##$YL= 0
##$YMAX_a= 671835
##$YMIN_a= -570679
##$ZGOPTNS= <>
##$ZL1= 120
##$ZL2= 120
##$ZL3= 120
##$ZL4= 120
##$ABSF1= 14.98509
##$ABSF2= -5.573092
##$ABSG= 5
##$ABSL= 3
##$ALPHA= 0
##$AQORDER= 0
##$ASSFAC= 0
##$ASSFACI= 0
##$ASSFACX= 0
##$ASSWID= 0
##$AUNMP= <proc_prof1d_extract_pilot.lims>
##$AXLEFT= 0
##$AXNAME= <>
##$AXNUC= <1H>
##$AXRIGHT= 0
##$AXTYPE= 0
##$AXUNIT= <>
##$AZFE= 0.1
##$AZFW= 0.1
##$BCFW= 0
##$BC_mod= 0
##$BYTORDP= 0
##$COROFFS= 0
##$CY= 15
##$DATMOD= 1
##$DC= 0
##$DFILT= <>
##$DTYPP= 0
##$F1P= 0
##$F2P= 0
##$FCOR= 0.5
##$FTSIZE= 32768
##$FT_mod= 6
##$GAMMA= 0
##$GB= 0
##$INTBC= 1
##$INTSCL= 1
##$ISEN= 128
##$LB= 0
##$LEV0= 0
##$LPBIN= 0
##$MAXI= 10000
##$MC2= 0
##$MEAN= 0
##$ME_mod= 0
##$MI= 0
##$NCOEF= 0
##$NC_proc= -8
##$NLEV= 6
##$NOISF1= 0
##$NOISF2= 0
##$NSP= 0
##$NTH_PI= 0
##$NZP= 0
##$OFFSET= 14.98509
##$PC= 1
##$PHC0= 95.39429
##$PHC1= 0
##$PH_mod= 1
##$PKNL= yes
##$PPARMOD= 0
##$PPDIAG= 0
##$PPIPTYP= 0
##$PPMPNUM= 2147483647
##$PPRESOL= 1
##$PSCAL= 4
##$PSIGN= 0
##$PYNMP= <proc.py>
##$REVERSE= no
##$SF= 400.02
##$SI= 32768
##$SIGF1= 0
##$SIGF2= 0
##$SINO= 400
##$SIOLD= 32768
##$SPECTYP= <>
##$SREGLST= <1H.CDCl3>
##$SSB= 0
##$STSI= 32768
##$STSR= 0
##$SW_p= 8223.68421052631
##$SYMM= 0
##$S_DEV= 0
##$TDeff= 65536
##$TDoff= 0
##$TI= <>
##$TILT= no
##$TM1= 0
##$TM2= 0
##$TOPLEV= 0
##$USERP1= <user>
##$USERP2= <user>
##$USERP3= <user>
##$USERP4= <user>
##$USERP5= <user>
##$WDW= 1
##$XDIM= 32768
##$YMAX_p= 476716743
##$YMIN_p= -742626
##$CURPLOT= <Network HP LaserJet P1505>
##$CURPRIN= <$Network HP LaserJet P1505>
##$DFORMAT= <normdp>
##$LAYOUT= <+/1D_H.xwp>
##$LFORMAT= <normlp>
##$PFORMAT= <normpl>
##$SURQMSG= 1
$$ End of Bruker specific parameters
$$ ---------------------------------
##NTUPLES= NMR SPECTRUM
##VAR_NAME=  FREQUENCY,     SPECTRUM/REAL,   SPECTRUM/IMAG
##SYMBOL=    X,             R,               I
##VAR_TYPE=  INDEPENDENT,   DEPENDENT,       DEPENDENT
##VAR_FORM=  AFFN,          ASDF,            ASDF
##VAR_DIM=   32768,         32768,           32768
##UNITS=     HZ,            ARBITRARY UNITS, ARBITRARY UNITS
##FACTOR=    0.250966925370066, 1,           1
##FIRST=     8223.43324360094, 3896,         37126
##LAST=      0,             3574,            -1463
##MIN=       0,             -742626,         0
##MAX=       8223.43324360094, 476716743,    0
$$ Real data points
##PAGE= N=1
##DATA TABLE= (X++(R..R)), XYDATA
$$ [...]
19515d20469i5790I5134b4254B4925R3234b85089e0417n3979R772k09923Q3567
19504b20980A1357a34160E4268a28399j11157D0296J92923D8729b79321F727e1190
19492I6811a1533q8872F0734b90983J7058J13658C4074a87725B66198e1042F7477
19480D1169b24441B04571N0116j02155K2639E7806a08431j80916B24476o4877
19470A59599b80669F5807k9429a71482A03563L3848b01349n1712E8558K58097
19460C16655A50570a03854L8629D03234g637j677j65052A81547a79347G2399C2782
19448a34844k7566j83885B22608b3314N353o374F9661P2659J42772i2131e812
19436h3571D6984a85294b1426k2473I9795a80994k51189A79338E3213O2995d02816
$$ y = [-420469, -95790, 95134, -24254, 24925, 118159, -285089, -50417, -104396, -94624, -304547, -220980, 11357, -134160, 54268, -128399, -239556, 40296, 233219, 48729, -279321, 6727, -51190, 96811, -11533, -100405, 60734, -290983, -273925, -160267, 34074, -187725, 266198, -51042, 67477, 41169, -224441, 204571, 254687, 152532, 175171, 57806, -108431, -289347, 224476, 159599, -280669, 65807, 36378, -171482, 103563, 137411, -201349, -253061, 58558, 316655, 150570, -103854, -65225, 403234, -7637, -9314, -174366, 181547, -179347, 72399, 32782, -134844, -162410, -346295, 222608, -23314, -17961, -24335, 69661, 142320, 285092, -92131, -5812, -83571, 46984, -185294, -21426, -43899, 99795, -180994, -432183, 179338, 53213, 116208, -402816]
19424a57295k21637J55387A29270a84751A63149F6020J75720b0958k34199c3279
19413a79092o4547a08809B40659p2096a10808i616l20740J39751c7356j96965
19403b34321C443a71204D2007J48467a27369E0676M747e2557r4710D3224b70320
19391A59036h1904r4135k33051h5386G598P6873N1137i4442A46294C0599J45890
19380A76489E1182a1408k99367j13992A5677c04753A11839C5165a72624Q1473
19370i1151j23931L4123Q9296k75667n4336M1211b0064m12537J19427g8931A91399
19358i4772A61586c88598f8558c2343a5360A13359m9005b54159c7797n3964o6100
19347a57861A69415a03289A00705a78555k47532b1141m9762g559A50640K81c9547
$$ y = [-157295, -378932, -223545, 129270, -184751, 163149, 66020, 241740, -20958, -255157, -33279, -179092, -243639, -108809, 240659, 168563, -110808, -9616, -330356, -190605, -37356, -234321, 3443, -171204, 42007, 190474, -127369, 50676, 55423, -52557, -147267, 43224, -270320, 159036, -81904, -176039, -409090, -85386, 7598, 84471, 135608, -94442, 146294, 30599, 176489, 51182, -11408, -310775, -424767, 15677, -304753, 111839, 35165, -172624, -91151, -215082, -180959, -91663, -367330, -421666, -380455, -20064, -432601, -313174, -78931, 191399, -94772, 161586, -388598, -68558, -32343, -15360, 113359, 64354, -254159, -37797, -91761, -157861, 169415, -103289, 100705, -178555, -426087, -21141, -70903, -7559, 150640, 150921, -39547]
19335C2903J14196a89146I2878K02364o0380b11110n9250b4988A14999b85167
19324D07508c131j74523h2643o6142L8440A37311E7770G214a32627E0167J08252
19313A58419C4644J0049I088a17804A41438e5934j05432A97683a4368A53002i2933
19301b31070B33534a49880m1118K7195O3621C6510c43014c4146G7447h0371B14552
19289c09030G9389b04120b841k59195J19368q0493f9141A5774b739A42184l7627
19278A04557c6122j03445F8656a01897C5076M3901N5721k694b5777o1272c8412
19266A24428a39855O469H6559J2886i2091l67194a55197F6519b13499C22115C5620
19254b61584j49890B0239a09827A53536J16122g4430o8364A50988b48951e8610
$$ y = [32903, 147099, -189146, 92878, 295242, 234862, -211110, -270360, -24988, 114999, -285167, 407508, -3131, -177654, -82643, -148785, -110345, 137311, 57770, 7214, -132627, 50167, 158419, 34644, 44693, 9088, -117804, 141438, -55934, -161366, 197683, -14368, 153002, -92933, -231070, 233534, -149880, -190998, -163803, -100182, 36510, -343014, -34146, 77447, -80371, 214552, -309030, 79389, -204120, -2841, -262036, -142668, -223161, -69141, 15774, -2739, 142184, 104557, -36122, -139567, 68656, -101897, 35076, 78977, 134698, 132004, -25777, -87049, -38412, 124428, -139855, -133386, 86559, 99445, -92091, -459285, -155197, 66519, -213499, 322115, 35620, -261584, -411474, 20239, -109827, 153536, 269658, -74430, -142794, 150988, -248951, -58610]
19243A44762i291q3072r1581k1931A50196b60301l0285B78661a95500p392C20619
19231E8437b09041P791B8520a43506n9697j866f0585A89612b29028f0639A34041
19219b01531p6003e7800C8953a37304j9469f070k25308A1330P3221B732c28918
19207a37943l3147m04962I9455J396j78d60274a13703G0274a92400e4829J6911
19196c7918k26790O7024O795A9700b9531A8992c85670i7160M2011C1044a61623
19184c17292A21048j4955i8129A13399M1626e5956k8013C819b22513B44660a26814
19172e32185J9071a9592B7593f6855J9869G1444a36303d6203q6654A4668a16078
19160A92887a02167G8324b39105O6318E2973d8028m62319b53849A50993m8954
$$ y = [144762, -9291, -92363, -183944, -205875, 150196, -260301, -290586, 278661, -195500, -202892, 320619, 58437, -209041, -201250, 28520, -143506, -203203, -205069, -60585, 189612, -229028, -60639, 134041, -201531, -277534, -57800, 38953, -137304, -156773, -6070, -231378, 11330, 84551, 2732, -328918, -137943, -171090, -576052, 99455, 100851, 100673, -460274, -113703, 70274, -192400, -54829, -37918, -264708, -197684, -190889, 19700, -29531, 18992, -385670, -97160, -55149, 31044, -161623, -317292, 121048, 106093, -98129, 113399, 155025, -55956, -83969, 3819, -222513, 244660, -126814, -532185, -513114, -19592, 27593, -66855, -46986, 71444, -136303, -46203, -132857, 14668, -116078, 192887, -102167, 78324, -239105, -172787, 52973, -48028, -510347, -253849, 150993, 102039]
19150A02039a70714l21828g7728a3899j93244k37740I5967A0093b19171h4127
19139A34385a52180A8932i7576p2525m4410b3878j26617b637G776M410K95081
19128C07267A8158e233A75727a60936A34734h9745k07195A00766c22886d6632
19117b21922B75172a27596p1084A64907c39386a69077A4362R8599n2742a01720
19106G8133a61685K0242c2263B48414E4472J66644c12843J7072b1309A92757b3580
19094b74972a1679j85582k37037a63690F6618j7596L2412J0403A9357J03375B7067
19082g2602n1045r5602i7154I2242k5790c8242E5630J75757d7400B60242E9570
19070b59599k25898I5060c18074B60555H6567J18166b12799A34292a34822A69084
$$ y = [102039, -170714, -492542, -77728, -13899, -207143, -444883, 95967, 10093, -219171, -84127, 134385, -152180, 18932, -97576, -170101, -214511, -23878, -150495, -2637, 7776, 12186, 307267, 18158, -5233, 175727, -160936, 134734, -89745, -296940, 100766, -322886, -46632, -221922, 275172, -127596, -198680, 164907, -339386, -169077, 14362, 112961, 60219, -101720, 78133, -161685, -141443, -32263, 248414, 54472, 221116, -312843, -295771, -21309, 192757, -23580, -274972, -11679, -197261, -434298, -163690, 66618, 49022, 81434, 91837, 19357, 122732, 27067, -72602, -123647, -219249, -97154, 92242, 66452, -38242, 55630, 231387, -47400, 260242, 59570, -259599, -485497, 95060, -318074, 260555, 86567, 204733, -212799, 134292, -134822, 169084]
19059a67347l3259k3221K7836B05670q6869P6236c66051k7054J88863e371l7138
19048d2509D2160b21608k14007f7371r4050C42114a62802I8536m8542f6494o7796
19037a34290A0985b30984B27236a50880j37997A50094e231B10012b70727L3492
19027b37235M3609c0112F2619b32641J07924e4996B52915j07771a0145A98745
19016I5960a3219D2445J13508h7236b76l57651i7316j11839Q5839J8559M988B3801
19003c5438j38293A41022b76152i8556f276q6695l3397j04244G7743k4129e7262
18991c11922J16633A34071c26791A05759R4949D8402j5468a6129H6159b7648n8667
18980h6315r3738j29739A91132E5533g5876G269a3651A49158h5863A92386c80724
$$ y = [-167347, -200606, -223827, -195991, 205670, 118801, 195037, -366051, -393105, -204242, -5371, -42509, 42160, -221608, -435615, -67371, -161421, 342114, -162802, 98536, 49994, -66494, -134290, 10985, -230984, 227236, -150880, -288877, 150094, -5231, 210012, -270727, -237235, -193626, -30112, 62619, -232641, -124717, -54996, 252915, 145144, -10145, 198745, 95960, -13219, 42445, 155953, -87236, -276, -357927, -97316, -209155, -123316, -104757, -99769, 23801, -35438, -173731, 141022, -276152, -98556, -6276, -92971, -126368, -230612, 77743, 53614, -57262, -311922, -195289, 134071, -326791, 105759, 200708, 48402, 32934, -16129, 86159, -27648, -86315, -180053, -309792, 191132, 55533, -75876, 7269, -13651, 149158, -85863, 192386, -380724]
18968a08747D0861L824f0798j05283A33959b34845B81439D1784c10098B682Q305
18957A0987O880e2283A25683J35078J0489f9466k96738h8709D6203e5607b4877
18945b08384D39463C6046e1250A60107a90927m3091h7357j04106e9374o4309A2825
18933a34295B48854H17b44338B61671b3556B9811J14485J4794h3941o1652j05817
18922b51410B362a14481B6919Q07a8159j0296a3913k11450A95657a98240O1814
18911a36426k37339e2386A92362a55684j31938F1444b48851D0418a00826c1053
18900B1194c21562h2532m9105i386A08313b58111C63229a13489B1375a29856I6227
18888a47111l3043f6802p9793q0600B79631a67072q9648E8804c6872E0926K01010
$$ y = [-108747, 40861, 44685, -60798, -166081, 133959, -234845, 281439, 41784, -310098, 2682, 10987, 17867, -52283, 125683, 260761, 271250, -69466, -366204, -88709, 46203, -55607, -24877, -208384, 439463, 36046, -51250, 160107, -190927, -234018, -87357, -191463, -59374, -123683, 12825, -134295, 248854, 817, -244338, 261671, -23556, 29811, 144296, 159090, -83941, -145593, -251410, 2362, -114481, 26919, 27726, -18159, -28455, -13913, -225363, 195657, -198240, -136426, -373765, -52386, 192362, -155684, -287622, 61444, -248851, 40418, -100826, -31053, 21194, -321562, -82532, -131637, -9386, 108313, -258111, 363229, -113489, 21375, -129856, 96227, -147111, -180154, -66802, -146595, -227195, 279631, -167072, -256720, 58804, -36872, 50926, 251936]
18877B51936a67687j59282R2118h6933c1886D8959K7397d1649j11031p43P3042
18866h0381j54340J04583r3098k18613A21949h0752A7527b79307j3725a36436
18855G0842h0659A75537A9336a83959C1135J44642h4998A4554b9400C1413a17984
18843G5450J14244a4940k09105b1491A60902a69307j78764I3172b54729a10633
18832i8341A8766e8280p1595A5668a32240j7808n5931E3325b13275N5946e7329
18820B11235A04810b61022H7151B7035h4283b9407A40603K88951C6880O044K13705
18809B56629q0985H3921M14953I9958m7166a3997q2053m4526J9402h552I9398
18797b69249C07775b9871E5062b28747F3232a04938m7322D2406e5167Q453b0610
$$ y = [251936, -167687, -326969, -234851, -86933, -31886, 48959, 76356, -41649, -152680, -153423, -80381, -234721, -130138, -223236, -441849, 121949, -80752, 17527, -279307, -293032, -136436, 70842, -80659, 175537, 19336, -183959, 31135, 175777, -84998, 14554, -29400, 31413, -117984, 75450, 189694, -14940, -224045, -21491, 160902, -169307, -348071, 93172, -254729, -110633, -98341, 18766, -58280, -129875, 15668, -132240, -150048, -205979, 53325, -213275, -157329, -57329, 211235, 104810, -261022, 87151, 27035, -84283, -29407, 140603, 429554, 36880, 42924, 256629, 175644, 83921, 498874, 99958, 52792, -13997, -96050, -140576, -121174, -8552, 99398, -269249, 307775, -29871, 55062, -228747, 63232, -104938, -152260, 42406, -55167, -46714, -20610]
18785a11558o5812F1209c76271f6625C03215f21661c6257h683l4757j37526C4963
18773a96815B37566b37260p2113m3151A56386b09700f9039j58731j79390E553
18762a94727M1060A84406p1683a18783a4095k38765D04325A13288c7928F9954
18751c6504A90192a65048A27326a96864E5813b71270A7862c3005j93653a00215
18740a00831m3522j56896a3086o9227q9899O7849H3508k7709c65014a63982a4139
18728f0847j19034E2819b33386f9538j37738h9831D9216i5710A8476d4165k46676
18717b90841o110L2784h638B17268d3858k80853a34283k201f4697k79053J51927
18706a91823A62526b90206a908k81681n914J00632o8632R6955n313A28919r585
$$ y = [-111558, -177370, 61209, -376271, -66625, 303215, -621661, -36257, -8683, -43440, -180966, 34963, -196815, 237566, -237260, -309373, -352524, 156386, -209700, -69039, -227770, -407160, 5553, -194727, -153667, 184406, 112723, -118783, -14095, -252860, 404325, 113288, -37928, 69954, -36504, 190192, -165048, 127326, -196864, 55813, -271270, 17862, -33005, -226658, -100215, -100831, -144353, -301249, -13086, -82313, -172212, -104363, 83508, 55799, -365014, -163982, -14139, -60847, -179881, 52819, -233386, -69538, -207276, -89831, 49216, -95710, 18476, -44165, -290841, -296951, -264167, -8638, 217268, -43858, -324711, -134283, -136484, -64697, -343750, -191823, 162526, -290206, -1908, -283589, -289503, -188871, -257503, -160548, -165861, 128919, 119334]
18695A19334a90812A53765a15553d7048m4753q9624I659J25899b23085A20018
18684G829a23037E8668e6859j5815r2344B35250p2380j7428e7576C3613K59025
18673B92638a76842E9111J63739A03009b03625i1203G4592b39388C3210J826J21886
18662A56922b20522a04027b8425k65803j06481A66849D7055d63A84371b74089
18651a02467F6114d6997g784k25936I7829j1114l7974J52183E1052a25296i196
18639I7633c79524a27486j55509K3124R157c9220D91583F6215d7192G1378B9093
18627a00136L3899B90690A42327O9812c54140J6015e7866a8388E0424d9303B25506
18615A62176a48407J8061B15318r8331O8553a22278H5219d64106a94710k4669
$$ y = [119334, -190812, 153765, -115553, -47048, -91801, -181425, 9659, 135558, -223085, 120018, 7829, -123037, 58668, -56859, -72674, -165018, 235250, 162870, 145442, -57576, 33613, 292638, -176842, 59111, 222850, 103009, -203625, -91203, 74592, -239388, 33210, 35036, 156922, -220522, -104027, -28425, -294228, -400709, 166849, 47055, -463, 184371, -274089, -102467, 66114, -46997, -7784, -233720, 97829, 86715, 48741, 200924, 51052, -125296, -9196, 97633, -379524, -127486, -282995, -259871, -250714, -39220, 491583, 66215, -47192, 71378, 29093, -100136, -66237, 290690, 142327, 212139, -354140, -338125, -57866, -18388, 50424, -49303, 225506, 162176, -148407, -130346, 215318, 116987, 185540, -122278, 85219, -464106, -194710, -219379]
18605b19379f3583A70511n0346j2951d38900G9480g849k33219B63187G8456J99214
18594B77670a00590a3873j85178A0865O9954e9988m9785j61333A13124c27041
18583A70782a7397p0520j5405B80827j32913a14397A16113b74477A90934c27632
18572b552j29290e8112j94053M0536A42447m9348J79813b25056m1820A92078n7204
18561A34874b45016B21655C9687c76765f6244G6636d4545A54882c10962A67403
18550A16821c95465a25350A4254L37314g2434A3045N0318b89115a33087L1175
18540a01912A06125a27078k953d8258A2679a93946C9210L647h5797k75934i7306
18528B45164h5509l8690j2473H7961a07820G3658C2908J12580b38495A61177a75145
$$ y = [-219379, -63583, 170511, 120165, 107214, -438900, 79480, -7849, -241068, 263187, 78456, 277670, -100590, -13873, -199051, 10865, 80819, -59988, -109773, -271106, 113124, -327041, 170782, -17397, -87917, -103322, 280827, 147914, -114397, 116113, -274477, 190934, -327632, -2552, -131842, -58112, -252165, -211629, 142447, 93099, 272912, -225056, -266876, 192078, 134874, -245016, 221655, 39687, -376765, -66244, 76636, -44545, 154882, -310962, 167403, 116821, -395465, -125350, 14254, 351568, -72434, 13045, 63363, -289115, -133087, -101912, 106125, -127078, -130031, -48258, 12679, -193946, 39210, 42857, -85797, -361731, -97306, 245164, -85509, -124199, -136672, 87961, -107820, 73658, 32908, 145488, -238495, 161177, -175145]
18516B29474a4131C3869b09988a5564B2523Q7415J50638c86966J24985A15944
18505B1403c52349A08741l8039b17468g1570A48720J92800j18982a65586r3979
18495b59565b6650I8909c17725J3959p6903K2732B65480b3687j34264J6680A44833
18483c43616D8311i4514A75998a9704j29889l00027a23961A9157b72012G1857
18472D4011a41940A5854n189b1720l12591J1342B00705a53503C29596A57091a24038
18460a8972E0282c27874a7016k60382p4870e9671k33877h8929B30317g063k53298
18449b60361c1975Q488A86370A13b48330J18361F3860b80359e7425A16303P1009
18438A87312r0719J14010a29389i869k30712d092q2911k6171A32335E6898N9846
$$ y = [229474, -14131, 33869, -209988, -15564, 22523, 109938, 260576, -386966, -261981, 115944, 21403, -352349, 108741, 70702, -217468, -71570, 148720, 341520, 222538, -165586, -259565, -26650, 98909, -317725, -303766, -380669, -357937, 265480, -23687, -157951, -141271, 144833, -343616, 48311, -94514, 175998, -19704, -149593, -449620, -123961, 19157, -272012, 71857, 44011, -141940, 15854, 10665, -21720, -334311, -322969, 200705, -153503, 329596, 157091, -124038, -18972, 50282, -327874, -17016, -277398, -352268, -59671, -293548, -88929, 230317, -7063, -260361, -31975, -23487, 186370, 113, -248330, -129969, 63860, -280359, -57425, 116303, 187312, 96593, 210603, -129389, -9869, -240581, -4092, -87003, -113174, 132335, 56898, 116744]
18427A16744k7243a89238j85026B64993b46426J07067d1530f067m0655k00904
18417b47626D2948b84544e2616A63129E4737a97223j7719F2594a24854E6464J88414
18406B44878F7118C3238J32379B7974j2108b66759f7987c1485A43626R4231b28207
18394i5794B89081a4748j81960F8275b93238k7536B16933G4451J28265b88492
18383a15815a6875k03959I0289R6777a65667O2864D32c04994B00484a12797F3644
18371B10910D9689g4808j0574H1669a02755C7156b80157J38273B0124a00404B14387
18359H4408A5403J66850J15025i8008B7775Q3545d3705k35369a22309D5732i0202
18347b54710I81J31951a2301j29313C65766f0965D4002b18382R6628F5708P9828
$$ y = [116744, 89501, -189238, -374264, 264993, -246426, -139359, -41530, -6067, -46722, -247626, 42948, -284544, -52616, 163129, 54737, -197223, -214942, 62594, -124854, 56464, 244878, 67118, 33238, 165617, 27974, 15866, -266759, -67987, -31485, 143626, 237857, -228207, -95794, 289081, -14748, -196708, 68275, -293238, -320774, 216933, 74451, 202716, -288492, -115815, -16875, -220834, 90289, 187066, -165667, -102803, 432, -304994, 200484, -112797, 63644, 210910, 49689, -74808, -85382, 81669, -102755, 37156, -280157, -141884, 20124, -100404, 214387, 84408, 15403, 182253, 297278, -98008, 27775, 111320, -43705, -279074, -122309, 45732, -90202, -254710, 981, 132932, -12301, -141614, 365766, -60965, 44002, -218382, -121754, 65708, 145536]
18336A45536b53457N5051b0730B4666J35825c00732b8800k55840a04433A16184
18325E506R1534D4997a47771p6045l6064j46373A87951i9946E3503g2574r4024
18314a66598B76496a82935k8734H5098a77439j6142o9198A98295r7995b86322
18303b04263O7784A58661P7612m3632a06469k4343G2020J90977A0949a0496k69503
18292b79999j474j9714a13105c4500j01988M6531B36903i4967k0625k51942J61284
18281b06250A09074a05384C2500a24548B5443b51312g0747l93353B61444E2f3805
18269A58593k6925M6623D0919d0734j4678q5025O6924A7711J73311m3394b60742
18257a12950p1795A97787K6188b93002b6414o1848E6662q086b6957q2984I7730
$$ y = [145536, -253457, -198406, -20730, 24666, 160491, -300732, -28800, -284640, -104433, 116184, 5506, 97040, 44997, -147771, -223816, -259880, -406253, 187951, -99946, 53503, -72574, -166598, 276496, -182935, -211669, 85098, -177439, -193581, -262779, 198295, 100300, -286322, -204263, -136479, 158661, 236273, 192641, -106469, -130812, 72020, 262997, 10949, -10496, -279999, -281473, -301187, -113105, -34500, -136488, -89957, 236903, -94967, -115592, -367534, -206250, 109074, -105384, 32500, -124548, 25443, -251312, -70747, -464100, 261444, 52, -63805, 158593, 131668, 178291, 40919, -40734, -55412, -140437, -73513, 17711, 191022, 147628, -260742, -112950, -184745, 197787, 223975, -293002, -26414, -88262, 56662, 48576, -26957, -109941, 97730]
18245G7880d7366l83674B2332b12989B6891f067A63656F5989a95363f8342E6276
18233A17558a77756F0153J40444h3443l1516l9082b2934k4968A36349c2636A15174
18221A26373b15899A12448b36160h4330L7621j54937n5728P0904m0259I9149D2497
18209b31779c7929k48924H5480M4881a01238F1517d7351D8430R3333Q2817a88305
18197a01552B50094J28482a31454j81611A26838N1996o4077a38343A66426j0360
18187A56066E5883K43306A3042d1514j95548B5586c58237d2858j4593a7493m5683
18176f3176p6898k02009C19241d0893B21941A03267e0769E4955H981L9733b62327
18164b63731N9435k9188J07176A68428a23463B50275E6733J01607b19638A42951
$$ y = [77880, -47366, -431040, 22332, -212989, 26891, -6067, 163656, 65989, -195363, -68342, 56276, 117558, -177756, 60153, 200597, -83443, -114959, -154041, -22934, -47902, 136349, -32636, 115174, 126373, -215899, 112448, -236160, -84330, -46709, -201646, -257374, -186470, -226729, 99149, 42497, -231779, -37929, -286853, 85480, 130361, -101238, 61517, -47351, 48430, 141763, 224580, -188305, -101552, 250094, 378576, -131454, -313065, 126838, 178834, 114757, -138343, 166426, 156066, 55883, 299189, 13042, -41514, -237062, 25586, -358237, -42858, -57451, -17493, -63176, -140074, -342083, 319241, -40893, 221941, 103267, -50769, 54955, 8981, 48714, -262327, -263731, -204296, -233484, -126308, 168428, -123463, 250275, 56733, 158340, -219638, 142951]
18153H6661b19293L5975O4833F3344c57596A83313p6415a85018K9496B11176j944
18142B09232p1611b83436o6423A15944L1489a11403k3517j85446J08498c181m8449
18131e1630J7392B28870b82932g9893a6663C2376b21324b9777A68281K11067E5910
18119A15921L3104j1994c26632m1447D27517b5889A88555a34068D0194J15821
18109A56015a33243r5162b4423j69310n1266o5138P2521a17495j09207A92654
18098c32037a65473C9466i9210q7577O5722B73066E1657a04863A37214a12936
18087C9558a37806k62220A2854l675J72993C6755a98530j55073J33069H5736a73707
18075G3727c01763a23349o6055k2379d4680B8693J58105G4495b95792I7794C9974
$$ y = [86661, -219293, -183318, -118485, 63344, -357596, 183313, 106898, -185018, -155522, 211176, 209232, 137621, -283436, -349859, 115944, 147433, -111403, -134920, -320366, -211868, -3181, -51630, -34238, 228870, -282932, -79893, -16663, 32376, -221324, -29777, 168281, 379348, 55910, 115921, 149025, 137031, -326632, -368079, 427517, -25889, 188555, -134068, 40194, 156015, -133243, -228405, -24423, -193733, -244999, -310137, -237616, -117495, -226702, 192654, -332037, -165473, 39466, -99210, -186787, -121065, 273066, 51657, -104863, 137214, -112936, 39558, -137806, -400026, 12854, 9179, 182172, 36755, -198530, -353603, -220534, 85736, -173707, 73727, -301763, -123349, -189404, -211783, -44680, 28693, 186798, 74495, -295792, 97794, 39974]
18063B90684A00830O1517C372J52618G2720L215O4372i4105o7845L4900j21404
18052b48454A03361g1084A52269b45854B03272a3572j08525f0164b113r4794I9550
18040d5617Q58a1427j21638H1480K20688a96588p0374F4759d124A68993a62619
18028d740A10733e9391j03000d6157h094k34132b3373j86559g1670b4214C67043
18016d7102A82267b96123R2351c0847m6356r0850A08716a00047m7235q1838c4277
18004b11082A64093a225C9309a67036N0374M2877m3343d3295C6260J91102a20352
17992a65531D0558J48321E9242b6245j05429F2479h7692l68741a27185j640B8684
17980B9509a12968A70834M243P0174a13082A286K04854f4040A26749b76494N1939
$$ y = [290684, 100830, 162347, 3372, 155990, 72720, 75935, 140307, -94105, -161950, -127050, -248454, 103361, -71084, 152269, -245854, 203272, -13572, -122097, -60164, -2113, -96907, 99550, -45617, -44759, -11427, -133065, 81480, 302168, -196588, -266962, 64759, -4124, 168993, -162619, -4740, 110733, -59391, -162391, -46157, -8094, -242226, -23373, -209932, -71670, -24214, 367043, -47102, 182267, -296123, -203772, -30847, -77203, -168053, 108716, -100047, -147282, -229120, -34277, -211082, 164093, -1225, 39309, -167036, -116662, -73785, -117128, -43295, 36260, 227362, -120352, -165531, 40558, 188879, 59242, -26245, -131674, 62479, -87692, -456433, -127185, -128825, 28684, 29509, -112968, 170834, 175077, 245251, -113082, 1286, 206140, -64040, 126749, -276494, -224555]
17969b24555F5477a11360I3240c0334j33185j04664g8831j85424E6325e9901m0093
17958i9994B80493b00909H5686a37538l5089a6801A74444a13607e0202j32205
17948a82407D09708a55323G2678d1933n2186L1249j46715E5050f1883G6302O8580
17937A44882b6021o3355M2448A38863h8050K7368j8790k62771f7015D3032G057
17925C07983r5102b3655B46981a08343D14795b5203C1281a76712a0558A33884
17914H9172J90686i6405l63248b4698n8080a5976k65999m2483A25589L8927l2336
17903A32180a11248I9135a2300l66393A21004J30188e5188H4224C2008g6124p3564
17892a49688e9318b8553j12578N6604C16696A04767O2333e7857A24345B0139b77508
$$ y = [-224555, 65477, -111360, 93240, -30334, -163519, -268183, -78831, -264255, 56325, -59901, -99994, 280493, -200909, 85686, -137538, -172627, -16801, 174444, -113607, -50202, -182407, 409708, -155323, 72678, -41933, -94119, -62870, -209585, 55050, -61883, 76302, 144882, -26021, -89376, -46928, 138863, -88050, -60682, -79472, -342243, -67015, 43032, 7057, 307983, 212881, -23655, 246981, -108343, 414795, -25203, 31281, -176712, -10558, 133884, 89172, 279858, -96405, -459653, -24698, -82778, -15976, -281975, -324458, 125589, 164516, 132180, -111248, 99135, -12300, -378693, 121004, 251192, -55188, 84224, 32008, -76124, -149688, -59318, -28553, -141131, -84527, 316696, 104767, 167100, -57857, 124345, 20139, -277508]
17880G538M0437b60404c493C28961A9067c8893j58682B9154f0136k25720j03629
17869c89485e2885A18361g4830A5957J29628c0993j41041k8511C6373a81208B540
17857a13600D3934a80759D6826f3755o4229j14621L4610d8662k7648q9218C0252
17845A50728d6158k38392E7511e5319k14248B9927d5909p2574N0402A30948b68664
17833f1795k32148d2819I5356i2237A31104c5127l5062A51820m4800h3165F86
17821C17368b3661m45115d8422r6466B42071m3005h2009j56100Q9057K6048a5990
17809h511C0580a74310H6541J7445K4461K20684c94095D3700h6482B63648l4805
17798B28843a76065l258B86269E6181P4126a85505A69681b17614g1326f300k73087
$$ y = [7538, 47975, -260404, -3493, 328961, 19067, -38893, -197575, 29154, -60136, -285856, -389485, -52885, 118361, -74830, 15957, 145585, -30993, -172034, -200545, 36373, -181208, 2540, -113600, 43934, -180759, 46826, -63755, -127984, -242605, -207995, -48662, -76310, -165528, 30252, 150728, -46158, -284550, 57511, -55319, -269567, 29927, -45909, -118483, -68081, 130948, -268664, -61795, -293943, -42819, 95356, -92237, 131104, -35127, -70189, 151820, 107020, -83165, 686, 317368, -23661, -468776, -48422, -144888, 242071, 199066, -82009, -238109, -149052, -123004, -15990, -8511, 30580, -174310, 86541, 103986, 128447, 349131, -394095, 43700, -86482, 263648, 228843, -176065, -179323, 286269, 56181, 130307, -185505, 169681, -217614, -71326, -6300, -279387]
17787b79387N4547i9018M2363B38281e0557I5361b7055d690k53885I2512N5062
17776A47574h1668h374j95625A93095q1859b0715A74996h4789A54292o3938K0346
17765A10700c16444B69174d5814D33870e4133A02661E0884a22010B75042q5235
17755A89807e3046B13675b849r3473E348a6396E3743g785A6111c67449a7096N93
17743a6503A77760a37699B26319K5687B9172c35292a46920n7706R172h2721H701
17731A20960f6212C0341K4006K15402a20618A59619b7131n6874k2308G9223l5094
17720D4129J89853m6882j285a82233c3321P009k05676j13244Q3929N7004A57935
17708A21242a14920r492A81389j7625a24627N5919C05735A29828B9944a1973H9345
$$ y = [-279387, -224840, -99018, -56655, 238281, -50557, 95361, -27055, -4690, -258575, 92512, 147574, -81668, -8374, -203999, 193095, 111236, -20715, 174996, -84789, 154292, 90354, 110700, -316444, 269174, -45814, 433870, -54133, 102661, 50884, -122010, 275042, 189807, -53046, 213675, -2849, -96322, 5348, -16396, 53743, -7785, 16111, -367449, -17096, -16503, 177760, -137699, 226319, 252006, 29172, -335292, -146920, -204626, -195454, -82721, 8701, 120960, -66212, 30341, 54347, 269749, -120618, 159619, -27131, -84005, -106313, 79223, 44129, 233982, 187100, 185815, -182233, -33321, -26312, -231988, -345232, -261303, -204299, 157935, 121242, -114920, -124412, 181389, 163764, -124627, -68708, 305735, 129828, 29944, -11973, 89345]
17696A02911k0321Q5498q3279a83404A66315l54p0316a29530D53105b28423i6083
17684B26936o9565m1949J04187g9937e356j23359D44380h5557G8258h7935B85143
17672B21408b75523C92557d34281B39913l1747K19151a26916B42231i8301C3977
17661F103N4381o043a98877A16510a34318n7806A68159f5808k2722f891A88411
17649c0357j7604j75751O6012C02098c22288B59549b24624l1574o0335D238N8101
17638F2339L18034j68027F0699c14193c053H4122A5607R609K6485K1908Q3112
17627A56721c01900j36585B47043b34153F0422K89045A73652b8547l36993A25176
17616A52780E8730f2379l20729B4045b22394B63828b16686a6288A88400a30834
$$ y = [102911, 82590, 168088, 84809, -183404, 166315, 165961, 95645, -129530, 453105, -228423, -96083, 226936, 157371, 115422, 219609, -79937, -5356, -128715, 444380, -85557, 78258, -87935, 285143, 221408, -275523, 392557, -434281, 239913, 208166, 427317, -126916, 242231, -98301, 33977, 6103, 60484, 54441, -198877, 116510, -134318, -192124, 168159, -65808, -88530, -6891, 188411, -30357, -47961, -223712, -157700, 302098, -322288, 259549, -224624, -256198, -316533, 4238, 62339, 380373, 212346, 60699, -314193, -3053, 84122, 15607, 25216, 51701, 73609, 156721, -301900, -438485, 247043, -234153, 60422, 349467, 173652, -28547, -365540, 125176, 152780, 58730, -62379, -383108, 24045, -222394, 263828, -216686, -16288, 188400, -130834]
17605B83648q6218a89824B88590f6356A47787b22304Q3019K8412L9772A7365J7012
17594C4377j5598c4694B09858b4138r2316B44470q7525R2300F7138a67278A02382
17582D01128A70050N7955b9298o0048n0160A19885n5534a12635B05584L2437h0124
17570a62544A30435b17371c8969E24940A09756b08901J4338d2261A05222C4038
17559A45401n3312a19125d1065I661b9257D06056b32329d4817r4925B76321A0085
17547f77j46715j0169F6678b5468A70555B0602K37106E3562L505N5633h8396D097
17534C16830o1131A21500J3057k2002h4395A45114L19156B20665f0352B83680
17523F9576K88934A52216f3012A92186b02844h8980B72663b34689D48915A27691
$$ y = [283648, 197430, -189824, 288590, -66356, 147787, -222304, -139285, -110873, -71101, 17365, 34377, 18779, -34694, 209858, -24138, -116454, 244470, 156945, 249245, 67138, -167278, 102382, 401128, 170050, 228005, -29298, -89346, -139506, 119885, 64351, -112635, 205584, 238021, -80124, -162544, 130435, -217371, -38969, 524940, 109756, -208901, -194563, -42261, 105222, 34038, 145401, 92089, -119125, -41065, 9661, -29257, 406056, -232329, -44817, -139742, 276321, 10085, -677, -147392, -157561, 66678, -25468, 170555, 20602, 257708, 53562, 57067, 112700, -88396, 4097, 316830, 255699, 121500, 134557, 112555, -84395, 145114, 464270, 220665, -60352, 283680, 69576, 358510, 152216, -63012, 192186, -202844, -88980, 272663, -234689, 448915, 127691]
17512b85405D4546J29447e5326b0690B30366o2867M4092D6785J05120J68080H7151
17500a69749B26248c02354c9620j79561i5121H3810c7040A05003P7032J6209L20760
17489E19004k04675a09698D7745L33041d6431H9663J34011h4135B62761k0641
17479B42120I8961a92673G2751L61306E9482J29075m29d8967F02412e2198j2112
17468f4310A67854N3103j4160J04204d4166j40431A83421q7408l0156J17332c15298
17456B41958e4717A65032a19944B28091m3645q5942J27921K09300k16407J48910
17446C68228j59832A3278N9248O1677P7924a7734C67743A22262J35804A21606
17435A72233J5373J10255D8204J57157a08571D76652j38043J56B4862K37833K98241
$$ y = [-285405, 44546, 173993, -55326, -20690, 230366, 167499, 211591, 46785, 151905, 319985, 87151, -169749, 226248, -302354, -39620, -219181, -95121, 83810, -37040, 105003, 182035, 198244, 519004, 314329, -109698, 47745, 380786, -46431, 89663, 223674, -84135, 262761, 242120, 98961, -192673, 72751, 434057, 59482, 188557, 188128, -48967, 602412, -52198, -64310, 167854, 220957, 206797, 311001, -44166, -184597, 183421, 96013, 65857, 183189, -315298, 241958, -54717, 165032, -119944, 228091, 184446, 98504, 226425, 435725, 219318, 368228, 208396, 13278, 72526, 134203, 212127, -17734, 367743, 122262, 258066, 121606, 172233, 187606, 297861, 48204, 205361, -108571, 476652, 338609, 338765, 24862, 262695, 560936]
17424E60936G9559l2441L42417j83920J33375r7687J72643j3080j39044k2594
17414B39228A15073K61391A7476a88173B25992Q2560G1765M03948j82471j20292
17404A72950L9324A8750b16390A41845c61262B5965J34968I593J42759G5472e9280
17392B77299a6366C34656c75307G4652J52527H0382N1371b19322G8041l0481A2997
17380i078D01098A84007E9059K28276q5817H3802P8057m6995J27492q169J7982
17369B52169A22261K4682B2206L68061b16518e865C07147k4663l2652n7946L2337
17358B24223n1834n2025k3371J09756n7677o1008L7950L4939E83L4967K91795
17347C27345n5717A17213g092B57575K26957A70994c0695D26717J3118F2387K62967
$$ y = [560936, 79559, 47118, 389535, 205615, 338990, 241303, 413946, 400866, 261822, 239228, 115073, 376464, 17476, -188173, 225992, 308552, 71765, 475713, 293242, 172950, 212274, 18750, -216390, 141845, -361262, 25965, 160933, 9593, 152352, 75472, -59280, 277299, -16366, 334656, -375307, 74652, 227179, 80382, 131753, -219322, 78041, 47560, 12997, -9078, 401098, 184007, 59059, 287335, 201518, 83802, 161859, 114864, 242356, 234187, 252169, 122261, 146943, 22206, 390267, -216518, -5865, 307147, 282484, 249832, 191886, 224223, 172389, 120364, 96993, 206749, 149072, 88064, 126014, 160953, 583, 35550, 327345, 271628, 117213, -7092, 257575, 484532, 170994, -30695, 426717, 439835, 62387, 325354]
17336C25354A53327m2128k2424K54444j29044b4709A45041j1247K4269J36144
17326B94207n4307R0796A43443d6916A88933b6422B38230I7731j0179K64999A009
17314B96863A36925a70156E8915L53189p3782j37553a60057B96334l0871A14692
17303b10286E4134Q9622c5676c312C96136J28419B38096L64815j74284A35019
17292A83112E480L14546A14068J73045i5790A83971J76858j28065H2802P4931
17282A57733C6431M51852F8176d2450C25418e2670r5022A4036J76679A8671e6265
17270A95047I6691b0306A10907c2604g772A14575O8927J98555A02675M1233L68975
17259E12883B40385I4761J87884j22085Q4310K57493k12183o8267j2778g0244
$$ y = [325354, 153327, 111199, 88775, 343219, 214175, -24709, 145041, 133794, 158063, 294207, 239900, 330696, 143443, -46916, 188933, -26422, 238230, 97731, 87552, 352551, 1009, 296863, 136925, -170156, 58915, 412104, 338322, 200769, -160057, 296334, 265463, 114692, -210286, 54134, 143756, -35676, -3312, 396136, 524555, 238096, 602911, 428627, 135019, 183112, 5480, 320026, 114068, 287113, -95790, 183971, 360829, 232764, 82802, 157733, 36431, 488283, 68176, -42450, 325418, -52670, -147692, 14036, 190715, 18671, -56265, 195047, 96691, -20306, 110907, -32604, -7772, 114575, 183502, 382057, 102675, 143908, 512883, 240385, 94761, 282645, 160560, 244870, 502363, 290180, 221913, 209135, -70244]
17248D62755O321B26097q0075O6489E4208P8697b57495B70547A24912M403I445
17236B33549J09973J91542B40560o0539l1658J82840j65334b226D08601h4355
17225E86668C9918J21000j4910h79E98762H0308b2018A82414K4580J39821j4981
17214C31834A41777a7476q1362B66398F5257K34915J33798P7250j80033J60271
17204D91458A30233J84738a34639d1235D50595A05045R1604L8272l118J17880
17194C49683j62325G6653J66800r2053J04057L7784K6052j02699j532D3144L68006
17183D11150j36149K62606j08395J3910k2855P2616D9869J93499Q1207j01571
17173B23004q2947K68671H941J87762P3683F7263K19273J92121K8185B28289J50679
$$ y = [462755, 469076, 226097, 146022, 212511, 54208, 132905, -257495, 270547, 124912, 129315, 9445, 233549, 343522, 535064, 240560, 180021, 148363, 331203, 165869, -2226, 408601, -84355, 586668, 39918, 160918, 146008, -879, 598762, 80308, -22018, 182414, 206994, 346815, 331834, 141777, -17476, -98838, 266398, 65257, 300172, 433970, 511220, 331187, 491458, 130233, 314971, -134639, -41235, 450595, 105045, 196649, 234921, 231803, 349683, 187358, 76653, 243453, 151400, 255457, 293241, 319293, 216594, 215062, 43144, 411150, 275001, 537607, 429212, 443122, 420267, 492883, 49869, 243368, 324575, 223004, 140057, 408728, 8941, 196703, 270386, 67263, 286536, 478657, 506842, 228289, 378968]
17162C78968I0384L41262A45761L56908L9055C7871K35211J30569m7983N1586
17152D07254I4298L94778K4987J0039j90873n6977E9219K27934J10012H4863J83346
17141B68209Q9473P0748d589B83653A39288C3136K69985L97502k40435j55372
17131C04816J8722J49544N9404A14169K81018n7735j28063K4829o7811O2863L6957
17120B66227K09227j38172k0864n5317J93866A31446L33087A09461J60925M87726
17110G58112B59373J84277j75911Q9444A04680M9197L44702A76080L52958j38882
17100C90156K48012C05490P5233K30484k1826j11264O4326h6794E39592L094q9254
17089D53432J0853K04200j91216q1790q166j62013O12136l72019m335L05220l63037
$$ y = [378968, 90384, 431646, 145761, 502669, 541724, 37871, 273082, 403651, 355668, 407254, 94298, 489076, 514063, 524102, 333229, 276252, 59219, 287153, 397165, 84863, 268209, 357682, 428430, -4589, 283653, 139288, 33136, 303121, 700623, 460188, 304816, 323538, 473082, 532486, 114169, 395187, 337452, 209389, 234218, 166407, 229270, 266227, 475454, 337282, 316418, 261101, 454967, 131446, 464533, 109461, 270386, 758112, 259373, 443650, 267739, 357183, 104680, 153877, 498579, 176080, 529038, 390156, 638168, 305490, 380723, 611207, 589381, 478117, 542443, -86794, 539592, 542686, 453432, 464285, 668485, 477269, 395479, 387313, 225300, 837436, 465417, 461082, 766302, 403265]
17078D03265J90540o7498j52850o7725K33069j38906A78418K40901l1207J09472
17068D97584P2720j68799J74240m8453l6523k00754M97726j67655r809j98200
17058D12077J49056l4068J01743o9984A77607M36007L72815k05201C76608j7540
17048C59068I5217O88772l85958L11828k79418J25564M2727l8735q3649Q3556
17038E59904k38666J10688K15330j55894P8139K61903j55565j66313J20212K03960
17028H33698J44807m01528J32527n494K36257l33028o2105J31925J17291j77825
17018F16525N15152l47275j04507J26567q6833P3028O5260k23437L29271P3861
17008A037612l9644m97388K19197L0767o5792J04795J42398m2320j28360J88410
$$ y = [403265, 593805, 526307, 373457, 305732, 538801, 399895, 178418, 419319, 388112, 497584, 570304, 401505, 575745, 527292, 490769, 290015, 787741, 620086, 610277, 412077, 561133, 527065, 628808, 558824, 177607, 613614, 986429, 781228, 376608, 359068, 95217, 783989, 398031, 709859, 430441, 556005, 598732, 559997, 476348, 559904, 321238, 431926, 647256, 491362, 569501, 831404, 675839, 509526, 629738, 833698, 978505, 576977, 709504, 704010, 940267, 607239, 545134, 677059, 794350, 616525, 1131677, 784402, 679895, 806462, 719629, 792657, 857917, 634480, 963751, 1037612, 997968, 500580, 719777, 750544, 684752, 789547, 931945, 889625, 761265, 949675]
16998I49675l89739L01385j24372L42937k31355k45112K88675k69998K91628j77879
16988G35845K6736j23045K4961J3099K95478R112k28673K9514m6923J44906p7115
16977H03895J23891q1513K6365O4341k06287J89142j63328K54933l143L5999L0307
16966A074602L8173j08080m9031K94275k72796J41249k77528O76059l47399k88846
16956H80678J19777R1276J4797j22286K41173k74019O5829L52691q4150q0202
16946A205564q0584J05546k79583L38599p8439j10091j7598M07462p2901J34941
16936A552916m77091N10653m03404L94255j89229N195k16359K12099J87118R8149
16926A674302j97740P2826j13972Q6970k83100L01881Q8569m92913K77444q2456
$$ y = [949675, 559936, 861321, 736949, 1079886, 848531, 603419, 892094, 622096, 913724, 735845, 762581, 639536, 664497, 677596, 973074, 982186, 753513, 783027, 736104, 881010, 803895, 927786, 846273, 872638, 936979, 730692, 919834, 756506, 1011439, 1008296, 1044295, 1074602, 1112775, 1004695, 955664, 1249939, 977143, 1118392, 840864, 1516923, 1169524, 880678, 1000455, 1091731, 1106528, 984242, 1225415, 951396, 1017225, 1369916, 1285766, 1205564, 1124980, 1230526, 950943, 1289542, 1211103, 1101012, 1083414, 1490876, 1417975, 1552916, 1075825, 1586478, 1183074, 1577329, 1388100, 1393295, 1176936, 1389035, 1576153, 1674302, 1476562, 1549388, 1435416, 1522386, 1239286, 1541167, 1629736, 1136823, 1414267, 1331811]
16916A331811N69455o6158j84176J56362j10751j51657J76842N7771J40910j90290
16906A730119k4378J1973K3011K80026J29077l23017k52475L13056m297k21133
16896A661962K55644N5811L3351J11473j09397j03970K5309M5830K7708N0386
16886B054107K24867K9132k15179J40496j65302K93216m4695p9189J30100k6509
16876B341044J10620k69716K88197o4539K92414Q1078j14083M3508l4567J67967
16866B841923l32595K74826j18375J54844J84317p3353o8834O84091m1366o55976
16856B849502K34077K53696L4966l0681j21094M29707j61188M5683L18864k03829
16846C649703L9995l7778k2995J59969J16098q6220L29379j31535J06151J81175
$$ y = [1331811, 1901266, 1835108, 1650932, 1807294, 1696543, 1544886, 1721728, 1779499, 1920409, 1730119, 1705741, 1717714, 1740725, 2020751, 2149828, 1826811, 1574336, 1887392, 1883095, 1661962, 1917606, 1973417, 2006768, 2118241, 2008844, 1904874, 1930183, 1976013, 2003721, 2054107, 2278974, 2308106, 2092927, 2233423, 2068121, 2361337, 2316642, 2237453, 2367553, 2341044, 2451664, 2181948, 2470145, 2405606, 2698020, 2779098, 2665015, 2708523, 2673956, 2841923, 2509328, 2784154, 2665779, 2820623, 3004940, 2931587, 2862753, 3546844, 3505478, 2849502, 3083579, 3337275, 3372241, 3341560, 3220466, 3650173, 3488985, 3534668, 3853532, 3649703, 3689698, 3651920, 3628925, 3788894, 3904992, 3818772, 4148151, 4016616, 4122767, 4303942]
16836D303942L1433J45641j32042R4533M9902M57883l72496K41844l24469N62096
16826E058267J36178m7142j88874N90998K11716j51865J62584j69541L46237q9932
16816E858626K51841J97017Q6601R2490J59371J04921K22219J31596n949J61305
16806G260038M8766Q4708N98489M916N55620m23740K38733M26962J85656M16473
16796I396621J19525L3706N59457o98K18137K03408O93972K56639j1400N17058
16786A1986425L33230J35187K71878P93208L71735L49362N11602K19839N51433
16777A5523899N09912M66363N06597K58611R50131N99483M92692Q26384R07209
16768B1041281P94749Q71269Q96911Q31317M54260J454161J255265R66777J233261
$$ y = [4303942, 4335375, 4481016, 4348974, 4443507, 4493409, 4951292, 4578796, 4820640, 4496171, 5058267, 5194445, 5147303, 4958429, 5549427, 5761143, 5609278, 5771862, 5602321, 5948558, 5858626, 6110467, 6307484, 6394085, 6486575, 6645946, 6750867, 6973086, 7104682, 7098733, 7260038, 7308804, 7393512, 7992001, 7996917, 8552537, 8128797, 8367530, 8794492, 8980148, 9396621, 9516146, 9549852, 10109309, 10108611, 10326748, 10530156, 11224128, 11480767, 11469367, 11986425, 12319655, 12454842, 12726720, 13519928, 13891663, 14241025, 14752627, 14972466, 15523899, 16033811, 16500174, 17006771, 17265382, 18215513, 18814996, 19307688, 20134072, 21041281, 21836030, 22707299, 23604210, 24435527, 24889787, 26343948, 27599213, 28565990, 29799251]
16759B9799251J085942J365995J553141J493527J611391J546322J940585J940171
16751D2336325K036117K016534L117145K096393K664674L161195L037339L158630
16743F3624352L750420M092319M324426M240422M641459N073758N512501N698563
16735A00958220O507292O561258O725492P082753P676496P356245Q304477P441266
16727A58613499P829015P284513O857135O924531N149736M377350L501134J830207
16719B02367120O70195k7194k289841l499961m361189n063616o102503o840031
16711A74852980p616971p526007q034451p494839q034427p527120p525648o950513
16703A14143004o706724o386033n903395n692156n054013n170803m626781m355902
$$ y = [29799251, 30885193, 32251188, 33804329, 35297856, 36909247, 38455569, 40396154, 42336325, 44372442, 46388976, 49506121, 51602514, 54267188, 57428383, 60465722, 63624352, 67374772, 71467091, 75791517, 80031939, 84673398, 89747156, 95259657, 100958220, 107465512, 114026770, 120752262, 127835015, 135511511, 142867756, 151172233, 158613499, 166442514, 173727027, 180584162, 187508693, 192658429, 197035779, 200536913, 202367120, 203037315, 203010121, 200720280, 197220319, 192859130, 187795514, 181693011, 174852980, 167236009, 159710002, 151675551, 144180712, 136146285, 128619165, 121093517, 114143004, 107436280, 101050247, 95146852, 89454696, 84400683, 79229880, 74603099, 70247197]
16695G0247197l822302l729875l539275k670009l453399k781794k737460k400816
16687D5112267k072019k139137j884383k264545j504159j233498j567241j661843
16679C0785442j275516j085930j328454j067617j172699p64373j280769m76941
16671B2333143r30197j111440o14611m12916p47535q38451l83931p59394o82223
16662A5852445m31276l88631o95567q35661P571p63466k45412l63135O4023m77767
16652A1723124m08777l12835l59721m84204K04939p02697l0686l14061n19963
16643H795119j86037m2110m29638j7939k57940l55953j7380l38215j93688J09261
16633G065480m97841K66234j79353n71401Q4502J28898j99468p8071k53082k77752
$$ y = [70247197, 66424895, 62695020, 59155745, 56485736, 53032337, 50250543, 47513083, 45112267, 43040248, 40901111, 39016728, 36752183, 35248024, 34014526, 32447285, 30785442, 29509926, 28423996, 27095542, 26027925, 24855226, 24090853, 22810084, 22333143, 21402946, 20291506, 19676895, 19263979, 18516444, 17677993, 17294062, 16534668, 15852445, 15421169, 15032538, 14336971, 13501310, 13508881, 12745415, 12500003, 12136868, 12200891, 11723124, 11314347, 11001512, 10641791, 10157587, 10362526, 9659829, 9629143, 9315082, 8795119, 8609082, 8566972, 8137334, 8119395, 7861455, 7505502, 7488122, 7149907, 6956219, 7065480, 6567639, 6833873, 6654520, 6083119, 6167621, 6296519, 6097051, 6018980, 5765898, 5488146]
16623E488146K27543l49105M06961p33688j25901o7642K35001o0770l60293o9948
16613D590304m21314m578L10649k31722m0707l72761j14090Q2411j27422J53617
16603C824387j37209j8740m37452J50272k5600j41950j58010J99283j73192J61943
16593C243732k25161m55428K39597P2921j00166K31970l2955k49743L00989k32987
16583B792769m61268K64321L1734l16125k9344J73943j33515j69301J70721r7434
16573B226501j5117O0822j10431o1884K8830m1203k11774k76831J85077L02184
16563B086174j62275K025k67942K07361j26913L98490m79436J92324k3529j70603
16553A655676K5570P3399n33950N93780l81424K05655j49766N3666J06584J91251
$$ y = [5488146, 5715689, 5366584, 5773545, 5039857, 4913956, 4846314, 5081315, 5020545, 4660252, 4590304, 4168990, 4164412, 4475061, 4243339, 4202632, 3829871, 3715781, 3798192, 3670770, 3824387, 3687178, 3668438, 3230986, 3381258, 3355658, 3213708, 3055698, 3254981, 3081789, 3243732, 3018571, 2563143, 2802740, 2875661, 2775495, 3007465, 2974510, 2724767, 3025756, 2792769, 2331501, 2595822, 2627556, 2311431, 2282087, 2456030, 2322515, 2153214, 2323935, 2226501, 2211384, 2272206, 2161775, 2099891, 2128721, 2087518, 1875744, 1598913, 1783990, 2086174, 1923899, 1925924, 1657982, 1865343, 1738430, 2136920, 1657484, 1849808, 1826279, 1655676, 1681246, 1754645, 1220695, 1814475, 1433051, 1638706, 1488940, 1542606, 1649190, 1840441]
16543A840441m49392p5072J68563J76950k19185L4287j92405k91203L52594L6254
16533A381832p3541j24896J84120n69066M13134K0666k8170p4635J51548j41463
16523A139529J1535l86815K84324j19325K24816j70429Q5453m8440K89161l38402
16513I71407O8767K34280n31477M01395j88601K95185m04683j39708J94067K3392
16503I24024j19006M66596m55365J71415r3428k59615J49976J2527j48933P4009
16493G22200K26200k06973K26458C61899O44688j11478j31928N4406J02066k22239
16483F97414j715m3139O9252l5135L51842k57898j20652K12928k98235p5426J06481
16472F05717P9490J41421J50422m23884j02198J68501N3137j57598k7328j56617
$$ y = [1840441, 1391049, 1315977, 1484540, 1661490, 1442305, 1476592, 1284187, 992984, 1345578, 1381832, 1308291, 1183395, 1367515, 798449, 1211583, 1232249, 1204079, 1129444, 1280992, 1139529, 1151064, 764249, 1048573, 929248, 1154064, 983635, 1069088, 1020648, 1309809, 971407, 1040174, 1274454, 742977, 1144372, 955771, 1250956, 846273, 706565, 900632, 924024, 805018, 1271614, 816249, 987664, 894236, 634621, 784597, 797124, 648191, 722200, 948400, 741427, 967885, 361899, 1006587, 895109, 763181, 817587, 919653, 697414, 695699, 652560, 721812, 686677, 1038519, 780621, 659969, 872897, 574662, 499236, 605717, 685207, 826628, 977050, 553166, 450968, 619469, 672606, 515008, 487680, 331063]
16462C31063J85598j20221L00626A09080J28753K60243J74069N4160k29221L74862
16452H71946J74070E19771P0661P0424l5892k51173J59111J12594j58883K0557
16442E07170K07572k41087j287k08167K51944Q6967J8510j80098o2798J19761
16432D98487m5017Q3751l335A49382N99867B64278J52819K80488B06910N42286
16422G49196B17673N53939C76275o8180M7377K57070j45191k12803K67850I4642
16411E84766k83447q9924L52845j99510n2348A54871P6832L13633p8890Q0278
16401E46724j9784r4847j03781n3215L27657o7708j3749k13147J93908K3713k06492
16390C19279J25491k2320K09881A07913K70670D1761K7258L18224A61346Q4069
$$ y = [331063, 516661, 396440, 697066, 109080, 237833, 498076, 672145, 726305, 497084, 871946, 1046016, 519771, 590432, 660856, 624964, 373791, 532902, 645496, 486613, 507170, 714742, 473655, 472368, 264201, 516145, 603112, 621622, 441524, 378726, 498487, 453470, 537221, 533886, 149382, 749249, 264278, 417097, 697585, 206910, 749196, 217673, 771612, 376275, 308095, 355472, 612542, 467351, 254548, 522398, 94642, 584766, 301319, 211395, 564240, 364730, 312382, 154871, 231703, 545336, 466446, 546724, 526940, 432093, 328312, 275097, 602754, 535046, 521297, 308150, 502058, 525771, 319279, 444770, 422450, 632331, 107913, 378583, 41761, 69019, 387243, 161346, 245415]
16380B45415J61636j37027f3899A12254M1155L93865A38163l083K63074j95452
16370B02702J00361J96960A96927L49540j73282A43287e4901A69007D1288c712
16359D72847B15530L03493j36393R1235G1233J17760n3441k2028K35973A56495
16348A39787m2324k6458K40236J47099j18633r2478F585K51517J94614g3424C74876
16336C08674m2863R3414A28313J03148q4922A1303N34157A66029b498A46671R9935
16325B46606p911Q5913F3827o184a69714A06348J40335M9850j13847N1601q3060
16314A51227a71631P5898B4820N1739K07767G4874J72818a29773h52B36742a1204
16302A66520n5853J5717h6072A03864a49996H7701k3512J46441I0891K00519O51
$$ y = [245415, 407051, 270024, -63899, 112254, 153409, 547274, 138163, 135080, 398154, 202702, 303063, 500023, 196927, 546467, 373185, 143287, -54901, 169007, 41288, -3712, 472847, 215530, 519023, 382630, 473865, 71233, 188993, 135552, 113524, 349497, 156495, 139787, 97463, 71005, 311241, 458340, 339707, 247229, 6585, 258102, 452716, -73424, 374876, 308674, 265811, 359225, 128313, 231461, 146539, 11303, 545460, 166029, -2498, 146671, 246606, 238695, 324608, 63827, 57643, -169714, 106348, 246683, 296533, 182686, 234287, 151227, -171631, -95733, 24820, 76559, 284326, 74874, 247692, -129773, -852, 236742, -11204, 166520, 110667, 126384, -86072, 103864, -149996, 87701, 64189, 210630, 90891, 291410, 292061]
16291B92061j24074K2513a17843H0168M5158c6597p3368A14398J37402m7599j00051
16280A04150L94298G1121f1841C3949b91954A49346D4530b8311j57118o2201D86820
16268B8157i1034F6755J18748o4544O3592K76960A9006J05508J47228E2190J37028
16257A89218O0199a97286d1234A34233i1638E1987h5608n8815F5901J24792l2191
16246A58502a45761B83838a06076A5616L81915i7151I9879a72905f2344C0108
16235A91298m092a51340C6416L50257A87654d571E84400H2548J76264H3842i9598
16223F2370b05081A35105c43224f7322j73886N0606g944B14695E948L359J00738
16212A10045h5164p5537E449L413J30556g7217m8173B01409a32270E7589e0965
$$ y = [292061, 167987, 190500, -117843, 80168, 125326, -36597, -109965, 114398, 251800, 204201, 104150, 498448, 71121, -61841, 33949, -291954, 149346, 44530, -28311, -185429, -247630, 486820, 28157, -91034, 66755, 185503, 120959, 184551, 461511, 19006, 124514, 271742, 52190, 189218, 249417, -197286, -41234, 134233, -91638, 51987, -85608, -144423, 65901, 190693, 158502, -145761, 283838, -106076, 15616, 397531, -97151, 99879, -172905, -62344, 30108, 191298, 187206, -151340, 36416, 386673, 187654, -4571, 584400, 82548, 258812, 83842, -99598, 62370, -205081, 135105, -343224, -67322, -241208, -190602, -7944, 214695, 5948, 9307, 110045, -85164, -160701, 5449, 8862, 139418, -77217, -125390, 201409, -132270, 57589, -50965]
16200B21082r9707P5623k4412J2512d35050a55111H4647L1312a36791B8560E328
16188A85572a51384B99094H213g5381k60615a5775q6602k4377H9103a18475m657
16177a23132n5608B21503H5791a0463A76228b9514B03484b41874C3752M07654
16167D41406I9427a11732b1685l6962k81046A87760j0810B6461L64613a04294
16156A98781a73702B595K51717i6099A64445J76517D1642a15567B1646J80302
16146B01948O4413d1330q2310D5461J15628a89856A53579Q3750b11616B02235
16135a64431A17398a0661G0816b69486A17412O4847a95998a6888j35992j30097
16125b82977a03286l9561B38468h0761j7570E37221a89305B94507a93693D66069
$$ y = [221082, 121375, 196998, 172586, 185098, -435050, -155111, 84647, 115959, -136791, 28560, 5328, 185572, -151384, 299094, 8213, -75381, -335996, -15775, -102377, -126754, 89103, -118475, -123132, -178740, 221503, 85791, -10463, 176228, -29514, 203484, -241874, 33752, 441406, 99427, -111732, -21685, -58647, -339693, 187760, 176950, 26461, 391074, -104294, 198781, -173702, 2595, 254312, -96099, 164445, 340962, 41642, -115567, 21646, 201948, 266361, -41330, -123640, 45461, 161089, -189856, 153579, 237329, -211616, 202235, -164431, 117398, -10661, 70816, -269486, 117412, 182259, -195998, -16888, -152880, -282977, -103286, -142847, 238468, -80761, -98331, 537221, -189305, 294507, -193693, 466069]
16114A34059M7375J0570l2897a73707H5276J10078l4063A9248N3988L9053D5992
16102a2956o2872B20933F7651L6377r491O5843J3328a07809d0675E9586a081A11240
16089b10266M6422A95873l6224n8481i883n01362a98076E2012J87290j06100a91829
16077B1817a3836n0859k66601i0667A85926f0257C02629G4112C0620J14993d883
16065b6886k3851l5595a8929B50213i3271D2627A4320a4541B00507r9381b01878
16053c37096L9785J44725A36478D9313h4858l66934b05058C0923b99675e7062
16042a24716l4112G938P6688c59276I7732a86863B44490f9670j31079j59725C39202
16030b9583A78077J4471E6294P8850b08239A13921E5972O77850b20925A83781
$$ y = [134059, 181434, 192004, 159107, -173707, 85276, 195354, 161291, 19248, 73236, 112289, 45992, -12956, -75828, 220933, 67651, 104028, 94537, 160380, 173708, -107809, -40675, 59586, -1081, 111240, -210266, -163844, 195873, 159649, 101168, -9883, -511245, -198076, 52012, 239302, 133202, -191829, 21817, -13836, -64695, -331296, -90667, 185926, -60257, 302629, 74112, 30620, 145613, -4883, -26886, -50737, -86332, -18929, 250213, -93271, 42627, 14320, -14541, 200507, 101126, -201878, -337096, -297311, -152586, 136478, 49313, -84858, -451792, -205058, 30923, -299675, -57062, -124716, -158828, 7938, 84626, -359276, 97732, -186863, 244490, -69670, -200749, -360474, 339202, -29583, 178077, 192548, 56294, 135144, -208239, 113921, 55972, 733822, -220925, 183781]
16019C8615L0533c8635k01892o5288B63009o7627a61182B1005J55624o4951n1056
16008F0622A0444J19272b52216E6603b23815C0049f5270j63831B8549h3885j34600
15997b18485A10151a15407n5503A07285j9852a6442A34473K4378b58998J06715
15987a52283B08935O8479a15909L9376I1850f2769j08019B91312K00654k27855
15977B64111M09g2285k0716K8017j25530J8664l6246a02251A31125F1859b07177
15965a4195H0107a90938A19252g2903q2834j10282J18716B36781A6273O6456l415
15954G9314b78276M6027A04563b97586a15823N40b1734B46681p9435a83613a649
15942a71696f2158q2113A64189h3487B3286R8881c05017J40393I9279b47939m153
$$ y = [38615, 69148, -38635, -240527, -305815, 263009, 195382, -161182, 21005, 176629, 111678, 60622, 10444, 129716, -252216, 56603, -223815, 30049, -65270, -229101, 28549, -83885, -218485, 110151, -115407, -170910, 107285, 87433, -16442, 134473, 158851, -258998, -152283, 208935, 277414, -115909, -76533, 91850, -62769, -170788, 291312, 491966, 264111, 264520, -72285, -93001, -64984, -190514, -171850, -208096, -102251, 131125, 61859, -207177, -14195, 80107, -190938, 119252, -72903, -155737, -266019, -147303, 236781, 16273, 82729, 79314, -278276, -232249, 104563, -297586, -115823, -115283, -21734, 246681, 167246, -183613, -1649, -171696, -62158, -144271, 164189, -83487, 23286, 122167, -305017, -164624, 99279, -247939, -252092]
15931b52092g6893j40729a00925A63111a46455A05667g6547P322E2270b66946
15920B40599b65540O0714C248a71290j5513A57243C9421P6695c100H4491i6809
15908d72410E3217f5855D57417a53286A17718a17940a8670j00356B96495j27456
15898A69039b52360B2289P1194B8442O2735l1724b7465B08231C4152b19770p8344
15887b98114B0945a47209D43895a61573j67929C6226a40152A02702b26634k33811
15877d60445B17558a01149E0849f6255D25990b00114g5812G3650Q6900a470A86872
15865b1345o7997D668c11402Q7936E087N5991R2529d1533I9851d4978l7525j3054
15853i5557c7889j56100F121d8945j68241L1165K1228o7126d6233B4360d3658
$$ y = [-252092, -76893, -217622, -100925, 163111, -146455, 105667, -76547, -69225, 52270, -266946, 240599, -265540, -204826, 3248, -171290, -186803, 157243, 39421, 116116, -3100, 84491, -96809, -472410, 53217, -65855, 457417, -153286, 117718, -117940, -18670, -119026, 296495, 169039, -252360, 22289, 93483, 28442, 91177, 59453, -27465, 208231, 34152, -219770, -298114, 20945, -147209, 443895, -161573, -329502, 36226, -140152, 102702, -226634, -460445, 217558, -101149, 50849, -66255, 425990, -200114, -75812, 73650, 160550, -1470, 186872, -21345, -89342, 4668, -311402, -223466, 5087, 61078, 153607, -41533, 99851, -44978, -82503, -95557, -37889, -193989, 6121, -48945, -217186, -186021, -164793, -231919, -46233, 24360, -43658]
15841f4476p7073A01605a1824E8990f6469D521a6755l5599j93994C86097j15843
15830B70254G4098a29410d5765J2413m9374A76556k4643a55665J4431j41555B75555
15818A49603b86490a13332C3859K2784f4214k46839O7049H1714a8081F9253a10068
15806A44689b06192N8730O7399l75077C3313K1187q381O3632D9205P0118b55853
15794A41390D9903h6949p8807B53351A21818J07616F7679a93249g0409J5686C73107
15782i360l2441l28235J54294B13943N5823F0709k8880J82004I4867j2418f9024
15770a87245B5542c33956a6497A01432J35099b07490N4100o8650h6281L9811P549
15759c8921B9394M6728J20625p5017a70478j77321B07497b09434B13346J71155
$$ y = [-64476, -141549, 101605, -11824, 58990, -66469, 4521, -16755, -52354, -246348, 386097, 270254, 74098, -129410, -45765, -33352, -82726, 176556, 151913, -155665, -141234, -282789, 275555, 149603, -286490, -113332, 33859, 56643, -64214, -311053, -244004, 81714, -18081, 69253, -110068, 144689, -206192, -147462, -80063, -455140, 33313, 54500, 46119, 109751, 49205, 119323, -255853, 141390, 49903, -86949, -165756, 253351, 121818, 229434, 67679, -193249, -70409, -54723, 373107, -9360, -41801, -370036, -215742, 213943, 269766, 60709, 31829, 213833, 94867, 82449, -69024, -187245, 25542, -333956, -16497, 101432, 236531, -207490, -153390, -222040, -86281, -46470, -38921, 29394, 76122, 196747, 121730, -170478, -347799, 207497, -209434, 213346, 384501]
15749C84501f4242A58364K02303j62825E0959K32718h5124D1064K14069A02387
15738I936K44419b436l72897B84485d33942B7265c47004a35583d4063k0807l1996
15727i6866j44342f3168r3878A28309d13637A5188J0624Q9525a12109j2936f2368
15715c77708a75171j4903B2486a37265h64B2341L820K2986a83179A88723i2932
15703e6394h301j00957A88319j6274F5264J2991d86246H6146C923a13885l1866
15692a45751f2501A72829J90245j58884M5211h9809c1165k37462a10855n4559
15682a65414e0059j21832A30908F1587g5588k03193E9667a4568A48391a99053
15671a67673a5492A30497L0134K48303a45315j42349i6209I3465a95053E5524
$$ y = [384501, -64242, 158364, 360667, 197842, 50959, 283677, -85124, 41064, 255133, 102387, 9936, 254355, -2436, -375333, 284485, -433942, 27265, -347004, -135583, -44063, -64870, -96866, -241208, -63168, -157046, 128309, -413637, 15188, 25812, 115337, -112109, -125045, -62368, -377708, -175171, -190074, 22486, -137265, -864, 22341, 26161, 49147, -183179, 188723, -92932, -56394, -8301, -109258, 188319, 172045, 65264, 78255, -486246, 86146, 3923, -113885, -145751, -62501, 172829, 363074, 204190, 249401, -89809, -31165, -268627, -110855, -165414, -50059, -171891, 130908, 61587, -75588, -278781, 59667, -14568, 148391, -199053, -167673, -15492, 130497, 160631, 408934, -145315, -287664, -96209, 93465, -195053, 55524]
15660b69912b9172l0769j64888B04973c13580O2228J05612J8749A0986c15237
15649a07066F9420a66698A35359h8144j56620r7085i4775B1133a05936G1599l763
15638F7836M4218I978P5459b58738g2791D16232a0613A06104L766J52588g8493
15626C902P4327J61033f9986j01941B62919m4915Q8666k9734f7990j3646m4291
15615a25927g122l47745a14448A40279K14146g152G4401b36899F6953c3288n4424
15604h7712c4685A44312a3564B24380b17909i9380H2274b82392i6036b4081E5048
15592B50312j20224a00938m1460B59545a37659k0958C0685J14332f6903a0217
15581A64244F2161j0713K8629a47615B28655a48135A62321a16444A8549a18636
$$ y = [-269912, -29172, -59941, -224829, 204973, -313580, -251352, -145740, -126991, 10986, -315237, -107066, 69420, -166698, 135359, -88144, -244764, -341849, -94775, 21133, -105936, 71599, 67836, 112054, 9978, 85437, -258738, -72791, 416232, -10613, 106104, 109870, 262458, -78493, 3902, 78229, 239262, -69986, -171927, 262919, 218004, 306670, 276936, -67990, -81636, -125927, -7122, -354867, -114448, 140279, 354425, -7152, 74401, -236899, 66953, -33288, -87712, -34685, 144312, -13564, 224380, -217909, -99380, 82274, -282392, -96036, -24081, 55048, 250312, 130088, -100938, -142398, 259545, -137659, -158617, 30685, 145017, -66903, -10217, 164244, 62161, 51448, 80077, -147615, 228655, -148135, 162321, -116444, 18549, -118636]
15570a76649c8901j05640B8728b36067h8196A46094K0732d3031j10641A64384
15559i9228M5967k40120C5115c61083I7765g8751D1936a94838A58295g1672c2921
15547C41286d5934A53170C1437f1521n5328N5259A08855a9625j05943r6463C70501
15535A87013c91760A52959a37914A41784b30438J06692C85261C0727o75b95624
15524B08531a93095f9015c2106A85614a44354A10702L2581B4414J05287a67277
15513A78988K25320A04375a60422A46083o7104R2038a51471r5111R3960p362C1330
15501a60174a3232B53032d7358B5123a74388N9853m8214A44720d77907i947F802
15489a0759l7764j43707E3805a05330A9830c14324F9309j2561a6403E667J2111
$$ y = [-176649, -38901, -144541, 28728, -236067, -88196, 146094, 166826, -43031, -153672, 164384, -99228, -53261, -293381, 35115, -361083, 97765, -78751, 41936, -194838, 158295, -71672, -32921, 341286, -45934, 153170, 31437, -61521, -116849, -61590, 108855, -19625, -125568, -222031, 370501, 187013, -391760, 152959, -137914, 141784, -230438, -123746, 385261, 30727, 30052, -295624, 208531, -193095, -69015, -32106, 185614, -144354, 110702, 143283, 24414, 129701, -167277, 178988, 404308, 104375, -160422, 146083, 78979, 171017, -151471, -246582, -152622, -159984, 31330, -160174, -13232, 253032, -47358, 25123, -174388, -114535, -162749, 144720, -477907, -9947, 6802, -10759, -48523, -192230, 53805, -105330, 19830, -314324, 69309, 56748, -16403, 5667, 17778]
15478A7778a07136j03639A15957K02956a65831A21854N1691g5381E4387J08094
15468A62481d33535E91210a01605j43192Q7745I7626O1578b00111E3216i6333
15457B25225n2157a45596c2537A14899K7666a63924b7068E7095k5248e6584F6753
15445D10527a89137b4310o1143r7162l83232b8391B33713a78345E8858b14412
15434a45914e7127G178K16414b930j05015n7j68488A55390k1143L4530F075b6164
15421a01807B2976a9200A61875c30101h2277L0637A57505a68145B58039r5523
15411A62516q429E9751M6108h9226A67669b93277C9412K3596L43002F2008M15713
15400D77721a64521h2175m5738l95246j7325C62461d5183C3043K855c7216E3950
$$ y = [17778, -107136, -210775, 115957, 318913, -165831, 121854, 173545, -75381, 54387, 162481, -433535, 591210, -101605, -244797, -157052, 97626, 159204, -200111, 53216, -96333, 225225, 173068, -145596, -32537, 114899, 142565, -163924, -27068, 57095, 31847, -56584, 66753, 410527, -189137, -24310, -85453, -182615, -565847, -28391, 233713, -178345, 58858, -214412, -145914, -57127, 7178, 223592, -2930, -107945, -108002, -276490, 155390, 134247, 168777, 6075, -26164, -101807, 22976, -19200, 161875, -330101, -82277, -51640, 157505, -168145, 258039, 162516, 154087, 59751, 105859, -89226, 167669, -293277, 39412, 63008, 406010, 62008, 477721, -164521, -82175, -127913, -523159, -540484, 362461, -45183, 33043, 35898, -37216, 53950]
15388a26832L8136L3389A67052o3511b11839c5035j2060A54980O6269R2930b95500
15376d09582a30720A57083c47261A29320m5361K9202d1044B46675b50055A38007
15365a21843C6182J67229b14551B813a97713D1202a14912A05494D3776c78276
15354H9733a38310B15368l6815h2315b276A46333K8340c0504C30a30626J0623
15343a20003m43751B84153f43l16510a21247A59922a42266A52243C9956b06074
15332F2621d4698A30123C853K7423J43341q5591e7461B40248a21735K9315D4235
15320D7444a41855B28647a21770A12914K00622E0567L8076m3767J08408c981j00975
15309a04956q5128A80353B9535a98475C04006K76338a35815f1307A84010k8033
$$ y = [-126832, -88696, -55307, 167052, 103541, -211839, -35035, -47095, 154980, 221249, 314179, -295500, -409582, -130720, 157083, -347261, 129320, 83959, 113161, -41044, 246675, -250055, 138007, -121843, 36182, 203411, -214551, 2813, -197713, 41202, -114912, 105494, 43776, -378276, 89733, -138310, 215368, 178553, -82315, -2276, 146333, 174673, -30504, 330, -130626, -120003, -563754, 284153, -643, -317153, -121247, 159922, -142266, 152243, 39956, -206074, 62621, -44698, 130123, 3853, 31276, 174617, 89026, -57461, 240248, -121735, -92420, 44235, 47444, -141855, 228647, -121770, 112914, 313536, 50567, 88643, 44876, 153284, -3981, -104956, -190084, 180353, 29535, -198475, 304006, 580344, -135815, -61307, 184010, 155977]
15299A55977a4634k1210E3124M0317L6936E0530R5104J07528b08513c5585B7708
15287d20979a38156M4794A06190b50887A24800n8318b42958B22864c67501F1043
15276A3672g7033A51007e2706B49146b83491B1550O3920i1670I8107i6283l19634
15265d15917A524L5455b07264r5003J34024C95336j77079q5110L9025l557J6234
15254A84849i2237j08018A90139C2318L35235A45413J5349R36082K81897m96068
15244H82673P98886p14722D36562j78376N8169a01168E40901a50965A09169O991
15234A16160L57349B05422m3272A1651J06282i4471B34145A12116A1314L25228
15224C36542b70216D4484A9647f8960C23539i9698j46039D5114b37765G9549P3101
$$ y = [155977, -14634, -35844, 53124, 93441, 130377, 50530, 145634, 253162, -208513, -35585, 27708, -420979, -138156, -93362, 106190, -250887, 124800, 66482, -242958, 222864, -367501, 61043, 13672, -77033, 151007, -52706, 249146, -283491, 21550, 85470, -91670, 98107, -96283, -415917, 1524, 36979, -207264, -302267, -168243, 395336, 218257, 133147, 172172, 168615, 184849, -92237, -200255, 190139, 32318, 367553, 145413, 160762, 1096844, 1378741, 882673, 1681559, 966837, 436562, 258186, 316355, -101168, 540901, -150965, 109169, 116160, 473509, 205422, 162150, 11651, 117933, -94471, 234145, 112116, 11314, 336542, -270216, 44484, 19647, -68960, 323539, -99698, -245737, 45114, -237765, 79549, 152650]
15213A52650D2480b5548a168j01154M8524o4861j7833I6332h6858F0886M07885
15202D68771B32542I2647b2143B9514L33358G3338j0618e5499l55354b1464H3130
15190G9890R0959b20927L423A57923p4397M5425A2027c61270i2041H6383K72449
15179C58832A0181M369a08633H7576a03202C05104A5821b33711B53287K22028
15169D75315F3628d9622H4362J14784h3185B17074I4225N1296L14382A4467J86245
15158B00712n1288J13486b2241A89521K43063j54586a0000A06459B1438J85564
15148B07002H4815K36645K4662r2466a84802I5875C9784a80199E3001K59079l8814
15137B73266a3811B46219n1865A293R7953A8583P0528O765l9879J23799b9605
$$ y = [152650, 42480, -25548, -1168, -102322, -53798, -118659, -136492, 96332, -86858, 60886, 468771, 232542, 92647, -22143, 29514, 362872, 73338, 62720, -55499, -410853, -21464, 83130, 79890, 170849, -220927, -217504, 157923, 83526, 128951, 12027, -361270, -92041, 86383, 358832, 10181, 14550, -108633, 87576, -103202, 305104, 15821, -233711, 253287, 475315, 63628, -49622, 84362, 199146, -83185, 217074, 94225, 145521, 459903, 14467, 200712, 149424, 262910, -22241, 189521, 432584, 277998, -10000, 106459, 21438, 207002, 84815, 321460, 346122, 253656, -184802, 95875, 39784, -180199, 53001, 312080, 273266, -13811, 246219, 194354, 1293, 99246, 18583, 89111, 95876, 55997, 179796, -29605]
15125G9678J55720q9815B3429j203M15462A16031J32487M9949e5662D18433a63561
15113C91393E3077a43892C33396K2844A19596E0085M0158c2833A3157b14208g4864
15101B53925J43903o3381B9846c9639B06324O3374D0338J9575a14689o94D47657
15089a65304C93517A29166J28605A12445K98276j27758j06963J82438A76691P9763
15079B56454j4618g5506D3311L27109q5437c6460A06248K83274j70166n8968l3784
15068A26604a09432M5428B11342l0631K01201E5290L78961e1705B07930d3959
15057B81006j26142h2271a3521H0454A5794J76065G7617f4754A5324Q0181h7689
15045A70350b0382A21636a18220A06178J73923I4668K96548q2134j41482N9826
$$ y = [79678, 235398, 145583, 23429, 22226, 437688, 116031, 248518, 298467, -55662, 418433, -163561, 391393, 53077, -143892, 333396, 356240, 119596, 50085, 90243, -32833, 13157, -214208, -74864, 253925, 397828, 334447, 29846, -39639, 206324, 269698, 40338, 59913, -114689, -115383, 447657, -165304, 393517, 129166, 257771, 112445, 410721, 282963, 176000, 358438, 176691, 256454, 241836, -75506, 43311, 370420, 284983, -36460, 106248, 389522, 219356, 160388, 126604, -109432, -64004, 211342, 180711, 381912, 55290, 434251, -51705, 207930, -43959, 281006, 154864, -82271, -13521, 80454, 15794, 191859, 77617, -64754, 15324, 95505, -87689, 170350, -20382, 121636, -118220, 106178, 280101, 94668, 391216, 309082, 167600, 227426]
15035B27426p6041J05763a0167A39031k2248a46677A58071L07805A80111L7228
15025B17339o7980L44783A43045A7761J33748L35446b8449B50811b81450A02363
15014a12291C54247p0469j30104R0438M9714J66939A27799b35569A96118R0541
15004B86659P3440m7045R9200j26138A41058J23534B141a06399E24023f1392C86470
14992E19299B20833H7805J15441h3235G1451M4474K20065j0994J18770j18169
14982C25597q440j17327m7665A2633K69801A1117K68836E0003J53634n2960K72790
14971D23467l729k02132Q6931J60957H1469B0663K06327l0938J75708L6475p4445
14960C33790L46148l16255j18798K8939R7615j51735a9381A34541L27312k23464
$$ y = [227426, 151385, 257148, -10167, 139031, 116783, -146677, 158071, 465876, 180111, 217339, 149359, 494142, 143045, 17761, 151509, 486955, -28449, 250811, -281450, 102363, -112291, 354247, 283778, 153674, 244112, 293826, 460765, 127799, -235569, 196118, 286659, 360099, 313054, 412254, 286116, 141058, 264592, 2141, -106399, 524023, -61392, 386470, 519299, 220833, 87805, 203246, -83235, 71451, 115925, 335990, 324996, 443766, 325597, 317157, 199830, 152165, 12633, 282434, 11117, 279953, 50003, 203637, 150677, 423467, 419738, 217606, 304537, 465494, 81469, 20663, 226990, 196052, 371760, 408235, 333790, 679938, 363683, 244885, 273824, 371439, 219704, -19381, 134541, 461853, 238389]
14950B38389A06421M43104k29124N23538C12911j01630O303J60141J6144K57207
14940F51076F9979O20169l8588j32204A40347M92043B59622L24438k61302K0188
14930C42946J41864A42844K03482N0515K69148E4953L14574A67259k2364d2574
14919C24483B3187M73897B16991P1713O8517L05260j58433j80997n673K67632
14909E85010B81196K350L03493A53060D26L07187J84275E1643Q6694O9863J92511
14898D00711L78480C41663j33878g8733B36932K5921I9191J05360L89203j86448
14888D07306L1030H2613L96393q9068F8901Q2811L51183j61909K81534B07550
14877D33243P8247o9674B11229M76836k88070j50877J82811L3981J38476j30453
$$ y = [238389, 106421, 549525, 320401, 843939, 312911, 211281, 217584, 377725, 393869, 651076, 69979, 690148, 651560, 519356, 140347, 632390, 259622, 584060, 322758, 342946, 484810, 142844, 346326, 396841, 665989, 54953, 369527, 167259, 144895, -42574, 324483, 23187, 497084, 216991, 288704, 357221, 662481, 504048, 323051, 317378, 585010, 281196, 283546, 587039, 153060, 426, 307613, 491888, 51643, 138337, 208200, 400711, 779191, 341663, 207785, -78733, 236932, 262853, 99191, 204551, 593754, 407306, 438336, 82613, 479006, 389938, 68901, 151712, 502895, 340986, 622520, 207550, 433243, 511490, 441816, 211229, 688065, 399995, 249118, 431929, 465910, 604386, 473933]
14867D73933k29514K3790K39313N5816k65399N11237B29222K91301P0151B31767
14856D82762j4762A32511N33029j54161J12607j95710n7210J09873p9055o1509
14846C40375n3334j08636K26747j63433L88603k15882n7189I9070L41687J49348
14836E90105r9673k35378N01203C18827r6555L57995k3830k11066J55201n6399
14826D44173K78781k10141j55452k7318J53311M4734Q8882j63582n0670M5464
14816D48182J08856j94084L11974l15368N9758j87432K59197r2492J00703k33009
14806B66285K70710J69788j99866k7869n2611j08268j19829O6190K6084K54048
14796E44662o3749N99201l69582C26655K01986q0196J36783j60204n4686J83940
$$ y = [473933, 244419, 268209, 507522, 563338, 297939, 809176, 229222, 520523, 590674, 231767, 482762, 468000, 132511, 665540, 511379, 623986, 428276, 371066, 480939, 401884, 340375, 287041, 178405, 405152, 241719, 630322, 414440, 357251, 99070, 440757, 590105, 490432, 255054, 756257, 318827, 222272, 580267, 556437, 345371, 500572, 444173, 722954, 512813, 357361, 330043, 483354, 528088, 616970, 453388, 402718, 448182, 557038, 362954, 674928, 359560, 419318, 231886, 491083, 398591, 499294, 266285, 536995, 706783, 506917, 479048, 426437, 318169, 198340, 264530, 290614, 544662, 480913, 1080114, 710532, 326655, 528641, 448445, 585228, 425024, 370338, 554278]
14786E54278j43215q1114J21951O8486K90683J2798m9163k88205G404O52600k8456
14775F31548j50877J52398L7507l29033M10306q6081K27242k93721L7111L2239
14765F68639M7829R2703k02094M522j88308J87118K32638l72852L38219J29540
14755I37954j37333k95556p9630K98908J39425r8715k29913L03962k49086j15147
14745D74869L17492j72781O10090E80682J57670l8471L85459k96438r8318J36760
14735H27344J24851l52318J41323J40561k04284k5587L26513l11197L01564Q0247
14725A049017k98299O5241J6594m4540j20092R7361M3311J6014J19301P9558j30269
14714H93197o5377K32145k18003l3713K45006l2752q6788r527M8131k22529K60955
$$ y = [554278, 411063, 329949, 451900, 520386, 811069, 823867, 774704, 486499, 7404, 660004, 631548, 480671, 633069, 670576, 341543, 751849, 665768, 893010, 599289, 636400, 668639, 716468, 809171, 607077, 611599, 423291, 610409, 843047, 470195, 808414, 937954, 800621, 505065, 425435, 724343, 863768, 765053, 535140, 839102, 590016, 474869, 792361, 619580, 1229670, 580682, 738352, 699881, 1085340, 788902, 690584, 827344, 952195, 599877, 741200, 881761, 677477, 651890, 978403, 667206, 968770, 1049017, 750718, 815959, 832553, 788013, 667921, 765282, 808593, 824607, 943908, 1023466, 893197, 827820, 1059965, 841962, 808249, 1053255, 1020503, 933715, 924188, 972319, 749790, 1010745]
14703A010745K34943n33070o0086J48899k63729M44805l20312K64888j63538R7547
14693H61092N5662j4057K92045m21695M59295F06061J48853M19390p5638J09989
14683A208655k28703M8161J00509q4974j36247k16000J81764K38864p3236J98785
14673A237578K53620o97336K01311j32235r0997L15348k7839m6731j82329M03507
14663A233897l66401L34112q9850K44169j60457q0485L80485k13775r371J2672
14653A284996n2437L02639k36236j9950J4144p6656L02731k89438K5066R3679
14643A348538J25276n5040j11411K54668j10200k10408J9386L91156k03328J16485
14633A565122j72959J89958k81142J81080n5371K9993j34508j04045J41287J03791
$$ y = [1010745, 1245688, 712618, 652532, 801431, 537702, 982507, 662195, 927083, 763545, 861092, 916754, 902697, 1194742, 773047, 1232342, 606061, 754914, 1174304, 1098666, 1208655, 979952, 1028113, 1128622, 1043648, 907401, 691401, 873165, 1112029, 1038793, 1237578, 1491198, 793862, 995173, 862938, 771941, 1087289, 1059450, 1012719, 830390, 1233897, 867496, 1201608, 1111758, 1355927, 1195470, 1114985, 1495470, 1281695, 1272324, 1284996, 1232559, 1535198, 1298962, 1279012, 1293156, 1216500, 1519231, 1229793, 1254859, 1348538, 1473814, 1418774, 1307363, 1562031, 1451831, 1241423, 1260809, 1651965, 1448637, 1565122, 1392163, 1582121, 1300979, 1482059, 1426688, 1456681, 1322173, 1218128, 1359415, 1463206]
14623A463206M2295L35066o59382L68132k6333R0609j64955p9977o232L69207
14613A731636K2415m42932o0362L81634k34835K15517N2770L87609k59457k42174
14603A551821K73861j21632m98193M47277L61111m80403k04701M93198k22463
14594A599876J74858j6409J16996k04587J61139k6300L55799m11079M94L10880
14584B061667k46140K92917J52572r4820k11860P5625K7430L29927k16108q3715
14574B087495L95603l19695K92325j06084L5015k11942L81713l66579M02733k22181
14564B368403K41198J61845j55817K34851k29029j87290J18587M89089m7862L25462
14554C319437N2349L95424N68654J28741R48662J611356L309426Q535419K4798190
$$ y = [1463206, 1505501, 1840567, 1181185, 1549317, 1522984, 1613593, 1448638, 1368661, 1362429, 1731636, 1754051, 1311119, 1250757, 1632391, 1397556, 1613073, 1665843, 2053452, 1793995, 1551821, 1825682, 1704050, 1205857, 1653134, 2014245, 1533842, 1329141, 1822339, 1599876, 1774734, 1758325, 1875321, 1670734, 1831873, 1805573, 2161372, 1750293, 1750787, 2061667, 1815527, 2108444, 2261016, 2166196, 1954336, 2029961, 2057391, 2387318, 2171210, 2087495, 2483098, 2163403, 2455728, 2349644, 2384659, 2172717, 2554430, 2187851, 2590584, 2368403, 2609601, 2771446, 2615629, 2850480, 2621451, 2434161, 2552748, 3041837, 2993975, 3319437, 3371786, 3767210, 4335864, 4464605, 5413267, 7024623, 10334049, 18869468, 43667658]
14545D3667658k171948j5611594j2204997n908665l011243k011143k35795l46119
14537B166154J81472l98142N96563n61513P7924q3350L50354k82004N0971J44817
14527B243246L49920l43326L06235m64757L94589k60039N42816o3661N4264p8586
14517B680701M8872j06026K11971j59158k1270J05874L82046k21172J53946J8510
14507C094294J52653k26756J0562J27409k43237N02551k07899J37267J32991k75370
14497C204465j55435J72853M90745N8486j68091J9535j77087J09701J05333K567
14487C663072l308n5631M00817n82845N99963l80210N41398q0030K41684j08353
14477D236557j65017L00986l26324K04235n7703J7326J66712J48869K09199j80132
$$ y = [43667658, 41495710, 25884116, 13679119, 7770454, 4759211, 2748068, 2512273, 2166154, 2347626, 1949484, 2546047, 1984534, 2062458, 1979108, 2329462, 2047458, 2098429, 2243246, 2593166, 2249840, 2556075, 2091318, 2485907, 2225868, 2768684, 2705023, 2759287, 2680701, 2729573, 2623547, 2835518, 2676360, 2655090, 2760964, 3143010, 2921838, 3075784, 3094294, 3246947, 3020191, 3030753, 3158162, 2914925, 3417476, 3209577, 3346844, 3479835, 3204465, 3049030, 3221883, 3712628, 3771114, 3603023, 3622558, 3445471, 3555172, 3660505, 3663072, 3659764, 3604133, 4004950, 3422105, 4022068, 3641858, 4183256, 4103226, 4344910, 4236557, 4071540, 4372526, 4046202, 4250437, 4192734, 4210060, 4376772, 4525641, 4734840, 4554708]
14467D554708L88229l19741R9757N7794j38043K73481k5864r6285n2095M74362
14457E216303j1655M2108J03922o9705J38919J64245J58826l71157L82160M5339
14447E799305n3255j43679N64049n2923k06472L95370L548j65410M77498p2581
14437F545450n2341L32853J77120l34307M35751L9947k552K47693k87795P21105
14427G822924l40702J75813j2743K24274L8439R3627k99157N93764J82716j65759
14417H313196N57053l34094N31796m5846K9437r4358L95365K83581j70560M1064
14407I506634K85618K85505J27551L41897J56725l4816J83915L16987p7844j57717
14397A0934455O81460M45852j27273J94641R3141K87985J60695K18153N27212
$$ y = [4554708, 4942937, 4623196, 4722953, 4780747, 4642704, 4916185, 4890321, 4794036, 4741941, 5216303, 5204648, 5246756, 5350678, 5280973, 5419892, 5584137, 5742963, 5371806, 5753966, 5799305, 5746050, 5602371, 6166420, 6113497, 5907025, 6302395, 6305943, 6140533, 6618031, 6545450, 6493109, 6825962, 7003082, 6668775, 7104526, 7144473, 7141921, 7389614, 7101819, 7822924, 7482222, 7658035, 7645292, 7869566, 7908005, 8001632, 7702475, 8296239, 8478955, 8313196, 8870249, 8536155, 9067951, 9022105, 9051542, 8957184, 9352549, 9636130, 9465570, 9506634, 9792252, 10077757, 10205308, 10547205, 10703930, 10669114, 10853029, 11170016, 11092172, 10934455, 11615915, 12061767, 11934494, 12129135, 12222276, 12510261, 12670956, 12889109, 13416321]
14388A3416321Q0106n2577M59786J29299J50889M63947J58296K76344o3431P17047
14378A5736027K09808n2952M79452J81526L02626N98411O54695j46371P30966
14369A8694188M8523M68658P46841l28101P76124N60393N65006p1880N12012R99862
14359B2971626L05629K88883N47322M51263Q38468K71816Q26515P53051L72233
14350B7626806J092205Q62511L69820J130421L00581J068920N44043P50887J179903
14341C4926097P99618J019034J098760J061991R53432J215168J178372J087117
14333D3339589J117287J527984J220852J855158J216526J464801J799800J763908
14325E5305905J720872K234339J995051J863137K402065K184077K375190K595004
$$ y = [13416321, 13496427, 13443850, 13903636, 14032935, 14183824, 14647771, 14806067, 15082411, 15018980, 15736027, 15945835, 15892883, 16372335, 16553861, 16856487, 17454898, 18109593, 17963222, 18694188, 18742711, 19211369, 19958210, 19630109, 20406233, 20966626, 21531632, 21459752, 21971764, 22971626, 23277255, 23566138, 24113460, 24564723, 25403191, 25675007, 26501522, 27254573, 27626806, 28719011, 29581522, 29951342, 31081763, 31382344, 32451264, 32995307, 33746194, 34926097, 35725715, 36744749, 37843509, 38905500, 39858932, 41074100, 42252472, 43339589, 44456876, 45984860, 47205712, 49060870, 50277396, 51742197, 53541997, 55305905, 57026777, 59261116, 61256167, 63119304, 65521369, 67705446, 70080636, 72675640]
14317G2675640K675599K962389K786731L497971K961128L669144L625531L783972
14309I8638105M046703M824016M442049M898736N197924N347420N498197O147448
14301A39040598O791075O757118P692133P440991Q369446Q745610R169638R825565
14293B03832174J0443564J0928700J1388542J1957972J2696004J2996822J4059649
14286B88303427J3999447J4501961J5149136J5308861J5561103J5498277J5217491
14279C93539703J5075680J4221048J3406560J2482571J0235248Q700399N839209
14272D73500418K601674O14651j333832p732054l265667j406019o080409p806995
14264D49091767r609768j0597817j1830426j3205599j4489773j5734290j6040519
$$ y = [72675640, 75351239, 78313628, 81100359, 84598330, 87559458, 91228602, 94854133, 98638105, 102684808, 107508824, 111950873, 116849609, 122047533, 127394953, 132893150, 139040598, 145831673, 152588791, 160280924, 167721915, 176091361, 184836971, 194006609, 203832174, 214275738, 225204438, 236592980, 248550952, 261246956, 274243778, 288303427, 302302874, 316804835, 331953971, 347262832, 362823935, 378322212, 393539703, 408615383, 422836431, 436242991, 448725562, 458960810, 467661209, 473500418, 476102092, 476716743, 475382911, 467650857, 464385190, 462979171, 456898762, 449091767, 439481999, 428884182, 417053756, 403848157, 389358384, 373624094, 357583575]
14257C57583575j6181822j5760973j5442743j4601088j3716393j3828350j3076640
14250B54975566j2253383j2074569j1271466j1080325r991899r069675q801055
14243A80433194q757046p705072p591309p419696o550029n721174n881832o000035
14235A24807001n189287n018699m662943m696039l603055m019007m238692l422548
14227H9956731l319541l324401k950995k837400k907323k804973k413270k234544
14219F7164284k148147k268507j983146k353687j602394j980986j117341j845368
14211E1864708j954146j327861j341668r09741j273317j090300j768043r50784
14203D1248848j267058p42413r96536p66511j221728j160496p64872r25699j060941
$$ y = [357583575, 341401753, 325640780, 310198037, 295596949, 281880556, 268052206, 254975566, 242722183, 230647614, 219376148, 208295823, 198303924, 189234249, 180433194, 171676148, 163971076, 156379767, 148960071, 142410042, 136688868, 130807036, 124807001, 119617714, 114599015, 109936072, 105240033, 101636978, 97617971, 93379279, 89956731, 86637190, 83312789, 80361794, 77524394, 74617071, 71812098, 69398828, 67164284, 65016137, 62747630, 60764484, 58410797, 56808403, 54827417, 53710076, 51864708, 49910562, 48582701, 47241033, 46331292, 45057975, 43967675, 42199632, 41248848, 39981790, 39239377, 38242841, 37476330, 36254602, 35094106, 34329234, 33403535, 32342594]
14194C2342594o11341o76576q27356p79221j076391l49035m18173p85709n02482
14185B6316310n72173n30154o32953o03325m19939o59965n03902l76871m68628
14176B1548400k80510p15869k97297n23045j34058p36207J21253p36145j431n11613
14166A7733478o68113K93467p06766j39362o19171R831m01940j23501j66855o29525
14156A4581543Q267p14761K84235j75202p43759j8936j29021l25059j48811n11372
14146A2107124M63975n64350n287j34666l69205j76838K0855n44506k4728J12835
14136A0885209j30490n08559n5422l10086k09422K87131m45528j98025j42019
14127I172789r1495q0203J59688n60184J08179K04722m24620j22261L6872L9413
$$ y = [32342594, 31731253, 31054677, 30227321, 29448100, 28371709, 28022674, 27604501, 26818792, 26316310, 25744137, 25213983, 24581030, 23977705, 23557766, 22897801, 22393899, 22017028, 21548400, 21267890, 20552021, 20254724, 19731679, 19597621, 18861414, 18982667, 18246522, 18245091, 17733478, 17065365, 17358832, 16652066, 16512704, 15893533, 15903364, 15501424, 15377923, 15211068, 14581543, 14589810, 13875049, 14159284, 13984082, 13240323, 13221387, 13092366, 12767307, 12618496, 12107124, 12571099, 12006749, 12001462, 11866796, 11497591, 11320753, 11341608, 10797102, 10772374, 10885209, 10754719, 10246160, 10190738, 9880652, 9671230, 9958361, 9512833, 9314808, 9172789, 9081294, 9001091, 9160779, 8600595, 8708774, 8913496, 8488876, 8366615, 8403487, 8442900]
14117H442900m35179J5159l89391J44407K41792n85031P0426k3746J6501k23599
14107G274239j09745j07039l03406L40020l91860J13498k49092j2695j46295j93385
14097F214240J53715j33977p5934J02576k63018m9865j17451j97447p9762K71651
14087E824728j33822j15822m0668p7190R6909k64010J84749m73403J24049K5115
14077E150635k66672J98679q3178O11l86629K40328j52678J4902j12984J87202
14067D790216k38873l01510J24785o9620l0846K15058J93901k38777q2797J67621
14057D529158K9358M3588k26024j74859k5356l56946J05551m5813R29j8642K330
14046C863274J3290j09655n4611l21774L56914k35063o3800k3334J79947K09l63349
$$ y = [8442900, 8007721, 8022880, 7633489, 7777896, 8019688, 7434657, 7505083, 7481337, 7497838, 7274239, 7164494, 7057455, 6754049, 7094069, 6702209, 6815707, 6566615, 6553920, 6407625, 6214240, 6367955, 6233978, 6158044, 6260620, 5997602, 5947737, 5830286, 5632839, 5553077, 5824728, 5690906, 5575084, 5534416, 5457226, 5554135, 5290125, 5474874, 5001471, 5125520, 5150635, 4883963, 5082642, 4999464, 5000075, 4613446, 4853774, 4701096, 4715998, 4603014, 4790216, 4551343, 4249833, 4374618, 4304998, 4274152, 4489210, 4683111, 4444334, 4361537, 4529158, 4558516, 4602104, 4376080, 4201221, 4175865, 3818919, 3924470, 3878657, 3879586, 3860944, 3863274, 3876564, 3766909, 3712298, 3390524, 3747438, 3512375, 3448575, 3425241, 3605188, 3605397, 3242048]
14035C242048J54077l5659j88019R5501j40271K04980l81872J52586Q6826J42204
14025C332401l75746M60111k78911j40685k80179K42658n4635L94847l68256j14738
14015B816867Q9810k49644j88407j0950M95828o71563K24877j94522N47985m40591
14005B419690J5534k6662K0783J63495k21852r2426k8362K83623r04258N28489
13995B158054q6450l6617M12508l7621k42472L82164Q77962J566291O452914K3111954
13985C4558687R187939j2709919j3493161p190442k969218j487824j085397q03499
13977D007166k93125l52993k05356N601N2328l36470m31627K79186p0446K8914
13967B683178j18724j25915q6437J73293j95398L57168k75763k98939n7722j8213
$$ y = [3242048, 3396125, 3360466, 3172447, 3267948, 3127677, 3332657, 2950785, 3103371, 3190197, 3332401, 2956655, 3416766, 3137855, 2997170, 2716991, 2959649, 2905014, 3299861, 2931605, 2816867, 2906677, 2657033, 2468626, 2457676, 2953504, 2281941, 2506818, 2312296, 2860281, 2419690, 2435224, 2408562, 2429345, 2592840, 2370988, 2278562, 2250200, 2533823, 1629565, 2158054, 2071604, 2034987, 2447495, 2409874, 2167402, 2549566, 3427528, 4993819, 11446733, 34558687, 43746626, 31036707, 17543546, 10353104, 7383886, 5896062, 4810665, 4007166, 3714041, 3361048, 3155692, 3161293, 3213621, 2877151, 2445524, 2724710, 2654264, 2683178, 2564454, 2438539, 2352102, 2525395, 2329997, 2687165, 2411402, 2112463, 2054741, 2036528]
13957B036528p5807K75410k4k64120R1200N101M92427m42536p6334p4997K91575
13946B258423J00514l39723r2722J07362r6747P2350p3170J63873l58534q440
13936A733186J57286j24381J7677j11138J70406J43330r0105m829m85017M5875
13926A452290K56276J42927o3434l58912L57364m32298N02545k31687L45417m66648
13916A503840j32866K07844j8162k40860K23926j22727J32612K0599p8874j73175
13906A322157L98784k01252J03253j06081k22327L50915l88387P0508J80934j31495
13896A377009R3892J84194j49997k28846M6611O9247K74844j73430K12041n46843
13886A158722K46021j64684j06283J98350n0204j52544l3554M52023l58786j4812
$$ y = [2036528, 1960721, 2236131, 2236107, 1971987, 2063187, 2068288, 2560715, 2118179, 2041845, 1966848, 2258423, 2358937, 2019214, 1926492, 2033854, 1937107, 2009457, 1936287, 2100160, 1741626, 1733186, 1890472, 1766091, 1783768, 1672630, 1843036, 1986366, 1896261, 1891432, 1406415, 1452290, 1708566, 1851493, 1788059, 1429147, 1786511, 1354213, 1856758, 1625071, 1970488, 1503840, 1370974, 1578818, 1560656, 1319796, 1543722, 1420995, 1553607, 1574206, 1495332, 1322157, 1720941, 1519689, 1622942, 1516861, 1294534, 1645449, 1257062, 1327570, 1508504, 1377009, 1470901, 1655095, 1505098, 1276252, 1322863, 1392110, 1666954, 1493524, 1705565, 1158722, 1404743, 1240059, 1133776, 1332126, 1281922, 1129378, 1095824, 1547847, 1189061, 1174249]
13876A174249j05283L56955n47539L06667M2235J24390n2041j28020K3904N1703
13866A247220K60888K3545m78704Q4546J14160m0075j07523K81376j90530N358
13856A200261q4563K29655j25538K0268j74502J31338k84953J06287q5993J59229
13846A091489K13806l61864R9155O5273n7326Q7221k25619q4282K14799J77065
13836A219717J6842k09923l14897K62038l3054p3938K76809l15294K42223k50828
13826H19695j06200N00344k15918j76353j3929n9193J25342J2992K61716l20845
13816H27651j24772K93982n8709P5938j63995j08544J52054J51665r1103m57935
13806D96232K13785L41232l40673L51586j23649j03700N0075J6577j19820M54788
$$ y = [1174249, 1068966, 1425921, 878382, 1185049, 1227284, 1351674, 1299633, 1171613, 1195517, 1247220, 1508108, 1531653, 1052949, 1137495, 1251655, 1211580, 1104057, 1385433, 1194903, 1200261, 1115698, 1345353, 1219815, 1240083, 1065581, 1196919, 911966, 1018253, 932260, 1091489, 1305295, 943431, 1042586, 1107859, 1050533, 1137754, 912135, 827853, 1042652, 1219717, 1236559, 1026636, 711739, 973777, 940723, 866785, 1143594, 828300, 1070523, 819695, 713495, 1213839, 997921, 821568, 807639, 748446, 873788, 886780, 1148496, 827651, 702879, 996861, 938152, 1014090, 850095, 741551, 893605, 1045270, 954167, 496232, 710017, 1051249, 710576, 1062162, 938513, 834813, 884888, 901465, 781645, 1236433]
13796A236433m05770J46420q6267q2901J85147k27876q3194J43006K81705l54174
13786G52529o6950O4241K35907l2665m46544J59189J23950J72227D41284L19024
13776G60308M3595j29113K56792k0716m25573L51123j89568K59280k44994K35177
13766H96311l49803L34669k08756R5982m9873k05399L82827m0624q0536j5716
13756G59082K18525l78570o3032K7215J01179J98718q99j16201k46357k4964K60940
13745G35636M2538K05829m14677L52675l07709M62783m79663J81224k27984M8839
13735E99491K59786k90668K59238j77531J41603j47110p1375J76951l13470M13472
13725H50387M6982r5878l70452M55271A92527M14918j98934J51702j11479J57978
$$ y = [1236433, 830663, 977083, 890816, 807915, 993062, 765186, 681992, 824998, 1106703, 752529, 685579, 749820, 985727, 953062, 506518, 665707, 789657, 961884, 441284, 760308, 803903, 674790, 931582, 910866, 485293, 836416, 646848, 906128, 661134, 896311, 546508, 881177, 672421, 768403, 718530, 513131, 895958, 855334, 774798, 759082, 977607, 599037, 536005, 563220, 664399, 863117, 862218, 746017, 499660, 474696, 735636, 778174, 984003, 569326, 922001, 614292, 1077075, 597412, 778636, 550652, 599491, 859277, 568609, 827847, 650316, 791919, 644809, 573434, 750385, 436915, 850387, 897369, 801491, 431039, 886310, 192527, 607445, 408511, 560213, 448734, 606712]
13715F06712L172j8235j48941L10460J47237l89583J70526J17630k77176P7823
13705E99625j59872J91618r5988L48533j45693r7161J72076B82182M04454p4199
13695F12437L3587j38209j49417J52247n7549M07995j83053k8259j2628J65994
13685H03145j69722j06542j12975K89478r522j54417N5617r1135A72238J88335
13675C60573j7359j34508J64618J30039J19718K8533B89468M17928j40980B25044
13664E43500r4292m3572j06045L82270j96580n533K62046B21293K77705K4788
13654E23786n7075J8774K6190j05487J69429k51962A22978K91699m6014J28821
13644D97484k40234K50092K73320l11671J02905B85854K24045L26070j88810F2797
$$ y = [606712, 609884, 591649, 442708, 753168, 900405, 510822, 681348, 798978, 521802, 599625, 439753, 631371, 535383, 883916, 738223, 641062, 813138, 282182, 686636, 612437, 646024, 507815, 358398, 510645, 453096, 861091, 678038, 649779, 637151, 803145, 633423, 526881, 413906, 703384, 693862, 539445, 595062, 503927, 172238, 360573, 343214, 208706, 373324, 503363, 623081, 651614, 289468, 707396, 566416, 225044, 543500, 449208, 405636, 299591, 681861, 485281, 479748, 741794, 221293, 498998, 523786, 466711, 485485, 511675, 406188, 575617, 323655, 122978, 414677, 368663, 497484, 257250, 507342, 780662, 468991, 571896, 285854, 509899, 835969, 647159, 62797]
13633C14482K41057l0362K32561k85949j31820r8050L5353K6206J07302j78283
13623B32497Q7526O2095R5805p2682M116A89762K68945j07491K46231j97949G764
13611B35381J98784j60616J12671j49108L19000B60119A29450R2806K58211B12072
13600C47548j34704O6169K10470o3474A64961L13798J32811j62040A93846H2744
13589E90506q7256p5064j28462q0546J06711J04730m6737N6674j27029R8612J08116
13578E20255B18544K98480R9568k39406j59806n2949L59134A62820K39996m0048
13568C62768c3742D88060k13044m5886L72135B64375O1607l1891M03059C35192
13557C49857A54823O2659K6285H5000M01704j82045N494A45925a372A29804K73918
$$ y = [314482, 555539, 525177, 757738, 471789, 339969, 241919, 277272, 303478, 410780, 232497, 320023, 382118, 477923, 405241, 409357, 189762, 458707, 351216, 597447, 399498, 7764, 235381, 434165, 273549, 386220, 237112, 556112, 260119, 129450, 222256, 480467, 212072, 347548, 212844, 279013, 489483, 426009, 164961, 478759, 611570, 449530, 193846, 82744, 590506, 503250, 428186, 299724, 219178, 325889, 430619, 383882, 440556, 313527, 412139, 520255, 218544, 517024, 616592, 377186, 217380, 164431, 523565, 162820, 402816, 362768, -33742, 488060, 275016, 229130, 601265, 264375, 325982, 294091, 697150, 335192, 349857, 154823, 217482, 243767, 85000, 486704, 304659, 310153, 145925, -1372, 129804, 403722]
13546D03722j17297H6155J56967L19379j40862j96199J33409j30126j975J37800
13536C64548K65780A30822B7749J27271K90032a3929E8844M85025k35677P2208
13526C80400j35412L00863j78453O2294k2524p5222B4680K42044G2945K45257
13516C18202K74055j45830B3217O43814k48611n919Q9075E4129L20904L1737F7984
13504E36062n5971B18880j03649M17523j46865p6971j28598N9427J8148j904N4542
13493C10533o7984L70405h9552G6257L24001Q7685K45115A25268L08402j87841
13483B45829O1261O7780O1288l5941A95798I6870L77746E8681J39448N6123n9473
13472A94779F9447K55686D2846O1921K7287L52701M8648B10897K31244A74111
$$ y = [403722, 286425, 86155, 243122, 562501, 421639, 225440, 358849, 228723, 226748, 364548, 630328, 130822, 27749, 155020, 445052, -13929, 58844, 543869, 308192, 380400, 244988, 545851, 367398, 429692, 407168, 331946, 24680, 266724, 72945, 318202, 592257, 446427, 23217, 667031, 418420, 412501, 501576, 54129, 375033, 406770, 67984, 536062, 480091, 218880, 115231, 532754, 385889, 308918, 180320, 239747, 257895, 255991, 310533, 242549, 612954, -89552, 76257, 400258, 487943, 733058, 125268, 433670, 245829, 307090, 374870, 436158, 400217, 195798, 96870, 474616, 58681, 198129, 254252, 194779, 69447, 325133, 42846, 104767, 132054, 484755, 533403, 210897, 442141, 174111]
13461B85744q0945J38393A69738q2292a04090A35550J0240L36766b08229B64094
13450C43380n9621c9845D39466m2665A42942C1512J35861J84620I1563c1683H6583
13438H3566J91279N6734Q4977j21274p4617d9912E2997J79175J38353a24102F9432
13426D2947K12598J40816q8651I9004N2098K54709D6541K83099K70000d9053C39247
13414C29470m7716J26206M237B1983Q4688D2631J27399l6475j0204n5187L35736
13403D03900A62809M1584m5450d502C00549A20633Q8946N31057l31722H4667J29372
13392B14039N2147h5459A99631O6992J39102A46632L31565H5029J93741p316n8897
13381B12557k5241F6613B877J62776N0199K07692J0390A80485J22910p0388L46017
$$ y = [285744, 204799, 343192, 169738, 87446, -104090, 135550, 145790, 482556, -208229, 264094, 343380, 283759, -39845, 439466, 396801, 142942, 31512, 167373, 351993, 91563, -31683, 86583, 83566, 274845, 331579, 416556, 295282, 220665, -49912, 52997, 232172, 370525, -124102, 69432, 42947, 255545, 396361, 307710, 99004, 151102, 405811, 46541, 329640, 599640, -49053, 339247, 329470, 281754, 407960, 412197, 21983, 106671, 42631, 170030, 133555, 123351, 68164, 403900, 162809, 204393, 158943, -4502, 300549, 120633, 209579, 740636, 408914, 84667, 214039, 266186, -85459, 199631, 266623, 405725, 146632, 478197, 85029, 278770, 271454, 212557, 187316, 66613, 2877, 165653, 215852, 423544, 433934, 180485, 303395, 233007, 579024]
13370E79024B29034n3982J72420j0440j05062D4985f6327C77437A06967B0515
13359B50783b2020k5265B32918E8187J88029J34406J62662k9099E7908L25681
13349C83589A15423J04488i1987A59329m0440J78647A26581L55128B37909N26996
13339G64905B48615K45672A20888a67078A70173K3665m9855J91554j61191m7156
13329A27190c5383D75186b80148D5965c877B53575J21445b56207d8052j82556
13319b30608B3137d1833B39418J87418k02026h420p8156A73942N5572o2810L06949
13308D73653M9195A7901K60043Q0867A09355C7050h6259K870B18479a55289c439
13296C21780H9495J28080J7235f5447B32362P6922n5629M0447B312i2720A40282
$$ y = [579024, 229034, 175052, 347472, 337032, 231970, 44985, -66327, 377437, 106967, 20515, 250783, -22020, -47285, 232918, 58187, 246216, 380622, 543284, 514185, 57908, 383589, 115423, 219911, -91987, 159329, 118889, 297536, 126581, 481709, 237909, 764905, 248615, 494287, 120888, -167078, 170173, 193838, 143983, 335537, 174346, 127190, -35383, 475186, -280148, 45965, -3877, 253575, 375020, -256207, -48052, -230608, 23137, -41833, 239418, 426836, 224810, -8420, -86576, 173942, 229514, 166704, 473653, 522848, 17901, 277944, 358811, 109355, 37050, -86259, -83389, 218479, -155289, -3439, 321780, 89495, 217575, 234810, -65447, 232362, 309284, 253655, 294102, 2312, -92720, 140282]
13284A13996k0166D5413Q803J72135K42601n3573H463b37296H9467B820J80459
13273A83279b04041B51679k5913A12817D8330O1950C3390L7325K36464A07016
13262A91539q2746J39598q5944N2885I0409J08273L4088a7589B38993a70955A59289
13250C91162p3346J66551a64429H0396k1215J1007d3043A85448I0790J20547J11400
13239C22737I1477M39872A89606d0782A37251L26296c03102F6689K5386K7812
13229A19887J73127b74282a920G4638l489J08776H5598R3846a76261C36654A11892
13217a7532A41127K01565l3161D1134K81479o4416i1053F7811L0879A6241K07746
13206B23987a10739A9643J98155a35266a4183o0838A22827H047J25280J01135
$$ y = [113996, 93830, 45413, 54216, 226351, 468952, 415379, 8463, -237296, 89467, 2820, 183279, -204041, 251679, 225766, 112817, 48330, 110280, 33390, 70715, 307179, 107016, 191539, 108793, 248391, 162447, 215332, 90409, 198682, 232770, -17589, 238993, -170955, 159289, 391162, 317816, 484367, -164429, 80396, 59181, 70188, -43043, 185448, 90790, 211337, 322737, 91477, 531349, 189606, -40782, 137251, 463547, -303102, 66689, 92075, 119887, 293014, -274282, -1920, 74638, 71149, 179925, 85598, 179444, -176261, 336654, 111892, -17532, 141127, 342692, 309531, 41134, 322613, 258197, -91053, 67811, 98690, 16241, 223987, -110739, 19643, 217798, -135266, -14183, -75021, 122827, 8047, 133327, 234462]
13196B34462d6585j45755D59401a20432a2989G265J74725M0593e181B49894F0851
13184I0294K27511o2675K55386k44240B3066j0206b05437D8665R0997d393B74468
13172a9281B16616b94652b391j50565B41886B9576J6058L6204N679b4116A09113
13160A96338k9909e5273D7239J56953K17986A07417j9049C0105J56960n6691A3867
13148b11850A13831l7730M5168d9732B23907D2997i4341D8834J25468K04469a77598
13136H5735l4391K24531h9124k6992D1734J0020K48270A39849K1874R4899r6307
13125A60315Q52J05497A6241i2902k25153B18660r6770a55599m5944H741P0377
13114G9118A5325a700C6715J70995h0067C03073H8735J02543M1849e0130p202
$$ y = [234462, -46585, -192340, 459401, -120432, -12989, 7265, 181990, 222583, -5181, 249894, 60851, 90294, 317805, 255130, 510516, 266276, 23066, 12860, -205437, 48665, 139662, -4393, 274468, -19281, 216616, -294652, -2391, -152956, 241886, 29576, 45634, 81838, 87517, -24116, 109113, 196338, 166429, -55273, 47239, 204192, 422178, 107417, 88368, 30105, 187065, 130374, 13867, -211850, 113831, 76101, 121269, -49732, 223907, 42997, -94341, 48834, 174302, 378771, -177598, 85735, 51344, 275875, -89124, -116116, 41734, 51754, 300024, 139849, 161723, 256622, 160315, 161167, 266664, 16241, -92902, -318055, 218660, 121890, -155599, -201543, 8741, 79118, 15325, -1700, 36715, 207710, -80067, 303073, 88735, 191278, 233127, -50130, -57332]
13103e7332C25328M2068C8484J4047M00161B4058P3073K31970A8542a46423A28042
13091B0429p203e9398a4581k07422F9461Q3549j3144l4557b37917B38436J0510
13080B48946B8546J99089E4278J85225a5242j74856A96250K077E3651K85534b6483
13068F3352J7928J65578K6507J02665B4541M09616j2936D8396a48432G4813M64874
13057E39687B39350a09881b0736B62573h1640A52450L4429p0231Q9616B7873K59199
13046B87072K08919j99639D738J88957l7907E6264J39701I3711J67332A30097
13035A6137c77035a68460A72016K82629j22693A54812J48739d2741D27623j93724
13025B33899n2424D4981R2759J39280D7286J19908M3445G2535J7447N2899g1808
$$ y = [-57332, 325328, 367396, 38484, 52531, 452692, 24058, 97131, 329101, 18542, -146423, 128042, 20429, 13226, -59398, -14581, -222003, 69461, 153010, 139866, 105309, -237917, 238436, 248946, 28546, 227635, 54278, 239503, -15242, -190098, 196250, 198327, 53651, 339185, -26483, 63352, 81280, 246858, 273365, 376030, 24541, 434157, 421221, 48396, -148432, 74813, 539687, 239350, -109881, -20736, 262573, -81640, 152450, 186879, 116648, 206264, 27873, 287072, 495991, 296352, 4738, 193695, 155788, 56264, 195965, 93711, 261043, 130097, 16137, -377035, -168460, 172016, 454645, 331952, 154812, 303551, -42741, 427623, 233899, 181475, 44981, 137740, 277020, 47286, 167194, 210639, 72535, 89982, 142881, -71808]
13013A07456J6622K77784a47154B57163B3533d4182C0040K86204a69097B7019
13002B30924D5686a7935B18126b72042A92447R8387H663d7458p6317A28474c67189
12990B11686a4317l9738E8927c6462q5050A15790b5117r808B88869e3681B571
12978C86631A12101d6867j37752f9849A76281a07492p0953B02864a6370A43093
12967F538O2725K49496k6311j18617m4009j9340K2365l3000N1340J07773B6626
12955b1690D06549A7025c53931A35066J32483j02273p6548g7282F189M7226J30138
12944A83553A0287J44773G7314J00635b46276a6858C8385K09537J43335D9673
12933C36405F4244b43101g8221B00789g5050I5495b4856A42377b22637A10996
$$ y = [107456, 124078, 401862, -147154, 257163, 23533, -44182, 30040, 316244, -169097, 27019, 230924, 45686, -17935, 218126, -272042, 192447, 290834, 8663, -47458, -123775, 128474, -367189, 211686, -14317, -54055, 58927, -36462, -121512, 115790, -25117, -34925, 288869, -53681, 2571, 386631, 112101, -46867, -184619, -69849, 176281, -107492, -178445, 202864, -16370, 143093, 6538, 69263, 318759, 292448, 173831, 129822, 110482, 132847, 99847, 151187, 258960, 26626, -21690, 406549, 17025, -353931, 135066, 267549, 165276, 88728, -77282, 6189, 53415, 183553, 10287, 155060, 77314, 177949, -246276, -16858, 38385, 247922, 391257, 49673, 336405, 64244, -243101, -78221, 200789, -75050, 95495, -24856, 142377, -222637, 110996]
12922B13778b09592I8374R9427e904B61086j29641k7107M81a3538E4304O1003
12911A15307L37754a3026q2115c3386k04670G6402f0764A10312j7871a53924j27868
12900b81792j43439D8997L15988a5252A15189J65975C551a61775J0498H3795P0571
12889A54366e4070B11924j4820J24442h0401B8060d2985A17938a82269b1977H4293
12877A52906l9050e0608J883A87285G4146N7072d15811A5379b01042J4092j30429
12866c17379A56732a19732H476O1972i052p1819a3169l0399r1969C3274d6820
12854B757a37882K3439D3873a29282n3501O6194C25997A45776E1367K70995J14963
12843D37325E8156N470J42149d9474q6987A05464B9407M38131i832D40737B0879
$$ y = [213778, -209592, 98374, 197801, -5904, 261086, 131445, 104338, 104819, -13538, 54304, 115307, 453061, -13026, -95141, -33386, -238056, 76402, -60764, 110312, 92441, -153924, -281792, -425231, 48997, 364985, -15252, 115189, 281164, 3551, -161775, -151277, 83795, 154366, -54070, 211924, 197104, 321546, -80401, 28060, -42985, 117938, -182269, -21977, 84293, 152906, 113856, -50608, -48725, 187285, 74146, 131218, -415811, 15379, -201042, -186950, -317379, 156732, -119732, 8476, 70448, -9052, -80871, -13169, -43568, -135537, 33274, -46820, 2757, -137882, -114443, 43873, -129282, -182783, -116589, 325997, 145776, 51367, 322362, 437325, 58156, 63626, 205775, -49474, -136461, 105464, 29407, 467538, -9832, 440737, 20879]
12831A40628d3295O646A49625b668A40617n44a12097M1610A61932a05365r5316
12820b00681A00397c92577h9117n7341B63842O3486E6124J9990C3630O4386a05587
12808e1119D04678D2967P4239a4003l1970j49745C089J26233m6371c4254A28292
12796i1218C23825j42312G6823c3174a4632C77963j44866C3062J6876F980b22164
12784b14437A24240B3511J3858L88386b9699k4472p0366j3550H3919N7284k9974
12773A11229g8229G6664J95475b16980p3866l3668c8826p4969B11121b57622A29948
12761B68423j15625e7280E8447a49188F7466e801G1134l4853b2713G1536B8534
12749i6457k7094G607i7665A75313J4839b20435G2565b768r292r5760A93172b08235
$$ y = [140628, -43295, -36649, 149625, -2668, 140617, 140073, -112097, -70487, 161932, -105365, -200681, 100397, -392577, -89117, -146458, 263842, 327328, 56124, 76114, 33630, 98016, -105587, -51119, 404678, 42967, 117206, -14003, -45973, -195718, 3089, 129322, 82951, -34254, 128292, -91218, 323825, 181513, 76823, -33174, -14632, 377963, 233097, 33062, 49938, 6980, -222164, -214437, 124240, 23511, 37369, 425755, -29699, -54171, -124537, -138087, 83919, 141203, 111229, -78229, 76664, 272139, -216980, -290846, -324514, -38826, -113795, 211121, -257622, 129948, 268423, 152798, -57280, 58447, -149188, 67466, -5801, 71134, 36281, -22713, 71536, 28534, -96457, -123551, 7607, -97665, 175313, 190152, -220435, 72565, -2768, -12060, -107820, 193172, -208235]
12736C09738a35607C67628a01239M63A38411E5505P952J33882k9089j9377b11582
12724C24652e2009A4959a10111H3923A3272O2139K0867J88792D0214O4695n588
12713I9321K70704A2586L65870A84227L44317a5422C31675K56341j76760N5134
12703D66390B14673J38471j101D8225k2405O7066g9953b431C01903j42017k4780
12692A35106n8400K8176G966J27700a56744c7139G3838c3270j87449A21278K19857
12681C41135A27760i9502B79035A19392h1916A07791k4944B8413a9621m8065C52384
12669A59564G7907J40173a43304q8838j9921A95494n4954J8337J11195g3189H3570
12657a09970B19993N59011l69958a19939D00702J30853b20010A30826C7860J78430
$$ y = [309738, -135607, 367628, -101239, -100776, 138411, 55505, 63457, 197339, 168250, 148873, -211582, 324652, -52009, 14959, -110111, 83923, 13272, 75411, 96278, 285070, 40214, 104909, 99321, 370025, 12586, 378456, 184227, 528544, -15422, 331675, 588016, 411256, 466390, 214673, 353144, 352043, 48225, 25820, 92886, -79953, -2431, 301903, 159886, 135106, 76706, 104882, 7966, 135666, -156744, -37139, 73838, -33270, -220719, 121278, 341135, 127760, -99502, 279035, 119392, -81916, 107791, 82847, 28413, -19621, -67686, 352384, 159564, 77907, 218080, -143304, -232142, -252063, 195494, 140540, 158877, 270072, -73189, 83570, -109970, 219993, 779004, 409046, -119939, 400702, 531555, -220010, 130826, 37860, 216290]
12647B16290D8905J13422p5333l0277i9696A33107P8523p3777L5162l1811B1116
12635i4105j03911C7500a64195B2886K92028A05865B3578H618K52652G244L17585
12624C24829p4244J42357E1515j4109K39532j21429J50857J9358a9949k40857
12614b60806B21036b41222a8124A28217K66292A50594j7065J50268A0001a0698
12603g9693B46567b14956C85199F1785Q941J04111O573J58296A41518A1676a68317
12591A3606o76J25430K60354a7428m541o8516j28401R2904E4515K8712J7496B8913
12578a15746A42205b82664B57846H445h8140j7450A99469a3382C5631g2458m2047
12567a14505D6415J38978O365b0099B116K27095F1634J183g3150j46333B22051
$$ y = [216290, 48905, 162327, 86994, 56717, -99696, 133107, 211630, 137853, 173015, 141204, 21116, -94105, -198016, 37500, -164195, 22886, 314914, 105865, 23578, 8618, 261270, 7244, 324829, 250585, 392942, 51515, 37406, 276938, 155509, 306366, 325724, -19949, -260806, 221036, -241222, -18124, 128217, 394509, 150594, 133529, 283797, 10001, -10698, -79693, 246567, -214956, 385199, 61785, 70726, 174837, 181410, 339706, 141518, 11676, -168317, 13606, 12930, 138360, 398714, -17428, -21969, -90485, -218886, -125982, 54515, 83227, 100723, 28913, -115746, 142205, -282664, 257846, 8445, -88140, -105590, 199469, -13382, 35631, -72458, -114505, 46415, 185393, 191758, -20099, 2116, 229211, 61634, 62817, -73150, -219483, 222051]
12555a29454r1864G2013M0015J31406A03499B0758K4157K1906l2069e1860A3237
12543A71426q4340a15258j2221j49864B05756a15411A56537J72943a76146p7233
12533b53379B1011g3600H737L19076r6491J78748b10452C0365L51387a13938A58285
12521B35674F4395K50720a88407A34453E4004k5708K75317F3468J28112p3874
12511A17706J72678j20552m715n283K8938a42135O6825A91261e4089k43310a07933
12499D0045K27448B23a07420B94756c9547j83393E94870a79104F1962k9991f0568
12487a22737D5478K5094b0228G9497g5686j45118A52850E4552a62595P9887c8899
12475A0906g4017j436p4501j54699J20822a4103E2166J09851p679m9825k7144
$$ y = [-129454, -221318, 72013, 112028, 243434, 103499, 20758, 44915, 66821, 34752, -51860, 13237, 171426, 87086, -115258, -127479, -277343, 205756, -115411, 156537, 329480, -176146, -253379, 21011, -73600, 8737, 327813, 231322, 410070, -210452, 30365, 381752, -113938, 158285, 235674, 64395, 315115, -188407, 134453, 54004, 28296, 303613, 63468, 191580, 117706, 290384, 169832, 165117, 159834, 188772, -142135, -75310, 191261, -54089, -297399, -107933, 40045, 267493, 223, -107420, 294756, -39547, -222940, 594870, -179104, 61962, 31971, -60568, -122737, 45478, 70572, -20228, 79497, -75686, -220804, 152850, 54552, -162595, -82708, -38899, 10906, -74017, -75453, -149954, -304653, -183831, -14103, 52166, 162017, 154338, 104513, 77369]
12464G7369a71287f3347F6417I752b1782A68295b0500j79318l3982B98976A19542
12452a44343C64268A07536c9094A49229c4171k34924B46668L8477p2755O5044
12442B77434c78620A35706D8409J53882I3109f8098J5132B82391c65531A63032
12431c2973A95676I2283b7682l9079o5879b5127j17260e2408j80626H6461a27589
12419A34365E0646J67445d6618A046J5516O6912Q0371D7541N7968D0120c01625
12407B61909d3932r6781j31127N5156l5789B51290e1995A09257O8443b31375C36195
12395G4073j7327f936k5283r5888b6230G037K78830b71290E2934a07848j56328
12384b64176A04658m9579R7356J04810c05452J43916a2429I5987k5190C0476f0950
$$ y = [77369, -171287, -63347, 66417, 9752, -21782, 168295, -20500, -199818, -233800, 298976, 119542, -144343, 364268, 107536, -39094, 149229, -34171, -269095, 246668, 285145, 212390, 277434, -378620, 135706, 48409, 202291, 93109, -68098, -52966, 282391, -365531, 163032, -32973, 195676, 92283, -27682, -66761, -132640, -25127, -142387, -52408, -233034, 86461, -127589, 134365, 50646, 218091, -46618, 1046, 16562, 83474, 163845, 47541, 105509, 40120, -301625, 261909, -43932, -140713, -271840, -216684, -252473, 251290, -51995, 109257, 177700, -231375, 336195, 74073, 56746, -6936, -32219, -128107, -26230, 7037, 285867, -271290, 52934, -107848, -264176, 104658, 55079, 152435, 257245, -305452, -161536, -12429, 95987, 70797, 30476, -60950]
12372a77405C37377G8724a79523h13A7350J46039C8148Q6885c47647K2623A69380
12360A00172j6911c9216B16410r5203i2648B088K3290a53294m6126P2293A61173
12348B60203A04826O0778F1390J80561b26509l0614c6992m1840j92443A76065
12337c31983J51110A02416b226p6488m3323A59506g608m4765j48733Q2933N5382
12326f2791j33628k18039J33668H2034N5679O4066b05328F9141b44727A50464
12315A69807D8096g2185j24090B5229J95693H5418J65058F7842f3238F982L3331
12304D0313a56648f9544A07178J00964O009P9377J2245n6056b07394C49016a13002
12292B51527l4891i7313F4023P3268J50588A14171K00518A53074J53653c98422
$$ y = [-177405, 337377, 78724, -179523, -813, 17350, 163389, 38148, 125033, -347647, -325024, 169380, 100172, 83261, -39216, 216410, 121207, -92648, 2088, 25378, -153294, -199420, -127127, 161173, 260203, 104826, 165604, 61390, 241951, -226509, -257123, -36992, -78832, -271275, 176065, -331983, -180873, 102416, -2226, -78714, -122037, 159506, -7608, -52373, -201106, -118173, -62791, -196419, -414458, -280790, 82034, 137713, 201779, -205328, 69141, -244727, 150464, 169807, 48096, -72185, -196275, 25229, 220922, 85418, 250476, 67842, -63238, 6982, 40313, -156648, -69544, 107178, 208142, 214151, 293528, 305773, 249717, -207394, 349016, -113002, 251527, 216636, -97313, 64023, 137291, 287879, 114171, 314689, 153074, 306727, -398422]
12281D42423A51915f2961B60717H2991a70041A1138K72772l9041K15894m4918
12271D15845J03105k57142L3851A01613C1881R5199O462B5939d2396F3597h4045
12259B46127F8916l3665O2421C3031J25456d4579B1919J76802g1714K4899k3812
12248g0627o7655A89405M2279R8778n9017N0E8894K0159P946J41631g2858A27977
12235H7986g4562A69046N1766o1465C2223L65102j86825q2493Q6320H669K39893
12224B48562F1064K51491A52560J80563j2929P7680A71031p3934J02845H4862
12213h7264m1559C28434c9655J3859B48993D3170i6451A89953a37718A23496K01617
12202C25113j00300a77073C46487G757h4349E4331K01661A8221O481a44701n661
$$ y = [442423, 151915, -62961, 260717, 82991, -170041, 11138, 283910, 244869, 460763, 415845, 518950, 261808, 295659, 101613, 31881, 127080, 133542, 25939, -42396, 63597, -84045, 246127, 68916, 35251, 97672, 33031, 158487, -44579, 21919, 198721, -71714, -46815, -70627, -138282, 189405, 231684, 330462, 271445, 271495, 58894, 79053, 86999, 228630, -72858, 127977, 87986, -74562, 169046, 220812, 159347, 32223, 397325, 210500, 128007, 214327, 8669, 248562, 61064, 312555, 152560, 333123, 320194, 397874, 171031, 97097, 199942, 84862, -87264, -128823, 328434, -39655, -25796, 248993, 43170, -96451, 189953, -137718, 123496, 325113, 224813, -177073, 346487, 7757, -84349, 54331, 255992, 18221, 24702, -144701, -150362]
12191a50362B56270I0589K53614a5787B05890k3062l0983K84775a05945M4096
12181f1849F092K74731m5934b1757A52438h2002F0839c7286B74231p2974r8076
12170A03181h7940A564Q6017J2929a00199A71401D9634N2229J33767D5562K80457
12159C26019f7398c3002o8427B0406P4870J25249C1001O8356O827r900L71083
12148D67367c8885A33690H415a31867B2785b0711m7028F3440f1499B27839G9508
12136C36259J15695F9577J0493g9507h422j29483A19277f0026A10172J08619E9944
12124f5214I1296J4516K26177D3207J16848J17993A7307J55134a41287b2097A85605
12112b0933j33474f765l1174E1750b87348A2515J1073b12468D9675Q6713C9758
$$ y = [-150362, 256270, 90589, 344203, -15787, 205890, 182828, 151845, 436620, -105945, -61849, 6092, 280823, 234889, -21757, 152438, -82002, 60839, -37286, 274231, 201257, 103181, -87940, 1564, 87581, 100510, -100199, 171401, 49634, 101863, 235630, 45562, 326019, -67398, -33002, -101429, 20406, 95276, 220525, 31001, 99357, 106184, 96284, 467367, -38885, 133690, 8415, -131867, 22785, -20711, -67739, 63440, -61499, 227839, 79508, 336259, 451954, 69577, 80070, -79507, -8422, -137905, 119277, -60026, 110172, 218791, 59944, -65214, 91296, 105812, 331989, 43207, 160055, 278048, 17307, 172441, -141287, -22097, 185605, -20933, -154407, -6765, -37939, 51750, -287348, 12515, 23588, -212468, 49675, 136388, 39758]
12100A34928o4402J94208I6658d2246m6875F171J59024a84647F7760O7797P7442
12089B12999C7228R9913d20823d8388k17690R1477j83450J58260B31405M4837
12079B76242e553j81379A05110L09112j54450O4874J522258J8099p15210n71759
12069E78034A56691K807B010d2442j53249e5927A21226M933E3801c8068B59100
12057f074B47675c6303A74853f1884j30764c0740A08520b69726A09692c32084
12046g91A49696a9611A6371a36918A45508a67474g1720H3012f6621C7594L9226
12035G6820d89337a99927m5968A35092b37260b8213A02409a1713A17012g5279
12024a32379L9800b0795n4442B59271a30807o0309A81387c37416A89238a90559
$$ y = [134928, 70526, 264734, 96658, -42246, -89121, 6171, 165195, -184647, 67760, 135557, 212999, 37228, 137141, -420823, -48388, -266078, -174601, -358051, -199791, 231405, 276242, -5553, -186932, 105110, 414222, 259772, 324646, 1846904, 1865003, 1149793, 578034, 156691, 159498, 2010, -42442, -195691, -55927, 121226, 126159, 53801, -38068, 259100, -6074, 247675, -36303, 174853, -61884, -192648, -30740, 108520, -269726, 109692, -332084, -791, 149696, -19611, 16371, -136918, 145508, -167474, -71720, 83012, -66621, 37594, 76820, -489337, -199927, -245895, 135092, -237260, -28213, 102409, -11713, 117012, -75279, -132379, -92579, -20795, -75237, 259271, -130807, -191116, 181387, -337416, 189238, -190559]
12013B82350D1694d4253A01447j3150K61354B7753b10607B84794c7286r3104C63148
12001a25571q265e2345r373r791I5653a9616B71808e47678b8524r539A39809l3513
11989A06296m1496i3793L7320q1038j44882h0162l10560A800K20641C0927h7887
11977G1127d01326C8974e8893G1996k0838l467a52315B4590i3262E7823Q8972
11966A46795Q823d23349J42139G5990a63051D2686a47410n9685f8593D8462c0250
11954H7609d583A517a27567N8958k14759f6099C8582a15613A36971o0642A7287
11942A85095K0663N6024a01108m5250A01399G163c31447D2078g360B16975E9652
11930b91741J12246K3240F3703J01288a61399D9848a60522B51029c902H4009f3189
$$ y = [282350, 41694, -44253, 101447, 88297, 349651, 27753, -210607, 284794, -37286, -130390, 363148, -125571, -133836, -52345, -61718, -71509, 95653, -19616, 271808, -547678, -28524, -38063, 139809, 106296, 64800, -93793, -56473, -137511, -282393, -80162, -390722, 1800, 222441, 30927, -87887, 71127, -401326, 38974, -58893, 71996, 51158, 47691, -152315, 24590, -93262, 57823, 146795, 155618, -423349, -281210, 75990, -163051, 42686, -147410, -207095, -68593, 48462, -30250, 87609, -4583, 1517, -127567, -68609, -283368, -66099, 38582, -115613, 136971, 76329, 17287, 185095, 205758, 261782, -101108, -146358, 101399, 7163, -331447, 42078, -7360, 216975, 59652, -291741, -179495, -156255, 63703, 164991, -161399, 49848, -160522, 251029, -3902, 84009, -63189]
11918F4019a98606e6581m1729k07887P1358j890A14376b8273j23340L2111j74775
11907b94277B68298b5936k02845B22856E1264a60071B63054n6948D1222e5336
11896c0241k6623A52800J20233A00938K7946b14059j29448B11460b86225A37660
11885a63877A66146F6017J76465b71492e4815E4226a06548A4619J46408c5429
11874B75482H3590J19348a04911k58293a00789j37315e0945G8074a22835A55461
11863d01451E6877A1266a26227F592J36599L4633a75820K5324j78460B7820c2065
11851a34576A60150J23a45398B40184b6694A04916L4388l3607c18606a58897A11379
11839D7827b46637J21340j26170B03332b1168C4299b49973A77124R37a39117C14186
$$ y = [64019, -198606, -56581, -98310, -306197, -234839, -236729, 114376, -28273, -151613, -119502, -294277, 268298, -25936, -228781, 222856, 51264, -160071, 263054, 206106, 41222, -55336, -30241, -56864, 152800, 273033, 100938, 128884, -214059, -343507, 211460, -286225, 137660, -163877, 166146, 66017, 242482, -271492, -54815, 54226, -106548, 14619, 161027, -35429, 275482, 83590, 202938, -104911, -363204, -100789, -238104, -50945, 78074, -122835, 155461, -401451, 56877, 11266, -126227, 6592, 143191, 177824, -175820, -150496, -328956, 27820, -32065, -134576, 160150, 160273, -145398, 240184, -26694, 104916, 139304, 105697, -318606, -158897, 111379, 47827, -246637, -125297, -251467, 203332, -21168, 34299, -249973, 177124, 178061, -139117, 314186]
11827G4303L1775L8184b2038j26387B19456g1738B43662G0240L821d244D57764
11815i9956n8592a3601l3136k20070b1524D52728c07999f0340j30905L2737q1085
11804b39593i0630B13307O127C8610L2516A3394a28553d3100B65751H1004N4294
11793A35298n3914f5454F8253L8996f5667r057B03916I6508k8594a4239l0527
11782d4766n0626D5636J34232h0914E8192P7223C4012J31670g257j71472O8887
11771a09842l00902B13869d2460A56711a0339B58939o6421B158a24271A29064
11760B29272A02474a53872H0161d5636q8349A16830i7472K5704F9764M4325b94682
11748h5978A91751i3998D8697a24510A01459k8909b94809c5341a0879A23547P9623
$$ y = [74303, 106078, 144262, -22038, -148425, 219456, -71738, 243662, 70240, 74061, -4244, 457764, -99956, -158548, -13601, -46737, -266807, -21524, 452728, -307999, -60340, -191245, -158508, -239593, -90630, 213307, 219434, 38610, 71126, 13394, -128553, -43100, 265751, 81004, 135298, 81384, -65454, 68253, 107249, -65667, -74724, 203916, 96508, 67914, -14239, -44766, -95392, 45636, 179868, -80914, 58192, 135415, 34012, 165682, -7257, -178729, -109842, -410744, 213869, -42460, 156711, -10339, 258939, 192518, 2158, -124271, 129064, 229272, 102474, -153872, 80161, -45636, -133985, 116830, -97472, -71768, 69764, 114089, -294682, -85978, 191751, -93998, 48697, -124510, 101459, 72550, -294809, -35341, -10879, 123547, 203170]
11737B03170c46856A76570M6482j03186b55861g6455c3171a178A17955L4466g0674
11725b3101A52851K69021k6521A50951b74235l544i3259F1005J19525o9852g6185
11713a12936C14445a5980A85795p0661R3826a11021a7034n4807j5014A9800K43182
11702B62982m1350q1601F4440k9537b9420k16727G6023J0051K42256l3661D2835
11690G0177a33370C37916E5120h5073n3263A58528a76087q9100J20076A56130
11679A56527c18739B42480o1675P5298g9924j33219A74427j5615o8929q60j0186
11668G8837L10356N97h8966B76991f2832p2530A24242f3632G8396J95024I0800
11656h8162c3738A56582b37618f3400p1235D1688K95267o3733c0621B71121b12884
$$ y = [203170, -346856, 176570, 223052, 119866, -255861, -76455, -33171, -1178, 117955, 152421, -70674, -23101, 152851, 421872, 395351, 150951, -274235, -277779, -93259, 61005, 180530, 110678, -76185, -112936, 314445, -15980, 185795, 115134, 208960, -111021, -17034, -71841, -86855, 19800, 262982, 221632, 140031, 64440, 34903, -29420, -246147, 76023, 86074, 328330, 294669, 42835, 70177, -133370, 337916, 55120, -85073, -138336, 158528, -176087, -265187, -145111, 156130, 156527, -318739, 242480, 180805, 256103, -79924, -213143, 174427, 158812, 89883, 89023, 78837, 389193, 389790, -88966, 276991, -62832, -135362, 124242, -63632, 78396, 273420, 90800, -88162, -33738, 156582, -237618, -63400, -134635, 41688, 336955, 273222, -30621, 271121, -212884]
11644G3427K90181C7897K16669b80263a21544e8047b5260p9301k69351K5170J32088
11633b16654B14675q1443a70977l618A02454J6555k9726a42529e4501m3956J1958
11622h6499A85869a10620a1801A21462a21193G1824a37331c0042A62756J23630
11612B86386P3342b04209C22894a28688j19366I341e0369G6039N2977d9201B44172
11600A858h3948o5916B8431K4434d868m8339H5368b01051i2226B49488K1523a00715
11587f3947D04213j29416F9609L06660b0927C01827A5411K70437A14179J71671
11577B85850A38497B1377g9810j24378F8511f4257D28505d3671C00797N473a6090
11565a43942A19928A1379E327J72552J97147j74144c2163A41771N5606h8249B43943
$$ y = [73427, 363608, 37897, 254566, -280263, -121544, -58047, -25260, -104561, -373912, -348742, -216654, 214675, 133232, -170977, -174595, 102454, 119009, 89283, -142529, -54501, -98457, -86499, 185869, -110620, -11801, 121462, -121193, 71824, -137331, -30042, 162756, 286386, 359728, -204209, 322894, -128688, -248054, 9341, -50369, 76039, 129016, -49201, 244172, 1858, -83948, -149864, 28431, 52865, -4868, -53207, 85368, -201051, -92226, 249488, 271011, -100715, -63947, 404213, 274797, 69609, 376269, -20927, 301827, 15411, 285848, 114179, 285850, 138497, 21377, -79810, -204188, 68511, -64257, 428505, -43671, 300797, 306270, -16090, -143942, 119928, 11379, 5327, 177879, 375026, 200882, -32163, 141771, 197377, -88249, 243943]
11553C12606c15398B15926D1883a0943D8929P8189i7491c7202B2254J33589J76623
11542C32466j58541J46270J29315A6138n253a45640B0141g7336A17083B2212I648
11530b8636B71109a67993a6635j27190A35955F231b64401A18136J19509j02793
11520A34852A0482e3511C28173L0405k2740c055A51921J0959G247e8108C89480
11508B96032n2740j3654H6370L22629a38793D5781J45088a30083k05077B90317
11497C22871M2448a6529j0106G3488J89120j08821a58643P3944C13542C0631J50310
11486A80941c65649b2067B55652A13804R2138J35813i343C00736A02280J0676
11476A12956B1284K04278L76815A46306k6643M4232J5182J48054A31897c6629
$$ y = [312606, -315398, 215926, 41883, -10943, 48929, 127118, -97491, -37202, 22254, 155843, 332466, 173925, 320195, 449510, 16138, 10885, -145640, 20141, -77336, 117083, 22212, 9648, -28636, 271109, -167993, -16635, -143825, 135955, 6231, -264401, 118136, 237645, 134852, 10482, -53511, 328173, 358578, 335838, -3055, 151921, 162880, 7247, -58108, 389480, 296032, 243292, 229638, 86370, 408999, -138793, 45781, 190869, -130083, -335160, 290317, 322871, 365319, -16529, -26635, 73488, 262608, 153787, -158643, -84699, 313542, 30631, 180941, -365649, -22067, 255652, 113804, 205942, 341755, -9343, 300736, 102280, 112956, 21284, 225562, 602377, 146306, 119663, 163895, 179077, 327131, 131897, -36629]
11465A04166a11282j32419a6011C46756A32411J08343K10376l8097I699K78570
11455B88269a00124C56506F9678b6420B57085C8592L99618j53686A17100J62497
11445B79597F4429j5268K03562c556j37886B20889Q6897j45590K75846A29209
11434A44585b30298A0165a54409g7080A5805h456j61282f1482A82757E0005L2923
11423H2928l3282a05740l9979F253h5494I6358L588b12589b9022B41820a82268
11411i7989E8923h9247j76335b4061C09492e31273C41791B2400J09910F1095a17560
11399A71518J13182j25037a01216A10024k7283a65800B16749F3862a7753k35539
11389b53292D4700J39429G1007a39052j15466F9810a4391G0172P2993J02358n3039
$$ y = [104166, -111282, -243701, -16011, 346756, 132411, 240754, 451130, 413033, 9699, 288269, -100124, 356506, 69678, -26420, 257085, 38592, 438210, 284524, 117100, 279597, 64429, 49161, 252723, -3556, -141442, 220889, 307786, 162196, 438042, 129209, 144585, -230298, 10165, -154409, -77080, 15805, -8456, -169738, -61482, 182757, 50005, 82928, 49646, -105740, -145719, 6253, -85494, 96358, 99946, -212589, -29022, 241820, -182268, -97989, 58923, -89247, -265582, -24061, 309492, -531273, 341791, 22400, 132310, 61095, -117560, 171518, 284700, 159663, -101216, 110024, 82741, -165800, 216749, 63862, -17753, -253292, 44700, 184129, 71007, -139052, -254518, 69810, -14391, 70172, 143165, 245523, 192484]
11378A92484m946Q0830l5906R7028j29649J54315I3160a60196B08782O3049a13025
11366b01138Q186Q0247q895j19295G3110Q0019p3031h8811A24904R0648l3089
11355A82463a57695O0192C26252c1927G1238L3170J36754K8227i489b53C9778
11343G1712a17587j1865C3723d02320C17536d6997A4002b97958b0480F087d83317
11331h4079H0306B5240c06462r2904a72725E217K2868b24862a00321F475L09052
11320C15527A17985b41676D72371A22773M4544b07471E0220a3550j08363C00794
11309A17956k1988m4037a33538E128J43246b69322C1602K20391J9222a04303D4010
11297B29432J37381C2824b59390b4211k51525E7566R6110J075c0739E3347d04840
$$ y = [192484, 187538, 268368, 232462, 329490, 199841, 354156, 93160, -160196, 208782, 271831, -113025, -201138, -192952, -112705, -121600, -240895, 73110, 153129, 80098, -88811, 124904, 215552, 182463, -157695, -97503, 326252, -31927, 71238, 104408, 241162, 269389, -9489, -253, 39778, 71712, -117587, -129452, 33723, -402320, 317536, -46997, 14002, -297958, -20480, 6087, -483317, -84079, 80306, 25240, -306462, -399366, -172725, 5217, 28085, -224862, -100321, 6475, 315527, 117985, -241676, 472371, 122773, 167317, -207471, 50220, -13550, -121913, 300794, 117956, 95968, 51931, -133538, 5128, 148374, -269322, 31602, 251993, 271215, -104303, 44010, 229432, 366813, 32824, -259390, -24211, -275736, 57566, 153676, 154751, -30739, 53347, -404840]
11285b11751a03103c7325A22242a64919C74794b1487j29894j37366a14845E2686
11274b91326J7806a10744B5672b8080E7184b45655a06836K8440k3759a0533k55223
11263b65756A41705J6564b32556L9156Q3100r7136B6534a4781j23333G8402c25254
11251B41588c3902G1694a98078A8658a68914f3181G3681O0786a12592j7124a6380
11239a86311p1500J19562G830a31881A63451g4208A72635b87972Q0511C90662
11228A9835b8764H9859i8771A26143c13235a834D3128g0026k29906H0432j1876
11217F8556c2406m6388G7752a25529D1433f8756a0934k44175A11673g8538B55411
11205A76445A2274a38350b6003A04100D8290K22285a67119f1088q6518A829M9232
$$ y = [-211751, -103103, -37325, 122242, -164919, 374794, -21487, -151381, -288747, -114845, 52686, -291326, -273520, -110744, 25672, -28080, 57184, -245655, -106836, -78396, -102155, -10533, -265756, 141705, 158269, -232556, -193400, -110300, -207436, 26534, -14781, -138114, 78402, -325254, 241588, -33902, 71694, -198078, 18658, -168914, -63181, 73681, 134467, -112592, -129716, -16380, -186311, -257811, -138249, 7830, -131881, 163451, -74208, 172635, -287972, -207461, 390662, 19835, -28764, 89859, -98771, 126143, -313235, -1834, 43128, -70026, -299932, 80432, 68556, -32406, -78794, 77752, -125529, 41433, -68756, -10934, -255109, 111673, -78538, 255411, 176445, 12274, -138350, -26003, 104100, 48290, 270575, -167119, -61088, -147606, 1829, 51061]
11194E1061g8281r2015c5372j58999I0854a20724M1133c937j95193N7138m0793
11183a82785I6902B4671J75572E7808J03062b16342i6552B5245f1979F7573a07000
11171A2168L12845F4557e01097a98356A26916J02516b77505k3971g5581q2347
11161a57928J6102C6331J27802a46308A68184a2636A04759C423R3110b8348l7082
11150f5430j5285I1086d6501m0588I5958J0035a01940H6638a23291A60190A2497
11138a49232A0104J07151B5640J19846l6899C9121O4338i3317A05519L34188A32664
11126B42741l8956n9992L5685e95991C03831d9115A13154a9133l3876i899G3273
11114C75732A33329B8246f9835l7232M5419k37543A79490a60811B20581j6063
$$ y = [51061, -78281, -170296, -35372, -194371, 90854, -120724, -79591, -3937, -199130, -141992, -182785, 96902, 24671, 200243, 57808, 160870, -216342, -96552, 25245, -61979, 67573, -107000, 12168, 325013, 64557, -501097, -198356, 126916, 229432, -277505, -301476, -75581, -157928, -141826, 36331, 164133, -146308, 168184, -12636, 104759, 3423, 96533, -28348, -65430, -80715, 91086, -46501, -87089, 95958, 105993, -101940, 86638, -123291, 160190, 12497, -149232, 10104, 117255, 25640, 145486, 108587, 39121, 103459, -93317, 105519, 439707, 132664, 242741, 203785, 143793, 179478, -595991, 303831, -49115, 113154, -19133, -53009, -9899, 73273, 375732, 133329, 28246, -69835, -107067, -61648, -299191, 179490, -160811, 220581, 204518]
11104B04518i5165C52594a31671k70276B28995A5612J94910o7704J69672j11357
11094B01133H7521K62807r2548b8027D02483Q1536G1364J00495L1718N7196p21
11083B60052r4668D1708K45872G5019P30149C26994k3670a43170B34635g0879
11072E57491j99206j068l1331O9695m0403j54318J27616j08171B7217K12586f1102
11060E00218J7805J02730K53282k69991j54033K58672p4080o3462J75569J90155
11050I36865m03026A71100L67389R9704K10213k10402P0285R1736J24718Q2223
11040A006966m61583N36189D59346L32215j20652K48866k75302O8686K54819k21578
11030G46400k20045J80641B43038N37738l44695K86010J85836j46256R6885p6617
$$ y = [204518, -95165, 352594, -131671, -401947, 228995, 15612, 210522, 142818, 312490, 201133, 87521, 350328, 257780, -28027, 402483, 484019, 71364, 171859, 203577, 260773, 260052, 165384, 41708, 287580, 75019, 805168, 326994, 303324, -143170, 234635, -70879, 557491, 358285, 357217, 325886, 395581, 355178, 200860, 328476, 220305, 27217, 239803, -61102, 500218, 518023, 620753, 874035, 604044, 450011, 708683, 634603, 571141, 746710, 936865, 533839, 171100, 538489, 638193, 848406, 638004, 708289, 800025, 924743, 1006966, 545383, 1081572, 459346, 791561, 670909, 919775, 644473, 713159, 967978, 746400, 526355, 706996, 243038, 780776, 436081, 722091, 907927, 761671, 858556, 781939]
11020G81939j1551j15678q7482l5406j60002K6493L57136j36058N4030k91839
11010C81582K7325J38453K25132j67738n8861k16080j16717J86075L94985l53320
11000D40836L17528j54174j0567k08959L39957K4795J35090O1772j54988J38114
10990I29404l88883M43560l85601L42911k02488M02002K98232k33134k63518K20422
10980A162907O1091J49222j28945M43898m0001j47299O17367J82299L43876K41578
10970B885993r3130K32898k58307Q2618l79131K856J93798k72167l8526m12016
10960A944886K60236L59136p8004L243l56064K72279j3774m21441l781m31017
10950A535699k13696j37124l28747j72421n8901k52725L39664B85102E5309O1940
$$ y = [781939, 770388, 654710, 567228, 531822, 371820, 398313, 755449, 619391, 673421, 381582, 408907, 547360, 772492, 604754, 545893, 329813, 213096, 399171, 794156, 440836, 758364, 604190, 593623, 384664, 724621, 749416, 884506, 946278, 791290, 929404, 540521, 984081, 598480, 941391, 738903, 1140905, 1439137, 1206003, 942485, 1162907, 1223998, 1373220, 1244275, 1688173, 1648172, 1500873, 2118240, 2300539, 2644415, 2885993, 2792863, 3025761, 2767454, 2850072, 2470941, 2473797, 2667595, 2395428, 2356902, 1944886, 2205122, 2564258, 2486254, 2489497, 2133433, 2405712, 2391938, 1970497, 1966716, 1535699, 1322003, 1184879, 856132, 683711, 624810, 372085, 711749, 285102, 55309, 117249]
10940A17249J36308l2472a1277C46569j39595G7634K45156F4839J43670h221B1321
10928A5448J95289Q1729A33377K28222A29174N293b5045k76711C81812b96950
10917A04471a77246A03867l2288J57494a37262N5370k6981p4612H7800R464N7045
10906A54309g6964A42847a82333h8951K0616l8555A21567a72982E168O0112d6074
10894C7087J97589j16688E7578k6020P8702c02929a23772r8566I0200I610J02911
10883A12521D8915b04685A32366a05841G5469C0717e0386q0021N840E9482c8894
10871G050K17414b89819g1191a1200B03787H9924J57500j7699a47812A19823c68367
10859f9205j34246f0431A55416L1597D4006a14688A10689g2485J3620A07770b72531
$$ y = [117249, 253557, 221085, -11277, 346569, 206974, 77634, 322790, 64839, 208509, -8221, 21321, 15448, 210737, 292466, 133377, 361599, 129174, 134467, -25045, -301756, 381812, -296950, 104471, -177246, 103867, 71579, 229073, -137262, -81892, -108873, -183485, 87800, 97264, 154309, -76964, 142847, -182333, -88951, -68335, -106890, 121567, -172982, 5168, 65280, -46074, 37087, 234676, 117988, 57578, 31558, 110260, -302929, -123772, -222338, 90200, 9610, 112521, 48915, -204685, 132366, -105841, 75469, 30717, -50386, -130407, -124567, 59482, -38894, 7050, 224464, -289819, -71191, -11200, 203787, 89924, 247424, 229725, -147812, 119823, -368367, -69205, -203451, -60431, 155416, 187013, 44006, -114688, 110689, -72485, -58865, 107770, -272531]
10847B35319m1385b04367A43392b8810l26H7089B8971b69078f867A95117a53059
10835a7834B9751a05227F4910K6865J8966k6830m833a4512j40654C5356a15481
10823a50372D9513j1646e84793h730I8755J17926f2249B47290d0360r4264k27842
10812c62466a47299j16502a11806d9658A50921H196i2351p6273e9308B9793R5503
10801A25296L8833n8390b34830a6066C09308G4158J37941f9200A16317Q8966p8962
10790A26321n2720h1543A43679a62822g1651A48343b8887q8601B53664j15725
10780A37939a96924i7166o670A87630g0945l35608A13232i547a242l1663A64535
10768b12859B15900l3225h1431n0579I7161L64676f9221p071l4564k055k9657
$$ y = [235319, 193934, -204367, 143392, -28810, -29136, 87089, 28971, -269078, -6867, 195117, -153059, -17834, 29751, -105227, 64910, 91775, 110741, 83911, 79078, -14512, -155166, 35356, -115481, -150372, 49513, 37867, -584793, -8730, 98755, 216681, -62249, 247290, -40360, -134624, -362466, -147299, -263801, -111806, -49658, 150921, 8196, -92351, -168624, -59308, 29793, 125296, 164129, 105739, -234830, -16066, 309308, 74158, 212099, -69200, 116317, 205283, 126321, 73601, -81543, 143679, -162822, -71651, 148343, -28887, -117488, 253664, 137939, -196924, -97166, -103836, 187630, -70945, -406553, 113232, -9547, -1242, -32905, 164535, -212859, 215900, 182675, -81431, -132010, 97161, 461837, -69221, -76292, -110856, -112911, -142568]
10757a42568h092A5228a02639o5033M5004j05519q0433a29369k37356A77183a20177
10745a16768B0284P4297k3466O40a18275D6690a94704k71534J25044c3974j02367
10734a36341J820j82011H8456e0813B44740A11964a46292I785d7241B47594c42497
10722b54754G1349b56167C0174P555a00331M4360j31568m6527A09200c27870A04763
10710A14050J5030a54656M7165L8406A35244b63440F1721b0971G4352a62440d5533
10698I4178a62040O6561p9851B7357J62615a93357c0436q5537k30445a21736k74852
10687c96588E6521Q5181A7719b38909g0293k8943H5287a48871q8814G9589e5599
10675c51676a45169g565j6913E8314B6882b29129O6771B00582O3482J5886d1796
$$ y = [-142568, -8092, 15228, -102639, -167672, -122668, -228187, -308620, -129369, -366725, 177183, -120177, -116768, 20284, 94581, 71115, 71755, -118275, 46690, -194704, -466238, -341194, -33974, -136341, -134521, -316532, 88456, -50813, 244740, 111964, -146292, 9785, -47241, 247594, -342497, -254754, 71349, -256167, 30174, 37729, -100331, -55971, -187539, -234066, 109200, -327870, 104763, 114050, 129080, -154656, -107491, -69085, 135244, -263440, 61721, -20971, 74352, -162440, -45533, 94178, -162040, -95479, -175330, 27357, 189972, -193357, -30436, -115973, -346418, -121736, -396588, 56521, 141702, 17719, -238909, -70293, -99236, 85287, -148871, -237685, 79589, -55599, -351676, -145169, -7565, -24478, 58314, 26882, -229129, -162358, 200582, 264064, 279950, -41796]
10663I2103O2341c32327J48680D2175b30299j1284N6627m1397B40908j9540o4784
10652A56584d9767o3089E2555a24565j27391A06651L3622b08415B62794a67939
10641a63445k9948F733P411N5310B8831a94252N6024e6468f193C3185a41917M0762
10629a01155j52093E0695n706b98700J1598f9386E0371a31362A02308C1519J18670
10618A50189a3549p6055C1840a28550G3406R0577F8765b16512c2105q5405K0806
10607i6704q9103O9255a456H3623b23857I881i9327I2480K8426c3732A75589D4045
10594G9723c44793N2967k5944d8292n0426J6614j49187c9583B68342c96838D8432
10582I3084A8608a36780n3122A3282c4925A58386b85899g4247n2921A76441B830
$$ y = [92103, 154444, -332327, -183647, 42175, -230299, -241583, -184956, -226353, 240908, 221368, 156584, -49767, -112856, 52555, -124565, -251956, 106651, 140273, -208415, 262794, -167939, -163445, -193393, 6733, 14144, 69454, 28831, -194252, -138228, -56468, -6193, 33185, -141917, -101155, -253248, 50695, 44989, -298700, -287102, -69386, 50371, -131362, 102308, 31519, 150189, -13549, -89604, 31840, -128550, 73406, 163983, 68765, -216512, -32105, -117510, -96704, -185807, -116552, -1456, 83623, -223857, 9881, -99327, 92480, 120906, -33732, 175589, 44045, 79723, -344793, -291826, -317770, -48292, -98718, -82104, -231291, -39583, 268342, -396838, 48432, 93084, 18608, -136780, -189902, 13282, -34925, 158386, -285899, -74247, -127168, 176441, 2830]
10570c50148d6244k25361A89983G6060a41865B82799c45139a23793M5736I1046
10559F8704b10058R3608L6888j50523B069O5493k742a06410o1818m9050P7295
10548a39983A62414b7199k78386L6866a26132A15273G232J84756J2588d4305A33107
10536B53939J1870e8304n6581k37027b917j42559k30722A61589f8373j96281J28066
10525a36588j00012I4620c13545a27074A46089o7187M5319a95180g3606B30944
10514f2875H8525A5437Q8058c08611a0817k1397r3484a7829A43927a36633p1967
10503b08600E7530i3763l11828J40783k7272M5671A28901D9879a16997j5909m5838
10492a78744p1242B4546P6293e35878A09123i4961A48286J45107H9862R2688q7558
$$ y = [-350148, -46244, -271605, 189983, 76060, -141865, 282799, -345139, -123793, -78057, 91046, 68704, -210058, -116450, -79562, -230085, 2069, 67562, 64820, -106410, -168228, -217278, -139983, 162414, -27199, -305585, -268719, -126132, 115273, 7232, 191988, 204576, -44305, 133107, 253939, 265809, -58304, -114885, -351912, -2917, -145476, -376198, 161589, -68373, -264654, -136588, -236600, 94620, -313545, -127074, 146089, 78902, 124221, -195180, -73606, 230944, -62875, 88525, 15437, 103495, -308611, -10817, -32214, -125698, -17829, 143927, -136633, -208600, 57530, -93763, -405591, -264808, -292080, -246409, 128901, 49879, -116997, -132906, -178744, -249986, 24546, 100839, -535878, 109123, -94961, 148286, 293393, 89862, 182550, 94992]
10481I4992L91741j42650J63904J19099k45984A89302P907m6332j9155K33730
10471C65452b62499C3103a24390m8920C79206h4970A31169L7618E7109J30330
10461A87439a08318d1943B0172P0625A6069b6556B35866n1731a44713A33712M8495
10450A82207b1426k6181m533B77251a33176N9537H6989a68063N0283B50556A04352
10438D5447R1050b68671b235A10701b805m06433B77431d923j73993O9330k06220
10427c15806J30065P5236K7474m0317c6910J731n7122A07897M9720i4538C31878
10415c452n7033n4445b5607F0954c21430c2811P373k58970k9898a19337q040b5219
10402A1952Q6480h3834B39831D5055K58731A25617C2848J78524F1262J16982J0393
$$ y = [94992, 486733, 344083, 507987, 627086, 381102, 189302, 197209, 150877, 131722, 365452, -262499, 33103, -124390, -173310, 379206, -84970, 131169, 168787, 57109, 187439, -108318, -41943, 20172, 90797, 16069, -26556, 235866, 184135, -144713, 133712, 182207, -21426, -47607, -52140, 277251, -133176, -73639, 86989, -168063, -117780, 250556, 104352, 45447, 136497, -268671, -2235, 110701, -2805, -409238, 277431, -4923, -178916, -109586, -315806, -185741, -110505, -83031, -123348, -36910, -35179, -92301, 107897, 157617, -94538, 331878, -3452, -60485, -114930, -25607, 60954, -321430, -32811, -25438, -284408, -314306, -119337, -127377, -25219, 11952, 98432, -83834, 239831, 45055, 303786, 125617, 32848, 211372, 61262, 178244, 188637]
10391A88637a42013B86924j18224A6957a9465A96568a73073B72303e394B72877
10380b47900D28716A26562K54418F9604J81830n7769M5408M04877A93770P502
10370B01272q0937J60751m5868R146N8499L7917K2729A06562J11929R856n8698
10359A69649C4151O65d9582B03922H9020K33673L3108C8366J82044N93581C86185
10347F11288A30660K47934j83405K2668L90025C02074l9879j29037F5723K93760
10337C59483g6842A69757N0116p6601J47008a23705N8935n8335j72789B70450
10326A02045l7349K75745A46930F3925E709J57960N1737C6357R8844J43105D3139
10314A39474J02225A04995P0632a06336B75419e4021D6895f775r5519A16764a1886
$$ y = [188637, -142013, 286924, 168700, 16957, -19465, 196568, -173073, 272303, -5394, 272877, -247900, 428716, 126562, 380980, 69604, 251434, 193665, 239073, 643950, 193770, 201272, 120335, 281086, 235218, 244364, 302863, 340780, 363509, 106562, 218491, 228347, 169649, 34151, 34816, -49582, 203922, 89020, 322693, 355801, 38366, 220410, 813991, 386185, 611288, 130660, 378594, 195189, 217857, 607882, 302074, 262195, 133158, 65723, 359483, -76842, 169757, 219873, 143272, 290280, -123705, -64770, -123105, -295894, 270450, 102045, 64696, 340441, 146930, 63925, 5709, 163669, 215406, 36357, 135201, 278306, 43139, 139474, 241699, 104995, 175627, -106336, 275419, -54021, 46895, -6775, -102294, 116764, -11886]
10302a5913j88631R7731a131A72200F165a16657B37556d983C19613c46978E536
10290b03132j32928N4570d2546B4445b2921C72613i9973A58369b83166a10303
10279G3391Q77g803o4400H8702i9357B44639c73278N6052b6443p7921p8569g8703
10266A47298a0752C6864j6268M05535B08398Q2278F4440N58325j89660j65925
10256B67180O491J41736j40426K58413B31556Q7923E2193g4570n9875j79352A80884
10244F6231a59974A08350M1174p690a25058N823G0119j738a3917k13500d5959
10232H4361J46640B7014g6191n913q4233l627n5167o0605A214a35175o2222K3649
10220a73748P1100J4631D33523a34010J0944A64161b12183f0130B60288a48423
$$ y = [-15913, -204544, -106813, -1131, 172200, 6165, -116657, 237556, -4983, 319613, -346978, 5536, -203132, -336060, -281490, -42546, 24445, -22921, 372613, -99973, 158369, -283166, -110303, 73391, 74268, -7803, -72203, 88702, -99357, 244639, -373278, -317226, -26443, -104364, -182933, -78703, 147298, -10752, 36864, 20596, 426131, 208398, 290676, 64440, 622765, 433105, 267180, 273671, 415407, 274981, 533394, 231556, 319479, 52193, -74570, -134445, -313797, 180884, 66231, -159974, 108350, 149524, 141834, -125058, -119235, 70119, 68381, -13917, -227417, -45959, 84361, 231001, 27014, -76191, -82104, -166337, -169964, -225131, -285736, 1214, -135175, -197397, -173748, -102648, -88017, 433523, -134010, -123066, 164161, -212183, -60130, 260288, -148423]
10209a67837O0383l96553g8839l9710B01779g3719l87783J82577B46959a25868
10198a44538m13613e3517k44102a1854B8330a17061c0890j8200B3022h5219n5184
10187a40403E3349d6533l27890a05035A31009j36a15399A4815a59788F8232b7836
10175a59280A21926Q113j9341B2024J17939c18258H5961h801C8104e6374q0379
10164a36753N7422k2475m5120a5586D4221Q528a94433g2428L1543n8793j15926
10153b15604b6451r7057c6794k50333E3644N6844a86432h0808j46741k09476c2566
10141B2280a65531j89351F801a32412A38835i2387d3679k35164J39237A35413
10130a08537n7683d3955N796D33253b17979j75737d2031k30515E7936a67236A76099
$$ y = [-167837, -107454, -504007, -78839, -118549, 201779, -73719, -461502, -278925, 246959, -125868, -144538, -558151, -53517, -297619, -11854, 28330, -117061, -30890, -49090, 23022, -85219, -140403, 53349, -46533, -374423, -105035, 131009, 130873, -115399, 14815, -159788, 68232, -27836, -159280, 121926, 130039, 110698, 22024, 139963, -318258, 85961, -8801, 38104, -56374, -136753, -79331, -101806, -146926, -15586, 44221, 52749, -194433, -72428, -40885, -99678, -215604, -26451, -123508, -36794, -287127, 53644, 110488, -186432, -80808, -227549, -437025, -32566, 22280, -165531, -354882, 6801, -132412, 138835, -92387, -43679, -278843, -139606, 135413, -108537, -166220, -43955, -38159, 433253, -217979, -393716, -42031, -272546, 57936, -167236, 176099]
10118C23933R2870i3063A49826k9003a23159E0493b59919Q2017A55840j9899c3233
10106a78363L987l0689l2980f1007j6244m049k33384c1123B07925f7655C27624
10094B1962N0743l0141L9928a97128o2112a07670G7443a25810q9129j59423A07930
10082G6150J88662b46023b0542L038n0678F4787b77628B8608d00281a78098h7424
10070d4046k36214e527l80645D0701k334b12022I4527a81487g8540o8156A08167
10058B45247p444f0013k36318a47311C9233b48686A32340B8448d44254F2916h0229
10046c82175a36476e2914J9216l40441d0986j10807A4571d36773d5185E6788j230
10035E5558b94376d7392A76257a48647C1961a80609I7402a03584F2383J5266J67986
$$ y = [323933, 416803, -93063, 149826, 120823, -123159, 50493, -259919, -177902, 155840, 135941, -33233, -178363, -174376, -205065, -238045, -61007, -77251, -81300, -314684, -31123, 207925, -67655, 327624, 21962, 72705, 42564, 82492, -197128, -259240, -107670, 77443, -125810, -214939, -374362, 107930, 76150, 264812, -246023, -20542, -17504, -68182, 64787, -277628, 28608, -400281, -178098, -87424, -44046, -280260, -5527, -386172, 40701, 38367, -212022, 94527, -181487, -78540, -146696, 108167, 245247, 237803, -60013, -296331, -147311, 39233, -248686, 132340, 28448, -444254, 62916, -80229, -382175, -136476, -52914, -33698, -374139, -40986, -151793, 14571, -436773, -45185, 56788, 55558, -294376, -47392, 176257, -148647, 31961, -180609, 97402, -103584, 62383, 77649, 245635]
10024B45635p2297b0996l8717m4571k7336J022C7482b7835E363J16672m7336c18373
10011A01426a82080a8858A83208d15570h300A35236D6722b14611j60159A14273
10000d83911D23872I2169a03336j76717l8041e2713H627f0325l2417k18044F2236
9988d44257B44137a53470A12700J95089a2250A24534b09699G9278K20664H9461
9977A56713C3790a89665H5416J48080A3681J33806A6962c52179K6794J1452b3113
9965b64003A44362h3485r9312P5011L8557A6646a08246p074e535l37697q6607
9954d29839a11767l1644k93528i3186A67775D0545c86764B60619d1643m3780D6925
9942a86110J4624r4762G0848a35221B9873L6927a04305B36804d4192D1851l868
$$ y = [245635, 173338, -20996, -59713, -104284, -131620, -130598, 37482, -27835, 5363, 122035, 74699, -318373, 101426, -182080, -18858, 183208, -415570, -8300, 135236, 46722, -214611, -374770, 114273, -483911, 423872, 92169, -103336, -280053, -318094, -52713, 8627, -60325, -92742, -310786, 62236, -444257, 244137, -153470, 112700, 307789, -12250, 124534, -209699, 79278, 299942, 89461, 156713, 33790, -189665, 85416, 233496, 13681, 147487, 16962, -352179, -325385, -313933, -23113, -264003, 144362, -83485, -182797, -107786, -69229, 16646, -108246, -115320, -5535, -343232, -429839, -111767, -143411, -436939, -93186, 167775, 40545, -386764, 260619, -41643, -85423, 46925, -186110, -171486, -266248, 70848, -135221, 29873, 66800, -104305, 236804, -44192, 41851, 37983]
9931C7983P2566E5043a10948l6190A48045a87258g1399m178j45739m6049A3867
9919e5215C7690b31969d6273l10728h613L24m55521B8603J83500b77470B81190
9907d12786L9872A41939c02425k0730c0941r8131n7621e404k14902C4558b52392
9895a40005L052I692m330b86310A60306c83743e8540j47398l937B093a08614A7649
9882A38606a63231A01474b66029A96577a57144D407a45066j08417h4707j45968
9872b30675c5915n8368A24801b47462j6096m8927a09233R386r383J4107r6557
9861a91680L6143B3340h2559i811K129D7711K63482h0884A68621p9563a96331
9849A29777k9251c02887A78336F2541K70788E5852N1029b66756j30374B12978
$$ y = [37983, 110549, 55043, -110948, -147138, 148045, -187258, -71399, -75577, -221316, -267365, 13867, -55215, 37690, -231969, -46273, -357001, -8613, -8289, -463810, 28603, 212103, -277470, 281190, -412786, -372914, 141939, -302425, -323155, -30941, -129072, -186693, -5404, -220306, 34558, -252392, -140005, -136953, 9692, 5362, -286310, 160306, -383743, -58540, -205938, -209875, 2093, -108614, 17649, 138606, -163231, 101474, -266029, 196577, -157144, 4407, -145066, -253483, -84707, -230675, -35915, -94283, 124801, -247462, -263558, -312485, -109233, -99847, -109230, -95123, -191680, -155537, 23340, -82559, -9811, -7682, 47711, 311193, -80884, 168621, 89058, -196331, 129777, 100526, -302887, 178336, 62541, 333329, 55852, 106881, -266756, -397130, 212978]
9838c11597i9045C5080b15052b9777C5753c9023B10795c23369J30856A4100a06148
9826B76999I096h7259m8840A01990a30276e5372j15998O349E7144a98205A21312
9814c11712B17393b08838j28660c5567E9198M3307d2221r6075B87871C3879b22217
9802I1330a95010j32664B630a18618D540L10626a82825A52610F8568D096P5430
9791G9526a52203m6332l37334A4465a9500A65658e8878j29858A55312d7827D3913
9779B85554c47248j12989D7872f9174A5673J63322g1056k1569m4357q351K3889
9768a21444k4983B35933e0858n6553A93242d75788a21610B5166K17387f631p6694
9757h3325b883m31609A5159a10145m1078A5422d4282l3285R690j7030C30047A23132
$$ y = [-311597, -99045, 35080, -215052, -29777, 35753, -39023, 210795, -323369, -192513, 14100, -106148, 276999, 9096, -87259, -136099, 101990, -130276, -55372, -171370, -165021, 57144, -198205, 121312, -311712, 217393, -208838, -337498, -35567, 59198, 102505, -42221, -138296, 287871, 33879, -222217, 91330, -195010, -327674, 2630, -118618, 4540, 315166, -182825, 152610, 68568, 4096, 79526, -152203, -198535, -535869, 14465, -19500, 165658, -58878, -188736, 155312, -47827, 43913, 285554, -347248, -460237, 47872, -69174, 15673, 178995, -71056, -92625, -136982, -145333, -121444, -146427, 235933, -50858, -107411, 193242, -475788, -121610, 25166, 242553, -6631, -83325, -2883, -434492, 15159, -110145, -151223, 15422, -44282, -77567, -67877, -84907, 330047, 123132]
9744b2563c212A50525n6597M1954a26118P299k3e8672j06513A08885b98735f0840
9731c71787a29180E2018a31910A36784b97929g6954k9587K0856j9635Q906q7291
9720a83705A22447b36361A25420b2659k79769J8321q0479a13502o6951O3715l47804
9709d64542B96741a04255m1088j5831P3254H981b50236G4090a41929B32527d3402
9697A3254b98594n6797q4072B45273b86324a41350G5063J25902b01272A82082
9686c6245p3202C4505K02341g3480p6570j16733M5176C34400j45615I2328J47976
9675B40304c72168a0468k1556D0031a34962A32329a68941f3806A0510O9363a69147
9663b63556m1885A8740c59138A07305j060A9796J91072a08990k25440k5808c9985
$$ y = [-22563, -3212, 150525, 93928, 135882, -126118, -118819, -118842, -58672, -165185, 108885, -298735, -60840, -371787, -129180, 52018, -131910, 136784, -297929, -76954, -106541, -85685, -105320, -96414, -183705, 122447, -236361, 125420, -22659, -302428, -284107, -364586, -113502, -180453, -116738, -464542, 296741, -104255, -145343, -161174, -87920, 8981, -250236, 74090, -141929, 232527, -43402, 13254, -298594, -355391, -439463, 245273, -286324, -141350, 75063, 200965, -201272, 182082, -36245, -109447, 34505, 236846, -73480, -150050, -266783, -221607, 334400, 188785, 92328, 240304, -372168, -10468, -32024, 40031, -134962, 132329, -168941, -63806, 10510, 79873, -169147, -263556, -305441, 18740, -359138, 107305, 106245, 19796, 210868, -108990, -334430, -360238, -39985]
9651A17025E5252a11329e4667F0816b41941b9688l28645L7761J05460r1713a05713
9639e9376a8116A25096b16917B66351b25377R2930N6598n7841j71056h0343D7068
9627c24758i6614b2057A45450B4934J27606a65731k92585A01281e7130p577E6887
9615A22722C9252c5416H428b60422A72747a68325O7737j5239P151j51716i7029
9603a28880a0617B84590b56288J01944B38045f1190A66958g1030k7216j33411
9593b31657m1115o6372a43401n2482P6367e194k66003B74922a41328o7842n8838
9582b68008C0704a28857o8208R2035r1656o3891A96834b06432p566j77502F1066
9570A66042a54531q5949c5031G7681M41567A19208e7085k59926j89493d8512j07095
$$ y = [117025, 55252, -111329, -54667, 60816, -241941, -29688, -358333, -320572, -215112, -306825, -105713, -59376, -18116, 125096, -216917, 266351, -225377, -132447, -75849, -133690, -304746, -80343, 47068, -324758, -96614, -22057, 145450, 24934, 152540, -165731, -458316, 101281, -57130, -64707, 56887, 122722, 39252, -35416, 8428, -260422, 172747, -168325, -100588, -115827, -108676, -260392, -97029, -128880, -10617, 284590, -256288, -154344, 238045, -61190, 166958, -71030, -98246, -231657, -272772, -339144, -143401, -195883, -119516, -5194, -271197, 274922, -141328, -209170, -268008, 30704, -128857, -197065, -105030, -196686, -260577, 196834, -206432, -213998, -391500, 61066, 166042, -154531, -240480, -35031, 77681, 519248, 119208, -57085, -317011, -506504, -48512, -155607]
9559a55607l1075o928L1407j0417k49475G3501K44464e8832H7851a48441F404
9547B58341g1311n1087j03727J04034p1686A469J22893e63292H7519k8535b71605
9535g7093b7361F5830f0107l5793F1593a56027K1510N7198j44065A01098i2367
9523A30498D2701P6968D9244c04467D8984a15974N1720E6149R4013n4364P5204
9512A71002f9814l9771k4816e784j0848A835i486j23542J5196J9023F4519a4413
9499d18737a640n97740a7981j37587E487a44026H1114C4640h7547A58322a96364
9487I6369l4183b03326n3193D24135H0290a91748G4868b01489F315a5331c683
9475a26657j21293J08410N8068A35882d5082j44318H6056h7348k10219B1929L8625
$$ y = [-155607, -186682, -193610, -162203, -172620, -422095, 73501, 317965, -58832, 87851, -148441, 6404, 258341, -71311, -122398, -226125, -122091, -193777, 1469, 124362, -563292, 87519, 58984, -271605, -77093, -27361, 65830, -60107, -95900, 61593, -156027, -134517, -77319, -221384, 101098, -92367, 130498, 42701, 119669, 49244, -304467, 48984, -115974, -64254, 56149, 150162, 95798, 171002, -69814, -109585, -134401, -5784, -16632, 1835, -9486, -133028, -117832, -98809, 64519, -14413, -418737, -1640, -599380, -17981, -155568, 5487, -144026, 81114, 34640, -87547, 158322, -196364, 96369, 62186, -203326, -256519, 424135, 80290, -191748, 74868, -201489, 6315, -15331, -3683, -126657, -247950, -139540, -81472, 135882, -45082, -189400, 86056, -87348, -297567, 21929, 60554]
9464F0554a3913B40973b25168D4046c39704J26110C0374A0513m20d10161O6403
9453c43758J20550l8513e0514B9798K8063e17160a17575o9692H3523g2968n2952
9442a25920A75185c89625J60755B05091a40795K9679F3427J17678a0403C06241
9431e3832b6515k31101A57691m0340c28078G5058A9330b65135j58381a6122q74
9420a6996C00872b04993A34092o5065b31124E79030a07792L4147r7734P9258m3028
9409a35149A32236O6080I1300c9023l8989L6508A18259d4427A10886a92669A63140
9397a06392B23401q8588o2577b12840D0305c01311G4267B0954a08016E6068K817
9386E8885a55962B88873F1634c46041F3607a55364d1031j90964l3545g7334F5962
$$ y = [60554, -13913, 240973, -225168, 44046, -339704, -213594, 30374, 10513, 10093, -410161, -343758, -223208, -261721, -50514, 29798, 57861, -517160, -117575, -187267, 83523, -72968, -125920, 175185, -389625, -228870, 205091, -140795, -111116, 63427, 181105, -10403, 306241, -53832, -26515, -257616, 157691, 117351, -328078, 75058, 19330, -265135, -423516, -16122, -16996, 300872, -204993, 134092, 69027, -231124, 579030, -107792, -73645, -171379, -92121, -135149, 132236, 198316, 91300, -39023, -78012, -41504, 118259, -44427, 110886, -192669, 163140, -106392, 223401, 134813, 72236, -212840, 40305, -301311, 74267, 20954, -108016, 56068, 58885, -155962, 288873, 61634, -346041, 63607, -155364, -41031, -231995, -265540, -77334, 65962]
9374A5342d33782i2813q3292H6490c2314j63218B51907i6038l6382A58935k986
9363A55949g6031k0255D3219a147j38632A03835A5493i4998j6812J3931A20587
9351A34645a08735N2500j21330L803j03262a0583l07528G7401N2458I871P2605
9340H2476c8824j9336n303K5R526C6799J399c4129j64680e489C4501a38917I5531
9326H3275g7694A51783a17622l055k35A71425L2226h9261A6853b40202R0220A64112
9313c8031j48672b5668A66040g8084J3998l6673I1810R421b52513J22547N0604
9302g9362C5963a19931F9730a16449l3813a7186k18485d3903A24996l2749c5624
9290a85326B6146K2249l864M8128a33227o3816f9924b7344B29856b4352m17115
$$ y = [15342, -433782, -92813, -176105, 86490, -32314, -195532, 251907, -96038, -132420, 158935, 155949, -76031, -96286, 43219, -1147, -139779, 103835, 15493, -94998, -111810, -97879, 120587, 134645, -108735, -56235, -177565, -173762, -277024, -10583, -318111, 77401, 129859, 9871, 82476, -38824, -58160, -63463, -63438, -53912, 36799, 38198, -34129, -198809, -5489, 34501, -138917, 95531, 83275, -77694, 151783, -117622, -120677, -120912, 171425, 203651, -89261, 16853, -240202, -149982, 164112, -38031, -186703, -25668, 166040, -78084, -64086, -100759, 91810, 101231, -252513, -129966, -79362, 35963, -119931, 69730, -116449, -150262, -17186, -235671, -43903, 124996, 92247, -35624, -185326, 26146, 48395, 44531, 92659, -133227, -197043, -69924, -27344, 229856, -24352, -441467]
9279d41467a38339A23300b7663B14776q1715b26848h8212j44989Q7865j88213
9269c33549a32285M7388k67048H0117b80668J5268L5896N6319B19723d34239J76829
9258b57410q6837a03659B29301a03471A67429b22966L5280B77366b80835B13072
9247b0484r265M924n5804m2284l6943E4080a94170o133F4832M3049d47817j44030
9235e91847i8723A11379b00260c0276J2102A38087J31653a91380h7129B33037
9224d8893J4488J5986m9730j12073I0110i7529A2276E639a09385D5450L8873C741
9211b45150J02734b3613A02097L2387C7772h5436l55847c7513E4811i713A06412
9199f22812F9580d2846m34189a56564A00387a8912G1724b06175a7640m63953A24322
$$ y = [-441467, -138339, 123300, -27663, 214776, 133061, -226848, -88212, -233201, -145336, -333549, -132285, -84897, -351945, 80117, -280668, -265400, -229504, -173185, 219723, -434239, -257410, -344247, -103659, 229301, -103471, 167429, -222966, -187686, 277366, -280835, 213072, -20484, -29749, -24825, -80629, -122913, -159856, 54080, -194170, -200303, 64832, 107881, -447817, -591847, -98723, 111379, -200260, -30276, -18174, 138087, 269740, -191380, -87129, 233037, -48893, -34405, -18419, -68149, -180222, 90110, -97529, 12276, 5639, -109385, 45450, 84323, 3741, -245150, -142416, -23613, 102097, 134484, 37772, -85436, -441283, -37513, 54811, -9713, 106412, -622812, 69580, -42846, -477035, -156564, 100387, -18912, 71724, -206175, -17640, -481593, 124322]
9187b02334G8760g8524A73844d87560c3416m23776I2057D0720c50807J73835q7972
9176b64944h0932D8876a88745I1667J1500a85639O2005m5695g5858B42959p0123
9165A72836B3061a19174E4032K18543n1905D9292b89349D8263a18232i405o2011
9154g1416k91688b4038A529a3422p780j60226l2381a6336j66570J922h7246l50508
9142d37754f1776k0649B3308a33252B2962a34743F6002C1547a89811c5602j11281
9131a46883j4558N6173k04017F108d6910k3657B1670J91860e6008H5810P8426
9120A64236a75040A20734b12089B14767i4906o2418d9486k72595j7522e8188C6203
9108a98869A30659N9245d2400j17785A64477B0988c86969Q3244a11224A61076
$$ y = [-202334, 78760, -78524, 173844, -487560, -33416, -457192, 92057, 40720, -350807, -176972, -264944, -80932, 48876, -188745, 91667, 103167, -185639, -123634, -169329, -75858, 242959, 172836, 23061, -119174, 54032, 272575, 220670, 49292, -289349, 48263, -118232, -9405, -71416, -363104, -24038, 1529, -13422, -21202, -181428, -213809, -16336, -182906, -180984, -87246, -437754, -61776, -82425, 23308, -133252, 22962, -134743, 66002, 31547, -189811, -35602, -146883, -161441, -105268, -309285, 6108, -46910, -70567, 21670, 213530, -56008, 85810, 164236, -175040, 120734, -212089, 214767, -94906, -157324, -49486, -322081, -339603, -58188, 36203, -198869, 130659, 189904, -42400, -160185, 164477, 20988, -386969, -303725, -111224, 161076]
9097b8607I1382k3587n887K3749a60393A7619K33427j11982j766A9325a04104
9085g9027I0356a99452C0816K5086e17290F7431N9377M4823b30852M38n978J09867
9073a26525I0873k8056a94828Q5143l57249a1700N312A31005P7779c24815H0977
9061b38254P4892e4724A08195a34110B35328F6390b38185M2507A12761f3282A64486
9049c5968k7061A30912d535j51258A18200a10766G9871a45965B21348c569q8258
9038i1827l21384J97145j43522j43855A6388a06028D04564a44190E2703a95532
9027A95240d31031A1633R3558R4653b45853R0115c7918A26903F3206K15508r8155
9016A80559c096A6210a1437m35386b01214l00860J92066B30259B0715O9946m4943
$$ y = [-28607, 91382, 67795, 61908, 85657, -160393, 17619, 251046, 139064, 137298, 19325, -104104, -79027, 90356, -199452, 30816, 55902, -517290, 67431, 126808, 171631, -230852, -230414, -236392, -126525, 90873, 62817, -194828, -109685, -466934, -11700, -6388, 131005, 208784, -324815, 80977, -238254, -163362, -54724, 108195, -134110, 235328, 66390, -238185, -195678, 112761, -63282, 164486, -35968, -63029, 130912, -4535, -155793, 118200, -110766, 79871, -145965, 221348, -3569, -91827, -413211, -216066, -359588, -503443, 16388, -106028, 404564, -144190, 52703, -195532, 195240, -431031, 11633, 105191, 199844, -245853, -155738, -37918, 126903, 63206, 278714, 180559, -3096, 16210, -11437, -446823, -201214, -502074, -310008, 230259, 20715, 90661, 45718]
9005D5718a45468C8965O6922J33059j12965P0318i1880C9677K40966c20095J17854
8994b02241O2582K0493B08808a10941G088a81971o1518E0815J63453e7180k45633
8983c02813P8715e7529K4881k40291A87571p5303a73238A382K17489d6799A52581
8971c06944c3879B3742a5314j71993K1984e2020j4530J3840q2296l3323k15079
8960c83408B04088a55795A19165f5045F2651k9953J98304q2550C3291c23029d8301
8948b32170f9618j38861B02581a96036n7243B05252a80983q9688C10217a20894
8937c22580F0410b70226A61121n0927k4383a99464o6920g7963A46943b81252a14417
8925b57837A2426K41149r5768J695507O168268l581695A982711F27238j33695
$$ y = [45718, -145468, 38965, 105887, 238946, 125981, 196299, -91880, 39677, 280643, -320095, -202241, -139659, -119166, 208808, -110941, 7088, -181971, -243489, 50815, 214268, -57180, -302813, -224098, -57529, -32648, -272939, 187571, 112268, -173238, 1382, 218871, -46799, 152581, -306944, -33879, 23742, -15314, -187307, -165323, -52020, -66550, -52710, -135006, -168329, -383408, 204088, -155795, 119165, -65045, 62651, 32698, 231002, 148452, 33291, -323029, -48301, -232170, -69618, -208479, 202581, -196036, -253279, 205252, -180983, -270671, 310217, -120894, -322580, 60410, -270226, 161121, 110194, 85811, -199464, -266384, -77963, 146943, -281252, -114417, -257837, 12426, 253575, 157807, 1853314, 8021582, 4439887, 1982711, 627238, 493543]
8916D93543q1524A08724m6941a76471E57a08427L3739F3136a3459k41907J17283
8905a38083a3209C23865j25534e1298A52832F3042P6667K2756E1457L6068e6670
8893d1126j59219j7812A29650B1629a47137c8606I396b0375n5704j91674H2435
8881e8568l02940G2759a65357A90547b24384I7270a30806N6141j2212j14122m4451
8870b45450R1559j91940J49437f7367p164F4492a83423k82060a06367A95103g0629
$$ y = [493543, 412019, 108724, 61783, -176471, 557, -108427, -74688, 63136, -13459, -255366, -138083, -13209, 323865, 198331, -51298, 152832, 63042, 139709, 162465, 51457, 87525, -56670, -41126, -200345, -218157, 129650, 21629, -147137, -38606, 9396, -20375, -76079, -267753, 82435, -58568, -361508, 72759, -165357, 190547, -224384, 97270, -130806, -74665, -86877, -200999, -245450, -153891, -345831, -196394, -67367, -74531, 64492, -183423, -465483, -106367, 195103, -70629]
$$ [...]
##END NTUPLES=NMR SPECTRUM
##END=
