##TITLE=AC1635_CENAH_8493933_VXAgfACdkY
##JCAMPDX= 6.0         $$ Bruker NMR JCAMP-DX V2.0
##DATA TYPE= NMR SPECTRUM
##DATA CLASS= NTUPLES
##ORIGIN= BRUKER
##OWNER= Administrator
$$ 1.72 TOPSPIN		Version 2.1
$$ 2014-02-18 19:20:59.461 -0800  Administrator@X
$$ Compression mode = diff/dup
##.OBSERVE FREQUENCY= 400.02188249412
##.OBSERVE NUCLEUS= ^1H
##.ACQUISITION MODE= SIMULTANEOUS (DQD)
##.ACQUISITION SCHEME= undefined
##.AVERAGES= 64
##.DIGITISER RES= 22
##SPECTROMETER/DATA SYSTEM= spect
##.PULSE SEQUENCE= noesygpps1d.comp
##.SOLVENT NAME= COFFEE_meoh
##.SHIFT REFERENCE= INTERNAL, COFFEE_meoh, 1, 14.96126
##AUDIT TRAIL= $$ (NUMBER, WHEN, WHO, WHERE, PROCESS, VERSION, WHAT)
$$ ##TITLE= Audit trail, TOPSPIN		Version 2.1
$$ ##JCAMPDX= 5.01
$$ ##ORIGIN= Bruker BioSpin GmbH
$$ ##OWNER= Administrator
$$ $$ E:\/data/COFFEE/nmr/AC1635_CENAH_8493933_VXAgfACdkY/12/pdata/1/auditp.txt
$$ ##AUDIT TRAIL=  $$ (NUMBER, WHEN, WHO, WHERE, PROCESS, VERSION, WHAT)
(   1,<2014-02-18 19:20:54.680 -0800>,<Administrator>,<X>,<go>,<TOPSPIN 2.1>,
      <created by zg
	started at 2014-02-18 19:09:24.928 -0800,
	POWCHK enabled, PULCHK disabled,
       configuration hash MD5:
       C8 4E 4E 5D D3 5C D8 9E 9F 52 82 E0 59 8A DE 15
       data hash MD5: 64K
       CD 40 5F 1B 81 61 FE DD E4 4B FB 45 AC 6F 63 60>)
(   2,<2014-02-18 19:20:57.586 -0800>,<Administrator>,<X>,<proc1d>,<TOPSPIN 2.1>,
      <Start of raw data processing
       efp LB = 0.3 FT_mod = 6 PKNL = 1 PHC0 = 0 PHC1 = 0 SI = 128K 
       data hash MD5: 128K
       55 4E EF DB 14 41 F8 FA B2 DB AF D7 3B 50 EA E9>)
(   3,<2014-02-18 19:20:58.524 -0800>,<Administrator>,<X>,<proc1d>,<TOPSPIN 2.1>,
      <pk PHC0 = -82.37 PHC1 = 0 
       data hash MD5: 128K
       50 EF 97 95 A6 CA 8E A4 A5 10 A9 95 0B D9 E0 7A>)
(   4,<2014-02-18 19:20:58.930 -0800>,<Administrator>,<X>,<proc1d>,<TOPSPIN 2.1>,
      <abs ABSG = 1 
       data hash MD5: 128K
       19 DA 86 C1 3D 30 28 1F B9 2D 68 F0 89 11 9B 24>)
(   5,<2014-02-18 19:20:59.039 -0800>,<Administrator>,<X>,<proc1d>,<TOPSPIN 2.1>,
      <abs ABSG = 2 
       data hash MD5: 128K
       C4 28 ED 90 70 E1 16 64 AF 2B 9B 64 E4 B2 4E 32>)
(   6,<2014-02-18 19:20:59.102 -0800>,<Administrator>,<X>,<proc1d>,<TOPSPIN 2.1>,
      <abs ABSG = 3 
       data hash MD5: 128K
       A2 48 61 2D 9F 94 33 13 4B CA A1 9D 6C 82 BE 67>)
(   7,<2014-02-18 19:20:59.180 -0800>,<Administrator>,<X>,<proc1d>,<TOPSPIN 2.1>,
      <abs ABSG = 4 
       data hash MD5: 128K
       15 45 03 9F 4D C3 3E 11 3D 71 F0 DF B0 13 69 58>)
(   8,<2014-02-18 19:20:59.258 -0800>,<Administrator>,<X>,<proc1d>,<TOPSPIN 2.1>,
      <abs ABSG = 5 
       data hash MD5: 128K
       E7 26 7F 0F E8 B7 47 78 CB 7C C5 F0 94 F0 00 C7>)
$$ ##END=
$$ 
$$ $$ hash MD5
$$ $$ 5E 3E 03 F5 22 34 BF 0E 87 88 4F D3 70 74 8F 90
##$RELAX= 
##$RELAX= 
##$RELAX= 
##$RELAX= 
##$RELAX= 
##$RELAX= 
##$RELAX= 
##$RELAX= 
$$ Bruker specific parameters
$$ --------------------------
##$DU= <E:\>
##$EXPNO= 12
$$ [...]
150 150 150 150 150 150 150 150
##$TP07= 0
##$TPNAME0= <>
##$TPNAME1= <>
##$TPNAME2= <>
##$TPNAME3= <>
##$TPNAME4= <>
##$TPNAME5= <>
##$TPNAME6= <>
##$TPNAME7= <>
##$TPOAL= (0..7)
0.5 0.5 0.5 0.5 0.5 0.5 0.5 0.5
##$TPOFFS= (0..7)
0 0 0 0 0 0 0 0
##$TUNHIN= 0
##$TUNHOUT= 0
##$TUNXOUT= 0
##$USERA1= <user>
##$USERA2= <user>
##$USERA3= <user>
##$USERA4= <user>
##$USERA5= <user>
##$V9= 5
##$VALIST= <valist>
##$VCLIST= <CCCCCCCCCCCCCCC>
##$VD= 0
##$VDLIST= <DDDDDDDDDDDDDDD>
##$VPLIST= <PPPPPPPPPPPPPPP>
##$VTLIST= <TTTTTTTTTTTTTTT>
##$WBST= 2048
##$WBSW= 25
##$XGAIN= (0..3)
0 0 0 0
##$XL= 0
##$YL= 0
##$YMAX_a= 6610380
##$YMIN_a= -14148795
##$ZGOPTNS= <>
##$ZL1= 120
##$ZL2= 120
##$ZL3= 120
##$ZL4= 120
##$ABSF1= 14.96126
##$ABSF2= -5.596922
##$ABSG= 5
##$ABSL= 3
##$ALPHA= 0
##$AQORDER= 0
##$ASSFAC= 0
##$ASSFACI= 0
##$ASSFACX= 0
##$ASSWID= 0
##$AUNMP= <proc_prof1d_extract.lims>
##$AXLEFT= 0
##$AXNAME= <>
##$AXNUC= <1H>
##$AXRIGHT= 0
##$AXTYPE= 0
##$AXUNIT= <>
##$AZFE= 0.1
##$AZFW= 0.1
##$BCFW= 0
##$BC_mod= 0
##$BYTORDP= 0
##$COROFFS= 0
##$CY= 15
##$DATMOD= 1
##$DC= 0
##$DFILT= <>
##$DTYPP= 0
##$F1P= 0
##$F2P= 0
##$FCOR= 0.5
##$FTSIZE= 131072
##$FT_mod= 6
##$GAMMA= 0
##$GB= 0
##$INTBC= 1
##$INTSCL= 1
##$ISEN= 128
##$LB= 0.3
##$LEV0= 0
##$LPBIN= 0
##$MAXI= 10000
##$MC2= 0
##$MEAN= 0
##$ME_mod= 0
##$MI= 0
##$NCOEF= 0
##$NC_proc= -2
##$NLEV= 6
##$NOISF1= 0
##$NOISF2= 0
##$NSP= 0
##$NTH_PI= 0
##$NZP= 0
##$OFFSET= 14.96126
##$PC= 1
##$PHC0= -82.37
##$PHC1= 0
##$PH_mod= 1
##$PKNL= yes
##$PPARMOD= 0
##$PPDIAG= 0
##$PPIPTYP= 0
##$PPMPNUM= 2147483647
##$PPRESOL= 1
##$PSCAL= 4
##$PSIGN= 0
##$PYNMP= <proc.py>
##$REVERSE= no
##$SF= 400.020009532328
##$SI= 131072
##$SIGF1= 0
##$SIGF2= 0
##$SINO= 400
##$SIOLD= 131072
##$SPECTYP= <>
##$SREGLST= <1H.CDCl3>
##$SSB= 0
##$STSI= 131072
##$STSR= 0
##$SW_p= 8223.68421052631
##$SYMM= 0
##$S_DEV= 0
##$TDeff= 65536
##$TDoff= 0
##$TI= <>
##$TILT= no
##$TM1= 0
##$TM2= 0
##$TOPLEV= 0
##$USERP1= <user>
##$USERP2= <user>
##$USERP3= <user>
##$USERP4= <user>
##$USERP5= <user>
##$WDW= 1
##$XDIM= 131072
##$YMAX_p= 451762982
##$YMIN_p= -12536
##$CURPLOT= <Network HP LaserJet P1505>
##$CURPRIN= <$Network HP LaserJet P1505>
##$DFORMAT= <normdp>
##$LAYOUT= <+/1D_H.xwp>
##$LFORMAT= <normlp>
##$PFORMAT= <normpl>
##$SURQMSG= 1
$$ End of Bruker specific parameters
$$ ---------------------------------
##NTUPLES= NMR SPECTRUM
##VAR_NAME=  FREQUENCY,     SPECTRUM/REAL,   SPECTRUM/IMAG
##SYMBOL=    X,             R,               I
##VAR_TYPE=  INDEPENDENT,   DEPENDENT,       DEPENDENT
##VAR_FORM=  AFFN,          ASDF,            ASDF
##VAR_DIM=   131072,        131072,          131072
##UNITS=     HZ,            ARBITRARY UNITS, ARBITRARY UNITS
##FACTOR=    0.0627417313425164, 1,          1
##FIRST=     8223.62146879497, 855,          -70889
##LAST=      0,             3042,            -70751
##MIN=       0,             -12536,          0
##MAX=       8223.62146879497, 451762982,    0
$$ Real data points
##PAGE= N=1
##DATA TABLE= (X++(R..R)), XYDATA
$$ [...]
63875F51682j3949j2059r432o873m986l219o78K485N247P173Q940J1286J4137
63862F49754J6866J8976K0361K1281K2165K3134K3771K3653K2954K2152K1353
63851H86420K0372J9222J7893J5933J3000R644O700M031P69l145o770r676j2577
63838I61816j6013j9391k1989k4103k6398k8780l0631l1736l2258l2169l1389
63827F66959l0232k9077k7753k5834k3447k1256j9684j8535j7380j6050j4703
63816D23008j3629j2854j1980j0588q892p599p028o798o539o329o126n413l994
63803C15239k596k072k224k131j517j089j522k623l632m022l871l615l500l320
63789B77505k793k183k142k764l265k994k276j887j917j799j247o07l08m25q18
$$ plain form
63875 651682 637733 625674 616242 609369 604383 601164 600486 602971 608218 615391 624331 635617 649754
63862 649754 666620 685596 705957 727238 749403 772537 796308 819961 842915 865067 886420
63851 886420 906792 926014 943907 959840 972840 982484 989184 993215 993984 990839 984069 974393 961816
63838 961816 945803 926412 904423 880320 853922 825142 794511 762775 730517 698348 666959
63827 666959 636727 607650 579897 554063 530616 509360 489676 471141 453761 437711 423008
63816 423008 409379 396525 384545 373957 365065 357466 350438 343640 337101 330772 324646 319233 315239
63803 315239 312643 310571 308347 306216 304699 303610 302088 299465 295833 291811 287940 284325 280825 277505
63789 277505 274712 272529 270387 267623 264358 261364 259088 257201 255284 253485 252238 251631 251323 250898 250080
63774B50080j311j671j686j331p44o4M99O86M63J69J43L35N28O76P70N94o1r91
63756B47084j739k026j854j376r11q45j193j402r28J80J450K499L073K870J906
63741B46788Q38M52Q45J436J732J716J601J579J707J826J679J384J501K256L026
63726B70366L088K577K149J989J868J907K474L337L826L859L964M173L808K751
63712C12136J955K044K267J579K00p76r65r75j221j376j133p95p66r26q49m39
63696C09960n3p3n00q80p00O9Q50J134J141J507K329K921K649J674O45m8l68k94
63678C21963J56O69Q76Q74J105J633J971J818J489J343J220Q50N34P63J369J625
63662C40258J234O81M05K21k57r83j643k145k600l003l264l433l618l769l723
$$ plain form
63774 250080 248769 247098 245412 244081 243337 243273 243772 244458 244921 245090 245233 245568 246096 246772 247542 248136 248075 247084
63756 247084 245345 243319 241465 240089 239178 238333 237140 235738 234810 234990 236440 238939 242012 244882 246788
63741 246788 247626 248078 248923 250359 252091 253807 255408 256987 258694 260520 262199 263583 265084 267340 270366
63726 270366 273454 276031 278180 280169 282037 283944 286418 289755 293581 297440 301404 305577 309385 312136
63712 312136 314091 316135 318402 319981 320181 319405 318440 317465 316244 314868 313735 312940 312174 311248 310399 309960
63696 309960 309907 309834 309334 308454 307754 307823 308673 309807 310948 312455 314784 317705 320354 322028 322673 322625 322257 321963
63678 321963 322119 322788 323664 324538 325643 327276 329247 331065 332554 333897 335117 335967 336501 337264 338633 340258
63662 340258 341492 342173 342578 342799 342542 341559 339916 337771 335171 332168 328904 325471 321853 318084 314361
63647C14361l465l162k978k940k968k950k808k487j839o95P00J597J519J055J301
63632B94241K458L517L609L036K641K707K983L346L825M203M287M398N056O231
63618C46538P392Q293R189J0239J1167J1699J1987J2459J3383J4706J6189J7683
63606D90924J9323K1321K3475K5188K6127K6580K6798K6262K4150K0405J5840
63595G46393J1240O825K685p74l092m239m641m879n319n948o609p503r215j1920
63581G03004j4839j6911j7927j8564j9320j9963k0007j9299j7946j6114j4023
63570E08091j1856r562p077m698k892j676o22M65J298J695J925K323K946L787
63556D84147M829N711N829N229M889N714P538R610J1740J4375J7708K1358K5003
$$ plain form
63647 314361 310896 307734 304756 301816 298848 295898 293090 290603 288764 288069 288769 290366 291885 292940 294241
63632 294241 296699 300216 303825 306861 309502 312209 315192 318538 322363 326566 330853 335251 340307 346538
63618 346538 353930 362223 371412 381651 392818 404517 416504 428963 442346 457052 473241 490924
63606 490924 510247 531568 555043 580231 606358 632938 659736 685998 710148 730553 746393
63595 746393 757633 764458 767143 766369 763277 759038 754397 749518 744199 738251 731642 724139 714924 703004
63581 703004 688165 671254 653327 634763 615443 595480 575473 556174 538228 522114 508091
63570 508091 496235 486673 479596 474898 472006 470330 469708 470173 471471 473166 475091 477414 480360 484147
63556 484147 488976 494687 500516 505745 510634 516348 523886 533496 545236 559611 577319 598677 623680
63543F23680K8836L3125L7480M0704M1251L8090L1452K2826J3979N991p22n733
63531I10959q539r214q619p720o969o420o152o333p185r165j2787j7815k2882
63518G81159k6478k8273k9000k9191k8641k7286k5771k4650k3584k1938j9783
63507D96564j7665j5675j3484j1215r519q655q165p658p278p140o886o168n123
63494C71933m011k843j751j186j348j741j787j485j082n40J01K87l36j041p36
63479C52434N57J707J998J866K011K558L303M078M510M061K743J341M19l98j720
63464C81468l281m222m224l801l493l319l100k831k564k208j708j206q44o16n40
63449C43511q15j429j770j062O78K508L639M295N186O369P234P530P756Q391R330
$$ plain form
63543 623680 652516 685641 723121 763825 805076 843166 874618 897444 911423 917414 916692 910959
63531 910959 902420 893206 884587 876867 869898 863478 857326 850993 843808 834643 821856 804041 781159
63518 781159 754681 726408 697408 668217 639576 612290 586519 561869 538285 516347 496564
63507 496564 478899 463224 449740 438525 429006 420351 412186 404528 397250 390110 383224 377056 371933
63494 371933 367922 365079 363328 362142 360794 359053 357266 355781 354699 354159 354260 354547 354211 353170 352434
63479 352434 352991 354698 356696 358562 360573 363131 366434 370512 375022 379083 381826 383167 383586 383188 381468
63464 381468 378187 373965 369741 365940 362447 359128 356028 353197 350633 348425 346717 345511 344667 344051 343511
63449 343511 342696 341267 339497 338435 339113 341621 345260 349555 354741 361110 368344 375874 383630 392021 401351
63434D01351J0470J2361J5795K0872K6799L2271L5808L6094L2751K6768J9866
63423F71206J3409Q095M306K206J562J994L423N935R374J3406J7870K2544K6680
63410H02010K9370L0327K9878K8119K4760J9799J3909P919K431j991m830o049
63398I75652o240o100o121o743q327j0784j3685j6844k0351k3915k6822k8723
63386H00997k9915l0554l0264k8874k6938k4993k2869k0320j7831j6023j4629
63375E37787j2834j0462q100o151m429k725j074O13K549M539O051O972P821Q961
63361E29518J0150J1162J2343J4085J6203J8301K0470K3088K5985K8444L0010
63350G39759L0854L1192L0787K9241K6491K2821J8580J4087R607N222R17k965
$$ plain form
63434 401351 411821 424182 439977 460849 487648 519919 555727 591821 624572 651340 671206
63423 671206 684615 692710 697016 699222 700784 702778 706201 712136 721510 734916 752786 775330 802010
63410 802010 831380 861707 891585 919704 944464 964263 978172 986091 988522 986531 981701 975652
63398 975652 969412 963312 957191 950448 942121 931337 917652 900808 880457 856542 829720 800997
63386 800997 771082 740528 710264 681390 654452 629459 606590 586270 568439 552416 537787
63375 537787 524953 514491 506391 500240 495811 493086 492012 492625 495174 499713 505764 512736 520557 529518
63361 529518 539668 550830 563173 577258 593461 611762 632232 655320 681305 709749 739759
63350 739759 770613 801805 832592 861833 888324 911145 929725 943812 953419 958641 959558 956593
63338I56593n617o499o100n674o200p876j0478j3752j7320k0640k3289k5196k6449
63325G81503k7064k7023k6293k4796k2560j9914j7184j4107r999m846J9K651J844
63312E92231k161p851j3130j6370j7345j7102j6697j6277j5482j4194j2478j0319
63300D32825p907n911m821m277l629k912k671k978l297l294l141l048l085l411
63286C78443m094m644m388l388k479k202k250k047j444o85j76l07j056j693j403
63271C46187k89P44J142J195J294J379J326J298J397J444J358J313J293J076P77
63256C62934R47J801K908L792M328M403L856L090K940L612M381M770N226O105
63242D15093O793O724O550P372R149J0895J2103J3127J4242J5337J6539J8255
$$ plain form
63338 956593 950976 944477 938377 932703 926503 918627 908149 894397 877077 856437 833148 807952 781503
63325 781503 754439 727416 701123 676327 653767 633853 616669 602562 592563 587717 587736 590387 592231
63312 592231 590070 582219 569089 552719 535374 518272 501575 485298 469816 455622 443144 432825
63300 432825 424918 419007 414186 409909 406280 403368 400697 397719 394422 391128 387987 384939 381854 378443
63286 378443 374349 369705 365317 361929 359450 357248 354998 352951 351507 350822 350646 350339 349283 347590 346187
63271 346187 345898 346642 347784 348979 350273 351652 352978 354276 355673 357117 358475 359788 361081 362157 362934
63256 362934 363881 365682 368590 372382 376710 381113 384969 388059 390999 394611 398992 403762 408988 415093
63242 415093 421886 428610 435160 442532 451681 462576 474679 487806 502048 517385 533924 552179
63230E52179K0428K2408K3746K4577K5116K5353K5385K5502K5762K5924K5954
63219H22334K6101K6402K6549K6502K6693K7398K8248K8653K8426K7702K6497
63208A121505K4631K1920J8203J3402P753J791m102r957j5856k1438k6067k9362
63196A102423l1305l1955l1320k9515k6824k3476j9555j5177j0560n911j392K732
63184H78165O206R235J2509J6512K0926K5009K8400L1151L3154L4217L4736L5623
63172A165843L7149L8480L8775L8287L7768L7250L6132L4282L2169K9908K6864
63161A552907K2385J6335Q870K50q913j7764k5900l3493m0599m6763n1539n4926
63149A320850n7024n7713n7007n5268n2739m9224m4675l9826l5716l2663l0058
$$ plain form
63230 552179 572607 595015 618761 643338 668454 693807 719192 744694 770456 796380 822334
63219 822334 848435 874837 901386 927888 954581 981979 1010227 1038880 1067306 1095008 1121505
63208 1121505 1146136 1168056 1186259 1199661 1207414 1209205 1205103 1195146 1179290 1157852 1131785 1102423
63196 1102423 1071118 1039163 1007843 978328 951504 928028 908473 893296 882736 876825 875433 878165
63184 878165 884371 893606 906115 922627 943553 968562 996962 1028113 1061267 1095484 1130220 1165843
63172 1165843 1202992 1241472 1280247 1318534 1356302 1393552 1429684 1463966 1496135 1526043 1552907
63161 1552907 1575292 1591627 1600497 1600747 1591834 1574070 1548170 1514677 1474078 1427315 1375776 1320850
63149 1320850 1263826 1206113 1149106 1093838 1041099 991875 947200 907374 871658 838995 808937
63138H08937k7188k3975k0903j8372j6303j4338j2386j0723r469q210o506m586
63126F35978l119k357j868j093J82J813L343M180M188M015M298M796M878M693
63112F63927M938N509N445M388L143K395J861J171O80P50R86Q80N79L35j73j235
63096F95579k344k821k743k582k340j792j202j046j257j404j325j053m22N50J190
63081F74988Q90P2k24M06J519K649L651M368M689M897N370O008O508P097Q263
63066G31151R799J0812J0866J0594J0976J2385J4453J6578J8448K0240K2314K4666
63054I13282K6908K8920L1183L4167L7723M1402M5011M8561N1958N5194N8418
63043A372727O1451O3681O4826O5358O5696O5613O4990O4502O4647O4766O4026
$$ plain form
63138 808937 781749 757774 736871 718499 702196 687858 675472 664749 655280 647070 640564 635978
63126 635978 632859 630502 628634 627541 627723 629536 632879 637059 641247 645262 649560 654356 659234 663927
63112 663927 668865 674374 679819 684207 687350 689745 691606 692777 693457 694207 695193 696073 696652 696987 696814 695579
63096 695579 693235 690414 687671 685089 682749 680957 679755 678709 677452 676048 674723 673670 673248 673798 674988
63081 674988 675878 675950 675726 676132 677651 680300 683951 688319 693008 697905 703275 709283 715791 722888 731151
63066 731151 740950 751762 762628 773222 784198 796583 811036 827614 846062 866302 888616 913282
63054 913282 940190 969110 1000293 1034460 1072183 1113585 1158596 1207157 1259115 1314309 1372727
63043 1372727 1434178 1497859 1562685 1628043 1693739 1759352 1824342 1888844 1953491 2018257 2082283
63032B082283O2979O2929O3904O4425O3338O0727N6810N1003M2670L2026J9899
63021B662993O960o409j9869l2966m5124n5759o4524p1252p5490p6575p4630p0906
63009B076449o6473o1025n3795m5174l6340k7661j8557q893P62J0201J9780K9327
62997A818601L7980M5364N1884N7559O1683O4032O5548O7265O9353P1549P3658
62986B484476P5175P5286P3855P1666O9154O5549N9828N1860M2078L0675J7635
62975C117237L047j3040l0491m8346o4960p9363r1818j02474j10352j14426j15053
62964B349961j13385j09944j04758r8488r2277q6559q0879p4892o8855o3160n8098
62953A398666n3996n0932m8275m5268m2034l9401l7636l6104l4316l2514l0949
$$ plain form
63032 2082283 2145262 2208191 2272095 2336520 2399858 2460585 2517395 2568398 2611068 2643094 2662993
63021 2662993 2669953 2663544 2643675 2610709 2565585 2509826 2445302 2374050 2298560 2221985 2147355 2076449
63009 2076449 2009976 1948951 1895156 1849982 1813642 1785981 1767424 1758531 1759293 1769494 1789274 1818601
62997 1818601 1856581 1901945 1953829 2011388 2073071 2137103 2202651 2269916 2339269 2410818 2484476
62986 2484476 2559651 2634937 2708792 2780458 2849612 2915161 2974989 3026849 3068927 3099602 3117237
62975 3117237 3120284 3107244 3076753 3028407 2963447 2884084 2792266 2689792 2579440 2465014 2349961
62964 2349961 2236576 2126632 2021874 1923386 1831109 1744550 1663671 1588779 1519924 1456764 1398666
62953 1398666 1344670 1293738 1245463 1200195 1158161 1118760 1081124 1045020 1010704 978190 947241
62942I47241k9252k7114k4999k3549k2593k1360j9529j7438j5373j3317j1545
62931G21172j0680j0711j0519r089o828m997m056l405k755k710l563m437m295
62918F43127l309k456k222k438l047m137n325n842n394m401l427k897l172m241
62904E90819n356n639n157m748m770m679m024l185k743k618k200j173N3O27L0
62889E45237j282k255k373k178k237k143j257K0N78J36m94n65j00O12J360J740
62873E34799J377M83l96j107j686j610l95J175J543L42j241k286l054l783l861
62858E20300k927j709j016p14l65n6Q5L73Q95J098P65N59R42J365J258R97J023
62841E22873Q73Mj093j656j885k304k605k225j598j586k023k039j593j409j515
$$ plain form
62942 947241 917989 890875 865876 842327 819734 798374 778845 761407 746034 732717 721172
62931 721172 710492 699781 689262 680173 673345 668348 664292 660887 658132 655422 651859 647422 643127
62918 643127 639818 637362 635140 632702 629655 625518 620193 614351 608957 604556 601129 598232 595060 590819
62904 590819 585463 579824 574667 569919 565149 560470 556446 553261 550518 547900 545700 544527 544580 545207 545237
62889 545237 543955 541700 539327 537149 534912 532769 531512 531532 532110 532246 531752 531187 531087 531699 533059 534799
62873 534799 536176 536659 536263 535156 533470 531860 531465 532640 534183 534525 533284 530998 527944 524161 520300
62858 520300 517373 515664 514648 513934 513569 513513 513598 513971 514866 515964 516729 517288 518230 519595 520853 521850 522873
62841 522873 523746 523750 522657 521001 519116 516812 514207 511982 510384 508798 506775 504736 503143 501734 500219
62826E00219j150k08M52M45M81J114J791J749J216J067J698K715L523L824L673
62811E22609L316L074L224L903M898N633N622N093M837N276O058O770P509Q406
62797E96228R116R318R356R760J0449J0966J1307J1868J2844J4201J6117J8754
62785G40284K1713K4392K6904L0100L4523L9808M5248N0563N5988O1821O8053
62774A199397P4372Q0485Q6390R2036R6820R9800J00574R9489R6690R1575Q3564
62763B201192P2894O0142M5445K8890J1334n943k2346l8041n2943o6146p6572
62752B157906q3850q8429r1051r2119r1616q9600q6604q3171p9172p4189o8600
62741A229505o3435n9021n4609m9701m4828m0535l6498l2346k8511k5369k2366
$$ plain form
62826 500219 499069 498861 499313 499758 500239 501353 503144 504893 506109 507176 508874 511589 515112 518936 522609
62811 522609 525925 528999 532223 536126 541024 546657 552279 557372 562209 567485 573543 580313 587822 596228
62797 596228 605344 614662 624018 633778 644227 655193 666500 678368 691212 705413 721530 740284
62785 740284 761997 786389 813293 843393 877916 917724 962972 1013535 1069523 1131344 1199397
62774 1199397 1273769 1354254 1440644 1532680 1629500 1729300 1829874 1929363 2026053 2117628 2201192
62763 2201192 2274086 2334228 2379673 2408563 2419897 2413954 2391608 2353567 2300624 2234478 2157906
62752 2157906 2074056 1985627 1894576 1802457 1710841 1621241 1534637 1451466 1372294 1298105 1229505
62741 1229505 1166070 1107049 1052440 1002739 957911 917376 880878 848532 820021 794652 772286
62730G72286j9007j5951j4028j2745j0952q612o607n091l366j310L62J383K308
62717F78670L432M406N200O404Q245J0154J1782J3639J6237J9277K2196K5063
62705H24705K8462L2757L7717M2715M7267N1623N6766O3420P1128P8780Q5895
62694A421235R2889J00239J07996J16042J24062J31178J36181J38265J37170J32662
62684B637919J24403J12247R6127P5887N1912K5866m6k4579m7661o9147q8214
62673B894714j04011j16134j24375j28800j30244j29882j28023j24120j18185
62664A790940j11329j04529r7655r0278q2730p5702o9303o3178n7259n1749m6543
62653I40685m1299l6122l1700k8590k6543k4743k2733k0856j9634j8883j7877
$$ plain form
62730 772286 753279 737328 723300 710555 699603 690991 684384 679293 675927 674617 674979 676362 678670
62717 678670 682102 686508 691708 698112 706357 716511 728293 741932 758169 777446 799642 824705
62705 824705 853167 885924 923641 966356 1013623 1065246 1122012 1185432 1256560 1335340 1421235
62694 1421235 1514124 1614363 1722359 1838401 1962463 2093641 2229822 2368087 2505257 2637919
62684 2637919 2762322 2874569 2970696 3046583 3098495 3124361 3124315 3099736 3052075 2982928 2894714
62673 2894714 2790703 2674569 2550194 2421394 2291150 2161268 2033245 1909125 1790940
62664 1790940 1679611 1575082 1477427 1387149 1304419 1228717 1159414 1096236 1038977 987228 940685
62653 940685 899386 863264 831564 802974 776431 751688 728955 708099 688465 669582 651705
62642F51705j6441j5162j4302j3201j1387r488q225p053m968k375r11j360k788
62629E44044l929m479m710m714m513m291m143l982l851l873l871l572l125k763
62615D88228k092o32J048J732J293J029J924L560N053O109O685O606O232O627
62601E33402Q280J0273J1446J1851J2423J3697J5573J7982K1002K4524K8306L2290
62589G41049L6495M0748M4723M8047N0237N0977N0481M9039M6107M0665L2780
62578A231348K4009J5729P793n64r204j7250k4234l0173l4898l8175m0305m1853
62566A042223m2799m2633m1279l9348l7397l5450l3273l0713k7704k4391k1224
62555F66012j8600j6389j4109j1715r805q889q649q194o998n432m286l835l615
$$ plain form
62642 651705 635264 620102 605800 592599 581212 571724 563499 556446 551478 549103 548192 546832 544044
62629 544044 540115 535636 530926 526212 521699 517408 513265 509283 505432 501559 497688 494116 490991 488228
62615 488228 486136 485504 486552 488284 489577 490606 492530 496090 501143 507252 513937 520543 526775 533402
62601 533402 541682 551955 563401 575252 587675 601372 616945 634927 655929 680453 708759 741049
62589 741049 777544 818292 863015 911062 961299 1012276 1062757 1111796 1157903 1198568 1231348
62578 1231348 1255357 1271086 1278879 1278315 1269111 1251861 1227627 1197454 1162556 1124381 1084076 1042223
62566 1042223 999424 956791 915512 876164 838767 803317 770044 739331 711627 687236 666012
62555 666012 647412 631023 616914 605199 595394 586505 577856 569662 562664 557232 552946 549111 545496
62542E45496l071k177j238l89M20J110J590K012K516K778K318J228K11j02M48
62527E53150J796L745N854P662R181J0839J2901J5262J7689J9948K1862K3701
62515G03590K6286L0214L5159M0396M5763N1438N7211O2782O8459P4468P9759
62504A275525Q2700Q2950Q1449P8477P3099O4897N4884M4033L2193J9266O455
62493A895928m660j3561k0498k5409k7992k8348k6725k3085j7547j0905m026L061
62481A696233J0868J9449K7926L4576L7323L4922K8235J9883J2224N803l38p737
62469A919367j7883l1188m5839n8627o7683p3668p7896q0409q0761p9581p7943
62458A227889p5832p2350o7183o0887n4068m7203m0909l5554l0842k6360k2256
$$ plain form
62542 545496 542425 540248 539010 538621 539041 540151 541741 543753 546269 549047 551365 552593 552804 552702 553150
62527 553150 554946 558691 564545 572207 581388 592227 605128 620390 638079 658027 679889 703590
62515 703590 729876 760090 795249 835645 881408 932846 990057 1052839 1121298 1195766 1275525
62504 1275525 1358225 1441175 1522624 1601101 1674200 1739097 1793981 1838014 1870207 1889473 1895928
62493 1895928 1891268 1877707 1857209 1831800 1803808 1775460 1748735 1725650 1708103 1697198 1693172 1696233
62481 1696233 1707101 1726550 1754476 1789052 1826375 1861297 1889532 1909415 1921639 1927442 1927104 1919367
62469 1919367 1901484 1870296 1824457 1765830 1698147 1624479 1546583 1466174 1385413 1305832 1227889
62458 1227889 1152057 1079707 1012524 951637 897569 850366 809457 773903 743061 716701 694445
62447F94445j8743j5467j2122r157p065n434l484j202Q62K523L948N139O091P120
62433F47454Q259Q848Q372P181N702L601O29k451m782o659q815j1014j2530j3433
62419F30362j4169j4354j3387j1852j0941j0707j0289r573r204r000q003o264
62407E02619n130n366o255o857o935o369m944l202k293k467k623j860n09P65J841
62392D50415K632K783K466K553L292L730L173K384K475L249L600L175K769L204
62378D91900M497O092P315P675P100O041N172M943N277N674N704N593O073P291
62364E76347Q402Q734Q986J0386J2964J5661J8035K0697K3918K7008K9614L2571
62352G93323L6766M1834M6537M9892N1465N1158M9287M6375M2393L6761K9507
$$ plain form
62447 694445 675702 660235 648113 638956 631891 626457 622973 621771 622633 625156 629104 634243 640334 647454
62433 647454 655713 664561 672933 680114 685816 689417 690046 687595 682813 676154 667339 656325 643795 630362
62419 630362 616193 601839 588452 576600 565659 554952 544663 535090 525886 516886 508883 502619
62407 502619 497489 492123 485868 479011 472076 465707 460763 457561 455268 452801 450178 448318 447809 448574 450415
62392 450415 453047 455830 458296 460849 464141 467871 471044 473428 475903 479152 482752 485927 488696 491900
62378 491900 496397 502489 509804 517479 524579 530620 535792 540735 546012 551686 557390 562983 569056 576347
62364 576347 584749 593483 602469 612855 625819 641480 659515 680212 704130 731138 760752 793323
62352 793323 830089 871923 918460 968352 1019817 1070975 1120262 1166637 1209030 1245791 1275298
62341A275298K1922J5464J0378N855J154l855q909j3666j7972k2081k6218k9813
62329A207557l1709l1480k9991k8304k6592k4652k2808k1589k0879k0194j9609
62318I29750j9730k0720k1959k2732k2906k2810k2739k2666k2297k1406k0114
62307F89671j8725j7267j5512j3532j1859j0828j0028q824p205n820n150m913
62295E60008m392l215j756o93k55o3K09M21M44O59J426K322K575K212K008K228
62279E64138K172J288N6o28n19o4K68L88N59J152K199L163L478L400L799N020
62263E89869O579Q127J0050J2741J5912J9146K2589K6462L0395L3874L7180M1176
62251H54100M6194N1593N6398N9956O1986O2445O1388N8683N3908M6741L7661
$$ plain form
62341 1275298 1297220 1312684 1323062 1328917 1330071 1326216 1317307 1303641 1285669 1263588 1237370 1207557
62329 1207557 1175848 1144368 1114377 1086073 1059481 1034829 1012021 990432 969553 949359 929750
62318 929750 910020 889300 867341 844609 821703 798893 776154 753488 731191 709785 689671
62307 689671 670946 653679 638167 624635 612776 601948 591920 583096 575891 570071 564921 560008
62295 560008 555616 552401 550645 549952 549697 549634 549843 550264 550708 551367 552793 555115 557690 559902 561910 564138
62279 564138 566310 567598 567654 567026 566507 566443 566711 567099 567658 568810 571009 574172 577650 581050 584849 589869
62263 589869 596448 604575 614625 627366 643278 662424 685013 711475 741870 775744 812924 854100
62251 854100 900294 951887 1008285 1068241 1130227 1192672 1254060 1312743 1366651 1413392 1451053
62240A451053K7986J9030J1127L490m900j4251k3823l2786m0813m7687n2778n5535
62228A240113n6284n5967n5053n3280n0395m6544m1928l6818l2073k8758k6867
62217G56146k5053k2208j8763j5990j4455j3722j3126j2266j0961r365p962p085
62205E85190o457n617m553l556k695j794p97K17J202K001K239J805J343J713L007
62190E73248M444N339N739O069O466O781O977P277P866Q665R458J0113J0511J0356
62176F79309R385P823O302N176M237L347K905L259M104N059O560R301J2953J6365
62162G76085J9135K2057K5792K9941L3826L7259L9923M0758L8902L4834K9864
62151A128376K4750J9445J3998Q832M125m78n313j0189j4600j8209k1033k3317
$$ plain form
62240 1451053 1479039 1498069 1509196 1512686 1507786 1493535 1469712 1436926 1396113 1348426 1295648 1240113
62228 1240113 1183829 1127862 1072809 1019529 969134 922590 880662 843844 811771 783013 756146
62217 756146 731093 708885 690122 674132 659677 645955 632829 620563 609602 600237 592275 585190
62205 585190 578733 573116 568563 565007 562312 560518 559721 559938 561140 563141 565380 567185 568528 570241 573248
62190 573248 577692 583031 588770 594839 601305 608086 615063 622340 630206 638871 648329 658442 668953 679309
62176 679309 688694 696517 702819 707995 712232 715579 718484 721743 725847 730906 737466 746767 759720 776085
62162 776085 795220 817277 843069 873010 906836 944095 984018 1024776 1063678 1098512 1128376
62151 1128376 1153126 1172571 1186569 1195401 1199526 1199048 1193735 1183546 1168946 1150737 1129704 1106387
62139A106387k5183k6361k6345k4917k2452j9579j6723j4011j1482r225p322n750
62127H97037m313k877j745j503k194k956k952k355j822j325l47R31J721K006K710
62112H80016M212N772O867P955R096Q967O370K125j619l584l910l000j095J085
62098I19257K409K356J327j18j699l095l849l867l519l143k753k222j401j28J494
62083I01049K927L783M389N271O299P000P644R112J1530J3825J4986J5262J5571
62070A018648J6238J6792J6792J6280J5429J4167J2413J0527R314R461J0932J3041
62058A180034J5143J7156J9229K1074K1942K1261J9142J6162J2877R626O654M119
62046A364419J809j021n190j0841j7216k3287k8507l2879l6577l9790m2559m4440
$$ plain form
62139 1106387 1081204 1054843 1028498 1003581 981129 961550 944827 930816 919334 910109 902787 897037
62127 897037 892724 889847 888102 886599 884405 881449 878497 876142 874320 872995 872648 873579 875300 877306 880016
62112 880016 884228 890000 896867 904822 913918 922885 929255 931380 929761 926177 922267 919267 918172 919257
62098 919257 921666 924022 925349 925231 923532 920437 916588 912721 909202 906059 903306 901084 899683 899555 901049
62083 901049 903976 907759 912148 917419 923718 930718 938362 947474 959004 972829 987815 1003077 1018648
62070 1018648 1034886 1051678 1068470 1084750 1100179 1114346 1126759 1137286 1146600 1156061 1166993 1180034
62058 1180034 1195177 1212333 1231562 1252636 1274578 1295839 1314981 1331143 1344020 1353646 1360300 1364419
62046 1364419 1366228 1365207 1360017 1349176 1331960 1308673 1280166 1247287 1210710 1170920 1128361 1083921
62034A083921m4586m2693l9711l6985l4795l2352k9264k6062k3185k0322j7244
62023G36722j4551j2957j2296j1788j0897r590q090o903o616p177p725p517o708
62010F13907n855n136m592m530n077n621n407m483l510k891k584k458k208j245
61996E58310O23K563L481L250K633K126J561P72n6q14j661k733l999n427o872
61981E53757p924q284q197q103q002p679p233o850o238n018l609k913l032l056
61967D67619k338j354r49j209j485j196l82L34K33q31k174k917k858k498k242
61952D45753k019j641j154p35n34o16p58l66R64K824M283M928N202N742O747Q094
61936D76714R593J0927J1679J1668J1177J0734J0709J1088J1479J1378J0616R530
$$ plain form
62034 1083921 1039335 996642 956931 919946 885151 852799 823535 797473 774288 753966 736722
62023 736722 722171 709214 696918 685130 674233 664643 656553 649650 643034 635857 628132 620615 613907
62010 613907 608052 602916 598324 593794 588717 583096 577689 573206 569696 566805 564221 561763 559555 558310
61996 558310 558933 561496 564977 568227 570860 572986 574547 575319 575263 574449 572788 570055 566056 560629 553757
61981 553757 545833 537549 529352 521249 513247 505568 498335 491485 485247 480229 476620 473707 470675 467619
61967 467619 465281 463927 462978 461769 460284 459088 458706 459040 459273 458442 456268 453351 450493 447995 445753
61952 445753 443734 442093 440939 440204 439670 439054 438296 437930 438894 441718 446001 450929 456131 461873 468620 476714
61936 476714 486307 497234 508913 520581 531758 542492 553201 564289 575768 587146 597762 607292
61924F07292Q514P565O497N308M056K538O00j369k658l024k893k781k771k589
61910F24285j876m64J396L156M547N898P581R367J0715J1500J2012J2323J2054
61897G12494J0763Q293M933J497j026k324l118m254n760p122q103q656q477p454
61883F81686o338o023o302o263n829n931o924p932q177q077q430r141r460q992
61869E77867p980o874o065n780n881n885n444m590l433j983m69O23J133J573K623
61854E29435M453O708Q891J0651J1992J3376J5277J7484J9177J9890K0023K0186
61842F97543K0360K0030J8915J7260J5490J3752J1699Q734M680K56l383n643o807
61829H12886p353p339o612n244l460j354J031L445N471O873P809Q638R345R249
$$ plain form
61924 607292 615806 623371 629868 635176 639232 641770 642370 641001 638343 635319 632426 629645 626874 624285
61910 624285 622409 621945 623341 626497 631044 636942 644523 653890 664605 676105 688117 700440 712494
61897 712494 723257 731550 736483 737980 736954 734630 731512 727258 721498 714376 706273 697617 689140 681686
61883 681686 675348 669325 663023 656760 650931 645000 638076 630144 621967 613890 605460 596319 586859 577867
61869 577867 569887 563013 556948 551168 545287 539402 533958 529368 525935 523952 523483 524106 525239 526812 529435
61854 529435 533888 540596 549487 560138 572130 585506 600783 618267 637444 657334 677357 697543
61842 697543 717903 737933 756848 774108 789598 803350 815049 823783 828463 828719 825336 819693 812886
61829 812886 805533 798194 791582 786338 782878 781524 782555 786000 791471 798344 806153 814791 824136 833385
61815H33385P550M339O35k777o110r684j2877j4786j5607j6379j7418j7946j7410
61802G14915j6282j5207j4208j3134j2184j1519j0892j0097r274q447p383o254
61790E80034n771o078o172n133l449k380k288k471k382k233k293k296j851j031
61776E34206l10o8k40l52j7N00M96k22q75o09M21J291J557J654K061K586K794
61759E44873K679K559K462K095J490J280K013L304M100L826K910K059J349M52
61745E77451o63j697k567l387l972l961l504l305l739m398m680m429l753k708
61731E30688j459l67L59Q48J178J174Q47O46Q85J283J447J475J662J929K006J984
61715E46585K187K596K866K787K422J820J074N51N51P39M03n86j569k038k317
$$ plain form
61815 833385 840935 845274 845909 843132 837022 827338 814461 799675 784068 767689 750271 732325 714915
61802 714915 698633 683426 669218 656084 643900 632381 621489 611392 602118 593671 586288 580034
61790 580034 574263 568185 562013 556880 553431 551051 548763 546292 543910 541677 539384 537088 535237 534206
61776 534206 533896 533828 533588 533236 533219 533719 534215 533993 533118 532509 532930 534221 535778 537432 539493 542079 544873
61759 544873 547552 550111 552573 554668 556158 557438 559451 562755 566855 570681 573591 575650 576999 577451
61745 577451 576788 575091 572524 569137 565165 561204 557700 554395 550656 546258 541578 537149 533396 530688
61731 530688 529229 528862 529221 530069 531247 532421 533268 533914 534799 536082 537529 539004 540666 542595 544601 546585
61715 546585 548772 551368 554234 557021 559443 561263 562337 562888 563439 564178 564581 563995 562426 560388 558071
61700E58071k967l818m067l294j959q50l51l99p55j126j221j106j331k250l305
61685E29272l510k778k197k577l270l094k003j045p97p84o12p57j611k489k366
61670D99382j356o63j052k006k585k536k261k085k009j965j864j453n90K55K85
61655D77497o20j549j607r77m61k55J09P71J265J400J626K198K582K267J623J430
61639D87299J874K458K672K358J697J185J234J526J217J55p36p54m33n69r28q24
61623D99431m92p57j672k508l032l645m333m564m274l995l878l546l068l069l591
61608D53007l846l482l204l672m524n020m975m597m020l407l049k980k914k740
61594D00577k619k502k200k053k664l790m332l856l246l367l889m018l687l286
$$ plain form
61700 558071 555104 551286 547219 543925 541966 541116 540765 540366 539611 538485 537264 536158 534827 532577 529272
61685 529272 525762 522984 520787 518210 514940 511846 509843 508798 508001 507217 506605 505848 504237 501748 499382
61670 499382 498026 497363 496311 494305 491720 489184 486923 484838 482829 480864 479000 477547 476957 477212 477497
61655 477497 476877 475328 473721 472744 472283 472028 472137 472908 474173 475573 477199 479397 481979 484246 485869 487299
61639 487299 489173 491631 494303 496661 498358 499543 500777 502303 503520 503675 502939 502185 501752 501183 500255 499431
61623 499431 498939 498182 496510 494002 490970 487325 482992 478428 474154 470159 466281 462735 459667 456598 453007
61608 453007 449161 445679 442475 438803 434279 429259 424284 419687 415667 412260 409211 406231 403317 400577
61594 400577 397958 395456 393256 391203 388539 384749 380417 376561 373315 369948 366059 362041 358354 355068
61580C55068k792j914p74J88O76N46k59j373k014j786j115n72k02J20K40N8j87
61563C43908l91q51j553j753r13M19J271J434J412J492J486J275J018R36J162
61548C50352J675K144K098J527J042J155J723K230K227J438Kj197j107J96J423
61533C66928J669J470J812K724L422L397K720J702P51J98j45q80k101l081l233
61518C77353k844k411j875j071l08M4J27K06K36K28M34O44J40j120j999j688q86
61501C65210o26o93k88L67L85k71p83q32p78o72j94M13M38j64n95l92K8J41J8
61482C60712M8N07J381K271K539K076J635J953K721L054K649J876J065M40M40
61467C85367J218K027J969J242P56P03L85n59j622k191k047j150K63J305J143
$$ plain form
61580 355068 352276 350362 349588 349776 350452 350998 350739 349366 347352 345566 344451 343879 343677 343797 344037 344095 343908
61563 343908 343517 342666 341113 339360 338447 338866 340137 341571 342983 344475 345961 347236 348254 349190 350352
61548 350352 352027 354171 356269 357796 358838 359993 361716 363946 366173 367611 367613 366416 365309 365505 366928
61533 366928 368597 370067 371879 374603 378025 381422 384142 385844 386595 386793 386648 385768 383667 380586 377353
61518 377353 374509 372098 370223 369152 368844 368888 369015 369221 369457 369685 370119 370763 370903 369783 367784 366096 365210
61501 365210 364584 363891 363603 363970 364355 364084 363301 362469 361691 361019 360825 361238 361676 361512 360917 360525 360553 360694 360712
61482 360712 360760 361267 362648 364919 367458 369534 371169 373122 375843 378897 381546 383422 384487 384927 385367
61467 385367 386585 388612 390581 391823 392579 393282 393667 393108 391486 389295 387248 386098 386361 387666 388809
61452C88809J92k10M45J187J029K46k10m6K26J75j1J76Q75J613J886J861K160
61435D00403K796K974K295J545J617K221K472K250K114K117J797J190Q47Q32O18
61420D28088R5j57J77O48P39M61J42N8L03O12M22m17j249j420j152r77q10m45
61402D25118n14j705l231l409j878j37L70l39j482k462k779k054p13J59J34q6
61386D04992J29N13O65Q58J435K044K018J225J88l66J18J607L257M060L824L122
61370D29689K414J853J784K474L270L059J833Q34P82R97P67N90J288K570L413
61355D57617L414L059K904L135L725M547N339N875O108O132O145O408O875O994
61341E28277O377N495N086N013M515L587L114L492M030M096L767L019J381r29
$$ plain form
61452 388809 389001 388791 389236 390423 391452 391698 391488 391442 391668 391843 391832 392008 392883 394496 396382 398243 400403
61435 400403 403199 406173 408468 410013 411630 413851 416323 418573 420687 422804 424601 425791 426638 427470 428088
61420 428088 428183 428026 428203 428851 429590 430051 430193 430251 430554 431166 431588 431171 429922 428502 427350 426373 425563 425118
61402 425118 424604 422899 419668 416259 414381 414244 414614 414275 412793 410331 407552 405498 404785 404944 405078 404992
61386 404992 405121 405634 406299 407157 408592 410636 412654 413879 414067 413701 413819 415426 418683 422743 426567 429689
61370 429689 432103 433956 435740 438214 441484 444543 446376 447210 447992 448989 449756 450346 451634 454204 457617
61355 457617 461031 464090 466994 470129 473854 478401 483740 489615 495723 501855 508000 514408 521283 528277
61341 528277 534654 540149 545235 550248 554763 558350 561464 564956 568986 573082 576849 579868 581249 580320
61327E80320k511k343j215p08j230j950k235k204j966j287j55Q62J152P43L41
61312E65614O71J788L061M000M832N982P274Q271R268J1093J3802J6317J7587
61299F69560J7469J6268J4225J1787R652Q065O519M482J906j067m205o780p965
61286G39916q026q265r327j0396j0596j0307j0305j0437j0032r055p943o693n051
61273F23483l336k250j940j832j311j84J310K546K894K437J996K170K750L378
61259F32111M172N266O340P113P763Q282Q139P172O192N818N372L863J581l43
61245G08841j551k569l489l798l456l163l348l759m123m373m129k907j149j63
61231F66864m98j132p46P08K258L278L977M752N683O640P501Q161Q554Q734Q807
$$ plain form
61327 580320 577809 575466 574251 573543 572313 570363 568128 565924 563958 562671 562516 563378 564530 565273 565614
61312 565614 566285 568073 571134 575134 579966 585948 593222 601493 610761 621854 635656 651973 669560
61299 669560 687029 703297 717522 729309 738961 747026 753545 758027 759933 758866 754661 747881 739916
61286 739916 731890 723625 714298 703902 693306 682999 672694 662257 652225 643170 635227 628534 623483
61273 623483 620147 617897 615957 614125 612814 612630 613940 616486 619380 621817 623813 625983 628733 632111
61259 632111 636283 641549 647889 655002 662765 671047 679186 686358 692550 698368 703740 707603 709184 708841
61245 708841 707290 704721 701232 697434 693978 690815 687467 683708 679585 675212 671083 668176 667027 666864
61231 666864 666366 665234 664488 665196 667454 670732 674709 679461 685144 691784 699285 707446 716000 724734 733541
61216G33541Q794Q636Q381Q227Q312Q497Q469Q096P587P203O902O420N656M800
61202H39521M101L680L552L731M264N338P169R575J1840J3383J4512J6060J8247
61189I54973K0219K0834J9517J6477J2543Q899O422M957L567J637n58k432l797
61176A063258m842n880p271r221j1380j3060j4014j4633j5173j5342j4964j4573
61164I22905j4873j5832j6754j7151j7187j7289j7580j7693j7177j5973j4474
61153G40922j2996j1470r820q320p141n801l731j217P74J704J799J320J90j563
61139F84650l532n252o350o505n796m939m496m023k742q91N97J681L297N736Q062
61124F59497R582J0806J2462J4447J6367J8243K0134K1804K3317K5220K7575K9497
$$ plain form
61216 733541 742335 750971 759352 767579 775891 784388 792857 800953 808540 815743 822645 829065 834721 839521
61202 839521 843622 847302 850854 854585 858849 864187 871356 880931 892771 906154 920666 936726 954973
61189 954973 975192 996026 1015543 1032020 1044563 1053462 1059884 1064841 1068408 1070045 1069487 1067055 1063258
61176 1063258 1058416 1052536 1045265 1036044 1024664 1011604 997590 982957 967784 952442 937478 922905
61164 922905 908032 892200 875446 858295 841108 823819 806239 788546 771369 755396 740922
61153 740922 727926 716456 706636 698316 691175 685374 681643 680426 681200 682904 684703 686023 686213 684650
61139 684650 681118 675866 669516 663011 657215 652276 647780 643757 641015 640124 640721 642402 645699 651435 659497
61124 659497 669079 679885 692347 706794 723161 741404 761538 783342 806659 831879 859454 888951
61112H88951L0235L0161L0122L0369L0568L0393K9622K8133K6099K3789K1060
61101A199502J7685J4118J1115Q472N156R10l435p443j1684j6344k0536k3593
61089A173923k5959k8129k9826l0882l1765l2447l2002l0218k8408k7616k7090
61078H49581k5655k3503k1439j9387j6965j4682j3190j2036j0404q472o859n355
61066F71634l502j807j109j140r34j63R20K304L861M771M521L969M223N048N620
61051F98216O281Q064J0803J3173J4517J5440J6686J8506K0898K3531K5566K6460
61039H98141K6705K6986K7130K6740K6218K6150K6276K6171K6279K7146K8232
61028A192174K8639K8406K8016K7369K6537K6594K8244L0291L1051L0581L0112
$$ plain form
61112 888951 919186 949347 979469 1009838 1040406 1070799 1100421 1128554 1154653 1178442 1199502
61101 1199502 1217187 1231305 1242420 1250892 1256048 1256958 1253523 1246080 1234396 1218052 1197516 1173923
61089 1173923 1147964 1119835 1090009 1059127 1027362 994915 962913 932695 904287 876671 849581
61078 849581 823926 800423 778984 759597 742632 727950 714760 702724 692320 683848 676989 671634
61066 671634 668132 666325 665216 664076 663142 662979 663899 666203 670064 674835 679356 683325 687548 692596 698216
61051 698216 704497 712561 723364 736537 751054 766494 783180 801686 822584 846115 871681 898141
61039 898141 924846 951832 978962 1005702 1031920 1058070 1084346 1110517 1136796 1163942 1192174
61028 1192174 1220813 1249219 1277235 1304604 1331141 1357735 1385979 1416270 1447321 1477902 1508014
61017A508014K9998K9930L0419L2412L6020M1207M8795N8929O9596P8753Q7148
61006B051221R6924J08663J22346J40154J65091J97591K36727K84123L43240M15808
60996D161888N03263O11135P47749R20467J138957J414979J736040K026138K151322
60987A5411938K000286J579593J024679N09195J45059l5823l6441J24635L76315
60978B1099436N72587N54221K57393k39051p76076j220467j518283j674978j714743
60969A5340039j663546j550216j403424j243967j083736r30653p90751o66837
60961F006909n59181m67890l92803l32145k83462k45212k15810j92261j71857
60952C146288j54434j41047j31044j22254j13431j04751r6406q8417q1405p6102
$$ plain form
61017 1508014 1538012 1567942 1598361 1630773 1666793 1708000 1756795 1815724 1885320 1964073 2051221
61006 2051221 2148145 2256808 2379154 2519308 2684399 2881990 3118717 3402840 3746080 4161888
60996 4161888 4665151 5276286 6024035 6944502 8083459 9498438 11234478 13260616 15411938
60987 15411938 17412224 18991817 20016496 20525691 20670750 20634927 20598486 20723121 21099436
60978 21099436 21672023 22226244 22483637 22244586 21468510 20248043 18729760 17054782 15340039
60969 15340039 13676493 12126277 10722853 9478886 8395150 7464497 6673746 6006909
60961 6006909 5447728 4979838 4587035 4254890 3971428 3726216 3510406 3318145 3146288
60952 3146288 2991854 2850807 2719763 2597509 2484078 2379327 2282921 2194504 2113099 2036997
60942B036997p2376o9894o8987o9545o9935o8615o6122o3845o1589n8250n4228
60931A313611n1054m8819m6057m2301l8804l6370l4161l1270k8040k5248k3043
60920I08444k1274j9880j8625j7194j5796j4841j3955j2231r669p411o262n784
60908G45522n107l962k631j537j061j255j579j446j015r24j285j588j599j723
60894G18810k381l552m892n899o069n457m902n098n661n725n243m941n120n395
60880F48475n541n792o207o483o528o562o570o351o148o527p443q060p805p013
60866E55445o319n913n633n394n145m727m048l206k366j615r90n04j05K46N58
60851E10284R12J404J849J893J575J422J735K117K119J948K029K204J913R94j21
$$ plain form
60942 2036997 1964621 1894727 1825740 1756195 1686260 1617645 1551523 1487678 1426089 1367839 1313611
60931 1313611 1262557 1213738 1167681 1125380 1086576 1050206 1016045 984775 956735 931487 908444
60920 908444 887170 867290 848665 831471 815675 800834 786879 774648 764979 757568 751306 745522
60908 745522 740415 736453 733822 732285 731224 729969 728390 726944 725929 725005 723720 722132 720533 718810
60894 718810 716429 712877 707985 702086 696017 690560 685658 680560 674899 669174 663931 658990 653870 648475
60880 648475 642934 637142 630935 624452 617924 611362 604792 598441 592293 585766 578323 570263 562458 555445
60866 555445 549126 543213 537580 532186 527041 522314 518266 515060 512694 511079 510089 509585 509480 509726 510284
60851 510284 511196 512600 514449 516342 517917 519339 521074 523191 525310 527258 529287 531491 533404 534398 534277
60836E34277r93j560k063k804l771m406m144l280k724k603j908j04J732K224J559
60821E09432J032J182J377J069M17l04j003j460j489j424j761k341k596k520k611
60806D97000k875k763k216j878k097k476k710l094l858m590m783m539m280m197
60792D50644m267m481m712m627m029l095k124j288q10j046j991k903k816j564
60778D10891k8P49O21K86K70L12rm38l61K36P22Q02Q99J366J988K527L172L980
60760D27985M480M322L853L540L325L066L113L730M351M134L080J859P95k27j031
60745D70375j140n79o2j96r68k044l154m186n193o375p665q488q241p026n563
60730D09495m482l957l830l769l457k939k607k599k467j774p45j4J05k20n93n94
$$ plain form
60836 534277 533284 531724 529661 526857 523086 518680 514536 511256 508532 505929 504021 503917 505649 507873 509432
60821 509432 510464 511646 513023 514092 514509 514205 513202 511742 510253 508829 507068 504727 502131 499611 497000
60806 497000 494125 491362 489146 487268 485171 482695 479985 476891 473033 468443 463660 459121 454841 450644
60792 450644 446377 441896 437184 432557 428528 425433 423309 422021 421211 420165 418174 415271 412455 410891
60778 410891 410863 411612 412233 412519 412789 413101 413092 412654 412293 412529 413251 414053 414952 416318 418306 420833 424005 427985
60760 427985 432465 436787 440640 444180 447505 450571 453684 457414 461765 465899 468979 470838 471633 471406 470375
60745 470375 469235 468656 468594 468398 467430 465386 462232 458046 452853 446478 438813 430325 422084 415058 409495
60730 409495 405013 401056 397226 393457 390000 387061 384454 381855 379388 377614 376869 376855 376960 376740 376147 375553
60714C75553q3M89M78Kj16M12Q44O53M42Q83J489J336N20q5q8L05R94J808K054
60695C87890J325N39J029K661L957M137L891L978M165L966L476L001K570K286
60681D28871K546L415M239M307L693L061K890L093L255L096K664K142J554R30
60667D69756O86J176J775J170r63l296m516m852n160n281m520l312k952l695m364
60652D31652l925k524q25O23J306R80L14M18J465K455K542J856Q73k33j316k071
60636D33590k479k879l407l766l675l071j953n96K54R4n09n30Q4M97L93L81Q45
60619D13273J388J648J728J570Q08m00j191j084n86l33l59m47n61n55k00K49J73
60602D15121m34q36p40p35j175j476j078l63N8K47N65R40J185J547K259K908K966
$$ plain form
60714 375553 375470 375959 376437 376439 376323 376735 377579 378232 378674 379557 381046 382382 382902 382817 382729 383034 384028 385836 387890
60695 387890 389215 389754 390783 393444 397401 401538 405429 409407 413572 417538 421014 424015 426585 428871
60681 428871 431417 434832 439071 443378 447071 450132 453022 456115 459370 462466 465130 467272 468826 469756
60667 469756 470442 471618 473393 474563 473600 470304 465788 460936 455776 450495 445975 442663 439711 436016 431652
60652 431652 427727 425203 424378 425001 426307 427287 427601 428019 429484 431939 434481 436337 437210 436977 435661 433590
60636 433590 431111 428232 424825 421059 417384 414313 412360 411764 412018 412112 411603 411073 411157 411654 412047 412428 413273
60619 413273 414661 416309 418037 419607 420415 420015 418824 417740 417154 416821 416462 416015 415454 414899 414699 414948 415121
60602 415121 414687 413851 413111 412376 411201 409725 408647 408284 408342 408589 409154 410094 411279 412826 415085 417993 420959
60585D20959K600K369K354K110J383L96m60q90p83l25J57O21J296K098K532K460
60569D38877K548L463M980O328P223Q071R244J0587J1724J2559J3300J4055J4471
60556E57430J3858J1794Q571M903J362j772m229n737o337o468o587o719o361m909
60542E48799k399J91J780K496L505N439P723R824J2239J5369J8251J9596J9460
60529F62273J8739J7455J4892J1180P274L435q38n120p861q346p660p138o968
60516F91317o858o884p017o739n883n026m421l427j698k6P46R77J431J996K165
60501F50653K375L773O727J0404J3916J7287K1202K6147L1901L7729M3091M8041
60489I13246N2701N6538N8665N8753N7081N3614M7739L9153K8294J5711J644j3342
$$ plain form
60585 420959 423559 425928 428282 430392 431775 432171 431711 430821 430038 429713 429870 430491 431787 433885 436417 438877
60569 438877 441425 444888 449868 456196 463419 471490 480734 491321 503045 515604 528904 542959 557430
60556 557430 571288 583082 591653 596556 597918 596146 591917 586180 579843 573375 566788 560069 553708 548799
60542 548799 546400 546591 548371 550867 554372 559811 567534 577358 589597 604966 623217 642813 662273
60529 662273 681012 698467 713359 724539 731813 735248 734410 729290 721429 713083 705423 698285 691317
60516 691317 684459 677575 670558 663819 657936 652910 648489 645062 643364 643338 644084 645061 646492 648488 650653
60501 650653 653028 656801 663528 673932 687848 705135 726337 752484 784385 822114 865205 913246
60489 913246 965947 1022485 1081150 1139903 1196984 1250598 1298337 1337490 1365784 1381495 1383139 1369797
60477A369797k7875m0303m9478n5028n7383n7600n6579n4420n1018m7059m3511
60466H29543m0269l6465l2106k8248k5287k2482j9540j7284j6123j5096j3319
60455E63324j1285r815q734p556o556o167o093n945o004o405o435n678m998n201
60441D66452n480m526k567r42q1O46J330J258K86q42j669k415l019k922k128j430
60425D41951j229r50j25P28Q23K89O9Q69K417L666L651K367Q08k9q6J8p0j47K8
60406D55048M31R43J468J824J830J505J041O25M58P29J344J882K047K015K132
60391D75322K396K489K159J434P27O65J533K767L431L292K939K765K555K249K358
60376E09081L061L579L129K048J338J428J952K411K531K160J405P17M65N14N11
$$ plain form
60477 1369797 1341922 1301619 1252141 1197113 1139730 1082130 1025551 971131 920113 873054 829543
60466 829543 789274 752809 720703 692455 667168 644686 625146 607862 591739 576643 563324
60455 563324 552039 542224 533490 525934 519378 513211 507118 501173 495169 488764 482329 476651 471653 466452
60441 466452 460972 456446 453879 452937 452856 453502 454832 456090 456376 455534 453865 451450 448431 445509 443381 441951
60425 441951 440722 439772 439647 440375 441198 441487 441556 442425 444842 448508 452159 454526 455334 455305 455219 455237 455167 455020 455048
60406 455048 455479 456422 457890 459714 461544 463049 464090 464715 465173 465902 467246 469128 471175 473190 475322
60391 475322 477718 480207 482366 483800 484527 485192 486725 489492 492923 496215 499154 501919 504474 506723 509081
60376 509081 512142 515721 518850 520898 522236 523664 525616 528027 530558 532718 534123 534840 535305 535819 536330
60361E36330L02n2l77k82N81J879K738K746K318J941J677J652K250L390M383M943
60345E66419N613O617P228O901O218N837N230L457O94j942l728m655m961n026
60331E93902n365n911n862m930m109m336n054n218m994n181n487m865l406k395
60317E26789k367k513k213j883j836j453j47J660L152M120M859N567O334P432
60303E47501R128J1298J3507J5422J7037J8477J9540J9555J7950J4902J0995O319
60291G21631O53n309r947j2452j3724j4785j5228j4138j1844r562p860o586n934
60278E94915o215o763o375m981l843l908m829n743o117n754m726l599l077l266
60264E25719l676l834l534k719j725j257j487j564p89K40N69M48P88J513J769
$$ plain form
60361 536330 536632 536580 536203 535921 536502 538381 541119 543865 546183 548124 549801 551453 553703 557093 561476 566419
60345 566419 572032 578649 585877 592778 598996 604833 610063 613520 614214 612272 608544 603889 598928 593902
60331 593902 588537 582626 576764 571834 567725 563389 558335 553117 548123 542942 537455 532590 529184 526789
60317 526789 524422 521909 519696 517813 515977 514524 514377 516037 519189 523309 528168 533735 540069 547501
60303 547501 556629 567927 581434 596856 613893 632370 651910 671465 689415 704317 715312 721631
60291 721631 722284 716975 707028 694576 680852 666067 650839 636701 624857 615295 607435 600849 594915
60278 594915 588700 581937 575562 570581 566738 562830 558001 552258 546141 540387 535661 532062 528985 525719
60264 525719 522043 518209 514675 511956 510231 508974 507487 505923 505134 505374 505943 506391 507179 508692 510461
60249E10461J539J623K036J906J163Q28J281J559R36n6p38j337k204k904k915
60234E13178k463k014j539q70j68N14J502K807L751L793L322L088L339L888M570
60219E36698N212N542N548N597N930O433P072P984Q965R508R582R754J0243J0551
60205F44619J0423J0371J0683J0670R648Q144P254P130O912O062M966M207L793
60192G44882L300K382J019n11j806k697l434m339n361o184o760p454q458r269
60178F95310r100p895o611o173o318n980m737l307k511k427k817l607m394m235
60164F25198k778j174q36j607k113j744j231j170j133o11J22N89Q90J324J742
60149F15468J846J794K025K576L009K967K603K386K544K789K641K067J611J755
$$ plain form
60249 510461 512000 513623 515659 517565 518728 519556 520837 522396 523332 523276 522538 521201 518997 516093 513178
60234 513178 510715 508701 507162 506292 506124 506638 508140 510947 514698 518491 521813 524901 528240 532128 536698
60219 536698 541910 547452 553000 558597 564527 570960 578032 586016 594981 604489 614071 623825 634068 644619
60205 644619 655042 665413 676096 686766 696414 704558 711812 718942 725854 731916 736882 741089 744882
60192 744882 748182 750564 751583 751072 749266 746569 743135 738796 733435 727251 720491 713037 704579 695310
60178 695310 686210 678315 671704 665531 659213 653233 648496 645189 642678 640251 637434 633827 629433 625198
60164 625198 622420 621246 620410 618803 616690 614946 613715 612545 611412 610801 610923 611512 612402 613726 615468
60149 615468 617314 619108 621133 623709 626718 629685 632288 634674 637218 640007 642648 644715 646326 648081
60135F48081K489L597M987O453P472P747P607P467P185O415N346M511M058L761
60121G27176L574L699M181M791N164M912L964K979K838L423L614K895K082J773
60107G77065J195m93k649m183n283o675p873p877p163p232q219q723q083p188
60093F96619o739o303n525m801m193k994j068N66J100R27P05M91L18O39J464J964
60077F73170J523N29m00j228k101k931l784m949o203o836o794o944p812q783r022
60062F07435q396p162n609m367m173m775m901l786k031n63L82Q32O80K43M19J572
60046E65800K969L867M410N051N821O691P822Q924R182Q338P139O244N481M555
60032F52294L616K576R16j232k784l188l290l981m991n762o523p515q103p746
$$ plain form
60135 648081 650570 654167 659154 665607 673079 680826 688433 695900 703085 709500 714846 719357 723415 727176
60121 727176 730750 734449 738630 743421 748585 753497 757461 760440 763278 766701 770315 773210 775292 777065
60107 777065 778260 777767 775118 770935 765652 758977 751104 743227 736064 728832 720613 711890 703807 696619
60093 696619 689880 683577 678052 673251 669058 666064 664996 665562 666662 667589 668294 668785 669103 669742 671206 673170
60077 673170 674693 675222 674822 673594 671493 668562 664778 659829 653626 646790 639996 633052 625240 616457 607435
60062 607435 599039 591877 586268 581901 577728 572953 568052 564266 562235 561672 562054 562886 563566 563809 564228 565800
60046 565800 568769 572636 577046 582097 587918 594609 602431 611355 620537 628875 636014 642258 647739 652294
60032 652294 655910 658486 659402 658170 655386 652198 648908 644927 639936 634174 627651 620136 612033 604287
60018F04287p056o879o964o709o490p062q078q465q003p355o819o085n204m695
60004E08423m609m370l634k687j870j199n83L8P44J460J822J625J263J325J941
59989D99689K791L603M264M675M808M842M969N151N111M502L134J268n15k072
59975E46220l893o031p314o703n034m186m596m927m268l150k152j084j01l4q33
59960D91914j134k50P38Q66Q94J796K927L080K348J637J127O04M99J233K185K578
59944E13042K711L155L353K478R97J9m59j226k223k619k293j907j686j260o00
59929E11482j5N11J071J327J313K072M279O720P710P553Q008R506J0597J0223
59915E82357Q865P251N398L485K246J906J769J378J159J455J778J551R33M62L74
$$ plain form
60018 604287 597231 590352 583388 576679 570189 563127 555049 546584 538581 531226 524407 518322 513118 508423
60004 508423 503814 499444 495810 493123 491253 490054 489471 489509 490253 491713 493535 495160 496423 497748 499689
59989 499689 502480 506083 510347 515022 519830 524672 529641 534792 539903 544405 547539 548807 548292 546220
59975 546220 542327 536296 528982 522279 517245 513059 508463 503536 499268 496118 493966 492882 492781 492747 491914
59960 491914 490780 490530 491268 492134 493028 494824 497751 500831 503179 504816 505943 506547 507046 508279 510464 513042
59944 513042 515753 518908 522261 524739 525736 525755 525296 524070 521847 519228 516935 515028 513342 512082 511482
59929 511482 511467 511978 513049 514376 515689 517761 522040 528760 536470 544023 552031 561537 572134 582357
59915 582357 591222 598473 603871 607356 609602 611508 613277 614655 615814 617269 619047 620598 621531 621993 622367
59900F22367M76L29m57j603k076j214K63J195J582K229L150L506L200L151L699
59885F39797L987L370K446K118K508L291M324N372N797N208M059L158K802K664
59871F90901K265J376J75r21j779k733l914m728m512l556k809k727k953l055k933
59856F58097k595k100j675j411j075o60o88j245j308M0K117L456L854M370N517
59841F64694O698P499Q107Q219O886M026R57j068j933j917r23Q17K340K991L104
59826G10497K998K093r4k794m759n803o634p452p667o957n801m811m171l845l849
59811F50951l996l827l081k136j595j613j888k225k677k989k486j021L41L66o93
59796F21431j359r64n40j232k703l760l941l701l414l038k567k201k150k530l239
$$ plain form
59900 622367 622843 623172 622715 621112 619036 617822 618085 619280 620862 623091 626241 629747 632947 636098 639797
59885 639797 643784 647154 649600 651718 654226 657517 661841 667213 673010 678218 682277 685435 688237 690901
59871 690901 693166 694542 694717 693796 692017 689284 685370 680642 676130 672574 669765 667038 664085 661030 658097
59856 658097 655502 653402 651727 650316 649241 648581 647893 646648 645340 645380 647497 650953 654807 659177 664694
59841 664694 671392 678891 686998 695217 702103 706129 707086 706018 704085 702168 701245 702062 704402 707393 710497
59826 710497 713495 715588 715494 712700 707941 702138 695504 688052 680385 673428 667627 662816 658645 654800 650951
59811 650951 646955 643128 640047 637911 636316 634703 632815 630590 627913 624924 622438 621417 621758 622124 621431
59796 621431 620072 619108 618568 617336 614633 610873 606932 603231 599817 596779 594212 592011 589861 587331 584092
59781E84092l718l357k487k198k740k941j898m29J13k80o51p01p61o58J36J400
59765E62922K394K979L491L748L421L111L778N157O065O195O312O610O409N706
59751F28298N577O530P701Q255Q380Q290P512N976M765M726N122M668L372K322
59737G11494J939J490L50j003j614j275p32o83r17p13M4O34N32Q3j76k68l50j72
59719G08663L56N76n8r66j151o20k19l68q56j566k366k622j886q61n45o75k49
59702F94587N77O20k52o60K53J678K541K805K902K852K661K697L037L139K643
59687G22080J892J305Q12K32m53j342k466l298l212k568k444l169m035m616n325
59672F93393o380p191p291p001o725o366n835n392n101m652l954l275k530j282
$$ plain form
59781 584092 580374 577017 574530 572332 569592 566651 564753 564324 564437 564157 563506 562805 562044 561386 561522 562922
59765 562922 565316 568295 571786 575534 578955 582066 585844 591001 597066 603261 609573 616183 622592 628298
59751 628298 633875 640405 648106 656361 664741 673031 680543 686519 691284 696010 701132 705800 709172 711494
59737 711494 713433 714923 715273 714270 712656 711381 710649 709966 709049 708336 708380 709014 709546 709629 709453 709185 708835 708663
59719 708663 709019 709595 709537 708571 707420 706800 706581 706213 705357 703791 701425 698803 696917 696056 695511 694836 694587
59702 694587 695164 695784 695532 694872 695125 696803 699344 702149 705051 707903 710564 713261 716298 719437 722080
59687 722080 723972 725277 726089 726321 725868 724526 722060 718762 715550 712982 710538 707369 703334 698718 693393
59672 693393 687013 679822 672531 665530 658805 652439 646604 641212 636111 631459 627505 624230 621700 620418
59658F20418L55J633K182K429K798L300L986M866N381M991M306M421M975M325
59644F70366K004m75j856k720m059n576o455o765o983o954o316n328m461l721
59630F10701l032k644k562k313j873j965k873l831m259m671n523o094n486m008
59616E59567k600j546p24m48r98j783j981j624j197n22R27K820M019L857K742
59601E60509J512P02M05L92M27N83J050J521J329L57o24q66l93K93P17M85m55
59584E67944j376j399p29n12j191j931j992j632j235o11J51K21p34j697j552n25
59568E51200L35M73L2o11r07n05rn16j873k536j764p34n47n04M14J547J637R31
59550E46063O14P16L79k92l07M30J061J425K284L720M808N203N795P265R257J1545
$$ plain form
59658 620418 620773 622406 624588 627017 629815 633115 637101 641967 647348 652339 656645 661066 666041 670366
59644 670366 672370 671895 670039 667319 663260 657684 651229 644464 637481 630527 624211 618883 614422 610701
59630 610701 607669 605025 602463 600150 598277 596312 593439 589608 585349 580678 575155 569061 563575 559567
59616 559567 556967 555421 554697 554249 553251 551468 549487 547863 546666 546144 547071 549891 553910 557767 560509
59601 560509 562021 562723 563128 563520 563947 564530 565580 567101 568430 568787 568163 567297 566904 567197 567914 568399 567944
59584 567944 566568 565169 564440 563928 562737 560806 558814 557182 555947 555336 555487 555708 554974 553277 551725 551200
59568 551200 551535 552008 552040 551429 550522 550017 550008 549492 547619 545083 543319 542585 542038 541534 541948 543495 545132 546063
59550 546063 546677 547393 547772 547480 547173 547603 548664 550089 552373 556093 560901 566104 571899 579164 588421 599966
59534E99966J4913J9839K4771K6668K3482J5979P261N54k754l397k900k335k105
59521G19942k228k344j945j110o74j299k734m372o102q033r785j0819j1223j1527
59507F45747j1808j1628j0835r834q986q190p199o042m899l751k430j123o44j648
59493E56730l412m039k509q6J223J128R53J313J476J135J243K426L806M314M199
59478E69900M299M693M939N037N259N571N964O785Q029Q821Q330O739M820L037
59464F52223J650J053J276J637J558J330J565K344L411M742O413Q285J0067J1290
59450G08844J1210R572P454O361O231N576L878K344J687P51j594m586o860q376
59436G42492r665j0176r027o765m871l900l308k829k747l044l229k951j971O0
$$ plain form
59534 599966 614879 634718 659489 686157 709639 725618 732879 733433 730679 727282 724382 722047 719942
59521 719942 717714 715370 713425 712315 711641 710342 707608 703236 697134 689101 679316 668497 657274 645747
59507 645747 633939 622311 611476 601642 592656 584466 577267 571225 566326 562575 560145 559022 558378 556730
59493 556730 553318 549279 546770 546684 547907 549035 549988 551301 552777 553912 555155 557581 561387 565701 569900
59478 569900 574199 578892 583831 588868 594127 599698 605662 612447 620476 629297 637627 644366 649186 652223
59464 652223 653873 654926 656202 657839 659397 660727 662292 664636 668047 672789 679202 687487 697554 708844
59450 708844 720054 729626 737080 743441 749672 755248 759126 761470 763157 763908 762314 757728 750868 742492
59436 742492 732827 722651 713624 706859 701988 698088 694780 691951 689204 686160 682931 679980 678009 678069
59422F78069L036N968P928R088J0239J1689J3234J4663J5693J5942J5574J5535
59410H16658J6777J9645K3805K7588K7498K0466P585n917j5391k0167k1726k0739
59398H76082j7333j2263n865K381J1139J5783J2504L018p169j4505j9132k1915
59386H22725k2756k1921k0411j8485j5632j2201r284o908m171j221O87J326J855
59373F93603K822L473L446L508M185M977N402N656N972O298O764P449P885P840
59359G69280Q175R616J1142J1220J0289J0190J1340J2426J2902J3654J4905J5516
59347I10655J5042J4654J5179J5755J5326J4135J2898J1640J0096Q340O367L860
59335A053947Q56k201n235q532j1765j4079j5397j6486j7562j7877j7019j5592
$$ plain form
59422 678069 681105 687073 695001 704089 714328 726017 739251 753914 769607 785549 801123 816658
59410 816658 833435 853080 876885 904473 931971 952437 960022 954105 938714 918547 896821 876082
59398 876082 858749 846486 840621 843002 854141 869924 882428 885446 878277 863772 844640 822725
59386 822725 799969 778048 757637 739152 723520 711319 702035 695127 690956 689735 690422 691748 693603
59373 693603 696425 699898 703344 706852 711037 716014 721416 727072 733044 739342 746106 753555 761440 769280
59359 769280 777455 787071 798213 809433 819722 829912 841252 853678 866580 880234 895139 910655
59347 910655 925697 940351 955530 971285 986611 1000746 1013644 1025284 1035380 1043720 1050087 1053947
59335 1053947 1054803 1052602 1047367 1038835 1027070 1012991 997594 981108 963546 945669 928650 913058
59323I13058j4290j3225j2379j1784j1080r796q197o934n966m859l896l749m134
59310H02769m148l872m134m780m792m175m051m616m710l898l216l204k818j175
59296G49180J054K985N024P922J1142J3080J2375Q630K573l944q899j1560j2607
59283G76955j2796j2290j1257j0013q373n925l029n60J453L742O306Q301R602
59270G42116J1074J2952J4295J4543J4284J4011J3310J1822R817P278L663p88
59258H68377m639o894q118r292j0513j1391j1908j2234j2386j2421j2345j1609
59246G44627r602o728m193k535j334l23L90J260L094N572P261P499P117P022P133
59231G66260P045O611N542L591J337k74j271k396l560l987l877m330n466o201
$$ plain form
59323 913058 898768 885543 873164 861380 850300 840504 832307 825373 819407 814548 810652 806903 802769
59310 802769 798621 794749 790615 785835 781043 776868 772817 768201 763491 759593 756377 753173 750355 749180
59296 749180 750234 753219 758243 766165 777307 790387 802762 811392 813965 810021 801122 789562 776955
59283 776955 764159 751869 740612 730599 722226 716301 713272 712712 714165 717907 724213 732514 742116
59270 742116 753190 766142 780437 794980 809264 823275 836585 848407 858224 865502 869165 868377
59258 868377 863738 856844 848726 839434 828921 817530 805622 793388 781002 768581 756236 744627
59246 744627 735025 728297 724104 721569 720235 719912 720302 721562 724656 730228 737489 744988 752105 759127 766260
59231 766260 773305 779916 785458 789049 790386 790112 788841 786445 782885 778898 775021 770691 765225 759024
59217G59024o185o245o576o293n231m413m202l693k506j442p56K98J572J652K74
59202G15278p95m45J27l96j388j846k236l248m131l908l037k389j683l99P99J038
59186F91341P05O58P88O44O24J268K188K792L336M183M862M939M945N431N970
59171G34674O108O383P298Q270Q699R188J0516J2230J3350J3725J3507J2196R376
59158H65520N820K709K86j849l757n443p305r429j1099j1913j2553j3567j4174
59145G83246j3389j1626j0255j0051j0804j1830j2205j1253r436q061p630p415
59133F59291p062p151p598p041m868k513j481j395j159p59n73m2J388K989L811
59118F25837M311N562P564R551J1259J2672J3316J2935J2210J1746J1151J0063
$$ plain form
59217 759024 752839 746594 740018 733725 728494 724081 719879 716186 713680 712238 711482 711780 713352 715004 715278
59202 715278 714483 714038 714165 713769 712381 710535 708299 705051 700920 697012 693975 691586 689903 689504 690303 691341
59186 691341 692046 692704 693492 694136 694760 696028 698216 701008 704344 708527 713389 718328 723273 728704 734674
59171 734674 740782 747165 754463 762733 771432 780620 791136 803366 816716 830441 843948 856144 865520
59158 865520 871340 874049 874335 872486 868729 863286 855981 846552 835453 823540 810987 797420 783246
59145 783246 769857 758231 747976 737925 727121 715291 703086 691833 682397 674336 666706 659291
59133 659291 652229 645078 637480 630439 625571 623058 621577 620182 619023 618264 617691 617649 619037 622026 625837
59118 625837 630148 635710 643274 652825 664084 676756 690072 703007 715217 726963 738114 748177
59106G48177R135Q826Q235O363L741J621L51l61n31m07q98k324l678m274m940
59091G69036o324p245o328m237k588j622o26J34k37j560k896m089n445o470o505
59076G12998o158o566p537p910p359o527n779n090m801n156n486n013m076l476
59062F32064l165k701k282k173j809q02q4o63j902k449k257k228k459k355j974
59047F02761j779j481n71N01R04P82O88L35p36j829j898j236r44j198j385j433
59031E91481j575j323j06J491K490L016L777M638N130N777P347R301J0416J0545
59017F52405J0393J0006Q943P409N916M243K100J71q20j406k306k882k162o68
59003F91342L95J022J898K803L232L863N455P033P103O061N471N497N114M292
$$ plain form
59106 748177 757312 766138 774373 780736 784477 786098 786449 786088 785557 785150 784252 781928 778250 773976 769036
59091 769036 762712 755467 749139 744902 742314 740692 740066 740200 739963 738403 735507 731418 725973 719503 712998
59076 712998 706840 700274 692737 684827 677468 670941 665162 660072 655271 650115 644629 639616 635540 632064
59062 632064 628899 626198 623916 621743 619934 619132 619048 618385 616483 614034 611777 609549 607090 604735 602761
59047 602761 600982 599501 598930 599431 600335 601117 601805 602140 601404 599575 597677 596441 595497 594299 592914 591481
59031 591481 589906 588583 588477 589968 592458 595474 599251 603889 609019 614796 622143 631444 641860 652405
59017 652405 662798 672804 681747 689156 695072 699315 701415 701586 700766 699360 697054 694172 692010 691342
59003 691342 691737 692759 694657 697460 700692 704555 710010 717043 724146 730207 735678 741175 746289 750581
58989G50581L895L720K755J138j18j031k327l583l737l160l077l177k044K41K137
58974G42213L321M994P389R266J0248J1494J3617J5786J7394J8804K0046K0541
58962H95113K0447K0599K0794J9792J7361J4581J1856Q358L872n25m066p169j0239
58949A010774j3042j5545j7987j9856k0217j9265j8272j7802j7278j6285j4955
58938H20270j3163j0767q566p505p077o066m634l973m109l904l135k667k525j837
58924G40342p31l79q88j057m93j04l14m70l45m30n70m3Q98J310J371K012K845
58907G42954K569J496J393K619L732M320N820Q861J1998J4000J5328J6599J7468
58894H49157J7842J8376J8974J8632J7501J7316J8937K1150K2624K3424K3859
$$ plain form
58989 750581 754476 758196 760951 762089 761971 760940 758613 755030 751293 748133 745056 741879 739835 740076 742213
58974 742213 745534 750528 757917 767183 777431 788925 802542 818328 835722 854526 874572 895113
58962 895113 915560 936159 956953 976745 994106 1008687 1020543 1028901 1032773 1032248 1028182 1021013 1010774
58949 1010774 997732 982187 964200 944344 924127 904862 886590 868788 851510 835225 820270
58938 820270 807107 796340 787774 780269 773192 767126 762492 758519 754410 750506 747371 744704 742179 740342
58924 740342 739611 739232 738344 737287 736794 736690 736376 735906 735561 735131 734561 734518 735416 736726 738097 740109 742954
58907 742954 745523 747019 748412 751031 754763 759083 764903 773764 785762 799762 815090 831689 849157
58894 849157 866999 885375 904349 922981 940482 957798 976735 997885 1020509 1043933 1067792
58883A067792K3574K2531K1289J9657J6690J2577Q809N862K470k096o805j0602
58871A181748j3667j6205j7667j7861j7341j6179j4032j1803j1216j2106j2227
58860A021444j0618r037r092r947j0190j0124j0678j1570j1962j1912j1974j2292
58848H92048j2808j3393j3350j2014j0168r450r978j0240r668r391r906j0024
58836G61658r031q021q030q531q710q634q268p015n131m072m376m670l694j832
58822F71643L2J752L181L806L889M527N880O858P041P316P937P834O542N051M085
58807G47374L224K400K322K803K549J335L47k14j597l858n166m854m711n993p474
58792G28487p859p885q407q514p281n623m713m224l493k771k025l36K083L275
$$ plain form
58883 1067792 1091366 1113897 1135186 1154843 1171533 1184110 1192919 1198781 1201251 1199155 1192350 1181748
58871 1181748 1168081 1151876 1134209 1116348 1099007 1082828 1068796 1056993 1045777 1033671 1021444
58860 1021444 1010826 1001789 992697 982750 972560 962436 951758 940188 928226 916314 904340 892048
58848 892048 879240 865847 852497 840483 830315 820865 810887 800647 790979 781588 771682 761658
58836 761658 752627 744606 736576 728045 719335 710701 702433 695418 690287 686215 681839 677169 673475 671643
58822 671643 671675 673427 676608 680414 684303 688830 694710 701568 708609 715925 723862 731696 738238 743289 747374
58807 747374 750598 752998 755320 758123 760672 762007 762354 762140 760543 756685 751519 746665 741954 735961 728487
58792 728487 720628 712743 704336 695822 688541 682918 678205 673981 670488 667717 665692 665356 667439 670714
58778F70714K393J305J833L197L838L762L374J824j466n096p333q198q436p941
58764F53770o797o277p065p892p473o400n629m681l010j548j137q65K60J359J275
58749E97890P24J062J981K335K226K611L605M634N590O632P595Q427R260R547
58735F64119Q517P013O970Q414R078P931O726O883P253O613N924O222O443N436
58721G63542M224M160M610M520M592N807P398Q223Q711R545J0017R491Q793Q380
58707H62013O924L650K07j867l711o953j0753j3319j4843j6570j8450j9807k0928
58694G45593k1919k1509j9142j6542j5188j3977j1621r356q778q827p758o408
58682E84568o546p437p038n526m682m726m468l773l302k630j094L36M00p3N84
$$ plain form
58778 670714 673107 674412 676245 679442 683280 687042 690416 692240 690774 685678 678345 670147 661711 653770
58764 653770 646973 640696 633631 625739 618266 611866 606237 601556 598546 596998 595861 594996 595256 596615 597890
58749 597890 598614 599676 601657 603992 606218 608829 612434 617068 622658 629290 636885 645312 654572 664119
58735 664119 672636 679649 686619 695033 704111 712042 718768 725651 732904 739517 745441 751663 758106 763542
58721 763542 767766 771926 776536 781056 785648 791455 798853 807076 815787 825332 835349 844840 853633 862013
58707 862013 868937 872587 872794 870927 867216 860263 849510 836191 821348 804778 786328 766521 745593
58694 745593 723674 702165 683023 666481 651293 637316 625695 616339 607561 598734 590976 584568
58682 584568 578022 570585 563547 558021 553339 548613 544145 540372 537070 534440 533346 533682 534082 534009 534593
58667E34593K285L995N977Q813J1393J2306J2233J2518J2415J0304O660L310N86
58654F37388k352n184o823p406p775p797p168o769p203p270n920m363m040m094
58640E53224l152j948j662j369J19J542J275N08J288K848L110K407K431K724J649
58625E64994j45p00k50m52j010l77R79J329J018J778L431M502N273O951Q550Q114
58609F03985O340N519N446M068J656O22J352J821J271Q27N11q27k562k632j082
58594F26315j11n29j085j275j664j553M21L372N013N369O575R030J1012J2082
58580F72972J3526J5230J5465J4035J2589J1539R727P359O175O426O681O790Q141
58567H06655J0811J3455J6100K0016K4744K8398L0962L4103L7512L8722L6846
$$ plain form
58667 534593 536878 540873 546850 555663 567056 579362 591595 604113 616528 626832 633492 636802 637388
58654 637388 635036 629852 623029 615623 607848 600051 592883 586114 578911 571641 565721 561358 557318 553224
58640 553224 550072 548124 546462 545093 545212 546754 548029 548537 549825 552673 555783 558190 560621 563345 564994
58625 564994 564849 564149 563899 563447 562437 562060 563039 564368 565386 567164 570595 575097 580370 587321 595871 603985
58609 603985 610325 615844 621290 625358 627014 627636 628988 630809 632080 632907 633418 632591 630029 627397 626315
58594 626315 626204 625675 624590 623315 621651 620098 620519 623891 628904 634273 640848 649878 660890 672972
58580 672972 686498 701728 717193 731228 743817 755356 765083 772442 778617 785043 791724 798514 806655
58567 806655 817466 830921 847021 867037 891781 920179 951141 985244 1022756 1061478 1098324
58556A098324L3368K8924K2588J4749P595K097k617o584q620q866q773q361o458
58543A157366l866l176n126q062j1269j5685k1062k5510k8325l0366l1487l0521
58531I42911k7984k5699k3697k0522j6611j3963j2459j0022o615m482m085l354
58519G73418j540l53o24j183j588k725m154m099k637j847k340k717k634l179m074
58504G37724l887l070l341m039k890m29L69r16j568o66l17j325j727o68K60N76
58488G14086J933M547O296O477O947Q575J0107J1313J3725J7392K0407K2342K4493
58475H68640K6317K5448K1829J7818J3764P703L0o004r337j2232j5434j6696j5257
58462I06589j3300j1715q761m255o92J192L684P566J0685J2289J4369J7238J8220
$$ plain form
58556 1098324 1131692 1160616 1183204 1197953 1205548 1207645 1205028 1198444 1189824 1180958 1172185 1163824 1157366
58543 1157366 1153500 1150324 1145198 1137136 1125867 1110182 1089120 1063610 1035285 1004919 973432 942911
58531 942911 914927 889228 865531 845009 828398 814435 801976 791954 785339 780857 776772 773418
58519 773418 771878 771525 770901 769718 768130 765405 761251 757152 754515 752668 750328 747611 744977 741798 737724
58504 737724 733837 730767 727426 723387 720497 720068 720437 719521 717953 717287 716970 715645 713918 713250 713510 714086
58488 714086 716019 720566 726862 733339 740286 748861 758968 770281 784006 801398 821805 844147 868640
58475 868640 894957 920405 942234 960052 973816 981519 981549 975545 966208 953976 938542 921846 906589
58462 906589 893289 881574 872813 868558 867866 869058 872742 880308 890993 903282 917651 934889 953109
58449I53109J6209J3214R953M523k984r152j2308j4519j6986j7890j6562j5130
58437H91477j4286j1921p786m863m259l363r17P95Q13J755N045Q477J0588J2750
58423H84305J5014J4763J1730R376R002P410K813j902m377o264q934j0548j0204
58410I12184j0246j1745j2278j0749r682j0266j0059q087p092q133q169n780l850
58397G96048l819k744P83L378K910K345L996N339M195K898L534M090K932K145
58383H28030K958K961J233Q92L135M374K858K266M844O978N850M599O253Q326
58369H85557Q115P828R631J1086J0339J0359J3219J5608J4932J4309J6532J8626
58357A036141J7501J5447J4849J3143Q420M398M101M131R54k604k866j925k851
$$ plain form
58449 953109 969318 982532 992485 997008 994024 984872 972564 958045 941059 923169 906607 891477
58437 891477 877191 865270 857484 852621 848362 844999 844082 844877 845690 847445 852490 860967 871555 884305
58423 884305 899319 914082 925812 935188 944190 951600 954413 952511 948134 941870 932936 922388 912184
58410 912184 901938 890193 877915 867166 857484 847218 837159 829072 821980 813847 805678 799898 796048
58397 796048 792229 789485 790268 793646 796556 798901 802897 808236 812431 815329 818863 822953 825885 828030
58383 828030 830988 833949 835182 836074 839209 843583 846441 848707 853551 860529 866379 870978 877231 885557
58369 885557 893672 901500 911131 922217 932556 942915 956134 971742 986674 1000983 1017515 1036141
58357 1036141 1053642 1069089 1083938 1097081 1105501 1109899 1114000 1118131 1119085 1116481 1113615 1111690 1108839
58344A108839l545j354J341J929K757N957Q473P980Q026J1496J4781J4515J4157
58331A195352J7378K0892K0557J8793J9080J8913J5178J0845R324P889L662J73
58319A358036Q20J875n31k745n12K723K427J598M411P578O663M997P347J0653
58305A405340J0062Q473J0882J4781J5460J5227J8159K1160J9702J6990J8083
58294A574319K0463J9712J8647K1330K4074K2249J9802K1933K4799K2930K0232
58283A810490K2700K6736K6110K3943K6104K9293K7840K5760K9466L4823L4470
58272B117735L1789L4285L9305L9856L8601M2223M7716M8383M7599N2340N8943
58261B598775N9823N8342O2085O7490O6550O2671O4123O7795O5665O1291O3287
$$ plain form
58344 1108839 1105294 1103940 1105281 1107210 1109967 1115924 1124397 1132377 1140403 1151899 1166680 1181195 1195352
58331 1195352 1212730 1233622 1254179 1272972 1292052 1310965 1326143 1336988 1346312 1354201 1357863 1358036
58319 1358036 1358856 1360731 1360200 1357455 1356943 1359666 1362093 1363691 1368102 1375680 1382343 1387340 1394687 1405340
58305 1405340 1415402 1423875 1434757 1449538 1464998 1480225 1498384 1519544 1539246 1556236 1574319
58294 1574319 1594782 1614494 1633141 1654471 1678545 1700794 1720596 1742529 1767328 1790258 1810490
58283 1810490 1833190 1859926 1886036 1909979 1936083 1965376 1993216 2018976 2048442 2083265 2117735
58272 2117735 2149524 2183809 2223114 2262970 2301571 2343794 2391510 2439893 2487492 2539832 2598775
58261 2598775 2658598 2716940 2779025 2846515 2913065 2975736 3039859 3107654 3173319 3234610 3297897
58250C297897O8509O8634O7133P2365Q0255Q1831Q1359Q8493R9155J03325J04772
58239D213728J13317J24733J29069J31283J42165J56503J62893J67042J81545
58230E522278K00770K11083K17795K35414K59323K74940K86875L09951L39513
58221G857942L61180L81611M17362M61761M96946N29941N80867O44587P02491
58212A2434688P62625Q46878R48488J046943J154771J301558J482358J674611
58204B1652920J895090K182965K538685K943499L426949M044179M800913N682686
58196D9167886O745390Q088595R762636J1814244J4401167J7733726K1952740
58189A39666384K7229270L3788994M1227040M7495744M9121229M3331436L0380551
$$ plain form
58250 3297897 3366406 3435040 3502173 3574538 3654793 3736624 3817983 3906476 4005631 4108956 4213728
58239 4213728 4327045 4451778 4580847 4712130 4854295 5010798 5173691 5340733 5522278
58230 5522278 5723048 5934131 6151926 6387340 6646663 6921603 7208478 7518429 7857942
58221 7857942 8219122 8600733 9018095 9479856 9976802 10506743 11087610 11732197 12434688
58212 12434688 13197313 14044191 14992679 16039622 17194393 18495951 19978309 21652920
58204 21652920 23548010 25730975 28269660 31213159 34640108 38684287 43485200 49167886
58196 49167886 55913276 64001871 73764507 85578751 99979918 117713644 139666384
58189 139666384 166895654 200684648 241911688 289407432 338528661 381860097 412240648
58182D12240648J3642753k668571j5831330k5072910l0607027l2848134l2396424
58175B86459005l0185449k7277222k4481736k2152776k0240315j8507049j6776557
58168A26837901j5044639j3389367j1840672j0384859r041135p852256o817012
58161E2467961n897862n085172m396622l822448l325937k893464k535338k241284
58153B2269834j981052j746840j552930j395106j249970j113149j000456r11457
58145A1318874q27010p42981o73028o17401n60599n00951m52556m16483l78338
58136F149527l35850l01949k78981k55632k30859k15859k10457k01353j85877
58127C932710j74877j70240j61637j47508j37894j34280j27025j14902j07340
$$ plain form
58182 412240648 425883401 423214830 407383500 382310590 351703563 318855429 286459005
58175 286459005 256273556 228996334 204514598 182361822 162121507 143614458 126837901
58168 126837901 111793262 98403895 86563223 76178364 67137229 59284973 52467961
58161 52467961 46570099 41484927 37088305 33265857 29939920 27046456 24511118 22269834
58153 22269834 20288782 18541942 16989012 15593906 14343936 13230787 12230331 11318874
58145 11318874 10491864 9748883 9075855 8458454 7897855 7396904 6944348 6527865 6149527
58136 6149527 5813677 5511728 5232747 4977115 4746256 4530397 4319940 4118587 3932710
58127 3932710 3757833 3587593 3425956 3278448 3140554 3006274 2879249 2764347 2657007
58118B657007j05282r9159q7952q1345q0726p6562o7049o1293o1443n9144n2447
58107A824605m9180n0658m8752m2162l9367m2248m2490l7618l5225l7763l8062
58096A361080l3701l1528l3980l4594l0851k8438k9105k7175k1548j8721k0477
58085A050962k0660j7371j6348j9153j9952j7159j6525j9498k0198j7120j6288
58074H50690j9443k0462j7054j4773j5903j5358j1395r566j2017j3253j0518q401
58062F82547r211q635m964l053n161p048o776q241j2318j3807j1041r389j1376
58049E71527j2264r340o779p242p211m762l636n487o223m041l110n316o335l863
58035D85918j900k926l563k017k022n257p505o480o065q527j0067q412p379r356
$$ plain form
58118 2657007 2551725 2452566 2364614 2283269 2202543 2125981 2058932 1997639 1936196 1877052 1824605
58107 1824605 1775425 1724767 1676015 1633853 1594486 1552238 1509748 1472130 1436905 1399142 1361080
58096 1361080 1327379 1295851 1261871 1227277 1196426 1167988 1138883 1111708 1090160 1071439 1050962
58085 1050962 1030302 1012931 996583 977430 957478 940319 923794 904296 884098 866978 850690
58074 850690 831247 810785 793731 778958 763055 747697 736302 726736 714719 701466 690948 682547
58062 682547 673336 664701 659737 656684 651523 644475 637699 629458 617140 603333 592292 582903 571527
58049 571527 559263 549923 543144 535902 528691 523929 520293 514806 508583 504542 501432 496116 489781 485918
58035 485918 484018 481092 477529 475512 473490 468233 460728 454248 448183 439656 429589 421177 413798 404442
58021D04442j0439p870n362o133p220n575l607l876m198k670j780l118l693j784
58007C37117p27k655m159k488m67r54j915j222r19k381k669l2K200J492O75K320
57991C23216L877K787J378K033K442L07j923j571o57j749l181k797k244l290l923
57976C14705k312p11j232j847n23O88k40j206j46Q41l29j379J35K050J461j97
57960C09758k09N95K86j09Q55J525J32j703k108k491m346n763m823l305l293l343
57944B81658j647Q6j84q99J51J845K354K702M191N305M803M815P171R675R750
57929C31776Q775Q976R031O789L622K062J584M56o60o21q55k790m750m795m256
57914C54344m955n591m447l045l390m092k955r66j00M31J971K998J672m09p67
$$ plain form
58021 404442 394003 386133 380771 374638 367418 361843 358236 354360 350162 347492 345712 342594 338901 337117
58007 337117 336390 333735 329576 327088 326621 325667 323752 322530 321611 319230 316561 316529 318729 320221 320896 323216
57991 323216 327093 329880 331258 333291 335733 336040 334117 332546 331889 330140 326959 324162 321918 318628 314705
57976 314705 312393 311682 310450 308603 308080 308768 308528 307322 307176 308017 307688 306309 306444 308494 309955 309758
57960 309758 309549 310144 310430 310321 311176 312701 312833 311130 309022 306531 302185 296422 291599 288294 285001 281658
57944 281658 280011 280097 279913 279014 279165 281010 283364 286066 290257 295562 300365 305180 312351 322026 331776
57929 331776 340551 349527 358558 365347 368969 371031 372615 373071 372411 371790 370935 368145 363395 358600 354344
57914 354344 349389 343798 339351 336306 332916 328824 325869 324903 324803 325234 327205 330203 331875 331466 330699
57899C30699j68n03r11K47J644J100n14j117j203k178k950j870k50l53j614k205
57883C17854k407l101l013j046P22j4j903k524k603l977n541n273m311m787n524
57868B72552m168j917j718l052k898r01O49J142J939L015L112K738L476M908N449
57853B84326N485O458P734P653O795O945P670P197N764M893M253K473J55j077
57839C56724j640k981m443m340l259l119l866m106m026m571m851l598k157k674
57825C07093m280m468l280k743k956k338j064q02j471j496q38o98q46k80K50n32
57809B79251j531q90L85j86k397l997m731o022p331o683m590l625m148m068k840
57794B26597k124k245j553K69J470J342J128J473J661J646K183K877K653K174
$$ plain form
57899 330699 330531 330028 329117 329364 331008 332108 331594 330477 329274 327096 324146 322276 322026 321673 320059 317854
57883 317854 315447 312346 309333 308287 309009 308995 307092 304568 301965 297988 292447 287174 282863 278076 272552
57868 272552 268384 266467 264749 261697 258799 257898 258547 259689 261628 264643 267755 270493 273969 278877 284326
57853 284326 289811 296269 304003 311656 318451 325396 333066 340263 346027 350920 355173 357646 357801 356724
57839 356724 355084 352103 347660 343320 340061 336942 333076 328970 324944 320373 315522 311924 309767 307093
57825 307093 302813 298345 295065 292322 289366 287028 285964 285162 283691 282195 281357 280659 279813 279533 279783 279251
57809 279251 277720 276830 277215 277029 274632 270635 265904 259882 252551 245868 241278 237653 233505 229437 226597
57794 226597 224473 222228 220675 220944 222414 223756 224884 226357 228018 229664 231847 234724 237377 239551
57780B39551L091N023O038N896O100O865P028O759P400Q549Q353O822N892N972
57766C29339N370L417J368j44j835l625m441m504n263o693p129o103n008m661
57752B90088m435m005l735l333k208j009o92m64R87K721K710J316Q17J727K424
57737B82909K270K239K466K064J351J535K155J639L58K92J677K824L230L933M769
57722C15711M303K727J826J798J066n47j424j240j506k637l341l289l550m134
57708C05763l981l583m620o620p180n908n002n389n462m384l473l470l403l009
57694B40279l323m119l746k291j853k787k847j117M05L51J2M63O00k79o79O19
57678B19688K595L995N211O860Q649J0671J3766J7758K1573K5704L2126M1211
$$ plain form
57780 239551 242642 247665 253703 259599 265699 272564 279592 286351 293751 302300 310653 317475 323367 329339
57766 329339 334709 338126 339494 339350 337515 333890 329449 324945 319682 312989 305860 299757 294749 290088
57752 290088 285653 281648 277913 274580 272372 271363 270671 270207 271194 273915 276625 277941 278758 280485 282909
57737 282909 285179 287418 289884 291948 293299 294834 296989 298628 298986 299278 300955 303779 307009 310942 315711
57722 315711 320014 322741 324567 326365 327431 326884 325460 324220 322714 320077 316736 313447 309897 305763
57708 305763 301782 298199 293579 286959 279779 273871 268869 263480 258018 253634 250161 246691 243288 240279
57694 240279 236956 232837 229091 226800 224947 222160 219313 218196 218601 218952 218964 219427 220027 219748 219069 219688
57678 219688 222283 226278 231489 238349 246998 257669 271435 289193 310766 336470 368596 409807
57666D09807N1524O3054P6813Q9746R3732Q2456N7419K5779n372l1238m9197n9368
57654H05155o4051o4915o2058n6379n0359m5173l9506l2638k6304k1952j8598
57643C23222j5086j2155j0538r169p142n388m703m107k832j814j657j179K34J026
57629B48712J02j005o33K91J31o35n98J3M3n99j374k369l548m054l630l377l858
57612B23612l972l003k007j842j640p70l64j202j919j147J64M56j0j90k55p48
57596B05163j072o56l21r32j868k312k674l360l594k961k581l210l787l322k671
57581A69842k758k708j546k08l1o55j151j749k736l091k148j224j732k990l587
57566A41528l582l633l342k329j551j751j896r23K63M18Q1K63M62q5n69p4N19
$$ plain form
57666 409807 461331 524385 601198 690944 784676 867132 924551 950330 944958 913720 864523 805155
57654 805155 741104 676189 614131 557752 507393 462220 422714 390076 363772 341820 323222
57643 323222 308136 295981 285443 276274 269132 263744 259041 254934 252102 250288 248631 247452 247686 248712
57629 248712 248814 247809 247176 247467 247598 246963 246365 246378 246421 245822 244448 242079 238531 234477 230847 227470 223612
57612 223612 219640 216637 214630 212788 211148 210378 210014 208812 206893 205746 205910 206366 206356 206166 205911 205163
57596 205163 204091 203435 203114 202182 200314 198002 195328 191968 188374 185413 182832 179622 175835 172513 169842
57581 169842 167084 164376 162830 162622 162591 161936 160785 159036 156300 153209 151061 149837 148105 145115 141528
57566 141528 137946 134313 130971 128642 127091 125340 123444 122521 122784 123202 123283 123546 124008 123923 123354 123280 123799
57549A23799J46k79N53J900K322K252K863L604L152J961J390J254N58j17N50J952
57533A47860K158P90p43j542j817j615r12n25j168k038j978j410j334j232pJ686
57517A36173K199J553J231J695K047J968K024K201J907J396J497K042K049J358
57503A61340O79K90m0j53R9J5j050k408k934k721k581k534k194j998k563l359
57487A37888l387k672j856j024k00j30j155k188k175j678j586j381m00M35k5r96
57471A17470j040n46r02j935k313j886j572j429q63k71n02j108j019m88m96p64
57455A00336l34M33M90K26Q46J942J878M43q74j163q16k21N09P21n2q11l53P13
57437A03913R52O38J113K103J953M97n91m69k3O1K37P80J241J454J661J602Q36
$$ plain form
57549 123799 123945 123666 124219 126119 128441 130693 133556 137160 140312 142273 143663 144917 145475 145358 145908 147860
57533 147860 150018 150808 150065 148523 146706 145091 144179 143654 142486 140448 138470 137060 135726 134494 134487 136173
57517 136173 138372 139925 141156 142851 144898 146866 148890 151091 152998 154394 155891 157933 159982 161340
57503 161340 162019 162309 162269 162116 162215 162230 161180 158772 155838 153117 150536 148002 145808 143810 141247 137888
57487 137888 134501 131829 129973 128949 128749 128619 127464 125276 123101 121423 119837 118456 118056 118491 118466 117470
57471 117470 116430 115884 114982 113047 110734 108848 107276 105847 104984 104713 104211 103103 102084 101596 101100 100336
57455 100336 100002 100435 100925 101151 101997 103939 105817 106260 105386 104223 103407 103186 103695 104416 104364 103553 103200 103913
57437 103913 104865 105503 106616 108719 110672 111169 110578 110109 110086 110147 110384 111164 112405 113859 115520 117122 117958
57420A17958j90p64j180j900k108r40M91L76r16j398n70K22L35M94R57J129J127
57403A13123J612K046J171o72j721j398q02n48j37M15L92J3L53J378J890J548
57387A18663J178J086Q95R61J939L078L048K307K472L461L659K905K709L269L019
57372A54649J574N03M13j56j965l562l649k899k368j903j209p40o16k15M20L25
57356A38602n89j129p52k43mN53J402J561Q75M09M61J68n06l62P81J503J154Q33
57338A44717J205J339N76k87n89p33p40J52J624K000Q11k64j5O37N98L14L75K49
57320A51969l69o36j52J56k03k29P14J644J650J258J058N94k97o73j42K44j14
57303A56472k33N41J188Q31L08N90J160J260J310J770K023J643J408J843K171
$$ plain form
57420 117958 117768 117004 115824 113924 111816 110876 111367 111743 110827 109429 108859 109081 109416 109910 110867 111996 113123
57403 113123 114735 116781 117952 117280 115559 114161 113359 112811 112674 113089 113481 113494 113847 115225 117115 118663
57387 118663 119841 120927 121822 122783 124722 127800 130848 133155 135627 139088 142747 145652 148361 151630 154649
57372 154649 156223 156726 157139 156983 155018 151456 147807 144908 142540 140637 139428 138688 138072 137857 138277 138602
57356 138602 138013 136884 136132 135889 135885 136438 137840 139401 140276 140685 141146 141314 140808 140446 141227 142730 143884 144717
57338 144717 145922 147261 147837 147550 146961 146228 145488 145640 147264 149264 150075 149811 149796 150433 151031 151345 151720 151969
57320 151969 151600 150964 150812 150968 150765 150536 151250 152894 154544 155802 156860 157454 157157 156484 156342 156586 156472
57303 156472 156239 156780 157968 158799 159107 159697 160857 162117 163427 165197 167220 168863 170271 172114 174285
57288A74285J913J924K652K964K115J315J727K510K412J949K184K603K125J180
57274B03858R96J559J964K040K127J950J212O28R84J718J812J495J745K589L166
57259B29843L108K828K680K735K994L238L080K634K501K716K602K029J880K697
57245B67565L797M303M064L249K126J573K472M178M932M246L409L296L297L049
57231C15556L306M369N307N634O070O810O846N932N394N951O518O326O341P387
57217C97747Q625R224R755J0633J0939J0206R589R836R934R255R127J0542J2130
57204E27542J2257J1538J1341J1529J1552J2207J4119J5967J6336J6125J7023
57193F77536J8762K0012K0833K2160K3757K4777K5570K6992K8678K9739L0483
$$ plain form
57288 174285 176198 178122 180774 183738 185853 187168 188895 191405 193817 195766 197950 200553 202678 203858
57274 203858 204854 206413 208377 210417 212544 214494 215706 216334 217318 219036 220848 222343 224088 226677 229843
57259 229843 232951 235779 238459 241194 244188 247426 250506 253140 255641 258357 260959 262988 264868 267565
57245 267565 271362 275665 279729 282978 285104 286677 289149 293327 298259 302505 305914 309210 312507 315556
57231 315556 318862 323231 328538 334172 340242 347052 353898 359830 365224 371175 377693 384019 390360 397747
57217 397747 406372 415596 425351 435984 446923 457129 466718 476554 486488 495743 504870 515412 527542
57204 527542 539799 551337 562678 574207 585759 597966 612085 628052 644388 660513 677536
57193 677536 696298 716310 737143 759303 783060 807837 833407 860399 889077 918816 949299
57182I49299L1758L3336L4454L5116L5472L4986L3691L3093L4249L6151L7504
57171A329109L8835M1112M3721M5655M7420M9782N1857N2522N2565N3335N4364
57160A860277N4468N4150N4699N5758N5913N5037N4061N3153N1987N1081N1006
57149B451590N0977M9965M8503M7696M7286M6345M4959M3659M2199M0510L9709
57138B953398M0462M1535M1612M1374M2069M3425M4728M6555M9555N2852N5566
57127C453131N8428O2078O5352O7220O8874P1830P5690P9637Q4270Q9908R5160
57116D271578R9571J05541J15210J27556J40963J56391J75256J96708K19865K46413
57106E855052K78141L14666L56708M08843M75912N59914O63851P95087R60932
$$ plain form
57182 949299 981057 1014393 1048847 1083963 1119435 1154421 1188112 1221205 1255454 1291605 1329109
57171 1329109 1367944 1409056 1452777 1498432 1545852 1595634 1647491 1700013 1752578 1805913 1860277
57160 1860277 1914745 1968895 2023594 2079352 2135265 2190302 2244363 2297516 2349503 2400584 2451590
57149 2451590 2502567 2552532 2601035 2648731 2696017 2742362 2787321 2830980 2873179 2913689 2953398
57138 2953398 2993860 3035395 3077007 3118381 3160450 3203875 3248603 3295158 3344713 3397565 3453131
57127 3453131 3511559 3573637 3638989 3706209 3775083 3846913 3922603 4002240 4086510 4176418 4271578
57116 4271578 4371149 4476690 4591900 4719456 4860419 5016810 5192066 5388774 5608639 5855052
57106 5855052 6133193 6447859 6804567 7213410 7689322 8249236 8913087 9708174 10669106
57097A0669106J164769J410909J708952K068065K490794K977011L527861M138514
57089C0155981M791528N463234O128868O753380P288254P689344P919723P904899
57081H4095211P496816O540788N024886L158629J277062l46679j611209k558749
57073A03076755l286762l885550m413314m887413n289425n586165n751392n774161
57065F4202573n658831n424689n101950m722252m311864l892668l484215l101408
57057B8504696k752089k438640k160476j914831j698204j508799j346273j208883
57049A3476501j092863r94607r11297q39335p74694p15267o60668o09490n59078
57040F319202n08513m59571m14035l71883l32670k96771k64514k35551k09653
$$ plain form
57097 10669106 11833875 13244784 14953736 17021801 19512595 22489606 26017467 30155981
57089 30155981 34947509 40410743 46539611 53292991 60581245 68270589 76190312 84095211
57081 84095211 91592027 98132815 103157701 106316330 107593392 107246713 105635504 103076755
57073 103076755 99789993 95904443 91491129 86603716 81314291 75728126 69976734 64202573
57065 64202573 58543742 53119053 48017103 43294851 38982987 35090319 31606104 28504696
57057 28504696 25752607 23313967 21153491 19238660 17540456 16031657 14685384 13476501
57049 13476501 12383638 11389031 10477734 9638399 8863705 8148438 7487770 6878280 6319202
57040 6319202 5810689 5351118 4937083 4565200 4232530 3935759 3671245 3435694 3226041
57031C226041j86927j66874j48435j31113j14965r9486q3770o7695n1525l4320
57021B140931j4375P792K7503L7533L2218J1352j8860m9337p3782r0959j01796
57010A908220j06318j04666r9154r2796q6333p8674o9756o1126n3958m8207m3588
56999A063644l9901l6538l2995k9657k7039k4660k1895j9232j7345j5519j2573
56988G86290q797n394k387J331O003J0481J3370J3547J0050L096n103j2016j7095
56975G93376k1199k4294k5381k4430k2676k0899j8931j6823j5042j3350j0853
56964E79498p372l703l44L024O887J1646J7806K5062L1113L2658K7976J8097N619
56951G47967o778j6962k3832k7560k8902k8369k6432k4005k1864j9793j7081j3568
$$ plain form
57031 3226041 3039114 2872240 2723805 2592692 2477727 2378241 2294471 2226776 2175251 2140931
57021 2140931 2126556 2134348 2161851 2199384 2231602 2242954 2224094 2174757 2100975 2010016 1908220
57010 1908220 1801902 1697236 1598082 1505286 1418953 1340279 1270523 1209397 1155439 1107232 1063644
56999 1063644 1023743 987205 954210 924553 897514 872854 850959 831727 814382 798863 786290
56988 786290 777493 772099 769712 771043 777046 787527 800897 814444 824494 827590 822487 810471 793376
56975 793376 772177 747883 722502 698072 675396 654497 635566 618743 603701 590351 579498
56964 579498 572126 568423 568079 571103 577990 589636 607442 632504 663617 696275 724251 742348 747967
56951 747967 741189 724227 700395 672835 643933 615564 589132 565127 543263 523470 506389 492821
56939D92821r622n468j186L056P411J2651J9400K7467L5947M3085M5794M1039
56927G12395K8904J3274j600j4235k4833l2766l7029l8133l7616l6047l3129k9315
56915D69870k5672k2520j9540j6923j5099j3758j2367j1189j0532r629p708n614
56903B99319m780n022m890l925k979k472j831o86P00K180L860N612P432R927J3510
56888C15955J7514K1098K4297K7020K7805K5123J9429J2497N288k003q425j2649
56876D72949j4692j5628j5699j4297j1704r100o785l832K39M754R006J3024J7264
56863D25499K2479K9743L9393M9978N8991O4184O3436N4675L7849J6634l668j9933
56851H39260l1767l9138m1580l9751l5687l0957k5785k0071j3969p378j40P322
$$ plain form
56939 492821 483199 477731 476545 479601 487012 499663 519063 546530 582477 625562 671356 712395
56927 712395 741299 754573 752973 738738 713905 681139 644110 605977 568361 532314 499185 469870
56915 469870 444198 421678 402138 385215 370116 356358 343991 332802 322270 312641 304933 299319
56903 299319 294539 289517 284627 280702 277723 275251 273420 272734 273434 275614 279474 285086 292518 302445 315955
56888 315955 333469 354567 378864 405884 433689 458812 478241 490738 496026 494023 485598 472949
56876 472949 458257 442629 426930 412633 400929 391829 385044 381212 381451 386205 395211 408235 425499
56863 425499 447978 477721 517114 567092 626083 690267 753703 808378 846227 862861 859193 839260
56851 839260 807493 768355 726775 687024 651337 620380 594595 574524 560555 553177 553037 560359
56839E60359J4712K3012L3565M6384O0706P6541R3264J06478J08820R5385O7785
56828A287011L2699k410l2190n4170o8308p5641p7164p4024o8094o1074n3219
56817G53416m4051l4072k4608j6101p773J035J0391K0557L2228M5660N9918P2304
56805H68904P8003P1924N2929K5918j746k5493m4225n7441o4446o6064o4484o0907
56793G12872n5175m7783m0234l3099k5666j7887j0896n160K49O157J2658K0151
56781E16187K9082L7803M2354L9415K8830J3169l953j9035k9879l6531m0323m1920
56769E35199m1159l8518l5208l1788k8024k4166k1027j8665j6346j3841j1590
56758B54867r710q060p000o709o161m462k694k583l689m047l271k776k991k786
$$ plain form
56839 560359 575071 598083 631648 678032 738738 815279 908543 1015021 1123841 1219226 1287011
56828 1287011 1319710 1317300 1285110 1230940 1162632 1086991 1009827 935803 867709 806635 753416
56817 753416 709365 675293 650685 634584 626811 627846 638237 658794 691022 736682 796600 868904
56805 868904 946907 1018831 1071760 1097678 1095932 1070439 1026214 968773 904327 838263 773779 712872
56793 712872 657697 609914 569680 536581 510915 493028 482132 476972 477221 483378 496036 516187
56781 516187 545269 583072 625426 664841 693671 706840 702887 683852 653973 617442 577119 535199
56769 535199 494040 455522 420314 388526 360502 336336 315309 296644 280298 266457 254867
56758 254867 245157 237097 230097 223388 217227 212765 210071 207488 203799 199752 196481 193705 190714 187928
56744A87928j928j632k113j973p54Q1l78j031p27L6L40K24J2l01m04J48O74q5
56726A78117j709k189q46O55Q46K85P2K44N11J058J792K109J994K072K260J838
56710A89109J106J149J783J634O56L92J253J751J179P62J183J227J20q89o85r1
56694B01639j71m15j05P8o31j520j500p43q4J40j42r88j764j464l30K93J38L81
56676A92812J292J599R23P03J626K295J699R33J020J033M9q33k44J148J864J799
56660B09718J583J094J46m50n4N85N93L96P01J262J779K695L981M429L424K038
56644B33920J206L04j170k149j773j119j475k193j980j169r72j398j615j528j573
56629B15316j608j329j095j216j236r40j062j949k581k010q12r8p5m65j204j889
$$ plain form
56744 187928 186000 184368 182255 180282 179528 179609 179231 178200 177473 177509 177849 178073 178085 177784 177380 177528 178202 178117
56726 178117 176408 174219 173373 174028 174874 175159 175231 175475 175986 177044 178836 180945 182939 185011 187271 189109
56710 189109 190215 191364 193147 194781 195437 195829 197082 198833 200012 200774 201957 203184 203304 202415 201730 201639
56694 201639 201468 201053 200948 201026 200395 198875 197375 196632 196548 196688 196546 195558 193794 192330 192000 192293 192431 192812
56676 192812 194104 195703 196626 197329 198955 201250 202949 203882 204902 205935 205984 205151 204907 206055 207919 209718
56660 209718 211301 212395 212541 212091 212037 212622 213215 213611 214312 215574 217353 220048 224029 228458 231882 233920
56644 233920 235126 235430 234260 232111 230338 229219 227744 225551 223571 222402 221430 220032 218417 216889 215316
56629 215316 213708 212379 211284 210068 208832 207892 206830 204881 202300 200290 199478 199380 199305 198840 197636 195747
56613A95747j751j024r27j580j546l24N61L6q01p44m16p53j235j163j005j117
56597A81958o99M37R42J80l93K61Q43J17p57l42M76K94j48N39J716J946J572J722
56579A90664J936J170J22J48Q34Q41L21L37P55P85P50J306J790J383R36J692L116
56562B08886M063M909O537Q284R162J0077J2335J4841J5141J2678Q841M597K91
56549C20642k967m171m156m430m898m626l985l844l676k730k140l312n124n346
56535B65237m203l689l990l464j922j000j176j159n05l29j048j606j439j151r91
56520B37565m62K95N01K54L73P11L43o25j143j106j407k165k533k302k098k085
56504B24116j874j649j861k062j413j97N44N52L16j4l77j95O99J292Q57K44L13
$$ plain form
56613 195747 193996 192972 192045 190465 188919 188595 189156 189192 188391 187647 187231 186478 185243 184080 183075 181958
56597 181958 181259 181696 182638 182818 182425 182686 183529 183646 182889 182547 183023 183317 183169 183708 185424 187370 188942 190664
56579 190664 192600 193770 193892 194040 194874 195715 196036 196373 197128 197913 198663 199969 201759 203142 204078 205770 208886
56562 208886 212949 217858 224395 232679 241841 251918 264253 279094 294235 306913 315754 320351 320642
56549 320642 317675 313504 309348 304918 300020 295394 291409 287565 283889 281159 279019 275707 270583 265237
56535 265237 261034 257345 253355 249891 247969 246969 245793 244634 244129 243800 242752 241146 239707 238556 237565
56520 237565 237103 237398 237899 238153 238526 239237 239580 238955 237812 236706 235299 233134 230601 228299 226201 224116
56504 224116 222242 220593 218732 216670 215257 215060 215604 216156 216472 216458 216081 215886 216585 217877 218734 218978 219291
56487B19291L07n53j223n27N50M51j81L12J602K047J534J214J132N85J31P87J802
56470B29261J679Q48R28J807K004J382J064J129P73K85M36M51q66k578k740j579
56454B34284r04r24l62O82Q97M15N15Q88P5j511j874p19K90M90P47J108O94n8
56436B34733K81J439J737J030P34R95N89l70m16M70P32N0l31r2j18l33J37P94
56418B42061M47j99N01J935J990P54K99R45J068M95O59J314P10p68p94P10J240
56401B53367R5o00N6L76k84k36J045J666Q69M19J160J446M45j33P21J426P71Q
56383B62617L51R60R53J028J694K108J877J827J991J280j60o69M2M11P6M86J756
56366B78628J992P69J27R71J509O65k4O25J424J326J213J718J807R61L92P85J251
$$ plain form
56487 219291 219598 219045 217822 217295 217845 218296 218115 218427 220029 222076 223610 224824 225956 226541 226672 227459 229261
56470 229261 230940 231788 232716 234523 236527 237909 238973 240102 240875 241160 241596 242047 241181 238603 235863 234284
56454 234284 233380 232456 232094 232776 233673 234088 234603 235491 235566 234055 232181 231462 231752 232242 232989 234097 234791 234733
56436 234733 235014 236453 238190 239220 239954 240949 241538 241168 240752 241222 241954 242004 241673 241581 241463 241130 241267 242061
56418 242061 242508 242309 242810 244745 246735 247489 247788 248733 249801 250296 250955 252269 252979 252211 251417 252127 253367
56401 253367 253462 252862 252918 253294 253010 252774 253819 255485 256354 256773 257933 259379 259824 259691 260412 261838 262609 262617
56383 262617 262968 263928 264881 265909 267603 269711 271588 273415 275406 276686 276526 275857 275899 276310 276386 276872 278628
56366 278628 280620 281389 281516 282487 283996 284661 284637 285262 286686 288012 289225 290943 292750 293711 294103 294888 296139
56349B96139J417K024K624J603n28j049O99K095J545P32J141J611J137R47J907
56334C14044K718K540K654L695M066K917K028K782L868L835L455L704L806L073
56320C59185K408K395K117J254J000J600J506K04o95k95K90N43J482K978L257
56305C79229K239K138L534M315L803M210O388P898P234O283O533O456M905L556
56291D48721L655L692K624K037K784L019K010K315N392Q495Q921Q117Q567R699
56277E20048R857R562R838R970R644J0529J3143J5006J4605J4177J5826J7943
56265F70148J8424J8485K0141K2630K4500K6593K9972L3323L5504L8167M3102
56254I80989M9282N5215O1695O9757P8444Q7169R7521J10269J23454J35863J49195
$$ plain form
56349 296139 297556 299580 302204 303807 303279 302230 302929 305024 306569 307301 308442 310053 311190 312137 314044
56334 314044 316762 319302 321956 325651 329717 332634 334662 337444 341312 345147 348602 352306 356112 359185
56320 359185 361593 363988 366105 367359 368359 369959 371465 371669 370974 370679 370969 371512 372994 375972 379229
56305 379229 381468 383606 387140 391455 395258 399468 405856 413754 420988 427271 433804 440260 445165 448721
56291 448721 452376 456068 458692 460729 463513 466532 468542 470857 476249 484744 493665 501782 510349 520048
56277 520048 529905 539467 549305 559275 568919 579448 592591 607597 622202 636379 652205 670148
56265 670148 688572 707057 727198 749828 774328 800921 830893 864216 899720 937887 980989
56254 980989 1030271 1085486 1147181 1216938 1295382 1382551 1480072 1590341 1713795 1849658 1998853
56243A998853J64288J78560J90073K00582K11379K19556K21891K19221K13446
56234C817849K03179J86112J63003J35824J04482O8808L1343n015l9734p2441
56224D593410j00938j24152j43957j61325j74005j80804j84360j86609j85513
56215C151747j79804j72785j67375j61348j51788j40613j31161j22746j13228
56206A810899j03769r6422q9999q2676p5830p1008o6214n9454n2771m8493m4832
56195A019431l9603l4777l2667l1110k7287k3031k1260k0539j8233j5788j5569
56184G39567j5665j3277j0165r330r361p510n318n594o784o006m695n438o256
56171F34168m054q48m29j554o96J110N79j161o65J287J637J287L059N621N779
$$ plain form
56243 1998853 2163141 2341701 2531774 2732356 2943735 3163291 3385182 3604403 3817849
56234 3817849 4021028 4207140 4370143 4505967 4610449 4679257 4710600 4705585 4665851 4593410
56224 4593410 4492472 4368320 4224363 4063038 3889033 3708229 3523869 3337260 3151747
56215 3151747 2971943 2799158 2631783 2470435 2318647 2178034 2046873 1924127 1810899
56206 1810899 1707130 1610708 1520709 1438033 1362203 1291195 1224981 1165527 1112756 1064263 1019431
56195 1019431 979828 945051 912384 881274 853987 830956 809696 789157 770924 755136 739567
56184 739567 723902 710625 700460 691130 681769 674259 668941 663347 656563 650557 645862 640424 634168
56171 634168 630114 629266 628837 627283 626587 627697 628276 627115 626450 627737 629374 630661 633720 639341 645120
56156F45120M766N910Q110Q096P044Q395J0998J1122R609J0407J3530J5801J7123
56143G76031J9760K3100K5281K8099L4169M1311M6178N1013O0084P1700Q0816
56132A257542Q7217R3717R8348R6294Q8146P8884P0082O0460N2372M9683N0188
56121B082933M7643M0543L1956K2306R989k273r615j2742j6299k0977k4584k9283
56109B119597l9494n3656o5865p4626q2376q7903q7536q2703p8146p3686o5733
56098A327873n5540m7712m1845l4111k5733k1191j9478j5845j0918r024r044o195
56086A031237j568k83j448K72M288N312L765M787P801P590M900N382Q528Q552
56072A089115N806O280R987J1006R118J0128J4407J6329J5454J7051K1151K2257
$$ plain form
56156 645120 649886 655796 663906 672002 679046 687441 698439 709561 719170 729577 743107 758908 776031
56143 776031 795791 818891 844172 872271 906440 947751 993929 1044942 1105026 1176726 1257542
56132 1257542 1344759 1438476 1536824 1633118 1721264 1800148 1870230 1930690 1983062 2032745 2082933
56121 2082933 2130576 2171119 2203075 2225381 2235370 2233097 2223482 2210740 2194441 2173464 2148880 2119597
56109 2119597 2080103 2026447 1960582 1885956 1803580 1715677 1628141 1545438 1467292 1393606 1327873
56098 1327873 1272333 1224621 1182776 1148665 1122932 1101741 1082263 1066418 1055500 1046476 1037432 1031237
56086 1031237 1029669 1029386 1027938 1028210 1032498 1037810 1041575 1046362 1054163 1061753 1066653 1072035 1080563 1089115
56072 1089115 1094921 1101201 1111188 1122194 1131312 1141440 1155847 1172176 1187630 1204681 1225832 1248089
56060A248089K0309K0729K3345K2682J9304J9114K1412J9776J4758J3301J5516
56049A458335J4914J1814J3052J8032J8933J5554J5769K0313K1589J8873J9857
56038A647035K5333K7264K4259K4131K8714L0968K9481L0845L5470L6208L3336
56027A973044L5248M2140M4993M2923M4861N1734N4278N1177N1581N6783N7727
56016B506489N3882N5612O4118O8354O5881O7071P4421P8019P6100P9200Q8897
56005C278044R3777R1779R4646J04779J10316J09048J13571J26415J34444J34762
55995D391581J41054J56734J67793J70338J78590J96959K11670K19005K33368
55986F067092K57984K77266K88025L07324L39212L66216L84489M12953M56250
$$ plain form
56060 1248089 1268398 1289127 1312472 1335154 1354458 1373572 1394984 1414760 1429518 1442819 1458335
56049 1458335 1473249 1485063 1498115 1516147 1535080 1550634 1566403 1586716 1608305 1627178 1647035
56038 1647035 1672368 1699632 1723891 1748022 1776736 1807704 1837185 1868030 1903500 1939708 1973044
56027 1973044 2008292 2050432 2095425 2138348 2183209 2234943 2289221 2340398 2391979 2448762 2506489
56016 2506489 2560371 2615983 2680101 2748455 2814336 2881407 2955828 3033847 3109947 3189147 3278044
56005 3278044 3371821 3463600 3558246 3663025 3773341 3882389 3995960 4122375 4256819 4391581
55995 4391581 4532635 4689369 4857162 5027500 5206090 5403049 5614719 5833724 6067092
55986 6067092 6325076 6602342 6890367 7197691 7536903 7903119 8287608 8700561 9156811
55977I156811M95283N26720N72975O39511P03653P60452Q35600R37031J041244
55968A5669280J145250J281185J460049J656308J869916K143953K497476K907238
55960C0630655L382399L984097M742530N639309O707085Q054093R757174J1847620
55952H4744962J4446176J7775698K2009267K7301194L3931052M1823361M9371811
55945B91403521N3067173M9298271L7189463J9605725J198829j4446169k5952327
55938D11364486l3379468l7210304l8082282l6816540l4221695l0885760k7226345
55931A73542092k3596907k0238716j7231309j4584728j2325038j0450578q891458
55924F6223358p576461o486409n602897m865660m223462l675985l227815k847893
$$ plain form
55977 9156811 9652094 10178814 10751789 11391300 12094953 12855405 13691005 14628036 15669280
55968 15669280 16814530 18095715 19555764 21212072 23081988 25225941 27723417 30630655
55960 30630655 34013054 37997151 42739681 48378990 55086075 63140168 72897342 84744962
55952 84744962 99191138 116966836 138976103 166277297 200208349 242031710 291403521
55945 291403521 344470694 393768965 430958428 450564153 451762982 437316813 411364486
55938 411364486 377985018 340774714 302692432 265875892 231654197 200768437 173542092
55931 173542092 149945185 129706469 112475160 97890432 85565394 75114816 66223358
55924 66223358 58646897 52160488 46557591 41691931 37468469 33792484 30564669 27716776
55916B7716776k508121k217198j982961j780714j588881j418977j282240j161188
55908A3776496j040399r32536q48547p72849o92006o18982n65829n19672m67819
55899G317857m20785l89073l61563l27430k96454k78026k61832k38144k16357
55890D528193k05436j96074j79466j64306j58389j52328j37929j24451j20364
55881C089450j16582j03794q9644q3147p8177o7871n9867o1865o6451o4971o2733
55870B234348o6402o9930o6710o2690o4055o4527n7961n1066n0852n1438m5906
55859A582811l9494l8667l8620l3742k9394l1186l3381k9860k5976k7927l0687
55848A223877k8156k5099k7404l0253k7595k3966k5434k7803k5141k1349k2078
$$ plain form
55916 27716776 25208655 22991457 21008496 19227782 17638901 16219924 14937684 13776496
55908 13776496 12736097 11803561 10955014 10182165 9490159 8871177 8305348 7785676 7317857
55899 7317857 6897072 6507999 6146436 5819006 5522552 5244526 4982694 4744550 4528193
55890 4528193 4322757 4126683 3947217 3782911 3624522 3472194 3334265 3209814 3089450
55881 3089450 2972868 2869074 2779430 2696283 2618106 2550235 2490368 2428503 2362052 2297081 2234348
55870 2234348 2167946 2098016 2031306 1968616 1904561 1840034 1782073 1731007 1680155 1628717 1582811
55859 1582811 1543317 1504650 1466030 1432288 1402894 1371708 1338327 1308467 1282491 1254564 1223877
55848 1223877 1195721 1170622 1143218 1112965 1085370 1061404 1035970 1008167 983026 961677 939599
55837I39599k3562k0449j6625j7445j9082j6192j2440j2993j4060j0352n671n771
55825G64957p668o161m177o549j0066r686q290j0576j3394j1846r007j0058j2450
55812F45029j1205q459q561r140o056j969j213j336J661N011M726M084P785J2716
55798F33073J3210J0789J0095R819O152R30j943m006q295j2260j2386j1486j3660
55785F20032j6415j5461j2745j2001j1050o653k466l727p994r396q347q901j0131
55772D94745q391m933l268j820L151J0044J4370J5709J5539J1842K978o494j1148
55759E32324j2606j5308j8136j7563j5431j5744j6848j4537j0164q170q185o942
55747C72690n359o409q425p780n821o140p484o398m243m476n503l445L21J570
$$ plain form
55837 939599 916037 895588 878963 861518 842436 826244 813804 800811 786751 776399 770728 764957
55825 764957 757289 751128 746951 740402 730336 720650 712360 701784 688390 676544 667537 657479 645029
55812 645029 633824 625365 616804 607664 601608 599639 598426 597090 598751 603762 608488 612572 620357 633073
55798 633073 646283 657072 667167 676986 683138 684068 682125 678119 669824 657564 645178 633692 620032
55785 620032 603617 588156 575411 563410 552360 545707 543241 539514 531520 522124 513777 504876 494745
55772 494745 486354 481421 478153 476333 479484 489528 503898 519607 535146 546988 549966 543472 532324
55759 532324 519718 504410 486274 468711 453280 437536 420688 406151 395987 387817 379632 372690
55747 372690 367331 360922 352497 344717 338896 332756 325272 318874 314631 310155 304652 301207 301528 303098
55733C03098Q55J576K849J515r94j094k35k326n950o574m708m482n806n274l411
55718B69039l587n007m027j357p59j673l54K665L473K441L687P305R131Q067O981
55703B96025O423M038J56k248l172n153p659p805o255o297p465o329l141j534
55689B49584j876j182N86M86j174q60J741L264K950L437N092N438M475M806O056
55674B82823M968J514o72n05o08j857k211j469j829l145k845j037m80j207m66
55659B70974J663K090O32N93K742M068L417L090L917L834K354J515J429k44l491
55644B98583n454n473n909p217p143n581n294o813p499o644o608p843p745n644
55630B07716m200m487m366l009k438l213l152j726j217k202k354j113j040k880
$$ plain form
55733 303098 303953 305529 308378 309893 308899 307805 307570 305244 299294 292720 288012 283530 277724 272450 269039
55718 269039 265452 260445 256418 255061 254302 252629 252275 254940 258413 260854 264541 271846 280977 289044 296025
55703 296025 302448 306486 306642 304394 301222 296069 288410 280605 274350 268053 260588 254259 251118 249584
55689 249584 247708 246526 247112 247598 246424 245564 247305 250569 253519 256956 262048 267486 271961 276767 282823
55674 282823 287791 289305 288633 288128 287520 285663 283452 281983 280154 277009 274164 273127 272647 271440 270974
55659 270974 272637 274727 275359 275952 278694 282762 286179 289269 293186 297020 299374 300889 302318 302074 298583
55644 298583 293129 287656 281747 274530 267387 261806 256512 249699 242200 235556 228948 221105 213360 207716
55630 207716 203516 199029 194663 191654 189216 186003 182851 181125 179908 177706 175352 174239 173199 170319
55616A70319l766k104j26K25j2J09m44j794k053q01j21p54p80N54J320O00N7M95
55598A60924L88p74j200k79J18r00j736j517j475k022j776o15k80j014r84K7k
55581A46883j341j658j92R16O73P28J620J437l03j191j8J227J039O80J218J585
55565A53303J162J154J878J880R76R73K138K319Q16k83P1J89q79j639j295j186
55549A61577j684j182M30Q54n28j199K27J772J812J541J949J840P01K20J134J803
55533A71267J553K069L697L979J805m48j009j415k943l869k855j774k496l782
55519A63779l885l510l703l533k377j851l008m065l332k009j786j970j369o75
55505A26706q01r68m48r6l37JJ142J225m06j559p43L14q9p60l20p1j453l053k934
$$ plain form
55616 170319 166553 164449 164323 164548 164536 164645 164201 162407 160354 159553 159432 158678 157898 158452 159772 160372 160429 160924
55598 160924 161312 160538 159338 159059 159177 158277 156541 155024 153549 151527 149751 149136 148856 147842 146858 146885 146883
55581 146883 145542 143884 143692 144608 145281 146009 147629 149066 148763 147572 147554 148781 149820 150500 151718 153303
55565 153303 154465 155619 157497 159377 160353 161326 163464 165783 166599 166316 166387 166576 165697 164058 162763 161577
55549 161577 159893 158711 159141 159995 159467 158268 158495 160267 162079 163620 165569 167409 168110 168330 169464 171267
55533 171267 172820 174889 178586 182565 184370 183922 182913 181498 178555 174686 171831 170057 167561 163779
55519 163779 159894 156384 152681 149148 146771 144920 141912 137847 134515 132506 130720 128750 127381 126706
55505 126706 125905 124937 124489 124393 124056 124057 125199 126424 126018 124459 123716 124030 123941 123181 122861 122790 121337 118284 115350
55486A15350j823j336j004L04J758J907J106M65r1p65o18P26J796J538J061J433
55470A21807J734J103O09J078J188j94j695j591n02R4K36M75K82n98r63k01L16
55453A23178l99j061m06N76N66J25J73J67l18k28R27J621Q02j86p4J06p57j552
55435A23260j078m18r21j693j377o44o44p31P1R21O91K1j35m02j372j857q35M52
55417A13309M25m01p54p77r29n29P10J415P25j28j05k70j400k012r15L85K34l60
55399A08623J33Q42L31n06j05Q93J004N82O49O54j57p42j25M49l20j222o68L88
55381A10703K84l46j69P2p24j238Q6J761J408j24k75Q68J110K82J88J024J138
55364A16048K30k89o2j36n83l15P25J422J428J254P81l40j316j187n52m83n49
$$ plain form
55486 115350 113527 112191 111187 111491 113249 115156 116262 116727 116636 115871 115253 115979 117775 119313 120374 121807
55470 121807 123541 124644 125253 126331 127519 127325 125630 124039 123537 123631 123867 124342 124624 124026 123063 122862 123178
55453 123178 122779 121718 121312 121888 122454 122579 122752 122919 122601 122373 123300 124921 125723 125537 125463 125569 124812 123260
55435 123260 122182 121764 120843 119150 117773 117129 116485 115754 115825 116746 117437 117458 117323 116921 115549 113692 112857 113309
55417 113309 113734 113333 112579 111802 110873 110344 111054 112469 113194 113066 112961 112691 111291 109279 108364 108749 108983 108623
55399 108623 108756 109598 109929 109423 109318 110211 111215 111797 112446 113100 112943 112201 112076 112525 112205 110983 110315 110703
55381 110703 110987 110641 110472 110544 109820 108582 108668 110429 111837 111713 111438 112306 113416 113698 113886 114910 116048
55364 116048 116278 115989 115927 115791 115208 114893 115618 117040 118468 119722 120503 120163 118847 117660 117108 116625 116076
55347A16076P1M81n72k117k135o74N23Q19Q89Q47L92J49P24J115J54j248j465
55330A14029q13n97n11N06J753J674O40K11L75J3n54j89N24K8j302j644q41l84
55312A12918n86l61L28L92o6K17J243J624R70K69o7n09q42l21O80J022O75M45
55294A18031K44n08j256j021l05k28l70M24J627J739R48P70J355J431O96O2k78
55277A23361q91j491j343r35j213j605r96n2k92j301j386n69l15o23p3J251J626
55260A13153O58p1L21R58J112J053Q48L01P2R08J873J476K52m3N17K18j127j850
55242A20629j389r06p80K0J546K298J628N89j24r37j729j547n02M3l31n66j75
55225A17767P6j74l36l17p01j261j123m56k37l08L58J481J678Q85M42O47M28l69
$$ plain form
55347 116076 116147 116628 116056 113939 111804 111130 111653 112472 113361 114208 114600 114749 115473 116588 116742 115494 114029
55330 114029 113216 112619 112108 112614 114367 116041 116681 116892 117267 117280 116726 116537 117061 117089 115787 114143 113302 112918
55312 112918 112332 111971 112299 112691 112625 112842 114085 115709 116679 116948 116881 116372 115530 115209 115889 116911 117586 118031
55294 118031 118275 117767 116511 115490 115185 114957 114587 115011 116638 118377 119325 120095 121450 122881 123577 123639 123361
55277 123361 122470 120979 119636 118701 117488 115883 114887 114835 114543 113242 111856 111287 110972 110349 110276 111527 113153
55260 113153 113811 113740 114061 115019 116131 117184 118032 118333 118405 119313 121186 122662 122914 122871 123388 123606 122479 120629
55242 120629 119240 118334 117554 117574 119120 121418 123046 123635 123511 122574 120845 119298 118796 118839 118508 117942 117767
55225 117767 117843 117669 117333 117016 116315 115054 113931 113475 113238 112930 113288 114769 116447 117332 117774 118421 118849 118480
55207A18480o49k46k52q34q22R2Q55J014J168J232M37p60r41k06q0o66m19Q49
55189A18252J261K2j174q65K15Q47J031R77L24o82q74N6R09Q04J98l48q36r65
55171A19152k78N46L27n49n31M34P85J00k92J41K87k56k72P63J619J411Q69O88
55153A24944N45L80P73J373R51l70r57l85r5p10r37j18M72p7p82p71p13j157j299
55134A21067o90k93o64q34k27J32m93j104p23L4L25N01J030J392J168Q38O35M9
55116A22143p30m82R44J908J341K28j81n6R1M92J100J101M19K05Q16J070M10J7
55098A30836O31J144O43J07N73J231R09R2o4M03P63Q80Q78M67l15o98l92j13k21
55079A37754q3N11P54L90L47R92J326P70J26j01n96j502j549j62J280J484R79
$$ plain form
55207 118480 117831 117585 117333 116499 115677 115769 116624 117638 118806 120038 120475 119715 118774 118568 118488 117822 117403 118252
55189 118252 119513 119535 118361 117496 117711 118558 119589 120566 120890 120208 119334 119390 120299 121103 121301 120953 120117 119152
55171 119152 118874 119420 119747 119198 118667 119101 119886 119986 119694 119835 120122 119866 119594 120357 121976 123387 124256 124944
55153 124944 125489 125869 126642 128015 128966 128596 127639 127254 127159 126449 125512 125394 125866 125789 125007 124236 123523 122366 121067
55134 121067 120377 120084 119420 118586 118359 118491 117998 116894 116171 116205 116530 117031 118061 119453 120621 121459 122094 122143
55116 122143 121413 120931 121875 123783 125124 125352 125171 125115 125206 125698 126798 127899 128318 128523 129339 130409 130819 130836
55098 130836 131467 132611 133254 133361 133934 135165 136074 136166 136102 136505 137268 138148 139026 139493 139178 138480 138088 137975 137754
55079 137754 137671 138182 138936 139326 139673 140665 141991 142761 142887 142786 142190 140688 139139 138977 140257 141741 142720
55062A42720O86L37l24m90K52Q37N00J44O26J116N75m58r37r42r79q48m28l28
55044A42059p16p84l82o40j927k708j781j33P06O53K95l70j141j157n18o21j708
55027A29127j864mK092K426J669J466J570P82n84j345j460j466j077q4M53k52
55011A31449j071o60L35N72L43O56J114P37OP0O67P20L12K42L47J7l04J84J117
54992A36853J634J834K099J916R16Q3K72O37J33n44l26J14l31r64n98l9p77k010
54974A40902j649J95J365J149R83J557J655M47j165k056k150j676o46N22J118
54959A40551J167J319J591J412P97L62J99j06m23k33K91M42J68ll1l50q74j035
54941A45244p08k67K7M1l54p42k06J239K125J487M77P41J987K642K242J736J837
$$ plain form
55062 142720 143406 143743 143419 142929 143181 144018 144518 144662 145288 146404 146979 146521 145584 144642 143663 142815 142387 142059
55044 142059 141343 140559 140177 139537 137610 134902 133121 132988 133694 134347 134642 134272 133131 131974 131456 130835 129127
55027 129127 127263 127259 129351 131777 133446 134912 136482 137264 136680 135335 133875 132409 131332 131248 131701 131449
55011 131449 130378 129718 130053 130625 130968 131624 132738 133475 133481 133551 134218 134938 135250 135492 135839 135856 135552 135736 136853
54992 136853 138487 140321 142420 144336 145252 145335 145607 146244 146377 145833 145507 145621 145290 144326 143728 143689 142912 140902
54974 140902 139253 139448 140813 141962 142945 144502 146157 146604 145439 143383 141233 139557 138911 139433 140551
54959 140551 141718 143037 144628 146040 146837 147199 147398 147292 146869 146636 146927 147369 147537 147534 147503 147153 146279 145244
54941 145244 144536 144269 144296 144337 143983 143241 143035 144274 146399 147886 148363 149104 151091 153733 155975 157711 159548
54924A59548K460L470M620N202M852M432M953O178P297Q277R243R313P484M307
54910B41636J289r36k719m183n176n892o393o130m988m130m535n535n984n964
54896A80360n924n216l247j190o50j253j384p77m66o15l06O82J637K261K683K505
54880A69100J415N11J302L535N519O402O725P004P259P651Q101P622N453K435
54866B40034r6k145m313n967o100n446n656o663o928o088n330n165m865m192l785
54851A67295l652l061k148j960k611k988k516j774j273j024j264k160k789k010
54837A36065l16O68N26L07N57P22N83N65N51j1p80q28l37l61q66p04L30J078Q72
54818A38621K63k87q51j097m79M72O27J48K83J157J548J021N60O58O06J68K54
$$ plain form
54924 159548 162008 165478 170098 175300 180152 184584 189537 195715 203012 211289 220532 229845 237329 241636
54910 241636 242925 241989 239270 235087 229911 224019 217626 211496 206508 202378 197843 192308 186324 180360
54896 180360 174436 169220 165973 164783 164133 162880 161496 160719 160253 159638 159332 160014 161651 163912 166595 169100
54880 169100 170515 171026 172328 175863 181382 187784 194509 201513 208772 216423 224524 232146 237599 240034
54866 240034 239938 237793 233480 227513 221413 215967 210311 203648 196720 190632 185302 180137 175272 171080 167295
54851 167295 163643 160582 158434 156474 153863 150875 148359 146585 145312 144288 143024 140864 138075 136065
54837 136065 135749 136417 136943 137250 137807 138529 139112 139677 140228 140217 139437 138609 138272 137911 137045 136341 136671 137749 138621
54818 138621 138884 138597 137746 136649 136170 136642 137269 137417 137700 138857 140405 141426 141986 142644 143250 143418 143672
54801A43672J176J867J533Q19N69N77K96j62l20K1P35J311R51m26j582j344k90
54784A49403K00M1K64J035J545J616J842K135J787R42M86N89Q01J400K884M428
54768A71398M645L837L587M289N048N869P638R817J0463R033P101N784M495K663
54754B55667P00j321l940o674q023p741p280p416p336o600n997n738m869l225
54740A80207k106k106k143j458p60n62k31L91L34o14j156n64K51O61J423K857
54724A74424L850L883M245N887P797Q770R156R498Q998O905M026J487q24l211
54710B44891m919n299n117n434o151o691p038p130o362m745l364k831k446j776
54696A75588j581k207k556j898j176j304j554j020l23m38j004j208j266j646j866
$$ plain form
54801 143672 144848 146715 148248 149067 149636 150213 150509 150347 150027 150048 150783 152094 153045 152619 151037 149693 149403
54784 149403 149603 149644 149908 150943 152488 154104 155946 158081 159868 160810 161296 161885 162686 164086 166970 171398
54768 171398 176043 179880 183467 187756 192804 198673 206311 216128 226591 235624 242725 248509 253004 255667
54754 255667 256367 255046 251106 244432 236409 228668 221388 213972 206636 200036 194039 188301 183432 180207
54740 180207 178101 175995 173852 172394 171634 171072 170841 171232 171566 170952 169796 169232 169483 170144 171567 174424
54724 174424 178274 182157 186402 192289 200086 208856 218012 227510 236508 243413 247439 248926 248102 244891
54710 244891 239972 234673 229556 224122 217971 211280 204242 197112 190750 186005 182641 179810 177364 175588
54696 175588 174007 171800 169244 167346 166170 164866 163312 162292 161969 161531 160527 159319 158053 156407 154541
54681A54541j421r01r54j073n80J46M95N93N11k53j458j729o35L18N9k64N22J312
54663A49229N26j063j542q23l10l19j8N09K99o19j111p65j89L44J103J782J569
54646A48602M38o78j050o72K13J245J860J786J380R24J76q77j530j321p17k04
54630A49575L87R76P90k12p09R0J081R66K63J48M14J30n50p86o09n29k71N91J371
54611A53116J092J45l52k83k31r2M73P87j1j255j500o81j6J2J7K14J61p2J04N85
54591A52213O33J73j37j01r0q1K98Q20Q31L55j2r1j12M2M98O38j41j191j331o08
54571A52606j34k70l56j18r0m36n31j9O93J143J278J164R29R48J312J356N20n73
54553A59422q25k45K03J90L27Q70J191P85K4l95k05K87N06J94o5O26K078K825
$$ plain form
54681 154541 153120 152219 151265 150192 149612 149758 150253 150846 151357 151104 149646 147917 147282 147600 147659 147395 147917 149229
54663 149229 149755 148692 147150 146327 146017 145698 145680 146189 146488 145869 144758 143993 143804 144148 145251 147033 148602
54646 148602 149040 148362 147312 146640 146853 148098 149958 151744 153124 154048 154224 153347 151817 150496 149779 149575
54630 149575 149962 150938 151728 151516 150807 150897 151978 152944 153207 153355 153769 153899 153349 152563 151954 151425 151154 151745 153116
54611 153116 154208 154353 154001 153718 153487 153395 153868 154655 154644 153389 151889 151208 151192 151204 151221 151435 151596 151524 151628 152213
54591 152213 152846 153019 152882 152781 152691 152610 152908 153728 154559 154914 154902 154811 154699 154741 155239 155877 155736 154545 153214 152606
54571 152606 152472 152202 151846 151728 151638 151202 150671 150652 151345 152488 153766 154930 155859 156807 158119 159475 159995 159422
54553 159422 158597 158352 158555 158745 159072 159942 161133 161918 161942 161547 161342 161629 162135 162329 162264 162890 164968 167793
54535A67793K029P54M74J012J116M83j08k94m69p55q21o89p23q76q53q75j327
54518A65871j917k038j742j435r46L6R42Q91J16k84L5L89L52K19J96J10m8j27
54500A60620l19p94j048m91L82M88k39p51m08L12P40P65N44J75j52k90l40l55
54482A58839j17L04K48m96r49j50J354K191J962J265M45m67r08k36J055J759J600
54465A67699J328J314J203R71J047J321J136M74P2K15M02L53K98J50n82j712k265
54448A73424j822j091p90p52m90J7N11Q67J016Q33L60k05p35j126j122o07O3M02
54430A68753L27L0l13m17J3O57P17J94J55J019J542O20p84r23J61Q18L13m67o58
54411A71757m37j83P5K31Q7o4L26J149J743J776J372O48j09k15M93J010M81l44
$$ plain form
54535 167793 169822 170576 171050 172062 173178 173661 173553 173259 172790 172035 171214 170525 169802 168926 168073 167198 165871
54518 165871 163954 161916 160174 158739 157793 157829 158771 159662 159778 159494 159529 159918 160270 160489 160685 160795 160747 160620
54500 160620 160301 159507 158459 157968 158350 158838 158599 157848 157440 157752 158492 159257 159801 159976 159824 159534 159194 158839
54482 158839 158722 159026 159274 158778 157829 157679 159033 161224 163186 164451 164896 164429 163521 163285 164340 166099 167699
54465 167699 169027 170341 171544 172515 173562 174883 176019 176493 176565 176780 177182 177535 177833 177983 177401 175689 173424
54448 173424 171602 170511 169721 168969 168479 168496 169007 169874 170890 171723 172083 171878 171143 170017 168895 168288 168351 168753
54430 168753 169080 169110 168797 168380 168393 169050 169767 169961 170116 171135 172677 173297 172513 171590 171751 172569 172882 172415 171757
54411 171757 171320 171137 171212 171443 171530 171466 171792 172941 174684 176460 177832 178480 178371 178156 178649 179659 180140 179796
54393A79796j40R46J606J396R71O08m8p88q92m15p6O9N47J073P52k23n94J4N89
54374A85191M32M0m9l4o7J04M22M55K89M80R71J184J228J723K413K345J630J538
54356B00295K500L471L799M182N154N928N574M221K416L13j738k893k897k693
54342B27632l203m158m780m897m775m401l621k547j503q09p96j446k097k061j495
54327A85043j069q83n65j57L0K54Q95J384Q24l54p52r2M48J83k30k48k23k92J32
54308A84328J069J422N64o51j177j172j364j837k138k030j505o36K05N23L53K04
54292A76158L22N68R25J337J240K72q17j002n25l09k12O06J766J950J144O59P19
54275A84801J05j284j701l36J183J229L93jmk31l26K29Q57Q34N47N97N93L9l80
$$ plain form
54393 179796 179656 180602 182208 183604 184575 185183 185135 184347 183455 183040 182964 183033 183580 184653 185405 185182 184588 184602 185191
54374 185191 185623 185663 185614 185580 185513 185617 186039 186494 186783 187263 188234 189418 190646 192369 194782 197127 198757 200295
54356 200295 202795 206266 210065 214247 219401 225329 230903 235124 237540 237853 236115 233222 230325 227632
54342 227632 224429 220271 215491 210594 205819 201418 197797 195250 193747 192938 192142 190696 188599 186538 185043
54327 185043 183974 183091 182526 182369 182399 182653 183548 184932 185756 185402 184650 184558 185006 185189 184959 184711 184488 184196 184328
54308 184328 185397 186819 187383 186732 185555 184383 183019 181182 179044 177014 175509 174873 175078 175601 175954 176158
54292 176158 176480 177048 177973 179310 180550 180822 180005 179003 178478 178169 177957 178563 180329 182279 183423 184082 184801
54275 184801 184906 183622 181921 181585 182768 183997 184390 184389 184385 184154 183828 184057 184914 185748 186295 186892 187485 187524 187144
54256A87144J87J190J415P39O0p7K00P12J241J309P84K73K34K67j02n09l93Q7
54238A94761L70K96k4n09q95p84l67l46p65q22k36K45J72J54N40N39m56j631j822
54219A88420j104l71m3M5M6J39N48J008R49N70P60J485J489K98p68n03M81R79
54201A94428R61R07M89p27k006k319j847j483j290p09J04L33k93j180j570j033
54185A82765L04J524J483J88j066j314q83l36M20J366J835J561J222J132O02n87
54169A90216j360j025n09p49j112p18k4K48N54J307J498K67j171j167k71k28j005
54152A84751j028j6N64j18j248j893j957j474m25O28J001R31J042J030K53o75
54136A81366m77P37J523J271P96P10O59M24L55M23J60k49RR12J443J113N27J56
$$ plain form
54256 187144 187331 188521 189936 190675 190735 190658 190858 191570 192811 194120 194904 195177 195411 195678 195576 195067 194674 194761
54238 194761 195131 195427 195403 194894 193999 193215 192848 192502 191737 190915 190679 190924 191096 191250 191790 192329 191873 190242 188420
54219 188420 187316 186945 186902 186947 186993 187132 187680 188688 189637 190207 190967 192452 193941 194239 193471 192968 193449 194428
54201 194428 195389 196296 196785 196058 194052 191733 189886 188403 187113 186404 186508 186841 186548 185368 183798 182765
54185 182765 183069 184593 186076 186264 185198 183884 183001 182665 183085 184451 186286 187847 189069 190201 190803 190216
54169 190216 188856 187831 187322 186573 185461 184743 184719 184967 185521 186828 188326 188593 187422 186255 185984 185756 184751
54152 184751 183723 183707 184271 184153 182905 181012 179055 177581 177156 177784 178785 179716 180758 181788 182041 181366
54136 181366 180889 181626 183149 184420 185216 185926 186585 187009 187364 187787 187947 187698 187707 188619 190062 191175 191702 191858
54118A91858k28n85k80P39J502J374R23R37J284J403J218J011Q34N81K94J29J37
54101B03131K66M51P46J432K612L527K954P88j367j930j104j75K91N20M34j83
54085B12393o63O9J964L913N310O457P355P301N970L966J986K10j233k019k128
54070B50851k011k057k294k608k761k356j427p52r78j627j782j435j266j306r19
54055B25272m1O09O61N19M97M14K38L53Q94J534K000K377K740L010L191L386L674
54038B51328M304N668P599R189R909J0384J1306J2178J2047J1014R942R074Q027
54025C71969O787N618M290K537J020N64P44M28m17q73q12j037j607j688j316j769
54009C84438l599n595o435o364o480p210q121q633q428p574o539n716m921l845
$$ plain form
54118 191858 191630 191045 190765 191504 193006 194380 195303 196240 197524 198927 200145 201156 201990 202571 202865 202994 203131
54101 203131 203397 203848 204594 206026 208638 212165 215119 215907 214540 212610 211506 211331 211622 212142 212576 212393
54085 212393 211730 211799 213763 217676 222986 229443 236798 244099 250069 254035 256021 256231 254998 252979 250851
54070 250851 248840 246783 244489 241881 239120 236764 235337 234585 233607 231980 230198 228763 227497 226191 225272
54055 225272 225231 225840 226501 227020 227517 227931 228169 228522 229416 230950 232950 235327 238067 241077 244268 247654 251328
54038 251328 255632 261300 268899 278088 287997 298381 309687 321865 333912 344926 354868 363942 371969
54025 371969 378756 384374 388664 391201 392221 392785 393529 393957 393540 392667 391855 390818 389211 387523 386207 384438
54009 384438 380839 375244 368809 362445 355965 348755 340634 332001 323573 315999 309460 303744 298823 294978
53995B94978k863k594k869k999k912l060l324l149k664k502k481j831q24p18j738
53980B58450k496k031j096p29p63n93m09o13q69o66l18n12j229j788j737j174
53964B41427m61RQ9J18N72J304J652J408J107J122J146R03P69J287K401L523M091
53947B62467L928L371L095L439M079M619N275O335P400P978Q598J0280J3031J5867
53933C59762J8311K0598K2331K2167J9318J4434Q654K798k226n340o354o264n929
53920D62260n157l581j629PJ209K212L087L997N339P130Q665R277R079Q600Q140
53905E18635P722P196O114M004J137j473l061l746l967l864l496l246l599m670
53891E13686o078p159p446p265p545q682r953j0568j0780j1179j1468j0970r989
$$ plain form
53995 294978 292115 289521 286652 283653 280741 277681 274357 271208 268544 266042 263561 261730 260906 260188 258450
53980 258450 255954 253923 252827 252098 251335 250742 250333 249720 248851 248185 247867 247355 246126 244338 242601 241427
53964 241427 240966 240975 241064 241182 241754 243058 244710 246118 247225 248347 249493 250396 251165 252452 254853 258376 262467
53947 262467 266395 269766 272861 276300 280379 284998 290273 296608 304008 311986 320584 330864 343895 359762
53933 359762 378073 398671 421002 443169 462487 476921 485575 488373 486147 480807 474453 468189 462260
53920 462260 457103 453522 451893 451900 453109 455321 458408 462405 467744 474874 483539 492816 501895 510495 518635
53905 518635 526357 533553 539667 543671 544808 543335 540274 536528 532561 528697 525201 521955 518356 513686
53891 513686 507608 500449 493003 485738 478193 469511 459558 448990 438210 427031 415563 404593 394604
53878C94604r337q811p557n870n051n296n299m391l615l971m943n502n531n396
53864C14034n051m430l931l829l808l633l548l564l207k490k235k799l278k723
53850B65508j479o59q17j671k567k754j911p41m62j212j769j265l31k7m83j168
53834B46192j732j839j029N19J663J555O29k22q28j443j880j723r75J50J578K957
53818B43572L416K543J213P52J450K476K987K869K514K351K524K854L198L660
53804B78379M219M431M151M240N580P521Q441P940P244P171P069O269N344N038
53790C63037N028M675M179M114M379M403L912K918J499P8p05q27j027j738k671
53775C91254l693n156o926q121q385q377q421p820o328n114n189n855n821n072
$$ plain form
53878 394604 385267 376456 368899 363029 357978 352682 347383 342992 339377 335406 330463 324961 319430 314034
53864 314034 308983 304553 300622 296793 292985 289352 285804 282240 279033 276543 274308 271509 268231 265508
53850 265508 264029 263370 262553 260882 258315 255561 253650 252909 252447 251235 249466 248201 247870 247843 247360 246192
53834 246192 244460 242621 241592 242111 243774 245329 245958 245736 244908 243465 241585 239862 238887 239037 240615 243572
53818 243572 246988 249531 250744 251496 252946 255422 258409 261278 263792 266143 268667 271521 274719 278379
53804 278379 282598 287029 291180 295420 301000 308521 316962 324902 332146 339317 346386 352655 357999 363037
53790 363037 368065 372740 376919 381033 385412 389815 393727 396645 398144 398222 397517 396690 395663 393925 391254
53775 391254 387561 382405 375479 367358 358973 350596 342175 334355 328027 322913 317724 311869 306048 300976
53761C00976m449m175l891l640l662l641l187k629k446k325j678p25j37o7k31
53746B64093n76j087j377j270j312j909k447k080r79K8O19R68J013N62j18n92
53730B53536q45j021r26m23J02K86L57O25R54J225J725K413K559J801R11P39J037
53713B65055J106Q76N75lr29j444q50M00J372J888K288K545K558K757L502M305
53697B86001M561M531M730M877M391L449K654K147J824J831J997J517J75r00p20
53682C23065k0n6n95n01K81P35M78Q1j24l36n31n59o89j127j291o65J45K89J10
53663C18690M20R31Q13L33L80O88J35j243k129j880j118l65M58J089Q73pn35k82
53645C17251J73L80M49M03K16M28J473K548K434J432R53J279J356R41J120K212
$$ plain form
53761 300976 296527 292352 288461 284821 281159 277518 274331 271702 269256 266931 265253 264528 264391 264324 264093
53746 264093 263517 262430 261053 259783 258471 256562 254115 252035 251056 251084 251703 252671 253684 254246 254128 253536
53730 253536 252691 251670 250744 250321 250423 250709 251066 251691 252645 253870 255595 258008 260567 262368 263279 264018 265055
53713 265055 266161 267037 267612 267609 266680 265236 264386 264786 266158 268046 270334 272879 275437 278194 281696 286001
53697 286001 290562 295093 299823 304700 309091 312540 315194 317341 319165 320996 322993 324510 324685 323785 323065
53682 323065 323045 322989 322394 321893 322174 322909 323387 323468 323344 323008 322477 321918 321229 320102 318811 318146 318291 318580 318690
53663 318690 319110 320041 320854 321187 321567 322255 322390 321147 319018 317138 316020 315655 316113 317202 318075 318068 317533 317251
53645 317251 317424 317804 318253 318656 318872 319300 320773 323321 325755 327187 328140 329419 330775 331716 332836 335048
53629C35048K923K415J647J717K099J672N41k06L8R94K079K806K912K576K172
53614C61433J795J536J922L264M642M795M042M042N362O627O620N925N705N952
53600D23662N917N495N173N027M548L329J535j46r49q22o97j357k207k055r67
53585D45486k35m68j005j330j711k065j637n12m6q84j819j637r91j185k005k187
53569D25769j429o43m26n24o69r42j256j313j126r89r39p56m39j72J02N40R17
53552D15705Q02K40j97j24J88K20j76o30o96l20K00O96J303J989K285J929J528
53535D24942J968L240M403M705M265L669L463M057N483P094Q074Q302Q247Q157
53521E00069P964P969Q720J0088J1219J1743J2205J3067J3948J4289J4209J4361
$$ plain form
53629 335048 337971 340386 342033 343750 345849 347521 348062 347856 347894 348888 350967 353773 356685 359261 361433
53614 361433 363228 364764 366686 369950 374592 379387 383429 387471 392833 399460 406080 412005 417710 423662
53600 423662 429579 435074 440247 445274 449822 453151 454686 454540 453591 452769 452072 450715 448508 446453 445486
53585 445486 445251 444783 443778 442448 440737 438672 437035 436523 436477 435593 433774 432137 431146 429961 427956 425769
53569 425769 424340 423697 423271 422747 422078 421136 419880 418567 417441 416452 415513 414757 414318 414146 414248 414788 415705
53552 415705 416507 416747 416550 416426 416614 416834 416658 416028 415332 415012 415212 415908 417211 419200 421485 423414 424942
53535 424942 426910 430150 434553 439258 443523 447192 450655 454712 460195 467289 475363 483665 491912 500069
53521 500069 508033 516002 524722 534810 546029 557772 569977 583044 596992 611281 625490 639851
53509F39851J5264J6876J8513J9205J8843J8741K0259K2883K4752K5082K4829
53498H65098K4737K4150K2515K0725J9848J9536J8813J7823J7439J7642J7544
53487A085870J6953J6658J7029J7305J6752J5791J5462J6114J7130J7869J8458
53476A271391J9334K0241K0209J8722J6514J4655J3223J1496R305P312N859M448
53464A432709K604N67j380l547o271r114j1137j1812j1326j0292r464r419j0222
53451A341896j1512j2990j4548j5917j6663j6708j6450j6241j6122j6116j6290
53440A172339j6440j6187j5562j4909j4104j2504r937p213n293m381m093m032
53428A047684l929l662l349l118k636j407L81J826K459K845L790N437P366R201
$$ plain form
53509 639851 655115 671991 690504 709709 728552 747293 767552 790435 815187 840269 865098
53498 865098 889835 913985 936500 957225 977073 996609 1015422 1033245 1050684 1068326 1085870
53487 1085870 1102823 1119481 1136510 1153815 1170567 1186358 1201820 1217934 1235064 1252933 1271391
53476 1271391 1290725 1310966 1331175 1349897 1366411 1381066 1394289 1405785 1415090 1422402 1428261 1432709
53464 1432709 1435313 1435880 1434500 1430953 1424682 1415568 1404431 1392619 1381293 1371001 1361537 1352118 1341896
53451 1341896 1330384 1317394 1302846 1286929 1270266 1253558 1237108 1220867 1204745 1188629 1172339
53440 1172339 1155899 1139712 1124150 1109241 1095137 1082633 1072696 1065483 1060190 1055809 1051716 1047684
53428 1047684 1043755 1040093 1036744 1033626 1030990 1029583 1029964 1031790 1034249 1037094 1040884 1046321 1053687 1062888
53414A062888J0748J1911J2811J3731J4865J6308J8208K0451K2342K3215K3460
53403A250938K4178K5859K7954K9913L1797L3692L5342L6675L8056L9634M1123
53392A615161M2441M3967M5846M7658M9048N0081N0775N0900N0535N0145M9836
53381B146393M9207M8218M7455M7211M6907M5761M3491M0140L5928L1514K7682
53370B609907K4426K1072J7412J3936J0705P015K472k585q094j4530k1618k7893
53358B632225l2272l5158l7327l8758l9432m0176m1545m2636m2188m0310l8073
53347B204350l5888l3493l1186k9931l0219l1662l3612l5526l6869l7367l7283
53336A831314l6987l6386l5219l3608l1849k9965k7858k5630k3407k1145j9046
$$ plain form
53414 1062888 1073636 1085547 1098358 1112089 1126954 1143262 1161470 1181921 1204263 1227478 1250938
53403 1250938 1275116 1300975 1328929 1358842 1390639 1424331 1459673 1496348 1534404 1574038 1615161
53392 1615161 1657602 1701569 1747415 1795073 1844121 1894202 1944977 1995877 2046412 2096557 2146393
53381 2146393 2195600 2243818 2291273 2338484 2385391 2431152 2474643 2514783 2550711 2582225 2609907
53370 2609907 2634333 2655405 2672817 2686753 2697458 2704473 2706945 2704360 2696266 2681736 2660118 2632225
53358 2632225 2599953 2564795 2527468 2488710 2449278 2409102 2367557 2324921 2282733 2242423 2204350
53347 2204350 2168462 2134969 2103783 2073852 2043633 2011971 1978359 1942833 1905964 1868597 1831314
53336 1831314 1794327 1757941 1722722 1689114 1657265 1627300 1599442 1573812 1550405 1529260 1510214
53325A510214j7638j7140j7162j7410j8109j9265k0156k0163j9607j9216j9184
53314A305164j9204j8967j8224j6854j5220j3898j2684j0672p735n044l586l015
53302A160061k559k084j568m50J542L728N517P311R491J1436J2638J3896J6122
53289A235081J8671K0229K0828K1551K2689K3519K3678K3422K2706K1306J9711
53278A473391J8733J8224J7256J5458J3125J0278O772L241P39o76j880l279m575
53265A566807n897p922j0718j3509j5838j7925j9753k0807k1022k1030k1197k1274
53253A369915k1239k1477k1909k1870k1214k0697k0826k1122k0976k0533k0274
53242A137778k0298k0526k1035k1828k2567k2882k2673k2055k1314k0856k0757
$$ plain form
53325 1510214 1492576 1475436 1458274 1440864 1422755 1403490 1383334 1363171 1343564 1324348 1305164
53314 1305164 1285960 1266993 1248769 1231915 1216695 1202797 1190113 1179441 1171706 1166662 1163076 1160061
53302 1160061 1157502 1155418 1153850 1153400 1154942 1158670 1164187 1171498 1180989 1192425 1205063 1218959 1235081
53289 1235081 1253752 1273981 1294809 1316360 1339049 1362568 1386246 1409668 1432374 1453680 1473391
53278 1473391 1492124 1510348 1527604 1543062 1556187 1566465 1573237 1576478 1577217 1576541 1574661 1571382 1566807
53265 1566807 1560910 1552988 1542270 1528761 1512923 1494998 1475245 1454438 1433416 1412386 1391189 1369915
53253 1369915 1348676 1327199 1305290 1283420 1262206 1241509 1220683 1199561 1178585 1158052 1137778
53242 1137778 1117480 1096954 1075919 1054091 1031524 1008642 985969 963914 942600 921744 900987
53231I00987k0386j9110j7258j5789j4961j4089j2672j1022r601q552q108q693
53219G40746j0192j1756j2791j3595j4677j5901j6818j7366j7735j7808j7262
53208E74845j6161j5014j4176j3404j2188j0504q995q263q051p589o765o335o785
53195D40615p561p905p894p981q004p471o505n718n310n008m773m800m889m638
53181C52158m185m017m055l693k800j963j617j578j596j733k016k270k436k612
53167C15587k721k559k179j788j385r38p05p82o45J03P50K18j287k331k099j304
53151B95935r57j122j228r52l96J14J49m10r26n63N78J440J320O33J25j9m9q8
53133B93584j05p5jNk60o99o66K26J272J395O45J87O45J344J390Q13K63K56R47
$$ plain form
53231 900987 880601 861491 844233 828444 813483 799394 786722 775700 766099 757547 749439 740746
53219 740746 730554 718798 706007 692412 677735 661834 645016 627650 609915 592107 574845
53208 574845 558684 543670 529494 516090 503902 493398 484403 476140 468089 460500 453735 447400 440615
53195 440615 433054 425149 417255 409274 401270 393799 387294 381576 376266 371258 366485 361685 356796 352158
53181 352158 347973 343956 339901 336208 333408 331445 329828 328250 326654 324921 322905 320635 318199 315587
53167 315587 312866 310307 308128 306340 304955 304017 303312 302530 301885 301988 302738 302956 301669 299338 297239 295935
53151 295935 294978 293856 292628 291676 291280 291394 291543 291133 290207 289644 290222 291662 292982 293615 293740 293721 293672 293584
53133 293584 293479 293404 293403 293408 293148 292449 291783 292009 293281 294676 295321 295508 296153 297497 298887 299700 299963 300219 301166
53114C01166K062K820K563J677J267J686K122J862J200O87K49m17j167j678j953
53099C14146k128k135j998k007k244k352k055j536j018m91j01k55r34j460j358
53084B92074r86q67q85p17n22n91o48j94O11J056Q56M89M97Q16R20M06n29j155
53066B90631q44J96J014R21K01l58m39m03o25r60r60n05l4l6l25j85O41J437J384
53047B90751P35N18J148J941K136J797J413J084N89n7n24o22n17m84o62j017j416
53030B96813j602j274m28L43J94r35j919j656n65j00o81j151n79L44N79M46R12
53013B88741J814K085J551J193J566K060J979J383O40p5n78p09p20j018j426j375
52997B97111q43l99k19P3N62Q48Q68J069J557J848J665J233O98%n62n00m5J17
$$ plain form
53114 301166 303228 306048 308611 310288 311555 313241 315363 317225 318425 319112 319361 318944 317777 316099 314146
53099 314146 312018 309883 307885 305878 303634 301282 299227 297691 296673 296182 296081 295826 294892 293432 292074
53084 292074 291088 290221 289336 288619 288097 287506 286858 286664 287275 288331 289187 289676 290173 290989 291909 292315 291786 290631
53066 290631 289787 289983 290997 291918 292119 291761 291322 290919 290294 289334 288374 287869 287835 287799 287474 287289 287930 289367 290751
53047 290751 291486 292004 293152 295093 297229 299026 300439 301523 302112 302055 301531 300909 300392 299908 299246 298229 296813
53030 296813 295211 293937 293509 293852 294046 293111 291192 289536 288971 288871 288190 287039 286460 286804 287383 287829 288741
53013 288741 290555 292640 294191 295384 296950 299010 300989 302372 303012 302937 302359 301650 300930 299912 298486 297111
52997 297111 296268 295869 295650 295723 296285 297133 298001 299070 300627 302475 304140 305373 306071 306071 305509 305009 304964 305081
52979C05081J33Q26K061K504J644Q13J291K433K738J953J013M42o5o77j076j033
52963C20081o43J3R20J846K433K472J877O26r45k081k284j846j501j680k271k824
52947C14193k862k353j865j885j999j418l30J97j78m52J46R40Q43j9o12m61l0
52930C01855K8n77j712k755k868j909p64l33n08n93l44L9N59J278J760J414L36
52913B94906p13j245j426j525j454r99j93O38J113J032N49K4l22n21o12m97j06
52896B88649M99J172J633J502P89K17N09J393J871J544R87P09N25J31l72q85j502
52879B99371j942j548l48O28N46k65j016j428j373m02J488L144L329K278J377
52864C03839J467K192K866L231L327L236L110L026K736J886M76j103k433l254
$$ plain form
52979 305081 305214 306040 308101 310605 312249 313062 314353 316786 319524 321477 322490 322932 322867 322190 321114 320081
52963 320081 319438 319451 320371 322217 324650 327122 328999 329625 328680 326599 324315 322469 320968 319288 317017 314193
52947 314193 311331 308978 307113 305228 303229 301811 301481 301678 301500 301048 301194 302134 302977 302958 302346 301885 301855
52930 301855 301883 301306 299594 296839 293971 292062 291298 290965 290457 289864 289520 289559 290118 291396 293156 294570 294906
52913 294906 294193 292948 291522 289997 288543 287544 287351 287989 289102 290134 290683 290707 290385 289864 289252 288755 288649
52896 288649 289148 290320 291953 293455 294244 294461 294970 296363 298234 299778 300765 301474 301999 302130 301758 300873 299371
52879 299371 297429 295881 295533 296161 296707 296442 295426 293998 292625 292223 293711 296855 300184 302462 303839
52864 303839 305306 307498 310364 313595 316922 320158 323268 326294 329030 330916 331392 330289 327856 324602
52850C24602l519l476l519l773l967l897l735l740l959m304m582m312l050j172
52836B73597J89L61j05k95j10j21o20j313j752j651r72J6Q40J197J145Q48M33
52819B71687N6j79m13p34q00k38O75J347J783K287K439J464j95r29o9J169J434
52802B80784Q85L90J29q5n9K65K20o00j465j579j337j538j945j807j296j167j270
52785B68525o67P75K028K299J869J401J136J011J023J261J770K328K319J315o
52770B88387l03N79J103P6j600k287j904j621j794j710j156q16r45r33m16K03
52754B74863N93Q65Q83K57o70q55L3J032J244R97J125J752K366K601K411J798
52738B91295J001O07R75J681J951J646J409J806K597L058K860K362K007J720J137
$$ plain form
52850 324602 321083 317607 314088 310315 306348 302451 298716 294976 291017 286713 282131 277819 274769 273597
52836 273597 273786 274147 274042 273747 273637 273516 272896 271583 269831 268180 267208 267224 268064 269261 270406 271254 271687
52819 271687 271743 271564 271151 270417 269617 269379 270054 271401 273184 275471 277910 279374 279179 278250 278181 279350 280784
52802 280784 281669 282059 282188 282103 282044 282309 282529 281929 280464 278885 277548 276010 274065 272258 270962 269795 268525
52785 268525 267858 268633 270661 272960 274829 276230 277366 278377 279400 280661 282431 284759 287078 288393 288387
52770 288387 288084 288663 289766 289842 288242 285955 284051 282430 280636 278926 277770 276954 276009 275076 274660 274863
52754 274863 275456 276321 277204 277461 276791 275936 275969 277001 278245 279242 280367 282119 284485 287086 289497 291295
52738 291295 292296 292903 293878 295559 297510 299156 300565 302371 304968 308026 310886 313248 315255 316975 318112
52723C18112K50n50j039j314j412j240r48q71r80r01o66p28j106j176o55j48j93
52706C04435n06o28o69q32q41n57m84r30j258p33L14J050J382J763K100J798P63
52689C06167m25j237j516j284p95n05m56j16O85J179P06k15o79o51n41k27M25
52672C00515O02n19k136k579j572m78k43l68k34q5k79n10m10j59j1K07O87J212
52654B93640J502J614J716J799J827J879K009K118K019J483M91m65p00k38P6k41
52638C10529n65k03M64O29L96M93J046J532J783K189K896L677M546N806P420Q818
52622C51456R200P793M288l65m196n953o230o281o407o251n883n507m765l487
52608C17412k553k745l287k826j491n05j93J58P00Q52O42O84Q93O37R7K3K13k23
$$ plain form
52723 318112 318362 317812 316773 315459 314047 312807 311859 310988 310008 309107 308441 307713 306607 305431 304776 304628 304435
52706 304435 303929 303301 302632 301800 300959 300402 299918 298988 297730 296997 297311 298361 299743 301506 303606 305404 306167
52689 306167 305742 304505 302989 301705 300910 300405 299949 299833 300518 301697 302403 302188 301509 300858 300317 300090 300515
52672 300515 301117 300598 298462 295883 294311 293833 293590 293222 292988 292903 292624 292114 291704 291545 291534 291741 292428 293640
52654 293640 295142 296756 298472 300271 302098 303977 305986 308104 310123 311606 312097 311632 310932 310694 310770 310529
52638 310529 309964 309761 310225 310854 311250 311743 312789 314321 316104 318293 321189 324866 329412 335218 342638 351456
52622 351456 360656 368449 372737 372372 368176 362223 355993 349712 343305 337054 331171 325664 320899 317412
52608 317412 314859 312114 308827 306001 304510 304005 303812 303970 304670 305522 306164 306848 307741 308378 308475 308498 308711 308488
52590C08488j078j126j62O74Q11Q77J173J115O25N07R34J183J186J757K708K560
52574C22232R19n26m02M74O55J89p7m2k8J68O95Q93K26p23j094r90r92j109r99
52555C19469o68k80J98N90M92L6j13O2k27j072j352n22L43J66m71m27J64L73J42
52536C16903J85O55R79P69J52n76j010p57L1O73R23J211J585J363M20j80L82J452
52518C25160K018K142K417K732K639K221J706R12L7J42J784L769M576M286L967
52503C60508L664K501M94j220k059k631l553m579n195n270m938m340l637k842
52489C26903j837q37n22j139j877j781r21J4Q09J618K155J905J080M57L48L79
52473C26754L11L52O50J046J392J623J608J344J238J726K700L611M112M257M225
$$ plain form
52590 308488 307410 306284 306122 306796 307607 308484 309657 310772 311397 311904 312838 314021 315207 316964 319672 322232
52574 322232 323151 322625 322223 322697 323352 323541 323464 323422 323394 323562 324257 325150 325376 324653 323559 322569 321577 320468 319469
52555 319469 318801 318521 318719 319309 319801 319837 319724 319786 319559 318487 317135 316613 316956 317122 316651 316224 316388 316761 316903
52536 316903 317088 317743 318722 319491 319643 319067 318057 317300 317331 318004 318927 320138 321723 323086 323506 323326 323708 325160
52518 325160 327178 329320 331737 334469 337108 339329 341035 341947 341984 342126 343910 347679 352255 356541 360508
52503 360508 364172 366673 367167 365947 363888 361257 357704 353125 347930 342660 337722 333382 329745 326903
52489 326903 325066 324229 323707 322568 320691 318910 317989 318003 318812 320430 322585 324490 325570 326027 326375 326754
52473 326754 327065 327417 328067 329113 330505 332128 333736 335080 336318 338044 340744 344355 348467 352724 356949
52458C56949M082L750L025J863O49j95q54j791k852l365l334l527m174m496l995
52443C41735l218k707k164j378r16j042r47pR49Q15j06p19q01q67q68l16N81J034
52425C29058P74J89m42r44q47N0J023J261J033J153J582J668J431J539K136K673
52409C43337K909L127L477L883M533N669P066Q433J0042J2104J3853J4076J2325
52396D44834Q881M064j326n538p266p321p565q316q248o837n281m641m524m164
52382C86752l571k905j813k09J099J341Q68O22R72J593K177K752L552M764O247
52367D04241P388P528O632N241L810K412J040k32j357k194k374j753p91o4M15
52352D29942Q56J015O23K23O88J821K441J984J265J263J843K150J878J616K055
$$ plain form
52458 356949 361031 364781 367806 369669 370318 370123 369269 367478 364626 361261 357927 354400 350226 345730 341735
52443 341735 338517 335810 333646 332268 331352 330310 329363 329356 330305 331120 331014 330295 329494 328627 327759 327443 328024 329058
52425 329058 329832 330021 329579 328635 327788 327838 328861 330122 331155 332308 333890 335558 336989 338528 340664 343337
52409 343337 346246 349373 352850 356733 361266 366935 374001 382434 392476 404580 418433 432509 444834
52396 444834 453715 457779 456453 450915 443649 436328 428763 420447 412199 405362 400081 395440 390916 386752
52382 386752 383181 380276 378463 378254 379353 380694 381562 382184 383156 384749 386926 389678 393230 397994 404241
52367 404241 411629 419157 425789 431030 434840 437252 438292 438060 436703 434509 432135 430382 429591 429527 429942
52352 429942 430798 431813 432436 432659 433347 435168 437609 439593 440858 442121 443964 446114 447992 449608 451663
52337D51663L172M292M929N331N996O818P340P755Q800J0409J1470J1537J1760
52324E51272J3268J5477J7088J8011J9089K0431K1341K1595K1582K1356K0718
52313G61228K0032J9907K0229K0570K1197K2507K3867K4327K4254K4732K5579
52302A008429K5567K4608K3934K3924K3504K2235K1122K0678J9758J7351J4135
52291A245245J1186Q316M880J254j720l984n980p605q489q840r136r289q892p989
52277A198957p003o165n478m891m093k624n59J448L132N035P454R714J1040J1649
52263A217616J2293J3252J4349J5457J6348J6544J6098J6032J7187J8987K0120
52252A394283K0266K0283K0726K1030K0389J8772J6698J4375J1555Q143M675J951
$$ plain form
52337 451663 454835 459127 464056 469387 475383 482201 489541 497296 506096 516505 527975 539512 551272
52324 551272 564540 580017 597105 615116 634205 654636 675977 697572 719154 740510 761228
52313 761228 781260 801167 821396 841966 863163 885670 909537 933864 958118 982850 1008429
52302 1008429 1033996 1058604 1082538 1106462 1129966 1152201 1173323 1194001 1213759 1231110 1245245
52291 1245245 1256431 1264747 1269627 1270881 1269161 1265177 1259197 1251592 1243103 1234263 1225127 1215838 1206946 1198957
52277 1198957 1191954 1185789 1180311 1175420 1171327 1168703 1168144 1169592 1172724 1177759 1185213 1194927 1205967 1217616
52263 1217616 1229909 1243161 1257510 1272967 1289315 1305859 1321957 1337989 1355176 1374163 1394283
52252 1394283 1414549 1434832 1455558 1476588 1496977 1515749 1532447 1546822 1558377 1566520 1571195 1573146
52240A573146K82p58j758k958m341n905p373q075p690o909o715p131p364p116
52226A499335o882o903o741o123n363m634l580k132r74o73q72q77m92J80J244
52211A454513K735M221N289O103P043Q060Q877R533J0249J0907J1092J0624R760
52198A559006Q949Q555Q675R085R513R951J0511J1014J1112J0793J0416J0150
52186A677730R804R178Q146O471M117J648l79k402n358r060j2017j3252j3403
52173A661223j3529j3683j3356j2598j1794j0827r352p630o309n539m900m085
52161A547621l090j797n4J803L049L318K918K261J403K44j063k166k917l509m070
52146A543951m279l666k303r22j24K34N85R13Q87M52j85j007k064l058l559l508
$$ plain form
52240 1573146 1573428 1572670 1570912 1567954 1563613 1557708 1550335 1542260 1534570 1527661 1520946 1513815 1506451 1499335
52226 1499335 1492453 1485550 1478809 1472686 1467323 1462689 1459109 1456977 1456003 1455330 1454458 1453581 1453089 1453269 1454513
52211 1454513 1457248 1461469 1466758 1472861 1479904 1487964 1496841 1506374 1516623 1527530 1538622 1549246 1559006
52198 1559006 1567955 1576510 1585185 1594270 1603783 1613734 1624245 1635259 1646371 1657164 1667580 1677730
52186 1677730 1687534 1696712 1704858 1711329 1715446 1717094 1716715 1714313 1708955 1699895 1687878 1674626 1661223
52173 1661223 1647694 1634011 1620655 1608057 1596263 1585436 1576084 1568454 1562145 1556606 1551706 1547621
52161 1547621 1544531 1542734 1542680 1544483 1547532 1550850 1553768 1556029 1557432 1557676 1556613 1554447 1551530 1548021 1543951
52146 1543951 1539672 1536006 1533703 1532781 1532657 1532891 1533476 1534389 1535276 1535728 1535543 1534536 1532472 1529414 1525855 1522347
52130A522347k946j488J168M356P009R070J1454J4451J7135J8795K0066K2045
52118A643462K4855K7643K9567L0323L0088K9359K8644K8076K7456K6664K5621
$$ plain form
52130 1522347 1519401 1517913 1519081 1523437 1530446 1539516 1550970 1565421 1582556 1601351 1621417 1643462
52118 1643462 1668317 1695960 1725527 1755850 1785938 1815297 1843941 1872017 1899473 1926137 1951758
$$ [...]
##END NTUPLES=NMR SPECTRUM
##END=
