##TITLE=AC1636_CENAH_8493977_dbLFOWS9NT
##JCAMPDX= 6.0         $$ Bruker NMR JCAMP-DX V2.0
##DATA TYPE= NMR SPECTRUM
##DATA CLASS= NTUPLES
##ORIGIN= BRUKER
##OWNER= Administrator
$$ 1.72 TOPSPIN		Version 2.1
$$ 2014-02-18 19:53:30.525 -0800  Administrator@X
$$ Compression mode = diff/dup
##.OBSERVE FREQUENCY= 400.02188249412
##.OBSERVE NUCLEUS= ^1H
##.ACQUISITION MODE= SIMULTANEOUS (DQD)
##.ACQUISITION SCHEME= undefined
##.AVERAGES= 64
##.DIGITISER RES= 22
##SPECTROMETER/DATA SYSTEM= spect
##.PULSE SEQUENCE= noesygpps1d.comp
##.SOLVENT NAME= COFFEE_meoh
##.SHIFT REFERENCE= INTERNAL, COFFEE_meoh, 1, 14.96112
##AUDIT TRAIL= $$ (NUMBER, WHEN, WHO, WHERE, PROCESS, VERSION, WHAT)
$$ ##TITLE= Audit trail, TOPSPIN		Version 2.1
$$ ##JCAMPDX= 5.01
$$ ##ORIGIN= Bruker BioSpin GmbH
$$ ##OWNER= Administrator
$$ $$ E:\/data/COFFEE/nmr/AC1636_CENAH_8493977_dbLFOWS9NT/12/pdata/1/auditp.txt
$$ ##AUDIT TRAIL=  $$ (NUMBER, WHEN, WHO, WHERE, PROCESS, VERSION, WHAT)
(   1,<2014-02-18 19:53:25.822 -0800>,<Administrator>,<X>,<go>,<TOPSPIN 2.1>,
      <created by zg
	started at 2014-02-18 19:41:55.930 -0800,
	POWCHK enabled, PULCHK disabled,
       configuration hash MD5:
       C8 4E 4E 5D D3 5C D8 9E 9F 52 82 E0 59 8A DE 15
       data hash MD5: 64K
       0A 0C B6 6A D5 33 4C FE 5B 8A E1 64 16 D6 0B 28>)
(   2,<2014-02-18 19:53:28.682 -0800>,<Administrator>,<X>,<proc1d>,<TOPSPIN 2.1>,
      <Start of raw data processing
       efp LB = 0.3 FT_mod = 6 PKNL = 1 PHC0 = 0 PHC1 = 0 SI = 128K 
       data hash MD5: 128K
       3A 19 22 F8 93 53 8D 36 DF 0C 4D 55 DF 56 6F 37>)
(   3,<2014-02-18 19:53:29.603 -0800>,<Administrator>,<X>,<proc1d>,<TOPSPIN 2.1>,
      <pk PHC0 = -80.13428 PHC1 = 0 
       data hash MD5: 128K
       44 F4 43 10 87 6A 36 C5 99 E8 72 69 65 AB 0A F2>)
(   4,<2014-02-18 19:53:30.041 -0800>,<Administrator>,<X>,<proc1d>,<TOPSPIN 2.1>,
      <abs ABSG = 1 
       data hash MD5: 128K
       0A 5C E3 04 DF 43 0C 6C 9D 88 66 82 9D 70 F6 BE>)
(   5,<2014-02-18 19:53:30.135 -0800>,<Administrator>,<X>,<proc1d>,<TOPSPIN 2.1>,
      <abs ABSG = 2 
       data hash MD5: 128K
       88 9D 63 27 4B F2 7F E1 8F F3 1D 57 48 42 52 72>)
(   6,<2014-02-18 19:53:30.213 -0800>,<Administrator>,<X>,<proc1d>,<TOPSPIN 2.1>,
      <abs ABSG = 3 
       data hash MD5: 128K
       CE F7 B8 8D 1C F7 12 CA 89 E8 82 FC 2E 2C E5 40>)
(   7,<2014-02-18 19:53:30.291 -0800>,<Administrator>,<X>,<proc1d>,<TOPSPIN 2.1>,
      <abs ABSG = 4 
       data hash MD5: 128K
       62 D9 43 E8 19 3E 11 6B B6 90 B2 93 68 AB 6E AB>)
(   8,<2014-02-18 19:53:30.353 -0800>,<Administrator>,<X>,<proc1d>,<TOPSPIN 2.1>,
      <abs ABSG = 5 
       data hash MD5: 128K
       89 BE 17 1D 46 DA EE 1E B4 AC 60 B5 C7 B2 BD A6>)
$$ ##END=
$$ 
$$ $$ hash MD5
$$ $$ 02 2A 69 5D 2B 27 78 05 EC BE CF 30 43 D0 BB 5E
##$RELAX= 
##$RELAX= 
##$RELAX= 
##$RELAX= 
##$RELAX= 
##$RELAX= 
##$RELAX= 
##$RELAX= 
$$ Bruker specific parameters
$$ --------------------------
##$DU= <E:\>
##$EXPNO= 12
$$ [...]
##$TP07= 0
##$TPNAME0= <>
##$TPNAME1= <>
##$TPNAME2= <>
##$TPNAME3= <>
##$TPNAME4= <>
##$TPNAME5= <>
##$TPNAME6= <>
##$TPNAME7= <>
##$TPOAL= (0..7)
0.5 0.5 0.5 0.5 0.5 0.5 0.5 0.5
##$TPOFFS= (0..7)
0 0 0 0 0 0 0 0
##$TUNHIN= 0
##$TUNHOUT= 0
##$TUNXOUT= 0
##$USERA1= <user>
##$USERA2= <user>
##$USERA3= <user>
##$USERA4= <user>
##$USERA5= <user>
##$V9= 5
##$VALIST= <valist>
##$VCLIST= <CCCCCCCCCCCCCCC>
##$VD= 0
##$VDLIST= <DDDDDDDDDDDDDDD>
##$VPLIST= <PPPPPPPPPPPPPPP>
##$VTLIST= <TTTTTTTTTTTTTTT>
##$WBST= 2048
##$WBSW= 25
##$XGAIN= (0..3)
0 0 0 0
##$XL= 0
##$YL= 0
##$YMAX_a= 6289916
##$YMIN_a= -13687943
##$ZGOPTNS= <>
##$ZL1= 120
##$ZL2= 120
##$ZL3= 120
##$ZL4= 120
##$ABSF1= 14.96112
##$ABSF2= -5.597062
##$ABSG= 5
##$ABSL= 3
##$ALPHA= 0
##$AQORDER= 0
##$ASSFAC= 0
##$ASSFACI= 0
##$ASSFACX= 0
##$ASSWID= 0
##$AUNMP= <proc_prof1d_extract.lims>
##$AXLEFT= 0
##$AXNAME= <>
##$AXNUC= <1H>
##$AXRIGHT= 0
##$AXTYPE= 0
##$AXUNIT= <>
##$AZFE= 0.1
##$AZFW= 0.1
##$BCFW= 0
##$BC_mod= 0
##$BYTORDP= 0
##$COROFFS= 0
##$CY= 15
##$DATMOD= 1
##$DC= 0
##$DFILT= <>
##$DTYPP= 0
##$F1P= 0
##$F2P= 0
##$FCOR= 0.5
##$FTSIZE= 131072
##$FT_mod= 6
##$GAMMA= 0
##$GB= 0
##$INTBC= 1
##$INTSCL= 1
##$ISEN= 128
##$LB= 0.3
##$LEV0= 0
##$LPBIN= 0
##$MAXI= 10000
##$MC2= 0
##$MEAN= 0
##$ME_mod= 0
##$MI= 0
##$NCOEF= 0
##$NC_proc= -2
##$NLEV= 6
##$NOISF1= 0
##$NOISF2= 0
##$NSP= 0
##$NTH_PI= 0
##$NZP= 0
##$OFFSET= 14.96112
##$PC= 1
##$PHC0= -80.13428
##$PHC1= 0
##$PH_mod= 1
##$PKNL= yes
##$PPARMOD= 0
##$PPDIAG= 0
##$PPIPTYP= 0
##$PPMPNUM= 2147483647
##$PPRESOL= 1
##$PSCAL= 4
##$PSIGN= 0
##$PYNMP= <proc.py>
##$REVERSE= no
##$SF= 400.020009589188
##$SI= 131072
##$SIGF1= 0
##$SIGF2= 0
##$SINO= 400
##$SIOLD= 131072
##$SPECTYP= <>
##$SREGLST= <1H.CDCl3>
##$SSB= 0
##$STSI= 131072
##$STSR= 0
##$SW_p= 8223.68421052631
##$SYMM= 0
##$S_DEV= 0
##$TDeff= 65536
##$TDoff= 0
##$TI= <>
##$TILT= no
##$TM1= 0
##$TM2= 0
##$TOPLEV= 0
##$USERP1= <user>
##$USERP2= <user>
##$USERP3= <user>
##$USERP4= <user>
##$USERP5= <user>
##$WDW= 1
##$XDIM= 131072
##$YMAX_p= 405700544
##$YMIN_p= -29104
##$CURPLOT= <Network HP LaserJet P1505>
##$CURPRIN= <$Network HP LaserJet P1505>
##$DFORMAT= <normdp>
##$LAYOUT= <+/1D_H.xwp>
##$LFORMAT= <normlp>
##$PFORMAT= <normpl>
##$SURQMSG= 1
$$ End of Bruker specific parameters
$$ ---------------------------------
##NTUPLES= NMR SPECTRUM
##VAR_NAME=  FREQUENCY,     SPECTRUM/REAL,   SPECTRUM/IMAG
##SYMBOL=    X,             R,               I
##VAR_TYPE=  INDEPENDENT,   DEPENDENT,       DEPENDENT
##VAR_FORM=  AFFN,          ASDF,            ASDF
##VAR_DIM=   131072,        131072,          131072
##UNITS=     HZ,            ARBITRARY UNITS, ARBITRARY UNITS
##FACTOR=    0.0627417313425164, 1,          1
##FIRST=     8223.62146879497, -3874,        -66301
##LAST=      0,             -873,            -67282
##MIN=       0,             -29104,          0
##MAX=       8223.62146879497, 405700544,    0
$$ Real data points
##PAGE= N=1
##DATA TABLE= (X++(R..R)), XYDATA
$$ [...]
63892A029585l3915l1709l0568k9438k8101k7318k7326k7276k6479k5205k3751
63881G18499k1680j8748j5808j3863j2661j1030q436n455k793o01J292L070M994
63868F16780P257R615J1538J2808J3717J4625J5658J6796J7854J8361J7884J6577
63856G89470J5079J3668J2018R934P891O400N159L385Q56j872m312o589q983j1358
63842H30746j3336j4861j6210j7634j9222k1083k3213k5182k6243k6048k5052
63831F02662k4005k3208k2429k1434k0259j8955j7469j5835j4271j2887j1541
63820D00369j0161r018q389q110p778p315o918o529n836m898m229l987l577k514
63806C11110j258o18o30p55r40j619k618l068k696k335k609k972k752k486l132
$$ plain form
63892 1029585 995670 963961 933393 903955 875854 848536 821210 793934 767455 742250 718499
63881 718499 696819 678071 662263 648400 635739 624709 616273 610818 608025 607424 608716 611786 616780
63868 616780 624037 633652 645190 657998 671715 686340 701998 718794 736648 755009 772893 789470
63856 789470 804549 818217 830235 840169 848060 854460 859619 863004 863860 861988 857676 851087 842104 830746
63842 830746 817410 802549 786339 768705 749483 728400 705187 680005 653762 627714 602662
63831 602662 578657 555449 533020 511586 491327 472372 454903 439068 424797 411910 400369
63820 400369 390208 381190 372801 364691 356913 349598 342680 336151 330315 325417 321188 317201 313624 311110
63806 311110 309852 309234 308604 307849 306909 305290 302672 299604 296908 294573 291964 288992 286240 283754 280622
63791B80622m367m809l897k547j843j844k024k089k048j992k089k344k294j510
63777B44925m25J3l15n22j80Nm96r59n16L69N44j12o73o43m79o48r97j263j439
63758B36189j453j066k89M96J002J241J203Q31L62K76P14J303J639J638J410J126
63742B46622J038J260J529J571J617K139L014L547L373K858K435K095J784J767
63728B76649K179K630K625K269K074K302K735L035L107L094L148L188K956K403
63714C14394J936J915K031J619O16l22q06j230j933k459k187j371q85j037j282
63699C08999j119p37n64n99m67O1Q70J704K381K851L116L109K694J880J033O50
63683C25862Q00R53N86j26n39m14k06l08m17m1O13Q72O06M19O61R17P35M02M31
$$ plain form
63791 280622 276255 271446 267549 265002 263159 261315 259291 257202 255154 253162 251073 248729 246435 244925
63777 244925 244500 244513 244198 243676 243496 243501 243005 242046 241530 241899 242443 242331 241658 241015 240536 239888 238891 237628 236189
63758 236189 234736 233670 233381 233877 234879 236120 237323 238154 238516 238792 239506 240809 242448 244086 245496 246622
63742 246622 247660 248920 250449 252020 253637 255776 258790 262337 265710 268568 271003 273098 274882 276649
63728 276649 278828 281458 284083 286352 288426 290728 293463 296498 299605 302699 305847 309035 311991 314394
63714 314394 316330 318245 320276 321895 322511 322189 321383 320153 318220 315761 313574 312203 311318 310281 308999
63699 308999 307880 307143 306579 305980 305513 305574 306444 308148 310529 313380 316496 319605 322299 324179 325212 325862
63683 325862 326662 327615 328201 328075 327536 327122 326916 326608 326191 326150 326763 327635 328241 328660 329321 330238 330973 331375 331806
63664C31806P25P22J79p06j694k558k944k764k573k968l672l805l074k128j675
63649C02871j806k249k763l000k556j439k46M09L88ql18j20O46J504J978K259
63633B95550K873L709M060L737L491L987M920N535N574N360N329N820O943Q358
63619C65246R466J0134J0792J1618J2165J2176J2275J3338J5442J7865J9914K1351
63607E31782K2293K3063K3932K4703K4757K3728K1752J8944J5164J0710O585L562
63595G50975J356o64k437l517m013m500n205o067p346r406j1966j4307j6223j8107
63581F48573k0020k1332k1411k0236j8252j6109j4423j3304j2080j0040p465n350
63569D68551m064k930j305N24J824K366K607L161M257N489O155O088O004O673
$$ plain form
63664 331806 332531 333253 333432 332726 331032 328474 325530 322766 320193 317225 313553 309748 306674 304546 302871
63649 302871 301065 298816 296053 293053 290497 289058 288812 289221 289609 289601 289283 289163 289809 291313 293291 295550
63633 295550 298423 302132 306192 309929 313420 317407 322327 327862 333436 338796 344125 349945 356888 365246
63619 365246 374712 384846 395638 407256 419421 431597 443872 457210 472652 490517 510431 531782
63607 531782 554075 577138 601070 625773 650530 674258 696010 714954 730118 740828 747413 750975
63595 750975 752331 751667 749230 745713 741700 737200 731995 725928 718582 709176 697210 682903 666680 648573
63581 648573 628553 607221 585810 565574 547322 531213 516790 503486 491406 481366 473901 468551
63569 468551 464487 461557 460252 460776 462600 464966 467573 470734 474991 480480 486635 492723 498727 505400
63555E05400P964R243J0526J2375J4743J6873J8536K0473K3129K5831K7747K8956
63543G21796K9839L0031K8748K5743K1251J5416Q669K365j961m096n153o038o679
63530H59931o894p101p761q671r451j0318j1903j4544j8096k2145k5910k8256
63518F88881k8507k7251k5827k4888k3953k2416k0404j8376j6383j4264j2212
63507D54400j0636r566q677p768o810n673m279l020k429k436k455k303k323k552
63493C83473k450j816j263j241j236n90L15N34q9q15j083j036r08o71l64k31k94
63476C70235k42J55Q46J659K313K307J378J4r67j397j792k373k754k772k926l594
63460C60090m327m401l704k663j581m96N03J215J563J655J705J913K322K726K956
$$ plain form
63555 505400 513364 522607 533133 545508 560251 577124 595660 616133 639262 665093 692840 721796
63543 721796 751635 781666 810414 836157 857408 872824 881493 883858 881897 877801 872648 866610 859931
63530 859931 853037 845936 838175 829504 820053 809735 797832 783288 765192 743047 717137 688881
63518 688881 660374 633123 607296 582408 558455 536039 515635 497259 480876 466612 454400
63507 454400 443764 434198 425521 417753 410943 405270 400991 397971 395542 393106 390651 388348 386025 383473
63493 383473 381023 379207 377944 376703 375467 374877 375192 375726 375637 374822 373739 372703 371795 371124 370760 370529 370235
63476 370235 369993 370148 370994 372653 374966 377273 378651 378665 377698 376301 374509 372136 369382 366610 363684 360090
63460 360090 355763 351362 347658 344995 343414 342918 343421 344636 346199 347854 349559 351472 353794 356520 359476
63445C59476L244M023N319O708P905R010J0135J1196J2303J3767J5591J7371J8959
63432D95007K0665K2428K3423K2983K1458J9598J7510J4899J2062R923R091R453
63420F98500J0609J2211J3936J5658J7618K0024K2478K4274K5120K5044K3729
63409I09201K0717J6387J1987Q338N096J723j456l750n238o685q419j0021j1215
63396I26665j2493j4528j7362k0442k3167k5150k6221k6575k6748k7019k6869
63385F80091k5581k3360k1234j9663j7890j5170j2088r753q092n981l077m72Q87
63372E18617J594K947N321Q027J0225J1362J1143J0009R386J0512J2949J5001
63360F27093J5777J6069J7054J8895K1027K3099K4984K6292K6618K6132K5204
$$ plain form
63445 359476 362720 366743 372062 378770 386675 395685 405820 417016 429319 443086 458677 476048 495007
63432 495007 515672 538100 561523 584506 605964 625562 643072 657971 670033 679956 689047 698500
63420 698500 709109 721320 735256 750914 768532 788556 811034 835308 860428 885472 909201
63409 909201 929918 946305 958292 966630 971726 973449 971993 968243 963005 956320 947901 937880 926665
63396 926665 914172 899644 882282 861840 838673 813523 787302 760727 733979 706960 680091
63385 680091 654510 631150 609916 590253 572363 557193 545105 535352 527260 521279 518202 517730 518617
63372 518617 520211 523158 528479 536506 546731 558093 569236 579245 588631 599143 612092 627093
63360 627093 642870 658939 675993 694888 715915 739014 763998 790290 816908 843040 868244
63349H68244K3532K0276J5343R989N738K904O22j849m290o058p020p673q594j0058
63335I01106j2075j4459j6837j8921k0754k2494k3980k4797k4821k4324k3471
63324F74173k2029j9826j7135j4392j1828r565p806o570n587m847n022o754r580
63311E33232j2038j2999j2562j1636j0899j0301r412q031o491n240m209k856r96
63298D25562P27J538J416Q73J37q90k015k764l124l655m647n645o043n730m961
63283C90779l998l194k978l362l677l212k002p61j38k19o14q44p35n77p56j160
63267C62552j201m95O75J810K685L236L323K989K732L013L619L974L955L986M287
63252D01140M581M695M966N686O540P030P373Q378J0296J2208J2955J2560J2280
$$ plain form
63349 868244 891776 912052 927395 937384 943122 946026 946648 944799 940509 934451 927431 919758 911164 901106
63335 901106 889031 874572 857735 838814 818060 795566 771586 746789 721968 697644 674173
63324 674173 652144 632318 615183 600791 588963 579398 571592 565022 559435 554588 549566 542812 533232
63311 533232 521194 508195 495633 483997 473098 462797 453385 445354 438863 433623 429414 426558 425562
63298 425562 426289 427827 429243 430116 430253 429363 427348 424584 421460 417805 413158 407513 401470 395740 390779
63283 390779 386781 383587 380609 377247 373570 370358 368356 367595 367457 367238 366624 365780 365045 364468 363712 362552
63267 362552 361351 360856 361531 363341 366026 369262 372585 375574 378306 381319 384938 388912 392867 396853 401140
63252 401140 405721 410416 415382 421068 427608 434638 442011 450389 460685 472893 485848 498408 510688
63239E10688J3202J5192J7371J9234K0963K2891K5110K7508K9687L0986L1156
63228G63988L0977L1543L2796L3499L3026L2371L2741L3837L4380L3960L3293
63217A126411L2824L2199L1292L0700L0672L0293K8433K4994K0649J5722J0036
63206A414225L594l273j0315j7345k3818k9023l2809l5600l7569l8303l7475l5416
63194A116873l2686k9497k5921k2308j9035j5956j2592q759m677n13L657P446
63182I56032J0276J2190J4056J6589J9456K1758K3192K4222K5198K5851K5760
63171A174580K4969K3858K2675K1362J9665J7350J4397J1118P814M268j64n763
63159A336129j1906j7600k2380k6541l0589l4617l8074m0094m0249l9154l8011
$$ plain form
63239 510688 523890 539082 556453 575687 596650 619541 644651 672159 701846 732832 763988
63228 763988 794965 826508 859304 892803 925829 958200 990941 1024778 1059158 1093118 1126411
63217 1126411 1159235 1191434 1222726 1253426 1284098 1314391 1342824 1367818 1388467 1404189 1414225
63206 1414225 1417819 1414546 1404231 1386886 1363068 1334045 1301236 1265636 1228067 1189764 1152289 1116873
63194 1116873 1084187 1054690 1028769 1006461 987426 971470 958878 950119 945442 944929 948586 956032
63182 956032 966308 978498 992554 1009143 1028599 1050357 1073549 1097771 1122969 1148820 1174580
63171 1174580 1199549 1223407 1246082 1267444 1287109 1304459 1318856 1329974 1337788 1342056 1341892 1336129
63159 1336129 1324223 1306623 1284243 1257702 1227113 1192496 1154422 1114328 1074079 1034925 996914
63148I96914l7260l6079l3619l0391k7704k5859k3806k0755j7382j4849j3241
63137G15969j1685r748p919o673n755m712l607k751j964o53J268L083M165M909
63123F73927O220Q104R392R131P819O724O282N859M985M065L573L240K505J383
63109G53209L84j52k99k52j92k49l89m71o36j209k043k410k010j568j804k311
63093G37598k269j850j805j917j170L75J238O05l73k37Q53J753K202K781L510
63078G41294L735L416L425M347N798P195Q420R473J0116J0316J0560J1359J2704
63065H42158J4316J6071J7977K0002K2204K4783K7788L0932L3926L6808L9802
63054A126767M3060M6673N0672N4852N8783O2238O5453O8759P2026P4698P6360
$$ plain form
63148 996914 959654 923575 889956 859565 831861 806002 782196 761441 744059 729210 715969
63137 715969 704284 694536 686617 679944 674189 669477 665870 663119 661155 660502 661770 664853 669018 673927
63123 673927 680147 688251 697643 706774 714593 721317 727599 733458 738443 742508 746081 749321 751826 753209
63109 753209 753593 753441 753142 752890 752698 752449 752060 751589 750953 749744 747701 745291 743281 741713 739909 737598
63093 737598 735329 733479 731674 729757 728587 728962 730200 730805 730432 730195 731048 732801 735003 737784 741294
63078 741294 745029 748445 751870 756217 762015 769210 777630 787103 797219 807535 818095 829454 842158
63065 842158 856474 872545 890522 910524 932728 957511 985299 1016231 1050157 1086965 1126767
63054 1126767 1169827 1216500 1267172 1322024 1380807 1443045 1508498 1577257 1649283 1723981 1800341
63043A800341P7166P7655P8125P8295P7663P6223P4635P3498P2822P2365P2065
63032B630853P1660P0129O6305O0058N2261M3551L3697K2280R270n188k0789l6520
63020B997567n0873o3116p3735q3094r0297r4161r4753r3122q9859q4883p8425
63009B101249p1197o3444n4774m5128l5205k5613j6320p324P95P615J3665J9806
62997A824125K5990L1323L5342L8606M1706M4257M5368M5044M4399M4287M4169
62986B264616M2839M0039L6562L2817K8144K1928J4658P129r10j0451k1685l3482
62974B422204m4445n3877o1722o8188p3580p7974q0866q1626q0357p7894p4856
62963A646819p1188o6746o1850n7034n2664m8910m5733m2810l9943l7544l6130
$$ plain form
63043 1800341 1877507 1955162 2033287 2111582 2189245 2265468 2340103 2413601 2486423 2558788 2630853
63032 2630853 2702513 2772642 2838947 2899005 2951266 2994817 3028514 3050794 3060064 3054876 3034087 2997567
63020 2997567 2946694 2883578 2809843 2726749 2636452 2542291 2447538 2354416 2264557 2179674 2101249
63009 2101249 2030052 1966608 1911834 1866706 1831501 1805888 1789568 1782244 1783039 1790654 1804319 1824125
62997 1824125 1850115 1881438 1916780 1955386 1997092 2041349 2086717 2131761 2176160 2220447 2264616
62986 2264616 2307455 2347494 2384056 2416873 2445017 2466945 2481603 2488732 2487822 2477371 2455686 2422204
62974 2422204 2377759 2323882 2262160 2193972 2120392 2042418 1961552 1879926 1799569 1721675 1646819
62963 1646819 1575631 1508885 1447035 1390001 1337337 1288427 1242694 1199884 1159941 1122397 1086267
62952A086267l5276l3793l1261k8607k6824k5776k4800k3778k2833k1635j9842
62941G91842j7917j6623j5868j4854j3328j1876j0934j0236r372q253o907n319
62929F50355l729k579j973j584j249j181j439j670j644j662k076k725l136l160
62915F20548l098l332l973m785n331n329m988m795m976n273n351n092m487l535
62901E56203k496j873j878k097j955j446j071j144j395j353r51o09p42j239j543
62886E34411j312p90m32l22k27n9O0J41K93L56N7l85l95N6K09m20j271j484j045
62867E27441o15n17n38n90q56j277j467j325j183j205j104o26K3N43R05J187J351
62850E20147J435J636J857J550L90j010j602j115l60k70r41j758k153k007j511
$$ plain form
62952 1086267 1050991 1017198 985937 957330 930506 904730 879930 856152 833319 811684 791842
62941 791842 773925 757302 741434 726580 713252 701376 690442 680206 670834 662581 655674 650355
62929 650355 646626 644047 642074 640490 639241 638060 636621 634951 633307 631645 629569 626844 623708 620548
62915 620548 617450 614118 610145 605360 600029 594700 589712 584917 579941 574668 569317 564225 559738 556203
62901 556203 553707 551834 549956 547859 545904 544458 543387 542243 540848 539495 538544 537935 537193 535954 534411
62886 534411 533099 532309 531877 531555 531328 531269 531329 531470 531763 532119 532176 531791 531396 531452 531661 531241 529970 528486 527441
62867 527441 526826 526309 525771 525181 524325 523048 521581 520256 519073 517868 516764 516138 516161 516704 517609 518796 520147
62850 520147 521582 523218 525075 526625 527015 526005 524403 523288 522928 522658 521717 519959 517806 515799 514288
62835E14288q85l12Q0K76L46L47K32k6k68j92L21R94J352J179P83P51J437K609
62817E23312L646M165M417M928N705O174O038N896O541P845Q790Q681P896P343
62803F11377P591Q666J0199J1529J2034J1839J1880J2901J4528J5838J6633J7689
62791G62704J9756K2819K6439L0331L4410L8644M3117M8089N3745O0012O6701
62780A206767P3723Q0980Q8197R4924J00737J05432J09197J12466J15327J16947
62770B204697J15954J11541J04024R4157Q2202O7955N1479L3417J4544m624k3684
62759B851662m2065n9035p3962q6468r6468j04064j09376j12376j13000j11471
62749A943377j08426j04545j00094r4972q9224q3289p7551p1833o5674n9155n3014
$$ plain form
62835 514288 513403 513091 513171 513447 513793 514140 514372 514346 514078 513886 514207 515201 516553 517732 518515 519266 520703 523312
62817 523312 526958 531123 535540 540468 546173 552347 558385 564281 570822 578667 587457 596138 604034 611377
62803 611377 618968 627634 637833 649362 661396 673235 685115 698016 712544 728382 745015 762704
62791 762704 782460 805279 831718 862049 896459 935103 978220 1026309 1080054 1140066 1206767
62780 1206767 1280490 1361470 1449667 1544591 1645328 1750760 1859957 1972423 2087750 2204697
62770 2204697 2320651 2432192 2536216 2630373 2712575 2780530 2832009 2865426 2879970 2875346 2851662
62759 2851662 2809597 2750562 2676600 2590132 2493664 2389600 2280224 2167848 2054848 1943377
62749 1943377 1834951 1730406 1630312 1535340 1446116 1362827 1285276 1213443 1147769 1088614 1035600
62738A035600m7803m3238l8736l4305l0430k7221k4236k1228j8475j6217j4136
62727G19575j1769r160o797n042l889l096k374j530n59M77J711L340N176O796
62713F92859Q336J0585J3822J7085J9308K0996K3785K8343L3470L7689M1019M4625
62701I91922M9188N4213N8915O3186O7606P2701P8353Q3809Q8232R1235R2791
62690A792151R2775R0818Q6720Q0662P2796O2882N0589L6075K0041L391j2954
62679B375946k8234m2244n5421o7987p9019q6944r1188r2883r3562r3558r2127
62668A552779q8845q4276p9290p4274o9183o3897n8337n2627m7316m3112l9984
62657H51638l6959l3199k9057k5612k3300k1560j9738j7800j6044j4591j3440
$$ plain form
62738 1035600 987797 944559 905823 871518 841088 813867 789631 768403 749928 733711 719575
62727 719575 707806 698646 691849 686807 682918 679822 677448 675918 675359 675836 677547 680887 686063 692859
62713 692859 701195 711780 725602 742687 761995 782991 806776 835119 868589 906278 947297 991922
62701 991922 1041110 1095323 1154238 1217424 1285030 1357731 1436084 1519893 1608125 1699360 1792151
62690 1792151 1884926 1975744 2062464 2143126 2215922 2278804 2329393 2365468 2385509 2388900 2375946
62679 2375946 2347712 2305468 2250047 2182060 2103041 2016097 1924909 1832026 1738464 1644906 1552779
62668 1552779 1463934 1379658 1300368 1226094 1156911 1093014 1034677 982050 934734 891622 851638
62657 851638 814679 781480 752423 726811 703511 681951 662213 644413 628369 613778 600338
62646F00338j2606j1941j1100r873q360o792n416m634m711n156m954l756k393
62633E08646j816j914j942j702j636j975k465k900l302l548l343k669j784p55
62619D76895N47K000L212M028M601M910M781M472M657N543O502O903O954P460
62605E43465Q973J1451J4323J6731J8095J8809K0084K2753K6524L0626L4814L9298
62593H05946M3917M7917N0700N2390N3608N4780N5662N5523N3757N0334M5532
62582A370066L9393L1727K2619J2575K179q078j7648k6144l3688m0463m5892m9009
62570A257637m9916n0027n0425n0614m9546m7162m4223m1194l8123l5197l2552
62559G68658k9812k6687k3727k1588j9806j7345j4233j1575r908q675p463o627
$$ plain form
62646 600338 587732 575791 564691 554818 546458 539666 534250 529616 524905 519749 514795 511039 508646
62633 508646 506830 504916 502974 501272 499636 497661 495196 492296 488994 485446 482103 479434 477650 476895
62619 476895 477442 479442 482654 486682 491283 496193 500974 505446 510103 515646 522148 529051 536005 543465
62605 543465 552438 563889 578212 594943 613038 631847 651931 674684 701208 731834 766648 805946
62593 805946 849863 897780 948480 1000870 1054478 1109258 1164920 1220443 1274200 1324534 1370066
62582 1370066 1409459 1441186 1463805 1476380 1478559 1470481 1452833 1426689 1393001 1352538 1306646 1257637
62570 1257637 1207721 1157694 1107269 1056655 1007109 959947 915724 874530 836407 801210 768658
62559 768658 738846 712159 688432 666844 647038 629693 615460 603885 593977 585302 577839 571212
62547E71212o256n655m420l224k778k743k326j430m94K17N89L89k34m53K53J202
62531E43849J447J315K099M228O619Q050Q483Q820R847J1728J4104J6497J8763
62518F55849K1249K4313K7814L1412L5176L9358M3712M7602N0863N3804N6249
62507A087401N7340N6738N5350N4114N2530M9138M3358L6122K8675K1362J3908
62496A556036O416l55n569q906j0545j0723r372o280j627L747Q934J3746J8671
62483A554173K3961K9070L3159L5926L7529L7815L6036L1513K4398J5618O194
62472A865392l294j2733k2243l1905m1589n0952n9569o6969p2514p5488p5654
62461A352482p3745p1056o8352o5334o1285n6036n0084m4006l8122l2670k7831
$$ plain form
62547 571212 564956 559301 554881 551657 548879 546136 543810 542380 541886 542103 542692 543081 542847 542394 542647 543849
62531 543849 545296 546611 548710 552938 559557 567607 576090 584910 594757 606485 620589 637086 655849
62518 655849 677098 701411 729225 760637 795813 835171 878883 926485 977348 1031152 1087401
62507 1087401 1144741 1201479 1256829 1310943 1363473 1412611 1455969 1492091 1520766 1542128 1556036
62496 1556036 1562452 1562097 1556528 1547622 1537077 1526354 1516982 1510702 1509075 1512822 1521756 1535502 1554173
62483 1554173 1578134 1607204 1640363 1676289 1713818 1751633 1787669 1819182 1843580 1859198 1865392
62472 1865392 1862098 1849365 1827122 1795217 1753628 1702676 1643107 1576138 1503624 1428136 1352482
62461 1352482 1278737 1207681 1139329 1073995 1012710 956674 906590 862584 824462 791792 763961
62450G63961k3480j9265j5197j1853r664q135o233l535o22J734L439M902O290
62437F82342P305P635P343O740O047N284M330L035J294r03l443o061q365r997
62423G02586j0898j1361j1713j2036j2263j2396j2474j2366j1956j1384j0905
62412E72834j0456r711q636p648p044o514n550m083k529j340q03j022j733k231
62398E03534j934j025k19K15Q28K192L983N147M937L618K185J446J429J708K183
62383E30227L227M927O489O947O407O060O751P993Q681Q480Q026P979Q310Q599
62369F29103Q650Q691R143J0292J2017J3857J5448J6970J8958K1641K4661K7553
62357H16984L0298L3217L6396L9472M2022M3913M5150M5501M4549M2131L8553
$$ plain form
62450 763961 740481 721216 706019 694166 684502 676367 670134 666599 665977 667711 671150 676052 682342
62437 682342 689647 697282 704625 711365 717412 722696 727026 730061 731355 730452 727009 720948 712583 702586
62423 702586 691688 680327 668614 656578 644315 631919 619445 607079 595123 583739 572834
62412 572834 562378 552667 544031 536383 529339 522825 517275 513192 510663 509323 508520 507498 505765 503534
62398 503534 501600 500575 500356 500571 501399 503591 507574 512721 517658 521276 523461 524907 526336 528044 530227
62383 530227 533454 538381 544870 551817 558224 564284 571035 579028 587709 596189 604215 612194 620504 629103
62369 629103 637753 646444 655587 665879 677896 691753 707201 724171 743129 764770 789431 816984
62357 816984 847282 880499 916895 956367 998389 1042302 1087452 1132953 1177502 1219633 1258186
62346A258186L4264K9376K3723J7350J0813M802m50n266r960j4360j8058k1062
62334A309358k3832k6535k8562k9208k8650k7808k7155k6234k4557k2469k0667
62323A023681j9311j8145j7237j6924j7117j7385j7740j8606j9800k0289j9393
62312H21734j7672j6168j5259j4675j4163j3496j2277j0454q758p909p548o779
62300F76576n644n219n993p039p087n912m199k659j667j302j273j055m79Q8M21
62285F27557Q40J579K251K425K350K464K563K196J645J640K226K693K787L122
62271F58338M146N417O304O813P284P771Q205Q811R871J1448J3637J6710K0478
62258G85233K4003K6607K8906L2087L6264M0232M2961M4639M5968M6970M6895
$$ plain form
62346 1258186 1292450 1321826 1345549 1362899 1373712 1378514 1378064 1372798 1362838 1348478 1330420 1309358
62334 1309358 1285526 1258991 1230429 1201221 1172571 1144763 1117608 1091374 1066817 1044348 1023681
62323 1023681 1004370 986225 968988 952064 934947 917562 899822 881216 861416 841127 821734
62312 821734 804062 787894 772635 757960 743797 730301 718024 707570 698812 690903 683355 676576
62300 676576 670932 665713 659720 652681 645594 639682 635483 632824 631157 629855 628582 627527 627048 627136 627557
62285 627557 628397 629976 632227 634652 637002 639466 642029 644225 645870 647510 649736 652429 655216 658338
62271 658338 662484 667901 674205 681018 688302 696073 704278 713089 722960 734408 748045 764755 785233
62258 785233 809236 835843 864749 896836 933100 973332 1016293 1060932 1106900 1153870 1200765
62247A200765M5091M1584L6907L1539K5525J8719J1350M160k334q515j5179k2403
62235A367209k9369l5314m0155m3991m6494m7253m6416m4661m2490l9888l6612
62224I14566l2746k8823k5449k2751k0331j7884j5636j3941j2679j1458j0277
62213G02591r418q702p538n849m319l418k748j748n45L97J001J506K008K601L611
62198F69430N120O501P035O849O734P069P510P676P591P426P320P482Q025Q652
62184G70420Q900Q766Q693Q890R039Q749P989P038O320O233O756P245P099O648
62170H78785O869Q217J0200J2262J4541J7423K0817K4170K7011K9190L0794L1979
62158A112258L2678L2376L0452K6905K2426J7669J2774P779L090p99l955p051
$$ plain form
62247 1200765 1245856 1287440 1324347 1355886 1381411 1400130 1411480 1415640 1413306 1404791 1389612 1367209
62235 1367209 1337840 1302526 1262371 1218380 1171886 1124633 1078217 1033556 991066 951178 914566
62224 914566 881820 852997 827548 804797 784466 766582 750946 737005 724326 712868 702591
62213 702591 693173 684471 676933 671084 666765 663347 660599 658851 658306 658703 659704 661210 663218 665819 669430
62198 669430 674550 681051 688086 694935 701669 708738 716248 723924 731515 738941 746261 753743 761768 770420
62184 770420 779320 788086 796779 805669 814708 823457 831446 838484 844804 851037 857793 865038 872137 878785
62170 878785 885654 893871 904071 916333 930874 948297 969114 993284 1020295 1049485 1080279 1112258
62158 1112258 1144936 1177312 1207764 1234669 1257095 1274764 1287538 1295317 1298407 1297608 1293653 1286602
62146A286602j0792j5247j9617k2761k4220k4702k5117k5323k4405k2274k0113
62135A052031j8790j7582j5207j1751q705p120o498n738m635l965m303n175n560
62122I37002n037m078l202k228p40J012K283K894L446M316M993M769L630K091
62108I51151N22r45k176l078l762m230m188l497k649k429l125m342n516o355o852
62093H98529o986o460m838k276M2Q08N3q92j013n97k68P9P93J638K238K873M043
62076H87766N563O894Q044R354J0704J1732J2613J3684J4550J4538J3902J3622
62064A022966J3990J4474J5016J6245J8126J9609K0082K0050J9768J8308J4931
62053A213565J0572O821M039J471j232l852o726j0791j6160k1585k5793k8787
$$ plain form
62146 1286602 1275810 1260563 1240946 1218185 1193965 1169263 1144146 1118823 1094418 1072144 1052031
62135 1052031 1033241 1015659 1000452 988701 979996 972876 966378 960640 956005 952040 947737 942562 937002
62122 937002 931965 927887 924685 922457 921717 922729 925012 927906 931352 935668 940661 945430 949060 951151
62108 951151 951673 950728 948552 945474 941712 937482 933294 929797 927148 924719 921594 917252 911736 905381 898529
62093 898529 891543 885083 880245 877969 878011 878819 878872 877980 876967 876370 876102 876181 876974 878612 880850 883723 887766
62076 887766 893329 900223 908267 917621 928325 940057 952670 966354 980904 995442 1009344 1022966
62064 1022966 1036956 1051430 1066446 1082691 1100817 1120426 1140508 1160558 1180326 1198634 1213565
62053 1213565 1224137 1230958 1234997 1236468 1235236 1231384 1224658 1213867 1197707 1176122 1150329 1121542
62041A121542l1362l3781l5501l6022l5552l4680l3699l2415l0672k8730k6963
62030G62165k5261k3177k0684j8397j6829j5683j4257j2404j0734r884r737r467
62018E75651q358o633n416n550o515o836n782m171l243l136k999k314j469j012
62004E12217q90p04l39k1J31L52R44J830K531K730K706K944L318L056J698j98
61988E32305j703k615l505m688n701n994n762n763o396p185p301o416n055m059
61974D60162l826m064m242m144l983l983l993l494k198n58N14O26L23K92M35K55
61958D28122j19J3P65J368J342J210J539J905J556P13L79J012K077K944L477L669
61942D51972L446L136L548N096P137Q601R105R145R357R793R929R286Q034P083
$$ plain form
62041 1121542 1090180 1056399 1020898 984876 949324 914644 880945 848530 817858 789128 762165
62030 762165 736904 713727 693043 674646 657817 642134 627877 615473 604739 594855 585118 575651
62018 575651 567293 560660 555244 549694 543179 536343 530561 526390 523147 520011 517012 514698 513229 512217
62004 512217 511327 510623 510284 510263 510394 510746 511690 513520 516051 518781 521487 524431 527749 530805 532503 532305
61988 532305 530602 527987 524482 519794 514093 508099 502337 496574 490178 482993 475692 469276 464221 460162
61974 460162 456336 452272 448030 443886 439903 435920 431927 428433 426235 425677 426191 426817 427140 427432 427867 428122
61958 428122 428003 428016 428781 430149 431491 432701 434240 436145 437701 438414 438793 439805 441882 444826 448303 451972
61942 451972 455418 458554 462102 467198 474335 482936 492041 501186 510543 520336 530265 539551 547585 554668
61928E54668P209Q046Q188O626L925J667P75O58J11j307k929l827l638k680j572
61913E75920q87q50j064p14P29K957N212O976Q090Q446Q137P814Q145Q730Q263
61898F45904O189L583J872J183O48j57q49j207j526j993k357k426k300k041j644
61883F42879j468k100l543n163o543p878r230j0109j0244j0207j0608j1071j0638
61870E44077r050p041n475m618m237l945l393k382r66O44K190L410M238N059O373
61855E24884Q028R228R661J0139J1577J3636J5172J5811J6233J6909J7347J6979
61843F85604J6034J5080J4117J2706J0704Q385N946L376Q36j246k585l332l830
61830G61795m155m016l129j630l5J246K253L249M333N381O216O566N981M212J657
$$ plain form
61928 554668 561877 569923 578111 584737 588662 590329 591104 591762 591873 590566 587637 583810 580172 577492 575920
61913 575920 575033 574183 573119 572405 573134 576091 581303 588279 596369 604815 612952 620766 628911 637641 645904
61898 645904 652093 655676 657548 658731 659379 659222 658373 657166 655640 653647 651290 648864 646564 644523 642879
61883 642879 641411 639311 635768 630605 624062 616184 606954 596845 586601 576394 565786 554715 544077
61870 544077 535027 527986 522511 517893 513656 509711 506318 503936 502970 503614 505804 509214 513452 518511 524884
61855 524884 532912 542140 551801 561940 573517 587153 602325 618136 634369 651278 668625 685604
61843 685604 701638 716718 730835 743541 754245 762630 768576 771952 772788 771542 768957 765625 761795
61830 761795 757640 753624 750495 748865 748830 750076 752329 755578 759911 765292 771508 778074 784055 788267 789924
61815G89924r36l222n277o923p632p456p371q135r142r139p926o680o499p229
61801F96357p946q154q190q652r673j0691j0890j0014q724p869p418o551m895
61788E86690l182k369k431k527k096j336o83l12k24m01o51o36k89N1J06R1L92
61771E70193J014J646K171K787L544M136M347M485N097O307P653Q549Q717Q258
61757F38904P564P201P499Q066P968O707M802L028J303j047l944o214p053p189
61743F67595p916r265r995r405q271p694p656p371o489n388m448l705l156k809
61729E74027k453j829j143q49q61n16M53J399J612J239R25Q50P10M22K92M79P80
61712E75537J025J246J408J346J062P57M68j3p53j471j877j971j979k155k620
$$ plain form
61815 789924 788988 785766 780489 773566 765934 758478 751107 742972 733830 724691 716765 710085 703586 696357
61801 696357 688411 680257 672067 663415 653742 643051 632161 622147 613423 605554 598136 591585 586690
61788 586690 583508 581139 578708 576181 574085 572749 572066 571754 571530 571129 570478 569842 569553 569604 569710 569801 570193
61771 570193 571207 572853 575024 577811 581355 585491 589838 594323 599420 605727 613380 621929 630646 638904
61757 638904 646468 653669 661168 669234 677202 683909 688711 691739 693042 691995 688051 681837 674784 667595
61743 667595 659679 650414 640419 631014 622743 615049 607393 600022 593533 588145 583697 579992 576836 574027
61729 574027 571574 569745 568602 567753 566892 566376 566829 568228 569840 571079 572004 572854 573564 573986 574278 574757 575537
61712 575537 576562 577808 579216 580562 581624 582381 582849 582836 582083 580612 578735 576764 574785 572630 570010
61697E70010l158l259k757k293k600l419l801l587l654m357m739m001k897k713
61683E22775l418l934l922m038m531m801m586m408m445m047k861j607j054r62
61669D74161p71o32q98j155o77M03J256J530J617J803J962K122K579L332L978
61654D90610M327M577M722M425L644K890K520K204J463L94m38o08n7J013K082
61639E23768K426J704M42l81k26O32J526J949J757J169O19M14M37K51m32j499
61623E34556k664l802m931o004o806p134o949o418n802n302m923m567m244m147
61609D60863m350m606m624m511m588m757m501l617k597j997j826j897k290k942
61595D11760l253k814k220k337k901k835j957j292j451j776j588j246j296j403
$$ plain form
61697 570010 566852 563593 560836 558543 555943 552524 548723 545136 541482 537125 532386 528385 525488 522775
61683 522775 519357 515423 511501 507463 502932 498131 493545 489137 484692 480645 477784 476177 475123 474161
61669 474161 473390 472758 471860 470705 470028 470431 471687 473217 474834 476637 478599 480721 483300 486632 490610
61654 490610 494937 499514 504236 508661 512305 515195 517715 519919 521382 521776 521338 520730 520673 521686 523768
61639 523768 526194 527898 528340 527959 527733 528365 529891 531840 533597 534766 535385 535799 536236 536487 536055 534556
61623 534556 531892 528090 523159 517155 510349 503215 496266 489848 484046 478744 473821 469254 465010 460863
61609 460863 456513 451907 447283 442772 438184 433427 428926 425309 422712 420715 418889 416992 414702 411760
61595 411760 408507 405693 403473 401136 398235 395400 393443 392151 390700 388924 387336 386090 384794 383391
61581C83391j001l70j65m08o98j005j435j629j260p26n53n12k28j04o44j229q14
61564C70610M00J207J205J080J180J148J013J258J585J169M18Q79K745M071L397
61549C93365J781J094J512K043K366K664K438J158l75q25k52J69J73O24J695K299
61533D11929J793J016J052J779K264J934R01l87j407j823j796j771j870j870j747
61518D09997j778k028k198k128j866j285j68J088J536P88l59p72j88P28J232J160
61502D03759R19J071J780K617K958K679K265K342L178M526N664N738M503K711
61488D46710J484J228J510J796J910J772J315P78O71J202K055K804L266L335K880
61473D74716K010J127N46J81k49q47j438j747j722j722k184k986l466l373l332
$$ plain form
61581 383391 382390 382020 381855 381447 380749 379744 378309 376680 375420 374694 374141 373629 373401 373297 372653 371424 370610
61564 370610 371010 372217 373422 374502 375682 376830 377843 379101 380686 381855 382273 383152 385897 389968 393365
61549 393365 395146 396240 397752 399795 402161 404825 407263 408421 408046 407221 406969 407138 407311 407935 409630 411929
61533 411929 413722 414738 415790 417569 419833 421767 422668 422281 420874 419051 417255 415484 413614 411744 409997
61518 409997 408219 406191 403993 401865 399999 398714 398546 399634 401170 401958 401599 400827 400639 401367 402599 403759
61502 403759 404678 405749 407529 410146 413104 415783 418048 420390 423568 428094 433758 439496 443999 446710
61488 446710 448194 449422 450932 452728 454638 456410 457725 458503 459174 460376 462431 465235 468501 471836 474716
61473 474716 476726 477853 478399 478580 478331 477484 476046 474299 472577 470855 468671 465685 462219 458846 455514
61458D55514l880m458m141l036k046j446p09K08N27J0m19M6J062J926K578L082
61442D44818K887J641J63l82k3L14M32J042K276L104K722J663R60P88O53M55N84
61425D64097J056J407J560K086L206M070L722K496J699J896K253J840Q45J2n38
61410D91707j169j762j790j273q62q72q67m86OJ86O1j66l85m35q8N39R13P80N28
61391D84565N93Q70J080J324J871K594L100L257L240L137K846K369J972K037K742
61376E17597L815M553M349L261J916Q89L25J43J93K05m5m84r15j444k261l065
61360E29032l268k821k307k070j843j373p32R0J256K424K860K529K334K783L183
61345E32077K790J939J391J204J126J404K266L077K996K203J536J234R81Q84J309
$$ plain form
61458 455514 451634 447176 443035 439999 437953 436507 435798 436006 436533 436543 436124 436170 437232 439158 441736 444818
61442 444818 447705 449346 449509 449127 449104 449418 449850 450892 453168 456272 458994 460657 461617 462405 463058 463513 464097
61425 464097 465153 466560 468120 470206 473412 477482 481204 483700 485399 487295 489548 491388 492233 492245 491707
61410 491707 490538 488776 486986 485713 484851 483979 483112 482626 482632 482818 482879 482713 482328 481893 481805 482344 483257 484037 484565
61391 484565 485158 486028 487108 488432 490303 492897 495997 499254 502494 505631 508477 510846 512818 514855 517597
61376 517597 521412 525965 530314 533575 535491 536380 536705 536848 537041 537246 537201 536717 535802 534358 532097 529032
61360 529032 525764 522943 520636 518566 516723 515350 514618 514708 515964 518388 521248 523777 526111 528894 532077
61345 532077 534867 536806 538197 539401 540527 541931 544197 547274 550270 552473 554009 555243 556224 557108 558417
61330E58417J906J807R45J98J32M46Q08J360K204L081L823M483M883M746M404
61315E93643M698N876P262Q237Q914R617J0335J1023J1868J2952J4038J4933J5638
61302G29034J5924J5343J3764J1557R068O462M008J927j80k958o142q532r424
61289G79851r383r277r299r377r741j0402j0748j0353r708r454r325q577p160
61276F57047n761m812m109l318k447j752j489j567j451o82L45P47L80N8K38M20
61260F31847M21J161L215N440O259N808N399N279M456K690J097M27J19l96o61
61245F72561k15L83M55L03N28Q69O43o2n30n59n81p27n33K88J383K185K471K492
61227F81354K793L941N997Q314J0083J1050J1388J1163J0374R496R277R784J0147
$$ plain form
61330 558417 560323 562130 563075 563273 563405 563851 564659 566019 568223 571304 575127 579610 584493 589239 593643
61315 593643 598341 604217 611479 619716 628630 638247 648582 659605 671473 684425 698463 713396 729034
61302 729034 744958 760301 774065 785622 794690 801152 805160 807087 806907 803949 797807 789275 779851
61289 779851 770468 761191 751892 742515 732774 722372 711624 701271 691563 682109 672784 664207 657047
61276 657047 651286 646474 642365 639047 636600 634848 633359 631792 630341 629659 630004 630751 631131 631189 631427 631847
61260 631847 632268 633429 636644 642084 648343 654151 659550 664829 669285 671975 673072 673499 673618 673222 672561
61245 672561 672346 672729 673184 673487 674015 674884 675527 675465 674935 674376 673795 673068 672535 672823 674206 676391 678862 681354
61227 681354 684147 688088 694085 702399 712482 723532 734920 746083 756457 765953 775230 785014 795161
61214G95161R638Q642Q137Q371Q564P991O926O190O001N718M869M008M136N372
61200H89724O705P172O925O902P754R433J1511J3425J4455J4108J2682J1076R795
61187A021667Q369O038K812l96k687l963m795n717o786p825q851j0079j1538j2881
61173I63368j3730j4134j4430j4759j4899j4622j4090j3795j4177j5182j6079
61162H03471j5919j4449j2520j1255j0873j0624r828q509o986n377l774k462j547
61149F89348p29K01R54J184J037P76J88j077k686l761l801l028j873o43L65R84
61133F77439J499K305L224L750M095N301P933J1244J4000J5745J6890J7948J9243
61120H00616K0927K2857K4522K5558K6200K6923K7864K8798K9471K9661K9179
$$ plain form
61214 795161 804799 813441 821578 829949 838513 846504 853430 859620 865621 871339 876208 880216 884352 889724
61200 889724 896429 903601 910526 917428 925182 934615 946126 959551 974006 988114 1000796 1011872 1021667
61187 1021667 1030036 1036074 1038886 1038490 1035803 1031840 1027045 1021328 1014542 1006717 997866 987787 976249 963368
61173 963368 949638 935504 921074 906315 891416 876794 862704 848909 834732 819550 803471
61162 803471 787552 773103 760583 749328 738455 727831 718003 709494 702508 697131 693357 690895 689348
61149 689348 688619 688820 689774 690958 691995 692771 692959 691882 689196 685435 681634 678606 676733 676090 676455 677439
61133 677439 678938 681243 684467 688217 692312 697613 705546 716790 730790 746535 763425 781373 800616
61120 800616 821543 844400 868922 894480 920680 947603 975467 1004265 1033736 1063397 1092576
61109A092576K8207K7323K6848K6320K5036K2850K0207J7528J4942J2346R481
61098A323664O173K792K6k126m586p842j0919j2492j2647j2521j2510j1897j0297
61085A234818q332o619m946k893m95K081M851P651J0031J1857J3487J5091J6444
61072A293026J7567J8846K0141K0559J9715J8506J7949J7796J7023J5268J2985
61061A489381J0540P895N069K271l32k506l896m609n529p384r652j1146j1515
61048A458587j1434j1379j0994r901q410p089o094n259m485l736k775j259R37
61035A376709L458N540O571O726O872P620Q777R983J1477J3630J6033J7808J8845
61022A510049K0041K2128K4871K7687L0588L4184L9027M5186N2401O0554P0017
$$ plain form
61109 1092576 1120783 1148106 1174954 1201274 1226310 1249160 1269367 1286895 1301837 1314183 1323664
61098 1323664 1329837 1332629 1332655 1330529 1325943 1318101 1307182 1294690 1282043 1269522 1257012 1245115 1234818
61085 1234818 1226486 1219867 1214921 1212028 1211533 1213614 1218465 1226116 1236147 1248004 1261491 1276582 1293026
61072 1293026 1310593 1329439 1349580 1370139 1389854 1408360 1426309 1444105 1461128 1476396 1489381
61061 1489381 1499921 1507816 1512885 1515156 1514824 1512318 1508422 1503813 1498284 1490900 1481248 1470102 1458587
61048 1458587 1447153 1435774 1424780 1414879 1406469 1399380 1393286 1388027 1383542 1379806 1377031 1375772 1376709
61035 1376709 1380167 1385707 1392278 1399004 1405876 1413496 1422273 1432256 1443733 1457363 1473396 1491204 1510049
61022 1510049 1530090 1552218 1577089 1604776 1635364 1669548 1708575 1753761 1806162 1866716 1936733
61011A936733Q1479R5358J11856J31852J57195J89346K28033K72138L21856L79252
61001C905098M46706N25701O16979P20865Q37333R66695J109223J260360J403526
60992A1792486J509217J545034J489153J336217J095799P92947M72672J95768
60984B0229293J5855n0904l7654q132k3361j19770l07019n72585q81873j180230
60974A7063620j408650j528898j538669j464615j342217j200044j055810r18896
60966F605821p93166o79248n77029m87049m09867l44952k90854k46137k09765
60957B567754j80681j57360j37987j21146j06397r3898q3394p3953o5012n7143
60947A490783n1185m6925m3343l9986l7348l5894l5342l5041l4432l3167l1334
$$ plain form
61011 1936733 2018212 2113570 2225426 2357278 2514473 2703819 2931852 3203990 3525846 3905098
61001 3905098 4351804 4877505 5494484 6215349 7052682 8019377 9128600 10388960 11792486
60992 11792486 13301703 14846737 16335890 17672107 18767906 19560853 20033525 20229293
60984 20229293 20245148 20194244 20156590 20148458 20125097 20005327 19698308 19125723 18243850 17063620
60974 17063620 15654970 14126072 12587403 11122788 9780571 8580527 7524717 6605821
60966 6605821 5812655 5133407 4556378 4069329 3659462 3314510 3023656 2777519 2567754
60957 2567754 2387073 2229713 2091726 1970580 1864183 1770285 1686891 1612938 1547926 1490783
60947 1490783 1439598 1392673 1349330 1309344 1271996 1236102 1200760 1165719 1131287 1098120 1066786
60936A066786k9563k8316k7166k5424k3385k2011k1392k0543j9067j7787j7202
60925H14930j6401j4436j1926j0186r349q487p325o562o523o505n814m712l925
60912G02779l669l495k837j621m34k3m38r21r81j155k113l419m028l931m250n429
60896F64035o381o050n077n080o582q446r312q980q237p823p773p674p258o720
60882E62642o459o523o519o038n108m156l586l400l236k703j845j087p37n69j27
60867E10549O98J664K627L601M412M689M403M054M103M395M410L941L370L261
60853E60177L742M265M057K960J678J044J110J270J106O89J21p04j740k620l108
60838E74047l444l994m858n891o811p241o997o454o231o401o478o309o306o570
$$ plain form
60936 1066786 1037223 1008907 981741 956317 932932 910921 889529 868986 849919 832132 814930
60925 814930 798529 784093 772167 761981 752632 744145 736820 730258 723735 717230 711416 706704 702779
60912 702779 699110 695615 692778 691157 690723 690700 690262 689341 688360 687205 685092 681673 677645 673714 669464 664035
60896 664035 657654 651604 646527 641447 634865 626419 617107 608127 599890 592067 584294 576620 569362 562642
60882 562642 556183 549660 543141 537103 531995 527839 524253 520853 517617 514914 513069 511982 511245 510676 510549
60867 510549 511247 512911 515538 519139 523551 528240 532643 536697 540800 545195 549605 553546 556916 560177
60853 560177 563919 568184 572241 575201 576879 577923 579033 580303 581409 582098 582219 581515 579775 577155 574047
60838 574047 570603 566609 561751 555860 549049 541808 534811 528357 522126 515725 509247 502938 496632 490062
60824D90062o417n376m101l574l755l785l344l026l380m191m873n038m562l562
60810D31078k486j833j640j480j136r09j100j419j186r7J275J884J165k75j155
60795D20686p95K99J200J644K037K634L143L093K317J176M99J028K532L700L402
60780D48595J921M90k67p95j538k165k169j684j270j188j317j564k023k616k945
60765D29465k612j718q73n48m99r5P39J269Q57k46j274j813j932j695j168o45
60749D17212m50m62k70K77R74J608K009J945J392O99P8p52j909k719k554j960
60733D15118k010k697k974k457j897j774j488m79Q14J656J996K134K135K031K039
60718D12147K133K011J837K248L167L509K697J613J292J477J378J096J118J092
$$ plain form
60824 490062 483645 478269 474168 470594 466839 463054 459710 456684 453304 449113 444240 439202 434640 431078
60810 431078 428592 426759 425119 423639 422503 421594 420494 419075 417889 417792 419067 420951 422116 421841 420686
60795 420686 419891 420190 421390 423034 425071 427705 430848 433941 436258 437434 437933 438961 441493 445193 448595
60780 448595 450516 451006 450739 449944 448406 446241 444072 442388 441118 439930 438613 437049 435026 432410 429465
60765 429465 426853 425135 424262 423714 423215 423120 423859 425128 425985 425739 424465 422652 420720 419025 417857 417212
60749 417212 416762 416300 416030 416307 417281 418889 420898 422843 424235 424934 425012 424260 422351 419632 417078 415118
60733 415118 413108 410411 407437 404980 403083 401309 399821 399342 400156 401812 403808 405942 408077 410108 412147
60718 412147 414280 416291 418128 420376 423543 427052 429749 431362 432654 434131 435509 436605 437723 438815
60704D38815L44o95q74p5N53J85q09j702k184k217j939j865k407l096k998k036
60688D17000j130r21j142j359j502j399o59N76J530J857K122K755L251L021K459
60673D26459K386K806K934K367J575J183J189J070L86p19j612j780j380j040j118
60658D34706j404j560j474j091k82Q21J716K002J815J592J572J703J814J751J476
60643D45157J171J003P80J07j019k086k646k676k351j897j696j988k258j604r3
60628D27904R73O90k03m65k01n17j549k029r96R23K368K661K028R66k1m89m14
60611D31629k93n33q69p91l10O0L0j83k36j3M17Q67J028P04J56m5L61R99J338
60592D34316J290J184J311J630J879J855J595J326J240J270J230J174J374J896
$$ plain form
60704 438815 439159 438464 437590 437515 438068 438253 437444 435742 433558 431341 429402 427537 425130 422034 419036 417000
60688 417000 415870 414949 413807 412448 410946 409547 408888 409464 410994 412851 414973 417728 420979 424000 426459
60673 426459 428845 431651 434585 436952 438527 439710 440899 441969 442355 441636 440024 438244 436864 435824 434706
60658 434706 433302 431742 430268 429177 428895 429716 431432 433434 435249 436841 438413 440116 441930 443681 445157
60643 445157 446328 447331 448111 448218 447199 445113 442467 439791 437440 435543 433847 431859 429601 427997 427904
60628 427904 428877 429567 429364 428899 428698 428181 426632 424603 423607 424530 426898 429559 431587 432553 432532 432043 431629
60611 431629 431336 430803 429934 429143 428833 428893 428923 428740 428504 428491 428908 429775 430803 431507 431663 431618 431979 432978 434316
60592 434316 435606 436790 438101 439731 441610 443465 445060 446386 447626 448896 450126 451300 452674 454570
60578D54570K398K588K636K845L155L336L554M289N572O821P574Q070Q894J0217
60564E26519J1625J2513J2514J1744J0727R867Q943P369N014K400l0k329m429
60551F12447n683n548m428l210k210j118J71J385K498L921N882Q131J0434J2871
60537F35543J5405J7594J9039J9797K0169K0279K0134J9713J8753J6627J2815
60526H35868P528J744l338o979r309j1093j2809j3929j3515j1636r709r012r236
60513G34575q991p588n709m328l462k314l47K146M523O611Q920J2126J6433K1380
60499G73975K6226L0531L4493L8705M3473M8276N2116N4482N5721N6252N5724
60488A269974N3465M9564M4875L9723L3248K4396J3254R60j1492k3768l5559m5972
$$ plain form
60578 454570 456968 459556 462192 465037 468192 471528 475082 479371 484943 491764 499338 507408 516302 526519
60564 526519 538144 550657 563171 574915 585642 595509 604452 611821 616835 619235 619205 616876 612447
60551 612447 606764 601216 596788 593578 591368 590250 590421 591806 594304 598225 604107 612238 622672 635543
60537 635543 650948 668542 687581 707378 727547 747826 767960 787673 806426 823053 835868
60526 835868 843396 845140 841802 834823 825514 814421 801612 787683 774168 762532 752823 743811 734575
60513 734575 725584 717996 712287 707959 704497 702183 701836 703982 708505 715116 724036 736162 752595 773975
60499 773975 800201 830732 865225 903930 947403 995679 1047795 1102277 1157998 1214250 1269974
60488 1269974 1323439 1373003 1417878 1457601 1490849 1515245 1528499 1529459 1517967 1494199 1458640 1412668
60476A412668n3952n9167o2178o3709o3928o2570n9635n5611n1053m6166m1053
60465G93646l6126l1870k8350k5238k2318j9659j7281j5073j3120j1754j1084
60454E61773j0713j0107r025p529n871m523l946m097m393m388m231m184m057l521
60440D81188k760k262k061j690r60l22k38n34p01o02o07j092j986k833l107k579
60424D56854j458k59O28J180J533J680J577J464J730K359K805K649K170J897J802
60409D78611J357L91n34p50j36R43J969K425K073J297R02J259J971K548K988L366
60393E00680L332K638J819J698K310K890K805K103J279R54J586K829L464K664
60379E33051J242Q37J873L153L591L366L089K768K202J646J374J092M06l82n87
$$ plain form
60476 1412668 1358716 1299549 1237371 1173662 1109734 1047164 987529 931918 880865 834699 793646
60465 793646 757520 725650 697300 672062 649744 630085 612804 597731 584611 572857 561773
60454 561773 551060 540953 531928 524399 518528 514005 510059 505962 501569 497181 492950 488766 484709 481188
60440 481188 478428 476166 474105 472415 471455 471133 470895 470361 469660 469058 468451 467359 465373 462540 459433 456854
60424 456854 455396 455137 455765 456945 458478 460158 461735 463199 464929 467288 470093 472742 474912 476809 478611
60409 478611 479968 480359 479825 479075 478939 479882 481851 484276 486349 487646 488548 489807 491778 494326 497314 500680
60393 500680 504012 506650 508469 510167 512477 515367 518172 520275 521554 522508 524094 526923 530387 533051
60379 533051 534293 535130 537003 540156 543747 547113 550202 552970 555172 556818 558192 559284 559690 559308 558721
60364E58721pQ97J465J201J11j017j096P8J523K334K746L380M058M205M029M351
60348E86979N212N553M561K719J247Q18J016Q93j42j790l216l982m406m873n184
60333E85405m947m319l803l540l336l216l350l475l123k482k334k881l285k744
60319E38570j536n48j32J33O89J549K544L590M619N478O167O975Q190R588J0432
60304E96308J0236R478R277J0149J1324J1537J0390Q593O943N377L224R4l644
60291F89286p191r817j1112j1055j0080q991q419q161p321n368k954j328j073
60278E96416j761k747l719m445m655m494m637n463o413o590n797m649l818l505
60264E33723l458l240k553j590q86p06p73p90q19q67n50L73J475K131K317K393
$$ plain form
60364 558721 558714 559611 561076 562277 562388 561371 560275 560353 561876 564210 566956 570336 574394 578599 582628 586979
60348 586979 592191 597744 602305 605024 606271 607089 608105 608998 608856 607066 603850 599868 595462 590589 585405
60333 585405 580458 576139 572336 568796 565460 562244 558894 555419 552296 549814 547480 544599 541314 538570
60319 538570 537034 536486 536354 536487 537176 538725 541269 544859 549478 554956 561123 568098 576288 585876 596308
60304 596308 606544 616022 625299 635448 646772 658309 668699 677292 684235 689612 692836 692930 689286
60291 689286 682095 672278 661166 650111 640031 631040 622621 614460 607139 601771 598817 597489 596416
60278 596416 594655 591908 588189 583744 579089 574595 569958 564495 558082 551492 545695 541046 537228 533723
60264 533723 530265 527025 524472 522882 521996 521290 520517 519727 518908 518041 517491 517864 519339 521470 523787 526180
60248E26180K407K124J634J300J220J186J114J029P43P2o97j075j018q62o34p8
60232E34645P68J519K094K776L570M060M067L975M184M711N397O109O561O487
60218E90923O134O170O895P970R099J0406J1889J2972J3091J2451J1784J1533
60206G11317J1555J1470J1053J0328R508Q793Q194P608P016O421N679M648L453
60193H17043K256Q99q58k789m340n331o033o582o848o931p153p475p541p505p994
60178G42818q934r213q144o593n852n869n439l946k043o86k10m68j216k101k739
60163F79365l023l126l136k950k574k198j844j317n37K82R40J390J581J416J113
60148F65382J204J901K628K560J641P37O69J330J937K069K153K925M556O464P845
$$ plain form
60248 526180 528587 530711 532345 533645 534865 536051 537165 538194 538937 539009 538312 537237 536219 535357 534723 534645
60232 534645 535413 536932 539026 541802 545372 549432 553499 557474 561658 566369 571766 577875 584436 590923
60218 590923 597057 603227 610122 618092 627191 637597 649486 662458 675549 688000 699784 711317
60206 711317 722872 734342 745395 755723 765231 774024 782218 789826 796842 803263 808942 813590 817043
60193 817043 819299 820198 819340 816551 812211 806880 800847 794265 787417 780486 773333 765858 758317 750812 742818
60178 742818 733884 724671 716527 709934 704082 698213 692774 688828 686785 686099 685889 685421 684205 682104 679365
60163 679365 676342 673216 670080 667130 664556 662358 660514 659197 658660 658942 659882 661272 662853 664269 665382
60148 665382 666586 668487 671115 673675 675316 676053 676722 678052 679989 682058 684211 687136 691692 698156 706001
60133G06001Q265P863P184O793O842O960O677N981N324N051N045N054N143N557
60119G93740O191O483O015N117M577M732N026M665L599K517J946J626R29l35j716
60104H45112k565k605k210k196l036m269m963m852m599m694m744m244l562l451
60090G93122l864m015l507k771k372k462k953l656m168m194m032m270m961n625
60076G40272o112o783p731q396q328p811p379p155o974o819o737o549n994n096
60062F42408m198l728l803l937l359j936n53j27m02m17P5N05P36J380K626L738
60046F29008M206M509N197N978O390O663P151P498P138O228N263M151K516O81
60032G02577m75o54n38r69k150l633m787n372n828o798q237r473j0232j0924j1558
$$ plain form
60133 706001 714266 722129 729313 736106 742948 749908 756585 762566 767890 772941 777986 783040 788183 793740
60119 793740 799931 806414 812429 817546 822123 826855 831881 836546 840145 842662 844608 846234 847163 846828 845112
60104 845112 842547 839942 837732 835536 832500 828231 823268 818416 813817 809123 804379 800135 796573 793122
60090 793122 789258 785243 781736 778965 776593 774131 771178 767522 763354 759160 755128 750858 745897 740272
60076 740272 734160 727377 719646 711250 702922 695111 687732 680577 673603 666784 660047 653498 647504 642408
60062 642408 638210 634482 630679 626742 623383 621447 620894 620767 620365 619948 620023 620528 621264 622644 625270 629008
60046 629008 633214 637723 642920 648898 655288 661951 669102 676600 683738 689966 695229 699380 701896 702577
60032 702577 702102 701448 700910 699941 697791 694158 689371 683999 678171 671373 663136 653663 643431 632507 620949
60017F20949j1387j0233r253r302r363p944n559m187m377m550l543k302k205k901
60003E33843k922j783m55K9l15o74l33O93J733K230K435L033M118N044N366N318
59987E57360N139M643L902L656M316N006M453K651Q53j31q01j945l393m326m441
59972E76942m272m394m760m897m486l548k318j163n65q05j525j814j036N02J868
59957E43729K447K353K019J677J379J233J337J584J748J788J897K190K470K459
59943E70310K169J890J797J755J598J371J160Q33K33m52p73m13P34K629M873O546
59927E96260O925O470O381O994P204N966L748J886R08K94l42o76l50L64R09J023
59911F43964Q28N97N30N51L21l36j093j477j530j706k121k339j990j275o31j95
$$ plain form
60017 620949 609562 599329 590076 580774 571411 563467 557908 553721 549344 544794 541251 538949 536744 533843
60003 533843 530921 529138 528683 528712 528397 527723 527390 528083 529816 532046 534481 537514 541632 546676 552042 557360
59987 557360 562499 567142 571044 574700 579016 584022 588475 591126 591979 591848 591047 589102 585709 581383 576942
59972 576942 572670 568276 563516 558619 554133 550585 548267 547104 546539 545734 544209 542395 541359 541861 543729
59957 543729 546176 548529 550548 552225 553604 554837 556174 557758 559506 561294 563191 565381 567851 570310
59943 570310 572479 574369 576166 577921 579519 580890 582050 582883 583116 582664 581891 581478 582212 584841 589714 596260
59927 596260 603185 609655 616036 623030 630234 636200 639948 641834 642742 643036 642694 642018 641668 642032 642941 643964
59911 643964 644792 645389 645919 646470 646791 646455 645362 643885 642355 640649 638528 636189 634199 632924 632293 632098
59895F32098K03P08J292J844K303K732L246L841M348M672M973N427N889O029N872
59880F85477N948O775Q198R256Q842O771M174K585K400K545J820K66j195k068
59866G41794k636l176l502l466l349l477l690l471k524j062L77J400K036K562
59852G17816L021L140K815K431K455K966L807M869N874O217N611M727M490M751
59838G74990M331K589L86r07r03l02K18O94J428K271K563J811K05j595l064m029
59822G80686m452m454m549n297o427o810n751l908k447j636r65k49J37J08J18
59807G34104M06O36N40L59L86M89L94Q4l05p79j454k311l114l538l497l441m055
59790G14904n345o428o568o143n993o164o014n402m862m645m407l992l696l557
$$ plain form
59895 632098 632301 633009 634301 636145 638448 641180 644426 648267 652615 657287 662260 667687 673576 679605 685477
59880 685477 691425 698200 706398 715654 724496 731267 735441 738026 740426 742971 744791 745057 743862 741794
59866 741794 739158 735982 732480 729014 725665 722188 718498 715027 712503 711441 711818 713218 715254 717816
59852 717816 720837 723977 726792 729223 731678 734644 738451 743320 749194 755411 761022 765749 770239 774990
59838 774990 779321 781910 782296 781389 780486 780184 780402 781096 782524 784795 787358 789169 789374 787779 784715 780686
59822 780686 776234 771780 767231 761934 755507 748697 742946 739038 736591 734955 733990 733741 733878 733986 734104
59807 734104 734510 735146 735686 736045 736431 736920 737314 737398 737093 736314 734860 732549 729435 725897 722400 718959 714904
59790 714904 709559 703131 696563 690420 684427 678263 672249 666847 661985 657340 652933 648941 645245 641688
59776F41688l116k265j542j213p06N21K043K976L074K894L106L914M947N587N575
59761F67483N421N827O794P738Q447R218J0004J0233R763R230R095R057Q864Q840
59747G86014R040Q704P336N641M547L872K868J649R82Q82M81o36j890k559k505
59732H24426j914j063m51m99r31j023o06k80m20o26m68k66n83j279j578j032K7
59715H11434R91J577J841J848J650J537J984L143M523N401N560N448N667O494
59701H59098P812R163R953R901R397Q992Q667Q005P019O174N494M417K838J499
59687I58429Q29J53j265k993m152m800n599o459o635o214o259p268q378q679q477
59672H82233q660r324r762r482q648p606o510n382m158k617n86J690L628M856
$$ plain form
59776 641688 638572 636307 634765 633552 632846 633367 635410 638386 641460 644354 647460 651374 656321 661908 667483
59761 667483 672904 678731 685525 693263 701710 710928 720932 731165 740928 750158 759253 768310 777174 786014
59747 786014 795054 803758 811094 816735 821282 825154 828022 829671 830653 831535 832016 831380 829490 826931 824426
59732 824426 822512 821449 820998 820499 819568 818545 817939 817659 817239 816613 816145 815879 815296 814017 812439 811407 811434
59715 811434 812425 814002 815843 817691 819341 820878 822862 826005 830528 835929 841489 846937 852604 859098
59701 859098 866910 876073 886026 895927 905324 914316 922983 930988 938007 944181 949675 954092 956930 958429
59687 958429 959258 959411 958146 955153 951001 946201 940602 934143 927508 921294 915035 907767 899389 890710 882233
59672 882233 873573 864249 854487 845005 836357 828751 822241 816859 812701 810084 809498 811188 814816 819672
59658H19672N454N641N445N032N030O003P497Q184P321N646M302L276J641q83
59644H89261l531n719p735r825j1491j2274j2548j2818j2856j2285j1529j1269
59632G65381j1304j0868r877q952q303p532o594o011o008o189o378o893p702q051
59618F54719p420o277n347m713m124l744l817l916l239j714k14N02O50J003J791
59603F14140K411K268J585J109J117J171R12O12O12O85M73K22M02P98P22J23l19
59586F29043k78k12n23j016j479k058k690k910k672k692l306l650k768j121r2
59571F01576k30p96r61o67k79r6l05q16j069n76K58M53k11q84q61m99m51o08l93
59552E92585K23O33N19L23P48J995L580M733N119N282O192Q140J0334J1827J2657
$$ plain form
59658 819672 825126 830767 836212 841244 846274 852277 859774 867958 875279 880925 885227 888503 890144 889261
59644 889261 885730 880011 872276 862451 850960 838686 826138 813320 800464 788179 776650 765381
59632 765381 754077 743209 733332 724380 716077 708545 701951 695940 689932 683743 677365 670472 662770 654719
59618 654719 647299 641022 635675 630962 626838 623094 619277 615361 612122 610408 610194 610696 611346 612349 614140
59603 614140 616551 618819 620404 621513 622630 623801 624713 625325 625937 626622 627095 627317 627719 628517 629239 629362 629043
59586 629043 628765 628553 628030 627014 625535 623477 620787 617877 615205 612513 609207 605557 602789 601668 601576
59571 601576 601346 600550 599589 598922 598643 598547 598242 597426 596357 595781 596039 596492 596281 595397 594536 594037 593586 592978 592585
59552 592585 592808 593441 593960 594283 595031 597026 600606 605339 610458 615740 621932 630072 640406 652233 664890
59537F64890J3664J5312J7046J7815J6919J4380J0804O982L376M2k910m946n589
59524G67785n037l932k615j203k46n18j952l474m294m826n849p339q626r348r617
59509F98909r592r409r331r361q946p667o057n103m970m922m435l729l074k301
59495F10012j183J39J364K245K528K191J817K169L170L893L808L446L560M127
59481F43286M626M798M713M466M203M195M497M781M808M749M770M710M469M227
59467G07298L942L114J594J60l02J33P98J541K699M143N209N674O080O833P569
59452G56485P668P042O109N282M707M280L680K540P62j320l178m478n260n831
59438G78488o472p124p418p046o057m791l608k742k183j690j042l30K52Q78K060
$$ plain form
59537 664890 678554 693866 710912 728727 745646 760026 770830 777812 781188 781230 778320 773374 767785
59524 767785 762748 758816 756201 754998 754752 754234 752282 748808 744514 739688 733839 726500 717874 708526 698909
59509 698909 689317 679908 670577 661216 652270 644603 638546 633443 628473 623551 619116 615387 612313 610012
59495 610012 608829 608968 610332 612577 615105 617296 619113 621282 624452 628345 632153 635599 639159 643286
59481 643286 647912 652710 657423 661889 666092 670287 674784 679565 684373 689122 693892 698602 703071 707298
59467 707298 711240 714354 715948 716108 715806 715939 716737 718278 720977 725120 730329 736003 742083 748916 756485
59452 756485 764153 771195 777304 782586 787293 791573 795253 797793 798555 797235 794057 789579 784319 778488
59438 778488 772016 764892 757474 750428 744371 739580 735972 733230 731047 729357 728315 727985 728237 729115 731175
59423G31175M071O673R449J2010J3896J4844J5345J6344J8100J9825K0847K1413
59411I03992K1997K2388K2060K0836J8424J3955P019j018p673j1331j1939j0031
59399I88679o157j331K976N826P211P211N314J061n004j1275j5970j8004j7458
59386I43079j5336j2746j0215p821n649l778k112o73J40J29j23R9N78M66l61j060
59370H84617j006n33k77m46r37j538j727q93Q29K475L296L607M201N343O644P691
59354I11346Q451R220J0372J2027J3932J5788J7592J9329K0550K0717J9974J8997
59342A098295J8046J6732J4808J2553J0204P580M667J944k62k377n053q229j1102
59329A157806j2910j3620j3978j4920j6639j8237j8629j7814j6848j6519j6596
$$ plain form
59423 731175 735246 741919 751368 763378 777274 792118 807463 823807 841907 861732 882579 903992
59411 903992 925989 948377 970437 991273 1009697 1023652 1030671 1029653 1021980 1010649 998710 988679
59399 988679 982522 981191 984167 989993 997204 1004415 1009729 1010790 1005786 994511 978541 960537 943079
59386 943079 927743 914997 904782 896961 891312 887534 885422 884749 884889 885018 884895 884994 885572 886038 885677 884617
59370 884617 883611 883078 882801 882355 881418 879880 878153 877260 878089 880564 883860 887467 891668 897011 903655 911346
59354 911346 919797 929017 939389 951416 965348 981136 998728 1018057 1038607 1059324 1079298 1098295
59342 1098295 1116341 1133073 1147881 1160434 1170638 1178218 1182885 1184829 1184567 1182190 1177137 1168908 1157806
59329 1157806 1144896 1131276 1117298 1102378 1085739 1067502 1048873 1031059 1014211 997692 981096
59318I81096j6473j6013j5440j4952j4697j4771j4939j4701j3860j2754j1741
59307H20755j0837r948r073q078o727n116l661k505j318J94K022M089O169P460
59293G83426P079N176K887Q46j441m354p166q886r377q946p540n167k575n24J205
59278G44643L267N578P566R312J1403J3761J5532J6247J6280J6038J5447J4443
59266H89517J3296J2152J0720Q701O220L701J513k35j851l866o277q165q570p713
59252I09143o741o297o064n678n315m983m088k243j00J360K027K638L685M929
59238H82273N969O702P044O709N581M035K572J260j62j756l316m815o496q306
59224H97294r585r764r253r115r856j0879j1318j1041j0589j0352j0137r506q323
$$ plain form
59318 981096 964623 948610 933170 918218 903521 888750 873811 859110 845250 832496 820755
59307 820755 809918 799970 790897 782819 776092 770976 767315 764810 763492 763686 765708 769797 775966 783426
59293 783426 790505 795681 798568 799414 797973 793619 786453 777567 768190 759244 751704 746537 743962 743438 744643
59278 744643 747910 753488 761054 770366 781769 795530 811062 827309 843589 859627 875074 889517
59266 889517 902813 914965 925685 934386 940606 944307 945820 945585 943734 939868 933591 925426 916856 909143
59252 909143 902402 896105 890041 884363 879048 874065 869977 867734 867634 868994 871021 873659 877344 882273
59238 882273 888242 894944 901988 908697 914278 918313 920885 922145 921983 920227 916911 912096 905600 897294
59224 897294 887709 877945 868692 859577 849721 838842 827524 816483 805894 795542 785405 775899 767576
59211G67576o892n628m627l696k819k362k540k810k235n27J550K949L285K962
59197G44186K737L197M355N569O117N978N848O263P096Q016Q971R902J0344R808
59183H38387Q488P165O387N948N237L945K393J146L58l59j303k159k445k279k231
59168H68678k421k405k022j864k536l888n228n995n985n410n010n704p623r742
59154H02845j0880j0866j0414j0094r839r374q720q186p986p965p739p219o877
59141F86686p104p516p306o357n421n044m873m329l453k655k054j473q35j73N66
59126F28659J454K529L909N637P304Q333Q841R630J1062J2445J3050J3185J3701
59113G39739J4666J5132J4141J1729R014P302O823O415M894K641J086O65L00q73
$$ plain form
59211 767576 760684 755056 750429 746733 743914 741552 739012 736202 733967 733440 734990 737939 741224 744186
59197 744186 746923 750120 754475 760044 766161 772139 777987 784250 791346 799362 808333 818235 828579 838387
59183 838387 846875 854040 860427 866375 871612 875557 877950 879096 879454 879095 877792 875633 873188 870909 868678
59168 868678 866257 863852 861830 859966 857430 853542 848314 842319 836334 830924 825914 820210 812587 802845
59154 802845 791965 781099 770685 760591 750752 741378 732658 724472 716486 708521 700782 693563 686686
59141 686686 679582 672066 664760 658403 652982 647938 643065 638736 635283 632628 630574 629101 628266 628093 628659
59126 628659 630113 632642 636551 642188 649492 657825 666666 676296 687358 699803 712853 726038 739739
59113 739739 754405 769537 783678 795407 804421 811723 818546 824961 829855 832496 833582 834247 834547 833674
59099H33674k389l564m595n728o397o181n797o066o517o164n104m203l701l219
59085G64049k798k765k863k683k625l331m425n026n203n648o147n918n321n579
59071G03717o615o813n457l851l270l229k738k051k032k668l313l784m173m118
59057F49605l286k255j930k246k296j623o51P9M41M23J5n00o16j99K94L31q8n35
59039F34963p03p16q50j066j035p16n69r01j237q17M16J851L175M608O074O921
59023F49398O838O467O594P129P427P325P246P374P286O512N068L246J194r29
59009G28175k589l027k102o83J35J67J37N71J240J845K588L647M618N100N344
58994G45166N696N748M863L324K111J580J221O97K91J79J40J64O01J432K209K958
$$ plain form
59099 833674 831285 827721 823126 817398 811001 804820 799023 792957 786440 780276 775172 770969 767268 764049
59085 764049 761251 758486 755623 752940 750315 746984 742559 737533 732330 726682 720535 714617 709296 703717
59071 703717 697102 690289 684832 680981 677711 674482 671744 669693 667661 664993 661680 657896 653723 649605
59057 649605 646319 644064 642134 639888 637592 635969 635318 635397 635838 636261 636276 635776 635160 634961 635255 635586 635498 634963
59039 634963 634260 633544 632694 631628 630593 629877 629308 628407 627170 626353 626769 628620 631795 636403 642477 649398
59023 649398 656236 662703 669297 676426 683853 691178 698424 705798 713084 719596 724664 727910 729104 728175
59009 728175 725586 722559 720457 719774 719909 720076 720213 720784 722024 723869 726457 730104 734722 739822 745166
58994 745166 750862 756610 761473 764797 766908 768488 769709 770406 770697 770876 771016 771180 771781 773213 775422 778380
58978G78380M404O759R060J0295J0670J1096J1950J3007J4199J5649J7055J7699
58966I20223J7281J6307J5530J5202J4935J4172J2683J0651Q302N657K744j59
58954A053528k846n559q637j1835j4547j6642j8511k0119k0732j9925j8374j7163
58942H78638j6582j6059j4969j3222j1087q880o786m850l116j771j002p07n68
58929G79039m33l74l98l10J7M86Q42Q38M03j27j50M70J061R57M11K21O31J221
58911G84805J789K508L278L774M230N368P259R027J0076J0852J1965J3273J4361
58898H82565J5368J6627J7886J8503J8286J7690J7342J7674J8762K0171K1167
58887A082041K1432K1348K1341K1164K0128J7938J5022J2168R920Q133O093L318
$$ plain form
58978 778380 782784 789543 798603 808898 819568 830664 842614 855621 869820 885469 902524 920223
58966 920223 937504 953811 969341 984543 999478 1013650 1026333 1036984 1045286 1050943 1053687 1053528
58954 1053528 1050682 1045123 1036486 1024651 1010104 993462 974951 954832 934100 914175 895801 878638
58942 878638 862056 845997 831028 817806 806719 797839 791053 786203 783087 781316 780314 779607 779039
58929 779039 778606 778232 777834 777524 777541 778027 778869 779707 780110 779983 779833 780303 781364 782321 782732 782953 783584 784805
58911 784805 786594 789102 792380 796154 800384 805752 813011 822038 832114 842966 854931 868204 882565
58898 882565 897933 914560 932446 950949 969235 986925 1004267 1021941 1040703 1060874 1082041
58887 1082041 1103473 1124821 1146162 1167326 1187454 1205392 1220414 1232582 1242502 1250635 1256728 1260046
58875A260046K37k285m050n670p492r034r742r763r588r351q881q230p734p779
58861A160684q627j0239j2112j3612j4656j5679j6840j7659j7686j7081j6324
58850A000169j5669j5115j4576j3889j2991j2215j2024j2387j2829j3136j3436
58839H51902j3559j2976j1677j0455r978j0125j0459j0713j0476r154o814m472
58827G31044k983k043q75O30J987L010L977N110O329P369P846P504O626N943N845
58812G87319N994N830N107L828K249J095J016J547J304m01k704m361n133n592
58798G97098o207p089q024q306p292n539m556m901n383m833l716l011k466j164
58784G24611Q08K465L463M304N307O326P301Q129Q193P013N149L555K216L83k072
$$ plain form
58875 1260046 1260283 1257998 1253948 1248278 1240786 1231752 1222010 1212247 1202659 1193308 1184427 1176197 1168463 1160684
58861 1160684 1152057 1141818 1129706 1116094 1101438 1085759 1068919 1051260 1033574 1016493 1000169
58850 1000169 984500 969385 954809 940920 927929 915714 903690 891303 878474 865338 851902
58839 851902 838343 825367 813690 803235 793257 783132 772673 761960 751484 742330 735516 731044
58827 731044 728061 726018 725143 725773 727760 730770 734747 739857 746186 753555 761401 768905 775531 781474 787319
58812 787319 793313 799143 804250 808078 810327 811422 812438 813985 815289 814888 812184 807823 802690 797098
58798 797098 790891 783802 775778 767472 760180 754641 750085 745184 739801 734968 731252 728241 725775 724611
58784 724611 725419 727884 731347 735651 740958 747284 754585 762714 770907 777920 783069 786624 788840 789223 787151
58769G87151m534o752q923j0751j1527j1300j0922j0767j0322r273q006o802n488
58756F71784m174l455l386l156k210j067m06o6M90J306K154L152M484N788O505
58741F77743O735P137Q010Q942R487R727R905R850R178Q001P028O756O882O829
58727G92210O601O607O743O356N321M560M970O323P679Q592R328J0158J0916J1273
58713H97637J1066J0390R517Q541O992M173J61l973p260r771j2146j4557j6740
58700H84030j8573k0111k1209k1735k1883k1899k1605k0745j9480j8122j6570
58689F62098j4592j2424j0603r329q411p642o864n952n078m683m721m419l320
58676E64060k043j387j148n77L32R63J222J721K801M178N462O421O872O961P316
$$ plain form
58769 787151 782617 775865 766942 756191 744664 733364 722442 711675 701353 692080 684074 677272 671784
58756 671784 667610 664155 660769 657613 655403 654336 653930 653864 654354 655660 657814 660966 665450 671238 677743
58741 677743 684478 691615 699625 708567 718054 727781 737686 747536 756714 764715 771743 778499 785381 792210
58727 792210 798811 805418 812161 818517 823838 828398 833368 839691 847370 855962 865290 875448 886364 897637
58713 897637 908703 919093 928610 937151 944143 948316 948477 944504 937244 927473 915327 900770 884030
58700 884030 865457 845346 824137 802402 780519 758620 737015 716270 696790 678668 662098
58689 662098 647506 635082 624479 615150 606739 599097 592233 586281 581203 576520 571799 567380 564060
58676 564060 562017 560630 559482 558905 559237 560200 561422 563143 565944 570122 575584 582005 588877 595838 603154
58661F03154Q222Q820P917N466K497k61k810n046o501p089p277p331p109o727
58647E85925o686p069p294o890n989m888l658k344j098rQ08J045O50L47R91K426
58631E46267L591L812L314K486J418L33l07m13m09n09m40q4K35L59O76J508K585
58614E64422L425L891M163M409M736N117N266M871M072L439L295L374L280L014
58600F20774K849K826K608J932J097Q11J291J817J622J131J571L316N388O881
58586F55914P932Q937R744J0394J1611J3646J5341J5428J4170J2769J1726J0847
58574G98459J0244J0161J0230J0127J0523J2221J4748J7111J9479K2717K6537
58563I62557K9711L1944L3947L5538L5378L2872K8906K4324J9044J3033O894J086
$$ plain form
58661 603154 611376 620196 628113 633579 636076 635815 633005 627959 621458 614369 607092 599761 592652 585925
58647 585925 579239 572170 564876 557986 551997 547109 543451 541107 540009 540000 540808 541853 542503 542850 543841 546267
58631 546267 549858 553670 556984 559470 560888 561221 560914 560501 560092 559583 559143 559059 559294 559653 560329 561837 564422
58614 564422 567847 571738 575901 580310 585046 590163 595429 600300 604372 607811 611106 614480 617760 620774
58600 620774 623623 626449 629057 630989 632086 632897 634188 636005 637627 638758 640329 643645 649033 655914
58586 655914 663846 672783 682527 692921 704532 718178 733519 748947 763117 775886 787612 798459
58574 798459 808703 818864 829094 839221 849744 861965 876713 893824 913303 936020 962557
58563 962557 992268 1024212 1058159 1093697 1129075 1161947 1190853 1215177 1234221 1247254 1254148 1255234
58551A255234m206q166r721r314q889r556j0432j0456j0049j0321j1740j4321
58539A138063j8031k2169k5404k7194k8373k9596l0145k9143k6950k4517k2042
58528H54499j9318j6703j4755j3246j1453r256p268o032n553n463n291m824m322
58515G31015m173m258m147l793l476l129k513j947j915j971j149L54J170P47O5
58500G00880r6l23j182j860j243M71K155L174L612L723L957M989O955R023J0343
58485G44578J1092J2051J3618J5544J7280J8255J8338J8233J8752J9537J9279
58474I26557J7407J4617J1492P670K963j853n968r377j2003j3011j1913r651p617
58461I09313o108m395j869J510N349Q860J1328J2926J4466J5914J6079J4217J1043
$$ plain form
58551 1255234 1251028 1242862 1233141 1223827 1214938 1205382 1194950 1184494 1174445 1164124 1152384 1138063
58539 1138063 1120032 1097863 1072459 1045265 1016892 987296 957151 928008 901058 876541 854499
58528 854499 835181 818478 803723 790477 779024 769768 762500 756468 750915 745452 740161 735337 731015
58515 731015 726842 722584 718437 714644 711168 708039 705526 703579 701664 699693 698544 698898 700068 700815 700880
58500 700880 700784 700461 699279 697419 696176 696647 698802 701976 705588 709311 713268 718257 725212 734235 744578
58485 744578 755670 767721 781339 796883 814163 832418 850756 868989 887741 907278 926557
58474 926557 943964 958581 970073 977743 980706 978853 972885 963508 951505 938494 926581 916930 909313
58461 909313 903205 898810 896941 898451 903800 912660 923988 936914 951380 967294 983373 997590 1008633
58448A008633P474L371j593o680j0731j3515j5524j6862j7244j6614j5125j2845
58436H92745j0157p905o486n284l599j638L3J452L007M623N936O906P706Q258
58422H95597Q352P855O584M415J717q44l149n637q228j0127j0905j0992j0757
58409H63881j0017q808p728p030o257n241m522m319m054l367k606j882o82R75
58395G98343K144K377K498L242M181M651M745M677M248L680L842M815N362M684
58381H53489L685L531L968M061L664L245L056L314M355N845O845P295Q360J0522
58367I25235J2526J3174J3033J3260J3845J4127J4093J4110J4146J4085J4059
58356A075693J3757J2400J0024P688N789L582J023m71n7J199J980K335K645K684
$$ plain form
58448 1008633 1016107 1019478 1017885 1011205 1000474 986959 971435 954573 937329 920715 905590 892745
58436 892745 882588 874683 868197 862913 859314 857676 857709 859161 862168 866791 872727 879633 887339 895597
58422 895597 903949 911804 918388 922803 924520 923676 920527 914890 906662 896535 885630 874638 863881
58409 863881 853864 845056 837328 830298 824041 818800 814278 809959 805905 802538 799932 798050 797368 798343
58395 798343 800487 802864 805362 808604 812785 817436 822181 826858 831106 834786 838628 843443 848805 853489
58381 853489 857174 860705 864673 868734 872398 875643 878699 882013 886368 892213 899058 906353 914713 925235
58367 925235 937761 950935 963968 977228 991073 1005200 1019293 1033403 1047549 1061634 1075693
58356 1075693 1089450 1101850 1111874 1119562 1125351 1128933 1129956 1129485 1129428 1130627 1132607 1134942 1137587 1140271
58342A140271K741M048O828R475J0832J1709J2961J3965J4339J5217J7167J8678
58330A278231J8504J7684J7403J6750J4545J1683R418P096L878J073L11P86P89
58317A398151O64J701L403M372M859N916P140P683Q431J0559J2921J3511J2661
58304A491972J2257J2614J2662J2385J2600J3088J3292J4053J6209J8451J9093
58293A648676J8936J9823K1399K2050K1999K2597K3501K3537K3502K4990K7191
58282A898201K7946K7418K7649K9086L0486L1807L4012L6480L7679L8028L9239
58271B258031M1237M2680M3947M6484M9643N1383N1821N3041N5676N8458O0786
58260B813187O2911O4263O4335O4466O5905O7309O7065O6661O8312P0858P1906
$$ plain form
58342 1140271 1143012 1147060 1153888 1163363 1174195 1185904 1198865 1212830 1227169 1242386 1259553 1278231
58330 1278231 1296735 1314419 1331822 1348572 1363117 1374800 1384218 1391314 1395192 1396265 1396576 1397362 1398151
58317 1398151 1398815 1400516 1403919 1408291 1413150 1419066 1426206 1433889 1442320 1452879 1465800 1479311 1491972
58304 1491972 1504229 1516843 1529505 1541890 1554490 1567578 1580870 1594923 1611132 1629583 1648676
58293 1648676 1667612 1687435 1708834 1730884 1752883 1775480 1798981 1822518 1846020 1871010 1898201
58282 1898201 1926147 1953565 1981214 2010300 2040786 2072593 2106605 2143085 2180764 2218792 2258031
58271 2258031 2299268 2341948 2385895 2432379 2482022 2533405 2585226 2638267 2693943 2752401 2813187
58260 2813187 2876098 2940361 3004696 3069162 3135067 3202376 3269441 3336102 3404414 3475272 3547178
58249C547178P2538P5585Q0522Q4663Q8347R4173J01852J08676J14533J21694
58239D489761J30114J37771J45102J54275J64659J74026J83587J96561K12260
58230E988116K27115K41136K57763K77671K98378L19747L44131L71404L99661
58221H725122M30367M66855N08465N52359O00177O56322P21015P92250Q73237
58212A4326169R70073J083701J212865J363510J546411J767723K032479K355824
58204B6658755K760166L264039L885470M650353N578015O659098P869164R211275
58196G0536335J0730897J2485454J4512026J6821665J9405019K2239798K5292386
58189A92023580K8457557L1406055L3473477L3791714L1633835K6681215J9040492
$$ plain form
58249 3547178 3619716 3695301 3775823 3860486 3948833 4043006 4144858 4253534 4368067 4489761
58239 4489761 4619875 4757646 4902748 5057023 5221682 5395708 5579295 5775856 5988116
58230 5988116 6215231 6456367 6714130 6991801 7290179 7609926 7954057 8325461 8725122
58221 8725122 9155489 9622344 10130809 10683168 11283345 11939667 12660682 13452932 14326169
58212 14326169 15296242 16379943 17592808 18956318 20502729 22270452 24302931 26658755
58204 26658755 29418921 32682960 36568430 41218783 46796798 53455896 61325060 70536335
58196 70536335 81267232 93752686 108264712 125086377 144491396 166731194 192023580
58189 192023580 220481137 251887192 285360669 319152383 350786218 377467433 396507925
58182C96507925R192619j919943j2844313k1951332k8091471l1054357l1457738
58175B78381390l0248428k8258191k6021136k3774006k1540921j9273381j6979347
58168A12285980j4748493j2683471j0841630r238801p871089o717472n743146
58161D4441878m917114m220382l635453l141339k723085k374155k085207j840690
58153A9504453j629612j449807j298522j167892j052451r52368q66275p88585
58145A0298941p16350o51467n93910n39752m87844m41548m01785l64965l29843
58136E771477k99983k77113k57956k39918k24311k11743j99635j86684j74995
58127C699139j65527j55954j45062j34989j27173j20023j12408j05554r9948r4016
$$ plain form
58182 396507925 405700544 403780601 390936288 368984956 340893485 309839128 278381390
58175 278381390 248132962 219874771 193853635 170079629 148538708 129265327 112285980
58168 112285980 97537487 84854016 74012386 64773585 56902496 50185024 44441878
58161 44441878 39524764 35304382 31668929 28527590 25804505 23430350 21345143 19504453
58153 19504453 17874841 16425034 15126512 13958620 12906169 11953801 11087526 10298941
58145 10298941 9582591 8931124 8337214 7797462 7309618 6868070 6466285 6101320 5771477
58136 5771477 5471494 5194381 4936425 4696507 4472196 4260453 4060818 3874134 3699139
58127 3699139 3533612 3377658 3232596 3097607 2970434 2850411 2738003 2632449 2532501 2438485
58117B438485q7462q2217p8657p4446o8531o2859n8878n5660n2637n0764m9833
58106A716541m8025m5257m3607m3404m2369l9759l7754l7434l6871l4776l2603
58095A274682l1461l0141k7936k6264k5766k4717k2169j9843j9049j8440j6766
58084A012130j5283j5416j6305j6700j7145j8373j9408j9194j8411j8062j7792
58073H20041j7134j6746j7038j7104j6338j5599j5555j5484j4810j4156j3688
58062F46389j2235r348o564n317n140n126n550o683p648p879q258r396j0190r467
58048E37588p877o700o009n234m521m261m265m383m943n700n594m490l861m659
58034D65091n808n916n282n028n412o146p314q727r344q557p218o399o037n736
$$ plain form
58117 2438485 2351023 2268806 2190149 2115703 2047172 1984313 1925435 1869775 1817138 1766374 1716541
58106 1716541 1668516 1623259 1579652 1536248 1493879 1454120 1416366 1378932 1342061 1307285 1274682
58095 1274682 1243221 1213080 1185144 1158880 1133114 1108397 1086228 1066385 1047336 1028896 1012130
58084 1012130 996847 981431 965126 948426 931281 912908 893500 874306 855895 837833 820041
58073 820041 802907 786161 769123 752019 735681 720082 704527 689043 674233 660077 646389
58062 646389 634154 624806 618242 612925 607785 602659 597109 590426 582778 574899 566641 557245 547055 537588
58048 537588 529711 523011 517002 511768 507247 502986 498721 494338 489395 483695 478101 473611 469750 465091
58034 465091 459283 453367 448085 443057 437645 431499 424185 415458 406114 397557 390339 383940 377903 372167
58020C72167n825o476o740n756m145l111k817k627k341k167k043j802j566j314
58006C23437o82K75Q70P69M02j6p84j607j454k39N83l2j367k380l162l967m061
57989C06585k994j883k019k907l058k131j058n77o95j223j779j753j107o59p51
57974B81991m78Q39K260K497J882J787K557L254L126K245R95r2k97M75J163P14
57958C04918n52j594k170k740l283l440l458l874m377m134l197k525k512k513
57944B64549j932r77n6Q17J786K889M137N496O655P260P418P578P902Q101P843
57929C29466P017N693M006K024l42l050n456o670o597o106n974o122o237o455
57915B95197o883p128o834o213n506m498l115j897j193m84O91J699J591M91o94
$$ plain form
58020 372167 366342 359866 353126 347370 343225 340114 337297 334670 332329 330162 328119 326317 324751 323437
58006 323437 322755 323030 323900 324669 325071 325055 324271 322664 321210 320971 321554 321522 320155 317775 314613 310646 306585
57989 306585 303591 301708 299689 296782 293724 291593 290535 289958 289263 288040 286261 284508 283401 282742 281991
57974 281991 281513 282352 284612 287109 288991 290778 293335 296589 299715 301960 302955 302863 302566 303041 304204 304918
57958 304918 304366 302772 300602 297862 294579 291139 287681 283807 279430 275296 272099 269574 267062 264549
57944 264549 262617 261640 261584 262401 264187 267076 271213 276709 283364 290624 298042 305620 313522 321623 329466
57929 329466 336483 342176 346182 348206 347864 344814 339358 332688 326091 319985 314011 307889 301652 295197
57915 295197 288314 281186 274352 268139 262633 258135 255020 253123 251930 251446 252137 253836 255427 255918 255224
57900B55224j625k563l342l329k542j851j786j848j270p2R44J106O48O15J765
57885B40074L583M747M660L996L474K977K306J993K456L004K674J622P71M24K32
57870B78993K96J148K588L642L855L767L857L822L248K323J481Q16K87P5L76R95
57854C11569J440J420J109R44J150J432J306P29J36k37o64j321j850j918j765
57839C13480j770j854j822j902k320k690k485j863j334q31R5J275J925J795J505
57824C01204J628K051K443K819L282L636L570K946J859O02l98q85j094j523k406
57809C19734l591m783n630n863n740o109p447q981r424q527p275o450n773m663
57795B29478l193j937j260j166j476j843j821j256m34K74P50R35O65jn21k46R31
$$ plain form
57900 255224 253599 251036 247694 244365 241823 239972 238186 236338 235068 234996 235940 237046 237694 238309 240074
57885 240074 243657 248404 253064 257060 260534 263511 265817 267810 270266 273270 275944 277566 278337 278761 278993
57870 278993 279289 280437 283025 286667 290522 294289 298146 301968 305216 307539 309020 309836 310123 310198 310574 311569
57854 311569 313009 314429 315538 316482 317632 319064 320370 321099 321235 320998 320334 319013 317163 315245 313480
57839 313480 311710 309856 308034 306132 303812 301122 298637 296774 295440 294609 294704 295979 297904 299699 301204
57824 301204 302832 304883 307326 310145 313427 317063 320633 323579 325438 326040 325642 324757 323663 322140 319734
57809 319734 316143 311360 305730 299867 294127 288018 280571 271590 262166 253639 246364 239914 234141 229478
57795 229478 226285 224348 223088 221922 220446 218603 216782 215526 215092 215366 216116 217051 217716 217715 217194 216948 217879
57778B17879K485L761M444M622M570M499M413M194L746L051K075Q03o34j925k781
57763B55202l145l235l278l281l077k640k170j752j103oJ189J873J967J997K303
57748B40844K720L170L935N031N796N623M804M141L969M062M208M331M137L256
57734C00027J821M89k58m89n11m79m38m59n96q21j058j254j422j699k202k747
57718B87904k915k552k031j801j871j951j928j944k106k353k555k533k164j580
57704B57620j125r88r95q62m49K52J055J469J126M37K35O43Q81N85M81J220K231
57687B63816K591K399K349K388J909J196J420L053N264P251R295J2070J5591J9460
57673C50052K3628K8401L3905M0017M6654N3832O1313O8225P2889P3134O7109
$$ plain form
57778 217879 220364 224125 228569 233191 237761 242260 246673 250867 254613 257664 259739 260542 259908 257983 255202
57763 255202 252057 248822 245544 242263 239186 236546 234376 232624 231521 231515 232704 234577 236544 238541 240844
57748 240844 243564 246734 250669 255700 261496 267119 271923 276064 280033 284095 288303 292634 296771 300027
57734 300027 301848 302337 302079 301590 301079 300600 300162 299703 299107 298286 297228 295974 294552 292853 290651 287904
57718 287904 284989 282437 280406 278605 276734 274783 272855 270911 268805 266452 263897 261364 259200 257620
57704 257620 256495 255507 254512 253650 253201 253453 254508 255977 257103 257540 257775 258418 259299 259884 260365 261585 263816
57687 263816 266407 268806 271155 273543 275452 276648 278068 281121 286385 293636 302931 315001 330592 350052
57673 350052 373680 402081 435986 476003 522657 576489 637802 706027 778916 852050 919159
57662I19159N4085L4637J0477j5468l9336n7565o8424p2365p1100o6633o0703
57651E66764n4326m7632m0581l3765k8091k3712j9999j6564j3600j1096q598o086
57639B62714m346l891m070l858l161k719k903l187k860j842q31o81j588k771l178
57624B20828k611j882j807k366l045l542l796l660l037k189j571j387j527j788
57610A86620k029k209k436k741k748j955n70L34j5j072j616j246p05p72j368j930
57594A63542k196k324k432k350j885j180p09q42j460k109k527k790k916k703k118
57579A33001j643j795k455k999l111l056l193l495l706l713l578l326k906k379
57565I1646j953j848k034k160j864j172n55m01n53n63k82J5J43K84O41J061J250
$$ plain form
57662 919159 973244 1007881 1018358 1002890 963554 905989 837565 765200 694100 627467 566764
57651 566764 512438 464806 424225 390460 362369 338657 318658 302094 288494 277398 268800 262714
57639 262714 258368 254477 250407 246549 243388 240669 237766 234579 231719 229877 229046 228365 226777 224006 220828
57624 220828 218217 216335 214528 212162 209117 205575 201779 198119 195082 192893 191322 189935 188408 186620
57610 186620 184591 182382 179946 177205 174457 172502 171932 172266 172251 171179 169563 168317 167612 166840 165472 163542
57594 163542 161346 159022 156590 154240 152355 151175 150466 149624 148164 146055 143528 140738 137822 135119 133001
57579 133001 131358 129563 127108 124109 120998 117942 114749 111254 107548 103835 100257 96931 94025 91646
57565 91646 89693 87845 85811 83651 81787 80615 80060 79659 79106 78543 78261 78276 78419 78703 79344 80405 81655
57548H1655J217J256J494J708J642J361J160J173J167P88O1m74k29P30J567J432
57532I7708L37q14j101m91J82Q9o68j151o45M38J013O65J16J19L94J96l90m97
57514I5500J50Q92J314J939L049L700K894J279N13J037J540R15k92r26q73r45
57498A11686j550k312k802l039l193l245l100k743k275j896j822k083k464k707
57484G6455k685k307j588q60o05p74o39K34J137Q47q76k833l588k851j583r45
57468E6539j281k051k538k539k323k069j704j320j299j746k089j694p63j10j07
57453C2906l13k48o1j46m30m47l1M39N65M71N56Q64R27L92m10o83LJ211J970J623
57433C9158M17o45o83K18J100J162N30j57n28o17m54r9J02j55n48m81l4M9n33
$$ plain form
57548 81655 82872 84128 85622 87330 88972 90333 91493 92666 93833 94621 94682 94208 93979 94709 96276 97708
57532 97708 98045 97231 96130 95639 95821 95910 95242 94091 93446 93884 94897 95562 95678 95797 96191 96387 95997 95500
57514 95500 95650 96542 97856 99795 102844 106544 109438 110717 111230 112267 113807 114722 114430 113504 112631 111686
57498 111686 110136 107824 105022 101983 98790 95545 92445 89702 87427 85531 83709 81626 79162 76455
57484 76455 73770 71463 69875 69015 68410 67636 66997 67231 68368 69215 68339 65506 61918 59067 57484 56539
57468 56539 55258 53207 50669 48130 45807 43738 42034 40714 39415 37669 35580 33886 33123 33013 32906
57453 32906 32593 32345 32284 32138 31708 31261 31230 31669 32234 32705 33261 34125 35052 35444 35034 34351 34354 35565 37535 39158
57433 39158 39575 38930 38247 38465 39565 40727 41257 41100 40572 39955 39501 39402 39504 39349 38801 38320 38286 38335 37802
57414C7802j139j122o32j05M29J075J515J345P25J68j88o10j201j739k084k383
57398C1856k825l356l605l060j555L17J571J788J465J270J304J282J094Q70Q32
57383B9248J230K094K860K791K047J699K226K615J703j34j401j369p09l97p45
57368D3758j563k576l465l908l769l103k077j106p01q65q76k13O71R96P76P11
57352B2690J105J570J705J513J185R39R51J114J010N45K42M21N31m6r11j179q25
57335C2560o06q34j148j371j664j807j348n08q3l48q44j306j835k200j991j639
57319A3028k107l244l702A070h85j919k294k096j513j385j740j883j527r82n27
57304a6751l64q06j710k140j422k46J61k67m91l8M45L72O5M2J98J19k29n62o44
$$ plain form
57414 37802 36663 35541 34909 34804 35233 36308 37823 39168 39893 40061 39873 39263 38062 36323 34239 31856
57398 31856 29031 25675 22070 19010 17455 17772 19343 21131 22596 23866 25170 26452 27546 28416 29248
57383 29248 30478 32572 35432 38223 40270 41969 44195 46810 48513 48379 46978 45609 44900 44503 43758
57368 43758 42195 39619 36154 32246 28477 25374 23297 22191 21490 20625 19749 19536 20207 21203 21979 22690
57352 22690 23795 25365 27070 28583 29768 30707 31658 32772 33782 34327 34569 34990 35521 35475 34564 33385 32560
57335 32560 31954 31120 29972 28601 26937 25130 23782 23274 23191 22843 21999 20693 18858 16658 14667 13028
57319 13028 10921 7677 3975 1070 -885 -2804 -5098 -7194 -8707 -10092 -11832 -13715 -15242 -16224 -16751
57304 -16751 -17115 -17921 -19631 -21771 -23193 -23439 -23278 -23545 -24036 -24074 -23629 -23257 -23192 -23150 -22952 -22833 -23062 -23624 -24268
57285b4268l85J76P24P91L25j63k30p0j15l36l14P9N60R22J207J221M66j061k386
57266b2857k473j500o38n39o91m06K47Q19J196J453J421R83N11L69K80k72j126
57249b3223j555j172k47P42J343J094lj047r76J31J142J306R91Q57R69J062J066
57232a7520J007P60K78j75l06j18J55L24L76M73P32Q97M62n80j423j383q05n19
57214a7365o49o94m99l03Q8J133K557L437L464L227b556DJ844J728K551L429L584
57197A3140L489L853M278L974L306L382M339N081M940M602M961N817O222N815
57183G7199N199M993N019M739M244M299N210O179O185N293M538M618N271N965
57169A48951O681P751R267J0941J2407J3546J4640J6130J8152K0308K2066K3230
$$ plain form
57285 -24268 -24653 -24477 -23753 -22962 -22637 -22800 -23030 -23100 -23215 -23551 -23865 -23786 -23226 -22304 -21097 -19876 -19410 -20471 -22857
57266 -22857 -25330 -26830 -27468 -28007 -28698 -29104 -28857 -28038 -26842 -25389 -23968 -22985 -22474 -22105 -21825 -22097 -23223
57249 -23223 -24778 -25950 -26197 -25455 -24112 -23018 -23021 -24068 -25044 -24913 -23771 -22465 -21474 -20617 -19648 -18586 -17520
57232 -17520 -16513 -15753 -15475 -15650 -15956 -16074 -15919 -15595 -15219 -14746 -14014 -13117 -12655 -13235 -14658 -16041 -16846 -17365
57214 -17365 -18014 -18708 -19207 -19510 -19422 -18289 -15732 -12295 -8831 -5604 -2556 4 1848 3576 6127 9556 13140
57197 13140 16629 20482 24760 28734 32040 35422 39761 44842 49782 54384 59345 65162 71384 77199
57183 77199 82398 87391 92410 97149 101393 105692 110902 117081 123266 128559 133097 137715 142986 148951
57169 148951 155632 163383 172650 183591 195998 209544 224184 240314 258466 278774 300840 324070
57157C24070K3958K4570K5452K6741K7963K8455K8452K9115L1098L3854L6947
57146F40675M1216M7482N4633O0138O2402O1894O0241N9063N9346O0958O2827
57135A270875O4283O5863O8314P1474P4819P8209Q0856Q0450P5056O5721N6046
57124B051966M9473M7823N1473N9271O8769P8125Q7455R7257J06553J14183J20805
57113B933153J27719J34826J41915J50796J63613J80134J99478K23615K56209
57104D511458K99020L52678M20123N05812O12414P41672Q97034J080697J288827
57095A0709735J514075J751623J998375K248790K497922K746506K996777L247920
57087B9711723L503050L766059M003090M107971L947723L476391K791566K050974
$$ plain form
57157 324070 348028 372598 398050 424791 452754 481209 509661 538776 569874 603728 640675
57146 640675 681891 729373 784006 844144 906546 968440 1028681 1087744 1147090 1208048 1270875
57135 1270875 1335158 1401021 1469335 1540809 1615628 1693837 1774693 1855143 1930199 1995920 2051966
57124 2051966 2101439 2149262 2200735 2260006 2328775 2406900 2494355 2591612 2698165 2812348 2933153
57113 2933153 3060872 3195698 3337613 3488409 3652022 3832156 4031634 4255249 4511458
57104 4511458 4810478 5163156 5583279 6089091 6701505 7443177 8340211 9420908 10709735
57095 10709735 12223810 13975433 15973808 18222598 20720520 23467026 26463803 29711723
57087 29711723 33214773 36980832 40983922 45091893 49039616 52516007 55307573 57358547
57079E7358547J339264O40185p2088p58021j344194j797976k143579k418460k639937
57070D8163741k810566k931883l004549l026142k995601k915765k790825k626648
57062B5061762k434004k226299k013149j799851j592372j398173j221973j064702
57054A1311239r26696q08366p08146o23634n54825n02647m64234m33117m04534
57045E885040l77633l52522l28467l05466k84668k66277k49094k32369k16002
57036C272542j99118j80759j61994j44958j29748j14627r9361q5787p4745o4921
57026B016524n5226m5982l7142k7660j7643r401n516p212j4895k8241m4738n9762
57014A663106o9421p2784p1141o6395o0526n5144n0609m6219m1654l7470l4064
$$ plain form
57079 57358547 58697811 59337996 59265908 58507887 57163693 55365717 53222138 50803678 48163741
57070 48163741 45353175 42421292 39416743 36390601 33395000 30479235 27688410 25061762
57062 25061762 22627758 20401459 18388310 16588459 14996087 13597914 12375941 11311239
57054 11311239 10384543 9576177 8868031 8244397 7689572 7186925 6722691 6289574 5885040
57045 5885040 5507407 5154885 4826418 4520952 4236284 3970007 3720913 3488544 3272542
57036 3272542 3073424 2892665 2730671 2585713 2455965 2341338 2241977 2156190 2081445 2016524
57026 2016524 1961298 1915316 1878174 1850514 1832871 1823470 1817954 1810742 1795847 1767606 1722868 1663106
57014 1663106 1593685 1520901 1449760 1383365 1322839 1267695 1217086 1170867 1129213 1091743 1057679
57003A057679l1173k8604k6466k4560k2451k0289j8678j7662j6716j5643j4530
56992H20907j2981j0570p830n696m080k202j38J273J995K711L188K239m19l660
56978G84737o638r609j2782j5535j7305j8091j7830j6331j4129j2245j0755q720
56966F24767n780k715j12K421N296Q345J1487J4856J7916J9562J9514J8433J6260
56953G50250J1784M521m019j1670j7303k0726k1942k1308j9654j7554j5041j2275
56941F05063r635o848l059J713O223R642J2526J5586J8562K1016K3090K4459K3587
56928G41925J9165J1790L157n788j4784k2910k8639l1258l1413l0126k8028k5548
56916E57543k3101k0865j8715j6561j4484j2551j0715q966p451o356n623m800
$$ plain form
57003 1057679 1026506 997902 971436 946876 924425 904136 885458 867796 851080 835437 820907
56992 820907 807926 797356 789526 783830 779750 777548 777410 778683 780678 783389 786577 788816 788397 784737
56978 784737 778099 768490 755708 740173 722868 704777 686947 670616 656487 644242 633487 624767
56966 624767 618987 616272 616160 618581 623877 632222 643709 658565 676481 696043 715557 733990 750250
56953 750250 762034 766555 762536 750866 733563 712837 690895 669587 649933 632379 617338 605063
56941 605063 595428 588580 585521 587234 593457 603099 615625 631211 649773 670789 693879 718338 741925
56928 741925 761090 772880 776037 770249 755465 732555 703916 672658 641245 611119 583091 557543
56916 557543 534442 513577 494862 478301 463817 451266 440551 431585 424134 417778 412155 407355
56904D07355l472j928j058j167j351o01Q36K045K989M398O284P789Q702R948J2057
56889D52826J4193J5349J5696J6064J6612J6556J4862J0841M698k189p984j1764
56877E55760j3757j4319j3451j1519r434p645n590k571J425O053J0980J5691J9807
56864E31430K3889K9006L5074M0590M4430M6667M6989M3640L5219K2735Q671n233
56852I03107j8141k8746l5344l7318l5545l1293k5500j8905j1928m407L885J2507
56840F72372K0766K8676L6860M5619N4711O3725P1860P7329P7888P2111N9775
56829A281692M1242J7434r323l5123n5839o8917p4092p2877o7416n9526n0459
56818H46796m1166l2277k3743j5011n801L582J2799K1845L0607L8635M5509N0758
$$ plain form
56904 407355 403883 401955 400897 399730 398379 397778 398614 400659 403648 408046 414330 422119 430821 440769 452826
56889 452826 467019 482368 498064 514128 530740 547296 562158 572999 577697 575508 567524 555760
56877 555760 542003 527684 514233 502714 493280 485635 480045 477474 478899 484952 495932 511623 531430
56864 531430 555319 584325 619399 659989 704419 751086 798075 841715 876934 899669 908340 903107
56852 903107 884966 856220 820876 783558 748013 716720 691220 672315 660387 655980 659865 672372
56840 672372 693138 721814 758674 804293 859004 922729 994589 1071918 1149806 1221917 1281692
56829 1281692 1322934 1340368 1331045 1295922 1240083 1171166 1097074 1024197 956781 897255 846796
56818 846796 805630 773353 749610 734599 728798 732380 745179 767024 797631 836266 881775 932533
56806I32533N3012N0167M1127K6838R081j0779l0943m8087n8946o3002o2340n8905
56794G79756n3160m5467l7227k9785k3173j6785j0632n134j25N055J0588J5876
56782E89787K0263K3477K5251K4850K1343J4374M555o808j8174k7994l4947l8469
56770E97508l9084l7834l5328l1712k7494k3768k1227j9421j7424j4912j2260
56759C17044r900q019o647n651m776l986l545l523l503l166k823k938l374l559
56745B51634l235k622j974j369q68n06k50j30k39m60m52k22l09j047j921k136
56729B33894j572p71j89J52L98O00O39K92m24q88l81Q79J774J660J104Q89R65
56712B39021R69J055J442J703J339O49K65K36L04O12J242J556J001K14J67N53
$$ plain form
56806 932533 985545 1035712 1076839 1103677 1112758 1101979 1071036 1022949 964003 901001 838661 779756
56794 779756 726596 681129 643902 614117 590944 574159 563527 558393 558268 563323 573911 589787
56782 589787 610050 633527 658778 683628 704971 719345 723900 717092 698918 670924 635977 597508
56770 597508 558424 520590 485262 453550 426056 402288 381061 361640 344216 329304 317044
56759 317044 307144 299125 292478 286827 282051 278065 274520 270997 267494 264328 261505 258567 255193 251634
56745 251634 248399 245777 243803 242434 241566 241060 240810 240680 240441 239981 239529 239307 238998 237951 236030 233894
56729 233894 232322 231551 231362 231514 231912 232512 233151 233443 233019 232131 231750 232629 234403 236063 237167 238056 239021
56712 239021 239990 241045 242487 244190 245529 246178 246443 246679 246983 247595 248837 250393 251394 251608 251775 252328
56696B52328K78o00q20R6J117J305R37N67J57k96k32N72J376J473J207J312J732
56679B62509J852J507J075P61L64k63j002j627j933j847j568j464j597j564r99
56664B54204k9Q93J455J595J338P02j89r91j219o80O7J43n48r54j88J164J733
56647B58496J107J45m28p43j036j020n09M8J68j8j04k1R9K70M70M54N8n02r56
56628B55978j318j654j862j922k047k315k390j976j291p99o29n10k05K05M17K53
56612B37935n6LO01J161R67J21n37n19k19j80l25k27J29K89j16r10j443j135p8
56593B35461Q90J025N22K29N41J040J180R44O12L75K95L35K54j69o68o30J43J125
56575B43504J675J661J369J173J412K174L057L470L360L321L823M701N508O103
$$ plain form
56696 252328 252606 252006 251186 251282 252399 253704 254641 255208 255365 255069 254837 255409 256785 258258 259465 260777 262509
56679 262509 264361 265868 266943 267704 268068 267805 266803 265176 263243 261396 259828 258364 256767 255203 254204
56664 254204 254175 255068 256523 258118 259456 260158 259969 258978 257759 257079 257146 257289 256741 255787 255599 256763 258496
56647 258496 259603 259748 259320 258577 257541 256521 256012 256060 256228 256210 256106 256085 256184 256454 256924 257378 257436 256934 255978
56628 255978 254660 253006 251144 249222 247175 244860 242470 240494 239203 238404 237775 237265 237060 237265 237682 237935
56612 237935 237879 237882 238483 239644 240611 240732 240195 239676 239457 239277 238952 238725 238854 239143 239027 238117 236674 235539 235461
56593 235461 236351 237376 237898 238127 238668 239708 240888 241832 242444 242819 243114 243449 243703 243534 242866 242236 242379 243504
56575 243504 245179 246840 248209 249382 250794 252968 256025 259495 262855 266176 269999 274700 280208 286311
56561B86311O724P671Q956J0080J0291R355P900O566N134L121R48m08q95j475
56547C60279k607l651m042m070m085l896l505l464l844l824l034k423k757l223
56533C11854k734j904k180l356l616k213o74o78j971l106l410l237k814j843l42
56518B77776Q94J001o0j552k698l173k957k173j195o17o82r25p76m00m11p72p31
56501B60549n9L71j86j168j433q47l63o33j245j426r48j13O91J185J233R23N60
56484B57091L92L85L40J93R0J51K49J72kM8L54N01K56J7K29O58Q40J004J730K784
56464B67482L179K477J272J58q33j542j374l10O02N06j38m03k04l2J06N08R17
56447B72371P55J03l17r7M96J031J214Q76J93k58j91p5l87p38m82J35K93q2k46
$$ plain form
56561 286311 293035 300706 309662 319742 330033 339388 347288 353854 358988 362109 363057 362649 361754 360279
56547 360279 357672 354021 349979 345909 341824 337928 334423 330959 327115 323291 320257 317834 315077 311854
56533 311854 309120 307216 305036 301680 298064 295851 295177 294499 292528 289422 286012 282775 279961 278118 277776
56518 277776 278670 279671 279611 278059 275361 272188 269231 267058 265863 265246 264564 263639 262863 262463 262052 261280 260549
56501 260549 260490 260861 260675 259507 258074 257227 256864 256231 254986 253560 252612 252499 253190 254375 255608 256531 257091
56484 257091 257483 257868 258208 258401 258491 258642 258891 259063 259061 259109 259463 259964 260220 260237 260466 261124 261964 262968 264698 267482
56464 267482 270661 273138 274410 274568 273735 272193 270819 270509 271111 271617 271479 271076 270872 270840 270946 271454 272371
56447 272371 273126 273229 272912 272815 273311 274342 275556 276432 276625 276367 276176 276101 275714 274976 274494 274629 274922 274840 274594
56428B74594J02M41M19L69N00L97j60n43m7J049J755J609J049O59M48J25k26j88
56410B82352K68M83o8r02r76l1J057J414J122P63N47L09l1m27q71j217j123m90
56392B82179L31J083J859K620K900K478J800J317R29N39M75P86Q08K02k58J84
56376C00232R28R14L73M12J155J582J192O20M73O59J042J636J979J386K06k24
56360C14565O74J941K490K416K307K103J426N18M5K17O43Q97Q71O67N00N91R72
56343C33843J462J816J810J354P75P56J545K456K666K302K125K376K710L058L625
56328C64679M110L882L115K746L102L416L029K189J352O03J59N36J611K296J813
56313C98638O79j18l09j83J53P06J260J708K302L062L422L005K336K190K647L349
$$ plain form
56428 274594 274696 275137 275556 275925 276425 276822 276662 276119 276072 277121 278876 280485 281534 282193 282641 282766 282540 282352
56410 282352 282620 283103 283035 282133 281157 281126 282183 283597 284719 285482 286029 286338 286307 285880 285009 283792 282669 282179
56392 282179 282510 283593 285452 288072 290972 293450 295250 296567 297496 298035 298510 299296 300104 300306 300048 300232
56376 300232 301160 302074 302447 302859 304014 305596 306788 307408 307881 308540 309582 311218 313197 314583 314789 314565
56360 314565 315239 317180 319670 322086 324393 326496 327922 328440 328485 328702 329345 330242 331113 331780 332280 332871 333843
56343 333843 335305 337121 338931 340285 341060 341816 343361 345817 348483 350785 352910 355286 357996 361054 364679
56328 364679 368789 372671 375786 378532 381634 385050 388079 390268 391620 392223 392382 392918 394529 396825 398638
56313 398638 399317 399199 398890 398707 398860 399566 400826 402534 404836 407898 411320 414325 416661 418851 421498 424847
56297D24847M213N222N875N615M741M267M791N967P056P660P961Q490R609J1028
56283E17342J1968J1977J1422J1001J1092J1651J2430J3047J3251J3389J4251
56272F52821J6054J7901J8725J8587J8648J9888K2216K4866K7338K9800L2645
56261H99489L5896L9305M3011M7651N3639O0652O8274P6707Q6281R6679J07361
56250A614945J18456J30366J42715J54673J66182J77647J88361J96494K01073
56241C090912K02847K02592J99599J92437J80446J63801J42925J18506R1384O1855
56231D647304K9828l722l6342o5902r2082j15304j35124j50675j62065j70130
56221C745786j75159j76991j76098j73483j69521j63888j56619j48487j40167
$$ plain form
56297 424847 429060 434282 440157 445772 450513 454780 459571 465538 472594 480254 488215 496705 506314 517342
56283 517342 529310 541287 552709 563710 574802 586453 598883 611930 625181 638570 652821
56272 652821 668875 686776 705501 724088 742736 762624 784840 809706 837044 866844 899489
56261 899489 935385 974690 1017701 1065352 1118991 1179643 1247917 1324624 1410905 1507584 1614945
56250 1614945 1733401 1863767 2006482 2161155 2327337 2504984 2693345 2889839 3090912
56241 3090912 3293759 3496351 3695950 3888387 4068833 4232634 4375559 4494065 4585449 4647304
56231 4647304 4677132 4673410 4637068 4571166 4479084 4363780 4228656 4077981 3915916 3745786
56221 3745786 3570627 3393636 3217538 3044055 2874534 2710646 2554027 2405540 2265373
56212B265373j31748j23203j14861j07197j00394r4092q7524q0213p2687o6046
56202A287408o0617n5623n0518m5890m2418l9667l6700l3380l0166k7070k3770
56191H41589k0542j8102j6594j5464j4269j2985j1611j0163q992q438q194p552
56179F88683o315n026m262m066m038l659k726j628r26n06K87J457K065J703J453
56164F62496K488M334N553N745N760O203O811P376Q208R470J0884J2248J3654
56151G61230J5118J6599J8509K1491K5474K9508L2826L5742L9261M4017M9718
56140A089493N5457O0565O5167O9810P4486P8323Q0299P9920P7103P1987O5189
56129A867799N7705N0279M3265L7229L2807K9495K5454J9200J0996K062o716j4696
$$ plain form
56212 2265373 2133625 2010422 1895561 1788364 1687970 1593878 1506354 1426141 1353454 1287408
56202 1287408 1226791 1171168 1120650 1074760 1032342 992675 955975 922595 892429 865359 841589
56191 841589 821047 802945 786351 770887 756618 743633 732022 721859 712867 704429 696235 688683
56179 688683 682368 677342 673080 669014 664976 661317 658591 656963 656037 655531 655818 657275 659340 661043 662496
56164 662496 664984 669318 674871 680616 686376 692579 699390 706766 714974 724444 735328 747576 761230
56151 761230 776348 792947 811456 832947 858421 887929 920755 956497 995758 1039775 1089493
56140 1089493 1144950 1205515 1270682 1340492 1414978 1493301 1573600 1653520 1730623 1802610 1867799
56129 1867799 1925504 1975783 2019048 2056277 2089084 2118579 2144033 2163233 2174229 2176291 2169575 2154879
56117B154879k1119k5958l0556l6348m3307n0505n7607o4707p1145p5655p7577
56106A600395p7028p4095o8833o1910n4405m7031m0148l4234k9525k5483k1370
56095A066333j7185j3400j0149p384n353m120l007j359N22J931K806L507M052
56082A017194M393M922N871O807P463Q412J0050J1619J2265J2264J2284J2349
56070A125893J2527J3633J5889J7889J8410J8260J8717J9169J8210J6275J5027
56059A309899J4700J4181J3315J2990J3102J2623J1650J1367J1973J2551J2987
56048A451338J4067J5641J6674J7163J8134J9667K0839K1633K2890K4365K4961
56037A667372K5021K6168K8574L0637L1745L3111L5275L7012L7581L7981L9084
$$ plain form
56117 2154879 2133760 2107802 2077246 2040898 1997591 1947086 1889479 1824772 1753627 1677972 1600395
56106 1600395 1523367 1449272 1380439 1318529 1264124 1217093 1176945 1142711 1113186 1087703 1066333
56095 1066333 1049148 1035748 1025599 1018215 1012862 1008742 1005735 1004376 1004898 1006829 1009635 1013142 1017194
56082 1017194 1021587 1026509 1032380 1039187 1046650 1055062 1065112 1076731 1088996 1101260 1113544 1125893
56070 1125893 1138420 1152053 1167942 1185831 1204241 1222501 1241218 1260387 1278597 1294872 1309899
56059 1309899 1324599 1338780 1352095 1365085 1378187 1390810 1402460 1413827 1425800 1438351 1451338
56048 1451338 1465405 1481046 1497720 1514883 1533017 1552684 1573523 1595156 1618046 1642411 1667372
56037 1667372 1692393 1718561 1747135 1777772 1809517 1842628 1877903 1914915 1952496 1990477 2029561
56026B029561M0297M1027M1830M3223M4745M5976M7237M8792N0528N2688N5658
56015B541562N8995O1958O4775O7961P0874P2748P4631P8069Q2457Q6051Q9117
56004C349198R3354R8637J03320J07564J13198J20287J27081J33488J41251J50504
55994D537882J59594J68672J79773J92921K05903K18627K33698K51852K70691
55985F419613K89155L09352L32777L58549L86543M18446M54624M93737N36453
55976I999249N85570O41915P04613P75950Q60927R61577J077332J211710J372774
55967A8191617J566792J799010K081936K435464K878267L427751M107660M940870
55959D1429367N929029P053385Q307359R721879J1350941J3236709J5389728J7792444
$$ plain form
56026 2029561 2069858 2110885 2152715 2195938 2240683 2286659 2333896 2382688 2433216 2485904 2541562
56015 2541562 2600557 2662515 2727290 2795251 2866125 2938873 3013504 3091573 3174030 3260081 3349198
56004 3349198 3442552 3541189 3644509 3752073 3865271 3985558 4112639 4246127 4387378 4537882
55994 4537882 4697476 4866148 5045921 5238842 5444745 5663372 5897070 6148922 6419613
55985 6419613 6708768 7018120 7350897 7709446 8095989 8514435 8969059 9462796 9999249
55976 9999249 10584819 11226734 11931347 12707297 13568224 14529801 15607133 16818843 18191617
55967 18191617 19758409 21557419 23639355 26074819 28953086 32380837 36488497 41429367
55959 41429367 47358396 54411781 62719140 72441019 83791960 97028669 112418397 130210841
55951A30210841K0417828K3244836K6219194K9120082L1417268L2302012L0951201
55944C23883262K6840882J9897897J0514617m20425j1520267k1160519k8036534
55937C19998913l1660871l2412007l1148454k8748091k5861220k2881497k0007237
55930A27279536j7319850j4856979j2651385j0725343r075405p678829o508867
55923D8462878n537228m731233m059623l499136l031380k638298k305223k023706
55915B0637051j786907j585649j411791j261345j131361j017478r16838q29383
55907A0696299p53888o86410o24467n68935n19946m74892m32368l94155l61192
55898E880046l31357l03265k78443k57572k38227k18694k00635j85622j72214
$$ plain form
55951 130210841 150628669 173873505 200092699 229212781 260630049 292932061 323883262
55944 323883262 350724144 370622041 381136658 380716233 369195966 348035447 319998913
55937 319998913 288338042 255926035 224777581 196029490 170168270 147286773 127279536
55930 127279536 109959686 95102707 82451322 71725979 62650574 54971745 48462878
55923 48462878 42925650 38194417 34134794 30635658 27604278 24965980 22660757 20637051
55915 20637051 18850144 17264495 15852704 14591359 13459998 12442520 11525682 10696299
55907 10696299 9942411 9256001 8631534 8062599 7542653 7067761 6635393 6241238 5880046
55898 5880046 5548689 5245424 4966981 4709409 4471182 4252488 4051853 3866231 3694017
55889C694017j58885j46754j37009j28315j19160j10305j02647r5095q6890p9662
55879B529295p5057p2226o9651o7453o6080o4733o2974o1948o2195o2166o0603
55868A804209n8494n6917n4983n1707m8015m5020m2082l8540l5578l4333l3701
55857A304839l2059k9800k8237k7332k6368k5618k5502k5209k3969k2618k2266
55846A015861k2464k2315k2259k2989k3624k2762k0625j8521j6970j5827j5377
55835G92128j5713j5791j4684j3128j2384j2239j1652j0631r956r576q920q328
55823F49126q642r603j0104r883r680r799r679q897p635o195m771l653k938k236
55809E45411j119L58J953L583N023N920O457P252Q220Q452P759P189P302P048
$$ plain form
55889 3694017 3535132 3388378 3251369 3123054 3003894 2893589 2790942 2695847 2608957 2529295
55879 2529295 2454238 2382012 2312361 2244908 2178828 2114095 2051121 1989173 1926978 1864812 1804209
55868 1804209 1745715 1688798 1633815 1582108 1534093 1489073 1446991 1408451 1372873 1338540 1304839
55857 1304839 1272780 1242980 1214743 1187411 1161043 1135425 1109923 1084714 1060745 1038127 1015861
55846 1015861 993397 971082 948823 925834 902210 879448 858823 840302 823332 807505 792128
55835 792128 776415 760624 745940 732812 720428 708189 696537 685906 675950 666374 657454 649126
55823 649126 640484 630881 620777 610894 601214 591415 581736 572839 565204 559009 554238 550585 547647 545411
55809 545411 544292 544650 546603 550186 555209 561129 567586 574838 583058 591510 599269 606458 613760 620808
55795F20808N333K599j90l114o604j0031j2293j3281j3621j3450j2509j1002r373
55782E23272p693o072n108n074n288n074m634m172l067r48J425L545O359J0545
55768D98016J4418J5362J2903Q724L982j585p890j3627j7628j9780k0336j9478
55756D53081j7889j6633j5982j5233j3985j2796j2210j1902j1220j0036q682p379
55744B99134o050m504k766j262m27q3M09J096J190K44j088j989k527l011l155
55729B75211k788k722l714m976m996l644k324k055k488k848k802k217r73O53K081
55714B39398L034L610L820L727L844M651N737O072N182L457J455m44j846k569
55700B79128l046l883n015n913o413o675o536n739m615l746l070k129j033k70
$$ plain form
55795 620808 626141 628740 628550 625436 618832 608801 596508 583227 569606 556156 543647 532645 523272
55782 523272 515579 509507 504399 499325 494037 488963 484329 480157 477090 476142 477567 481112 487471 498016
55768 498016 512434 527796 540699 549423 553405 551820 543930 530303 512675 492895 472559 453081
55756 453081 435192 418559 402577 387344 373359 360563 348353 336451 325231 315195 306513 299134
55744 299134 293084 288580 285814 284552 284125 284042 284451 285547 286737 286981 285893 283904 281377 278366 275211
55729 275211 272423 269701 265987 261011 256015 252371 250047 247992 245504 242656 239854 237637 236664 237317 239398
55714 239398 242432 246042 249862 253589 257433 262084 267821 273893 279075 282532 283987 283543 281697 279128
55700 279128 276082 272199 267184 261271 254858 248183 241647 235908 231293 227547 224477 222348 221315 221045
55686B21045L05J248K298K566K101K075L044M072M176L693L449L332K610J279
55672B57293K12QK85K27m95j461j998j820j185m55K92J110J921K601L155L508
55656B63198L444L027K769K974L186K835K054J315N53o12j962k812l070l444m456
55641B68999n840p091q022q608q726q334p604o756n935n228m608l985l449l238
55627A81575l238k939k198j571j400j180n32j43p83j824j938j111p16j460k472
55612A58070k725k289j768j341r81r06j169j285p95R9P94R28N42p4n47p08p88
55595A45057j053j316j259j146j581k490l025k651j782j028l90M19J262J636J249
55580A31902L69l56l67L41J204J704J802J620J104L59q8O7L80L97N19J273K167
$$ plain form
55686 221045 221350 222598 224896 227462 229563 231638 234682 238754 242930 246623 250072 253404 256014 257293
55672 257293 257505 257513 257798 258025 257530 256069 254071 252251 251066 250611 250903 252013 253934 256535 259690 263198
55656 263198 266642 269669 272438 275412 278598 281433 283487 284802 285355 284743 282781 279969 276899 273455 268999
55641 268999 263159 256068 248046 239438 230712 222378 214774 208018 202083 196855 192247 188262 184813 181575
55627 181575 178337 175398 173200 171629 170229 169049 168517 168374 167591 165767 163829 162718 162002 160542 158070
55612 158070 155345 153056 151288 149947 148966 148060 146891 145606 144811 144910 145704 146632 147174 147100 146553 145845 145057
55595 145057 144004 142688 141429 140283 138702 136212 133187 130536 128754 127726 127336 127755 129017 130653 131902
55580 131902 132271 131915 131548 131889 133093 134797 136599 138219 139323 139682 139594 139661 140041 140438 140957 142230 144397
55563A44397K231J555J139J267J170M25m02r08j485k415l129k989k062q01M48
55548A38441J285J321P46K20M3Q7N36J672K788K656J420P88J637K712K604J747
55532A60703J332J255N40q18j901k371k640k832k713k591l076l957m278l692k836
55517A30125k305k031j808j652j473j077o14m47n02l83k10o00j586k244j810o59
55501A10724J89J96k97n74j35R23J913K103J456O74L64M10K51l52j006j088l84
55484A15367O73J404J535J360J187R03L29k49k83K90R16J114R36O59K99k60r42
55467A25238j472j737j862j936j854j512j022n67j55K13K51m01j448j895j074
55452A08767M63J510J548J052N86J95k28n01m26j30Q4L5l72j109j806j912j265
$$ plain form
55563 144397 146628 148183 149322 150589 151759 152184 151782 150874 149389 146974 143845 140856 138794 137993 138441
55548 138441 139726 141047 141793 142013 142056 142143 142679 144351 147139 149795 151215 152003 153640 156352 158956 160703
55532 160703 162035 163290 163830 163012 161111 158740 156100 153268 150555 147964 144888 140931 136653 132961 130125
55517 130125 127820 125789 123981 122329 120856 119779 119165 118718 118216 117833 117623 117023 115437 113193 111383 110724
55501 110724 110913 111109 110812 110238 110103 111026 112939 115042 116498 117172 117536 117946 118197 117845 116839 115751 115367
55484 115367 116040 117444 118979 120339 121526 122429 122758 122509 122226 122516 123432 124546 125482 126141 126440 126180 125238
55467 125238 123766 122029 120167 118231 116377 114865 113843 113276 113121 113334 113585 113184 111736 109841 108767
55452 108767 109230 110740 112288 113340 113926 114121 113893 113392 112966 112836 112920 112955 112583 111474 109668 107756 106491
55435A06491k79O14J384J996K108J480N12j25k64k87m47m90q8N75Q70L93m78r23
55417A13042o18j01M2JK86P13N34m07j323j482r44j63N62R22N94k38q32p67m24
55398A09397k17j0K71J00q32j743j578m59N19Q11R31J350J700J383N15j36JP43
55380A12746J315J143M54kQ6K05j43o73p76m95m03o47p36l87m2k80j049j707j675
55361A06934r22R7Q41J059Q72N21J58j46l66n51o57l80M78J479J769J096J55k95
55343A12142k85l35o65j099j410j390r02k55j14o21r90n21L64P42M86K25K24J48
55325A05744o3n3J69O4m47o17K6Q13P79Jn46l29J57K34k9o8K69N16L18l4p0J85
55303A07019L96N93J083J711J815J159K97k71o86j071r30R3J309J613Q72k6l64
$$ plain form
55435 106491 106212 106826 108210 110206 112314 113794 114306 114181 113917 113630 113183 112693 112605 113180 114050 114443 113965 113042
55417 113042 112424 112323 112365 112366 112652 113365 113899 113492 112169 110687 109743 109580 110142 111064 111658 111420 110588 109821 109397
55398 109397 109180 109170 109441 109541 108709 106966 105388 104929 105448 106259 107190 108540 110240 111623 112138 112002 112003 112746
55380 112746 114061 115204 115658 115656 115742 115947 115804 115131 114355 113860 113457 112810 112074 111687 111645 111365 110316 108609 106934
55361 106934 106012 106109 106950 108009 108881 109402 109560 109414 109048 108497 107840 107460 107938 109417 111186 112282 112437 112142
55343 112142 111857 111522 110857 109758 108348 106958 106056 105801 105687 105066 104076 103555 103919 104661 105147 105372 105596 105744
55325 105744 105681 105628 105797 105861 105414 104797 104823 105636 106415 106416 105870 105541 105698 105932 105903 105835 106104 106620 106938 106904 106834 107019
55303 107019 107415 108008 109091 110802 112617 113776 114073 113802 113116 112045 111115 111208 112517 114130 115002 114976 114612
55286A14612k22kM0j88n33n95k52o1m79r57n69M91R96M17l46l31J87L65O1k09
55266A12425k83n74j328k140k281j373K14J534J808J110K09k36j18L79R82J195
55250A11523N52o70j378q20M67J239R69K96J06N39R69P53j13j047j510j508j377
55233A08990j159n48M78J324J391Q63N12P15R54M74p28j805j957j244l62K38P01
55216A08837J278J795J774R53l54j342j220J4J263J260L4r76o18N56J070L25q52
55199A13797j381j020l44p3m79j148j352q12J4O07R56J169R71K66k57J11R21J025
55181A12971K00n74n50p4J96J34p0k84k12M29J258J371N72k40l59k20n23j065
55163A12960j218r81p57m93J22P88Q61M41L43R13J557J663J330R10M26j85o64
$$ plain form
55286 114612 114390 114388 114428 114240 113707 113112 112860 112799 112320 111363 110794 111285 112281 112698 112352 112021 112208 112573 112634 112425
55266 112425 112142 111568 110240 108100 105819 104446 104660 106194 108002 109112 109321 109085 108967 109346 110328 111523
55250 111523 112075 111405 110027 109207 109674 110913 111882 112178 112284 112823 113792 114545 114432 113385 111875 110367 108990
55233 108990 107831 107283 107761 109085 110476 111339 111851 112566 113520 113994 113266 111461 109504 108260 107898 108136 108837
55216 108837 110115 111910 113684 114637 114283 112941 111721 111735 112998 114258 114292 113316 112698 113254 114324 114649 113797
55199 113797 112416 111396 111052 110979 110500 109352 108000 107188 107202 107809 108765 109934 110905 111171 110914 111025 111946 112971
55181 112971 113171 112597 112047 111973 112169 112303 112233 111949 111737 112166 113424 114795 115367 115127 114768 114548 114025 112960
55163 112960 111742 110761 110004 109511 109633 110421 111282 111723 112066 112979 114536 116199 117529 118439 118865 118680 118016
55146A18016p84p90j048j353j150m38N1j23l70J40J209J764J340P10O86R75Q05
55129A19640K07j52j68l89r12j053m19M83J034J168R45J67r95j634j164k37Q6
55112A16607j61o5O56J224J026N01N03J196J988K268J865J028J85k91l21j75k04
55095A27830m34m90k7P08R94M92k11k50M26J041J098R31J018J258J275R72M91
55078A37122r4o22p50m10k5J05L01R26J591J551O87m33j298j691j433n19M77Q15
55060A36300M55k2l69q62j497j762j480j185j282j444j273r97r60r16n08q5k83
55043A21830r19j095m69L05N56M28L92M46K95l3k43k21o5K74Q55J296R78r3j036
55024A23481r74%J007J370J118O87M19L51K42k24j047j717j646q53nL04J24q2
$$ plain form
55146 118016 117232 116442 115394 114041 112891 112453 112504 112381 112011 112151 113360 115124 116464 117174 117860 118835 119640
55129 119640 119847 119695 119527 119138 118226 117173 116754 117237 118271 119439 120384 120551 119556 117922 116758 116521 116607
55112 116607 116446 116381 117037 118261 119287 119788 120291 121487 123475 125743 127608 128636 128821 128530 128209 128034 127830
55095 127830 127396 126906 126879 127587 128581 129073 128862 128612 129038 130079 131177 132108 133126 134384 135659 136631 137122
55078 137122 137028 136406 135656 135246 135221 135326 135627 136553 138144 139695 140382 139949 138651 136960 135527 135008 135485 136300
55060 136300 136755 136733 136364 135502 134005 132243 130763 129578 128296 126852 125579 124582 123622 122706 122198 122113 121830
55043 121830 120911 119816 119347 119652 120208 120636 121028 121474 121769 121736 121493 121272 121207 121481 122336 123632 124610 124517 123481
55024 123481 122507 122507 123514 124884 126002 126689 127108 127459 127701 127477 126430 124713 123067 122214 122209 122513 122637 122555
55006A22555K0M59J072J580J694J382R51P27O84N31J14m11p07m25N03J581J864
54989A34174P99j008k199k018r76o7L30M36L39j23o99o92J48J091J268P22J13
54972A31638k64n21m04N79K077K811K107Q62L20M42K90l28n70J8P80R31O05M30
54954A41803N63O34L97K2l01o41j159j700j801j210l20K20L55O51J289J609J106
54937A41517L60K52O50P27M43O02J436K156K242K201K581L086L305L603M522N809
54921A75492O773P279P738Q352Q867Q927Q256O712M488K019n21l251n825p301
54907B28005p304o720o618o932o892o343n758n307m772m189l732l103j908o26
54893A57801k38p33r27l4J328K049J803J090N72P75J923L612M964N517N758O487
$$ plain form
55006 122555 122575 123034 124106 125686 127380 128762 129713 130440 131124 131655 131769 131358 130651 130226 130729 132310 134174
54989 134174 134973 133965 131766 129748 128772 128705 129035 129471 129810 129687 128988 128296 128444 129535 130803 131525 131638
54972 131638 131374 130853 130449 131028 133105 135916 138023 138885 139205 139647 139937 139609 139039 139057 139837 140768 141373 141803
54954 141803 142366 143000 143397 143419 143118 142477 141318 139618 137817 136607 136287 136507 136862 137513 138802 140411 141517
54937 141517 141877 142129 142779 143506 143949 144551 145987 148143 150385 152586 155167 158253 161558 165161 169683 175492
54921 175492 182265 189544 197282 205634 214501 223428 231684 238396 242884 244903 244382 241131 235306 228005
54907 228005 220701 213981 207363 200431 193539 187196 181438 176131 171359 167170 163438 160335 158427 157801
54893 157801 157563 156830 155903 155869 157197 159246 161049 162139 162711 163486 165409 169021 173985 179502 185260 191747
54877A91747P826R103R484Q601O772M808L392K519J604J26j986m431o661q020
54863B24884q235p814p483p257o586n471m730m854n238m998m106l202k613k210
54849A50087j940j902j930j632j016o52r68j659k006j689j037n17j94J40M78N44
54833A34107K73K0L8J25J04L13J034J676J280j13j299j418q92n29l07L45J440
54816A36197K335K504J882O30q40j771j633q93n85r80j224n55O56J496J710J745
54800A40674J829J650J049M68L59N21M37R2m3J71J87m49j355j727j344p02j77
54783A41640M19J273K034K199J835J493J476J574J632J950K852M051M822M900
54769A74150M874N495O710P711P920P635P496P563P289O305M833L215J331j130
$$ plain form
54877 191747 199573 208676 218160 226761 233533 238341 241733 244252 245856 245982 243996 239565 232904 224884
54863 224884 216649 208835 201352 194095 187509 182038 177308 172454 167216 162218 158112 154910 152297 150087
54849 150087 148147 146245 144315 142683 141667 141015 140047 138388 136382 134693 133656 133139 132945 133085 133563 134107
54833 134107 134380 134400 134438 134563 134667 134980 136014 137690 138970 138857 137558 136140 135248 134719 134412 134757 136197
54816 136197 138532 141036 142918 143548 142708 140937 139304 138411 137826 136846 135622 135067 135723 137219 138929 140674
54800 140674 142503 144153 145202 145670 146029 146550 146987 147079 147036 147207 147394 146945 145590 143863 142519 141817 141640
54783 141640 142059 143332 145366 147565 149400 150893 152369 153943 155575 157525 160377 164428 169250 174150
54769 174150 179024 184519 191229 198940 206860 214495 221991 229554 236843 243148 247981 251196 252527 251397
54755B51397l949o293p500p736p684p665p331o303m891l875l626l690l372k518
54741A74964j608j149j160j204q07J09J159J837J968J796J668J756K066K504K841
54726A86740K910K915L360M400N499O017N931N723N659N510M879L573J647n21
54712B44242k319l416m279n720p806r530r825q712p136n896m977l929k671j664
54698A66362j405j845k362k315j524l51N48N77l64j631k280k003j440j295j425
54683A47247j153m02P2l23j234j805j623r93m48k53l10l60k39k6J00R2L3m3j81
54664A38151l32l29q7K82O03Q00Q61P44L94j28n74o27k14L01M16J06j37%J68q0
54644A40318n38n90j12L87N47N72O96P34M86J87J74L42L32J31M9J63J65j26m38
$$ plain form
54755 251397 247448 241155 233655 225919 218235 210570 203239 196936 192045 188170 184544 180854 177482 174964
54741 174964 173356 172207 171047 169843 169036 169145 170304 172141 174109 175905 177573 179329 181395 183899 186740
54726 186740 189650 192565 195925 200325 205824 211841 217772 223495 229154 234664 239543 243116 244763 244242
54712 244242 241923 238507 234228 228508 220702 211172 201347 192635 185499 179603 174626 170697 168026 166362
54698 166362 164957 163112 160750 158435 156911 156560 157108 157685 157321 155690 153410 151407 149967 148672 147247
54683 147247 146094 145692 145764 145441 144207 142402 140779 139786 139338 139085 138775 138415 138176 138150 138250 138342 138375 138332 138151
54664 138151 137819 137490 137403 137685 138288 139088 139949 140693 141087 140959 140385 139758 139544 139845 140261 140367 140230 140230 140398 140318
54644 140318 139780 139190 139078 139465 140012 140584 141280 142014 142500 142687 142861 143203 143535 143666 143715 143878 144043 143917 143479
54625A43479m03RO14J308J943K063J245k33j458j832j633j434j361j244j164j219
54609A38680j039j49J189K175K444K221J524J43j427j988j175r4J65j05j21k7
54593A42416l69p49k90Q37J490J219O90M08J14l01l51J75O89O77M07L27L30J44
54575A47863p9p6Kj99p02j157j174n49N07J309J282O55K25L39O07O69O41O70O22
54556A51455M58M17N50N88M00J16l08j001j535j199j77M02L9l41J68J024J094
54539A52150L59j30K50J059J479J109J60o42n55L04Q65K88r77j814j787j325q79
54522A49914m24K21J055J784J874J044r8m17L33J028O59k94p07m75l52n41n04
54505A54100j29J1k93m38M5P79J079P31M5m88m85N1N92N81O6m84q44j078j115
$$ plain form
54625 143479 143076 143085 143699 145007 146950 149013 150258 150025 148567 146735 145102 143668 142307 141063 139899 138680
54609 138680 137641 137492 138681 140856 143300 145521 147045 147188 145761 143773 142598 142504 142669 142564 142443 142416
54593 142416 142047 141298 141008 141845 143335 144554 145244 145652 145766 145465 145114 145289 145978 146655 147062 147389 147719 147863
54575 147863 147784 147708 147710 147511 146809 145652 144478 143929 144436 145745 147027 147682 147907 148246 148853 149522 150163 150833 151455
54556 151455 151913 152330 152880 153468 153868 153984 153676 152675 151140 149941 149764 150166 150205 149864 150032 151056 152150
54539 152150 152509 152379 152629 153688 155167 156276 156436 155794 155239 155543 156408 156696 155719 153905 152118 150793 149914
54522 149914 149490 149711 150766 152550 154424 155468 155370 154953 155286 156314 156973 156679 155972 155497 155145 154604 154100
54505 154100 153971 153982 153689 153251 153296 154075 155154 155885 155930 155442 154957 155008 155600 156181 156247 155763 154919 153841 152726
54486A52726p89k16L85J125K111K834K572J444L11m01r79j420j079K29J587J999
54470A62439J619J315J447J602J412J043Q23P49N21J8m19k51N53J310J373Q93
54454A76447M11o6r49k050k477j850r70p97j238j474j168p43o41q25j056j204
54438A59350j141o97J10Q97J204R91P21Q27J137J058M27j45J5P44J255J106N47
54421A68406l5n66r94j081o77o5L07K27j93p00j018r79o44k06K35P05J177J559
54403A65458J799J853J559Q66J19k28j55OJ90O43J232J275M48n61q01k23M49Q09
54385A74738J135J573J599P71l76p98k65L93N22M94Q75J309J049L88N16J808L132
54368A88863L390K954K887L323L517L068K289J449N39k53n50l98k46k75l03l94
$$ plain form
54486 152726 151937 151721 152106 153231 155342 158176 160748 162192 162503 162102 161123 159703 158624 158853 160440 162439
54470 162439 164058 165373 166820 168422 169834 170877 171700 172449 172970 172988 172569 172318 172871 174181 175554 176447
54454 176447 176858 176792 175843 173793 171316 169466 168496 167699 166461 164987 163819 163076 162435 161610 160554 159350
54438 159350 158209 157512 157622 158519 159723 160714 161435 162262 163399 164457 164884 164739 164754 165498 166753 167859 168406
54421 168406 168371 167805 166811 165730 165053 164988 165295 165522 165329 164629 163611 162632 161988 161782 162017 162722 163899 165458
54403 165458 167257 169110 170669 171535 171654 171426 171271 171277 171467 172110 173342 174617 175065 174504 173703 173480 173929 174738
54385 174738 175873 177446 179045 179816 179440 178642 178377 178770 179292 179786 180661 181970 183019 183407 183923 185731 188863
54368 188863 192253 195207 198094 201417 204934 208002 210291 211740 212279 212026 211476 211078 210832 210557 210254 209860
54352B09860r24j839k495k457k070j887j997k137k148k032j837j603j307q25j97
54337A84105J95K5m54o95o06o25j030j607j990j943j392n94p7MK68J166K025J837
54319A78612Q74M27R38J480J317Q19M09k53j359k209k170j609j108n74R2K70l65
54302A75591p93Q9J614J960O38r28j410j065q68j074j204r24l06L97Q99R40N83
54285A74139K80M41R09J102O66p3m52k56R6J85J85M15O52M63J66N70J602K053
54267A83143J092n68j592j518q57j74K49L03K14M40R82J167O93K89O40J210J078
54250A86791M28J49K61j6p44r94l69L09K10m13q16p68n23l08k22k76k82o2J40
54231A82495q0n44o23k03J95L73P85J532J871J292M45K87P31R02M65k4o8J01n7
$$ plain form
54352 209860 208936 207097 204602 202145 200075 198188 196191 194054 191906 189874 188037 186434 185127 184302 184105
54337 184105 184300 184325 183871 183176 182570 181945 180915 179308 177318 175375 173983 173389 173312 173316 173584 174750 176775 178612
54319 178612 179486 179913 180851 182331 183648 184467 184876 184623 183264 181055 178885 177276 176168 175594 175686 175956 175591
54302 175591 174798 174887 176501 178461 179099 178171 176761 175696 174828 173754 172550 171626 171320 171717 172616 173556 174139
54285 174139 174419 174860 175769 176871 177537 177464 177012 176756 176852 177037 177222 177637 178289 178752 178918 179488 181090 183143
54267 183143 184235 183667 182075 180557 179700 179526 179775 180078 180292 180732 181714 182881 183574 183863 184503 185713 186791
54250 186791 187219 187368 187629 187613 186869 185875 185506 185815 186025 185612 184796 184028 183505 183197 182975 182699 182417 182355 182495
54231 182495 182415 181871 181248 181045 181240 181613 182398 183930 185801 187093 187538 187825 188556 189458 189923 189899 189831 189932 189875
54212A89875o47j265j494j348j202j260j238p91j58L4l32o74n59l18l84n02j05
54195A77632O83J106Q21L25J91K86J42j80j17N22J125J073O21N77J188J876K122
54178A89993K027J801J286M82m4P8L00r5q06r74n97n43j115j606j468j050q02
54161A86867o24l90m00q05j263j556j878k060j429o4P16Jj235j368k95P25R89
54144A75931R22R01P56N36O63J047J008L14m62q84j081j051m34O49J339J174O85
54127A82013M74L94K75N41J354J880J325K37j43M80J423K229K980L521L438K910
54111B05331K617K729K748K539K583K999L187K845K482K424K123J034m50j653
54097B33538k582l507m106l902l236k923l091l096k538j651p56l0K34j54p81r94
$$ plain form
54212 189875 189228 187963 186469 185121 183919 182659 181421 180630 180472 180506 180174 179500 178941 178623 178239 177737 177632
54195 177632 178315 179421 180242 180567 180758 181044 181186 181006 180889 181411 182536 183609 184230 184807 185995 187871 189993
54178 189993 192020 193821 195107 195589 195545 195623 195923 195828 195022 194048 193451 192908 191793 190187 188719 187669 186867
54161 186867 186243 185853 185453 184648 183385 181829 179951 177891 176462 176398 177114 177115 175880 174512 174217 174942 175931
54144 175931 176853 177754 178510 179046 179709 180756 181764 182078 181616 180732 179651 178600 178166 178815 180154 181328 182013
54127 182013 182487 182881 183156 183697 185051 186931 188256 188493 188350 188830 190253 192482 195462 198983 202421 205331
54111 205331 207948 210677 213425 215964 218547 221546 224733 227578 230060 232484 234607 235641 235191 233538
54097 233538 230956 227449 223343 219441 216205 213282 210191 207095 204557 202906 202150 202120 202354 202200 201419 200425
54081B00425p19l27J94J104J992K016J274R04J442J995J675Q95N58P27J006J535
54065B16696K542L375L089J844P27K48p6o21j040r60n22j4M13N19J20l37j5J221
54047B27209K555L337L749M098M147L704L369L931N288O599P316P569P662P740
54033B98273P954Q464R103R370Q894P756O330M976L894L079K385J689J072P17
54019C73956O35N80K57m72j529k722l765m328m258l863l864m761o191p200p298
54004C25177o907o572o168n378m550m366m731m761m023l046k415k027j642j504
53990B67087j854k297k334k120k133k272j997j195l58J45M08N60N08K82K53Q21
53974B53504K008L402M380M528M140M120N048O421P185O907N926M455K254o22
$$ plain form
54081 200425 199706 199379 199573 200677 202669 204685 205959 206863 208305 210300 211975 212870 213428 214155 215161 216696
54065 216696 219238 222613 225702 227546 228273 228521 228445 227824 226784 225824 225302 225288 225701 226220 226340 226003 225988 227209
54047 227209 229764 233101 236850 240948 245095 248799 252168 256099 261387 267986 275302 282871 290533 298273
54033 298273 306227 314691 323794 333164 342058 349814 356144 361120 365014 368093 370478 372167 373239 373956
54019 373956 374591 375171 375428 374956 373427 370705 366940 362612 358354 354491 350627 345866 339675 332475 325177
54004 325177 318270 311698 305530 300152 295602 291236 286505 281744 277721 274675 272260 270233 268591 267087
53990 267087 265233 262936 260602 258482 256349 254077 252080 250885 250527 250672 251080 251640 252148 252430 252683 253504
53974 253504 255512 258914 263294 267822 271962 276082 281130 287551 294736 301643 307569 312024 314278 313656
53960C13656l399n268o115o230n687m453k917j711j057n79J37J037J689J808J622
53945B82533J685K278L105L759M380N420O702P284O623N405M781N040N504N568
53931C50067N260M852M473M221M225M377M359M140M132M700N725O770P441P520
53917D22262P062O562O693P602Q678R215R078Q586Q001P406O833O178N158L693
53903E23007K159R56j7j122k364l398m067m530m934n366o030p029p970q354q368
53888D62573q752r721j0601j0753j0371r997r753r467r203r089q798p811o126
53875C42131m414l359l150l540m112m514m600m431m127l836l842m348n023n074
53861B83761m165k945k364k662l285l616l401k748k066j863k149k208j462l31
$$ plain form
53960 313656 310257 304989 298874 292644 286957 282504 279587 277876 276819 276240 276377 277414 279103 280911 282533
53945 282533 284218 286496 289601 293360 297740 303160 309862 317146 323769 329174 333955 338995 344499 350067
53931 350067 355327 360179 364652 368873 373098 377475 381834 385974 390106 394806 400531 407301 414742 422262
53917 422262 429324 435886 442579 450181 458859 468074 477152 485738 493739 501145 507978 514156 519314 523007
53903 523007 525166 526122 526105 524983 522619 519221 515154 510624 505690 500324 494294 487265 479295 470941 462573
53888 462573 453821 444100 433499 422746 412375 402378 392625 383158 373955 364866 356068 348257 342131
53875 342131 337717 334358 331208 327668 323556 319042 314442 310011 305884 302048 298206 293858 288835 283761
53861 283761 279596 276651 274287 271625 268340 264724 261323 258575 256509 254646 252497 250289 248827 248496
53847B48496K30n8o00q42p92n71j51K97L56r0n77o37l41n8L3l1j35j33P0L03K65
53826B45034L5J23Q40J810K319J983J074K45M2N13J227J780K138K402K492K442
53810B66499K610L186L758L983M384N593O986P175O032N066N330O071O117N664
53796C38454N673O224O603O535O272N716M557L162K353K169J785Q07j81o65j017
53781C88447j787k852l723m367n122o046o746o927o778o780p172p656p713p192
53767C07586o484n974n612n133m510l865l200k574k243k250k091j370n50m51j077
53752B60202j584j482j121r30q36p30p78j004j095j014j199j740j918j157j3M55
53736B44056P8l23n4P05J274J158L71n66r72o49j29L5K8M47J336K061K134J710
$$ plain form
53847 248496 248726 248668 248068 247226 246434 245863 245712 246009 246365 246275 245698 245061 244720 244662 244695 244664 244529 244396 244466 244769 245034
53826 245034 245069 245192 246032 247842 250161 252144 253218 253463 253505 254018 255245 257025 259163 261565 264057 266499
53810 266499 269109 272295 276053 280036 284420 290013 296999 304174 310206 315272 320602 326673 332790 338454
53796 338454 344127 350351 356954 363489 369761 375477 380034 383196 385549 387718 389503 390310 390129 389464 388447
53781 388447 386660 383808 380085 375718 370596 364550 357804 350877 344099 337319 330147 322491 314778 307586
53767 307586 301102 295128 289516 284383 279873 276008 272808 270234 267991 265741 263650 262280 261730 261279 260202
53752 260202 258618 257136 256015 255085 254249 253519 252741 251737 250642 249628 248429 246689 244771 243614 243601 244056
53736 244056 244134 243811 243757 244462 245736 246894 247265 246699 245727 245078 244949 244984 245012 245459 246795 248856 250990 252700
53718B52700J156O48L08L67Q47J357J471J257J147J413J900K170J964J515J420
53703B71640K015K853L104K542J872J864K470L039L263L490M068M724M747L721
53689C15412K011N65J38O44J229J143M63j59l70m56q48j535k054j907r71L08J080
53672C14693P88j10n02J29J026J128L69m08o30m71k11J75O08P74P34J082J936
53655C21110K326J333m10j276o58L38M99l7l59j55J92M86R06J370J473J182J032
53638C29352J353J814J988J979K091K212K035J693J652J982K279K357K533L001
53624C58321L410L328K893K581K565K597K428K020J457R68R08J375J893J882J417
53609C90043J159J474K021K346K491K744L089L202K856K125J317Q52J009J572
$$ plain form
53718 252700 253856 254504 254812 255179 256026 257383 258854 260111 261258 262671 264571 266741 268705 270220 271640
53703 271640 273655 276508 279612 282154 284026 285890 288360 291399 294662 298152 302220 306944 311691 315412
53689 315412 317423 317988 318126 318770 319999 321142 321605 321446 321076 320620 319772 318237 316183 314276 313305 313613 314693
53672 314693 315481 315371 314869 314998 316024 317152 317521 317113 316483 316012 315801 315976 316584 317358 318092 319174 321110
53655 321110 323436 324769 324359 323083 322425 322763 323262 323225 322866 322711 322903 323389 324295 325665 327138 328320 329352
53638 329352 330705 332519 334507 336486 338577 340789 342824 344517 346169 348151 350430 352787 355320 358321
53624 358321 361731 365059 367952 370533 373098 375695 378123 380143 381600 382568 383476 384851 386744 388626 390043
53609 390043 391202 392676 394697 397043 399534 402278 405367 408569 411425 413550 414867 415719 416728 418300
53595D18300J865J422N36n2ML03K12m23j152j492j485j584j956k184j883j313
53579D09118r86q44m74j35p01k283l532l094j273M28J100J029O70J2q32j207o51
53562C96345L86J005Q71M19J80K66M14L83K00J31L83Q42J221J433J609J728J483
53545D09299P99K21M40J386K179K115J510J247J677K374K970L695M705N477N426
53530D45520M993N283O537P714P908P550P666Q500R507J0312J1011J1616J1898
53517E56015J1869J1907J2362J3336J4750J6297J7450J8007J8397J9060J9692
53506G29142J9770J9606K0068K1221K2095K2123K1902K2149K2511K2097K0723
53495I63407J9065J7783J7036J6627J6255J5761J5368J5506J6162J6766J6956
$$ plain form
53595 418300 420165 421587 422123 422071 422075 422378 422590 422167 421015 419523 418038 416454 414498 412314 410431 409118
53579 409118 408132 407288 406814 406679 405978 403695 400163 397069 395796 396224 397324 398353 399023 399035 398203 396996 396345
53562 396345 396731 397736 398607 399026 399206 399472 399886 400269 400469 400600 400983 401825 403046 404479 406088 407816 409299
53545 409299 410098 410319 410759 412145 414324 416439 417949 419196 420873 423247 426217 429912 434617 440094 445520
53530 445520 450513 455796 462333 470047 477955 485505 493171 501671 511178 521490 532501 544117 556015
53517 556015 567884 579791 592153 605489 620239 636536 653986 671993 690390 709450 729142
53506 729142 748912 768518 788586 809807 831902 854025 875927 898076 920587 942684 963407
53495 963407 982472 1000255 1017291 1033918 1050173 1065934 1081302 1096808 1112970 1129736 1146692
53484A146692J7039J7344J7562J7288J6842J6872J7231J7047J5927J4586J3960
53473A328390J4073J4025J2913J0626P808N170K798K79k442m666n697n815o059
53460A371403p076q587r971j0970j1660j2129j2465j2855j3455j4182j4752j4967
53448A228334j4930j4989j5335j5709j5653j5161j4786j4822j4679j3484j1251
53437A067535q990p564o812n907m364k519j145o94p79m90O54K180L314L913M359
53422A042691M749M889N044N973P947J0337J2472J4320J5963J7039J7381J7680
53410A176485J8755K0476K2138K3632K5327K7008K7899K7966K8230K9362L0850
53399A458128L2068L3412L5629L8556M1335M3540M5295M6494M6810M6577M6750
$$ plain form
53484 1146692 1163731 1181075 1198637 1215925 1232767 1249639 1266870 1283917 1299844 1314430 1328390
53473 1328390 1342463 1356488 1369401 1380027 1387835 1393005 1395803 1396082 1393640 1388974 1383277 1377462 1371403
53460 1371403 1364327 1355740 1345769 1334799 1323139 1311010 1298545 1285690 1272235 1258053 1243301 1228334
53448 1228334 1213404 1198415 1183080 1167371 1151718 1136557 1121771 1106949 1092270 1078786 1067535
53437 1067535 1058545 1050981 1044169 1038262 1033898 1031379 1030234 1029540 1028761 1028271 1028925 1031105 1034419 1038332 1042691
53422 1042691 1047440 1052329 1057373 1063346 1071293 1081630 1094102 1108422 1124385 1141424 1158805 1176485
53410 1176485 1195240 1215716 1237854 1261486 1286813 1313821 1341720 1369686 1397916 1427278 1458128
53399 1458128 1490196 1523608 1559237 1597793 1639128 1682668 1727963 1774457 1821267 1867844 1914594
53388A914594M7738M8828M9171M8810M8330M7857M6933M5233M3051M1017L9427
53377B420989L7941L5866L2902K9412K5838K1985J7389J2339P861M405J127l034
53365B645020q012j2919j7414k1969k6853l1486l5061l7379l8847l9902m0691
53354B334487m1077m0854m0043l9019l8224l7678l6958l5703l4051l2538l1692
53343A926650l1687l2239l2808l3018l2798l2117l0802k8841k6746k5198k4347
53332A596049k3727k2757k1151j8928j6515j4702j4092j4415j4859j5083j5526
53321A404294j6510j7587j8086j7951j7575j7091j6208j4858j3535j2899j3061
53310A228933j3309j2599j0533p814n556m117k920j505k43L23M85J244L177N811
$$ plain form
53388 1914594 1962332 2011160 2060331 2109141 2157471 2205328 2252261 2297494 2340545 2381562 2420989
53377 2420989 2458930 2494796 2527698 2557110 2582948 2604933 2622322 2634661 2642522 2646927 2648054 2645020
53365 2645020 2637008 2624089 2606675 2584706 2557853 2526367 2491306 2453927 2415080 2375178 2334487
53354 2334487 2293410 2252556 2212513 2173494 2135270 2097592 2060634 2024931 1990880 1958342 1926650
53343 1926650 1894963 1862724 1829916 1796898 1764100 1731983 1701181 1672340 1645594 1620396 1596049
53332 1596049 1572322 1549565 1528414 1509486 1492971 1478269 1464177 1449762 1434903 1419820 1404294
53321 1404294 1387784 1370197 1352111 1334160 1316585 1299494 1283286 1268428 1254893 1241994 1228933
53310 1228933 1215624 1203025 1192492 1184678 1179122 1175005 1172085 1170580 1170337 1170660 1171145 1172389 1175566 1181377
53296A181377Q192R845J1064J2475J4415J6666J8679J9965K0373K0189K0086K0638
53284A373964K1635K1981K0769J8362J6024J4434J3115J1413R418P560N828L886
53272A538389J661p15l252n933q407j0365j2075j4022j6151j7907j9087k0050
53260A412086k1068k1919k2301k2306k2212k2070k1792k1446k1254k1232k1023
53249A173463k0250j9088j8337j8673j9799k0690k0765k0440k0338k0435k0329
53238I54319j9988j9609j9054j8045j6793j5803j5081j4157j2927j1800j0984
53227G80078j0198r336q745q613q646q672r028r970j1183j2329j3559j4970j6022
53214F38807j6114j5524j5092j5111j5086j4482j3221j1575j0073r380r617r843
$$ plain form
53296 1181377 1189569 1199414 1210478 1222953 1237368 1254034 1272713 1292678 1313051 1333240 1353326 1373964
53284 1373964 1395599 1417580 1438349 1456711 1472735 1487169 1500284 1511697 1521115 1528675 1534503 1538389
53272 1538389 1540050 1539335 1536083 1530150 1521743 1511378 1499303 1485281 1469130 1451223 1432136 1412086
53260 1412086 1391018 1369099 1346798 1324492 1302280 1280210 1258418 1236972 1215718 1194486 1173463
53249 1173463 1153213 1134125 1115788 1097115 1077316 1056626 1035861 1015421 995083 974648 954319
53238 954319 934331 914722 895668 877623 860830 845027 829946 815789 802862 791062 780078
53227 780078 769880 760544 751799 743186 734540 725868 716840 706870 695687 683358 669799 654829 638807
53214 638807 622693 607169 592077 576966 561880 547398 534177 522602 512529 503149 493532 483689
53202D83689q947p185o108o720q371r745j0328j0391j0147r631r057q560p818
53189C70681o535n207m672m973n328n263n121n246n406n250m816m140l003j538
53175C04183o17r37j987k541k151j502j359j666j869j671j237r12q36q02n41k18
53159B83337l74j079j523r87L6L65k96j038j130q53p01n25k3N00N13J17j84k86
53141B75869m98q27q50l28L95Q05P23L89J42J18J71J18n3k61n06o63k54J016K496
53122B78002K993K285J514J693K398K592K159J893K202K675K797K409J524L09
53108C07445p32j169j228j409j617j330n47N2Q0j48k84m15o15p45r13j510k429
53091B92486k870k372j587j453j982k356k007j171m98m84j119j836j928j209j80
$$ plain form
53202 483689 474742 467557 461449 454729 446358 436613 426285 415894 405747 396116 387059 378499 370681
53189 370681 364146 358939 354267 349294 343966 338703 333582 328336 322930 317680 312864 308724 305721 304183
53175 304183 303566 302629 300642 298101 295950 294448 293089 291423 289554 287883 286646 285734 284898 284096 283555 283337
53159 283337 282963 281884 280361 279374 279410 279775 279479 278441 277311 276458 275757 275232 275209 275709 276222 276339 276155 275869
53141 275869 275371 274544 273694 273366 273761 274566 275289 275678 275820 275938 276109 276227 276174 275913 275407 274744 274490 275506 278002
53122 278002 280995 283280 284794 286487 288885 291477 293636 295529 297731 300406 303203 305612 307136 307445
53108 307445 306713 305544 304316 302907 301290 299960 299413 299465 299545 299397 299113 298698 298083 297338 296425 294915 292486
53091 292486 289616 287244 285657 284204 282222 279866 277859 276688 276190 275706 274587 272751 270823 269614 269434
53076B69434O07J071J369J487J323R12L22l84r03q01j80J90j81q20j039r75j203
53059B70229j638j587q67j10K57N56J097J489J211M64j09k79k90k62l8L81O93
53042B71197P14N38J83n17j403j743r32O27J712J461J65j118j471p60L50R40O22
53025B70565q9l89j29J54J93L83R86J521J390Q26N54P64R92R49Q02N91P5p02j163
53006B78273q93j49N62R92J076P23M9m56l85J11N65P31O77N27L95M20O09P36O29
52987B85192M66N68R60J354J570J786K205K677K786K388J899J808J958J650N79
52972C09846p09j535j858j932j596o29M79Q83O07N89J279J932J661N63o14j431
52956C07535j813j671j032l62k69r04j895k718k986k655k121j770j399n15O60
$$ plain form
53076 269434 270041 271112 272481 273968 275291 276203 276525 276141 275238 274437 274257 274447 274266 273446 272407 271432 270229
53059 270229 268591 267004 266137 266027 266284 266840 267937 269426 270637 271101 270992 270713 270423 270161 270123 270504 271197
53042 271197 271911 272449 272632 272115 270712 268969 268037 268664 270376 271837 272002 270884 269413 268653 269003 269943 270565
53025 270565 270476 270087 269958 270112 270305 270688 271674 273195 274585 275411 275965 276729 277721 278670 279472 280063 280138 279436 278273
53006 278273 277380 277231 277793 278785 279861 280584 280633 280177 279792 279903 280468 281199 281876 282403 282798 283218 283827 284563 285192
52987 285192 285658 286226 287186 288540 290110 291896 294101 296778 299564 301952 303851 305659 307617 309267 309846
52972 309846 309137 307602 305744 303812 302216 301587 302066 302949 303556 304145 305424 307356 309017 309580 308966 307535
52956 307535 305722 304051 303019 302657 302388 301484 299589 296871 293885 291230 289109 287339 285940 285425 286085
52941B86085J137M64n66j002r32r48j046q09l77l20o66q70p13m98m09k62oJ26
52923B78388R5J71M89Q12Q75O71L43K6k25m90q30r95o31J8J77l30o06O3J022J139
52903B80182M41r1n7K9j63l64m01m19k87K79R84J166Q46O38O02J85n50p28m1P53
52883B83004J010Q96N76j38q56o12M97R92K38l19O67K203K468J639J425K292K962
52866B98944K637J992J706J514J197J181J524J362J23j511k526k836l020l328
52852B98959l521l364k854k162j664j718k232k752l135l633m190m193l304k067
52838B58170j274j072j038q24m09O5M31O03P90J218J614J401O16R6L67Q10N14
52821B62078m02r48o27J0K03q4k63N3O16Q94P86Q12J379K064K034J171J99l97
$$ plain form
52941 286085 287222 287686 287120 286118 285186 284238 283192 282383 282006 281686 281020 280150 279437 278939 278530 278268 278262 278388
52923 278388 278483 278654 279143 279955 280830 281501 281844 281870 281645 281155 280325 279330 278699 278717 278894 278564 277958 278021 279043 280182
52903 280182 280623 280532 280475 280504 280341 279977 279576 279157 278870 279149 280133 281299 282145 282783 283385 283570 283020 282292 282251 283004
52883 283004 284014 284910 285486 285348 284492 283880 284377 285369 285607 285288 285955 288158 290626 292265 293690 295982 298944
52866 298944 301581 303573 305279 306793 307990 309171 310695 312057 312180 310669 308143 305307 302287 298959
52852 298959 295438 292074 289220 287058 285394 283676 281444 278692 275557 271924 267734 263541 260237 258170
52838 258170 256896 255824 254786 253962 253553 253618 254049 254652 255442 256660 258274 259675 260291 260387 260754 261564 262078
52821 262078 261676 260728 260101 260111 260314 260230 259967 260020 260636 261530 262316 263128 264507 266571 268605 269776 269975 269578
52803B69578q91j468j555p50J72M6j011j661j123j35J40m60j107j067l80L42N32
52786B59202J50l17l65M0N32P87P14L61j14m03l08K7L25N48P83Q85O32J07l39
52767B63247m99l48R6N43L31p76j834j571j00J077J018M38M64J099J613J785J895
52750B68478J892J483R52J016J809K612K749K295J763J489J463J465J291R89Q57
52735B92603R50Q58K94k67p9P40J250Q88J74j25NO1j11j66M3Q0n44j541j964j263
52715B91886j31J52o71j396r36J40K70r90k358k459j337n8O80R83J181J307J154
52698B87417N80k30p79p69n70q27j477j646q14L78R26P02M34N97R27R52N17k76
52680B86042j242k099k591k699k539k042j108p1L65n5o55n10M47J318J347P82
$$ plain form
52803 269578 268687 267219 265664 264914 265086 265132 264121 262460 261337 261202 261342 260882 259775 258708 258328 258670 259202
52786 259202 259352 259035 258670 258710 259242 260029 260743 261104 260990 260587 260279 260306 260631 261179 261962 262847 263479 263586 263247
52767 263247 262748 262400 262496 263039 263370 262594 260760 259189 259089 260166 261184 261622 262086 263185 264798 266583 268478
52750 268478 270370 271853 272805 273821 275630 278242 280991 283286 285049 286538 288001 289466 290757 291746 292603
52735 292603 293553 294411 294705 294438 294359 295099 296349 297237 297411 297286 297291 297352 297241 297075 297118 297198 296654 295113 293149 291886
52715 291886 291755 291907 291236 289840 288904 289044 289314 288324 285966 283507 282170 282112 282792 283775 284956 286263 287417
52698 287417 287997 287767 286988 286219 285649 284822 283345 281699 280885 281263 282189 282891 283325 283922 284849 285801 286318 286042
52680 286042 284800 282701 280110 277411 274872 272830 271722 271651 272016 271961 271306 270796 271243 272561 273908 274690
52664B74690N01Q27J155Q57J65j54J81P30J027J048R50Q65J101J975L135L578
52648B92631K816J596Q61N11j64j070j310o34O0k1n35p20m85k11Q9O83J399J689
52630B97185J474J345J697K178K206J799J490J551J606J088j01j530k725l524
52616C05739l977m048l685l081k616k390k062j292k38N63P61M28j26n70o52m03
52600B82351k78p14j424j508n24R05J922K445K843K901K008M28n51j53Q94J447
52584B92992J393J272J068M04l44k68O06J151P77K55L66O44K98l06j20Q50J387
52567C02425P50k90m98K92J075Q93k20j390j806j404p38k68mJ53O1m21j014j237
52549B96359r11k68L74P08M93j38n78l32K98N94L75J15O6n6l33k11O66J626J634
$$ plain form
52664 274690 275191 276018 277173 278030 278195 278041 278222 278952 279979 281027 281977 282842 283943 285918 289053 292631
52648 292631 295447 297043 297904 298415 298251 297181 295871 295237 295297 295276 294741 294021 293536 293325 293414 294097 295496 297185
52630 297185 298659 300004 301701 303879 306085 307884 309374 310925 312531 313619 313518 311988 309263 305739
52616 305739 301762 297714 294029 290948 288332 285942 283880 282588 282350 282913 283674 284102 283976 283406 282754 282351
52600 282351 282073 281359 279935 278427 277903 278808 280730 283175 286018 288919 290927 291355 290804 290651 291545 292992
52584 292992 294385 295657 296725 297129 296785 296517 297123 298274 299051 299306 299672 300316 300614 300308 300188 301038 302425
52567 302425 303175 302885 302387 302679 303754 304647 304427 303037 301231 299827 299089 298821 298817 298970 299031 298610 297596 296359
52549 296359 295448 295180 295554 296262 296755 296617 296039 295707 296005 296599 296974 297089 297155 297099 296766 296555 297221 298847 300481
52530C00481O69j52J4P74J163R49P57J065J531J523R86M69M71R61J535J813J743
52513C16752J656J955K568K936K725K363K426K761K697K003J017j48j670l229
52499C36812m021l907l682l764l469k321j194j232k157k710k400j801j394j126
52485C01634r75r86p41J77J276J602J165R26J319J784J932K099K431K417J822
52470C17882J153Q01N49M00R47K319L623M135M235M487M529L788K563J492M94
52455C53397p50j786j878j332j263k127l267l872l699k971k221k125k721l055
52441C20330k259q32L5J18J87M99L98l70j046j004n92l31r0L71P29O78N81Q79
52423C18281J266J152P51Q45J598K227K037J272P13P46J100J410J718K355L417
$$ plain form
52530 300481 301150 300998 301012 301786 302949 303898 304655 305720 307251 308774 309760 310229 310700 311661 313196 315009 316752
52513 316752 318408 320363 322931 325867 328592 330955 333381 336142 338839 340842 341859 341711 340041 336812
52499 336812 332791 328884 325202 321438 317969 315648 314454 313222 311065 308355 305955 304154 302760 301634
52485 301634 300659 299673 298932 299109 300385 301987 303152 304078 305397 307181 309113 311212 313643 316060 317882
52470 317882 319035 319836 320385 320785 321732 324051 327674 331809 336044 340531 345060 348848 351411 352903 353397
52455 353397 352647 350861 348983 347651 346388 344261 340994 337122 333423 330452 328231 326106 323385 320330
52441 320330 318071 317239 317274 317392 317579 318078 318476 318106 317060 316056 315464 315133 315043 315414 316143 316821 317402 318281
52423 318281 319547 320699 321450 322295 323893 326120 328157 329429 330142 330888 331988 333398 335116 337471 340888
52408C40888M611N605O372O997P439P719Q092Q606Q558P038M094Q46j733l643
52394D11489n252o480p019p030o892o483n280l248j150J48M20P2l32m41j96K93
52378C62619R98K041L377M565N103M989M627M223L640K920K560K906L628M083
52364D12279M046L661K885J572J03o98o25n11j156k185k536j825n99N99J697K521
52348D19228K634K108J810K366L282L686L558L588M061M564M770M839M981N267
52334D70742N935P299R131J0671J1611J2533J3992J5601J6590J6894J7178J7902
52322F26079J8945K0109K1335K2358K2707K2378K2105K2538K3455K4175K4531
52311H70715K4984K5769K6489K6709K6481K6059K5436K4510K3507K2762K2263
$$ plain form
52408 340888 345499 351104 357476 364473 371912 379631 387723 396329 404887 411925 416019 416865 415132 411489
52394 411489 406237 399757 392738 385708 378816 372333 367053 363805 362655 362803 363223 363295 362963 362522 362326 362619
52378 362619 363617 365658 369035 373600 378703 383692 388319 392542 396182 399102 401662 404568 408196 412279
52364 412279 416325 419986 422871 424443 424546 423848 423223 422712 421556 419371 416835 415010 414411 415010 416707 419228
52348 419228 421862 423970 425780 428146 431428 435114 438672 442260 446321 450885 455655 460494 465475 470742
52334 470742 476677 483976 493107 503778 515389 527922 541914 557515 574105 590999 608177 626079
52322 626079 645024 665133 686468 708826 731533 753911 776016 798554 822009 846184 870715
52311 870715 895699 921468 947957 974666 1001147 1027206 1052642 1077152 1100659 1123421 1145684
52300A145684K1720K0975J9987J8528J6423J3997J1732R420O402K789l13k285
52288A285059l964o391r146j0871j1143j0789j0411r690q513p681p749p878o755
52275A174078m341j835j6J567L555N703P322Q365R493J1137J2978J4460J5494
52262A257960J6371J7209J7781J7933J7931J8250J9064K0029K0566K0348J9556
52251A462998J8615J7638J6227J3977J1083Q127N280K136j511n086p811r595j0968
52238A521110j2278j3419j4315j5183j6122j6820j6932j6545j6081j5800j5649
52227A351966j5479j5208j4731j3824j2342j0488q765p502o518n439m261l362
52215A234047k851k245j029O43K043K623K520K427K991M258N575O210O074N666
$$ plain form
52300 1145684 1167404 1188379 1208366 1226894 1243317 1257314 1269046 1278466 1284868 1287657 1287344 1285059
52288 1285059 1281095 1274704 1265558 1254687 1243544 1232755 1222344 1212654 1204141 1196460 1188711 1180833 1174078
52275 1174078 1169737 1167902 1167886 1169453 1173008 1178711 1186033 1194398 1203891 1215028 1228006 1242466 1257960
52262 1257960 1274331 1291540 1309321 1327254 1345185 1363435 1382499 1402528 1423094 1443442 1462998
52251 1462998 1481613 1499251 1515478 1529455 1540538 1548665 1553945 1556081 1554570 1549484 1541673 1532078 1521110
52238 1521110 1508832 1495413 1481098 1465915 1449793 1432973 1416041 1399496 1383415 1367615 1351966
52227 1351966 1336487 1321279 1306548 1292724 1280382 1269894 1261129 1253627 1247109 1241670 1237409 1234047
52215 1234047 1231196 1228951 1227922 1228565 1230608 1233231 1235751 1238178 1241169 1245427 1251002 1257212 1263286 1268952
52201A268952N309M846M282M166M958O333P571Q382Q879R071Q826Q248P536O633
52187A363992N401M014K695J324k07j548k512l775o069q745j0256j0212r869j0220
52173A314013j0676j0247r090p988o995n638m037k861k244j619o51L70J142J749
52159A255228K330K772K947K882K620K156J611J210J013Q49N41J6o44j110q76
52144A273545J45J285J697J349J056J443K229K691K556K262K405L155M207N266
52130A305291O509Q450J1311J4612J7602J9978K2053K4235K6511K8506K9914L0798
52118A545770L1522L2402L3382L4055L3982L2986L1176K8870K6465K4274K2415
52107A877299K0895J9712J8709J7475J5742J3817J2290J1222R995Q074N542K677
$$ plain form
52201 1268952 1274261 1279107 1283389 1287555 1292513 1298846 1306417 1314799 1323678 1332749 1341575 1349823 1357359 1363992
52187 1363992 1369393 1373407 1376102 1377426 1377219 1375671 1373159 1369384 1363315 1354570 1344314 1334102 1324233 1314013
52173 1314013 1303337 1293090 1284000 1276012 1269017 1263379 1259342 1256481 1254237 1252618 1251967 1252337 1253479 1255228
52159 1255228 1257558 1260330 1263277 1266159 1268779 1270935 1272546 1273756 1274769 1275618 1276159 1276175 1275531 1274421 1273545
52144 1273545 1273690 1274975 1276672 1278021 1279077 1280520 1282749 1285440 1287996 1290258 1292663 1295818 1300025 1305291
52130 1305291 1311800 1320250 1331561 1346173 1363775 1383753 1405806 1430041 1456552 1485058 1514972 1545770
52118 1545770 1577292 1609694 1643076 1677131 1711113 1744099 1775275 1804145 1830610 1854884 1877299
52107 1877299 1898194 1917906 1936615 1954090 1969832 1983649 1995939 2007161 2017156 2025230 2030772 2033449
52095B033449m87l921p302j0389j3404j6620j9791k2349k4019k4844k4846k4130
52083A841347k3124k2169k0989j9033j6385j3783j1667r718p483n057k788o36
$$ plain form
52095 2033449 2032962 2029041 2021739 2011350 1997946 1981326 1961535 1939186 1915167 1890323 1865477 1841347
52083 1841347 1818223 1796054 1775065 1756032 1739647 1725864 1714197 1704479 1696996 1691939 1689151 1688515
$$ [...]
##END NTUPLES=NMR SPECTRUM
##END=
