##TITLE=AC1637_CTIAH13370_8569331_6N9dx2ids1
##JCAMPDX= 6.0         $$ Bruker NMR JCAMP-DX V2.0
##DATA TYPE= NMR SPECTRUM
##DATA CLASS= NTUPLES
##ORIGIN= BRUKER
##OWNER= Administrator
$$ 1.72 TOPSPIN		Version 2.1
$$ 2014-04-10 21:35:15.173 -0700  Administrator@X
$$ Compression mode = diff/dup
##.OBSERVE FREQUENCY= 400.02188249412
##.OBSERVE NUCLEUS= ^1H
##.ACQUISITION MODE= SIMULTANEOUS (DQD)
##.ACQUISITION SCHEME= undefined
##.AVERAGES= 8
##.DIGITISER RES= 22
##SPECTROMETER/DATA SYSTEM= spect
##.PULSE SEQUENCE= zg30
##.SOLVENT NAME= COFFEE_meoh
##.SHIFT REFERENCE= INTERNAL, COFFEE_meoh, 1, 14.98509
##AUDIT TRAIL= $$ (NUMBER, WHEN, WHO, WHERE, PROCESS, VERSION, WHAT)
$$ ##TITLE= Audit trail, TOPSPIN		Version 2.1
$$ ##JCAMPDX= 5.01
$$ ##ORIGIN= Bruker BioSpin GmbH
$$ ##OWNER= Administrator
$$ $$ E:\/data/COFFEE/nmr/AC1637_CTIAH13370_8569331_6N9dx2ids1/10/pdata/1/auditp.txt
$$ ##AUDIT TRAIL=  $$ (NUMBER, WHEN, WHO, WHERE, PROCESS, VERSION, WHAT)
(   1,<2014-04-10 21:35:06.004 -0700>,<Administrator>,<X>,<go>,<TOPSPIN 2.1>,
      <created by zg
	started at 2014-04-10 21:34:03.844 -0700,
	POWCHK enabled, PULCHK disabled,
       configuration hash MD5:
       C8 4E 4E 5D D3 5C D8 9E 9F 52 82 E0 59 8A DE 15
       data hash MD5: 64K
       A6 09 EA C1 F9 E5 36 57 14 F3 10 95 F1 A9 20 C7>)
(   2,<2014-04-10 21:35:09.907 -0700>,<Administrator>,<X>,<proc1d>,<TOPSPIN 2.1>,
      <Start of raw data processing
       efp LB = 0 FT_mod = 6 PKNL = 1 PHC0 = 0 PHC1 = 0 SI = 32K 
       data hash MD5: 32K
       C0 D0 33 75 8D 1C 67 CE C6 8C 6F B6 86 BE 88 3B>)
(   3,<2014-04-10 21:35:10.358 -0700>,<Administrator>,<X>,<proc1d>,<TOPSPIN 2.1>,
      <pk PHC0 = 95.47668 PHC1 = 0 
       data hash MD5: 32K
       49 47 E1 F8 A6 6A EF 2D 21 60 B7 61 AD A2 1D A9>)
(   4,<2014-04-10 21:35:10.575 -0700>,<Administrator>,<X>,<proc1d>,<TOPSPIN 2.1>,
      <abs ABSG = 1 
       data hash MD5: 32K
       A3 A6 AE B4 80 DD 33 15 ED 00 A1 85 70 E0 DB 01>)
(   5,<2014-04-10 21:35:10.738 -0700>,<Administrator>,<X>,<proc1d>,<TOPSPIN 2.1>,
      <abs ABSG = 2 
       data hash MD5: 32K
       34 72 86 85 2C 78 C2 56 55 0F 64 8E B8 E5 F6 C6>)
(   6,<2014-04-10 21:35:10.954 -0700>,<Administrator>,<X>,<proc1d>,<TOPSPIN 2.1>,
      <abs ABSG = 3 
       data hash MD5: 32K
       A8 ED 9A CA 52 08 26 CE 8A C7 4D DF 03 48 87 C9>)
(   7,<2014-04-10 21:35:11.027 -0700>,<Administrator>,<X>,<proc1d>,<TOPSPIN 2.1>,
      <abs ABSG = 4 
       data hash MD5: 32K
       C9 5E 41 E9 D4 1E 1E 46 41 62 3A AF 37 0B 88 7F>)
(   8,<2014-04-10 21:35:11.135 -0700>,<Administrator>,<X>,<proc1d>,<TOPSPIN 2.1>,
      <abs ABSG = 5 
       data hash MD5: 32K
       CB 3C 66 C0 57 BB 53 A9 62 3E 62 94 F2 5D CE 2F>)
$$ ##END=
$$ 
$$ $$ hash MD5
$$ $$ 05 CF 8B 14 1B 89 03 E5 3F 4B 2A 3C 85 CC 96 C0
##$RELAX= 
##$RELAX= 
##$RELAX= 
##$RELAX= 
##$RELAX= 
##$RELAX= 
##$RELAX= 
$$ Bruker specific parameters
$$ --------------------------
##$DU= <E:\>
##$EXPNO= 10
##$NAME= <AC1637_CTIAH13370_8569331_6N9dx2ids1>
$$ [...]
##$TP= (0..7)
150 150 150 150 150 150 150 150
##$TP07= 0
##$TPNAME0= <>
##$TPNAME1= <>
##$TPNAME2= <>
##$TPNAME3= <>
##$TPNAME4= <>
##$TPNAME5= <>
##$TPNAME6= <>
##$TPNAME7= <>
##$TPOAL= (0..7)
0.5 0.5 0.5 0.5 0.5 0.5 0.5 0.5
##$TPOFFS= (0..7)
0 0 0 0 0 0 0 0
##$TUNHIN= 0
##$TUNHOUT= 0
##$TUNXOUT= 0
##$USERA1= <user>
##$USERA2= <user>
##$USERA3= <user>
##$USERA4= <user>
##$USERA5= <user>
##$V9= 5
##$VALIST= <valist>
##$VCLIST= <CCCCCCCCCCCCCCC>
##$VD= 0
##$VDLIST= <DDDDDDDDDDDDDDD>
##$VPLIST= <PPPPPPPPPPPPPPP>
##$VTLIST= <TTTTTTTTTTTTTTT>
##$WBST= 1024
##$WBSW= 4
##$XGAIN= (0..3)
0 0 0 0
##$XL= 0
##$YL= 0
##$YMAX_a= 625006
##$YMIN_a= -529722
##$ZGOPTNS= <>
##$ZL1= 120
##$ZL2= 120
##$ZL3= 120
##$ZL4= 120
##$ABSF1= 14.98509
##$ABSF2= -5.573092
##$ABSG= 5
##$ABSL= 3
##$ALPHA= 0
##$AQORDER= 0
##$ASSFAC= 0
##$ASSFACI= 0
##$ASSFACX= 0
##$ASSWID= 0
##$AUNMP= <proc_prof1d_extract_pilot.lims>
##$AXLEFT= 0
##$AXNAME= <>
##$AXNUC= <1H>
##$AXRIGHT= 0
##$AXTYPE= 0
##$AXUNIT= <>
##$AZFE= 0.1
##$AZFW= 0.1
##$BCFW= 0
##$BC_mod= 0
##$BYTORDP= 0
##$COROFFS= 0
##$CY= 15
##$DATMOD= 1
##$DC= 0
##$DFILT= <>
##$DTYPP= 0
##$F1P= 0
##$F2P= 0
##$FCOR= 0.5
##$FTSIZE= 32768
##$FT_mod= 6
##$GAMMA= 0
##$GB= 0
##$INTBC= 1
##$INTSCL= 1
##$ISEN= 128
##$LB= 0
##$LEV0= 0
##$LPBIN= 0
##$MAXI= 10000
##$MC2= 0
##$MEAN= 0
##$ME_mod= 0
##$MI= 0
##$NCOEF= 0
##$NC_proc= -8
##$NLEV= 6
##$NOISF1= 0
##$NOISF2= 0
##$NSP= 0
##$NTH_PI= 0
##$NZP= 0
##$OFFSET= 14.98509
##$PC= 1
##$PHC0= 95.47668
##$PHC1= 0
##$PH_mod= 1
##$PKNL= yes
##$PPARMOD= 0
##$PPDIAG= 0
##$PPIPTYP= 0
##$PPMPNUM= 2147483647
##$PPRESOL= 1
##$PSCAL= 4
##$PSIGN= 0
##$PYNMP= <proc.py>
##$REVERSE= no
##$SF= 400.02
##$SI= 32768
##$SIGF1= 0
##$SIGF2= 0
##$SINO= 400
##$SIOLD= 32768
##$SPECTYP= <>
##$SREGLST= <1H.CDCl3>
##$SSB= 0
##$STSI= 32768
##$STSR= 0
##$SW_p= 8223.68421052631
##$SYMM= 0
##$S_DEV= 0
##$TDeff= 65536
##$TDoff= 0
##$TI= <>
##$TILT= no
##$TM1= 0
##$TM2= 0
##$TOPLEV= 0
##$USERP1= <user>
##$USERP2= <user>
##$USERP3= <user>
##$USERP4= <user>
##$USERP5= <user>
##$WDW= 1
##$XDIM= 32768
##$YMAX_p= 454663873
##$YMIN_p= -655752
##$CURPLOT= <Network HP LaserJet P1505>
##$CURPRIN= <$Network HP LaserJet P1505>
##$DFORMAT= <normdp>
##$LAYOUT= <+/1D_H.xwp>
##$LFORMAT= <normlp>
##$PFORMAT= <normpl>
##$SURQMSG= 1
$$ End of Bruker specific parameters
$$ ---------------------------------
##NTUPLES= NMR SPECTRUM
##VAR_NAME=  FREQUENCY,     SPECTRUM/REAL,   SPECTRUM/IMAG
##SYMBOL=    X,             R,               I
##VAR_TYPE=  INDEPENDENT,   DEPENDENT,       DEPENDENT
##VAR_FORM=  AFFN,          ASDF,            ASDF
##VAR_DIM=   32768,         32768,           32768
##UNITS=     HZ,            ARBITRARY UNITS, ARBITRARY UNITS
##FACTOR=    0.250966925370066, 1,           1
##FIRST=     8223.43324360094, -260127,      -193910
##LAST=      0,             -105729,         3343
##MIN=       0,             -655752,         0
##MAX=       8223.43324360094, 454663873,    0
$$ Real data points
##PAGE= N=1
##DATA TABLE= (X++(R..R)), XYDATA
$$ [...]
23859 228810 -17783 122660 35721 66594 129141 -110988 886 26967 -224347 155280 -55860
23847 201976 -74550 90315 144354 53898 -169282 105431 -440691 97876 25537 63009 197717
23836 197717 -305387 -201740 207659 63374 187088 -120474 139935 -119671 8987 277713
23826 277713 38466 -24389 -243049 119675 -269246 -270959 18050 160787 -228721 433029
23815 174148 102959 -225813 -3315 -100353 187881 23162 59579 54737 23429 -169350 -131900
23804 -131900 -46935 -13768 -30061 -24584 -192634 40511 -17577 11631 34911 -38651 23184
23792 134305 -110428 54730 75606 -166493 179408 52795 -140431 -19963 36913 -110773
23781 118082 52782 159252 -273432 -117390 -17060 -12757 -33762 -220186 -179934 44529 18050
23769 -91588 -385116 -200361 -155465 39408 -268965 44177 207662 68472 -437506 8529 -123564
23757 10441 -1040 55874 3222 -137604 265936 -324412 72745 69662 -122219 -90201 34995
23745 17219 69469 -448877 96601 -75547 82606 24174 185699 -168728 55184 39533 35668
23734 35668 132867 -124389 36916 146317 -258183 28457 55159 -63835 -185455 -12876 -177949
23723 -177949 -61274 45095 150508 115077 -86330 165401 -188269 280891 185518 -25741 -98095
23712 -98095 153556 -272266 112253 1124 210201 -9098 -363702 -217637 -104261 -250611
23702 -250611 -138700 264114 242224 124185 -156693 -56167 16025 105474 21253 85260 119988
23691 119988 34285 1267 -112386 65486 -29873 -169252 -112487 -21013 -43127 712 182766
23680 182766 -133867 -483155 -186993 105958 -118551 -20643 -294013 171463 39521 482382
23670 482382 -351306 123595 -19067 227560 211011 -242941 -293763 9539 -3374 21176 -96398
23658 195896 -141220 58468 -148380 193298 -240629 -139337 -82801 39286 155711 -49125
23647 58933 210597 129232 -396232 -141172 -15785 223006 184388 -226185 -101296 45891
23636 81464 -11786 -322186 -143394 -17592 181386 -272287 -524 -216852 78739 -81106 1031
23624 120331 -84140 -115172 -2544 -204836 -141024 -240581 91002 28983 -26708 29104 -236762
23612 137637 258123 101074 -287156 186459 74155 57765 200648 -385802 29252 -35490
23601 28136 -266287 9231 305616 4997 207301 -39711 41580 -89576 10542 -335785 290301
23589 113573 123805 -75768 -50047 103408 57442 -168225 361673 27758 -90 46182 -156770
23577 -383473 -303937 -225751 -187943 -74118 89475 -159778 236896 94233 -69765 56894 -170323
23565 186625 146152 230481 174918 -149185 33732 12085 -79172 -298255 105984 -24510 -273327
23554 -273327 -272663 -167697 122200 -74823 -145104 -91427 138197 181387 190086 -464562 -40370
23542 2027 195623 244037 223653 -100630 46154 68054 -235989 -2948 -27896 96007 80785
23531 80785 53420 -203874 5146 -171933 -186963 162455 42778 -167361 -61453 148957 -142296
23519 187340 -229757 249181 166886 -141562 -391445 95141 -199143 -81004 -40045 193907
23508 220050 -244596 40520 -358276 193338 -392921 159835 -177245 -360025 52569 117051
23498 117051 -171445 246694 -103643 -12649 -257694 -17417 2147 159341 -114110 -6091 -245746
23487 -245746 117731 244005 236032 86333 -37079 11453 -6085 26198 104242 237692 -909 162711
23474 -52698 -7605 89436 46795 5563 204690 258734 192629 -322432 -167860 231832 106731
23462 36608 -219141 20248 -17245 9641 221268 95784 -4294 289563 -249212 -160823 44794
23450 146852 278483 -282207 -25155 -91603 -82630 24969 70743 217783 -16510 -38132 3784
23438 -260079 -135536 -25978 -163481 -177161 -123520 -47056 143329 16151 -209036 167261
23427 185234 -319253 -270877 32 -331473 -167930 -135077 -314400 -60798 -129304 104213 -339012
23415 -57754 150451 -61317 113460 -82827 113649 -161064 -58865 143037 -72165 -414341
23405 -414341 186302 199252 152965 67236 -378499 -114280 -116207 54743 -26422 138809 -31236
23393 114074 -80204 159436 32915 55626 134707 -26838 188942 -65310 -162819 -245677 153798
23381 -313423 -120724 296440 324094 -205591 -219950 22202 -350151 -16385 -297450 -19787
23370 -161738 143135 -38622 133224 -497979 -137374 144777 -5819 -83815 196700 232835
23360 232835 -180229 -85208 71746 -63692 10229 -46858 79830 -154940 442801 -11183 -176408
23349 -176408 199781 230257 -222729 -191864 16832 -26259 204801 -174843 17675 -151162
23338 -132496 36025 -48032 12747 -50459 106780 265528 -521652 125842 -30949 -143500
23328 -143500 -198147 344169 216085 -111078 6662 -342033 -334348 -116596 -190462 -365137 155631
23316 33380 107869 -38527 -22392 167235 149489 -93322 -78586 -121594 110225 -408475 -124805
23304 -74119 289516 -131185 -29958 -487667 161493 -11490 94177 11991 -159898 44930 2554
23292 152054 -27787 -27315 -274304 1917 -200049 292244 -65452 169784 -225016 124727 267272
23281 267272 327932 24662 -19950 86769 122095 -57521 6811 122168 -146563 305881 199796
23270 199796 -199427 71149 100863 216095 -206735 -106135 -208748 -74796 196615 261002
23260 261002 420996 -60184 -172112 -32824 76194 78337 18374 -64429 -151479 66937 149732
23249 149732 32335 -4825 63837 -69534 37649 -103493 -195447 127745 13917 249722 -234411
23237 -75643 150650 -170347 105154 243176 -236881 147094 -476918 -122186 -162041 -184118
23227 -184118 -276976 202469 19031 -106006 -73223 197444 -135711 -327044 -211725 59361
23216 -181353 -43300 108726 -49601 151387 -133096 -126805 -72481 161837 -121439 -98324 -162954
23205 -162954 30158 -46190 -107203 18517 295420 -61015 467813 -161313 -200398 13696 68612
23194 68612 -197620 -88473 30146 288210 -137505 233700 76445 -168836 158009 -120386
23183 -129024 100358 -97857 -165717 -81885 262805 -27500 -439853 -268357 127806 -70075
23172 -142755 -61577 -195761 -22167 97716 328713 -16128 323147 169861 -66107 158441
23161 76144 78148 -55565 -46274 335899 -308132 285386 -137813 82649 -258425 76352 64455
23150 64455 48689 17566 -295864 -480571 311318 -23727 75172 -73813 -211376 -138439 -48540
23138 -139404 22757 255328 11090 -93520 -236860 18452 -121581 227354 -130620 183216
23127 281651 163070 -200697 67060 64032 178161 32026 -101375 33422 -394130 -119180
23116 -210891 66955 22205 -103919 -152248 117905 -182884 -10996 -48293 41538 333330 -99947
23104 -240175 145768 148946 223536 35944 -89746 53837 -241390 26084 15522 34884 175938
23093 175938 -2266 -211791 -47865 -193356 23140 250793 168611 -218028 -1426 -170314 193559
23081 -54494 198758 220727 -239805 -195963 -155548 -352267 -32622 -158263 -15589 -350832 -25688
23069 -21793 162982 233914 48653 -322080 44182 75099 115598 221989 3966 276906 83396
23057 219053 -165975 -79198 79667 -211356 191310 173641 -50144 -242661 58198 47653 291664
23046 291664 -83095 -132524 -146767 82635 54234 -49015 166062 -69406 -146905 -35686 -139139
23035 -139139 -24631 -165484 -316247 45796 58800 43525 -105177 23407 265791 -113763
23024 -131441 -26233 103756 41157 55495 -27744 86938 32036 -76328 -2997 346189 -203857
23012 -86520 -85377 -82821 -118544 32819 37632 -10167 -85885 90928 -324630 -173139 32385 -5457
22999 -330649 -52323 -42824 -95213 -31975 -134941 190572 39612 -90544 -62265 -89266 -98071
22988 -98071 136498 120569 -194041 -16509 -88344 -33174 -115412 91658 32162 353220 -169447
22976 -84044 -20733 6693 -472382 -78816 77118 -11458 6828 -205663 -307519 -161315 104210
22964 224687 47936 -84775 -263608 -361549 404306 -24610 -58851 -329958 -52084 -276854 59461
22952 -265442 222782 -217763 92845 38340 -118413 -19513 160278 321613 -217763 -88477
22941 128774 -60293 344287 34311 42165 -65892 -111557 2924 164488 -76845 -50270 -90267
22930 -90267 116910 -149425 -63988 -120178 152958 -33106 -91695 -29932 -452502 30843 243131
22919 243131 54676 -62038 -240162 132454 90833 35499 -65879 -270643 -122816 164062
22908 201561 47918 -86902 27797 13437 -341673 -157686 148405 127502 -126161 185462
22897 35368 -72141 135733 34628 199 -333644 100907 12103 -261855 -28775 50376 -535467
22885 -45851 -136827 -171330 -33662 -171875 -298837 198822 -37543 44089 -9207 -148720 -72520
22873 -93597 338028 -28098 162182 142202 -402320 -289555 -112998 -47409 -53737 -205512 -256492
22862 -256492 -236461 -49913 -429083 142364 -10961 67074 -184606 174808 218035 5655 -121863
22850 310909 261679 123206 -133443 -10733 -349104 -347233 -14186 173056 178259 -116144 49357
22838 340498 41488 157080 -456399 -154887 -89528 166956 -316731 45811 5151 30894 -137999
22826 -138977 66599 -57008 147052 -199487 -194419 156798 44209 100676 75642 64422 256866
22815 256866 -68930 112422 2658 11501 -86145 -82232 -117016 -161438 -194631 -153303 53780 -418743
22802 -272249 -219252 -22074 -333012 -124742 119708 357674 -295422 -78256 -496110 -206025
22791 -209811 -98787 31222 55089 -509546 -177086 -190575 265270 -118240 -137166 11190 382210
22780 382210 -24728 120267 -118581 222685 -176134 70885 -349534 -107543 128665 -444617
22769 -160876 196003 65105 13602 -423010 -83444 -81231 58219 26997 12134 48205 69975
22758 69975 305209 62974 -30048 -84343 74228 307195 -285339 127964 -207153 77525 -54740
22746 -103765 -6038 -276857 6868 -59408 -20184 -52892 -201770 266207 268728 5914 -93548 -239652
22734 -239652 -10550 26567 -290190 -95732 -228285 241166 -129210 -9876 -248242 153708
22723 52689 -127746 -60147 39140 11725 75992 -123324 303691 -135641 -122999 -296862 -31358
22711 22325 -172126 -171463 28737 -70117 -216012 21871 34179 23076 -85833 -27861 -92223 -185981
22699 -185981 -53705 27360 95263 -87705 49822 80144 -137527 -189903 204697 195391 70555
22687 -190047 55879 105539 138478 29869 -5770 -183535 -35910 18785 73033 40765 -16946
22675 -156985 204412 -174692 -109863 -295733 -77731 55426 112147 274894 -141702 122897
22664 82360 -1509 56492 50400 239525 11658 -102582 205305 339128 -65151 -57397 157078
22652 87219 48617 76874 -73563 -64764 236410 -86544 55036 -194031 -109600 62314 -235832
22640 -117858 15296 213493 372001 93305 75427 154860 90316 301047 -324201 157431
22629 27867 5157 85091 -263371 16890 -77184 -35906 264888 -216476 -32191 50461 201667
22618 201667 -152707 -202786 -42388 -71853 32194 -49622 -92664 153283 104708 34086 37214
22607 37214 -5688 28617 319980 23504 6241 -204016 155370 -116987 -49134 -317973 -141974
22595 213341 326905 240351 -129266 -212048 312705 -34296 -9750 -142360 -195511 -381301 -186155
22583 -230505 -31492 -47952 95413 244464 -346320 -351237 -96772 -64188 282821 -116745 -337291
22572 -337291 73362 340255 2287 -30287 -124877 -79724 -359178 -73003 152876 -411912 -191674
22560 -35753 83662 -2278 137321 -295055 175563 5006 -39450 -201466 -28596 220209 -18635
22548 231013 -56528 -51932 -62623 26264 -276844 30429 266076 86562 48738 -280526 75110
22536 -95967 25193 -27374 60090 -171987 -164096 284192 -306400 69376 -420004 -340207 -210994
22525 -210994 -216687 239103 302382 -182993 -169506 -204441 96779 23659 85241 -262699 -180737
22514 -180737 23877 -183244 -58371 -511983 -3102 -265609 3310 57316 19144 160240 118342
22503 118342 7150 -16420 -202293 -84011 -55110 122622 -45293 -232645 -30140 -606583 -423553
22492 -423553 -61965 -154155 -50193 -37131 27946 250903 -163063 -206833 -16216 -346079 282193
22480 -4950 434379 427790 -253425 -5893 118437 124041 6913 129486 30617 -267106 86650 -90011
22467 -212450 -256374 -137655 -506374 -64453 194540 -295713 -126482 -34557 -110198 -120324
22457 -120324 -261599 -42375 51940 -215535 135021 -49083 -99680 -11052 -369236 -242241
22447 -242241 344605 -90442 -89101 -25266 265207 130099 -168002 79793 210561 -86500 180854
22435 82655 42289 6927 257211 -210203 -288218 -88548 302573 -18588 296388 -46555 -148543
22424 -148543 -110838 373047 -111710 87914 13315 100047 -76411 57692 -276770 -136406 153299
22412 73496 -78304 -7090 -177979 -260832 -203519 86664 -343600 -268377 -144651 239121 110598
22400 -140009 -156584 -288404 -116621 104615 -45723 259650 -109943 53365 8357 -40375 96615
22388 240763 -84711 167241 220756 13624 -66512 112701 -113121 -18577 52027 126934 -60698
22376 -240520 81615 14105 -160919 138364 12173 -34480 128206 188688 -434732 94736 155300
22365 155300 71177 627021 -98063 -131796 279960 169067 -40193 114873 8618 70327 -164607
22353 -147079 129382 124066 72250 46996 329797 -209839 188665 32876 -85572 -212261 20461
22341 23114 -212251 226598 173040 309482 26639 -295229 -106305 -37951 18813 187877
22331 187877 -24004 295490 -198395 -333477 11691 26076 30103 -88775 36332 -15029 -123177
22320 -123177 91327 24755 60678 -76088 29849 -48713 87304 156110 -185825 -110121 -364693
22309 -364693 233684 42936 -37006 152129 -315073 -206343 49908 60923 91724 -248859
22298 296015 97018 151024 106736 24400 83327 199146 168468 -155373 320867 343941 3216
22286 -157648 -79989 -107105 153961 172227 -24731 55028 124293 -34349 -267417 63595 53772
22275 53772 196550 29247 -166486 -145211 161099 -136421 -110593 -224384 -114960 -7192 259382
22263 -298752 -68984 -47161 408921 -192891 -143019 -530004 60552 97682 -42753 -432914 -29524
22251 -187879 -48302 61594 -4062 -145269 190539 68332 298825 53599 -273074 -125690 -243454
22240 -243454 -2863 -158684 146043 20523 214612 13609 183393 90176 209387 -192999
22229 76582 -471530 -227212 165410 74895 23818 -49613 126028 -189658 -141775 -147285 327425
22217 -201761 -88555 -441978 -258389 -26692 26539 -264599 -66427 225255 -290530 -430102
22207 -430102 242858 -91998 -77269 115751 -27306 65509 52820 -52949 -24541 -147669 -44677
22195 -20812 138912 -130672 -290359 -105630 -422382 -397648 110764 -87034 99137 -145574
22184 -6073 170417 -170020 164659 157262 -96742 -242564 16908 -150908 -126312 39463 81289
22173 81289 -217346 -52313 -8712 233569 225449 -184158 195751 -93619 28483 -48273 -206318
22162 -206318 26401 10430 -39004 267688 -599085 -189044 102580 -103509 -120111 90305
22151 233853 -19287 143398 -253901 68944 -170394 70460 178391 -141994 -79244 -309560
22141 -309560 -95554 -57521 -10959 -2536 365791 47226 -227661 -364079 -203357 -103211 -248817
22130 -248817 -39700 -28788 -72228 -16228 -28596 -153894 -212409 -146963 43400 303852 68123
22118 -240790 161548 189521 -33964 -353634 -285944 -110653 -141405 -82029 31630 65978 -271977
22106 13239 79797 187503 -257538 -847 -80980 -25151 60409 -73188 -225832 14760 -39802
22094 132743 -217454 143292 -116918 -132119 284198 -72758 2989 126486 -168708 229353
22083 -289228 137786 -300507 -332997 -81556 -208258 -63470 -139151 -69399 -36190 -138070 237611
22071 -271070 -86840 -413986 -8302 -351792 28580 -320038 -126775 -122812 -76408 -36621 -41029
22060 -41029 -53973 135794 -790 216248 -271363 32724 -144647 -52477 289417 -213180 -141116
22049 -141116 -151566 149127 -23458 406677 -40775 -284377 -223479 44261 -171304 63848 -64058
22037 54518 11292 210734 -217602 89083 -121588 -171571 230518 -117010 -23966 -133154
22027 -133154 76624 -142825 -94001 191087 -115808 -321807 -348166 -114260 46226 -18 33387
22015 -165050 244070 -57643 179726 173994 193860 -128183 170868 9743 -220524 13124 229317
22004 229317 160026 159221 121105 -129206 -7042 116976 -294200 80116 -105237 -175253 93718
21992 -24015 -84444 -199993 -105193 -112832 28810 -176032 -160829 208293 -289241 89525 -67861
21980 -213180 -207634 -130624 -164481 -56296 -108088 58005 -299773 55915 259056 -39453 103072
21968 -35404 36093 -242498 -135091 -10957 24953 310288 135246 -95935 -521576 87089 188098
21957 188098 -38653 -180023 -57013 -109313 -141280 -40427 -286548 430863 120548 -20159 -140141
21946 -140141 -55331 49592 75609 -101270 268027 -74297 97359 -34007 10023 -279601 15525
21934 188493 -169100 -499360 182041 181504 -226671 436399 295790 28920 -133924 -186092
21924 -186092 207109 35914 233458 -135876 -227551 -210019 64206 59599 -211823 -184995 -240950
21913 -240950 -54706 170760 -179358 14269 -142099 86161 -78951 -94329 -71908 15128 71190
21902 71190 -21531 -115731 22569 -68311 -30938 2464 -68092 -236108 29702 -277413 -315190
21891 -315190 -34939 118424 70678 -33679 -257791 8553 -113730 200685 -88877 -292946 89596
21879 -216017 347191 -50480 -315951 -82687 233050 154992 -150369 -132046 237627 -128149
21868 142283 59247 43427 88747 175701 -71596 47179 -266580 178411 368471 230337 48
21856 -201144 170015 -251128 70026 -23116 -1580 -300990 -166586 139374 168382 -110261
21845 -43556 -137250 -68498 205772 29255 50607 160727 91847 -276784 361677 64083 175274
21834 175274 4003 -367105 12513 -276544 64672 102337 -32147 -325231 -47665 -75813 -92490
21823 -92490 183670 -53267 -90315 -135480 18425 285302 -280120 421185 68158 489067 -228440
21811 -44562 72229 190252 150328 -175914 -237798 57723 -2787 -255493 69199 99381 -313994
21799 141771 -169411 -294139 154306 -128485 -93441 -205215 -165141 2039 -80894 173503
21788 258498 42427 251566 -26413 108710 152671 -31822 376373 37362 3455 -83334 127854
21776 289553 -2354 -141753 -162645 -312064 -106201 -111084 -232663 82410 131760 285792 -351431
21764 40447 -427995 269694 8696 -116887 89183 -54390 107486 -193872 -34526 -171527 96362
21752 -32448 -233204 -24383 -94264 -374612 -85660 -127604 80573 45098 -218332 75242 141944
21741 141944 59804 18507 218126 -37288 158077 -103959 144246 4932 -81577 -347838 -8227
21729 22830 -54623 -83822 -282494 -23746 -303522 -337726 171012 -296917 274223 35985 79258
21718 79258 75032 299549 258104 -285590 -76627 -105022 -129401 -102937 -270734 -158456 -22296
21706 -221526 -108925 -298794 -30087 64908 6948 -144112 -34348 28002 132467 -163637 112725
21694 -12266 -122450 28657 -107503 -178482 -274923 101795 -295726 -184266 -202840 -198095 -100074
21683 -100074 -78447 -85555 -261966 -95462 99827 -112130 -179304 41284 38450 -98586 68309
21671 326330 143296 -128579 1783 3532 114665 58898 -78126 -213076 -113130 -120120 68495
21659 -220200 -5781 -211905 -182930 86552 178938 34070 -115030 -159561 35296 112417 225963
21648 225963 -103686 327425 117695 90197 -237482 -256671 198408 -59088 -218925 -376159
21638 -376159 224903 -7549 -31760 260734 -242307 17184 -83491 -218323 -236507 -141506 -294364
21627 -294364 -14531 321365 30408 14848 236308 -170602 -98306 157749 -228204 2559 -64385
21615 -192073 -137503 310470 270149 224223 -88964 9728 -48094 -87748 49897 -85603 18064
21603 75276 53037 -280552 -34899 377 111797 221821 -163531 -251463 20766 148195 -44784
21591 -83309 48041 271272 -264149 4930 -31359 1690 -236799 -36837 -293906 -174636 -108543
21580 -108543 -116560 -91211 134079 -500439 26043 -313655 -207627 -392248 -136018 89869
21569 33062 61130 265266 -60796 -39187 78392 125697 -118839 160128 220486 69178 -179206
21557 -32175 95886 -182968 -84362 233403 15634 118886 -288707 160532 -77573 -351660
21547 -351660 -158495 91806 -88551 -105240 -123741 67264 182615 -232044 -12359 257726 -101701
21535 52367 -200511 -394811 5622 -90922 3099 -343465 -153568 162910 12037 -29441 162040
21523 -198757 -50808 7824 -322635 181343 10684 -186857 -351615 -63193 91541 244997 -166242
21511 59013 67069 -102021 38401 23379 -173759 -252867 -324902 -37995 -34862 -306781 377716
21499 77751 -153686 365447 -43653 100977 89651 -126916 14514 -85449 -169317 94800 201330
21488 201330 181040 59709 156829 -481730 -56372 61907 5753 -109366 -234463 -46174 -68824
21477 -68824 -318062 145032 -59609 -30720 -69176 164674 77835 85874 163668 -134329 -116330
21466 -116330 -251579 1433 194868 -289355 -44629 87980 -78321 37582 -157223 -183449 -22518
21454 133449 -117253 -107203 -55694 4383 -28181 -134530 27457 -144757 15761 -295175 119543
21442 -72296 -74125 -185140 -395116 117129 191444 524481 214326 437206 326807 421848
21432 421848 -39920 505462 138012 88229 252110 32119 -31571 -85298 411454 224154
21422 224154 -205195 -188789 -69548 236454 -8275 -324745 -130921 50431 8822 -215722 -207744
21411 -207744 -284992 -285803 -340747 170362 56289 231944 128051 31747 7003 -89743 -12269
21399 78900 28659 182712 -411809 -92766 -35226 56200 -16590 -60451 13706 -55317 -110790
21388 -110790 -208943 2589 -134374 93243 -7005 235533 52327 -426908 129102 -176588 30485
21376 -82324 38526 -117109 -89968 -47063 -308357 286619 14672 206156 -44859 -403034 -28997
21364 -482313 131182 -332707 186679 205631 -127627 -263659 -75512 298938 103040 234599
21354 234599 -216352 4895 -178486 -189656 -3557 -26881 -513912 104 -256941 124959 -205550
21342 214231 -307583 -64167 -8664 122794 111934 -192752 130376 -75772 58725 -236498 40081
21330 -143353 168939 -158450 -114884 120793 108095 -197945 -196013 -1052 -123801 -216051 -248242
21319 -248242 -23208 -101131 -230905 -441669 -75368 82167 -102651 -128741 7488 180921 93761
21308 93761 -101356 27441 254035 -188796 12600 349506 46189 -372098 -114200 -197420
21298 -197420 -14950 -138601 -109513 -316728 44086 -364990 830 381549 -133664 22515 -291541
21286 -4136 -277789 -154002 -206856 -92455 111747 145049 -89811 -125870 -238448 -245494 -281537
21275 -281537 206500 62313 -150358 10597 75646 -186400 -32787 189916 -253858 60562
21264 -95975 171509 143412 106424 115993 176678 -200910 -181619 -350884 62244 204015 -128236
21252 -183030 72857 -398420 -5275 241444 -19632 125554 9286 -313503 1646 109400 50511
21240 -544852 -96670 -81165 24777 -24048 175345 264265 76897 -231352 18664 -362533 -34548
21228 23066 -73823 -319483 -66095 -135205 330171 90535 95931 -66220 -391560 -203610 -140931
21217 -140931 -151092 140567 130911 131132 61163 -115813 164299 61248 -73396 459047 -54959
21205 -266562 -94885 86942 55217 -300369 -103158 -159932 5476 39014 -62799 309960 -115017
21193 72415 -2972 -46588 -213856 60243 1072 -17708 -155260 -363797 -342818 -39877 -58550
21182 -58550 -119812 -265331 -200618 4624 -199940 -68534 -18339 278051 -243921 75446 103008
21171 103008 91082 -146934 -257621 341765 188922 35202 -216730 86687 -51268 62228
21160 -112130 -95027 215039 -45964 206686 -78455 -345292 -104119 -186424 48908 19794 278412
21149 278412 160578 -104352 -62714 87467 -112308 134239 187184 -95179 -242660 139530
21138 605019 -27564 -370278 187872 25797 7918 -264907 79299 -142099 -55878 -36185 -245516
21127 -245516 -148537 -104271 243417 -264018 145015 -241049 11543 -232471 61884 -78994
21116 -13429 159076 -521366 -129568 182233 267551 -232056 -280948 215046 -210138 93265
21105 -51792 201814 38229 -6837 -290853 89167 -156341 -168770 -45416 34975 8280 -35027
21093 -273969 35513 86896 128554 -24058 -84535 142366 -94541 -64789 37586 -48033 -302628
21082 -302628 3334 24941 28116 -117652 -133457 6621 -104205 -60808 -136335 -1070 122407 -60544
21069 -132597 -328746 160655 -246134 -35791 326306 36677 189979 -12713 111516 -35182
21058 164750 -66240 10959 -70432 85525 -71732 137415 -68088 -219911 -131072 -275671 70233
21046 -250497 31694 -248068 -118903 -228002 -234375 356702 -28644 134672 -166465 -79986
21035 -223887 104124 5211 158276 96755 239682 207284 -12623 101202 129796 -36313 154329
21023 -203180 91522 -169563 -10064 47326 106112 -20851 113177 -67390 140397 45792 -302102
21011 3411 -107051 -57874 -184896 62302 -121259 91337 -260241 -63730 -127112 -124935 180962
20999 -92247 284465 -222254 -186715 223102 -38119 -98222 -304193 -77775 350890 -101724
20988 379130 -185911 -157603 -91169 -203705 -98707 -34587 -218699 -59079 187641 -195800
20977 141686 -16361 100743 187855 -184773 -68722 -158796 -88033 -228330 75451 162249 -201161
20965 320346 6835 -296128 -220572 -141041 -26640 -133439 -311847 -258874 -88643 -353688 218896
20953 -1319 -48630 48479 -39668 122138 -170493 25060 44902 162984 249302 381272 -266975
20941 -127077 -125165 -359484 -219210 -81416 142360 -76152 236793 -50616 -313941 -239194 237074
20929 71344 -57083 -46221 -77740 -260176 -64419 -355870 -58763 -86220 252695 38290 179700
20918 179700 -103553 -121993 -137073 80536 -337920 -168822 275665 39701 -50376 -206110
20908 -206110 -145548 50438 -482833 -442520 -406545 -500966 -175200 -254289 -90899 -199805 127174
20896 47597 -511195 -206652 -125223 5711 -283945 100008 -214873 106700 -51682 64363 30356
20884 365050 -221228 -197653 25262 378807 5159 -23758 -262762 -66472 -173021 45546 -47761
20872 338271 -51116 123108 -176591 -5624 -356281 -125805 89006 -109977 113767 -6968 -101174
20861 -101174 -432396 90469 -42605 32169 254655 -123383 -405427 42374 -131628 -141675
20851 -141675 -1273 -13682 194114 -209924 70696 -202278 -139298 -45890 -122915 4183 -267070
20839 -290018 209079 -20355 -147885 -161700 84441 -20926 -7129 93927 -116105 -159392 -268445
20828 -268445 150482 -38491 134256 89652 77414 152052 140346 76555 118446 -186996 195720
20816 227316 15524 -181177 -145011 -256014 -35443 -89309 -274727 -25090 659 -194671 -67949
20804 6605 84083 177163 -166947 -115357 22888 -194635 -68464 -317663 -69650 -107978 -198237
20793 -198237 -197885 139822 180360 -63589 112790 -240057 -211745 53089 73822 14994 51000
20782 51000 -26444 -180403 -11031 -36806 -51137 -65318 30300 -121478 -48098 68805 86766
20771 86766 -50556 3160 237791 143113 -38788 143974 -172808 -374805 31236 243604 -73931
20759 3435 -212132 -236757 35836 -146471 95039 -309143 156684 -234689 -89094 -62608 -19118
20747 -357308 -83136 -36167 201319 -20961 -100232 -423229 -87003 -28063 -201598 144356 129298
20736 129298 38447 -189858 261325 -63801 31332 -163151 -266010 85108 76902 178718 -234601
20724 -29973 -189970 -259031 80881 -33760 90480 -344560 -125251 266740 -158884 33996 -15304
20712 241921 362287 106108 6701 -27078 -130703 -49744 97327 -187910 -365057 -97699 70172
20700 227266 -105156 -149142 -153873 -77996 -93975 67240 11802 -58437 -20400 -316485 -234762
20689 -234762 -58646 -125045 32429 -105607 -223612 -263122 -265696 -249233 284489 -10903 -147529
20678 -147529 180478 -83521 -61573 373689 -105818 -23477 -124867 22264 -80479 -2596 -66060
20667 -66060 249274 -136095 259621 18410 -434685 -236679 -81094 -27607 -165396 -78545
20656 177354 370094 53884 -243510 16997 187124 -116560 -94807 72192 22868 330791
20646 330791 -438680 -83830 212517 86460 273128 104055 -190454 10594 -2522 -103560
20636 -103560 -15333 -138503 -153183 -169333 12748 -80741 111737 92759 53348 155590 -202878
20624 14443 -131830 68027 -35026 -187760 51726 -234934 -353461 -182170 80246 -103929
20613 -66158 92755 -242404 -161906 -257704 -401484 -190517 -78656 -80739 68170 -71198 -41682
20602 -41682 -222857 134944 85285 -450883 47242 285140 260754 -217450 32270 74308 -582878
20590 104728 -233145 -501648 200316 8094 145816 296683 44667 149781 84300 42 96474
20579 96474 243020 173505 116033 52966 -104068 -192588 104805 -185248 -10014 -268130 -197
20567 130103 109880 -365155 -18748 -291407 -144276 -14397 -27339 1852 -198981 -82929 -113345
20556 -113345 1891 244685 -68300 126321 24793 -167712 -93290 -197146 -294879 125513 -393413
20544 74434 -233350 -64566 -90295 -27031 -197034 165312 27914 -304377 -5991 -117753 -128514
20533 -128514 -177896 -314321 -330425 5947 277219 44486 -56273 -306466 -189142 82870 -239863
20521 -19148 119745 -221679 -608 -118199 59479 -339277 -1409 -267829 104372 -99584 -61638
20510 -61638 -76079 -87717 -178153 -23231 -206362 -367075 41734 -349257 -198697 114677 -249362
20498 -4525 -134199 143512 -98520 -403887 -134644 150198 -222350 28 -39339 -32300 -39708 -122385
20486 -122385 58688 -42991 -17100 -52011 204030 -10514 242688 -18255 80204 2280 38318
20475 38318 132262 -20228 16831 -44920 -22427 101297 -156425 -101716 -173276 -226480 -128047
20464 -128047 -186392 252727 105598 -94350 -202214 -12806 -3936 -208983 170724 -5139 -192649
20453 -192649 -100830 211404 -7132 -2217 -121949 172577 15740 65197 -226370 30075 -153324
20441 -268010 88628 -296744 -254890 -216357 53054 -104861 -180414 -111909 -113105 -322011 -77812
20429 359625 39309 -178570 -389951 -81665 -63259 -68913 175209 -129517 -166134 -632690 -123102
20417 282915 -318441 452844 70448 -99873 -79216 -133599 -57442 160577 -43780 -180063 11984
20405 -2946 116461 -164615 11020 -273266 -211773 80460 127833 -117991 -239806 149465 328234
20394 328234 -195746 -74044 -330870 16517 144982 -343503 184469 -252642 140461 -397660
20383 -88441 -11381 -348101 142453 -100731 -227516 153044 -90460 -226657 66502 4674 -79070
20371 65168 -317901 180511 -77568 -75842 -205081 -26366 -28754 -207224 79979 -266632 -4966
20359 22059 63938 -7289 255110 -11735 -214694 -14764 51674 -52099 -210522 -75607 -170047
20348 -170047 134440 62457 -164843 -425912 92073 -467978 -139592 55193 -2992 -188853
20338 -188853 140387 -114720 23168 -171512 -146559 -55776 -94042 44256 -21372 225534 -252336
20326 -19416 -77393 -43306 16784 -25388 -57970 -5700 37845 213985 -195691 -66463 -44033
20315 -44033 -100601 102211 -414462 19372 -455030 -265298 46374 -51522 148326 270018
20305 270018 -67561 -290778 -10717 137710 -139302 19542 -4903 -115038 -86429 -4110 -67177
20294 -67177 -378144 -250596 -168768 276013 -15216 -165948 -408614 108714 136755 -306188
20283 100678 -83622 -138298 64482 258174 -161108 295123 -45269 38323 232668 -79210 -112052
20272 -112052 -48709 -28339 -292245 -292352 -105911 169043 -10800 20309 -93177 146883 -125872
20260 -20709 6898 -43584 -217445 -55345 -133467 -11623 66885 -249824 -315399 -6175 -356444
20249 -356444 226907 -256791 162171 20178 -257987 17092 -121606 -140757 -83532 -418258
20239 -418258 211489 -124534 -169373 -244019 -150846 -385891 -314407 -177210 -223381 210723
20228 35685 -83205 90389 -177806 -96499 -108876 -178643 -138875 -57294 174651 -20086 -378316
20217 -378316 168281 117145 -102899 63226 -364440 18509 -91803 94510 23967 -206431 142290
20205 163602 -80029 -197943 -311773 6254 150091 148418 -372098 76258 -79453 -76558 -227794
20194 -227794 -72193 223496 -291173 -63022 -172901 93404 -221356 -4398 -315309 167810
20183 -92337 69529 -117206 56784 -39077 207004 6517 171767 -109370 -155828 11979 -305374
20171 -82354 34541 -279468 22687 162551 243469 -196100 -47970 205352 120276 -358305 -44748
20159 332 49298 6246 -129922 -74720 -139823 -274540 -158569 -38366 -14908 98397 70202 139960
20147 139960 -357044 126148 192538 149481 -89563 -94923 314721 -128817 -157629 -256648 209521
20135 -14381 194837 321393 -237664 45566 -297933 -248433 -12579 23476 -131216 -425238
20125 -425238 -349984 -166207 -348694 313132 -7651 102751 320065 -56952 66400 53353 -155994
20113 -68301 -163164 -39604 -78502 -159478 123772 -14279 -90088 -197407 -94174 -144940 -249520
20102 -249520 -155028 -82532 -451489 163751 -39928 270041 220878 -418635 -33847 117443
20091 69311 -183095 -90575 -24590 -223895 -137873 -38976 -56885 422373 144565 -155438 -26606
20079 -242335 -89275 -296555 149730 -50644 38070 236703 -11933 94683 -159875 77008 -80086
20067 -286009 235458 71583 9089 -134498 -113678 77243 347700 268653 -127865 143242 -154277
20055 -103697 287010 30867 374726 -210494 29286 370976 63441 -74555 -281981 -61757
20044 -37856 8097 -95103 -148452 -48599 -262840 -420009 -38031 130480 257257 -97498 5762
20032 208787 159770 -227107 -234318 148460 58284 -53120 -77609 -86746 23553 -45378 -278818
20021 -278818 -57761 -89277 -61654 9752 -99521 -173393 16075 165367 17608 62492 -125654
20009 56434 -85563 -104989 -29991 173060 -113440 112710 17221 -207047 -216190 -148840 14593
19997 -332766 -153708 -109647 -188705 -40775 -86626 -135466 -171779 -298741 -98417 -274406 -142486
19986 -142486 233803 79511 6708 -206518 -94537 -121999 71162 175555 192620 104795 -98784
19974 -69917 155 27546 23303 232096 133337 66110 -49064 107923 2836 103764 -58912 -218166
19962 -218166 137482 -50443 -262141 9235 -193184 -456605 387559 -243839 -199865 -343266
19952 -343266 -208603 -206477 -322385 1194 242330 -144822 65472 184374 -147721 11907 92253
19941 92253 -136953 -28176 -38404 28250 4208 -3700 -173026 -35270 -164475 -497445 -346004
19930 -346004 -366087 -182243 -89945 -45708 -56819 -32154 -247817 -29589 -420054 166521 -34782
19918 177353 -173867 -218595 -219743 -44612 -306742 -147007 -184568 -400719 -298705 255274
19907 -90881 8371 -244126 203610 -41473 -300377 -63274 -256567 -31351 -44222 -99673 280197
19895 392350 -403413 -34579 -142575 77341 9224 23155 -127558 -64856 75217 -32542 -185799
19884 -185799 176868 24011 -76019 -59049 18169 84622 -213396 85537 -129408 157067 -220305
19872 123223 -20640 96666 166656 -241576 42666 64244 -113183 321776 -213380 124969
19861 331802 76105 -273743 28992 -23220 47679 60231 24066 -97103 14758 -213510 185597
19849 -252718 -275099 117054 -279771 88468 -223092 177382 3099 30276 -257575 -128666
19838 -139950 -58831 -47713 -269077 -39780 63850 287483 -126972 62553 257446 -68779 180156
19826 -116647 169944 -92879 -51197 -135772 -368902 -117994 -312403 47164 -161408 40994
19815 -118865 -323952 310092 -87368 -314428 -226215 -22535 -109628 158634 6307 30180 -74347
19803 -329788 104448 -298408 36572 61236 -215454 -272031 -269905 4459 -1490 -242779 -137705
19792 -137705 -323301 -205117 -333338 71944 180573 -614217 -217654 27648 -202335 -15811
19781 -222468 81392 205755 236151 -171164 -169947 -5419 -27128 59393 -144441 54360 26304
19769 -147391 224507 90908 203065 144379 -188344 -75234 -235840 117573 -108935 264152
19758 219424 170106 116824 193946 22744 -45705 -15283 -183811 397086 134223 -163601 -244226
19747 -244226 166329 -125223 -73108 -65047 172260 -320734 -265074 -255202 30543 -238789 -38695
19735 23709 294407 -85348 -226813 -374636 -83000 -21380 18731 -17755 -30605 -269165 -386829
19724 -386829 -52429 -146077 164536 -201109 -129143 -182247 9722 -213725 14535 138386 27024
19712 243000 105583 -190988 59820 -93246 35 -97442 -87792 9781 5714 -63904 30985 -110106
19699 -228978 -43598 140100 -293331 189883 36322 -113943 -252263 197057 160484 98049
19689 98049 -172713 -123757 -40893 70854 -195115 -170894 -184780 -145866 -59237 194949 -7651
19677 -258561 -224225 -136429 -168550 429001 159768 -169527 -19902 -27764 -152896 -78262 77471
19665 56041 95699 -99120 -14797 43289 165811 -64863 181161 62085 75040 -175731 167043
19653 -6889 -177148 113759 -19236 -158904 108475 -256535 -375361 -387537 107823 -241188
19642 -54913 -4205 -157195 -194669 53064 -191252 -168218 325057 128504 -184245 299541 -126122
19630 -112958 -71022 -199231 -157121 5703 -277913 124496 -77101 -28862 51277 60909 -346253
19618 52886 -179435 -139151 169580 20657 -60265 -346386 -249500 218514 -63378 1069 321012
19607 321012 -119196 134938 -198943 169562 167301 87798 151064 -27696 214814 -204389
19596 -247 21965 -29385 -131290 93978 -34683 -132949 -63877 -171805 -372813 262688 -193989
19584 278355 200234 -18679 59951 -26101 65958 -42785 55375 -380256 -1906 251267 101307
19572 -175952 -19244 29437 -231562 -50703 -365627 -190413 -85306 -243639 -3262 158427 -145116
19560 -308648 -92343 -52693 -3686 112488 86404 -352684 79091 137344 25411 -195200 -134088
19549 -134088 -78665 -116598 -360835 -355477 20324 -139659 -58572 -207322 -147338 -10458 99936
19537 -76814 -150017 256347 -280220 -29121 -200230 -24171 67340 181195 -9178 10625 -273513
19525 -192839 -64509 -105834 -77611 14831 -97247 -15474 45146 -528323 51736 85292 60261
19514 60261 -227486 210443 46312 74063 21437 7789 105877 18544 20709 -239820 -119316
19502 386020 -1059 -110647 343446 -315889 13758 -205133 -108025 -8713 -110754 166780 526930
19491 526930 -88729 149877 228342 -128268 -18155 46070 53957 20655 -26553 -139162 -26075
19479 -269033 -240012 195599 -398872 262065 -9529 -330076 390877 45814 201896 -115746
19468 23635 -38996 51240 26311 110851 -59433 94602 -91123 266511 -50570 -158719 -234028
19457 -234028 214662 -99968 -415041 -269781 -141954 8659 -146281 149132 -286853 -11742
19446 61219 -115368 -74656 -219679 -295195 -175098 130063 70729 -237351 -112103 -98590
19436 -98590 131393 -42625 -69878 171941 -69153 -28457 143847 -3741 3531 -64023 3339 227815
19424 227815 -253204 70071 79728 -94609 -56219 -72730 265152 -274709 39330 79960 -23534
19412 -14791 17191 -240863 -377010 -93653 24492 -143990 -67471 -232094 47967 -27138 -136882
19401 -136882 -106823 -403863 -16881 104665 -282883 -353935 129197 -28231 -39801 -25024 -152542
19390 -152542 428702 -47812 256538 -156733 -240095 32382 76511 -330696 -397654 -185538
19379 233307 111016 61721 -225707 -69927 -8571 -102237 -136284 -282792 -57728 160146 62518
19367 -181151 -246942 -83183 -27758 -256312 256056 98823 -2133 -78128 -17075 119042 93732
19356 93732 -251019 6719 172856 -210780 -64002 65094 -191883 70768 252999 -224576 -83422
19344 -62357 -4683 -87010 -202681 -216145 -403971 -176767 378716 -148013 142254 -128360
19333 -142958 -26764 -10101 17652 -21688 -237476 -204505 152793 141256 -159509 -136166 -318859
19322 -318859 -137134 186610 -116785 -115553 55432 -177080 138940 -157396 -71192 7848 33368
19311 33368 -103894 -287454 136139 -282132 -2640 99403 -69103 -161252 -312910 -165803 23906
19299 -15667 103766 226088 -179264 -318074 -50387 -170492 -18785 -209753 -273069 -88732
19288 44410 -315283 45317 -120746 -73119 -95958 69848 -180064 28733 165971 344997 -83306
19276 -167823 -87700 78263 -176356 13474 -44718 72444 378660 -87119 -124993 209857 13645
19264 -308614 -183725 -205151 -120200 681 -264771 -158710 -187000 -70747 -156986 -5664 -339130
19253 -339130 -174701 113350 -1273 143996 5027 98255 65236 24749 134580 -334331 122951
19241 -117176 57340 -115002 -140842 -106382 -163789 158280 -91479 9258 -51960 -136255 -114647
19230 -114647 -222469 -150435 100539 15125 -249577 -232304 -342646 -172979 -188258 -75528
19219 25266 -274940 -99324 -444637 -366858 -127391 -394962 -169830 -122122 -61578 68281 104210
19208 104210 -67862 292352 -95353 -107504 136943 123778 -225798 -20187 -220062 -63817 31853
19196 -162897 -48536 -77269 -45426 -160328 -339874 53420 -28711 -101493 -145845 139318 -210655
19184 -173782 -140958 -77507 102381 -112542 28514 -112308 -81688 -202520 49752 9803 -221003
19172 -138293 -219393 -15743 -332554 -239568 589 -207234 -22669 -283517 -122204 -305549 -4028
19160 -68628 -236249 136753 -151797 -140550 118104 -5488 -213917 -115284 -202757 -223063 51168
19148 -9326 35796 -189317 -114363 -220004 -329161 -156714 19489 -187587 -148419 196541 -30626
19136 142956 227727 -209063 -136865 69792 75275 -172804 -351323 12627 -184696 41033 -23730
19124 149286 -70604 -211336 -217218 -166301 -44623 111688 30600 -74830 -58126 -179411 171527
19112 199479 64108 -52242 -140049 -4894 -96761 158517 -341432 -209672 21268 -7334 -97356
19101 -97356 -173089 -286593 130110 -44193 -18785 -341185 -36790 -178713 26464 102530 -13589
19089 -246365 -246240 63160 116172 107075 159013 -334325 9014 -188030 62453 -205030 -57885 59790
19076 -131417 -113403 -82826 -253213 73361 -270783 -78491 -277017 -15965 -40322 -248802 -62048
19064 -187790 -113572 -165520 376779 76497 -242192 -309205 -92668 44111 -375813 -49313 -26697
19053 -26697 80186 54483 -69094 -124825 -83784 -131297 -45917 -198692 178864 -225712 -42680
19041 -248891 279022 -82074 118150 -361365 -294505 -104106 59472 154437 -85544 -54267 58810
19029 -25846 45367 22666 194987 177935 -87275 58607 -125417 248936 -130204 245351 300808
19018 300808 20956 132906 -39593 84145 173405 -66455 1555 -110633 -82360 70624 -133330
19006 83835 30711 -9596 -159256 186528 228437 -525258 73634 10271 -175936 64639 100549
18995 100549 117223 14137 -122466 -47088 138506 241714 -10883 -416520 4141 194061 -302606
18983 51912 105377 56216 -274576 23059 -172138 -133104 -174771 33970 99324 -271653 -106463
18971 274086 -47950 -32388 173509 192052 96166 -361847 144051 -101782 -251837 -115337
18960 -2565 149215 41751 -192227 -159893 71572 259690 -339926 -120323 -190700 107246 -152672
18948 257762 -71929 -59394 5526 -102502 43890 -82354 243606 56182 -35591 -81711 42406
18936 515 -16944 -141292 -44098 -87044 -25243 -215334 -150143 16437 100161 -84557 33304 31042
18924 31042 78571 126132 -218577 -78956 -139445 150430 65485 83591 181762 -18811 -116201
18913 -116201 -146519 -58926 -265144 -173006 31446 65118 9067 -185097 -139121 67349 -90470
18901 -148951 80231 -34264 14012 -133044 -228937 378184 149068 209187 -196406 -108890 8371
18889 -83060 -169128 -61088 32498 -470865 -48654 -179992 24342 -7180 -464644 125988 -27900
18877 -236514 1134 85432 -10545 63507 -173009 -103050 43900 -126758 31284 -101198 -117243
18866 -117243 -88952 15240 -271085 -61214 -276230 104291 -133750 -242432 -332090 83261
18855 -70926 45101 129851 -108130 -74943 -40503 -36482 364728 74363 84470 47656 149543
18844 149543 -139998 -252406 -134643 -159841 209103 -113970 -220724 -71807 54938 58192
18834 58192 -370206 -6716 389152 23443 176848 -356273 322236 -130567 -321621 -146954
18823 -47529 -240210 -241553 -234104 30886 -6884 -66155 264297 -73522 73307 45197 169396 -299526
18810 -57507 -79504 245010 146705 420042 -338557 522990 108570 111782 -32860 -133558 -101973
18799 -101973 -29008 110756 -66566 29478 -115662 18829 8938 40680 -270212 183449 -57230
18787 167667 -67273 -48923 -111491 87299 -157190 -475836 -346341 -275714 173462 41646 -97060
18775 -44855 -21912 -267000 206592 -119744 -41830 196501 -328393 252894 -141546 -17845
18764 -20389 -67286 91590 28217 -40605 -282752 -78433 221848 385362 -306056 252002 -28102
18752 264385 -135213 -218537 -248460 38466 25714 -151281 -84915 8501 200295 -223016 186172
18740 -8039 -86750 42814 -226488 -96841 -208012 -15928 202987 -41225 -25446 -25921 -55794 -151460
18728 -151460 -76875 -4346 44513 -143666 -74208 -22845 134185 -97252 -224796 -13494 107088
18716 100229 100925 -304466 59112 24990 -155425 -347694 136552 -244032 -91780 -137297 -168912
18705 -168912 120436 -219703 95160 18495 -219506 -231008 -80863 -294758 107930 -204785
18694 151687 -45020 -335596 120019 -310903 -137410 -336253 282316 -399827 -213819 54302
18683 100148 30180 -123610 106680 188101 29416 -427118 208128 54637 259482 -69349
18672 -38407 -198493 7286 -98517 -7467 -206275 -28739 -41227 -20708 107845 -352598 125425
18660 188878 -194880 50290 -137936 -209084 55365 -87747 -174285 35336 -203601 -133708 -178073
18649 -178073 -19283 -23254 -24934 53201 -2678 -2997 253447 187707 -39408 169342 49566 -331391
18636 -344724 114484 -236324 -52698 -33835 -233603 -240086 -204705 -106779 5594 -163716 -566873
18625 -566873 97144 -142199 -402737 -112302 -305599 216378 193196 16867 67415 -149462
18614 196061 -14928 -264578 171471 102984 -47293 -471604 -254968 66648 -37117 -303439
18604 -303439 -38496 110709 -70680 127613 -27015 -215118 296587 -68135 1310 -387506 266913
18592 -40363 -71837 -102060 245607 -219161 -68696 120542 -175360 120574 -56608 188781
18581 22060 126496 112306 -213710 96923 239454 183412 41869 271467 -82879 -15793 518325
18569 -104872 -172082 -94865 -397151 -149928 -25212 -109794 -256103 -328511 56743 -69892 -374898
18558 -374898 -45334 -109145 -72163 247498 -278667 -114633 -245544 -109728 152858 208027
18548 208027 93082 -55129 -118573 23886 95257 -421525 11981 8524 -313664 13298 -51251
18536 120582 -379219 94208 -71092 183528 -6152 -150552 104200 -84988 98074 -85126 -278634
18525 -278634 -277056 25741 199120 201365 -52741 -147357 39187 -176480 -86542 59885 201434
18514 201434 20722 -108821 41141 91178 222917 -13098 34339 -117857 -63972 110844 -337169
18502 -195814 239608 -215170 -73397 168911 115361 -188536 19715 -496144 -166446 -95478
18492 -95478 -152140 45164 -259332 198935 -231321 -173750 6308 -49469 -80307 97943 -184008
18480 -237714 272252 182667 7652 176073 -10679 256798 -216339 -18747 -245279 -122276
18469 -199960 299730 -252911 -138351 -107111 -68808 209886 8262 69612 73494 -61774 -184021
18458 -184021 325608 -102931 58397 -41607 9013 -62886 210024 -154823 -111140 -4263 -148796
18447 -148796 372935 -56573 35012 20446 -74719 -60751 -200732 -292501 -201391 -175361 -160835
18436 -160835 -133435 -63228 9553 -81947 29919 40306 -78279 -296367 -166377 -7119 -31338
18425 -31338 -156406 165706 62021 -52227 79824 118805 259705 68134 -90485 -267234 -95752
18413 -119410 8335 75847 48833 -326376 -233117 -11780 141231 -90245 -14213 56413 -54613
18401 -34949 83313 11133 124860 -389244 169673 100936 -216450 195660 -76464 -42888 -95183
18390 -95183 -174228 177041 418087 66198 -351154 -202619 -347003 171014 -226644 -84622
18379 -116396 -340866 127367 151609 313032 49883 -116769 90708 -292093 -49532 27832
18368 275572 356639 -7133 107968 -112467 65900 106821 -224748 5642 21119 172998 6314
18356 -144410 78089 -243956 -55358 -246673 -56357 -9739 -258351 -181277 133558 -28898 -40588
18345 -40588 272392 -245718 -33602 -181003 -174333 -14529 -42713 -168151 77769 -133779 -49253
18333 45052 -204956 53273 143126 104809 93108 -130253 62273 -60527 -114651 -2570 -40340
18322 -40340 22117 115759 78205 -85991 43309 203516 -62508 -349210 43048 -159090 -184829
18311 -184829 -322652 133872 70708 -230833 -42185 -82587 128992 256617 96672 460234
18301 460234 -21510 -393551 -164548 -133544 -399218 -74221 14922 315421 140561 -178843
18290 93550 -258606 -27785 -325390 -122552 -208986 -141447 23258 157527 97744 -51025 -149663
18279 -149663 179047 179040 148308 133137 -384535 2128 -156162 15710 -45467 -185577 -307246
18268 -307246 -55250 -34934 -262640 -37211 148101 242700 57685 -276889 302782 -214065
18257 9469 -353735 -217244 -1120 -305098 -67532 151443 -57192 -43823 235195 105 203014
18246 203014 243715 371032 14927 22168 -99226 -283346 -94648 -126805 -192315 -150588 -147166
18235 -147166 241782 168554 -327036 207349 -225420 18040 -112272 -179257 81417 -35016
18224 161975 -211254 -68465 -84286 -256254 53313 -4880 237684 -52363 224 71420 27322
18212 -456889 -214805 -66525 217219 227202 90315 103406 41315 14625 -64934 98369 52308
18201 52308 398050 -245555 -74437 -68632 -4757 -208774 -35416 -294851 75964 -56904 -73723
18190 -73723 -47161 -278546 31633 190695 -378622 123602 -42786 -9318 -22976 25157 -39331
18178 159162 88214 293372 59467 185723 -283497 -160212 -96343 -136617 -314137 102543
18167 -49129 -227820 109354 -154927 -138413 -69251 -353016 -213899 18324 64677 190851
18157 190851 111826 218891 -217195 36681 -132845 -57414 90688 -92277 -133775 -110531 -115517
18146 -115517 89344 -320124 426385 -214935 132447 237672 -150308 17702 222943 63068
18135 58667 59130 -68557 72607 -96409 -116013 -74119 -3009 92667 -198804 -313037 21444 -8954
18122 -133057 -210564 263190 -204993 30798 224977 -67029 -49493 46454 -159239 33131 -79405
18110 19768 455496 -132081 214793 85309 -141006 310903 66661 -229113 -268183 -54111
18099 113900 -30991 274002 343325 -184569 -234887 -1489 259883 -2693 -53896 47440 -46923
18087 104360 13491 -170361 -121548 76073 -11175 -189635 -62693 236671 152688 -376891 -4485
18075 -266856 29033 -42376 9716 -209027 -94242 197023 -228259 207001 -8418 65978 -199574
18063 -180639 -146559 248164 136052 251048 -29432 -81696 41351 271321 -203702 30180
18052 -163594 -151557 -43022 212699 -17678 -31184 -317851 36721 -29305 75845 -59741 -67033
18041 -67033 -11248 -154198 117805 -33496 -56149 -95400 -151226 -38392 30958 -431284 67363
18029 -196802 -257235 -52773 -10585 -222433 46353 -17832 -123855 -202904 -173145 72596 62086
18018 62086 332542 -293877 -96797 155322 23993 -149511 -123130 -263301 -115475 11771
18007 -211851 52145 174144 -96465 -161338 -402510 95130 -45323 -204899 -95464 23275 1142
17995 143836 -92502 -102844 -222350 -212600 215252 5395 26113 92796 -20893 -51831 -1647 110603
17982 -481793 -416208 -87241 -272600 -135377 120089 -275040 -88817 -51607 104639 -74873
17971 52380 5550 -217451 129146 -270449 190034 127787 -85282 -207651 11029 133044 24655
17959 -5524 -276701 -189482 -208719 -20718 99274 5717 -56720 -127630 -105303 -166276 107048 99801
17947 99801 -165081 407 -188669 -32703 -47253 -319675 140815 -162658 159470 -174199 150895
17935 121664 47341 -6929 92012 -198328 -58581 385932 71431 -251933 223525 32159 -270045
17923 230005 -65824 55473 68191 5278 196694 -115212 -186162 33165 -226332 184562 115158
17912 115158 8483 -194192 247967 261783 81046 138730 31605 -23684 -52097 214935 -124390
17900 112864 -141799 -219315 121790 -211897 10233 -135978 349438 -1003 187591 -152307
17889 258436 12409 -130269 196884 -144553 -126483 105169 171980 -124816 10980 -44027
17878 386903 -42396 -69515 -64474 82421 26598 -327513 -189477 37856 87456 -182649 51197
17866 -121763 -129897 141003 68090 -171656 133060 289953 108465 -333142 293 -216366 166601
17854 161002 -167778 -79267 287827 -352894 68320 -224708 -36766 -220654 44158 141901
17844 141901 279459 -167346 12222 284972 241557 -179646 -145811 169989 136911 -15399
17833 -204894 -88347 69948 148517 -2843 207076 29010 117261 -9479 2163 -170377 102417
17821 -96703 116754 -68422 -52966 134586 -8449 -79344 81823 253659 -221408 275135 100174
17809 -122105 84663 -152573 238554 136004 49988 -23729 230537 -73623 -112353 -373381
17799 -373381 -352436 -120077 -190470 -173008 -18065 -235527 183987 171613 157400 -23667 -16376
17788 -16376 -220763 126329 -50989 -126051 242150 255143 -47018 -18170 11772 34174 247797
17777 247797 70713 -143382 346702 87501 -30472 -33407 -235272 -37341 -60628 -72083 -13305
17765 -136844 54932 215396 57179 128425 -134674 -103533 -14185 -189141 80211 -141294 110521
17753 -442948 -312035 83686 14280 -103973 134751 -211870 -220443 -78087 229938 -10386 -321473
17742 -321473 -281286 -300810 40762 316183 -219140 328114 211665 -120980 170887 406507
17732 406507 186221 53552 345929 39092 -43613 -163365 -111567 -240123 108653 -82683
17721 -111554 -152648 125166 346504 -51253 48112 -59149 -283864 -9647 88105 375637 -4794
17709 -126831 78750 -132587 -54304 -308214 63663 -298862 58549 235672 44372 -200502
17698 -285613 228864 -173451 -204978 -21985 381567 115619 313305 -14627 137906 27819
17687 -99928 39757 -331738 317296 156126 -55797 -227505 -264535 225858 -270889 -52538
17676 -1094 43018 -357890 -228122 -107492 15453 37300 -16479 -37419 239559 279769 255941
17665 255941 -114451 -18430 -122274 191018 -205228 -147487 -50206 -4810 -65913 166624 -191622
17653 -4820 59067 226642 -382609 372946 18049 130340 143381 -328828 117303 -191706
17642 -238175 -19750 2619 283276 83265 -85195 -152471 4117 -86066 171097 225433 61537
17630 -51536 -78307 -17221 371149 289702 59355 -124759 2287 -34836 179371 -32992 5769
17618 4436 194443 230912 43259 -8618 -40442 133504 239720 161113 -15580 108839 18555
17606 126432 93946 -245722 180602 36499 -247029 5865 126896 -403594 19981 -47970 169072
17594 -3640 -161054 -63893 2971 -30789 118325 97344 -218356 -272628 -39243 241127 -266019
17582 176001 335692 243325 190649 -196917 36151 304286 69738 -76026 -356290 -38700 109726
17570 -24143 -73865 34563 -234474 249631 314652 69598 -46721 101048 -82626 27917 92812
17559 92812 352272 42737 621311 350969 -179563 -165774 -121182 77901 40017 56177 120912
17548 120912 43641 -50453 -60742 27724 -137471 -59175 141460 291089 9718 78378 62190
17537 62190 -242322 256805 -68753 379638 143912 -6745 17994 -59815 351254 253592 35489
17525 -160379 -201019 473818 -128410 235554 -94539 355 25455 47657 -79482 170175 170074
17514 170074 -42950 337002 -111199 29321 -65233 73777 278105 -154266 156268 7808 384207
17503 384207 -22198 185322 -1809 -210356 -117912 -137131 42708 109079 28154 6876 139250
17492 139250 11822 372188 -173137 6419 -196187 -333282 73459 174053 -97611 85222 239704
17481 239704 -136776 245036 234126 211143 185057 198326 156222 310841 241126 122902 484903
17470 484903 124891 -214188 328129 248753 273917 83649 173453 180106 -73651 307425 -71264
17458 317536 24737 -56914 154762 74239 420665 9201 308852 136114 194168 339164 -37831
17446 366281 228868 352377 -157128 -67105 89516 285471 -72760 336302 275944 379759
17436 379759 134923 474911 -158863 173996 394829 472320 69087 97668 286124 54922
17425 184618 136398 156816 123661 358939 -29604 319560 38575 118802 -221077 201519 341088
17414 341088 367023 408710 275038 240375 190212 26212 -36690 101273 -13452 120076 17822
17402 146831 322043 86824 277593 18175 315085 397338 187763 -61480 278507 281031 -26662
17390 202138 125828 168864 168679 247277 170886 517027 330560 150735 206579 -17817 255590
17378 50408 7010 290187 122174 131414 405216 219072 98032 267230 174446 -23832 310456
17366 268478 -36968 144025 324868 23426 143664 458646 374385 40212 245547 279628
17356 279628 231616 351248 -112328 126243 164937 188737 416243 199091 267206 -107465
17345 -136518 -202420 -874 -13301 -44487 414087 -203374 103440 178012 -39994 279877 -135406
17333 237667 219732 241007 280663 59476 321517 303865 -4984 -15927 -71688 346025 424962
17322 424962 -128639 246582 330703 -20387 259703 59413 -97541 162871 188714 164783 286376
17311 286376 55343 -87752 129837 -26081 242623 104334 85449 477438 -162644 226716
17300 -32192 174722 374954 601372 117268 -23480 -88694 392918 -29182 -67137 246300
17289 73343 358545 341445 67832 -30952 726217 290005 -1961 121109 365567 1010 161177
17278 161177 291326 191135 398433 218946 17500 -72221 -15054 135893 173365 106225
17268 106225 38023 344141 256922 185346 21201 201829 247213 174719 289697 -23174 -198004
17257 -198004 46652 158028 -3577 143631 409893 41305 250970 238406 137109 281827
17247 281827 186387 201736 137854 247813 132977 485061 -107367 -20614 131755 339864
17237 339864 -32470 11938 331239 82331 83043 91393 47900 246224 114073 319482 24993
17225 499746 496989 560323 -183733 274799 -49216 612783 367047 76410 423066 121626
17214 411255 -185876 343658 405748 61430 209327 205948 187043 272332 415135 306196 -64385
17202 87438 -5775 242384 307113 52218 43345 -47252 -249419 -14584 158486 -165296 358219
17190 334494 19852 78548 124835 606723 500658 107188 467969 477825 169724 522518
17180 522518 369317 393287 194087 149104 328907 283726 445452 -162834 273688 342493
17170 342493 384519 412543 70414 275371 293498 242789 161762 227646 439334 25279 160039
17159 160039 308563 75410 276914 274705 586149 568132 75203 570466 436227 318096
17149 318096 651448 167694 320019 580805 266168 543083 304540 96793 448411 363621
17139 363621 213335 298506 584127 393189 177986 129527 152201 377882 173663 292057
17129 292057 304129 473958 461419 386098 553176 239349 431221 548788 277575 252840
17119 252840 937865 455399 185923 323263 415594 624968 293632 507992 412162 345294
17109 345294 403088 540168 513626 447084 366544 149637 358443 337656 382979 298848 119483
17097 482950 164939 349967 552655 348513 296535 732488 447289 548880 451646 467133
17087 467133 551407 593642 499650 311755 392522 155673 377645 266702 452000 561136
17077 561136 352036 379864 601210 401131 640896 480580 380733 482259 620382 202462
17066 657613 157011 566015 356980 444429 282228 759825 484845 691462 504484 805415
17056 805415 347070 326599 315982 716156 359854 594701 155374 655414 456626 714715
17046 714715 283051 495143 534707 696912 584226 592649 496120 689568 327946 499993
17036 499993 542609 465774 685356 445444 192615 697853 321946 477655 180753 617872
17026 617872 735169 548256 484523 677582 635133 422955 736410 972588 568863 672606
17016 672606 640337 910082 693485 684792 892916 716115 508387 330405 514593 310340
17006 310340 760847 944236 550066 850356 618638 751910 602726 805950 744100 542077
16996 542077 792519 704445 417526 1129812 899822 902022 879852 979949 756771 866012
16986 866012 756517 899541 828271 909023 772577 895250 1218496 964851 613964 630601
16976 630601 1009948 993033 1072470 902049 640057 918020 869853 686346 991897 1007568
16966 1007568 823661 639444 705337 924917 1104782 997212 782672 1151592 723449 965300
16956 965300 1221914 1015751 996181 1078394 961247 1162953 1237119 1169556 1340270 1132210
16946 1132210 1063660 1305176 1046225 1065631 1151512 1374498 1444042 1068885 1280883 1095796
16936 1095796 1241261 1144649 1101726 1226733 1229334 1494626 1422707 1092462 1428358 1091386
16926 1091386 1596918 1230596 1698841 1358753 1415811 1573124 1441841 1565779 1549464 1398793
16916 1398793 1568161 1394218 1475672 1276710 1768994 1329418 1176583 1747459 1648366 1707634
16906 1707634 1351021 1868924 1744297 1605701 1473443 1568070 1531188 1572401 1866936 1752400
16896 1752400 2034621 1686613 1718103 1752826 1749332 1899732 2013434 1953516 1920222 1764801
16886 1764801 2238838 2255641 1959903 1834682 1999790 2080675 2341087 2079669 2264227 2298769
16876 2298769 2368357 2510951 2457560 2269887 2526856 2335673 2344978 2037175 2108366 2492186
16866 2492186 2403054 2825362 2549379 2716968 2938237 3014310 2717741 2663917 2901026 2809566
16856 2809566 2714134 2978507 3105481 2993126 3083856 2610439 3356386 3318664 2989257 3213978
16846 3213978 3355887 3324563 3438020 3307469 3722486 3333651 3955515 3678327 3505784 3550347
16836 3550347 4152767 3737555 4314530 3833012 4212503 4200176 4157499 4377997 4529116 4411374
16826 4411374 4402816 4570687 4682575 5036501 5080888 4696103 4911417 5179497 5397715 5142929
16816 5142929 5759216 5307974 5848161 5705907 5811371 6284945 6014107 6499572 6430547 6392808
16806 6392808 6641051 6941571 6898507 7075886 7123628 7318339 7736392 7707912 7836025 8206448
16796 8206448 8487191 8640237 8827252 8844875 9127732 9333692 9646491 10022862 10193219 10189059
16786 10189059 10822247 11047104 11277949 11529664 11649389 12018498 12584779 12754823 13329811
16777 13329811 13580282 14263676 14807805 14908023 15725761 16022343 16659581 17129225 17665588
16768 17665588 18179348 19158977 19594327 19895228 20927140 21675360 22169276 23205439 24271365
16759 24271365 25281448 25728342 26952161 28156099 29314125 30469045 32160440 33378990
16751 33378990 34590351 36189101 37892524 39958039 41582885 43759203 45795224 48019685
16743 48019685 50444987 53170355 56117830 59172509 62466018 65476697 69641713 73335760
16735 73335760 77630257 82116618 86844163 92050438 97256138 103103059 109137205 115542940
16727 115542940 122071842 128532835 135482724 142237698 149310025 155948097 161971692 167762338
16719 167762338 173284646 177573506 181246808 183425542 184875842 184650434 184329707 182215840
16711 182215840 179107608 174692301 169834116 164010534 157839053 151019549 144480035 137250222
16703 137250222 130033546 122920797 116424850 109653978 103566118 97261092 91778910 86343807
16695 86343807 81455385 76568653 72512991 68218753 64528317 60751026 57489079 54307221
16687 54307221 51013917 48485480 45994808 43710948 41574471 39612129 37515028 35326092
16679 35326092 34078587 32216939 31041817 29398134 28194088 26814211 25859578 24682112
16671 24682112 23785351 22911523 21845691 21330759 20016981 19443471 18913072 18037742 17385884
16662 17385884 16816012 15988505 15787556 14894625 14386250 14167366 13498620 13540392 12663135
16653 12663135 12130516 11652447 11542510 10988610 10711378 10854107 10137671 10017692 9696653
16644 9696653 9454272 9109461 8950159 8466757 8786619 8181835 8431383 7744836 7155779
16635 7155779 7362862 7363629 7085862 6749544 6362775 6828895 6633768 6361078 6235147 5963796
16625 5963796 6099453 5458114 5664809 5542266 5582719 5298677 4695491 5297058 4867448 4775810
16615 4775810 4633118 4809995 4529175 4471604 4595720 4300725 4390518 4156224 3995116 3994583
16605 3994583 4040325 4056101 3793679 3578912 3541949 3563722 3492436 3609436 3331937 3458478
16595 3458478 3046350 3179725 3227916 3089412 3139348 3129840 3075707 2934252 2888131 2858473 2689030
16584 2689030 2805930 2806214 2255073 2596842 2543811 2313975 2251151 2494059 2495248 2445261 2016295
16573 2016295 2059806 2245893 2226929 2274551 2379635 2056426 2137458 2023607 2098358 1860845
16563 1860845 1993765 1902118 1886015 1415883 1702024 1642917 1589512 1557914 1276541 1689629
16553 1689629 1199530 1737586 1434640 1646687 1565243 1484902 1240257 1535607 1357343 1371026
16543 1371026 1704451 1407249 1327791 1541636 1383576 1430249 1397041 1062455 1487975 1340257
16533 1340257 1373302 1241866 1432366 1308604 1260343 1138563 1470053 1035492 1287030 1170701
16523 1170701 1074408 1290666 901373 1222972 790826 1287017 661370 980893 1148391 954910
16513 954910 1157841 1140425 1065051 755590 934856 942210 1128362 611306 762643 897840
16503 897840 913296 808945 820743 618278 997254 678132 921991 932409 828988 897091
16493 897091 775027 686635 689767 507504 955965 908550 757397 791008 769007 668483 702163
16482 702163 588513 960130 831621 883811 719583 840182 680969 730786 825534 707345
16472 707345 695901 562026 489719 765858 284374 712289 429888 508111 800878 479212
16462 479212 604851 173114 609649 510613 557909 715189 774652 632053 577641 457517
16452 457517 659123 447402 242718 628923 437846 627556 249865 340945 253311 400854
16442 400854 642864 535516 91085 198955 278697 492792 479363 430219 512501 511579 475444
16431 475444 361067 274108 268576 534775 680200 767201 71055 383910 526613 273890
16421 273890 241153 456821 653196 536258 462963 437165 92186 378419 663210 469448
16411 469448 419471 562369 265054 227976 231257 708287 116057 36008 298502 301080 254091
16400 254091 318968 293195 412629 287403 450583 468002 278296 429659 -122646 521728
16389 369462 374140 29389 242511 150697 152637 270490 475937 453270 101080 501595 334272
16378 334272 324073 177117 323963 38882 278770 74056 254724 1413 557109 324392
16368 324392 416717 284729 269011 245553 363419 -31442 191793 340730 131695 -104677
16357 455876 -144540 306320 265663 95106 175224 312573 134475 621749 50438 333941
16347 333941 -21534 196394 306472 31955 72894 61683 85705 222018 298532 -7393 236239
16335 135500 222911 23820 26424 7408 479242 173257 -69290 387209 230227 -21757 -136653
16324 -136653 185887 513138 183780 215429 61898 200842 291524 -40367 148634 274702
16314 274702 121694 103064 71875 141059 196356 130430 -45074 98597 -204171 165951 166587
16303 166587 374205 151350 20174 11473 180072 -16045 86020 257463 153247 208560 -67610
16291 207928 118389 -54257 -125343 -105248 -115090 -173635 87645 14962 84698 57434 246589
16280 246589 -85643 181698 351492 -78193 -53658 -267621 161637 350290 -238776 66086
16269 -40345 13901 164384 257821 -140227 183390 343344 -9852 -76697 -77480 181465 -38708
16257 140836 -63461 -231884 85791 36448 -70824 345634 261892 264185 140099 -141446 158998
16245 50096 252655 -143934 63932 264560 96111 2920 45272 -119819 186849 -19044 16054
16233 -104412 -165707 89653 51050 -23521 -131507 -70062 33461 -27600 28233 228496 79398
16221 -105042 148267 12813 14734 105159 -15178 -196038 36167 -96937 28308 100726 302455
16210 302455 123501 -161734 194478 -111737 61777 -64300 -196553 248085 -245535 308911
16199 17394 -107761 111257 -270330 -154634 124739 101518 -30620 93449 158659 234552 72435
16187 247913 5297 58748 26920 99082 397806 -8968 134564 368457 -205883 199495 -97702
16175 30063 -47997 -319724 -143004 56323 20164 -243263 -8990 -178213 -214638 99510 4665
16163 149870 -281341 -27105 -115040 33680 -21607 170877 46670 175625 55268 -36190 -128047
16152 -128047 247456 81240 -3541 255780 -37085 -246422 -173473 -191533 52015 -63345 166651
16140 76243 49325 97813 -2603 -173902 59729 -219033 -74209 -31168 -76871 35857 28129 48646
16128 48646 -16551 64313 24783 -68318 9280 -98809 -157979 -38280 -91748 28551 -33788 -17713
16116 -17713 24410 -135605 -333304 37196 77200 84986 -211970 -148053 109718 59469 149175
16105 149175 214464 65926 -71787 112401 -96481 23 361731 -13442 239272 330698 -145180
16093 -31874 28783 -62914 -41266 93522 -114019 -382292 -255439 -20796 400580 131 12039
16082 12039 -129906 90680 -160308 47328 126937 -66541 -350849 177605 293653 -264974
16071 323049 68754 291604 119421 136696 6448 284653 -59411 -101732 -252187 191308 -37388
16059 227380 99576 123507 13639 -135130 169870 -339767 -117173 -10584 297891 95252
16048 158405 223441 -97184 119661 -190938 212200 165553 57310 -249691 -23605 -317346
16038 -317346 -446121 -146206 382815 -178149 16886 -16378 79012 -116109 50373 137342
16028 137342 61305 2422 -8108 -324494 78192 14375 -119138 382274 -357604 -329296 -105599
16016 92369 -224007 262132 -205918 235150 14049 157563 -233158 -128648 -9387 160110
16005 -6339 318734 178582 8827 142114 32447 -115181 -184496 62332 -118002 -207196 59331
15993 61212 81456 -71121 -84587 -101343 188484 -25468 314507 31632 228331 335801 565215
15982 565215 416054 417831 79173 256542 -131172 -107519 362741 17762 13559 130196 -14522
15970 -17151 -135467 127295 5521 -120700 -217517 282314 36969 127777 38402 -279333 -107325
15958 -69929 464918 108128 105780 -269888 11189 -23050 117550 -32747 -181935 -229072 -195039
15947 -195039 -231893 -152182 -92744 -164512 -145046 215020 -121903 -74782 -86982 -350613 28576
15935 -45715 31327 -179739 -59384 68329 -67293 -293300 79901 21847 -152613 322075 -112936
15923 156976 -121737 -213123 57741 -482958 -197086 -260757 129659 -14590 220573 -184072
15912 276608 -11259 24833 -192834 -84180 -84295 114192 97387 63704 142888 116121 -33671
15900 -272849 -323199 172692 -80722 -105228 -74504 -301006 269065 -56006 268191 52284 52977
15889 52977 -176402 -212758 379094 -114683 -228148 45375 -40666 147789 275257 -51008
15878 17090 -88520 -331797 -195295 308302 -348366 52907 33059 -153345 -14692 231053
15867 -64194 -223059 281736 127579 15843 -74720 -190413 118083 -261969 -76920 -106942
15857 -106942 -159941 -40647 60953 102792 -225653 48191 194764 77555 -90253 -113667 -182388
15846 -182388 152419 -169232 143635 -2576 -68919 221137 49624 119180 19211 272456 -37807
15834 -295822 22629 74255 -53554 123036 -9596 -137824 68531 -139784 -342657 -166059 69135
15822 95487 -86546 56240 -139546 -5304 201741 82845 -60903 -382783 335273 226000 233621
15811 233621 -101036 -236162 141998 28875 54262 -266167 59556 -501153 34851 -29896
15800 3122 104840 -137002 -119266 -96716 156317 143873 -25138 21664 20246 470872 240261
15789 240261 18834 41863 394017 -137871 110240 130730 -97917 -163793 -211886 -49900 26819
15777 -144352 90444 -261038 -201169 -227325 -45250 89807 -88324 -91108 -103085 5967 46941 -20136
15764 138499 -114473 169150 382039 -284930 209536 -11804 22082 95202 160456 518005
15754 518005 -153697 -134425 130338 -115359 -17611 4443 306654 -57464 -62781 116818 -273423
15742 -15708 -19693 117378 317577 -40547 -343934 25704 -325330 -185865 151572 8573 -143903
15730 67698 -201545 -50053 16026 -297842 79105 -103029 -46047 -325698 -379442 35186 22482
15719 22482 63343 -207062 150382 -82140 -106553 -175235 -95059 -119335 202717 164997 -204548
15707 -107851 -225606 84426 -78927 65345 159108 90071 83539 -561058 -50645 -156395 -157759
15696 -157759 66362 267876 -145625 71564 27235 -13307 14883 211087 107418 102699 -11154
15684 180078 -115433 -396667 -205512 -132154 179899 222430 27561 -105825 88334 -97838
15673 -63889 94898 -269051 436065 3991 -31948 -31088 139110 43649 130635 -160996 24966
15661 -36123 243808 -361564 -299489 -79081 119717 -34297 -207355 -187669 60792 83022 98665
15650 98665 -92545 96797 148357 -53642 -223918 60576 283450 -89516 -110389 -233832 -35993
15638 -217497 16239 -84556 -43312 102978 45642 64066 -113225 117647 50290 -76106 43814
15626 -263441 -6572 -425295 -340144 -241302 -61092 -203593 -272634 14544 41692 -280342 123709
15614 -74977 5454 -159013 34156 171783 -45397 355 149401 273982 76812 310151 169293
15603 169293 8009 298298 151728 84027 44853 -51584 -165908 -258696 -224132 -286466 -111050
15591 -57116 48570 -75854 73045 -210269 337456 -42803 214820 48063 51994 83625 53129
15580 53129 108308 -190111 -259911 108307 102954 -88817 -131971 -132967 -124596 202169 182654 -108159
15567 214449 -98942 -468843 87223 -197838 -42188 92861 231481 198736 -57660 99438 -180806
15555 111518 -47804 40875 -43944 256780 -53571 376816 273184 105124 280037 84859
15544 -42881 -183402 -291290 3500 32005 -51737 -34788 -129776 246833 50469 123282 -221415
15532 21978 -201479 -117071 215000 -20741 -428541 -184855 -6512 188839 -3462 -42264 138985
15520 -178771 -76956 -119835 -152627 343449 -195965 -36801 -72615 349369 -292633 40504 345766
15509 345766 128738 71546 265627 -1055 -231393 -74709 103072 165526 -108097 -29506 -196358
15498 -196358 280294 -124066 63900 -32479 8840 99891 57583 4796 8918 -185071 -152191
15487 -152191 60950 140142 -114505 26097 -136293 -148711 -64015 -70179 130581 12512 118472
15476 118472 115167 51488 100213 142003 -168929 210290 -27788 -44561 -96023 175774 -175786
15464 -135091 -283525 150289 -237869 85945 33860 75734 89603 -145089 48310 58180 -66096
15452 295452 163431 4621 301508 582 287375 -252711 159521 117629 -160576 -150860 -171427
15441 -171427 50307 -145947 -146859 -440853 39702 211595 -162879 -6222 196806 101867 -52098
15429 -518507 -31599 205405 138757 -123077 -115652 261539 84006 -241517 196114 148564 -219210
15417 38663 -178056 379377 200789 -138915 -62752 3538 97254 -118190 230974 30622 -84129
15405 117010 -85240 52276 -57465 80209 299625 -194734 35319 19628 -29539 264099 116531
15393 -45560 320914 287843 95980 -155624 208054 -156534 -50846 -11615 223670 87945 452757
15382 452757 -85350 35513 7739 -208582 32057 267431 30077 367424 190492 295897 40694
15370 -12961 22953 -12508 117593 -177461 -47149 227050 -101083 201869 4764 -130949 196460
15358 218092 169871 72160 85094 374283 -62024 292942 -88410 -317598 -283847 135884 -44805
15346 -36344 -435548 -257040 -151718 -157701 165680 -3815 -306364 39533 282037 -136741 77195
15334 -26974 54648 92690 -151560 -6395 -214865 -281427 186536 -1698 -150835 41039 100853
15323 100853 88043 108721 -32492 -38535 -110602 -49784 -90063 -105108 135805 8041 112143
15312 112143 -46666 135053 44734 70299 1740 85721 -38072 122303 71852 -150577 390449
15300 120151 193929 53815 125084 -15732 -110978 -290431 171471 294628 -87321 113770 108043
15289 108043 220178 136361 -80033 -166988 -185133 157682 297328 -292245 39569 -47621 23729
15277 -279945 45240 73912 22 106770 116307 -135523 -397778 -153193 -60088 -64540 291954
15265 -5683 60864 -146316 114661 148190 164572 342435 -100682 394905 -316577 330007
15254 112798 131985 -61833 139569 105442 198112 132544 424402 787692 1580953 1590731 1586150
15243 1586150 1154164 648747 428421 55837 49843 174351 342271 23151 316640 177031
15233 177031 88609 57484 -11082 -81120 -250225 -167200 -320521 19181 79736 -29949 354888
15221 -54359 -153033 110540 335481 87394 -211692 430794 201066 141819 354719 233700
15211 233700 323423 271759 -22161 2778 -205782 219362 132689 258567 -73676 46747 -5120
15199 -170695 13099 28925 -68595 -50976 87004 122980 151724 -160278 160365 -232930 150006
15187 129745 132240 -88317 -43261 -58432 -189100 -139452 -188786 -141963 273224 -240165 159938
15175 -121495 291844 400160 134528 243989 -3123 18292 289317 165818 109028 149047
15165 149047 40257 227182 -9629 27280 -82730 -25063 75237 319759 64610 25069 -158863
15153 340966 68198 -79265 134028 -258547 -273124 -50256 333317 168312 21465 37578 -51336
15141 59293 -5658 59315 -2423 43015 82638 -201583 -196524 -124244 189313 244410 284060 -52418
15128 98890 75572 110615 -75445 76162 66988 194163 53621 280870 428670 -77898 166782
15116 -29032 46885 -189024 -106337 146133 16943 28919 17680 14358 170008 -205130 -88075
15104 -92884 291213 -24711 94404 -30144 38450 45601 90353 217843 62607 116922 197582
15093 197582 74386 319437 -16354 -173904 -263312 381642 155733 285159 51292 -223950
15082 72056 106918 -18850 60903 -21390 -74873 -1957 -12388 349680 263001 -58639 165492
15070 62008 193265 292684 -182718 87903 536051 223409 74327 -70855 39863 48426 320392
15059 320392 165457 -75974 362141 221775 54005 7775 121105 74666 -105284 452381
15048 -24503 320270 -70396 468168 -114656 172629 -32841 236611 235004 492436 -176192
15037 342958 172319 196247 51739 164176 303386 189046 200419 123631 87737 59779 331758
15026 331758 329371 -227156 285176 -99020 121559 341713 294148 133328 145799 5525 -62121
15014 190897 87970 260669 215034 86582 165439 340461 2273 -26870 369691 179951 -91331
15002 -44515 249338 352437 152135 147506 200241 221185 139894 66910 96100 474733 27314
14990 220051 243593 233315 196957 -10629 137697 -49866 405803 75433 233471 116903 274847
14979 274847 178633 750189 158597 124112 43555 -52492 156438 303535 77635 650828
14969 650828 518849 18886 48666 180580 258445 345912 223910 168218 -5735 396766 380091
14958 380091 -7415 -10879 160656 318557 471955 192796 163110 391979 492309 228356
14947 140341 236888 137076 251181 519622 198282 147410 307784 359431 6732 418275 495035
14936 495035 204961 214347 276253 178009 78934 278869 307301 202652 -13417 526010 255682
14924 235233 586073 -4599 69011 162669 237057 459690 213521 65763 131785 361808 244826
14913 244826 223975 -24302 328120 359905 79247 234608 163458 238413 207904 442976 614084
14902 614084 358781 317630 447797 368125 33048 492943 131802 493707 53379 362603
14892 362603 143790 343008 304691 301276 94172 273154 249881 611424 310875 56536 328063
14881 328063 90983 290836 733832 493145 351802 193434 244572 209893 401458 565560
14871 565560 152884 292445 244511 549939 165484 708609 318522 301219 471569 456036
14861 456036 143325 443557 240396 106949 219866 893111 418895 125647 284295 483155
14851 483155 116204 428040 664153 69272 358879 494652 542732 754477 162088 325990
14841 325990 215749 234877 310270 363993 411345 436168 63473 135361 610207 368612 437396
14830 437396 330935 441559 63822 525404 576329 318322 628560 594241 508223 179158
14819 632259 496820 332500 263795 448244 672115 514422 438145 580461 642811 426598
14809 426598 520717 285910 780485 94322 679624 500939 435544 385419 576353 419244
14799 419244 646282 643723 353157 495312 305572 661156 124960 802656 401435 326582
14789 326582 422506 539611 518000 570608 396352 469450 787714 608571 333756 538512
14779 538512 632892 406257 425475 403461 300739 287871 549531 528071 714145 765913 633958
14768 633958 527107 480238 345433 961751 426786 701843 532283 412298 427951 625887
14758 625887 589184 290454 834930 526127 279396 484426 914018 621941 646623 506187
14748 506187 731540 668272 438214 905297 708262 475169 796846 540141 435275 495645
14738 495645 511399 754320 766766 768471 736742 755500 494549 344493 887177 727363 750069
14727 750069 927036 592277 448199 851901 759137 529871 632090 928164 514629 1029982
14717 1029982 1070706 981114 988570 795595 785444 536313 717388 639986 713345 835336 933796
14706 933796 571338 1052437 844710 816852 703943 859654 1020213 1049470 629749 815508
14696 815508 483283 826671 848220 924426 1053294 606658 728161 829515 1030409 930097
14686 930097 926871 708679 766112 660145 807658 739183 594521 811083 939877 1211323
14676 1211323 906362 1126273 1001581 1043928 958436 967295 917561 915288 816605 1087279 649096
14665 649096 1014061 836755 1045960 1195302 927422 658740 826958 652759 1357335 1167860
14655 1167860 760012 851325 1224319 995324 871291 856384 1190019 1206422 870654 1295493
14645 1295493 1168051 1148025 1465125 1277012 1383747 1093090 1051468 1402142 1503840 1180933
14635 1180933 1465941 1301593 936973 1141924 1415020 997268 1217423 1156044 1147782 1286496
14625 1286496 1055183 1178763 1395787 1277690 1435547 1411696 1099251 1277282 1393313 1102256
14615 1102256 1448876 1515466 1020616 1577251 1258940 1895156 1582267 1548020 1391061 1547781
14605 1547781 1351506 1219721 1749071 1235971 1731470 1538622 1487866 1364769 2016807 1688460
14595 1688460 1749365 1598529 1412233 1512249 1667063 1404807 1817257 1652601 1772586 1703359
14585 1703359 1402555 1681745 1799182 1677810 1434610 2049748 1508900 1889058 1982803 1811561
14575 1811561 1847639 1937777 1992547 2115072 2008509 2064035 2140061 2288114 1772938 2327734
14565 2327734 2121676 2275403 2116981 2290329 2219322 1937095 2277836 2805257 2656601 2849768
14555 2849768 2797020 3072526 3569868 3818964 4275976 5400180 7305126 10910203 20746321
14546 20746321 40039208 36431201 22788977 11853570 6897840 4162197 2592721 2121263
14538 2121263 2196697 1469692 2236069 1789116 1483795 1991583 1596197 1790464 1816580 1865398
14528 1865398 1921040 1739720 2180611 2179532 2367006 2088972 2107076 2245594 2570788 2361455
14518 2361455 2469783 2243819 2513663 2561879 2461575 2649528 2384285 2289244 2692213 2432765
14508 2432765 2797382 2842845 2508941 2464446 2870837 2683515 2853896 2398575 3005736 2929564
14498 2929564 3065837 3029690 2956645 2879820 3108125 3274680 3237971 3345640 3213560 3175379
14488 3175379 3328035 3203701 3302867 3638408 3386605 3867098 3337928 3533279 3708436 3527428
14478 3527428 3537595 3477461 3718339 3710789 3769403 3617144 3720338 4159270 3835226 3845113 3746273
14467 3746273 4310539 4165129 4291675 3996334 4212586 4674011 4722752 4505387 4368473 4707732
14457 4707732 4615026 4528748 4744165 4587672 4892702 5161753 4941126 4978229 4861621 5247581
14447 5247581 5522849 5121107 4933798 5493488 5501809 5348085 5431530 5425939 6102478 5780509
14437 5780509 5727222 6210583 6218381 6267299 6108817 6005356 6501614 6320922 6903369 6815706
14427 6815706 6747638 6576509 6513213 7204904 7041052 7100250 7193119 7488806 7292248 7773455
14417 7773455 7586165 7709233 7968869 7937215 8281877 8365038 7843543 8057855 8892949 8084938
14407 8084938 8611915 8845256 9019990 9218778 9240291 9774842 9298844 9650201 9847905 10292098
14397 10292098 10332793 10622467 10383868 10711299 10993200 11096936 11121822 11427675 11770752 12221485
14387 12221485 12215401 12159024 12661886 12677676 13175959 12957653 13110053 14015410 14000767 14292630
14377 14292630 14507961 15098728 15386393 15741596 15705726 16242902 16184900 16804309 17115418 17354895
14367 17354895 18011287 18342867 18438009 18681189 19469837 19640201 20263901 20616616 21269391
14358 21269391 21522471 21765921 22486763 22830212 23398728 24172114 24807651 24988916 26099768
14349 26099768 26497028 27442625 28074175 28790184 29632041 30133958 30654070 31588353 32867370
14340 32867370 33454499 34929450 35466477 36403622 37526745 38725479 39893545 40923868
14332 40923868 42145954 43430558 44996656 46319376 47807408 49182370 50802115 52520857
14324 52520857 54460077 56178680 58132379 59989957 62054205 64730423 67002226 69429719
14316 69429719 72112529 74902143 77631466 80641357 83938448 87021203 90796981 94367491
14308 94367491 98765909 102620742 107274884 111882057 116991840 122587638 127790212 134097197
14300 134097197 140257644 147014305 154010107 161689460 169743685 178487780 187568184 196928798
14292 196928798 207014265 217884893 228990105 240806455 253662886 266041127 279600378
14285 279600378 293157619 307804825 322201534 337109519 351774160 367106494 381888730
14278 381888730 396104194 409875878 422638757 434079667 443414215 449750973 452229611
14271 452229611 454663873 448229207 445284926 448373827 445306564 442333789 435341146 425305208
14263 425305208 413317715 399936379 385559197 370150698 354406227 338921341 323090590
14256 323090590 307461377 292358028 277813950 264566713 251740150 238768710 226599625
14249 226599625 215155925 203966693 193532479 184137990 175058123 166671239 158719326
14242 158719326 151205253 143700472 136947854 130824577 125060895 119609801 114294681 109143300
14234 109143300 104363684 99913428 95922027 92350963 88359031 84760783 81368986 78361586
14226 78361586 75176593 72637402 69657015 67493315 64699189 62553768 60601782 58650541
14218 58650541 56641987 54449842 52815395 51023456 49615729 48290426 46282768 45030503
14210 45030503 43483907 42332760 41464066 40676813 39479089 38280935 37143861 35754449
14202 35754449 34905311 34044250 33371572 32580542 31775963 30520408 29875053 28866223 28592100
14193 28592100 27877621 27220393 26653482 25653888 25158291 24568263 24012150 23316075 23031189
14184 23031189 22469048 21971265 21294611 21043123 20769623 20247621 19707218 19361289 18882453
14175 18882453 18532413 18061527 17731853 17380692 16987866 16866508 16524423 16022985 15749826
14166 15749826 15829254 15237168 15346218 14994841 14323385 14404531 13985970 13803026 13868373 13016795
14156 13016795 13131810 12816493 12851932 12582970 12328372 11956495 11674582 11779164 11665408
14147 11665408 11321616 11313619 10859436 10761692 10435868 10534853 10364266 9969427 10411142 9777690
14137 9777690 9674415 9492597 9498213 9214902 9380232 9035227 8842738 8452010 8726246 8516252
14127 8516252 8748780 8299330 8327838 8099440 8340564 7883054 7613746 7753289 7582878 7501298
14117 7501298 7364820 7435656 7160506 7066674 7164793 6913557 6721317 6927374 6405976 6628196
14107 6628196 6561321 6631544 6131828 6023021 6305376 6036739 6129593 5727867 6050324 6116821
14097 6116821 5767069 5455655 5552506 5347149 5322211 5115750 5500484 5330172 5339327 4976006
14087 4976006 5247890 5210572 5227182 4858918 4576503 4435079 4514416 4612579 4582741 4824320
14077 4824320 4340387 4668295 4557019 4336759 4285067 4458307 4355800 4518150 4354750 4046692
14067 4046692 3985522 4144525 3996487 3985112 4014479 3890821 3934567 3803053 4165420 3920395
14057 3920395 4120564 4043772 3717537 3956531 3479118 3601196 3477032 3748103 3732000 3596837
14047 3596837 3514457 3366793 3282973 3241372 3247934 3304037 3276057 3306436 3198513 3047224 3300904
14036 3300904 3107435 3072647 3335192 3182262 2715194 3192234 3030349 3054824 3094158 3144322
14026 3144322 2949508 2625748 2707499 2910751 2747437 2758712 2783397 2782090 2798316 2323867
14016 2323867 2852000 2729008 2456145 2497738 2503125 2416669 2149887 2277358 2274246 2135657
14006 2135657 2206992 2475584 2167417 2469028 2080442 2359005 2127756 2034792 2113119 2308932
13996 2308932 2219578 1990466 2049208 1936003 2134625 2270135 2589575 3254472 5844138 13709823
13986 13709823 35198934 38034865 27868087 14792578 9223713 5866692 4507037 4193329
13978 4193329 3309471 3286297 2923212 2901568 2839345 2628874 2399740 2564147 2572208 2397130
13968 2397130 2457463 2301501 2214912 2297980 2070796 2007263 2402778 1945979 2143483 2054806
13958 2054806 2211345 1972741 1881177 2058907 2111602 1889004 2066668 1884297 1954545 1818673
13948 1818673 1934000 1809785 1773818 1880563 1714731 1845118 1545166 1751756 1747330 1776852
13938 1776852 1758831 1961221 1604416 1945896 1775101 1644481 1801201 1828155 1719627 1531911
13928 1531911 1406223 1594642 1580060 1639437 1689507 1709828 1686661 1427566 1498887 1526707 1438031
13917 1438031 1173334 1537437 1351273 1620535 1501571 1242936 1753964 1278604 1243044 1095483
13907 1095483 1390430 1539829 1371365 1371720 1617481 1434770 1294866 1575890 1324836 1159543
13897 1159543 970242 1322993 1152474 1391774 1137378 1299803 1191160 1175566 1086840 1121580
13887 1121580 1079007 1326079 1090142 1359536 1058385 1210278 1111136 1132230 932275 1327679
13877 1327679 1495762 1058702 829625 1091198 1268031 1135507 1201379 1493037 1022982 1405076
13867 1405076 1014784 826872 889346 1242884 863475 1206875 1272071 669948 1156147 931087
13857 931087 1224303 1134256 1009170 1144516 969484 1008183 992511 942100 1282331 908394
13847 908394 990734 1137583 843913 1149783 850196 995872 1416680 721069 1266382 731862
13837 731862 856388 1204306 696037 654036 881249 827296 906739 793837 1331383 866528
13827 866528 697214 905964 933244 803239 1138153 618188 1007228 843246 867014 754674
13817 754674 758373 626464 1235220 912283 903891 954023 830357 726548 1059709 641168
13807 641168 866548 1153835 907826 1082101 538256 834451 964248 612377 580722 1031296
13797 1031296 678478 930959 902928 881719 743815 1009969 904434 484908 499105 800045
13787 800045 949877 837731 704360 670793 901444 935428 750891 299966 822072 765243
13777 765243 785333 733972 809480 881634 784051 618473 983885 366351 788422 871091 456288
13766 456288 523784 642383 650372 442857 712418 484358 635627 713445 826042 473102
13756 473102 466642 480807 622739 757128 1201602 627083 657532 681072 807331 464926
13746 464926 609519 802193 602739 696533 246403 661084 591064 591144 645237 521233 783236
13735 783236 719288 851684 843966 528212 940255 673853 500957 678499 529644 475546
13725 475546 753828 386146 563597 767391 249420 635345 349036 738284 508680 498590
13715 498590 342417 395463 623669 383254 441645 443013 719590 868515 801295 601384
13705 601384 433098 285638 389610 513093 505437 763764 739444 591399 253391 280016
13695 280016 966172 640108 573259 637601 830710 528083 172957 369521 514504 643477
13685 643477 273647 697508 579163 346204 576441 643366 445690 500245 275079 529170
13675 529170 43745 595588 567719 223555 465685 453835 289795 -5159 760471 550487
13665 550487 685343 392468 69914 121652 537647 340368 252940 655613 365041 454405
13655 454405 571486 293620 582581 468286 452530 393746 227897 761959 464979 397721
13645 397721 293499 424651 798767 429215 439164 378508 598850 276187 316676 759150
13635 759150 480153 194779 741257 533249 320619 575716 327287 304973 413579 317431
13625 317431 366401 504042 465552 466685 336611 319745 404745 285140 501555 383565 444811
13614 444811 280661 575819 134019 366310 662208 140411 415247 481807 647388 259479
13603 350471 445885 409084 143547 484013 311957 694158 497258 354655 438131 623214
13593 623214 55820 55151 204027 324449 397319 285073 627830 234387 285934 274190 449752
13582 449752 520666 543885 101695 281341 299518 87183 355529 405949 171868 -13464 65869
13570 201517 600690 433842 262907 252744 211224 562796 479701 346016 569362 -146655
13559 238193 305858 443146 282171 177742 63013 188445 428339 501650 387210 299937
13549 299937 192978 30855 281977 228932 -12691 418623 548082 219342 383051 284884
13539 284884 280951 271255 87191 184308 138934 379948 200387 348454 382596 528145 115357
13527 -89657 294610 420447 225737 -40997 61361 405500 53425 402384 230822 132941
13517 132941 221758 70920 174700 236107 145050 482686 95555 518006 234310 171628 119372
13506 119372 236302 344565 451632 151713 218379 199953 456935 216027 437946 180378
13495 -88544 47720 265555 -331603 247877 167963 225455 369568 243249 359924 126788
13484 76700 279776 277726 328190 125103 218811 601121 -11071 171441 582527 69311 338928
13473 338928 418456 473543 126012 235474 27073 526971 238642 331950 299709 358056 350391
13462 350391 212915 301936 161852 121166 268234 106560 260694 443042 353887 186971
13452 186971 366141 538888 226055 196388 454671 232545 295232 246776 303037 65150
13441 180621 98085 -26616 210422 204550 84175 112780 154670 347490 296666 250303 161892
13430 161892 123973 344108 402017 167274 151283 321377 171188 -11759 112482 127897
13420 127897 73106 83255 169643 570629 48852 529300 270964 -16972 420482 311130
13410 311130 326604 -72589 -176494 66784 277616 29246 336105 262661 305582 422667 -206467
13398 407029 92788 166574 248300 167981 270234 416600 228968 65682 7651 99323 54919
13387 54919 324707 -170583 171686 177529 190734 457368 -5936 112634 79349 463565 97811
13375 144574 96612 110352 4182 63230 130440 261333 112359 518497 105537 585265 267940
13363 231574 252785 127338 129490 189587 230308 -218870 -50409 598246 201679 196952 351684
13352 351684 291899 4267 221985 276954 402647 140688 318540 114417 411987 507797
13342 507797 383217 556885 472822 487736 45817 3763 240305 96972 85380 568815 62654
13330 34513 169529 328341 343289 196928 93839 337478 193091 293971 202304 43030
13319 269598 76083 418699 280336 268310 39140 120337 554442 174284 -104142 447656
13308 232326 56535 168430 114839 381773 -55684 84035 250253 -109194 128020 69387
13298 69387 447302 443832 232628 33156 -103656 -246214 237682 -152339 -15181 37138 -176928
13286 314727 499079 131211 312046 155693 -150022 61380 95708 437819 31506 194168
13276 194168 -161189 275434 -11197 9877 -175392 71000 507633 401420 6525 114226 242776
13265 242776 82896 55348 91115 43934 -54276 108925 172005 -20424 149644 168817 287413
13254 287413 15863 -43355 16123 164437 62234 -2358 243070 332909 111065 -158365 310363
13242 378019 702618 89312 209020 108482 -25531 226023 -141455 146159 -150487 -93117
13232 -93117 -133979 306093 142628 525464 287641 242150 172777 -18965 250542 14788 25044
13221 25044 117260 293739 108526 97133 53881 -37370 401518 -130589 -95757 399116 257181
13210 257181 -219932 -58446 -1893 373413 303744 -144027 21375 -99841 31493 97011 -12007
13198 204525 47111 -22047 68266 -110623 146408 117439 92969 133600 167971 329103 -190855
13186 89307 -27774 191253 90048 -268483 239039 666833 197327 434207 180540 21690
13175 140367 -36925 104321 15404 114431 -20901 258931 -166702 -112498 276832 412186
13165 412186 245635 -28184 111798 397938 -5328 257235 81572 260731 163953 324758
13155 324758 -97062 283672 113793 96668 -284560 76011 212595 120549 -107821 61339
13144 236205 83439 -71779 126659 -112771 257545 77890 45449 390121 262616 298981
13134 298981 368076 -43270 -119175 -186847 129075 111499 -16772 -49100 7542 42393 378021
13123 378021 -21040 354056 -49623 -3507 -39965 176057 -58154 214366 -288871 -63188 223277
13111 -24911 3137 63666 -134003 -106041 105308 -46320 -220898 -102506 47106 51211 81434
13100 81434 133460 81169 143898 294709 97070 -242192 -70794 116481 78264 202255 46848
13088 -63881 36339 37227 79356 138726 197444 -121764 215898 203629 -7491 228130 75374 403254
13076 403254 31503 83966 62767 10075 115477 306868 -381541 -188895 87549 70090 158459
13065 158459 22010 399430 208382 400350 411456 205042 166292 370198 105495 263092
13055 263092 133575 190095 -173653 109657 51650 216324 -45656 220543 48173 -124735
13044 124884 -37500 31875 -112197 212515 379755 37499 -45898 167046 254987 191268 -2872
13032 114400 110513 -27317 297608 134757 79240 -98815 71686 369992 99533 107095 305523
13021 305523 -176628 368827 176235 -149836 -98333 186723 -17570 -89709 -159160 55465
13010 -166234 161127 99876 219570 -76078 185578 40960 122418 62664 110145 183646 28628
12998 159908 14388 -30397 177796 105871 26639 111765 254663 -118724 -168414 1231 28507
12987 28507 -210287 177834 151118 119722 264548 95732 77174 257194 80916 153296 365890
12976 365890 13234 216347 358735 204519 290002 -83793 335946 195623 72104 -50069
12965 -224352 405 302058 104127 154297 -84256 233816 226802 185361 -136924 143073 89297
12954 89297 89969 209432 140960 161608 162624 83156 111388 27293 70344 -115870 7547 -195533
12941 -141043 57900 218901 -128410 -254020 -84684 57511 -87204 143067 220478 -79284 249773
12929 -216241 -104593 25033 -205892 298309 175714 180814 55429 -156222 -130730 133740
12918 -95481 315431 -107621 109117 92001 -103429 -246951 194842 -1393 -149794 120467
12907 -73892 -51853 102949 36504 -29988 162226 79874 331486 -118454 255239 51316 193428
12896 193428 -30814 -147669 124932 403174 -282691 -161424 256715 90721 366872 251564
12886 251564 280696 91066 285766 23996 320117 -89996 320631 12775 -49551 -127894 226762
12874 116903 86485 16087 13467 -121073 36013 -171728 25052 -61082 85450 59434 -108483
12862 -9523 -11308 144074 -160746 177807 -147937 66277 -331128 269855 61485 36539 126309
12851 126309 -5883 81969 125582 10959 -107530 -28781 441528 -108194 -3001 -157835 -35810
12839 -91906 174032 24777 110280 -22272 -83534 47204 -170494 -28392 -161338 -10277 -107514
12828 -107514 401445 2142 130942 119028 71771 171720 175835 -82636 -208760 38803 80527
12817 80527 10078 363931 -327429 238793 230128 -202592 259802 126562 -63353 51740 -148827
12805 -234306 102853 96083 1336 199357 -75875 142592 132058 -248098 -79389 208773 4227
12793 176447 -119760 6431 147850 -33674 -133121 -68854 -361631 45186 91650 357279 -127675
12781 -88397 -55600 -279615 96397 -117672 224904 10178 -26949 135388 215 28308 -28690
12769 68360 -97977 -34525 281851 -37704 -36982 27365 213486 294287 118533 -91030 -69479
12758 -69479 -353352 26918 199843 52496 -90431 157846 -84676 -87173 -38565 -295595 190524
12746 267998 11618 -440790 -23203 31854 -15925 -32071 -8505 306877 472432 210003 106739
12735 106739 213297 426752 61783 198631 56317 306101 -129778 -34990 3949 166030
12725 166030 -4228 118413 -142544 -94451 -134608 -30911 -116076 -53627 172498 137246 -26569
12713 132470 224326 -26448 135429 148250 465237 -84467 128868 255221 217206 148828 127457
12702 127457 74285 113420 508441 23350 22753 191632 123695 326597 38576 -187156 237964
12690 -85305 -223406 -17626 153119 -66400 27509 -100305 71124 354366 261786 -85613 -127012
12679 -127012 46111 377905 144001 40327 377693 85905 -46967 14113 -37080 205668 -29864
12667 -10167 111218 94410 94628 172250 -203679 1860 -9305 -126000 -47648 -62813 614171 161686
12654 105809 285228 81290 -262920 170129 267972 -4900 -203990 320022 299239 -37908 75048
12642 -67347 -234290 -160423 48176 120137 -143067 219260 -228266 149344 -21564 78551 507011
12631 507011 373119 185873 -11991 198640 143831 103113 229077 63194 -138985 134562
12620 83204 151330 208816 142484 186543 304817 259335 141552 43419 -144043 206578 -93388
12608 -18542 156787 -79429 52079 -96712 90437 128657 -58245 318343 377982 192568 164672
12597 164672 38106 242443 -26685 84215 125461 135579 -73426 -12684 100341 25850 -5145
12585 7566 -131633 83041 -47050 207810 266912 -83401 158173 108971 -20090 -58151 17523
12573 38481 433232 -20917 100903 -88631 100467 -126105 -180346 -165569 157606 265194
12563 265194 110673 -104151 -151162 252671 39142 71450 -301600 56341 140877 251234
12553 251234 53447 -387157 -180428 -31701 -346916 49570 -225336 250513 112127 55833
12542 -317985 -81770 37139 -36360 221900 -41215 272551 -35104 -218341 241418 -456990
12531 -159303 186038 142666 -157735 -130416 10702 285355 -49754 -262285 -79043 -242493
12521 -242493 230926 -182423 15954 -104680 14014 -188093 -120275 127657 -228165 242331
12510 315276 213738 139335 95308 95999 4219 332187 -110222 -104781 30712 115359 55724 -134316
12497 -87611 141855 -87069 43495 272274 63309 -53607 -95976 192809 192946 92076 -173813
12485 4004 -135629 116713 -193090 56459 183851 56669 315907 -84569 -41312 239419 31558
12473 -115753 129646 -158282 -51930 234731 -172959 302258 -10658 -296262 -9565 41512
12462 65647 -38744 -84948 265859 123857 -349462 451537 -114847 -212743 -354353 255809
12451 27201 146435 -86330 261681 -241189 -257741 63064 111657 15006 181950 -65689 -231540
12440 -231540 -107719 -5712 62484 43659 -20157 6524 -208097 234916 80955 176569 84927
12428 -409973 -204451 206826 -129300 62355 -155500 -244472 -63880 291094 93883 17648
12417 99446 99680 -143682 -96992 33846 -397557 -25105 345087 205086 -144549 101198 -88297
12405 -57719 -95301 273882 21925 -24961 155505 285284 262841 116072 70580 -128840 -213784
12394 -213784 -54591 182633 102824 49309 50564 -71045 120599 72171 -248666 -163281 -233427
12383 -233427 241016 -63937 24900 156598 -430398 2354 74526 118770 -240176 5506 -24132
12371 -406434 155937 156167 -15312 217528 -65927 227626 -23486 291532 -172410 -242458 44600
12359 284171 -156888 -75480 5771 -376508 -38232 28636 61654 29923 -250166 227615 257509
12348 257509 -115365 -180258 213300 -55083 -5842 17080 -108569 -114910 -89707 -22356 -24123
12337 -24123 222069 134609 -5381 251713 -23533 41133 -116523 -208105 230373 263747 -70481
12325 -90854 -145110 303087 248591 212659 63107 -43562 152499 250493 -64371 257389 80392
12313 -55771 272930 52917 -95263 -196972 -286631 -171825 63390 -81612 259417 94772 -292976
12301 23967 -354566 -412307 -2418 -41644 274312 281941 -101264 83706 39409 258680 168162
12290 168162 63867 312547 -144822 -58487 -10875 110529 209380 59546 37746 -43873 159730
12278 -94771 114801 169122 245532 -112726 286287 70622 314607 48637 372502 272434
12268 272434 249713 110333 -63048 122482 244394 194670 183140 127269 17929 148978 41440
12256 36364 149604 -96378 -123972 -33953 297283 180646 356874 104333 -56953 43277 402627
12245 402627 276008 115750 -96605 278987 35500 -61980 292248 -95301 23947 -43729 173363
12233 84078 -196059 -118469 165625 155757 434502 232296 312669 271142 56781 118831 153850
12222 153850 203908 -169349 181421 88650 255280 -60729 41510 243302 -261814 567300
12211 298392 -197668 301438 392040 277457 52894 184516 -163620 367844 -28156 120286
12200 169219 344129 102818 292477 454044 311957 185694 435935 -36528 218112 122727
12190 122727 425503 105349 290874 215044 448470 31924 47857 410061 -162863 274908
12179 359213 304612 101334 90836 -237447 445067 -93535 275243 85454 -57888 178632
12168 -8308 18688 228207 97334 318641 13726 3960 -321805 43692 260284 94554 42759
12156 61765 190803 279381 31303 203076 192435 200288 -95940 -155155 -110014 -171884 -57559
12144 115500 -99282 -13725 -232087 -165239 -158780 -8863 78297 -24611 -74321 92289 -65257 245188
12131 116157 54944 -402063 348159 -133410 67819 54742 -205290 189652 -164210 77567
12120 207835 39823 232059 73273 -82238 -130884 -298411 -136000 -198100 34534 9109 50730
12109 50730 -253624 -56735 -97592 -265522 -79540 254157 37346 152430 -142920 -182836 -126049
12098 -126049 230384 81505 -81299 -152692 -55865 94211 -93738 2596 426900 193906 103083
12087 103083 -102715 60007 39382 -11719 -105918 -352938 -248381 253997 359823 359985 1028511
12076 1028511 1619782 1836755 690476 169931 136469 -292515 112878 -182999 26722 21451
12066 21451 -23043 78633 66213 -142206 217841 -172311 119874 -219484 -324882 254623
12055 -18069 434514 328195 76821 267777 -52833 -152319 -73199 198393 -49926 -44111 -138292
12044 -138292 22180 49662 -168383 118299 -89376 -125864 -105473 29103 -160273 -142815 -201720
12033 -201720 -115903 -22099 19141 -150808 -183936 -203945 -401224 -179416 -387434 -79580 -210814
12022 -210814 -1348 237027 130251 365031 -31014 180838 302089 5820 -14674 -140652 -61328
12010 171702 189258 -366092 -41079 130366 4588 -10498 10759 -200212 -111035 247347 -220906
11998 -12025 155767 -123235 133155 -13200 295894 211255 27251 -213431 2176 -20419 163924
11986 42994 166510 97574 40735 89961 96035 -57748 -246799 -277396 -9646 550603 -146856
11974 285371 -170366 67806 -355468 -97475 68807 85912 115649 -172256 165044 149113 157593
11963 157593 -49897 173047 -28823 65810 62762 35983 178297 12842 -156876 -137841 -188933
11952 -188933 -236729 -102157 -116793 -304164 142466 3121 92813 -315333 71987 164397 -82515
11940 -79772 -166644 28001 -322195 22437 27494 -209994 41630 -1260 -58672 -29298 -91733 -319756
11928 -319756 33802 -48687 182049 -121770 -33040 70711 37172 -90524 -247526 -59997 -197605
11917 -197605 -72099 -175563 -44721 -105470 86419 -228958 -79918 50431 -367889 315196 154563
11905 -298 -272132 -8570 316209 -4468 -44943 212717 -321530 -76216 -99492 213703 -60303
11893 36342 -95250 -8816 -41254 196132 -23678 -132951 44462 6079 -218851 115942 -163548
11881 -135353 120259 -41603 239004 -5954 -310990 -296207 81600 -23659 44517 321004 -107125
11869 -89138 34978 257452 -10118 -168540 -225058 -51012 13435 200413 -238000 10814 -213342
11857 281944 -125005 236161 92032 -112137 -526235 86127 30642 183736 115574 52709
11846 139163 143427 -384964 1857 278653 -166139 386274 116526 -34732 -89860 64570 -2431
11834 -137834 -121233 -5967 243970 93646 -194125 -263488 -43804 223852 -107787 113228 106285
11823 106285 -68957 -275247 75391 -98216 84025 -34045 73932 35363 -135456 -87179 179490
11811 -2192 -41577 -219014 -308967 -27449 -153993 52623 67836 -156915 -352349 -25053 -78810
11800 -78810 34127 -210170 -70560 -240161 -102188 13943 148002 -115293 241431 -77025
11789 -150704 255414 -87034 -168950 -29853 74524 340603 -26292 -110196 193150 -62840 -60423
11778 -60423 402369 -9053 -59041 4098 24847 -158470 -155303 -299446 -298798 99503 165238 -284596
11765 98806 -186248 224491 -64486 54517 35191 110723 63905 319108 -138953 6495 49175
11754 49175 -29830 43134 -352901 122792 -33260 200140 -153414 53480 -240270 -317648 136425
11742 -66209 298252 -37040 281996 -126751 -63784 -59052 -126185 -218323 -478100 -57608 -172585
11731 -172585 -219365 14542 -172378 228772 151101 -306437 -105676 100008 -115587 -119359
11721 -119359 -49888 -239924 -173538 -27782 60912 198304 -42956 -84292 -41468 -249594 -170301
11710 -170301 -64532 48249 175683 337136 26407 183559 -3985 96245 51106 -69038 -81486
11699 -81486 -134543 -25192 -87621 -163900 165930 104728 -157182 180781 106915 188710 19703
11687 189000 -98404 226680 68850 264214 213047 -171430 -7312 -272069 -22744 -39364 116546
11675 252087 44745 109462 -371251 273061 -2124 -90841 37532 -31615 -389496 207528 215149
11664 215149 200389 -147736 -96706 -152418 -168219 223699 -13149 206679 88598 -83275 227179
11652 355957 -376531 -135488 -106064 -156822 -229431 255474 -41245 16554 108148 100211 26589
11640 411199 -61837 -464492 363013 64102 -173138 225048 70700 64965 -191852 -28486 -258854
11629 -258854 59336 310761 -69935 202475 338956 98902 -22375 131149 -128047 -129761 279288
11617 -89613 16005 -99954 -86828 208528 49245 81770 12294 282711 -68666 -59552 -45169
11606 -45169 11239 270392 -127470 -22129 80658 167507 -26640 -138219 236814 203656 32944
11594 -135287 -263280 127967 96517 -91024 148680 -182799 92008 -128699 -140906 -81430
11584 -81430 100441 14373 354226 100917 169526 89408 196939 69021 164917 97059 -114074
11572 239068 45733 154318 27820 -34424 235294 19280 -252902 -57374 318456 -214351
11561 124849 98108 241754 -118899 18976 6696 -220139 -98742 37919 -186650 59668 -167331
11549 -87021 13970 -4939 -60900 -8732 53883 -88986 355725 176955 60074 -120542 341821
11537 90020 -146410 -60623 79218 3467 -18442 246361 213466 -106036 355282 -262026 -150275
11526 -150275 231591 226303 -124339 -15074 197158 -48473 -4225 352011 25115 -68662 -786
11514 195399 203802 53466 -84588 -163041 295774 220953 146937 -124004 -111581 60839 246334
11503 246334 -207526 128327 115124 -6778 286452 3721 307 150668 327537 192712 -265292
11491 -194982 57168 28382 61992 299720 -43965 92203 -24674 30677 -127416 -10178 83140
11479 294694 -243007 208216 127423 145970 400128 -103182 6126 168544 372924 118230
11468 111918 83369 46484 245390 37766 65049 310484 -193731 72973 -6880 24486 -182308
11456 -60886 -14950 -72377 142241 227104 36447 163649 8997 -67259 263772 250385 -67135
11444 -135849 126468 393400 76433 80548 -229791 -58921 173344 388462 300376 34577 248185
11433 248185 139785 318748 -213952 -145748 -146633 -284270 -42883 187249 102027 35385 41195
11422 41195 -264436 175207 14860 -393790 -121332 80590 104248 -6193 -144529 -103604 106824
11410 -3452 100671 -65449 -124636 -60020 -128087 241532 -73782 381021 63560 -40617 54013
11398 -28231 70557 -79849 508050 99848 -76512 -220791 -260004 -100651 -260354 -174786 155523
11386 -58058 -178917 252579 54771 -64066 10089 -91255 73400 -7415 -67795 -192560 122185
11374 38982 79672 -151029 -7709 87928 -65048 20948 -268629 -208839 -363993 -240863 121297
11362 -11058 206249 -413331 91036 219250 -189493 -109396 185645 163097 5779 -424697 -180793
11350 -61709 -336960 -115616 -27949 -47812 114677 85497 -379174 119513 183474 -25831 17444
11338 -476482 282198 -85335 153698 31488 -65473 -46266 -271652 202019 -143226 -61440
11327 -34935 140681 -176575 8758 37250 -62244 -6687 -189670 167569 -223557 68087 84842
11316 84842 43353 -67266 -309744 -122284 227556 -29044 -175456 310769 -117713 32878
11305 -127702 -444091 173185 -121339 153031 -328264 -216040 274852 -217455 -365793 55885
11294 205178 -183604 15303 -93842 -274231 174437 249196 192308 276171 -188703 -177747 6093
11282 188787 -245234 411063 -97502 -118927 42770 188869 -253044 -45566 129929 190696
11272 190696 -70156 75100 42556 -152995 98775 -200121 176518 -271386 28164 8620 -121561
11260 -54217 10002 -31819 -62224 -72824 141522 145657 136671 -62145 -133891 -224785 -134808 -140629
11248 -140629 -84088 247403 -79288 -143303 -71951 145772 285765 -217656 -82912 260869
11237 -69030 177104 -257571 94066 -5126 1766 -141487 -90010 -208136 239272 205626 -142954
11225 -166498 220656 15026 -143751 -68092 -192862 11432 132512 49978 144574 164628 -50081
11213 -1605 258513 92423 -76968 -12428 -310527 -444204 -59524 162107 -285354 -213722 52213
11201 14065 106875 -145392 -11461 309229 62713 46004 169663 14679 17924 -244368 -60345
11189 -110641 -74278 -43083 250350 -7702 -80514 191612 -60875 -144084 -91551 -46186 -483610
11178 -483610 -138718 313607 27256 -118464 -29343 -70131 -88428 -8262 -312629 405785 -139457
11166 -222513 184325 62139 14355 163248 -48491 20601 -152336 -318604 105760 -91582
11155 -416355 -77792 406384 -139809 35832 136980 -209289 113900 189749 137652 -11976
11144 -163148 -28435 -79418 68314 -304340 15350 70705 143144 -51065 -83456 -19230 -83514
11133 -83514 -241113 98814 -22155 152449 -33192 277060 166840 71492 313670 -82743 732
11121 15216 337293 -118054 217818 56066 -47533 286577 -362834 111934 2353 219063
11111 219063 -126975 82674 -111531 -26823 178626 -61062 37017 380997 83850 103836 259290
11100 259290 471176 211819 -131414 51178 303749 237748 549780 14886 -117221 396308
11089 348734 362550 -60224 207582 372934 376254 199328 53506 227710 200926 203745 354047
11078 354047 293680 44129 89406 274355 135751 219107 206760 365897 342568 180222 482406
11067 482406 241200 691132 191436 366633 331337 462105 604038 616534 327682 680128
11057 680128 276750 406735 611524 477740 734513 523964 756969 505364 655526 365982
11047 365982 364981 769359 771645 686463 444448 560854 808225 963692 611316 682794 896124
11036 896124 612210 679412 924058 364331 767422 739275 729189 628018 602431 505119
11026 505119 316882 728971 540134 347575 460352 597262 331770 377836 708633 804227
11016 804227 410666 482672 812812 416690 388746 307558 606403 437562 114220 628784
11006 628784 367442 538801 386100 537094 634475 481849 485357 253390 763959 659558
10996 659558 777215 540365 681435 267885 708233 456579 390133 612346 718860 530099
10986 530099 526485 762203 869051 832776 1118912 1085060 1104052 1141521 1372982 1360114 1495142
10975 1495142 1657189 1892111 2115630 2268135 2407266 2392387 2309171 2345794 2366182 1905486
10965 1905486 1999892 1458969 1382004 1190097 1483968 1486424 1023518 1237588 1435902 1523084
10955 1523084 1554150 1487133 1370888 1468767 965787 988045 1043892 430515 537029 231987
10944 440750 236945 526479 367794 186016 183252 215892 356915 242890 386650 217944
10934 217944 -144578 91295 -38615 219966 358856 61039 259619 -22592 37810 -201129
10923 151684 270808 -109790 -18105 -37729 73609 48280 -226696 237227 124862 -359615
10912 -173870 -391 -174689 -177689 103898 -92092 -29245 -29946 -24218 -184249 -161058 -399632 221211
10899 -325296 138178 120976 -93077 -179728 -22377 -83818 -230884 138713 155726 6835 -210362
10887 254549 -101462 355579 -153512 110101 160970 -97943 -235861 -59603 225831 153010
10877 153010 -233232 -204916 -106060 29697 -399823 43256 -11496 71630 181494 -5524 -333330
10866 -333330 46621 188560 -10218 -178174 475 189547 -31746 -244348 301301 19010 -337850
10854 252128 -47141 197129 40401 123052 41868 -74241 192996 15127 -153466 107810 -31642
10842 -15813 391527 -84056 218946 -27017 129791 -159924 -138260 -254910 288978 3806 -52853
10830 -110638 73563 -457424 -283488 -151137 217441 -116942 -64667 140629 -20306 23577
10819 157774 -160636 -59473 200811 99471 7182 -405224 153174 63534 -435071 314842
10808 -127893 -98883 214267 -104295 24114 173199 -101961 -236610 -24868 125877 -52822
10797 -196286 -162142 -63534 -83372 64533 57822 -45825 102361 -113257 -819 -215891 49476
10785 -173524 -133089 -104099 -48811 -187252 -71284 108420 109813 56800 -417119 115322 81222
10774 81222 -47088 -94598 -324774 107177 -10663 8376 83342 -65430 95154 55268 -294156
10762 -118388 -443478 20076 212816 29238 279464 367415 -21481 50831 -152117 -244004 155463
10750 -63816 81983 -34663 -101809 -7352 126985 256228 321931 -124695 30347 -312556 272225
10738 -18845 13364 -313884 3994 214761 -278968 126428 33201 -174174 -84165 -75902 -238314
10727 -238314 -45351 -19757 118641 -293109 132513 -217934 -185409 -47513 -348792 149120
10716 194758 87866 -175970 23727 -207279 75797 1950 -250552 -113402 -126050 -201099 148674
10704 -321121 228172 -268733 -143823 -225650 -32048 -9746 151558 342036 100368 -283851
10693 -101455 198074 140974 160877 -205672 -236956 220872 -115622 53135 -46736 -222201
10683 -222201 -41918 -111560 196939 -88080 -27658 -304935 119881 196009 -58269 87973 113450
10672 113450 12178 -263488 -177621 -37089 -11571 -93805 170254 4336 -239014 -261412 -298281
10661 -298281 -125652 127644 -202291 50003 -71908 23265 -338818 291056 127732 31953
10650 176703 -23657 54858 -164705 219928 90384 26004 117295 -87007 -233594 -376427 -79612
10638 23346 -189498 -60147 32712 290891 39039 55534 -6253 -91862 -95308 60922 -117268
10626 197919 -349273 -301972 -17304 7941 16340 -234394 116949 -39704 51346 -39780 42141
10614 -229622 -181742 15032 197848 153077 -171053 396249 -46398 353113 88584 -193354
10603 -3899 -67853 -284281 -123615 -61438 -58341 -20789 -90188 -283022 -120198 -89518 13180
10591 -6715 78237 -99387 94291 -14112 -14285 -217845 -173698 -163733 -52582 -303446 -86776 -12328
10578 -93561 -22535 32270 41486 104693 -160614 -302230 -81776 -207386 -169214 -401911 -102503
10566 37190 -173908 22227 -6921 -156592 56395 92193 -113622 -194943 -205384 -220923 -41405
10554 28825 27335 -24077 -281121 51578 108830 -148548 -56257 -390955 -38903 -100511 137535
10542 114896 45598 -195474 -73354 -127604 -243580 140412 32454 -108798 -287125 143065
10531 22436 24037 -206535 48872 332352 -97211 -106522 -102385 20588 127700 130417 17265 155480
10519 155480 147925 44876 -245 -99925 29900 -77663 153166 161529 -234773 170943 200963 223371
10507 223371 59124 -225705 -42761 -277544 179501 -39294 -40465 -276329 -16755 84636 -10837
10495 67327 113266 -108328 -10757 146643 -39304 -81104 -108967 -36578 -353188 -273871 372871
10483 190028 335719 142619 223927 360614 564800 259213 357326 76135 -68337 -26513
10472 148144 -78586 261715 15467 -30706 20764 44011 -52933 -16507 -37303 61449 81394
10461 81394 63295 -71923 2318 12138 -211137 -98976 -131489 136744 -153681 -135639 -150540
10450 -150540 75781 -106155 200014 -39331 -10604 -191970 93543 73806 137182 216799 14684
10438 -203206 -156942 -210164 386337 -16036 20132 -236843 15595 82284 116554 276741 -16426
10426 -151152 7430 -317393 -85396 -186198 -134548 109737 -230228 99325 265741 330132 332717
10415 332717 159652 -55368 -74705 -82936 131014 409192 215240 4116 42593 -4868 -11688
10404 -11688 -79949 -132544 334688 -16708 14751 -37650 271633 19694 -17413 116243 58717
10393 58717 101287 93916 -52388 80278 -155327 -62257 74722 321003 161250 131322 154314
10382 154314 -200455 123387 409233 123102 -114695 196101 47977 383429 162061 67897
10371 180563 318391 87372 740179 235966 477534 456758 270738 450569 499879 239846
10360 263808 30972 78561 -64540 45590 179110 230034 74998 151300 146733 418521 490873
10349 490873 575917 119708 315323 122441 154718 147524 177916 214198 276227 207756 127404
10338 127404 215871 252429 -7406 342493 61827 -106863 253380 23308 -63609 -25059 -242390
10327 -242390 -227948 217870 -38653 -106314 -189716 296714 229106 297637 122931 132313 97451
10316 97451 8409 46942 -105952 388494 -235008 -149665 -219601 -223404 -396606 -200813 -242347
10305 -242347 -260059 251439 423285 129624 -57462 -80131 164129 272320 189313 -200615
10294 -90987 -54863 -163921 197607 192896 70123 -26106 6925 174054 12634 22460 -53177 63089
10281 -9867 15499 167173 13989 -43751 -178390 -306777 -47433 -83912 -241415 161895 133438
10270 133438 57002 74531 130207 -91887 -146963 -74415 180589 -95578 36866 358270 -5978
10258 -31710 292953 -77447 -19297 86070 130269 -98365 272437 247830 -87886 -26035 25673
10246 89387 315123 160602 -131777 -258878 -91276 49171 439640 249851 103039 62098
10236 62098 -131840 -308671 -90438 16968 155490 287498 -104552 -63913 1056 -204304 -261471
10225 -261471 159366 -132957 -99337 46628 -129197 -46977 217318 96867 -84504 -200166
10215 -200166 -5659 63628 -361027 -53534 14914 169949 -395653 21169 50599 32315 -194558
10203 -264843 -99591 -52385 75112 -12764 -91853 74705 -245291 -317821 -219585 -181333 -78016
10191 152581 -20929 -261050 -321403 -59105 -72883 -72567 -239674 119102 -163553 -212964 -163718
10180 -163718 -22844 -82271 -104813 -178195 -70845 -77815 43648 -29597 -210527 32513 216324
10169 216324 78933 154698 -282287 -11904 116687 -15111 -103656 80393 76395 -381732 -99295
10157 -240177 98597 -85071 -370513 101279 196176 -108109 79287 -67959 -316769 -1363 86949
10145 -15605 -481213 -219436 -134509 -113292 12626 -144252 -174834 -28007 3174 -362061 454519
10133 26907 128729 -340726 -251188 -113628 -476935 140062 3910 -108732 1406 -68116 -104123
10122 -104123 -311455 -79590 14400 59349 82490 -113093 -69819 77133 -171571 309892 -107653
10110 -288734 -328028 -205880 -311654 6869 44581 158337 82125 22679 194521 -211458 27370
10098 -54130 51650 -312663 -182450 123228 -87062 4537 157643 -158592 -343131 307082
10087 -19514 -143315 -145325 104425 230835 -85359 -172269 16090 95433 293908 -80506 -44929
10076 -44929 -28685 -92338 336718 -214895 -830 18482 -281748 107608 -142196 -272666 -270192
10065 -270192 -62405 -123493 208134 -18819 -36775 -4217 131678 -266734 357594 -180114 -40141
10053 -78437 -7032 -136401 -129826 -336860 37705 -35682 33609 284312 -106713 206514 95270
10041 -422530 -48074 -71516 -101471 -153342 -215318 137448 -136591 63610 -258763 -53298 246410
10029 -77925 229694 -163823 87780 41580 346397 -332653 -94800 -89974 -42328 33687 -282341
10017 -595346 149923 -7957 117402 -172698 -52802 75355 -170472 92376 -115907 -80579 -96192
10006 -96192 96562 -213566 -66669 -40525 -144697 -9991 -551 -91067 -108740 45971 90572 163460
9994 163460 -206553 148200 70364 -129798 -218033 -133269 -126974 90615 14056 -233880 -123217
9983 -123217 -246305 15949 -97331 -212743 -349210 -274872 77671 -330152 137180 32748 -60834
9971 -205236 -90242 -73742 -226729 -73966 311886 -35409 -39584 -285789 -374172 -119538 -382194
9960 -382194 -35624 -206656 125062 21309 162519 -118249 -251951 105012 -167221 -160256
9950 -160256 -217821 -278402 -81368 203380 -130002 -135978 21412 272359 31774 -335469 -228934
9939 -228934 80094 -235191 -190407 -3973 -211240 -91330 173924 -186571 7239 -325395 -257481
9928 -257481 116771 528633 -218215 183675 -174967 174873 172417 -416606 -156592 -191628
9918 -191628 -392629 48664 -151723 61640 9582 12381 -224765 -82724 -131912 -281302 -139990
9906 54895 178702 -121450 89475 -51445 79141 105775 -161102 -146366 -9801 -48101 -90831
9895 -90831 62317 92450 -80574 3302 -126426 334628 -88126 96779 -97084 -90897 -1212 -223738
9883 -223738 -404880 -1941 -203074 -167659 -203014 238096 -167621 12400 -119786 39901 -50319
9871 -54215 41592 -221292 73514 -97244 -110366 -110206 -19979 56813 338332 251886 84875 -137969
9858 -120083 -40755 110553 -327638 -328589 929 281283 -71379 -72287 107527 -363877 -180425 -176319
9846 -176319 206382 -267965 180840 -95441 15146 -86519 -49333 179288 234649 123760 -103470
9834 -419496 188336 -102582 -161708 -483938 161740 -34776 -138634 -138924 161246 -55255 39592
9822 -140544 -67662 -291582 47115 75446 -131758 27934 -44734 29356 -289513 13565 -270248
9810 21855 121393 71112 183414 -523001 84002 -75536 -195317 248844 -152720 -19869 76272
9798 -85690 -280080 12144 103155 -100350 -255693 124159 -5896 135988 85280 137320 -173618
9786 -45225 66648 -137835 106068 -159863 -127182 -203129 -412308 2480 -59114 -76424 31968
9774 -317810 -143020 117451 -91068 68569 -572210 -105385 -191539 6508 46353 -224646 1892
9762 -256294 -76370 -464513 -79455 -172047 -216764 -21616 -231164 -291327 -222498 330588 287521
9751 287521 -191976 -85184 -152235 -229506 104624 -286207 67642 -56047 -48695 -166770 -268675
9740 -268675 -1513 338254 131422 -175813 -323259 321480 -274660 -7349 -66132 -504628 25428
9728 -51998 302712 -302452 -219003 -345905 -8698 167359 73623 136496 51679 -366777 -384248
9717 -384248 -168020 191635 -35350 145791 -60035 -220274 128497 213437 148210 -154629
9706 -169462 -340919 28474 -72465 -101115 -86039 -148163 86839 64323 -78149 2977 -303052
9694 -167692 44209 106938 191808 -41030 -9496 33652 91745 -367121 -185387 70391 -65176
9682 -15463 23463 -130552 64280 70814 61713 -128516 345398 -205308 306589 -70194 -185348
9671 -185348 -197487 -77577 -217732 24730 -77279 -65190 -95731 280733 93530 -307417 164448
9659 -208815 101391 -255321 -81016 -74369 -138837 -279339 62050 132684 10065 70285 -3621
9647 113769 -19262 88502 -212622 201849 -89447 -161703 -18384 -319938 -241067 -98408 97822
9635 -130177 100255 160387 -227646 -295564 -168489 -27395 -269748 -191223 -230817 -31016 -211033
9624 -211033 3211 -189665 -43929 -89544 82739 35835 6741 -135228 43822 -319735 43219
9612 -85989 -75313 236122 -169051 -276765 19568 -323029 120713 137544 -52999 -129288 -386949
9601 -386949 67662 -195667 -56340 543817 -228243 -104828 -30838 -184947 -444565 151019
9590 -74532 112543 -132059 203635 -156860 -242531 202030 -63800 -109904 -163212 -184879 197647
9578 -20591 122354 4842 -98468 -209374 -192614 -35489 -130718 -152959 87231 -138636 19266
9566 -86643 227994 179841 -63339 258293 -389980 129013 -150454 -512776 -284584 70035
9555 -79920 1933 -290268 -102798 -134084 216028 -125760 -124205 -277781 -180938 -10109 -195072
9544 -195072 -50236 -78289 -131525 -31803 -302924 1757 -145733 -31380 -269618 -103791 -46216
9532 159518 88330 58323 -191542 -238040 -40956 -37996 -110931 -399752 -251951 -275014 -109015
9520 263736 19891 -237923 96230 199308 126935 -446349 96103 -53294 -21743 46441 367668
9509 367668 -235232 261595 -119947 -33126 -417907 -228719 -84310 -167814 -214123 -23520 -228553
9498 -228553 -79630 48570 -314405 61372 194472 -345892 -161974 -246197 -265164 -213695 -223996
9487 -223996 -67622 72327 166921 -154563 -248898 125328 169267 -9464 359777 12577 -52711
9475 -244623 -41110 -221706 -180563 49392 -192949 73928 -79289 -303963 46027 61104 -179653
9463 -488604 271670 33795 132305 42787 -262711 -30775 -78179 148369 -142464 -137636 -513600
9452 -513600 21718 -95428 203599 46129 -310121 -63104 94693 -34335 -107339 -117163 -343938
9441 -343938 -151371 17749 -466051 77590 285330 11053 -84017 -54264 -25733 -158203 -14969
9429 -455900 -85471 -309890 44294 54994 9736 12722 150518 -165942 -173593 -131680 -27363 31820
9416 5452 -272564 -377813 -90184 -123860 -13145 151936 9158 82735 -70173 36809 159179
9405 159179 248221 280582 146251 -2196 -11435 12756 103009 152280 -80475 216901 -237218
9393 -238502 -66433 33547 -222962 -66662 -281224 -162766 62395 -9456 37277 312889 -70475
9381 192297 -170532 146546 4843 -207352 37265 -314297 -157005 -91221 -231973 -358079
9371 -358079 -34705 131224 -270002 -140939 -17794 -66269 167508 50883 -14504 78419 208648
9360 208648 -33228 914 -68652 -83765 -341853 147517 -53010 -215041 86145 -241698 -98932
9348 -367610 -140817 84095 135583 -294479 -92315 -277099 94145 53548 -58440 853 -420249
9336 379780 -228769 -79330 337906 -547599 263302 24274 173958 -489266 170182 -100971
9325 -320320 -97341 300667 -33111 103758 -89945 204161 177303 -109721 -61270 78017 -296543
9313 -155197 126519 -3525 -23389 -144371 -138669 -245328 -175423 -157176 -501955 -149262 -19656
9301 -122330 -321773 -68755 -207254 -162937 -186788 348948 111508 104856 52648 -162227 166937
9289 152735 108429 214888 4140 67238 48630 -203018 -114807 40350 -2379 -66663 20705 -205879
9276 -21323 -28357 -33540 75255 -523598 26850 166668 -212601 -37228 407292 -175772 -211116
9265 -211116 -225366 -132116 -145857 416867 6698 38214 149880 418335 -14779 -77462 -198524
9254 -198524 196338 -1879 126863 -351208 85090 -81769 -132595 -328354 -197036 46358 57192
9243 57192 23399 396778 -82130 31892 -148523 88091 -145273 174964 -114444 163857 -245744
9231 93070 -216950 -186700 26267 -10005 -118896 -338231 145356 -280017 -46997 27026 -59238
9219 103580 11825 38879 -74402 41196 63963 179758 65619 22656 -116903 -90495 344755
9207 95724 -37619 189920 -3087 -227882 -195802 -205257 161641 -151354 -199535 159269 -175056
9195 1281 -139691 -200426 -208795 -3899 -22942 -64095 168881 -243927 -48747 44597 52177 197023
9183 197023 45231 38143 -199761 -178909 -177869 -192959 -397100 -7464 -224723 -48760 43778 -288305
9170 -37262 -57572 -312814 -258049 -32718 206425 -251890 -68790 207896 18775 42619 -123492
9158 -250574 44400 -76892 -59678 53930 -260219 10063 -126598 104216 277573 -257310 204262
9146 -21792 -70160 79461 -56162 195712 -63776 -26792 -189900 -47468 277430 199186 -540586
9134 209863 -320425 -21967 4467 7712 -50042 -306548 -372934 81681 196868 -81207 -201848
9123 -201848 31430 -81842 12009 41028 -214332 239383 -181530 -331515 -43507 -33391 -260386
9112 -260386 -555036 60263 166718 -36017 97707 -25210 -298932 -236806 66986 -378590 -115837
9100 -24450 -261656 -7815 174998 168978 -266242 -5608 -20655 -143752 41374 74256 142290 -206959
9087 -22597 84246 -149576 -99633 80629 276980 -215798 -53242 8980 -67179 -202808 -219759
9076 -219759 -434195 -89278 -110408 129866 96273 -224441 -75145 -167121 -62668 -216529 -8588
9064 -101827 -172069 -125362 -464068 -62927 188365 27289 -502046 -16883 195544 -517526 -101797
9052 -89821 -333706 185941 -15076 136059 -91725 -215521 178715 -185631 177025 -45244
9041 -76593 295003 -29813 86099 -34779 11804 9516 -22379 -9248 29202 -296354 -200859 -47174
9028 -203011 94481 106706 -186789 -60339 -52730 -17528 -22668 -154192 111800 -218342 -146153
9017 -146153 69299 -97317 -192248 -226215 306757 198112 -69826 -151193 -114203 240127 -198445
9005 -16467 -263827 -18310 244692 -414398 -254107 -13320 -146386 172166 -105795 171189
8994 -254308 189046 185229 58742 -48068 210111 -93027 119816 126224 304370 -63214 16344
8982 -216360 4966 -15317 -55416 -348725 -7549 261790 130560 190718 22511 -253115 119141
8970 -92275 50760 16679 -185099 7811 -332697 -103448 -300659 -32540 83390 -24675 -131298
8959 -131298 -199100 -162430 -86905 29769 85280 -162099 341859 62492 -118341 28399 -30016
8947 271124 -198055 -287523 -351812 322947 -18305 -115125 -152065 -125598 -203763 -184234 61814
8935 235867 -222840 357995 -16933 -33566 1035 35434 -171739 9269 151660 231080 -81641
8923 660562 1085353 4536315 5184347 3601596 1053492 580212 305097 -219738 -76724
8913 107260 -141414 392374 -35664 109878 8528 253191 252048 -397567 -92046 -111371 -459196
8902 -459196 43054 -143016 211695 -249767 -9120 -384330 -105305 -18565 -227920 -225504 -52731
8890 -1503 64842 -197837 -144259 -325187 45952 159680 -28896 9923 -54716 -193807 -36544
8878 54266 -139680 -373818 -67135 -248122 -372325 38408 -646 198347 -97927 -729 61584 30544
8865 18321 -196185 -130025 32735 -194893 -56817 -352577 -188953 -91558 2302 -50954 -67251
8854 -67251 107874 34429 55426 -82082 -15500 -247687 24561 184733 79347 -242426 5036
8842 -212376 12470 -144818 95695 131038 -49344 140622 145958 -31189 -57679 -171953 91850
8830 81163 -109213 -276548 19476 254556 223358 -291452 51204 179404 -120430 84318 -43819
8818 13297 -239774 103103 -82980 -91411 185940 -346559 -258548 -372950 -6303 -7963 -160139
8807 -160139 22886 -58133 -49659 -153847 102572 -141874 -8430 129220 -222970 -156845 -79717
8796 -79717 65376 -36071 -175277 9551 141495 -105274 -135670 44105 7015 472737 118208
8784 -54640 -319583 -7741 19838 140198 219302 -134632 -282220 -245251 -37749 -237694 274912
8772 -6748 241182 -236188 -709 78165 260141 -114203 278304 52930 -195990 -269459 80488
8760 -284372 -48791 -113709 -163043 -289887 -231568 45251 -98215 -220292 -201430 191575 -91658
8748 38045 79099 -60823 124627 101820 -161871 127737 -18399 -8283 69950 -23421 -177806
8737 -177806 5457 -138564 -74584 -163230 107137 -88677 -70460 17264 -176080 225508 -91806
8725 -208362 -88478 278723 92400 8872 -88114 -70653 -140649 51827 20116 -410657 -59177
8713 -20440 35635 128261 -240787 329887 -102831 107582 -74249 85440 70127 -260584 -234160
8702 -234160 -256295 -10324 27683 73109 -58289 -37679 -334972 138215 -252646 266358 -74673
8690 -236642 223384 40050 45118 -19557 91668 -76543 -181 -168620 -198833 78813 -309969 51963
8677 29754 38587 220111 -359357 -134513 -224987 -122646 244151 -74981 -90421 349377 -178218
8665 -35092 -105190 63290 25051 -201488 124509 135412 -164929 -60174 -68365 -343534 -83021
8653 -125328 174582 324915 333203 -64912 -191346 109836 -96997 37623 -28142 -133028 -174629
8642 -174629 -204640 -256704 -94125 -197540 -128421 -238208 -553968 43597 92344 164662 279523
8631 279523 33371 84854 -224831 -116079 -31019 -221698 -34188 20478 -113952 -90298 113623
8619 -234459 164131 -327166 97147 -68591 -210959 26849 99897 -301381 38790 284455 157721
8608 157721 -36053 -243026 -66358 199722 36249 104947 -107573 -224029 53355 -39742 -212123
8597 -212123 258265 177612 181811 -140334 -231302 -152115 -131919 -28444 -36383 54713 -159519
8585 -45203 -272348 -165821 89194 -18586 102435 -76935 336956 70025 -191009 186594 -16260
8573 -142304 -100913 37034 -52049 63712 -19347 -102954 -251474 324919 222813 -303248 -251446
8562 -251446 -70684 -334442 255838 -13371 -429121 34646 -194547 -199268 5521 188151 -186743
8550 185584 161706 -256514 212852 170055 -300377 -114751 -338252 52520 -26895 154490
8539 -194082 -208199 23961 -264761 -72166 -13989 172586 -78078 104742 65859 -231347 -504
8527 -101568 219558 245578 62967 -65069 -158796 -127376 120002 -68355 -4594 -138007 -230760
8516 -230760 101653 -32435 -14334 -228360 33604 -33931 165584 -153896 -399339 -108659
8505 28448 -41411 -245052 59567 74802 -164517 -33670 7435 98658 -225175 -186480 49827
8493 206262 2610 -202883 67753 -229818 -152662 85614 16741 -27332 11148 -219209 -126398
8482 -126398 110805 165723 -85766 -84648 33709 40869 -126900 -336580 -50463 97088 -54901
8470 -193799 238932 55035 98156 -346257 -110549 29567 183618 -140032 -47389 -143841 176192
8458 -104380 191236 114981 -6411 -300492 -86181 -56480 170463 -67115 109319 213737 -28858
8446 -134094 -118388 -92259 -217814 -130685 -166474 234378 -97440 -227496 -342670 -98664 17093
8434 -188669 313500 67743 -3780 -198473 -393909 -28543 75197 -389956 -5115 -327676 33533
8422 97709 -111908 19993 -286292 -21427 134628 124946 3528 -81432 -265310 270332 -40960
8410 -75545 -204363 141061 125410 -30773 -66024 175706 -73743 -269360 183692 155876 18844
8398 -144980 -26120 123148 -104466 64334 -212647 22314 104593 -187355 -380221 -1809 1332
8386 133316 -62273 16687 45093 -124388 201289 -22482 75559 -131736 -149389 -113615 -364265
8375 -364265 280150 26077 -38338 -125026 -99023 -117225 -159803 90526 -238704 -11462 -153517
8364 -153517 -367434 -119429 -169487 -157006 211134 -161391 139744 -140783 -66529 -230084
8354 -230084 -93138 -182071 -225947 -136566 -420803 85599 49204 -16428 -259624 -313926 16966
8342 -179510 -8032 261281 60915 -36569 -134562 36045 -68660 -203553 -35536 69264 158415
8331 158415 -111668 -188286 21056 -47879 91130 -196160 -160916 -70811 -85923 -213651 46834
8319 60058 90639 -99137 24859 316917 19875 18837 -116675 -245063 94310 -193589 -174688
8308 -174688 -295848 -21785 -97874 -101436 9503 94720 113403 -261462 -87717 -56441 59050 -331159
8295 -395975 -169937 -111274 -49843 -285872 -39519 77742 -102675 15918 -8603 -13137 -165595
8284 -165595 -272711 -84487 -79832 156255 115277 29043 -139146 -16155 -125674 -54577 -393492
8273 -393492 -148756 -355147 -49407 116232 -112642 264383 -133191 -137846 -231060 126127
8262 -87968 -69655 -377383 -27984 220 195402 -481020 27595 -25286 60223 -94080 21803 18939
8250 18939 45516 142442 46339 -331379 -197073 -36546 -4132 -8062 6896 -20124 -229092 43345
8237 160599 -113333 -254450 118542 -151236 7050 -234991 48530 266198 -262722 -131239
8226 -282892 -68332 -174477 -366623 103219 -205608 -295526 9688 40601 -167191 -56118 105299
8214 -86855 -45823 -47410 -341174 -117697 273379 93638 -4116 262877 -208534 -229323 -132670
8203 -132670 80227 98081 -234318 35577 16173 -43317 6824 4636 -97166 -10215 197845 -25529
8190 -111861 -19812 -119560 54958 -275819 -217177 -193141 -151854 -5312 112859 92986 149436
8179 149436 50146 214173 149380 -203921 151671 119033 -85955 -40337 129562 -220208 83098
8167 -141925 165193 202881 -200200 -167040 -55585 82562 -173475 98589 51514 70879 -8901
8155 63883 137105 -27646 171216 -91313 150788 58592 -203771 -153321 37690 16294 -52511
8143 -226925 -190762 -91810 61863 -105446 -118969 -48743 19843 121762 358092 -53305 -25840
8131 -74199 343696 92377 -281297 -106699 72062 150062 -308424 -265738 63420 -178533 276173
8119 -283623 -45525 150748 -286498 -31269 -106395 -203947 101069 -57916 103815 126333 -136860
8107 103493 124174 -59797 -42420 -90332 -243598 -313972 -253878 143499 -122716 -363305 96335
8095 258428 -362718 -84669 -197685 -119552 -297961 283595 -129549 208431 -426823 -143131
8084 171175 -33911 -8508 -95965 -19751 -177110 -94887 289479 -117196 92746 -134744 -195220
8073 -195220 -179730 9536 -40266 -66584 -193818 -149107 49764 64612 -71802 -320462 828 288172
8061 288172 35342 168976 433709 -154238 -78793 -85125 -187343 -222622 49428 249709 181500
8050 181500 -113575 -186388 -59896 248782 36076 -346476 -257386 -14240 -188976 -89308 96592
8038 -2872 -16657 -281449 -44447 -73053 -345310 67005 99144 332607 78932 -202024 -49630
8026 -133815 236786 -312514 -29151 -181980 -42904 -147853 46997 17644 58849 -42222 -162137
8015 -162137 -377773 282271 -233413 74488 -259948 205647 32484 -22635 420140 569570
8005 569570 -243434 -384485 -97560 -269827 -325111 -161690 -195681 68526 -255346 102712
7994 132386 -71967 195338 108478 -15848 134853 -36362 -73284 59347 304708 -104317 -186079
7983 -186079 -98087 -8326 -113913 44712 43589 -236812 59181 181512 -269102 -7549 -248381
7972 -248381 284703 255927 41858 -60623 -247846 -288485 -135657 -3080 -20723 -48429 -214877
7961 -214877 -190117 80800 107986 -22195 -30348 -75043 49429 362039 -133905 -103740 17874
7949 69353 160874 -175931 87395 -236154 -40449 43939 -176178 197475 -82698 -10392 42808
7937 -226357 35127 162546 -187266 -58993 -332202 -63978 339892 -109807 54496 -413798
7926 -144517 22184 -64653 -48821 14688 -29931 -295425 3040 -70468 -415669 26374 -208930
7914 54699 216723 5861 -71213 -117281 -14658 -53109 132417 -62714 -305575 -86717 256706
7902 -86110 -323428 -73416 -106452 -205462 -22832 -336177 3975 110910 3147 -191798 -176177
7891 -176177 -146887 -150302 39763 212327 285025 -354631 -314515 52349 -123131 -237162 138028
7879 57578 21790 -409067 -67367 -88508 -272380 -152695 193536 -202512 362180 -343730
7868 20984 -7472 -227081 -187740 263583 -162841 -246830 -54860 2519 35543 -325379 128059
7856 133275 106575 -118489 -37743 -6698 -200288 -21920 -138609 200033 -83737 31264 -42459
7844 242421 248830 -48693 -202419 -131596 -564 129477 -142297 -183213 -39573 -29195 -183093
7833 -183093 -287518 -326045 -85790 -81983 -71369 -103449 -75258 46179 -346351 -115555 -125943
7822 -125943 -312883 99757 -198815 62348 -429812 41446 247484 -35430 -49476 28509 187791
7811 187791 312153 35650 106022 15762 -59630 199017 27566 -983 283284 120728 72371
7800 72371 88226 -56869 382944 292411 -285587 255334 24404 239747 272587 -373975 105282
7788 183717 -222520 99952 -245339 35290 41282 -309212 18884 -220548 -233410 -182130 143931
7776 -245434 4073 -263984 -117315 -371262 -53308 298495 -67592 -297817 64976 -213445 1854
7764 -284247 80561 29620 189592 -57923 -38469 205286 76596 104473 128330 -192415 186782
7752 -275050 272910 -293354 108901 136063 -12525 -175341 -108774 312148 -107322 -84691
7742 -84691 205094 -93415 -224100 40917 148122 41763 -390145 177776 -401373 -64516 50829
7730 22059 -411759 -371602 98500 20154 -13400 -38972 -13512 -170857 -109815 139277 170693
7719 170693 211263 -105094 82539 -70709 -63327 84008 194916 131954 54355 190025 -333094
7707 -434346 103792 111133 -124030 402824 56999 74605 -112101 79314 214186 36719 -36873
7695 -171054 -379450 -33799 -437685 71723 -174621 -134059 -8290 194650 -254176 187783 -398841
7683 31930 -139438 -123613 36420 272058 28112 -159107 157351 -6283 88389 300735 29629
7671 -102716 -36356 53999 184849 14611 -100863 -41703 -450063 -57182 181761 293604 265239
7660 265239 -101995 254565 -33341 67311 -4281 -29358 -240017 -94444 -192443 -12412 171711
7648 49437 -249548 -70168 172576 -346413 -149001 -13219 -140468 93105 -175575 -68547 -200831
7637 -200831 -550629 87371 -218676 -49914 -99277 -209197 401941 118534 103769 148822 -174277
7625 -185031 124872 29037 -249955 125754 -17474 77043 -181884 54781 -147697 84274 170766
7614 170766 254429 -104757 32501 182895 -240699 17500 11141 181596 -4805 -177228 -219352
7603 -219352 -136850 101852 -59770 126256 -408565 92029 51435 -133044 94243 -318696 -60395
7591 113873 -418084 217683 -93918 292204 120153 120486 256623 -63356 -34098 -141980 6366
7579 -16022 22106 -248420 -59942 -167999 -171290 -203716 12136 31142 203880 -241600 -418773
7568 -418773 -12947 228269 -86898 23146 -10617 -76625 -145116 130858 169859 -203360 -247444
7557 -247444 -404086 -62305 37391 -69174 -233128 -161082 -90928 -316000 145039 69197 -471745
7545 59150 -31158 53449 -179363 -87095 200583 143638 -169003 -382412 164668 66408 220768
7534 220768 389507 -327768 -99131 -352317 54989 -157828 -152787 339765 -299781 175002
7523 -9247 -186597 -354306 -148389 132347 -164003 147227 -115500 -287612 -55174 -102612
7513 -102612 -6207 91824 336571 104910 -42241 -321438 -194146 257882 56012 91364 -263391
7501 67539 255078 56871 -46069 107759 124801 -17272 -171564 -78529 113706 -54381 -323331
7490 -323331 -277024 -245132 37764 57193 -86389 -110819 -171875 -140260 -102438 310877 169681
7479 169681 138215 -218168 -13700 -121839 -168711 -11617 95806 -98375 11967 -95646 -152488
7468 -152488 284368 -58197 -196191 -64642 190999 75329 -7899 346604 41909 232838 -96679
7456 264735 189839 101647 86989 108718 -227337 -110991 317233 -20764 -53676 38598 28661
7445 28661 147290 -351817 80172 -23558 -68242 7680 -348457 146835 198364 14242 143461
7434 143461 -143488 -143307 115764 -138720 -204629 -194876 -72295 -86179 -222714 239069 -180491
7422 -88325 50864 -386289 132536 -241852 87056 249028 -64144 -148700 -210078 -22308 -289162
7411 -289162 187698 -93495 13786 25074 65411 257758 43848 -195677 85274 -154141 -108070
7400 -108070 239561 -429431 312111 -152734 116521 -116545 -82835 -56258 -9932 -157617
7390 -157617 -48561 31261 -359526 49875 -27945 -66999 193603 64603 105219 -92793 202193
7378 -321797 77163 99920 -20581 134262 78231 24876 44173 -442471 -79019 -191495 253886
7366 -98073 -295676 339 242229 12399 -154315 -35007 -9099 -121769 -258177 -74473 -152330
7355 -152330 196038 186231 -32339 -72021 -264145 135164 -19184 -108630 -275180 158 -318190
7343 -168021 71822 -77165 -368384 125450 -112099 -86799 -218984 -140287 247507 -277855
7332 -339897 14469 -100631 112716 60081 -20455 71525 -15057 8003 -391573 -128642 -113346
7321 -113346 -24428 -168851 -280208 -142401 261048 -102387 65711 48757 -224398 -235463
7311 -235463 100111 75544 -84697 113925 -100703 -377902 70724 -37026 140439 181010 -224380
7299 216279 -273419 -210192 210437 -197273 -189580 178187 131938 -24992 -184020 189033 202620
7288 202620 -148186 10319 -155801 -10061 145111 307222 -136070 39371 232610 161692
7278 161692 -184593 -71124 130038 -58168 -149629 -411160 45176 -155500 -367734 138167
7267 -33321 -27688 75313 121387 161729 -210228 -118262 -17868 20048 -387829 -223251 -177546
7256 -177546 -128821 -124352 31995 -154197 -140156 -257718 -152237 -280890 -184752 36995 -199480
7244 30894 -1482 -133126 -99843 -45449 -321590 46973 -281443 -295553 -61814 12125 -64569
7232 -29561 -47654 27744 204094 -83075 -76597 57469 -282733 -208557 -148186 -178272 -82451 239720
7219 241846 -199115 -48744 -78623 -256804 -250471 373950 273758 -142243 -142452 50111 -180596
7207 -33133 -212720 -63157 202570 -67188 -238061 295882 -244157 267942 6394 -15782 -252513
7196 -252513 -53827 -38454 12205 204706 362802 -96035 -87364 -45287 -164364 214426 -51031
7184 26371 -45637 -345400 -185357 127462 -96467 -37637 60368 275058 -206958 132856 408688
7173 408688 -38571 -2642 73131 -183362 -71774 -335191 -165606 4453 -88196 -332634 -82119
7161 41551 131192 37212 -53664 -130730 -12362 220867 -159571 32958 333579 418401 -157664
7149 195459 -209449 -263809 55027 83335 -313614 -273274 179754 -202991 248654 128522
7139 128522 -147791 27304 65870 -120898 33786 224171 120617 -114103 92155 145173 -304161
7127 -57671 -146045 -208820 169047 -190058 -52837 -313709 92929 55760 -67815 31032 -246953
7115 12816 -5212 -79431 81202 154915 228085 -63813 92953 -20529 49110 168556 -234185 -181366
7103 -181366 -166815 -110781 71773 85756 -12676 -154564 292542 40278 -79281 117695 150227
7092 150227 22591 -222277 -188442 104173 62381 -55897 -75448 123402 49975 137171 189723
7081 189723 -75529 239551 -283633 44857 42807 -114467 -624370 -80359 12298 -43998 294759
7069 -89817 -153364 128734 -83049 104025 -263350 28703 -89357 -282126 68840 -24229 156921
7057 -213035 170719 71463 92165 -4322 -186137 -144275 -178563 101590 -264456 -131139 -13680
7045 -76404 -297925 -193996 103145 62602 293371 201229 63838 61159 -320992 -253578 45676
7033 134897 -365825 78252 447967 -196783 -139880 85861 98006 -312882 -160957 269200
7022 -132054 216236 -145847 -19559 109245 -125522 321028 106439 -89908 -87143 -245787
7012 -245787 86639 -205149 -165130 -2443 -271902 35622 161869 248891 -192856 -165228 113151
7000 -518782 -375277 92611 -2285 152674 -275711 -690 30307 -111543 -5202 274792 130325
6988 -167476 -174868 -151206 -35565 285576 -84168 163640 288028 -189767 -214772 -354125 149015
6976 141462 -94333 93600 -8949 27380 -108756 -305456 -150241 1106 80123 219067 133695
6965 133695 -256711 -63167 53969 57415 81172 66207 -157505 -187752 -229840 -66834 -12113
6953 -214935 -141065 36743 -250031 -147613 136249 136792 -122198 -133818 -137519 104221 -105425
6941 344261 36326 -276554 120504 -195701 -332830 -160071 -88143 -111563 140367 -190317
6930 -34284 73993 124006 -126168 -113917 83431 132775 24947 -15260 -14032 8881 -10911 -294419
6918 -294419 -37883 -291472 27266 346259 -187059 -433654 -126731 88866 -187947 75749
6907 -84281 230210 155655 -172098 65193 93086 -38000 -338796 27569 -1595 125332 -214708
6895 -190085 350336 22883 -63086 -153045 33588 187021 -42795 -152636 -53352 -11126 -54510
6884 -54510 -145895 71007 -176827 110938 141970 206980 -266171 74873 -481936 -391339 91722
6872 -38553 249028 -37673 -149856 420909 -34632 -20310 39432 -245746 -320867 21088 -170819
6860 -96289 13037 -24671 -102200 -57555 52591 53374 57145 92126 -42861 -193248 11444 292871
6848 292871 -6029 18313 -296147 -101232 -48636 -30907 -57035 234964 -132181 290599 -113956
6836 63385 -75363 78758 -82115 315166 -293258 122719 -213083 -28175 -191433 97450 -24218
6824 115107 37422 -167364 20254 130474 -87783 233928 179659 37475 -174752 114851 -264689
6812 -114871 -6207 -296398 -68023 -335271 -8704 -40780 147163 -234342 -74108 -41527 -43996
6801 -43996 -168374 423854 45402 -60934 -45 100745 -226264 120248 198348 -141594 -174066
6790 -174066 -5177 -59057 155649 223662 -70098 31214 4445 87063 -407556 -107842 5125 -150387
6777 -49224 -25484 -122987 -54276 121770 -375126 82435 102968 -4625 -244932 -84742 -6197 -212994
6765 -212994 -525742 189883 64857 96079 -378136 -133824 214366 48598 -443593 136181
6754 -260492 -50056 -218017 312308 162221 136077 -215318 -321717 -44722 101357 185017
6744 185017 31859 120981 -40710 66956 -117846 41456 -147992 -73500 92777 68072 -264967
6732 -8196 -214308 -106456 -127381 -151572 -41124 -195387 147967 -100906 -333944 -84719 212744
6720 -127010 -59619 198899 104500 5299 133031 -311866 109732 -33677 -385904 -429870 113881
6708 103211 -19026 -118910 -162196 -299671 -22060 370676 -20885 99211 70982 -154305 24696
6696 211257 119409 38316 208888 -26650 -275694 -111708 -1270 213354 144636 132432 357425
6685 357425 37384 -26914 -533988 -13979 404124 27482 59837 -155756 -36579 -62569 -271510
6674 -271510 226726 -184200 200213 -65479 29249 147128 88762 -288943 -95891 159244
6663 -34443 -117834 -269735 164539 -22281 -85199 -279743 147169 132489 -126362 -128473 55560
6651 63189 -85262 -44401 -185598 203862 190985 274590 -127778 -108805 216882 -112977 -28636
6639 89048 -223449 22150 -254594 -72161 -99696 -163338 -67986 148860 -127186 -40952 138015
6627 -251810 -167181 184282 -126436 -3687 165223 -285259 -281273 -162769 -269983 -46493 -238941
6616 -238941 -27136 -243909 234534 -379372 59374 -29156 -193477 -30704 -150101 -223894 -306205
6605 -306205 -83266 186804 -44228 32762 26685 -84316 7300 117864 221260 303163 71473
6593 -73104 -373272 249528 438991 417089 450664 237889 358514 -856 56252 -264939 -518189
6582 -518189 -93115 -78330 -212041 66406 124617 -97921 -105597 38456 -110951 54367 200408
6571 200408 -119552 -115940 -231771 77456 -209243 -260732 -292448 -94408 -157094 67531 -249550
6559 20944 -23807 182977 -143717 -199167 -119898 47034 -73532 167066 -73691 72942 113624
6548 113624 77480 349122 -62723 -312449 36403 -69736 -10796 -259183 -197267 -462948 -114587
6536 -192287 112250 -303099 -66144 52963 -176340 40148 -298791 -2008 189286 -204364 -66553
6524 291819 -301310 194266 -127800 232990 -170572 -312515 -82498 307463 110308 -54928
6513 -309288 97112 459651 173740 32934 -271919 -195454 10000 31798 40346 41285 87682 61879
6501 61879 -26673 96218 14757 -64917 27746 -79949 60287 183170 89166 70902 -5063 262309
6488 -34212 -235857 197678 140440 -114582 243818 -88735 202937 -7245 55352 75661 -52351
6476 -182498 158293 156874 -73292 -157647 -140185 -111593 200176 360888 -253146 130955 -142700
6464 -147928 358392 -129839 160193 -189005 -222818 -83404 81766 -228221 216012 -43429
6453 -158977 -268334 -166781 -42586 58346 88748 205971 94258 97957 -315510 -126177 33732
6441 -287368 191319 73365 -214073 64384 -281918 -100476 -207651 130466 -261080 7627
6430 -130002 -196690 15036 234958 -57693 170970 -224212 145689 -56751 84675 232495 -129093
6418 -234285 144838 -59839 -149393 -39264 -192620 -73121 -43750 186296 -7711 62496 -127324
6406 148834 -74735 -338840 163537 27980 -144592 -212036 175493 54826 85270 -9417 70182
6394 -461803 1966 -73492 97081 -139682 260198 -63361 -25875 36365 394552 -302928 168212
6382 -38910 208531 101165 -379121 -216004 -174914 -239634 223741 -193451 85201 -170955
6371 82387 -45463 275729 -20729 -356964 103201 -86727 65342 112534 2045 120611 125682
6360 125682 -220815 74212 -78946 154516 -143336 16679 -156040 78174 316822 114091
6349 -139511 -157672 -104814 -18992 -36413 -192181 -297198 -163630 -125944 -72797 -80913 27256
6337 -126543 32738 62099 71622 259632 283394 154583 -292874 56510 -116264 68048 202628
6326 202628 34082 -148721 -197604 280078 -209702 -180672 -140449 240670 -17042 -286036 -260534
6315 -260534 30602 178272 298056 72775 141979 -20753 -320277 -192176 -170291 392108 -298025
6303 115330 75626 -221908 -86906 -70099 343378 157124 -148547 -204864 -47295 103086 -46784
6291 355306 -25388 418407 -312752 98228 229845 -110006 -74078 180081 -33682 -191419
6281 -191419 104295 173140 215601 275391 -49000 -42249 69346 111036 3021 -195339 177839
6269 -609369 -8874 207289 313956 -66099 -50425 -114045 278941 -5390 113595 -141376 103776
6257 -311303 -47104 -285076 22611 -19024 22258 -174259 192459 111592 144772 37989 -37489
6245 129978 -60040 -171098 -310815 247460 307725 -73179 10989 143353 361735 -98892 367526
6233 -374013 85362 4075 -128852 -51258 15827 -278495 30906 -296851 173134 -14027 268059
6221 -57934 116800 17122 25388 -38232 -346873 133198 -132613 -95568 123746 64955 -46788
6209 149188 284625 189923 145781 -189952 232456 24604 54770 -70728 -97679 -168741 -123645
6198 -123645 89574 120786 -55249 -227083 917 -116226 -146873 4744 -11030 77010 -173916 413359
6185 -241216 321280 -27677 14139 77329 -211230 -53318 -19155 110082 -19003 88447 168672
6174 168672 -80461 -54614 -238862 -64979 130795 88041 12136 81807 -139716 -267698 -68390
6162 16981 -291914 -35823 -92382 -48880 61843 -101165 279298 110373 56143 -13354 6294
6150 -41689 3644 139514 -61455 27777 174151 191149 -139131 -183442 263338 -48686 30206
6138 -209880 -306639 -110817 141202 39173 105555 8141 63807 79191 -86554 -216363 -105 249108
6125 -165298 -370646 188748 377375 55961 212671 -63514 47292 -231745 33949 -81969 -86872
6114 -86872 -247235 -156964 105634 -147522 74118 -1182 26466 -374932 -154164 -88479 -87099
6103 -87099 -383298 134778 -38142 -147480 -220353 -134469 406359 -54304 -149343 -63150 -2027
6091 -94882 174069 -90671 -27098 65111 -107048 -174598 261280 -115996 18316 261436 36789
6079 -31212 -129443 -24225 127696 -54728 157943 -218618 -32247 -647 -120848 280258 -192047
6067 -153075 -173141 100065 14152 42391 211990 -62185 275219 3940 45194 110297 -100607
6055 136501 274736 -141374 -182572 -388572 -24631 -131866 333488 -23981 -66243 135027
6044 171710 95151 -106250 -286945 214391 -14435 -3481 116961 155799 48256 -131178 214763
6032 220369 -267676 21754 184007 -240347 96011 91482 -97992 -21023 254927 -61388 286862
6020 83913 -41228 -22949 -116394 -340191 9583 -55163 121970 50366 -134265 -184262 -74111
6008 -206558 -233209 217905 -70338 -137418 -63764 -126276 50548 -295749 -58332 -391366 118554
5996 -235559 67669 97797 39023 57092 -47544 -81052 168826 50936 -263743 170691 255710
5985 255710 -296931 33228 83663 -22093 5290 -186265 8465 -107194 -333750 -162870 33070
5973 15557 139485 131970 102307 65607 -50698 -119812 -80035 -215155 -92551 -152612 -136580 149812
5960 -185086 85977 -52803 -176986 57416 -111710 98992 185956 -34249 46882 -454841 -120658
5948 13528 -78500 94320 -147115 -388038 162507 -252433 107418 129844 69057 147600 242533
5937 242533 56034 277973 197184 -120326 106411 -213081 13443 -23629 -313570 -58331 143579
5925 -46684 43969 -128918 38507 80859 -58961 -93572 -72825 -34493 13592 -126552 136539
5913 -251027 -90904 -90418 -313920 20566 226471 -153561 286402 -268714 62892 -218779 14039
5901 39292 48489 84400 60052 9790 32101 178055 -275340 -174524 -129236 -16050 -235029
5890 -235029 102348 -31819 -131247 -19403 -123 -228667 171572 234492 25691 -200387 -16657
5878 103339 -57597 -215236 -162958 4745 19597 -30117 289122 -210480 -183459 -121256 -165735
5867 -165735 245938 -167813 123376 301113 -210463 61419 155550 -460820 -149056 -11342
5856 47291 75409 125901 135554 92937 171546 114325 -722 -115763 95483 -43458 202547 -125890
5843 -73130 -124575 -246584 -336142 127116 25436 289847 -291041 28289 -78019 74023 -115985
5831 2596 -24391 -287220 -109276 173504 116473 54019 -260911 -528048 -54101 -36082 47217
5819 167499 -471087 66416 121938 9097 150415 -100418 206561 -170067 172859 318258
5809 318258 -140866 18178 193482 137573 -19014 -273800 339305 -148832 -133269 49470 229608
5798 229608 337271 149772 141423 101985 -34551 317991 -66608 56395 31016 -203074 32403
5786 -45728 23822 -35858 -100018 -496032 -17307 108266 -16617 -147916 -82654 -49854 -100194
5775 -100194 -61396 105327 131086 220752 109364 197301 -44815 147907 44318 -205293 172390
5763 21397 226328 -18454 148328 -384272 -111412 102981 -185328 182633 -50122 297 -226817
5751 -67097 -21116 -146363 -6777 -178523 222247 -102337 241891 179746 181231 -213131 -189765
5740 -189765 227067 -156916 -217003 -190563 82427 81275 -36117 -192296 -62761 -242314 89630
5728 76408 181153 44051 -29803 -33228 207597 19500 90544 -49069 -160783 -157216 66082 96922
5716 96922 -140444 -100147 -35294 217255 288938 -224835 -235425 25002 205408 116358 -188770
5704 117298 -213452 -142923 41650 219549 -122856 -111916 507581 -55096 -241052 59658 -366743
5692 50024 275178 -160397 -99590 -77747 95658 59912 -77752 -160728 -158096 -208523 157579
5680 -33814 66436 -196629 180222 -220885 -126747 -143078 -68385 245381 -402417 -374355 -98842
5668 107274 128788 98700 37371 169742 73653 -215093 62469 -228572 183310 -107424 -80492
5657 -80492 84804 63452 -73043 155652 154048 46621 -87612 199652 287471 -23747 146017
5645 -121162 226797 80983 -61194 6030 144924 -168196 -144917 3286 50035 -99065 -59528
5634 -59528 -270524 197977 -88713 -44187 -26093 -5043 -30123 -98082 119695 -270666 -95147
5622 53194 -52694 -43040 -146676 220880 -50189 96426 -272018 98830 -163984 -6849 82670
5610 299610 -120600 187136 -145758 85346 -29736 183222 252 21448 318148 -16267 -273525
5599 -273525 185993 -183798 132959 -131110 -195931 -57474 24545 -84228 -15023 229296 348203
5588 348203 342310 -166326 -123781 225122 -89918 -160688 -72529 122360 -127093 -279452 47901
5576 -103332 -312371 201232 -211940 212954 252760 -40259 -290122 48602 -124043 24607
5565 126502 -36764 115607 -79661 130593 326499 160385 57601 331278 -25829 202487
5554 -381599 191196 -69701 -125904 -87805 216765 -211581 -171257 -308181 100488 66287 -56322
5542 -6511 -108330 164529 -92940 -17641 -180278 115604 -116927 182800 -32462 -60661 -181483
5531 -181483 85810 225444 -213520 62669 15084 368377 155057 -35956 -40272 101749 -182642
5519 252733 174462 41279 -73202 -118236 -81373 -172201 68911 -135378 43386 -212423 -8353
5507 168207 232407 -66966 -72636 -62530 30704 146570 -126728 -37852 -195929 -10330 -7149
5496 -7149 -115874 8271 53997 353362 139658 20510 364574 241439 -44436 247411 -52982
5484 -345006 -2819 -198204 -306006 -29903 -4352 131528 -133357 -291442 -59460 11531 -131322
5472 -141779 -180891 -471 -47757 138173 -38885 282618 82383 394383 -24295 126513 -108305
5460 -95458 -25140 -95136 -11441 58926 -72163 207858 136355 126345 176831 -22786 5686 100130
5448 100130 166451 -173416 13895 -129383 201316 -47586 -23826 -30491 -204122 67398 116801
5437 116801 -170858 272332 185130 293599 -280580 159810 -43237 69938 -222334 160943
5426 332208 -56435 61050 120959 42535 -205758 168830 23450 -22754 -264200 -235268 34561
5414 -144844 -3640 -258539 406147 266262 -339312 -88928 36342 193042 59574 107279 -398960
5402 -179987 -115942 303272 275404 33284 -74569 23586 94561 -185310 -288087 30588 118110
5391 118110 52112 156657 -75647 211893 -185560 -28879 -25766 -142815 -308242 70797 -320175
5379 -30822 -422164 95405 228574 7486 -69210 -52197 339259 -286514 -51095 -31056 -315447
5368 -315447 310278 208783 -113121 9981 263291 -214349 -94922 -310295 -199148 70332
5357 55793 -118329 76034 -192696 215380 57563 -324872 40981 189223 918 -491977 -100868
5345 -234191 -61626 -160028 -191411 -112089 -226122 49912 -301828 -15318 89244 222211 92795
5333 257060 -73674 234526 235155 244641 76327 202436 -348118 -510546 -135609 31142 19870
5322 19870 -32449 -183913 303595 -217000 -92453 40447 89881 -192338 -407666 -167558 -311473
5311 -311473 64187 255032 -24310 -7946 -7025 229868 -74777 -83853 -239009 62370 -14438 -102545
5299 -102545 164489 94996 128568 -37545 314422 99926 -93184 167583 -193516 -181410 -13275
5287 170978 -80043 -62456 192539 -311 -9826 -38270 -70939 -88907 -32680 35504 -126526 -113130
5275 -113130 -176777 133909 -358572 120464 205644 -44157 359426 318629 190118 76337 -54158
5263 29593 11783 49171 47313 204344 40667 20782 -171137 -109833 86568 -78718 193670
5251 224344 434920 -127695 95378 -408386 279218 89876 -77943 88499 85819 -45721 13838
5239 124062 -106551 -184662 19652 39734 260029 185328 134215 -142980 -59992 15516 286514
5228 286514 -54514 140532 199712 -174641 124581 406904 -327751 -66203 52503 230458
5218 230458 -87730 14352 231669 -250238 20237 226957 -50050 343295 98027 15875 32826
5207 32826 69976 -19117 159893 -24254 -20195 62461 -162903 -151978 -7505 112896 -56738 113598
5194 -146458 214871 288695 12734 224718 7566 -19628 -20049 143309 169359 -14629 102769
5182 -137403 12820 119622 34697 -81270 -64599 283150 183656 -94196 25950 8829 -112084
5170 -50269 162780 67040 148029 96780 -76256 -251327 -3462 11486 -39831 -253606 265152
5158 349863 -48317 4932 224040 -210656 -123608 -7763 31206 216416 -207176 60954 -66122
5146 181737 -67121 16378 -164714 42911 324210 305 -121849 -135635 -53906 -236515 181985
5134 -400906 6425 115002 155920 32920 -76423 3068 -108542 -22983 -128992 350121 -16582
5122 -185161 1715 -48430 -37318 -306423 -274321 2970 106669 341880 -236571 -167664 -154918
5111 -154918 -116760 -205123 -136795 -116385 -218887 59126 42066 2123 -199047 -13019 -30890
5100 -30890 44243 -312168 -123166 -156032 -117607 43122 39767 -91697 -42744 -461885 391076
5088 81489 439772 19407 -67492 221958 -188747 87872 37472 177041 -114896 300548 75841
5076 -29385 -136036 127944 18639 108844 -216603 218300 240002 -84978 -306944 112492 1012
5064 132970 -406621 126176 159119 42295 145066 -180513 79031 -31732 -32546 -1270 -310079
5053 -310079 -30141 -341660 47805 94139 90157 236297 11014 -3572 -315213 -164311 247212
5041 -67657 -81089 60839 -135109 -25339 364060 170216 -157488 -78387 -46737 35976 -239883
5029 9678 -9199 148084 -4200 60480 -160567 -127377 -75407 223154 -33599 109397 -41548 66809
5016 14463 -156899 275414 135882 -49672 -164475 -34937 -47552 83697 -117372 147754 -90325
5004 -33474 -139361 313115 28882 84823 20330 -113101 150141 -148527 -128374 -376371 -133890
4992 -29740 30006 -104315 -23406 -29390 207637 338083 119175 160674 -86720 -72528 -193865
4981 -193865 219854 -108974 -96811 -406660 464806 -81770 136438 -56293 -198269 65121
4970 12089 74929 194784 83726 245362 208032 -213816 -157366 -312729 317665 296374 9483
4958 -108599 184342 -235984 -135970 -3453 -227614 -113916 230560 187677 -339201 -114877
4947 58428 -125786 82085 25595 -316121 63949 -268766 117164 -110485 -48480 -23616 -7599
4935 54213 -227469 -223268 341213 44068 -192731 -215538 5692 -31651 -281354 -122503 188050
4923 133003 25238 238877 -73532 23570 -23155 17684 -237313 -280728 226937 -310227 243840
4911 -108225 -209021 -301905 -272396 81161 -430816 144255 -414509 339272 -225785 139652
4900 224737 -38874 -43544 33988 69843 -277633 165253 268320 -127113 -9974 260382 -6335
4888 166351 -100603 115914 -39093 50724 58086 170997 -46328 -77439 79217 177241 -114990
4876 103426 10951 -63035 179106 45825 190722 -287453 -66663 415967 10469 5877 -445
4864 -50218 239366 -193369 -96 198270 8720 -337054 76522 324836 222403 140938 235287
4853 235287 -140291 315514 279456 325873 -211847 -3983 222297 -150068 263740 224002 -359044
4841 191629 -278084 -217119 -82927 -30360 294437 -372051 -203465 -41515 -71717 10093 -211562
4829 23280 2353 -188712 292500 51954 27736 223561 89198 -182593 58283 12692 -54948
4817 -166437 -80655 -7844 164131 231439 -225532 358479 14393 67604 369873 42797 260326
4806 260326 235523 -28700 13427 198019 -75081 304988 -72853 -17948 -102520 61288 -141854
4794 47922 -186060 -246446 324784 352208 155205 103999 209229 -179677 -36054 79422 151942
4783 151942 206212 158822 -182536 12517 306869 -97951 -271798 -108578 85061 -6090 204571
4771 72184 374820 -59767 2589 405739 -155936 -148655 23480 -134174 219179 120288 -92868
4759 -56000 -10327 -42503 -308177 63696 307886 225360 24909 187963 26625 -179493 -126956
4748 -126956 -68351 130106 -139283 49247 -232113 -317549 -100180 249331 270937 -38457 -79036
4737 -79036 -161532 136517 179119 -31012 -45405 264853 163830 -433917 -56628 257943 265795
4726 265795 85544 163748 267658 -153922 9702 -25543 -280825 -327539 61412 174924 -53354
4714 175489 27428 114358 -144125 318246 -132817 -70471 110312 -73221 -94577 4521 -289562
4702 -119567 -149509 -45652 178372 292205 293169 124922 -152273 30264 -27049 9079 42453
4691 42453 2133 -77459 5406 -174257 -20565 55794 214673 -6987 70909 -69662 -284946 212442
4678 65918 158892 292804 200975 -114483 31397 -187143 -75753 27663 -183753 60957 -168911
4666 -95759 -160337 -39943 359073 -108898 86906 -48267 226112 -12363 12260 256337 65078
4654 -91149 252215 106310 110788 51852 -158289 202533 10982 -21122 -102254 -492589 174197
4642 -269583 -205319 -197475 107530 140816 157433 -105041 -152872 -140590 205420 -13253 -243497
4631 -243497 67122 23041 34769 -82643 -349053 235825 34015 237422 185600 392221 -139059
4619 105050 -214370 214630 -143821 134463 46238 -230442 19942 54614 -179197 8821 131843
4608 131843 12671 99186 -275679 -45726 -1588 15204 329820 15606 88265 174853 31048
4596 -54979 327356 72327 312313 -130450 -139114 244297 -289161 25845 428910 3276 128861
4585 128861 -135577 77032 -143197 138356 33237 -90469 -60430 49342 -129806 -178506 -137660
4574 -137660 -20115 188083 47019 113441 75005 83863 282045 15567 13974 -9237 113920 -24980
4561 -73011 107770 39014 71275 -16774 134310 -233410 -293157 113806 110367 -158146 54568
4549 143204 135030 -242132 525807 2051 119463 -105486 10092 114234 -62230 -70977 107943
4537 144076 118616 3009 -89416 -31020 8426 -80866 210072 56525 49834 68470 100467 302404
4525 302404 133721 36040 -218986 132925 302993 -10256 185285 82698 22569 50051 13433
4513 -130001 103001 -286251 141718 -277289 -213236 196552 -144189 -164722 104449 -180980
4502 -56574 265114 76922 86880 -83523 11400 136120 -74596 134416 41122 -55352 -49553 -71936
4490 -71936 171627 95106 213996 -7277 -139073 -43233 -34136 69119 117563 -102879 -187632
4479 -187632 17884 -78362 176240 -83471 90896 -157145 -173769 -139323 -289721 104955 -2483
$$ [...]
##END NTUPLES=NMR SPECTRUM
##END=
