##TITLE=AC1637_CTIAH13370_8569331_6N9dx2ids1
##JCAMPDX= 6.0         $$ Bruker NMR JCAMP-DX V2.0
##DATA TYPE= NMR SPECTRUM
##DATA CLASS= NTUPLES
##ORIGIN= BRUKER
##OWNER= Administrator
$$ 1.72 TOPSPIN		Version 2.1
$$ 2014-04-10 21:48:17.323 -0700  Administrator@X
$$ Compression mode = diff/dup
##.OBSERVE FREQUENCY= 400.02188249412
##.OBSERVE NUCLEUS= ^1H
##.ACQUISITION MODE= SIMULTANEOUS (DQD)
##.ACQUISITION SCHEME= undefined
##.AVERAGES= 64
##.DIGITISER RES= 22
##SPECTROMETER/DATA SYSTEM= spect
##.PULSE SEQUENCE= noesygpps1d.comp
##.SOLVENT NAME= COFFEE_meoh
##.SHIFT REFERENCE= INTERNAL, COFFEE_meoh, 1, 14.96112
##AUDIT TRAIL= $$ (NUMBER, WHEN, WHO, WHERE, PROCESS, VERSION, WHAT)
$$ ##TITLE= Audit trail, TOPSPIN		Version 2.1
$$ ##JCAMPDX= 5.01
$$ ##ORIGIN= Bruker BioSpin GmbH
$$ ##OWNER= Administrator
$$ $$ E:\/data/COFFEE/nmr/AC1637_CTIAH13370_8569331_6N9dx2ids1/12/pdata/1/auditp.txt
$$ ##AUDIT TRAIL=  $$ (NUMBER, WHEN, WHO, WHERE, PROCESS, VERSION, WHAT)
(   1,<2014-04-10 21:48:10.979 -0700>,<Administrator>,<X>,<go>,<TOPSPIN 2.1>,
      <created by zg
	started at 2014-04-10 21:36:36.568 -0700,
	POWCHK enabled, PULCHK disabled,
       configuration hash MD5:
       C8 4E 4E 5D D3 5C D8 9E 9F 52 82 E0 59 8A DE 15
       data hash MD5: 64K
       C6 9E 4A 51 64 F5 32 7F 2E 57 7D 6B 17 7D B2 54>)
(   2,<2014-04-10 21:48:14.369 -0700>,<Administrator>,<X>,<proc1d>,<TOPSPIN 2.1>,
      <Start of raw data processing
       efp LB = 0.3 FT_mod = 6 PKNL = 1 PHC0 = 0 PHC1 = 0 SI = 128K 
       data hash MD5: 128K
       40 47 B5 85 7F CD FD F4 D0 A0 3D 16 1C 2C B1 83>)
(   3,<2014-04-10 21:48:15.526 -0700>,<Administrator>,<X>,<proc1d>,<TOPSPIN 2.1>,
      <pk PHC0 = -81.78772 PHC1 = 0 
       data hash MD5: 128K
       B2 0E 07 DA 77 9E 9D DC 2A 96 F4 D2 9C A0 36 D6>)
(   4,<2014-04-10 21:48:16.323 -0700>,<Administrator>,<X>,<proc1d>,<TOPSPIN 2.1>,
      <abs ABSG = 1 
       data hash MD5: 128K
       2D E5 41 89 D0 60 9B AE 9F BE 12 9A A7 55 4A 04>)
(   5,<2014-04-10 21:48:16.526 -0700>,<Administrator>,<X>,<proc1d>,<TOPSPIN 2.1>,
      <abs ABSG = 2 
       data hash MD5: 128K
       44 15 78 05 45 C1 CC F4 79 D6 FF 97 A7 4B 5B E1>)
(   6,<2014-04-10 21:48:16.744 -0700>,<Administrator>,<X>,<proc1d>,<TOPSPIN 2.1>,
      <abs ABSG = 3 
       data hash MD5: 128K
       92 A9 79 22 41 A2 ED 15 BC C1 CC F1 42 01 ED 4B>)
(   7,<2014-04-10 21:48:16.916 -0700>,<Administrator>,<X>,<proc1d>,<TOPSPIN 2.1>,
      <abs ABSG = 4 
       data hash MD5: 128K
       63 DA 07 4F 55 D7 5D FE C7 E1 03 BB 32 2C 68 1D>)
(   8,<2014-04-10 21:48:17.119 -0700>,<Administrator>,<X>,<proc1d>,<TOPSPIN 2.1>,
      <abs ABSG = 5 
       data hash MD5: 128K
       86 8A 39 E6 6A D0 32 FB A3 05 12 7D A1 48 4C D3>)
$$ ##END=
$$ 
$$ $$ hash MD5
$$ $$ 3A 3F EA A9 A7 8A BF F7 E3 AD 33 77 87 F8 F4 F6
##$RELAX= 
##$RELAX= 
##$RELAX= 
##$RELAX= 
##$RELAX= 
##$RELAX= 
##$RELAX= 
##$RELAX= 
$$ Bruker specific parameters
$$ --------------------------
##$DU= <E:\>
##$EXPNO= 12
$$ [...]
##$TP07= 0
##$TPNAME0= <>
##$TPNAME1= <>
##$TPNAME2= <>
##$TPNAME3= <>
##$TPNAME4= <>
##$TPNAME5= <>
##$TPNAME6= <>
##$TPNAME7= <>
##$TPOAL= (0..7)
0.5 0.5 0.5 0.5 0.5 0.5 0.5 0.5
##$TPOFFS= (0..7)
0 0 0 0 0 0 0 0
##$TUNHIN= 0
##$TUNHOUT= 0
##$TUNXOUT= 0
##$USERA1= <user>
##$USERA2= <user>
##$USERA3= <user>
##$USERA4= <user>
##$USERA5= <user>
##$V9= 5
##$VALIST= <valist>
##$VCLIST= <CCCCCCCCCCCCCCC>
##$VD= 0
##$VDLIST= <DDDDDDDDDDDDDDD>
##$VPLIST= <PPPPPPPPPPPPPPP>
##$VTLIST= <TTTTTTTTTTTTTTT>
##$WBST= 1024
##$WBSW= 4
##$XGAIN= (0..3)
0 0 0 0
##$XL= 0
##$YL= 0
##$YMAX_a= 6322922
##$YMIN_a= -11696214
##$ZGOPTNS= <>
##$ZL1= 120
##$ZL2= 120
##$ZL3= 120
##$ZL4= 120
##$ABSF1= 14.96112
##$ABSF2= -5.597062
##$ABSG= 5
##$ABSL= 3
##$ALPHA= 0
##$AQORDER= 0
##$ASSFAC= 0
##$ASSFACI= 0
##$ASSFACX= 0
##$ASSWID= 0
##$AUNMP= <proc_prof1d_extract.lims>
##$AXLEFT= 0
##$AXNAME= <>
##$AXNUC= <1H>
##$AXRIGHT= 0
##$AXTYPE= 0
##$AXUNIT= <>
##$AZFE= 0.1
##$AZFW= 0.1
##$BCFW= 0
##$BC_mod= 0
##$BYTORDP= 0
##$COROFFS= 0
##$CY= 15
##$DATMOD= 1
##$DC= 0
##$DFILT= <>
##$DTYPP= 0
##$F1P= 0
##$F2P= 0
##$FCOR= 0.5
##$FTSIZE= 131072
##$FT_mod= 6
##$GAMMA= 0
##$GB= 0
##$INTBC= 1
##$INTSCL= 1
##$ISEN= 128
##$LB= 0.3
##$LEV0= 0
##$LPBIN= 0
##$MAXI= 10000
##$MC2= 0
##$MEAN= 0
##$ME_mod= 0
##$MI= 0
##$NCOEF= 0
##$NC_proc= -2
##$NLEV= 6
##$NOISF1= 0
##$NOISF2= 0
##$NSP= 0
##$NTH_PI= 0
##$NZP= 0
##$OFFSET= 14.96112
##$PC= 1
##$PHC0= -81.78772
##$PHC1= 0
##$PH_mod= 1
##$PKNL= yes
##$PPARMOD= 0
##$PPDIAG= 0
##$PPIPTYP= 0
##$PPMPNUM= 2147483647
##$PPRESOL= 1
##$PSCAL= 4
##$PSIGN= 0
##$PYNMP= <proc.py>
##$REVERSE= no
##$SF= 400.020009587717
##$SI= 131072
##$SIGF1= 0
##$SIGF2= 0
##$SINO= 400
##$SIOLD= 131072
##$SPECTYP= <>
##$SREGLST= <1H.CDCl3>
##$SSB= 0
##$STSI= 131072
##$STSR= 0
##$SW_p= 8223.68421052631
##$SYMM= 0
##$S_DEV= 0
##$TDeff= 65536
##$TDoff= 0
##$TI= <>
##$TILT= no
##$TM1= 0
##$TM2= 0
##$TOPLEV= 0
##$USERP1= <user>
##$USERP2= <user>
##$USERP3= <user>
##$USERP4= <user>
##$USERP5= <user>
##$WDW= 1
##$XDIM= 131072
##$YMAX_p= 363237837
##$YMIN_p= -87945746
##$CURPLOT= <Network HP LaserJet P1505>
##$CURPRIN= <$Network HP LaserJet P1505>
##$DFORMAT= <normdp>
##$LAYOUT= <+/1D_H.xwp>
##$LFORMAT= <normlp>
##$PFORMAT= <normpl>
##$SURQMSG= 1
$$ End of Bruker specific parameters
$$ ---------------------------------
##NTUPLES= NMR SPECTRUM
##VAR_NAME=  FREQUENCY,     SPECTRUM/REAL,   SPECTRUM/IMAG
##SYMBOL=    X,             R,               I
##VAR_TYPE=  INDEPENDENT,   DEPENDENT,       DEPENDENT
##VAR_FORM=  AFFN,          ASDF,            ASDF
##VAR_DIM=   131072,        131072,          131072
##UNITS=     HZ,            ARBITRARY UNITS, ARBITRARY UNITS
##FACTOR=    0.0627417313425164, 1,          1
##FIRST=     8223.62146879497, -2146,        -52295
##LAST=      0,             -994,            -52421
##MIN=       0,             -87945746,       0
##MAX=       8223.62146879497, 363237837,    0
$$ Real data points
##PAGE= N=1
##DATA TABLE= (X++(R..R)), XYDATA
$$ [...]
63858I19914K7367K6820K5623K3724K1576J9597J7779J5819J3451J0544P162L550
63846A132926k00m368r127j3886j7715k0532k3263k6498k9565l1552l2701l3921
63834H89598l5134l5180l3634l1735l0893l0860l0282k8623k6562k4610k2444
63823E59641j9937j7828j6686j5884j4434j2444j0865j0044r406q589p941p666
63811D07917p278o375n334m740m520m212l770l581l783m058m092l856l471l067
63797C45780k884l138l711m091l862l172k661k789l365l756l579l001k367j791
63783C01613j326j185j448j691j428q72p92j486k291k287j296p3L48m26j668k102
63767B81590j288j41K70Q7J44M60K90m05p31l81k15p50j198p75k9J59J55Q97K167
$$ plain form
63858 919914 947281 974101 999724 1023448 1045024 1064621 1082400 1098219 1111670 1122214 1129376 1132926
63846 1132926 1132726 1128358 1119231 1105345 1087630 1067098 1043835 1017337 987772 956220 923519 889598
63834 889598 854464 819284 785650 753915 723022 692162 661880 633257 606695 582085 559641
63823 559641 539704 521876 505190 489306 474872 462428 451563 441519 432113 423524 415583 407917
63811 407917 400639 394264 388930 384190 379670 375458 371688 368107 364324 360266 356174 352318 348847 345780
63797 345780 342896 339758 336047 331956 328094 324922 322261 319472 316107 312351 308772 305771 303404 301613
63783 301613 300287 299102 297654 295963 294535 293663 292871 291385 289094 286807 285511 285438 285786 285360 283692 281590
63767 281590 280302 280161 280431 280518 280662 281122 281412 281007 280276 279895 279680 278930 277732 276957 276928 277087 277242 278139 280306
63748B80306K775K362J838J885K061J783J367J538K346L027K874K015J306J430
63734C08913K130K605K655K894L619M160L897L318L285L716L889L777M046M814
63720C57718N373N271M814M275L452K327J474J311J448J151J78j142k317k977
63706C82356l077k886k624k105j160k12J60J48M48J037J072L06k54L13J502K085
63690C77109J738J223J169J373J362J088Q32P04N07Q2l32k79L18R31J051Q85J038
63673C90799J565J844J535J146J358K088K604K380J571P67L98L02j26j237k600
63658D04394l458l676l802m182m520m516m463m773n220n115m149k749j640j240
63644C50891j367j356o02Q34K221K872K765K408K245K405K858L579M487N290N563
$$ plain form
63748 280306 283081 285443 287281 289166 291227 293010 294377 295915 298261 301288 304162 306177 307483 308913
63734 308913 311043 313648 316303 319197 322816 326976 330873 334191 337476 341192 345081 348858 352904 357718
63720 357718 363091 368362 373176 377451 380903 383230 384704 386015 387463 388614 388792 387650 385333 382356
63706 382356 379279 376393 373769 371664 370504 370292 370452 370600 371048 372085 373157 373463 373209 373522 375024 377109
63690 377109 378847 380070 381239 382612 383974 385062 385894 386598 387105 387187 386855 386576 386894 387825 388876 389761 390799
63673 390799 392364 394208 395743 396889 398247 400335 402939 405319 406890 407657 408055 408357 408231 406994 404394
63658 404394 400936 397260 393458 389276 384756 380240 375777 371004 365784 360669 356520 353771 352131 350891
63644 350891 349524 348168 347566 348400 350621 353493 356258 358666 360911 363316 366174 369753 374240 379530 385093
63629C85093N146M547M626N670P000P821Q262R062J0403J1665J2436J3105J4175
63616D99011J5609J7180J9057K1460K4044K6110K7417K8308K9029K9273K8470
63605G64968K6414K3429J9984J6264J2261Q168M424J226j705m569o933q189q449
63592H47293q528r037j0016j1431j3455j5989j8365j9860k0308k0029j9456j8844
63580F61975j8153j7107j5608j3978j2483j0783q371n519l156j744q82r6O74J492
63566E56261K560L656M150L976L854M271M971N827P323R495J1359J2278J3260
63553F43241J5780J9777K3830K7040K9744L2511L5370L7825L8871L7229L2605
63542I73823K6475K0585J4855Q080O15n306q440j0097j1939j3555j3582j2299
$$ plain form
63629 385093 390239 394786 399412 405082 412082 419903 428165 437227 447630 459295 471731 484836 499011
63616 499011 514620 531800 550857 572317 596361 622471 649888 678196 707225 736498 764968
63605 764968 791382 814811 834795 851059 863320 871488 875912 877138 875433 870864 863931 855742 847293
63592 847293 838765 829728 819712 808281 794826 778837 760472 740612 720304 700275 680819 661975
63580 661975 643822 626715 611107 597129 584646 573863 565492 559973 556817 555073 554191 554095 554769 556261
63566 556261 558821 562477 566627 570603 574457 578728 583699 589526 596849 606344 617703 629981 643241
63553 643241 659021 678798 702628 729668 759412 791923 827293 865118 903989 941218 973823
63542 973823 1000298 1020883 1035738 1043818 1044433 1039127 1030687 1020590 1008651 995096 981514 969215
63530I69215j1469j2043j3470j5245j7670k0743k3543k5363k6594k7870k8981
63519G46224k9297k8806k7946k6735k4842k2413k0107j8246j6526j4709j3041
63508E03556j1739j0563r233p939o973o231n446m710m287m024l431k409j455j086
63494D24030j298j768k226k515k493k075j319l96M59J094J617K369L473M504M879
63479D28335M517L894L494L454L642L740L364K449J436P16K0j111k387l034l011
63464D49518l138l761m081l351k081j369j449j590j096Q6J582K819L254K904K603
63449D40850L208M637O092P067P650Q020Q279Q791J0092J2233J4711J7139J9621
63436E68390K2328K5117K7722K9883L1067L0450K7702K3518J9094J5062J1358
$$ plain form
63530 969215 957746 945703 932233 916988 899318 878575 855032 829669 803075 775205 746224
63519 746224 716927 688121 660175 633440 608598 586185 566078 547832 531306 516597 503556
63508 503556 491817 481254 472021 464082 457109 450878 445432 440722 436435 432411 428980 426571 425116 424030
63494 424030 422732 420964 418738 416223 413730 411655 410336 409940 410399 411493 413110 415479 418952 423456 428335
63479 428335 432852 436746 440240 443694 447336 451076 454440 456889 458325 459041 459061 457950 455563 452529 449518
63464 449518 446380 442619 438538 435187 433106 431737 430288 428698 427602 427688 429270 432089 435343 438247 440850
63449 440850 444058 448695 454787 461854 469504 477524 485803 494594 504686 516919 531630 548769 568390
63436 568390 590718 615835 643557 673440 704507 734957 762659 786177 805271 820333 831691
63425H31691Q015N730N354P027J0028J3438J6782J9959K2827K5030K6150K5828
63413A017859K3841K0313J5806J1042O419K053j802m753o762q304r754j1005j1913
63400A043040j2873j4435j6558j8665k0496k2437k4822k7281k9093k9956l0045
63389G96379k9449k8037k6055k4267k3052k1665j9125j5709j2764j0898r198o793
63377E69367m256k621j577J70K948N622P154P690P957Q484R735J2105J5287J8270
63363F56335K0391K1923K3413K5062K7004K9416L1943L3687L4152L3531L1802
63352I68659K8494K3880J9325J5609J1734O493N15m371p346r035j0072j0534j0803
63339A022548j1790j3918j6641j9196k1331k3201k5022k6836k8181k8209k6616
$$ plain form
63425 831691 839706 845436 850790 857817 867845 881283 898065 918024 940851 965881 992031 1017859
63413 1017859 1041700 1062013 1077819 1088861 1095280 1097333 1095531 1090778 1084016 1075712 1065958 1054953 1043040
63400 1043040 1030167 1015732 999174 980509 960013 937576 912754 885473 856380 826424 796379
63389 796379 766930 738893 712838 688571 665519 643854 624729 609020 596256 585358 576160 569367
63377 569367 565111 562490 560913 561083 564031 569653 576807 584497 592454 600938 610673 622778 638065 656335
63363 656335 676726 698649 722062 747124 774128 803544 835487 869174 903326 936857 968659
63352 968659 997153 1021033 1040358 1055967 1067701 1074194 1074709 1070338 1062992 1053957 1043885 1033351 1022548
63339 1022548 1010758 996840 980199 961003 939672 916471 891449 864613 836432 808223 781607
63328G81607k4238k2082k0075j7445j4064j0544p222m077j641r00k088m363o919
63315F45949r639j2441j4847j6539j7654j8210j7865j6562j4840j3228j1820j0618
63303D71686r663q623o997n028l715l505l678l440k958k801k940k996l020l287
63289D09035l655l701l374k935k462j861j276j013j132j396j577j566j299q45
63275C80943m20r4K77O62O90K32j58J59J026J663J703J573J791K285K611K593
63259C97536K432K340K346K474K853L495M077M246M134M324N099O027O530O614
63245D54527O767P223P757Q186Q649R355J0286J1308J2380J3639J5308J7489J9876
63232F02750K1849K3063K3731K4162K4277K4007K3748K3929K4251K4048K3331
$$ plain form
63328 781607 757369 735287 715212 697767 683703 673159 665937 661860 660219 659319 657231 652868 645949
63315 645949 636310 623869 609022 592483 574829 556619 538754 522192 507352 494124 482304 471686
63303 471686 462023 453400 446403 441375 437660 434155 430477 427037 424079 421278 418338 415342 412322 409035
63289 409035 405380 401679 398305 395370 392908 391047 389771 388758 387626 386230 384653 383087 381788 380943
63275 380943 380523 380429 380706 381368 382058 382290 382132 382291 383317 384980 386683 388256 390047 392332 394943 397536
63259 397536 399968 402308 404654 407128 409981 413476 417553 421799 425933 430257 435356 441383 447913 454527
63245 454527 461294 468517 476274 484460 493109 502464 512750 524058 536438 550077 565385 582874 602750
63232 602750 624599 647662 671393 695555 719832 743839 767587 791516 815767 839815 863146
63221H63146K2823K2902K3113K2934K2488K2225K2329K2582K2539K1682J9773
63210A108536J7149J4253J0899O511J145m289r083j3486j8044k2592k6340k8725
63198A035934k9914l0472l0707l0322k8830k6374k3794k1564j9144j5973j2612
63187G66228j0060q147n735k508N78K868M828O892Q575R454J0061J0973J1767
63174H05774J1761J1220J0954J1175J1481J1561J1192J0049Q277O815O262N794
63162I22315M116J153k100n125q200j1243j3544j4937j6248j8116k0020k0960
63150G97091k0636j9522j8230j7133j6369j5768j4897j3420j1457r515q074p165
63138F24905o289m922l184j823j312j258r16p2R63J912K680L198L561M192N298
$$ plain form
63221 863146 885969 908871 931984 954918 977406 999631 1021960 1044542 1067081 1088763 1108536
63210 1108536 1125685 1139938 1150837 1157348 1158493 1154204 1145121 1131635 1113591 1090999 1064659 1035934
63198 1035934 1006020 975548 944841 914519 885689 859315 835521 813957 794813 778840 766228
63187 766228 756168 748021 742286 739778 740356 743224 748052 754944 763519 772973 783034 794007 805774
63174 805774 817535 828755 839709 850884 862365 873926 885118 895167 903444 910259 916521 922315
63162 922315 926431 927584 925484 920359 912159 900916 887372 872435 856187 838071 818051 797091
63150 797091 776455 756933 738703 721570 705201 689433 674536 661116 649659 640144 632070 624905
63138 624905 618616 613694 610510 608687 607375 606117 605201 605129 606092 608004 610684 613882 617443 621635 626933
63123F26933O354O639O259N994O134O151N600M778M168L793L435L078K821K621
63109F94758K460K450K495K147J160N6l57L6M46J20q78j914k611l096l478l510
63093F90284k897j768m98O55J511J711J038j8n50k31L88Q29J281K013K740L093
63077F99581L333L908M639N046N255N840O822P565P834Q223R300J0902J2593J4260
63063H05101J5930J7432J8702K0092K1929K4034K6127K8514L1827L6044M0313
63052A086045M3812M6506M8800N0902N2785N4576N6459N8255N9485O0001O0151
63041A677777O0124N9515N7932N5847N4251N3478N2852N1618M9804M7914M6081
63030B267193M3861M0628L5914K9544K1661J2591K540q436j9994l1288m1472n0326
$$ plain form
63123 626933 633287 639926 646185 652179 658313 664464 670064 674842 679010 682803 686238 689316 692137 694758
63109 694758 697218 699668 702163 704310 705470 705526 705169 705205 705651 705771 704893 702979 700368 697272 693794 690284
63093 690284 687387 685619 685121 685776 687287 688998 690036 690018 689468 689237 689625 690454 691735 693748 696488 699581
63077 699581 702914 706822 711461 716507 721762 727602 734424 741989 749823 758046 767346 778248 790841 805101
63063 805101 821031 838463 857165 877257 899186 923220 949347 977861 1009688 1045732 1086045
63052 1086045 1129857 1176363 1225163 1276065 1328850 1383426 1439885 1498140 1557625 1617626 1677777
63041 1677777 1737901 1797416 1855348 1911195 1965446 2018924 2071776 2123394 2173198 2221112 2267193
63030 2267193 2311054 2351682 2387596 2417140 2438801 2451392 2453932 2445496 2425502 2394214 2352742 2302416
63018B302416n8143o5032p0540p4034p5322p4850p3238p0641o6684o1202n4799
63007A557931m8339m2065l5681k9211k3155j7681j2353o989k148J667M796P824
62995A354596J0677J2955J4773J6572J8244J9186J9262J9074J9117J9159J8677
62984A542292J7498J5769J3606J0965P826M288N16l467p937j3221j9181k5040
62972A543914k9955l3633l6316l8313l9722m0424m0246l9260l7951l6763l5481
62961A135850l3549l1154k9336k8584k7957k6262k3731k1712k0872k0551j9910
62950H52232j9008j8408j8242j8007j7185j5795j4291j3013j1858j0709r959j0076
62938F75681j0559j0085q096n640m082l568l369l229l397l647l298k294j427j327
$$ plain form
63018 2302416 2244273 2179241 2108701 2034667 1959345 1884495 1811257 1740616 1673932 1612730 1557931
63007 1557931 1509592 1467527 1431846 1402635 1379480 1361799 1349446 1342457 1340309 1341976 1346772 1354596
62995 1354596 1365273 1378228 1393001 1409573 1427817 1447003 1466265 1485339 1504456 1523615 1542292
62984 1542292 1559790 1575559 1589165 1600130 1607956 1612244 1612760 1609293 1601356 1588135 1568954 1543914
62972 1543914 1513959 1480326 1444010 1405697 1365975 1325551 1285305 1246045 1208094 1171331 1135850
62961 1135850 1102301 1071147 1041811 1013227 985270 959008 935277 913565 892693 872142 852232
62950 852232 833224 814816 796574 778567 761382 745587 731296 718283 706425 695716 685757 675681
62938 675681 665122 655037 646941 641301 637219 633651 630282 627053 623656 620009 616711 614417 612990 611663
62924F11663j781k166k080j525r56j068k060l168l483l102k864l059l133k703
62910E78515k120j824j784j774j698j520j248j124j338j604j451r73p03q13r80
62895E57561j023j051r76n69nK12K6j36j53l45p27p96k31P39J734K385K176R02
62877E59723o61j425j405j586k282k699k400k081k305k572k245j589j104o79n2
62862E34638N15P77J014J319J154L56j80K73J093J299J089J304J870J968J463
62847E49952J005Q27N51J41nO4j23n45o37l18j26k13j03K69K07o04j426j425p72
62828E46719k18k3J54N99J215J752K015J972J856K049K690L511M137M446M563
62813E77437M657M798M856M611M108L810M115M766N115M984M885N321O200P075
$$ plain form
62924 611663 609882 607716 605636 604111 603155 602087 600027 596859 593376 590274 587410 584351 581218 578515
62910 578515 576395 574571 572787 571013 569315 567795 566547 565423 564085 562481 561030 560057 559354 558541 557561
62895 557561 556538 555487 554511 553942 553937 554149 554175 554039 553886 553541 552814 552018 551787 552526 554260 556645 558821 559723
62877 559723 559062 557637 556232 554646 552364 549665 547265 545184 542879 540307 538062 536473 535369 534690 534638
62862 534638 535153 535930 536944 538263 539417 539773 539593 539866 540959 542258 543347 544651 546521 548489 549952
62847 549952 550957 551784 552335 552476 552471 552535 552412 551867 551230 550912 550786 550573 550470 550739 550946 550342 548916 547491 546719
62828 546719 546501 546478 546632 547231 548446 550198 552213 554185 556041 558090 560780 564291 568428 572874 577437
62813 577437 582094 586892 591748 596359 600467 604277 608392 613158 618273 623257 628142 633463 639663 646738
62799F46738P696Q181Q774R651J0792J2002J3123J4253J5659J7523J9918K2941
62787H07251K6593L0572L4475L8240M2173M6479N1027N5630O0338O5262P0256
62776A328296P4955P9104Q2680Q5657Q7679Q8114Q6557Q3120P8080P1302O2409
62765B207953N1522L9301K6142J1825l624j9186l3479m5948n6860o6414p4339
62754B036893q0324q4272q6172q6216q4995q3057q0370p6713p2537o8693o5232
62743A168312o1258n6306n1117m6596m2620l8519l4269l0448k7254k4345k1543
62732G34037j9026j6740j4346j1998j0506j0233j0251r278p247n318m278l626
62720F11190k485q65N18J303J755K138K488L069M388O491Q694J0425J1865J3446
$$ plain form
62799 646738 654434 662615 671389 681040 691832 703834 716957 731210 746869 764392 784310 807251
62787 807251 833844 864416 898891 937131 979304 1025783 1076810 1132440 1192778 1258040 1328296
62776 1328296 1403251 1482355 1565035 1650692 1738371 1826485 1913042 1996162 2074242 2145544 2207953
62765 2207953 2259475 2298776 2324918 2336743 2333119 2313933 2280454 2234506 2177646 2111232 2036893
62754 2036893 1956569 1872297 1786125 1699909 1614914 1531857 1451487 1374774 1302237 1233544 1168312
62743 1168312 1107054 1050748 999631 953035 910415 871896 837627 807179 779925 755580 734037
62732 734037 715011 698271 683925 671927 661421 651188 640937 631659 624412 619094 614816 611190
62720 611190 608705 607840 608358 609661 611416 613554 616042 619111 623499 629990 638684 649109 660974 674420
62706F74420J5090J6505J7916J9892K2503K5204K7566K9656L1643L3549L5537
62695I49481L7980M0939M3879M6096M7271M7443M6667M4868M1886L7527L1736
62684A415773K4891J7685J0515L076n147j4109k2990l0757l6749m0899m3611m5484
62672A232194m6913m7779m7647m6311m4155m1877l9874l8028l6010l3679l1073
62661G78848k8261k5367k2655k0329j8247j6079j3859j2079j1127j0756j0332
62650E89757r494q462p725p490p419o893n714m383l493k880j811j13J379J796
62636E27055J285O92M86M44J75m75j434k390k814k453j786j558j864k036j484
62621E11843k94J079K278L101L411L253K848K456K331K773L839N014N656N833
$$ plain form
62706 674420 689510 706015 723931 743823 766326 791530 819096 848752 880395 913944 949481
62695 949481 987461 1028400 1072279 1118375 1165646 1213089 1259756 1304624 1346510 1384037 1415773
62684 1415773 1440664 1458349 1468864 1471940 1466793 1452684 1429694 1398937 1362188 1321289 1277678 1232194
62672 1232194 1185281 1137502 1089855 1043544 999389 957512 917638 879610 843600 809921 778848
62661 778848 750587 725220 702565 682236 663989 647910 634051 621972 610845 600089 589757
62650 589757 580263 571801 564076 556586 549167 542274 536560 532177 528684 525804 523993 523880 525259 527055
62636 527055 528340 529032 529518 529962 530137 529662 528228 525838 523024 520571 518785 517227 515363 513327 511843
62621 511843 511549 512628 514906 518007 521418 524671 527519 529975 532306 535079 538918 543932 549588 555421
62607E55421O306P460Q745R507R960J0823J2291J3945J5601J7657K0444K3691
62595G11851K6878K9829L2650L5307L7625L9599M1350M2756M3395M2925M1269
62584A125434L8371L4102K8583K2281J5525Q182K22p653j4479k0129k5339l0552
62572A174548l5202l8376l9785l9878l9356l8776l8190l7035l4713l1579k8814
62561G72844k6999k5433k3246k0669j8475j6680j4706j2536j0788r658q649p520
62549E77485o698o481o423n879m767l497k474j870j538j115m91j23m19r75j015
62534E33720o10o63j486k137j619j19J393K350K881L420M387N921P617Q842R613
62519E73510J0689J2506J4679J6860J9333K2135K4354K5272K5707K7116K9699
$$ plain form
62607 555421 561727 569187 577932 587439 597399 608222 620513 634458 650059 667716 688160 711851
62595 711851 738729 768558 801208 836515 874140 913739 955089 997845 1041240 1084165 1125434
62584 1125434 1163805 1197907 1226490 1248771 1264296 1272478 1272700 1265047 1250568 1230439 1205100 1174548
62572 1174548 1139346 1100970 1061185 1021307 981951 943175 904985 867950 833237 801658 772844
62561 772844 745845 720412 697166 676497 658022 641342 626636 614100 603312 593654 585005 577485
62549 577485 570787 564306 557883 552004 547237 543740 541266 539396 537858 536743 536252 536129 535710 534735 533720
62534 533720 533110 532447 530961 528824 527205 527086 528479 530829 533710 537130 541517 547438 555055 563897 573510
62519 573510 584199 596705 611384 628244 647577 669712 694066 719338 745045 772161 801860
62508H01860L2361L4400L6004L7132L7072L5582L3422L1243K8790K5753K2707
62497A156326K0453J9029J8119J8019J9361K2043K5172K8137L1112L4543L8576
62486A430890M3092M7747N1757N4000N3598N0439M5098L8414L1031K2909J3316
62475A882291J651j1528k4570l6004m5609n4098o2031o9174p4762p8103p8993
62464A349070p7802p5142p1360o6452o0549n4334m8649m3710l8989l3955k8759
62453G49369k4017k0064j6680j3551j0774q680p247n904m104j899K27K023L621
62440F42320N015N809N737N153M709M594M381L524J837m64k844m711n883o786
62426F62391p901r099r858j0024r895r573q863p993p747q409r069q594p050n527
$$ plain form
62508 801860 834221 868621 904625 941757 978829 1014411 1047833 1079076 1107866 1133619 1156326
62497 1156326 1176779 1195808 1213927 1231946 1251307 1273350 1298522 1326659 1357771 1392314 1430890
62486 1430890 1473982 1521729 1573486 1627486 1681084 1731523 1776621 1815035 1846066 1868975 1882291
62475 1882291 1883942 1872414 1847844 1811840 1766231 1712133 1650102 1580928 1506166 1428063 1349070
62464 1349070 1271268 1196126 1124766 1058314 997765 943431 894782 851072 812083 778128 749369
62453 749369 725352 705288 688608 675057 664283 655603 648356 642452 638348 636449 636676 638699 642320
62440 642320 647335 653144 658881 664034 668743 673337 677718 681242 683079 682615 679771 675060 669177 662391
62426 662391 654490 645391 635533 625509 615614 606041 597178 589185 581438 573029 563960 555366 548316 542789
62412E42789m778m571m375m028l607l164k825k732k666k109r74N8L14O2J93J049
62396E08636K024K501K721L390M551N433N403M738M118L771L497L379L836M894
62382E62892N933O477O819P540Q615R456R610R119Q271P385O836O948P817R305
62368F73023J1166J3022J4479J5589J7051J9606K3228K7258L1190L5055L9034
62357I19701M3093M6981N0235N2182N2304N0713M7953M4324L9710L4102K7830
62346A409128K1152J4032O527q64p441j2717j6585j9444k2179k5508k9099l1795
62334A285207l2927l3059l2987l2580l1135k8714k6383k5089k4762k4625k4039
62323I68907k2944k1781k1139k1282k1856k2180k1925k1309k0657j9908j8693
$$ plain form
62412 542789 538011 533440 529065 525037 521430 518266 515441 512709 510043 507934 506960 507018 507332 507394 507587 508636
62396 508636 510660 513161 515882 519272 523823 529256 534659 539397 543515 547286 550783 554162 557998 562892
62382 562892 568825 575302 582121 589661 598276 607732 617342 626461 634732 642117 648953 655901 663718 673023
62368 673023 684189 697211 711690 727279 744330 763936 787164 814422 845612 880667 919701
62357 919701 962794 1009775 1060010 1112192 1164496 1215209 1263162 1307486 1347196 1381298 1409128
62346 1409128 1430280 1444312 1450839 1449975 1442534 1429817 1413232 1393788 1371609 1346101 1317002 1285207
62334 1285207 1252280 1219221 1186234 1153654 1122519 1093805 1067422 1042333 1017571 992946 968907
62323 968907 945963 924182 903043 881761 859905 837725 815800 794491 773834 753926 735233
62312G35233j6806j4537j2526j1243j0488r520p777n486l402k005j090j30J188
62299F41411K785M360N634O591P527Q708R942J0662J0592J0077R622R293Q893
62286G46097Q495Q378Q354P663N808L233Q36r77k398l484l889l420k519j831j498
62271G68848j149m93M24J506K905M911P607J0802J4277J7985K1935K5965K9848
62258I05371L3691L8003M3044M8233N2438N4878N5447N4233N1209M6528M0689
62247A423764L4101K6824J8992J1127L592l944j1939k0026k7179l2858l7479m1613
62235A343362m5163m7579m8586m8429m7513m6022m3838m0741l6800l2568k8753
62224H77370k5699k3199k0873j8552j6318j4284j2471j0851r486q537q017p559
$$ plain form
62312 735233 718427 703890 691364 680121 669633 660113 652336 646850 643448 641443 640353 640223 641411
62299 641411 644196 648556 654190 660781 668308 677016 686958 697620 708212 718289 727911 737204 746097
62286 746097 754592 762970 771324 778987 784795 788028 788864 787887 785489 782005 778116 774696 772177 770346 768848
62271 768848 767699 767206 767630 769136 772041 776952 784559 795361 809638 827623 849558 875523 905371
62258 905371 939062 977065 1020109 1068342 1120780 1175658 1231105 1285338 1336547 1383075 1423764
62247 1423764 1457865 1484689 1503681 1514808 1518400 1514456 1502517 1482491 1455312 1422454 1384975 1343362
62235 1343362 1298199 1250620 1202034 1153605 1106092 1060070 1016232 975491 938691 906123 877370
62224 877370 851671 828472 807599 789047 772729 758445 745974 735123 725637 717100 709083 701524
62212G01524o678n353m103l335k852k223j398n93J76J091K127L068L820M402M649
62197F94322M431M105M347N343O561P414P844Q127Q484R061R968J1046J1776J1744
62183H04573J1157J0641J0544J0533R980Q725P333O530O431O528O506O800Q170
62170I14451J0865J4439J8214K1754K5067K8521L2358L6086L8585L9063L7694
62159A217097L5102L1585K7196K2233J7033J1543N626l53n764j0397j4445j7971
62147A318485k0959k3676k6292k8305k9026k8603k7851k7030k5568k3139k0255
62136A037781j7620j5551j4168j3473j2979j1883j0008q023o637o011o054o610
62124I08764p136o928n885m533l168j659k12O55J101K014L591M837N021M735M806
$$ plain form
62212 701524 694846 689493 685390 682055 679203 676980 675582 674989 675165 676256 678383 681451 685271 689673 694322
62197 694322 698753 702858 707205 712548 719109 726523 734367 742494 750978 760039 770007 781053 792829 804573
62183 804573 815730 826371 836915 847448 857428 866153 873486 880016 886447 892975 899481 906281 914451
62170 914451 925316 939755 957969 979723 1004790 1033311 1065669 1101755 1140340 1179403 1217097
62159 1217097 1252199 1283784 1310980 1333213 1350246 1361789 1367415 1367062 1361298 1350901 1336456 1318485
62147 1318485 1297526 1273850 1247558 1219253 1190227 1161624 1133773 1106743 1081175 1058036 1037781
62136 1037781 1020161 1004610 990442 976969 963990 952107 942099 934076 927439 921428 915374 908764
62124 908764 901628 894700 888815 884282 881114 879455 879243 879898 880999 883013 886604 891441 896462 901197 906003
62109I06003M966M359K782O40j709l769m693m090k693j535r20p56j221k258l066
62094H92040l094k983l556m323m129k854j373j31J016J843J980K074L314N585
62080H85409P334P771P945R111J1012J2577J3557J4603J6130J7861J9304K0194
62068A042808K0571K0789K1350K2562K4321K6154K7261K6788K4497K1155J7738
62057A295994J4381J0540O076J495k879p207j1526j5532j9158k2773k6503k9971
62045A192937l2826l5000l6286l6406l5717l5111l4907l4494l3411l1945l0272
62034H16562k7901k4716k1695j9757j8431j6702j4661j3182j2284j1040r150p450
62022F19593o552o027n399n026n296n689n451m735m221l867k982j559o06p66j322
$$ plain form
62109 906003 910969 915328 918110 918750 917041 913272 908579 904489 901796 900261 899341 898585 897364 895106 892040
62094 892040 888946 885963 882407 878084 873955 871101 869728 869597 870613 872456 874436 876510 879824 885409
62080 885409 892743 900514 908459 917570 928582 941159 954716 969319 985449 1003310 1022614 1042808
62068 1042808 1063379 1084168 1105518 1128080 1152401 1178555 1205816 1232604 1257101 1278256 1295994
62057 1295994 1310375 1320915 1326991 1328486 1325607 1318400 1306874 1291342 1272184 1249411 1222908 1192937
62045 1192937 1160111 1125111 1088825 1052419 1016702 981591 946684 912190 878779 846834 816562
62034 816562 788661 763945 742250 722493 704062 687360 672699 659517 647233 636193 627043 619593
62022 619593 613041 607014 601615 596589 591293 585604 580153 575418 571197 567330 564348 562789 562183 561417 560095
62007E60095j124m4J139J981K784L794M686N083N034M734M187L474K968K849K677
61992F04317J905O48m85j286k206l653n399o884p838q414q805q930q588p882p266
61977E29234p006o718n827m443l326k892k748k479k331k673l236l486l399l201
61963D75469k720j683n52k07p03j098p22RL27J21j08M6O30J508K583L891N476
61946D82267P091Q225Q745R278J0457J1967J2977J3413J4021J5055J5774J5617
61934F24887J5136J5157J5586J5592J4748J3340J1748J0057Q298O639N251M074
61922G60513K812J140r19k774l749l797l495l195k560j149Q81K926M618O018P300
61907G64570Q461R309R616R347Q749Q013O888M909K100q82l428n468p164q502
$$ plain form
62007 560095 558971 558927 560066 562047 564831 568625 573311 578394 583428 588162 592349 595823 598791 601640 604317
61992 604317 606222 606870 606385 605099 602893 599240 593841 586957 579119 570705 561900 552970 544382 536500 529234
61977 529234 522228 515510 509683 505240 501914 499022 496274 493795 491464 488791 485555 482069 478670 475469
61963 475469 472749 471066 470514 470307 469604 468506 467784 467793 468120 468241 468133 468179 468809 470317 472900 476791 482267
61946 482267 489358 497583 506328 515606 526063 538030 551007 564420 578441 593496 609270 624887
61934 624887 640023 655180 670766 686358 701106 714446 726194 736251 744549 751188 756439 760513
61922 760513 763325 764465 763546 760772 757023 753226 749731 746536 743976 742827 743708 746634 751252 757270 764570
61907 764570 773031 782340 791956 801303 810052 818065 824953 829862 831962 831080 827652 822184 815020 806518
61893H06518r390r917j0225j0326j0209r933r460q650p611o838o843p722r132
61880F90262j0460j1100j0875j0274r876r579q901p946p365p137o299m354k230
61867E83866j029m25P35K580L998M343M330M936O233P765R531J1867J4652J7244
61853F70626J9236K0790K2128K3118K3600K3803K4051K4188K3734K2616K1235
61842I19125J9633J7183J3501R275N516K297j014m390o848p717p435o754n729
61829I46643l984j466J478M464P029Q615R010Q631P947O849M905K068j264m671
61815I96254p888j0816j3587j6446j9172k0995k1417k0881k0171j9434j8371j7088
61803G89988j6084j5410j4583j3431j2422j1911j1526j0674r272p714o330n208
$$ plain form
61893 806518 797128 787211 776986 766660 756451 746518 737058 728408 720797 713959 707116 699394 690262
61880 690262 679802 668702 657827 647553 637677 628098 619197 611251 603886 596749 590450 586096 583866
61867 583866 582837 582412 583147 585727 589725 594068 598398 603334 609567 617332 626863 638730 653382 670626
61853 670626 689862 710652 732780 755898 779498 803301 827352 851540 875274 897890 919125
61842 919125 938758 955941 969442 978717 984233 986530 985516 981126 974278 966561 959126 952372 946643
61829 946643 942659 941193 942671 947135 954164 962779 971789 980420 988367 995216 1000121 1002189 1000925 996254
61815 996254 988366 977550 963963 947517 928345 907350 885933 865052 844881 825447 807076 789988
61803 789988 773904 758494 743911 730480 718058 706147 694621 683947 674675 666961 660631 655423
61791F55423m373l806l367k976k758k831k940k644j950j437j589k146k430k162
61777F18014j633j119n92p8J60L6j65k85m99p38m11P01J802K064J897K310L338
61760F24802M105M335M617N041M790L523K074J190N70k39r81j467k300l802n047
61745F41211n058m394m417n331o040n803m903l733k326r23j14j25n46r41j203
61730E95354j233q12M5J010J750K067J842J299J016J290J702J784J719J837J891
61715F12561J579J268J275Q87o75k659l482l018k708l229l581k996k292k478l209
61700E87243l614l771m213m722m723m399m363m529m276l607l227l423l654l397
61686E31325k823k488k649l060l219k899k430k298k428k310j913j833k242k434
$$ plain form
61791 655423 651050 647244 643877 640901 638143 635312 632372 629728 627778 626341 624752 622606 620176 618014
61777 618014 616381 615262 614670 614592 614752 614788 614623 614338 613839 613101 612690 613391 615193 617257 619154 621464 624802
61760 624802 628907 633242 637859 642900 647690 651213 653287 654477 655047 654808 653827 652360 650060 646258 641211
61745 641211 636153 631759 627342 622011 615971 610168 605265 601532 599206 598283 598169 598044 597498 596557 595354
61730 595354 594121 593309 593354 594364 596114 598181 600023 601322 602338 603628 605330 607114 608833 610670 612561
61715 612561 614140 615408 616683 617570 616895 614236 610754 607736 605028 601799 598218 595222 592930 590452 587243
61700 587243 583629 579858 575645 570923 566200 561801 557438 552909 548633 545026 541799 538376 534722 531325
61686 531325 528502 526014 523365 520305 517086 514187 511757 509459 507031 504721 502808 500975 498733 496299
61672D96299j892j190j112j425j315o45M9N20R54J312J330J035O27M5n82m19J105
61655D94696L022L609K562J220N86L23J3L6M42L03p88j502l73J984L540L429K606
61638E15708K053J617Q61k2o98j311k137k970l380l263k882k615k779l433m186
61623D90563m539m431m155l762l046k143j555j413j282r91r98j588k306k662k888
61608D52804l306l507k949k093k007k867l680l674l212l016l125l075k746k491
61594D11056k576k828k887k632k327k325k613k797k580k084j513q13j2M49K14
61579C83732k72k33K88M28k32j058j279r46n81m05k97j35J86P57J272J073Rj031
61561C81276r93Q6J169J441J009M97K75K64J63j20k39K99J441K381K346J452O14
$$ plain form
61672 496299 494407 493217 492105 490680 489365 488720 488769 489289 490243 491555 492885 493920 494547 494592 494010 493591 494696
61655 494696 497718 501327 503889 505109 505695 506018 506031 506067 506509 506812 506024 504522 504149 506133 509673 513102 515708
61638 515708 517761 519378 520239 520217 519519 518208 516071 513101 509721 506458 503576 500961 498182 494749 490563
61623 490563 486024 481593 477438 473676 470630 468487 466932 465519 464237 463246 462248 460660 458354 455692 452804
61608 452804 449498 445991 443042 440949 438942 436075 432395 428721 425509 422493 419368 416293 413547 411056
61594 411056 408480 405652 402765 400133 397806 395481 392868 390071 387491 385407 383894 383081 383069 383518 383732
61579 383732 383460 383227 383515 383943 383711 382653 381374 380428 379847 379442 379145 379010 379196 379953 381225 382298 382307 381276
61561 381276 380283 380369 381538 382979 383988 384485 384760 385024 385187 385067 384828 385127 386568 388949 391295 392747 393361
61544C93361N47J100J519J328Q87J009J924K809K741J905J274J197J115P75P98
61529D14289J464J889J182j46q37o04k59m35j005j664k206k263j647r23r07j477
61513D04451j725j299q05o59n54l29m59j083j401p73K03N42L12L81R33J196P17
61496C99648O4nM70Q85R51R07J016J237J394J435J391J255J040R12J062J432J709
61479D16803J715J612J613J646J431R31M60M06Q69J507J720J180J94n74q60r58
61463D29695j023p34L2O22L03o80j321j074k60N86J244J568J370P85L19K63M09
61446D32104N04N89P38Q22P94Q53J154J553J849K007K017J827J534J357J275J035
61430D52012O69N40P10O83K14q0M88J561K008J381N16M49J170J783J704J251J012
$$ plain form
61544 393361 393908 395008 396527 397855 398742 399751 401675 404484 407225 409130 410404 411601 412716 413491 414289
61529 414289 415753 417642 418824 418678 417841 417237 416978 416543 415538 413874 411668 409405 407758 406835 405928 404451
61513 404451 402726 401427 400622 399963 399409 399080 398621 397538 396137 395364 395567 396109 396421 396802 397735 398931 399648
61496 399648 399712 399707 400177 401062 402013 402920 403936 405173 406567 408002 409393 410648 411688 412600 413662 415094 416803
61479 416803 418518 420130 421743 423389 424820 425751 426211 426617 427486 428993 430713 431893 432087 431513 430653 429695
61463 429695 428672 427938 427970 428592 428895 428215 426894 425820 425560 426146 427390 428958 430328 431113 431432 431695 432104
61446 432104 432608 433197 433935 434757 435551 436404 437558 439111 440960 442967 444984 446811 448345 449702 450977 452012
61430 452012 452681 453221 453931 454614 454828 454748 455236 456797 458805 460186 460702 461151 462321 464104 465808 467059 468071
61413D68071J004P73J80l41m39l49m23n11k61R7j32j155k325k927k906k623k245
61396D53488j692r72j98N36J090J188O92Kj52O27J932K809K561J390K56K3P68
61379D64348J936K945L479L385K700J873J526J885K578L062L045K560J887J523
61365D98732J787K401K754K718K851L543M295M308L587L051L505M826O295P467
61351E52120Q426R312R881R791R120Q321P627O825N715M468L339K358J561J223
61337F40087J413J583J064j48j521k755l884m730m947m663m488m653m706m252
61323F03400l581l119k718j880m89J015K140K800L353M237N498O645P207P370
61309F31878P838R051J0840J2850J4867J6639J7692J7570J6110J3489J0229P107
$$ plain form
61413 468071 469075 469848 470028 469687 469248 468899 468476 467965 467704 467801 467669 466514 464189 461262 458356 455733 453488
61396 453488 451796 450824 450626 451162 452252 453440 454132 454134 453982 454609 456541 459350 461911 463301 463557 463580 464348
61379 464348 466284 469229 472708 476093 478793 480666 482192 484077 486655 489717 492762 495322 497209 498732
61365 498732 500519 502920 505674 508392 511243 514786 519081 523389 526976 530027 533532 538358 544653 552120
61351 552120 560546 569858 579739 589530 598650 606971 614598 621423 627138 631606 634945 637303 638864 640087
61337 640087 641500 643083 644147 643999 642478 639723 635839 631109 626162 621499 617011 612358 607652 603400
61323 603400 599819 596700 593982 592102 591613 592628 594768 597568 600921 605158 610656 617301 624508 631878
61309 631878 639716 648767 659607 672457 687324 703963 721655 739225 755335 768824 779053 786160
61297G86160M641K604L65k301n010p305q952r731r574r001q837r243r483q880
61283G05453p623o394n579n093m575l600k079n76K02L65P73J842L017L671L942
61268F83746M302M789N196N504N791O032O439P485R153J0557J0880J0332R624
61255G79830Q869P559N445K872L84j568k760l415m151n206o011o049n833o348
61241G63618p563q235p356n331l406k309j729r87J51J362K289K911L323L458L379
61226G43575L648M831O589P850Q030P591P162O771O319O219O860P851Q394Q279
61212H39969P931P622P148O251N069M112L919M553N360N602N412N749P150R156
61198I25003J1220J3531J6342J9179K1341K2781K3701K3700K2239J9647J6859
$$ plain form
61297 786160 790801 793405 793770 791469 786459 779154 770202 760471 750897 741896 733059 723816 714333 705453
61283 705453 697830 691436 685857 680764 676189 672589 670510 669934 670136 670501 671274 673116 676133 679804 683746
61268 683746 688048 692837 698033 703537 709328 715360 721799 729284 738437 748994 759874 770206 779830
61255 779830 788699 796258 801703 804575 804959 803391 800631 797216 793065 787859 781848 775799 769966 763618
61241 763618 756055 747820 740464 735133 731727 729418 727689 726702 726853 728215 730504 733415 736738 740196 743575
61226 743575 747223 752054 758643 766493 774523 782114 789276 796047 802366 808585 815445 823296 831690 839969
61212 839969 847900 855522 862670 868921 873990 878102 882021 886574 891934 897536 902948 908697 915847 925003
61198 925003 936223 949754 966096 985275 1006616 1029397 1053098 1076798 1099037 1118684 1135543
61187A135543J4200J1265P947M848K491P48q59k714m968p360r276j0407j1315
61174A130143j2796j4869j6849j8260j9102j9423j9362j9517k0450k1776k2450
61163I25289k2040k1031j9814j8210j6213j4340j2892j1505r868q260o906n368
61151G58842l095l18K180L885M759M877M354L513K662J697K55j665l413m172l695
61136G70666k584j774j620j487l52K208N676R264J2590J5636J8239J9975K0687
61123H67124K0992K2003K4271K7152K9465L0746L1531L2422L3357L3893L3747
61112A186703L2831L1200K9313K7834K6803K5380K2884J9644J6351J3062R476
61101A441481N688J905k234p112j2170j6373j9654k2891k6384k9264l0721l1013
$$ plain form
61187 1135543 1149743 1161008 1168955 1173803 1176294 1177042 1176183 1173469 1168501 1161141 1151865 1141458 1130143
61174 1130143 1117347 1102478 1085629 1067369 1048267 1028844 1009482 989965 969515 947739 925289
61163 925289 903249 882218 862404 844194 827981 813641 800749 789244 779376 771116 764210 758842
61151 758842 755747 755429 757609 761494 766253 771130 775484 778997 781659 783356 783611 781946 778533 774361 770666
61136 770666 768082 766308 764688 763201 762849 765057 770733 779997 792587 808223 826462 846437 867124
61123 867124 888116 910119 934390 961542 991007 1021753 1053284 1085706 1119063 1152956 1186703
61112 1186703 1219534 1250734 1280047 1307881 1334684 1360064 1382948 1402592 1418943 1432005 1441481
61101 1441481 1447169 1449074 1446840 1439728 1427558 1411185 1391531 1368640 1342256 1312992 1282271 1251258
61089A251258l0862l0479k9663k8324k6544k4410k2101j9854j7680j5475j3406
61078I92460j1831j0643r172o948m194j466Q54K635M008N365O931Q324R030R333
61064I94686J0151J1813J3670J5092J6172J7106J7699J7949J8535K0058K2203
61053A175134K4250K6042K7861K9645L1024L2024L3107L4448L5668L6364L6548
61042A522115L6487L6386L6357L6381L6191L5388L3886L2111L0593K9366K7979
61031A893240K6116K4081K2473K1490K0838K0269J9975K0248K1135K2494K4169
61020B136528K5847K7109K7966K9111L1347L4952L9863M6163N3987O3186P3504
61009B589563Q4856R7233J10802J26503J46060J70973K02173K41116K90221L51165
$$ plain form
61089 1251258 1220396 1189917 1160254 1131930 1105386 1080976 1058875 1039021 1021341 1005866 992460
61078 992460 980629 969986 960814 953866 949672 948206 949060 951695 955703 961068 967999 976323 985353 994686
61064 994686 1004837 1016650 1030320 1045412 1061584 1078690 1096389 1114338 1132873 1152931 1175134
61053 1175134 1199384 1225426 1253287 1282932 1313956 1345980 1379087 1413535 1449203 1485567 1522115
61042 1522115 1558602 1594988 1631345 1667726 1703917 1739305 1773191 1805302 1835895 1865261 1893240
61031 1893240 1919356 1943437 1965910 1987400 2008238 2028507 2048482 2068730 2089865 2112359 2136528
61020 2136528 2162375 2189484 2217450 2246561 2277908 2312860 2352723 2398886 2452873 2516059 2589563
61009 2589563 2674419 2771652 2882454 3008957 3155017 3325990 3528163 3769279 4059500 4410665
60999D410665M23857N08752O09226P29883Q73911J045103J249730J486347J726212
60990A3063686J908493J968180J878447J666821J389454J093506Q06943N55842
60982B4331372L73049K76302K39966K00140R6094r1974l43710o28089r24721j218994
60972B2309435j487520j696871j817512j838019j768480j634085j464944j287060
60964I314944j117391r63887q28333p09259o04290n12102m32885l66778l12288
60955C467731k66951k29123j98263j73716j54111j37973j24154j11642r9724q8552
60945A883522p8936p1351o5516o1053n7999n6362n5484n4250n1942m8791m5659
60934A236179m3162m1078l8669l5547l2008k8549k5407k2692k0580j9026j7610
$$ plain form
60999 4410665 4834522 5343274 5952500 6682383 7556294 8601397 9851127 11337474 13063686
60990 13063686 14972179 16940359 18818806 20485627 21875081 22968587 23775530 24331372
60982 24331372 24704421 24980723 25220689 25420829 25516923 25424949 25081239 24453150 23528429 22309435
60972 22309435 20821915 19125044 17307532 15469513 13701033 12066948 10602004 9314944
60964 9314944 8197553 7233666 6405333 5696074 5091784 4579682 4146797 3780019 3467731
60955 3467731 3200780 2971657 2773394 2599678 2445567 2307594 2183440 2071798 1972074 1883522
60945 1883522 1804586 1733235 1667719 1606666 1548667 1492305 1436821 1382571 1330629 1281838 1236179
60934 1236179 1193017 1151939 1113270 1077723 1045715 1017166 991759 969067 948487 929461 911851
60923I11851j5999j4366j3068j2080j1097r986q823p619o305m980l904l270l037
60910G97317k914k476j522m36M8l36j065j455j434j556k423m199o358p932q320
60895G54939p969p837q126q165p649p330p885q763q833p860o668n996n798n675
60881F50385n440n198n211n686o413o705o005m605l482l403m218n017m907l766
60867E80329k293j238o61j36M54Q66J132J665K586L473M026M383M589M388L898
60852F07461L766M193M371L580K293J532J564J855K029K071J834J117Q2r15j893
60837F34940l104m508n840o962p671p497o391n248n027n477n520m824m126l917
60823E58828l780l321k966l276m006m404m150l569l096k893l008l537m477n455
$$ plain form
60923 911851 895852 881486 868418 856338 845241 835255 826432 818813 812508 807528 803624 800354 797317
60910 797317 794403 791927 790405 789969 790017 789681 788616 787161 785727 784171 781748 777549 771191 763259 754939
60895 754939 746970 739133 731007 722842 715193 707863 699978 691215 682382 674522 667854 661858 656060 650385
60881 650385 644945 639747 634536 628850 622437 615732 609727 605122 601640 598237 594019 589002 584095 580329
60867 580329 578036 576798 576137 576001 576455 577321 578453 580118 582704 586177 590203 594586 599175 603563 607461
60852 607461 611227 615420 619791 623371 625664 627196 628760 630615 632644 634715 636549 637666 637748 636833 634940
60837 634940 631836 627328 621488 614526 606855 599358 592967 587719 582692 577215 571695 566871 562745 558828
60823 558828 555048 551727 548761 545485 541479 537075 532925 529356 526260 523367 520359 516822 512345 506890
60809E06890n812n121l706k475k077k349k650k586k260j938j734j506j040m87
60795D71149m95j470k677k729j277L77Q40L02nM74J135J337J112P92N26L55L36
60778D70082M32N81Q65J299J576J374Q53M70L79L81M02O06R91J219J010M58o9
60761D82909k30J4L63N00M81N64O50L23m02q94p92n66p81j239j390j202j050j051
60743D76207j043j002r89q78o67p72j504k524l256l604l797l891l862l834l680
60728D40904k874j402k29j66o59o76k92l68r29j037k44Q81J767K356K528K027
60712D41587J170P46R43J142J001R35J249J584J505J062N12Q1J22Q05J611J859
60696D57914J768K078K582K123M42j071j089L4R71J040M75k46o12j89Q27J569
$$ plain form
60809 506890 501078 495957 492251 489776 487699 485350 482700 480114 477854 475916 474182 472676 471636 471149
60795 471149 470654 469184 466507 463778 462501 462878 463718 464020 464015 464489 465624 466961 468073 468865 469391 469746 470082
60778 470082 470514 471095 471960 473259 474835 476209 477062 477532 477911 478292 478694 479300 480291 481510 482520 482978 482909
60761 482909 482679 482693 483056 483556 484037 484601 485251 485574 485172 484278 483486 482920 482139 480900 479510 478308 477258 476207
60743 476207 475164 474162 473173 472295 471628 470856 469352 466828 463572 459968 456171 452280 448418 444584 440904
60728 440904 438030 436628 436399 436233 435574 434898 434606 434238 433309 432272 432028 432909 434676 437032 439560 441587
60712 441587 442757 443503 444446 445588 446589 447524 448773 450357 451862 452924 453436 453517 453639 454444 456055 457914
60696 457914 459682 461760 464342 466465 466907 465836 464747 464781 465752 466792 467267 467021 466409 466220 467047 468616
60680D68616J543J335J658K251K310J708J090R16J006R80O75J91k59n20o95j011
60664D81794j481j921k315k761l039k835k371k256k422k047q12L96O89M31O46
60649D59696J532K285K194J356L75k16l33m18r72j868k442k380k032j620q45K56
60633D54568P61K6j101j166p8Q12O14l6j16L67O45L73r0l83n20n41k52M20J066
60614D55369J156P03K69K34L69K92K3j86l24m85m77n0N58P35K44n39j101j118
60596D55672m23P89J752J757J094P91J287J988K292K391K681L025L094K974K874
60581D84038K611J878Q27n7m78m52j18L12O59J131K228L959N515O160O243O836
60565E21292Q414J0339J1615J1892J1643J1546J1722J1604J0520Q387N699K951
$$ plain form
60680 468616 470159 471494 473152 475403 477713 479421 480511 481427 482433 483413 484088 484279 484020 483500 482805 481794
60664 481794 480313 478392 476077 473316 470277 467442 465071 462815 460393 458346 457534 457930 458619 459050 459696
60649 459696 461228 463513 465707 467063 467438 467222 466889 466471 465499 463631 461189 458809 456777 455157 454312 454568
60633 454568 455329 455355 454254 453088 453010 453822 454436 454400 454284 454651 455296 455669 455579 455196 454676 454135 453883 454303 455369
60614 455369 456525 457228 457497 457731 458100 458392 458415 458229 457905 457420 456943 456893 457451 458186 458430 457891 456790 455672
60596 455672 455249 456038 457790 459547 460641 461432 462719 464707 466999 469390 472071 475096 478190 481164 484038
60581 484038 486649 488527 489354 489297 488819 488367 488249 488561 489220 490351 492579 496538 502053 508213 514456 521292
60565 521292 529706 540045 551660 563552 575195 586741 598463 610067 620587 628974 634673 637624
60553F37624L70j865l548m636n176n051m195l052k295j968j369QJ906L815N619
60538F16187P436R291J1155J2980J4542J5684J6764J8291J9829J9973J7851J4163
60526G94146J0354P146M320J490j403m102o162p312p839q338q885q984q457p759
60512G48215p178o475n611n057m797l888j765P50K562L915N896Q782J1964J5227
60498G62540J9057K3628K8431L3000L7228M0887M3603M5485M7122M8665M9380
60487A179026M8328M5085L9772L2812K4856J6559Q139o79j0202k0293l0226l8880
60475A294297m5341m9571n2264n3797n3754n1841m8830m5828m2967l9503l5209
60464G75392l0797k6949k3653k0709j8236j6364j4876j3508j2307j1389j0559
$$ plain form
60553 637624 637994 636129 632581 627945 622769 617718 613523 610471 608176 606208 604839 604847 606753 610568 616187
60538 616187 623623 632914 644069 657049 671591 687275 704039 722330 742159 762132 779983 794146
60526 794146 804500 811646 815966 817456 816053 811951 805789 798477 790638 782300 773415 764431 755974 748215
60512 748215 741037 734562 728951 723894 719097 715209 713444 714194 716756 720671 726567 735349 747313 762540
60498 762540 781597 805225 833656 866656 903884 944771 988374 1033859 1080981 1129646 1179026
60487 1179026 1227354 1272439 1312211 1345023 1369879 1386438 1394577 1393898 1383696 1363403 1333177 1294297
60475 1294297 1248956 1199385 1147121 1093324 1039570 987729 938899 893071 850104 810601 775392
60464 775392 744595 717646 693993 673284 655048 638684 623808 610300 597993 586604 576045
60453E76045r466q046o623n619n130m814m264l551l217l517l978l948l365k662
60439E07845k116j709j467j452j480j261q45n81p03j169j891k667l037k610j565
60424D83292n28J16N11R51J519K107K535K628K401K128K009J862J345M94k40m25
60408E02705K8Q37J471J545J241J162J519J809J546R48N60N17O60R85J497J877
60392E20907J951K174K943L647L257J856P35Q27J708K414K526K239J882J792K220
60377E53078K976L447L239K578J850J123L83r3L5O77J335J616J578J541J687J852
60361E78902J787J572J575J880K071J802J394J492K251L257M118M761N124N120
60347F17106M929M918N077M893L989K649J500Q05K64n85j834l107l948m313m529
$$ plain form
60453 576045 566579 558533 551910 546291 541161 536347 532083 528532 525315 521798 517820 513872 510507 507845
60439 507845 505729 504020 502553 501101 499621 498360 497515 496934 496231 495062 493171 490504 487467 484857 483292
60424 483292 482764 482880 483391 484342 485861 487968 490503 493131 495532 497660 499669 501531 502876 503370 503130 502705
60408 502705 502733 503570 505041 506586 507827 508989 510508 512317 513863 514811 515371 515888 516548 517533 519030 520907
60392 520907 522858 525032 527975 531622 534879 536735 537470 538297 540005 542419 544945 547184 549066 550858 553078
60377 553078 556054 559501 562740 565318 567168 568291 568674 568581 568616 569293 570628 572244 573822 575363 577050 578902
60361 578902 580689 582261 583836 585716 587787 589589 590983 592475 594726 597983 602101 606862 611986 617106
60347 617106 622035 626953 632030 636923 640912 643561 645061 645866 646130 645545 643711 640604 636656 632343 627814
60332F27814m700m520l835l067k764k857k854k563k263k188k239k182j850j199
60318E88733m81j77l76l38Q00K885M776N586N563N683O706Q666J0873J2407J2965
60303F64271J3190J3857J4750J4874J3802J2217J0897R642P629M467N80l260o407
60290G70509q500r564j0029j0409j0857j1051j0616r635q629q026p759p531p351
60277F50552p455p777p862p457o775o026n196m470m302m599m417l116j438o71
60263E78991j005j526j655j669j767j542p40J86P31J005J331J620J594J333J152
60248E78039J106J021Q92Q54P65K07r07j903j898q08L93O87P9o22q63o96j79Q68
60230E77035K195L002K995K974L771N010N736N886O305P355Q415Q830Q709Q555
$$ plain form
60332 627814 623114 618594 614759 611692 608928 606071 603217 600654 598391 596203 593964 591782 589932 588733
60318 588733 588252 588075 587699 587361 588161 591046 595822 601408 606971 612654 619360 628026 638899 651306 664271
60303 664271 677461 691318 706068 720942 734744 746961 757858 767500 775129 779596 780176 776916 770509
60290 770509 762009 752445 742416 732007 721150 710099 699483 689848 681219 673193 665434 657903 650552
60277 650552 643097 635320 627458 620001 613226 607200 602004 597534 593232 588633 584216 581100 579662 578991
60263 578991 577986 576460 574805 573136 571369 569827 569087 569273 570004 571009 572340 573960 575554 576887 578039
60248 578039 579145 580166 581058 581912 582677 582884 581977 580074 578176 577368 577761 578448 578527 577905 577042 576346 576167 577035
60230 577035 579230 582232 585227 588201 591972 596982 602718 608604 614909 622264 630679 639509 648218 656773
60216F56773Q688R201J0000J0714J0940J0754J0667J0959J1350J1444J1173J0806
60204G83469J0614J0513R958Q416O129M042K693J561M4j488k289k539l136m350
60190H23637n604o581p633q909r887j0178j0109j0157j0290j0161r594q641p454
60177G08439o312n425m685l831k890k127j664j450j481j599j384p45l84r32j837
60162F71693j906q90K76Q31R34R59R71J050J389J794J780J430J431K043K719L001
60146F89505L042L098L195L585M695O310P599Q275Q933R794J0099R322Q201P793
60132G83446Q148Q586Q764Q756Q529Q068P621P251O504N119L674K967L014L275
60118H73722L487L654L553K932K091J621J565J323L09j543l859o042p612q596
$$ plain form
60216 656773 665461 674662 684662 695376 706316 717070 727737 738696 750046 761490 772663 783469
60204 783469 794083 804596 814554 822970 829099 833141 835834 837395 837439 835951 833662 831123 827987 823637
60190 823637 818033 811452 803819 794910 785023 774845 764736 754579 744289 734128 724534 715893 708439
60177 708439 702127 696702 692017 688186 685296 683169 681505 680055 678574 676975 675591 674846 674462 673530 671693
60162 671693 669787 668897 669173 670004 670938 671897 672868 673918 675307 677101 678881 680311 681742 683785 686504 689505
60146 689505 692547 695645 698840 702425 707120 713430 721029 729304 738237 748031 758130 767452 775653 783446
60132 783446 791594 800180 808944 817700 826229 834297 841918 849169 855673 860792 864466 867433 870447 873722
60118 873722 877209 880863 884416 887348 889439 891060 892625 893948 894257 892714 888855 882813 875201 866605
60104H66605r433j0282j0697j0309r462q813q567q476q284p743o500m483k298
60091G61258p34J15Q12J673K331K285J679J271J647K508K916K315J086j42j426
60076G79594l192n153o356o520o592p545r152j0386j0630j0018q963p865p055
60063F80167o515n783m465k881j836j796k392k781k363j240K6J111K236L590M794
60048F59872N403N719O527P920R064R281Q835Q432Q352Q289P749O462M686L081
60034G59672J939P65r85k979m489n524o666p896q571q647q874r586j0269j0582
60020F77308j0829j1122j1043j0579j0345j0455j0116q942p674o943o261n017
60008E67982l633k849k574k249j762j167k10J061J808J447P13Q61K129L723M915
$$ plain form
60104 866605 857172 846890 836193 825884 816422 807609 799042 790566 782282 774539 768039 763556 761258
60091 761258 760524 760639 761451 763124 765455 767740 769419 770690 772337 774845 777761 780076 781162 781020 779594
60076 779594 776402 771249 764893 758373 751781 744236 735084 724698 714068 704050 695087 687222 680167
60063 680167 673652 667869 663404 660523 658687 656891 654499 651718 649355 648115 648141 649252 651488 655078 659872
60048 659872 665275 670994 677521 685441 694505 703786 712621 721053 729405 737694 745443 751905 756591 759672
60034 759672 761611 762376 761391 758412 753923 748399 741733 733837 725266 716619 707745 698159 687890 677308
60020 677308 666479 655357 644314 633735 623390 612935 602819 593877 586203 579260 572999 567982
60008 567982 564349 561500 558926 556677 554915 553748 553538 554599 556407 557854 558567 559428 561557 565280 570195
59993E70195N416N184M574M318M675M976M605L933L601L477L074K433J756O36
59979F22853j345l691n476o475o972o859n856m409l426l164l063k610j744o37
59965E67126L73Q79R64J333K371L495L998L973L840L528K961K652K953L200K618
59950F06264J558R13P59O08N15P98J009L50j076k452l396l950l813k824j861j967
59934E91435k690k619j460k54N13J576L380N200O246O579O531O085N267M386L523
59919F33698K474J404Q29Q28R07Q36Q39J006J198J504K094K624K680K631L041
59904F58593L430K848J602J106J758K437K411K396L124M137M806N343N998O210
59890G06199N598M920N098N800O024N604N285N537O150O812P413P798P719P065
$$ plain form
59993 570195 575611 580795 585369 589687 594362 599338 603943 607876 611477 614954 618028 620461 622217 622853
59979 622853 621508 617817 612341 605866 598894 592035 586179 581770 578344 575180 572117 569507 567763 567126
59965 567126 567499 568378 569342 570675 573046 576541 580539 584512 588352 591880 594841 597493 600446 603646 606264
59950 606264 607822 608735 609494 610102 610617 611415 612424 612774 611698 609246 605850 601900 598087 595263 593402 591435
59934 591435 588745 586126 584666 584412 584925 586501 589881 595081 601327 607906 614437 620522 625789 630175 633698
59919 633698 636172 637576 638405 639233 640140 640976 641815 642821 644019 645523 647617 650241 652921 655552 658593
59904 658593 662023 664871 666473 667579 669337 671774 674185 676581 679705 683842 688648 693991 699989 706199
59890 706199 711797 716717 721815 727615 733639 739243 744528 750065 756215 763027 770440 778238 785957 793022
59876G93022N937M608L482K752J987M83j754l862n137n781o365p061p711q188
59862G66412q374q084p360o573o019n677n403n033m226k737r90J19K64J28O56
59847G07103K186M399O612Q035Q272P834P768Q598R871J0714J0474Q961O722N011
59833H12560M810N729O477O421N966N401M283K217m71l174n551p392q685r888
59819H18703j1490j3050j3504j2662j1602j1193j1072j0501r514q640q072p618
59807F89785o980n736l702j613p50j356k168k013j220q54j234j902k492k849k683
59792F52233j924j131r67j340j633j509j138q44r07j461k129k123j097L28J302
59777F35660J671J788J771J467R77P30J014J696K328K458K023J517J487J797J889
$$ plain form
59876 793022 798959 803567 807049 809801 811788 812271 810517 806655 801518 795737 789372 782311 774600 766412
59862 766412 758038 749954 742594 736021 730002 724325 718922 713889 709663 706926 705936 706055 706319 706447 707103
59847 707103 709289 713688 720300 728335 736607 744441 752209 760807 770678 781392 791866 800827 807549 812560
59833 812560 817370 823099 829576 835997 841963 847364 851647 853864 853393 850219 844668 837276 828591 818703
59819 818703 807213 794163 780659 767997 756395 745202 734130 723629 714115 705475 697403 689785
59807 689785 682805 677069 673367 671754 671004 669648 667480 665467 664247 663393 662159 660257 657765 654916 652233
59792 652233 650309 649178 648211 646871 645238 643729 642591 641747 640840 639379 637250 635127 634030 634358 635660
59777 635660 637331 639119 640890 642357 643334 644064 645078 646774 649102 651560 653583 655100 656587 658384 660273
59762F60273J768K130L296M688N706O500P393Q116Q252P971P746P634P417P185
59748G46075P245P510P566P252O827O552O340N833M733L145J592N28j64q57j456
59733H08721j469q26j09J81M4m35j301k244k511j790p10j25j91m97p67j048j443
59716G93480j927k358k554k491k369k224j768r79n24q90j382q66N81J795K225
59701G77749K429K789K965K869L030L496L570L186L321M338N100M614L441K538
59687H25435J691L14j058j434r55o09p23r89j614l173n320o853p188o954o928
59672G83642p127p158o884o456n991n345m192k472q27j13l13l94M60J947L256
59657G42033L926L838L073K250K259L110L733L450K782K226J244o23k561l568
$$ plain form
59762 660273 662041 664171 667467 672155 677861 684361 691754 699870 708122 716093 723839 731473 738890 746075
59748 746075 753320 760830 768396 775648 782475 789027 795367 801200 805933 809078 810670 811198 811034 810177 808721
59733 808721 807252 806426 806317 806498 806542 806107 804806 802562 800051 798261 797551 797426 797235 796738 795971 794923 793480
59716 793480 791553 789195 786641 784150 781781 779557 777789 776810 776286 775396 774014 773148 773729 775524 777749
59701 777749 780178 782967 785932 788801 791831 795327 798897 802083 805404 809742 814842 819456 822897 825435
59687 825435 827126 827440 826382 824948 823993 823384 822661 821672 820058 816885 811565 804712 797524 790570 783642
59672 783642 776515 769357 762473 756017 750026 744681 740489 738017 737190 737077 736764 736370 736830 738777 742033
59657 742033 745959 749797 752870 755120 757379 760489 764222 767672 770454 772680 773924 773301 770740 767172
59643G67172m047n041o471p318p252o820o304n511m579l910l435k865k467k627
59629F98525k873k474j805j983l159m308m761m897n147n354n333n164m725l740
59615F42802k448j534j210j115j062j107r25mJ395K401K731K847K866K365J456
59600F49458R72J190J302P10m4k37r9k87p95j071q57l66Q7K21j34p44j049q75
59582F47382p59j214k000k478k439k224k144k183k152j956j653j392j252j133
59568F22403r05o13l86j68K16P53J147J099O04kk47O7N91P74N61M04M81L74j39
59549F27014m67J08J435K746L651M354N110N996P203R030J1508J4260J6610J7724
59535G26282J7003J4669J1664Q760O079L699K034J214P28K35J28O42J107Q79L29
$$ plain form
59643 767172 763125 758084 751613 744295 737043 730223 723919 718408 713829 709919 706484 703619 701152 698525
59629 698525 695652 693178 691373 689390 686231 681923 677162 672265 667118 661764 656431 651267 646542 642802
59615 642802 640354 638820 637610 636495 635433 634326 633401 633397 634792 637193 639924 642771 645637 648002 649458
59600 649458 650430 651620 652922 653632 653588 653351 653252 652965 652170 651099 650242 649876 649963 650184 650050 649306 648257 647382
59582 647382 646623 645409 643409 640931 638492 636268 634124 631941 629789 627833 626180 624788 623536 622403
59568 622403 621498 620885 620499 620331 620547 621300 622447 623546 624150 624148 623901 623968 624559 625333 625894 626298 626779 627153 627014
59549 627014 626547 626655 628090 630836 634487 638841 643951 649947 657150 666180 677688 691948 708558 726282
59535 726282 743285 757954 769618 778378 784457 788156 790190 791404 792132 792367 792495 793137 794244 795123 795452
59520G95452N9k53j211k501l508m637o647r035j0465j0756j0946j1389j1225j0048
59506G02890q693p902p316o351n050l646k171r35n04q12j085r86r26r82n87K96
59490F55240Q69Q92J253K464L618L839L724M279N173N328M738M466N032N885O497
59475G13297P000P576P989P984P606O935N938M683L446K425J584Q73L77K87P62
59460G78762J828L332N025O742Q307R382R682R428R227R314R257Q580P381O043
59446H82290M600K725K89k353m638o317p644r054j0548j1547j1474j0387q826
59433H07116p224n773m612l693k577q71J162K891M260N892Q186J0816J3266J5419
59419H44258J7401J9189K0708K2116K3796K6020K8408K9561K7727K2473J5448
$$ plain form
59520 795452 795511 795258 794047 791546 788038 783401 776754 767719 757254 746498 735552 724163 712938 702890
59506 702890 694197 686295 678979 672628 667578 663932 661761 660826 660322 659510 658425 657439 656513 655531 654944 655240
59490 655240 656109 657001 658254 660718 664336 668175 671899 676178 681351 686679 691417 695883 700915 706800 713297
59475 713297 720297 727873 735862 743846 751452 758387 764325 769008 772454 774879 776463 777336 777713 778000 778762
59460 778762 780590 783922 788947 795689 803996 813378 823060 832488 841715 851029 860286 868866 876247 882290
59446 882290 886890 889615 889904 887551 882913 876596 868952 859898 849350 837803 826329 815942 807116
59433 807116 799892 794119 789507 785814 783237 782366 783528 786419 790679 796571 804757 815573 828839 844258
59419 844258 861659 880848 901556 923672 947468 973488 1001896 1031457 1059184 1081657 1097105
59408A097105Q802L057k737q853j3943j6380j5640j2028o235J34M548N224K715
59395A045769r27m334p618j1229j4904j7864j9520j9684j8505j6420j4009j1679
59383H89076r580p805o541n831n328m553l460k585k408k710k803k313j477o72
59369H31010n5L42N89R85J815K873L702M383N412O735P747Q527J0021J2430J4471
59354I10987J5132J5245J6214J7966J9430K0401K1420K2319K2425K2009K1923
59343A125471K1756K0029J6422J2324Q692M920M19m115p872j1171j4557j7626
59331A154692j9767k1349k3069k4663k5237k4600k3430k2301k1222k0031j8654
59320I10369j7038j5175j3232j1507j0348j0027j0363j0557r896q610p498o775
$$ plain form
59408 1097105 1105907 1108964 1106227 1097374 1083431 1067051 1051411 1039383 1033148 1033282 1037830 1043054 1045769
59395 1045769 1044842 1040508 1032890 1021661 1006757 988893 969373 949689 931184 914764 900755 889076
59383 889076 879496 871691 865150 859319 853991 849438 845978 843393 840985 838275 835472 833159 831682 831010
59369 831010 830955 831297 831886 832871 834686 837559 841261 845644 851056 857791 865538 874065 884086 896516 910987
59354 910987 926119 941364 957578 975544 994974 1015375 1036795 1059114 1081539 1103548 1125471
59343 1125471 1147227 1167256 1183678 1196002 1204694 1209614 1210033 1205918 1198046 1186875 1172318 1154692
59331 1154692 1134925 1113576 1090507 1065844 1040607 1016007 992577 970276 949054 929023 910369
59320 910369 893331 878156 864924 853417 843069 833042 822679 812122 802226 793616 786118 779343
59308G79343n949m920m289m380m688m640m177l340j956j16J693L247M807O486
59294G57121Q109R851J2072J4159J4623J2867J0013P260M371O54l308o066p047
59281H34679o878o120m564j901J537M892P470R313J1093J3236J5142J5911J5721
59268I09531J5700J6148J5799J3493R867O578M304K301l29l660p090r858j1449
59255I61335j1926j1835j1593j1065r937q264o468n005m089l436k279j05K570
59242H77903M655N796O596P514Q301Q738R106R443R094P546N163K565j82l234
59228I59004o309q939j1053j2832j4240j5108j5393j5123j4404j3674j3506j3830
59216H04593j3750j2406r792o701m223l202l571m216m112l480l164l065k281o64
$$ plain form
59308 779343 773394 768474 764185 759805 755117 750477 746300 742960 741004 740888 742581 745828 750635 757121
59294 757121 765230 775081 787153 801312 815935 828802 838815 846075 850446 851100 847792 841726 834679
59281 834679 827801 821681 817117 815216 816753 821645 829115 838428 849521 862757 877899 893810 909531
59268 909531 925231 941379 957178 970671 980538 987116 991420 993721 993392 989732 982642 972784 961335
59255 961335 949409 937574 925981 914916 904979 896715 890247 885242 881153 877717 875438 875333 877903
59242 877903 882558 888354 894950 902464 910765 919503 928609 938052 947146 954692 959855 962420 962238 959004
59228 959004 952695 943756 932703 919871 905631 890523 875130 860007 845603 831929 818423 804593
59216 804593 790843 778437 768645 761944 757721 754519 750948 746732 742620 739140 735976 732911 730630 729966
59202G29966R54K202L459M525M411L091J993K053K511K456K255K537K967L134
59188G68514L452M063L959K602J326J627K847L208K503K077K521L038L060K934
59174H07731K893K681K371K488L110L754M271M920N475N285M345L392K687J573
59160H56976m20k757m639o062p663r718j1630j2466j2071j1490j1932j3266j4087
59147G38775j3461j1972j0670r748q816p865p164o674o209n840n491m658l226
59134F36981k042j869k160j738m06J018J979K666L285L743M059M518N299O369
59120F61702P621Q884J0008J1211J2850J4585J5391J4911J4079J3841J3896J3499
59108H12478J2742J2136J1499J0276Q652P281O096M363J820r19l099m423n054
$$ plain form
59202 729966 730920 733122 736581 741106 745517 748608 750601 752654 755165 757621 759876 762413 765380 768514
59188 768514 771966 776029 779988 782590 783916 785543 788390 791598 794101 796178 798699 801737 804797 807731
59174 807731 810624 813305 815676 818164 821274 825028 829299 834219 839694 844979 849324 852716 855403 856976
59160 856976 856556 853799 849160 843098 835435 825717 814087 801621 789550 778060 766128 752862 738775
59147 738775 725314 713342 702672 692924 684108 676243 669079 662405 656196 650356 644865 640207 636981
59134 636981 634939 633070 630910 629172 628766 629784 631763 634429 637714 641457 645516 650034 655333 661702
59120 661702 669323 678207 688215 699426 712276 726861 742252 757163 771242 785083 798979 812478
59108 812478 825220 837356 848855 859131 867783 875064 881160 885523 887343 886424 883325 878902 873848
59095H73848n432n812n758m625k830j782k034k470k110j692k406l971n233n958
59081H21735o756p721q468r094r868j0343r969r197q756q296p075n537m757m624
59067G11274m080l037k478k664k821k748l166m149m549l555j764k56M29J75q44
59052F75767j850j922j102l29j47k96n49r55j181p41m2j06r34j283m54P17J167
59035F65760J025J070J560K232K939L754M770O099P814R710J1497J3162J4703
59022G46095J5600J5180J3600J1770J0236Q628O455L843J350o26k069l246m330
59009H22486n004m695l360j678k03J096K211K834L216M278O161P642P959Q097
58995H51040Q964R342P479M058J605J159J378R71J39o84j728k945l528l088k210
$$ plain form
59095 873848 868416 862604 856846 852221 849391 847609 845575 843105 840995 839303 836897 832926 827693 821735
59081 821735 814979 807258 798790 789696 779828 769485 759516 750319 741563 733267 726192 720655 715898 711274
59067 711274 707194 704157 701679 699015 696194 693446 690280 686131 681582 678027 676263 676007 676436 676611 675767
59052 675767 673917 671995 670893 670564 670417 670121 669572 668617 667436 666695 666653 666547 665613 664330 663876 664593 665760
59035 665760 666785 667855 669415 671647 674586 678340 683110 689209 697023 706733 718230 731392 746095
59022 746095 761695 776875 790475 802245 812481 821109 827564 831407 832757 832131 830062 826816 822486
59009 822486 817482 812787 809427 807749 807546 808642 810853 813687 816903 821181 827342 834984 842943 851040
58995 851040 860004 869346 876825 880883 882488 883647 885025 885996 886135 885451 883723 880778 877250 874162 871952
58980H71952j385l88Q75J958K717L677N184O974Q793J0621J2090J2615J2371J2300
58966I60354J2920J3832J4446J4507J3808J2255J0200Q012N447K232j102l947
58954A062964o773j0355j4138j6725j7836j8395j8828j8805j8571j8823j9090
58943H84625j7905j5073j2170j0256q608o341l942k373j783j787k065k126j481
58930G98715n77n83j819l220l752l431k689j773j107j191j776k074j974j998j960
58915G68791r93Q50K356K913L251L958M636N026N728P163Q896J0547J2305J4095
58901H49522J5402J6308J7496J8817J9175J8404J7918J8763K0258K1311K1928
58890A055302K2619K3386K4041K4664K5096K4772K3519K1655J9015J5016R944
$$ plain form
58980 871952 870567 870179 871054 873012 875729 879406 884590 891564 900357 910978 923068 935683 948054 960354
58966 960354 973274 987106 1001552 1016059 1029867 1042122 1052322 1060334 1065781 1068013 1066911 1062964
58954 1062964 1056191 1045836 1031698 1014973 997137 978742 959914 941109 922538 903715 884625
58943 884625 866720 851647 839477 829221 820613 814272 810330 807957 806174 804387 802322 800196 798715
58930 798715 798138 797555 795736 792516 788764 785333 782644 780871 779764 778573 776797 774723 772749 770751 768791
58915 768791 767798 768648 771004 773917 777168 781126 785762 790788 796516 803679 812575 823122 835427 849522
58901 849522 864924 881232 898728 917545 936720 955124 973042 991805 1012063 1033374 1055302
58890 1055302 1077921 1101307 1125348 1150012 1175108 1199880 1223399 1245054 1264069 1279085 1289029
58879A289029M974N15m099q879j2631j4779j6267j7881j9004j8896j7986j7007
58867A147089j6035j5045j4392j4016j3358j2583j2575j3165j2973j1690j0910
58856A000347j1627j2535j2020j0473r365r186r617j0565j1778j2328j1789j1095
58844H67969j1231j1891j2315j2480j2524j2089j1170j0582j0588j0166q580o634
58832G37719n352m564l772l193k851j877L8J648J913J663K193L287L968M185M364
58817G39369M251L595L179L689M352M003K833J779R54j6q62j168j381k062k733
58802G59782k738k531k952l846m545n042n599n853n480n012m955m765l780k407
58788G00277j318k95J059K283K911L473M560N713O325O785P548Q044P655O762
$$ plain form
58879 1289029 1294003 1294518 1290419 1281540 1268909 1254130 1237863 1219982 1200978 1182082 1164096 1147089
58867 1147089 1131054 1116009 1101617 1087601 1074243 1061660 1049085 1035920 1022947 1011257 1000347
58856 1000347 988720 976185 964165 953692 944327 935141 925524 914959 903181 890853 879064 867969
58844 867969 856738 844847 832532 820052 807528 795439 784269 773687 763099 752933 744353 737719
58832 737719 732367 727803 724031 720838 717987 716110 716148 717796 719709 721372 723565 726852 730820 735005 739369
58817 739369 743620 747215 750394 754083 758435 762438 765271 767050 768004 767988 767126 765958 764577 762515 759782
58802 759782 757044 754513 751561 747715 743170 738128 732529 726676 721196 716184 711229 706464 702684 700277
58788 700277 698959 698664 699723 702006 704917 708390 712950 718663 724988 731773 739321 747365 755020 761782
58774G61782N675L702N74k373l996n150p083r106r679q903q075p522o709n848
58760F97289n533n280m213k739j896j482n36P19J193Q33N72O74P03Q65J824L396
58744F86389M794N928P123P964P858P291P167P262O810O104O099O752P262P529
58730G82332P940Q193P738P018O782O716O102N372N386N794N658N160N102N329
58716H70622N357N830P418Q751P664M254P85j407k951m558o063p511r363j1431
58702H67397j3104j4650j6739j8867j9847j9765j9706j9732j8895j7151j5404
58691F73537j3644j1070q127o474o530o894o616o250o276o120n446m889m827m658
58677E75716l785k300m43J622L301M086M582N925Q136J0258J1985J3794J5527
$$ plain form
58774 761782 767457 771159 771733 769360 765364 760214 753131 744025 734346 725443 717368 709846 703137 697289
58760 697289 691756 686476 682263 679524 677628 676146 675610 676329 677522 678355 678927 679601 680304 681169 682993 686389
58744 686389 691183 697111 704234 712198 720056 727347 734514 741776 748586 754690 760789 767541 774803 782332
58730 782332 790272 798465 806203 813221 820003 826719 832821 838193 843579 849373 855031 860191 865293 870622
58716 870622 875979 881809 889227 897978 905642 909896 910681 909274 906323 901765 895702 888191 878828 867397
58702 867397 854293 839643 822904 804037 784190 764425 744719 724987 706092 688941 673537
58691 673537 659893 648823 640696 634222 627692 620798 614182 607932 601656 595536 590090 585201 580374 575716
58677 575716 571931 569631 569188 570810 574111 578197 582779 588704 596840 607098 619083 632877 648404
58664F48404J6344J6136J5565J4573J2268Q495M193P4l844p321r860j1635j3181
58651F90211j4138j3647j1945j0265r149q104o904n832m702l048j269k34J92Q88
58637F02054J828K140J775J562J635J284M34k07n41j222k279k894k710k161j481
58622E99217n31N58J602K983M910O608P378P840Q758R489R118Q274P907P255N155
58607F86521K554J329J216N07p41r85m15r13k657l637l028k323k500k578j765
58592F70585o44M81K218M406N916O847Q632J1403J3431J3920J4104J4713J4685
58579G80697J3416J2114J1688J1215R750Q083P521Q314J0111J2593J5088J7042
58567I17632J9328K3413K8767L2975L4922L5932L7063L7285L5251L1082K5517
$$ plain form
58664 648404 664748 680884 696449 711022 723290 731785 735978 736052 732208 724887 715027 703392 690211
58651 690211 676073 662426 650481 640216 631067 622963 616059 610227 605525 602477 601208 600974 601166 602054
58637 602054 603882 606022 607797 609359 610994 612278 612712 612505 611964 610742 608463 605569 602859 600698 599217
58622 599217 598686 599244 600846 603829 608739 615347 622725 630565 639323 648812 657930 666204 674111 681366 686521
58607 686521 689075 690404 691620 692127 691386 690401 689986 689073 686416 682779 679751 677428 674928 672350 670585
58592 670585 669941 670422 672640 677046 682962 689809 698441 709844 723275 737195 751299 766012 780697
58579 780697 794113 806227 817915 829130 838880 846963 854484 862798 872909 885502 900590 917632
58567 917632 936960 960373 989140 1022115 1057037 1092969 1130032 1167317 1202568 1233650 1259167
58556A259167J8910J1991O007J360k591n890p700p980p765p424o464n415n911
58543A240295q406j1651j4907j8684k2857k6223k8442l0301l1618l1096k8805
58532I87305k6487k4698k2134j8539j5698j4484j3346j0986q294o376m817l184
58520H18262k188k164k297k333l086m292m293k960k471l810m888l802j772j034
58506G76872j656k257k272j890j115l59o20j895k741k365j642j238m95Q86J939
58491G59152K238K887M661O809Q590J0294J2065J3473J4861J7169J9957K1704
58479H93860K2493K3793K5134K3918J9410J4006R457M801p06n700r257j2416j5507
58466I93286j6871j5877j4337j3134j0443n335j16L189N887R734J3655J5935J7192
$$ plain form
58556 1259167 1278077 1290068 1296075 1297435 1294844 1288954 1281254 1273274 1265509 1258085 1251621 1246206 1240295
58543 1240295 1231889 1220238 1205331 1186647 1163790 1137567 1109125 1078824 1047206 1016110 987305
58532 987305 960818 936120 913986 895447 879749 865265 851919 840933 832639 826263 821446 818262
58520 818262 816074 813910 811613 809280 806194 801902 797609 794649 792178 788368 783480 779678 777906 776872
58506 776872 775216 772959 770687 768797 767682 767323 766703 764808 762067 759702 758060 756822 756327 757213 759152
58491 759152 761390 764277 768938 775747 784337 794631 806696 820169 835030 852199 872156 893860
58479 893860 916353 940146 965280 989198 1008608 1022614 1032071 1036872 1036166 1030466 1021209 1008793 993286
58466 993286 976415 960538 946201 933067 922624 917289 917173 920362 926249 935983 949638 965573 982765
58453I82765J8497J8705J6333J2222P892L079k762q370j2375j5365j8169j9863
58441I82589j9497j7994j6380j4043j0643p678o164m801k373J15J642L192N580
58428H93545P569Q283R138J1145J2640J1989J0200Q567O098J877k417m963o661
58415I67010r016j1243j2043j2126j2539j2544j1552j0978j1750j2200j0832q881
58403H31306p754o404l833j583j020o85R07K369K278K192L807N623N674N060N485
58388H43422N786M295K326J824J743K01j961l155m268o389p617n769k341j64R74
58373H28907K928N457P287Q960J1308J3146J3628J4559J7157J9177J8668J7715
58361I78897J8691J9708J7984J4886J3203J2003Q860M833K444R69j589l936l761
$$ plain form
58453 982765 1001262 1019967 1036300 1048522 1056414 1059493 1056731 1048361 1035986 1020621 1002452 982589
58441 982589 963092 945098 928718 914675 904032 896354 890190 885389 883016 883131 884773 887965 893545
58428 893545 901114 909397 918535 929680 942320 954309 964509 973076 979174 981051 978634 973671 967010
58415 967010 957994 946751 934708 922582 910043 897499 885947 874969 863219 851019 840187 831306
58403 831306 823552 817148 813315 811732 810712 810027 810934 813303 815581 817773 821580 827203 832877 837937 843422
58388 843422 849208 853503 855829 857653 859396 859597 857636 854481 850213 843824 836207 830438 828097 827933 828907
58373 828907 831835 837292 844579 853539 864847 877993 891621 906180 923337 942514 961182 978897
58361 978897 997588 1017296 1035280 1050166 1063369 1075372 1084232 1089065 1091509 1092478 1090889 1086953 1083192
58348A083192k508k982l999k436J047L263M050N795Q685J1014J2904J5371J7160
58335A150556J6800J6193J7854K0281K0303J8167J6028J3569R627N968M699M127
58323A314172J790p69j019n44j925l262j423J849K798K220L287N337N866O280
58309A334657R272J2769J3041J1692J2900J5775J6258J4795J5088J6890J7038
58298A490175J6120J7211J9401J9432J8207J8887K0264J9148J7398J9156K2857
58287A698256K3697K2242K2858K5181K5285K3789K4584K6925K6945K5592K6697
58276A972051K8877K7996K6028K8325L3565L5885L5644L8338M3909M7140M7891
58265B365649N0810N5528N7226N6408N7959O1107O0730N7859N8192O0919O0174
$$ plain form
58348 1083192 1080684 1077702 1073703 1071267 1072314 1075577 1079627 1085422 1094107 1105121 1118025 1133396 1150556
58335 1150556 1167356 1183549 1201403 1221684 1241987 1260154 1276182 1289751 1299378 1305346 1310045 1314172
58323 1314172 1315962 1315193 1314174 1313630 1311705 1308443 1307020 1308869 1311667 1313887 1317174 1322511 1328377 1334657
58309 1334657 1343929 1356698 1369739 1381431 1394331 1410106 1426364 1441159 1456247 1473137 1490175
58298 1490175 1506295 1523506 1542907 1562339 1580546 1599433 1619697 1638845 1656243 1675399 1698256
58287 1698256 1721953 1744195 1767053 1792234 1817519 1841308 1865892 1892817 1919762 1945354 1972051
58276 1972051 2000928 2028924 2054952 2083277 2116842 2152727 2188371 2226709 2270618 2317758 2365649
58265 2365649 2416459 2471987 2529213 2585621 2643580 2704687 2765417 2823276 2881468 2942387 3002561
58254C002561N6918N7769O2486O4600O4169O7645P5059P9882Q1772Q6816R4952
58243C794629J00142J03064J10233J20404J26026J28219J35690J48367J57469
58234D924243J62428J71680J85829J96616K04031K17172K36438K52505K64944
58225F815886K83635L09559L33078L53570L81212M16881M50729M83113N25538
58216A0353201N78475O30983O84597P53210Q37052R23240J014594J129186J268840
58207A8173378J419875J588516J801022K065085K370433K733528L199387L793389
58199C7144613M519396N411657O530969P900237R512593J1419817J3736811J6545833
58191A12721926J9891966K3848527K8319695L2568016L5114406L4502673L0347006
$$ plain form
58254 3002561 3059479 3117248 3179734 3244334 3308503 3376148 3451207 3531089 3612861 3699677 3794629
58243 3794629 3894771 3997835 4108068 4228472 4354498 4482717 4618407 4766774 4924243
58234 4924243 5086671 5258351 5444180 5640796 5844827 6061999 6298437 6550942 6815886
58225 6815886 7099521 7409080 7742158 8095728 8476940 8893821 9344550 9827663 10353201
58216 10353201 10931676 11562659 12247256 13000466 13837518 14760758 15775352 16904538 18173378
58207 18173378 19593253 21181769 22982791 25047876 27418309 30151837 33351224 37144613
58199 37144613 41664009 47075666 53606635 61506872 71019465 82439282 96176093 112721926
58191 112721926 132613892 156462419 184782114 217350130 252464536 286967209 317314215
58184C17314215K3545208J5443969O934445j634254r936255j7329583k3012354
58177C11325391k6394868k7372800k6392199k4264733k1789222j9441434j7369098
58170A48301037j5591900j4119267j2914782j1872958j0886158r899018q891849
58163F4125105p863963o851016n914818n092022m376153l754370l228458k791287
58155B4253018k416762k087557j807748j577854j381884j208716j063153r46237
58147A1763107q45570p54118o78576o20687n68907n16605m70769m35022m01007
58138F471846l64052l31070l05509k79971k51020k26575k11259j98275j82733
58129D121382j69861j63220j57346j48651j41673j38393j32889j22514j13218
$$ plain form
58184 317314215 340859423 356303392 363237837 361603583 351667328 334337745 311325391
58177 311325391 284930523 257557723 231165524 206900791 185111569 165670135 148301037
58170 148301037 132709137 118589870 105675088 93802130 82915972 73016954 64125105
58163 64125105 56261142 49410126 43495308 38403286 34027133 30272763 27044305 24253018
58155 24253018 21836256 19748699 17940951 16363097 14981213 13772497 12709344 11763107
58147 11763107 10917537 10163419 9484843 8864156 8295249 7778644 7307875 6872853 6471846
58138 6471846 6107794 5776724 5471215 5191244 4940224 4713649 4502390 4304115 4121382
58129 4121382 3951521 3788301 3630955 3482304 3340631 3202238 3069349 2946835 2833617
58120B833617j08141j02009r2251q4645q2203p9161p1836o5260o3195o1365n6492
58109A967059n2612n2586n2274m8851m6263m7046m7041m3661m1139m2231m2704
58098A450651l9409l6100l5898l5492l2149k9217k9353k9179k5893k2578k1935
58087A113448k1240j8381j6529j7880j8993j7216j5640j6973j8431j7478j6761
58076I17926j8466j9568j7597j5632j6587j7764j6075j3651j3385j3572j1854
58065G43775j0005j0106j0155q011n731n725o468n951n531o541p049n720m898
58052F51884o259p402o374n419o569p679o628n406o136o952n740m239m552n210
58038E67319m498m038n351o421n432m401n394o658o232n830p319q779q038o844
$$ plain form
58120 2833617 2725476 2623467 2531216 2446571 2364368 2285207 2213371 2148111 2084916 2023551 1967059
58109 1967059 1914447 1861861 1809587 1760736 1714473 1667427 1620386 1576725 1535586 1493355 1450651
58098 1450651 1411242 1375142 1339244 1303752 1271603 1242386 1213033 1183854 1157961 1135383 1113448
58087 1113448 1092208 1073827 1057298 1039418 1020425 1003209 987569 970596 952165 934687 917926
58076 917926 899460 879892 862295 846663 830076 812312 796237 782586 769201 755629 743775
58065 743775 733770 723664 713509 705498 699767 694042 687574 681623 676092 669551 662502 656782 651884
58052 651884 645625 638223 631849 626430 619861 612182 605554 600148 594012 587060 581320 577081 572529 567319
58038 567319 562821 558783 553432 547011 541579 537178 531784 525126 518894 513064 505745 496966 488928 482084
58024D82084p493q418p173m923m059m051l419l155m398n340m111k247j910k108
58010D19279j148j13m52p37O16J951J259J0N18J844J899J350J831K406J350n19
57994D31344j566k462m365o016n887n162n512n971n082l949l972l891k320r90
57980C74199j930l630l532k308k042k132p66J125J283J40j42N23P04O01J392K433
57964C65918K244J336J175J438R76K56J80j01j582l037k978k347k568k720j526
57949C56664l16p70j548n23J246J388N91J369L600N012N280N986P191P646P879
57934D00695R564J2092J3029J1924J0609R798Q310N673K830K20k543n127o752
57921D70322p740q830r541r190q668r118r765r268q195p768p302n464l064j883
$$ plain form
58024 482084 474591 466173 459000 454077 450018 445967 442548 439393 434995 429655 425544 423297 421387 419279
58010 419279 418131 418018 417566 416829 417445 419396 420655 420665 421183 423027 424926 426276 428107 430513 431863 431344
57994 431344 429778 427316 422951 416935 411048 405886 400374 394403 389321 385372 381400 377509 375189 374199
57980 374199 372269 368639 365107 362799 360757 358625 357859 358984 360267 360407 360265 360788 361492 362093 363485 365918
57964 365918 368162 369498 370673 372111 373087 373343 373523 373422 371840 368803 365825 363478 360910 358190 356664
57949 356664 356348 355578 354030 353507 354753 356141 356732 358101 361701 366713 371993 377979 385170 392816 400695
57934 400695 410259 422351 435380 447304 457913 467711 476021 481694 484524 484744 482201 477074 470322
57921 470322 462582 453752 444211 435021 426353 417235 407470 398202 390007 382239 374937 369473 366409 364526
57907C64526j603o66O84J001N26O49J087M40r71j562j283j244j065N39K972M317
57891C68347M446M907N933O208N516N011M975M678M258M409M465L108P99q36j592
57876D24632k426l169k985k595l357m590m470l266k891l499l383k205j423j360
57862C83013o79R38K193K594L047L683L561K855L004M313N508N936O181O334N803
57847D38284M854M233L416J445o67r25K91N40q80k132k177k135k744l057k491
57832D35855j919j891j794j409j378j695j689j717k725l934l428j401l64j443
57818D09068k998l565l763m392m942n085n458n990n481l902l038l789m838n043
57804C46784n212o198p155p066o420o056n701m930m286m208m038l132k033j517
$$ plain form
57907 364526 362923 362257 362941 363942 364468 365117 366204 366644 365673 364111 362828 361584 360519 361058 364030 368347
57891 368347 372793 377700 383633 389841 395357 400368 405343 410021 414279 418688 423153 426261 427060 426224 424632
57876 424632 422206 419037 416052 413457 410100 405510 401040 397774 394883 391384 388001 385796 384373 383013
57862 383013 382334 383272 385465 388059 391106 394789 398350 401205 404209 408522 414030 419966 426147 432481 438284
57847 438284 443138 447371 450787 452232 451565 450640 450931 451471 450591 448459 446282 444147 441403 438346 435855
57832 435855 433936 432045 430251 428842 427464 425769 424080 422363 419638 415704 412276 410875 410511 409068
57818 409068 406070 402505 398742 394350 389408 384323 378865 372875 367394 363492 360454 356665 351827 346784
57804 346784 341572 335374 328219 321153 314733 308677 302976 298046 293760 289552 285514 282382 280349 278832
57790B78832j431j231p95o2J163K616L691M466N571O887P619P802Q285R030Q931
57775C41374P732O560O165O035N664N282M943M239L225K280R72j329l717m425
57761C85000l456k633k800k995k731k811l292k907j440n18j024j705j506j292
57747C53890j916k448j861r48r81j733k234k373k485k344j715j033o46k72M9l65
57731C30585j488k152j696r40o76m80J75Q90J210J394J533J226P57J234K738L746
57715C38056L278K250J815J760J470J074P05r9j272j887j791k061l015l384k513
57700C34386j636j739j924j392j271k618m168m100k937k560l269l840l860m022
57686B95050m401m224l316k314j499n74O06K046M102P061J0560J4241J8429K3407
$$ plain form
57790 278832 277401 276170 275375 275313 276476 279092 282783 287249 292820 299707 307326 315128 323413 332443 341374
57775 341374 349106 355666 361831 367866 373530 378812 383755 387994 391219 393499 394471 393142 389425 385000
57761 385000 381544 378911 376111 373116 370385 367574 364282 361375 359935 359417 358393 356688 355182 353890
57747 353890 351974 349526 347665 346717 345736 344003 341769 339396 336911 334567 332852 331819 331173 330901 330950 330585
57731 330585 329097 326945 325249 324309 323633 323153 323328 324218 325428 326822 328355 329581 330338 331572 334310 338056
57715 338056 341334 343584 345399 347159 348629 349703 350408 350309 349037 347150 345359 343298 340283 336899 334386
57700 334386 332750 331011 329087 327695 326424 323806 319638 315538 312601 310041 306772 302932 299072 295050
57686 295050 290649 286425 283109 280795 279296 278722 279328 281374 285476 292537 303097 317338 335767 359174
57672C59174K8644L3724L9413M6749N5384O3441O8464O8056O0695M7027K9702
57661I00473J1145p791k6327m2222n3090n8514n9705n7837n3774m8644m3291l7614
57649D22809l1510k5860k1608j8499j5768j3366j1511r769p803o289n873n804
57637B49149m901l334k225j910j858j801j800j466m28O72P59k31j372k021k229
57622B25004k215k178k374k711k621j951j393j426j604j461j261j147o31J72R8
57607B02301j205k135j354N5K76m42n69n4j04p73r41n92r20j997k410j645j047
57590A86444j681k813l295l143k933k698k236j754j512j388j210j120j253j552
57576A57856k007k607k986k762k253k257k921l484l235k319j404r91j127j462
$$ plain form
57672 359174 387818 421542 460955 507704 563088 626529 694993 763049 823744 870771 900473
57661 900473 911618 903827 877500 835278 782188 723674 663969 606132 552358 503714 460423 422809
57649 422809 391299 365439 343831 325332 309564 296198 284687 274918 267115 260826 254953 249149
57637 249149 244248 240914 238689 236779 234921 233120 231320 229854 229426 230098 230857 230626 229254 227233 225004
57622 225004 222789 220611 218237 215526 212905 210954 209561 208135 206531 205070 203809 202662 202031 202203 202301
57607 202301 201096 198961 197607 197662 197938 197496 196927 196873 196769 195996 195055 194463 193543 191546 189136 187491 186444
57590 186444 184763 181950 178655 175512 172579 169881 167645 165891 164379 162991 161781 160661 159408 157856
57576 157856 155849 153242 150256 147494 145241 142984 140063 136579 133344 131025 129621 128630 127503 126041
57562A26041j526j159n95m5M74P88O15K42M15J171J524R56L38N69J180J253J021
57545A33262J342K148K616K551K445K373J989J372R15N46Pm31m67o01j397k301
57529A46369k350j717j258q97P7J270J291j53j683k099j582p57K57J329J916J861
57513A41874J790K200K736K820K473K110J935J845J703J514J530J938K299J708
57499A70475J9j587j969j445j083j135j140j205j845k772l043k561k224k463k619
57484A43403k067j055j74L01L28jl79n60p16r39p42J85J130J114K66n19j045j789
57466A36741k637k756j881n99N83J502J781J136K62K01Q06R60M19J31N50R90J029
57449A39218J272K118K860K735K006J417J261J409J661J685J269Q40J071J781
$$ plain form
57562 126041 124515 123356 122761 122716 123190 123978 124593 124835 125250 126421 127945 128901 129239 129808 130988 132241 133262
57545 133262 134604 136752 139368 141919 144364 146737 148726 150098 151013 151559 151566 151135 150668 150067 148670 146369
57529 146369 144019 142302 141044 140147 140224 141494 142785 142632 140949 138850 137268 136511 136768 138097 140013 141874
57513 141874 143664 145864 148600 151420 153893 156003 157938 159783 161486 163000 164530 166468 168767 170475
57499 170475 170494 168907 166938 165493 164410 163275 162135 160930 159085 156313 153270 150709 148485 146022 143403
57484 143403 141336 140281 140107 140408 140736 140735 140356 139796 139080 138141 137399 137584 138714 139828 140094 139575 138530 136741
57466 136741 134104 131348 129467 128868 129451 130953 132734 133870 134132 134333 135139 136099 136518 136649 137199 138189 139218
57449 139218 140490 142608 145468 148203 150209 151626 152887 154296 155957 157642 158911 159751 160822 162603
57435A62603K036J503Q93Q11J014J079J000Q42N20K07L29R23J568J976K032J544
57419A80880O56K14P25J282Q26L7M72J953K665J984J375J887K613K449J816J595
57403B03429J634J395J036R76J163J451J818J824R47j06K04J975L446L571L403
57388B28166M017M702M479L923L936M069L625L238L691M150L443K224K050K862
57374B78575L264K897K710K993K951K315J803J737J587J146R84J370J796J834
57360C07962J726J886K442L283M051M194L717L479M078M882N064N016N583O391
57346C63754O365N643N409N827N753M732L799L769M079M040M064M741N555N517
57332D33047M598L778L868M838O060O829O880O561O328O102N542M901M955N894
$$ plain form
57435 162603 164639 166142 167035 167846 168860 169939 170939 171781 172301 172508 172837 173760 175328 177304 179336 180880
57419 180880 181536 181750 182475 183757 184583 184620 185092 187045 189710 191694 193069 194956 197569 200018 201834 203429
57403 203429 205063 206458 207494 208470 209633 211084 212902 214726 215673 215567 215771 217746 221192 224763 228166
57388 228166 232183 236885 241364 245287 249223 253292 256917 260155 263846 267996 271439 273663 275713 278575
57374 278575 281839 284736 287446 290439 293390 295705 297508 299245 300832 301978 302962 304332 306128 307962
57360 307962 309688 311574 314016 317299 321350 325544 329261 332740 336818 341700 346764 351780 357363 363754
57346 363754 370119 375762 381171 386998 392751 397483 401282 405051 409130 413170 417234 421975 427530 433047
57332 433047 437645 441423 445291 450129 456189 463018 469898 476459 482787 488889 494431 499332 504287 510181
57318E10181O986P598P916Q348Q743Q743Q497Q478Q758Q925Q717Q488Q812R687
57304F28877J0286R812Q614Q030Q845J0375J1426J1680J1584J1361J0989J0799
57292G52678J1169J1727J1813J1663J2118J3133J3695J3488J3559J4724J6305
57281H96072J7238J7618J8247J9165J9627J9354J8873J8625J8428J8012J7537
57270A098796J7302J7305J7298J7175J7048J7000J6972J6932J7073J7609J8399
57259A288909J9012J9321J9692K0387K1032K1159K0991K1205K2007K2972K3772
57248A520459K4510K5199K5500K5233K4801K4824K5503K6432K6912K6474K5344
57237A801191K4297K3793K3476K2932K2600K3311K4964K6586K7717K8931L0765
$$ plain form
57318 510181 517167 524765 532681 541029 549772 558515 567012 575490 584248 593173 601890 610378 619190 628877
57304 628877 639163 648975 657589 665619 674464 684839 696265 707945 719529 730890 741879 752678
57292 752678 763847 775574 787387 799050 811168 824301 837996 851484 865043 879767 896072
57281 896072 913310 930928 949175 968340 987967 1007321 1026194 1044819 1063247 1081259 1098796
57270 1098796 1116098 1133403 1150701 1167876 1184924 1201924 1218896 1235828 1252901 1270510 1288909
57259 1288909 1307921 1327242 1346934 1367321 1388353 1409512 1430503 1451708 1473715 1496687 1520459
57248 1520459 1544969 1570168 1595668 1620901 1645702 1670526 1696029 1722461 1749373 1775847 1801191
57237 1801191 1825488 1849281 1872757 1895689 1918289 1941600 1966564 1993150 2020867 2049798 2080563
57226B080563L2922L4929L6886L9022M1090M2734M3991M4908M5064M4100M2340
57215B528549M0381L8217L5398L1831K7935K4027K0051J5947J2028Q877P093O991
57203B797325Q407J0900J4318J8997K5163L2275L9212M5122M9986N4313N8312
57192C154330O1414O2826O2691O2207O2220O2107O0779N8390N6115N4412N2604
57181C810095N0296M7927M5643M2853L9432L6135L3082K9201K4210J9897J8058
57170D196829J8074J8091J7827J8473K0293K2184K3616K5384K8190L1796L5809
57159D456566L9845M2609M2180L7920L1276K4174J7477J1270N794J470j507l394
57147D705680n089p918j2502j8034k3469k9083l5677m2630m8267n2156n5520n9159
$$ plain form
57226 2080563 2113485 2148414 2185300 2224322 2265412 2308146 2352137 2397045 2442109 2486209 2528549
57215 2528549 2568930 2607147 2642545 2674376 2702311 2726338 2746389 2762336 2774364 2783241 2790334 2797325
57203 2797325 2805732 2816632 2830950 2849947 2875110 2907385 2946597 2991719 3041705 3096018 3154330
57192 3154330 3215744 3278570 3341261 3403468 3465688 3527795 3588574 3646964 3703079 3757491 3810095
57181 3810095 3860391 3908318 3953961 3996814 4036246 4072381 4105463 4134664 4158874 4178771 4196829
57170 4196829 4214903 4232994 4250821 4269294 4289587 4311771 4335387 4360771 4388961 4420757 4456566
57159 4456566 4496411 4539020 4581200 4619120 4650396 4674570 4692047 4703317 4709111 4710581 4709074 4705680
57147 4705680 4700591 4692673 4680171 4662137 4638668 4609585 4573908 4531278 4483011 4430855 4375335 4316176
57135D316176o2574o5526o8894p3366p8639q4538r1644j00229j09685j19386j28885
57124C332810j37145j43081j47240j51276j55528j59037j62243j67459j75975
57115A933826j86960j99825k15125k32251k49131k65743k85345a1298l42101l79740
57105g33139m26014m82335n47911o24044p16646q32256r75349j152385j374155
57096g864234j650419j986117k386041k856843l398570l999382m642858n307465
57088c4091929n941030o439282o673433o558678o105348n415345m636016l893672
57080g9754733l224386k546253j723886o96488M48700J535870K428585L097640
57072h0434951L589850L966176M271177M527276M731211M860172M894677M836063
$$ plain form
57135 4316176 4253602 4188076 4119182 4045816 3967177 3882639 3790995 3690766 3581081 3461695 3332810
57124 3332810 3195665 3052584 2905344 2754068 2598540 2439503 2277260 2109801 1933826
57115 1933826 1746866 1547041 1331916 1099665 850534 584791 299446 -11298 -353399 -733139
57105 -733139 -1159153 -1641488 -2189399 -2813443 -3530089 -4362345 -5337694 -6490079 -7864234
57096 -7864234 -9514653 -11500770 -13886811 -16743654 -20142224 -24141606 -28784464 -34091929
57088 -34091929 -40032959 -46472241 -53145674 -59704352 -65809700 -71225045 -75861061 -79754733
57080 -79754733 -82979119 -85525372 -87249258 -87945746 -87497046 -85961176 -83532591 -80434951
57072 -80434951 -76845101 -72878925 -68607748 -64080472 -59349261 -54489089 -49594412 -44758349
57064d4758349M699667M498559M240291L933369L589136L219925K840718K469982
57056a5266702K123750J810228J532530J293199J092245R24294P82335O62848
57048e045273N64172M82539M13523L55467L07926K68445K34171K04932J81506
57039b032592J62223J44492J28327J15259J04888R5411Q6507P8943P2259O5534
57029i78749N9488N5319N2303M8959M5680M3851M3351M3363M4514M7524N0582
57018d43815N0726M7450M2575L7315L1787K6580K2123J7074J0113K916j303k034
57006a58493j657j619j162M3R16J113J754L221M366M635N027O214P464Q274R456
56991a10448J1687J4190J5729J6076J5925J6058c995A3645J7609J6373J4847J3680
$$ plain form
57064 -44758349 -40058682 -35560123 -31319832 -27386463 -23797327 -20577402 -17736684 -15266702
57056 -15266702 -13142952 -11332724 -9800194 -8506995 -7414750 -6490456 -5708121 -5045273
57048 -5045273 -4481101 -3998562 -3585039 -3229572 -2921646 -2653201 -2419030 -2214098 -2032592
57039 -2032592 -1870369 -1725877 -1597550 -1482291 -1377403 -1281992 -1195485 -1116542 -1044283 -978749
57029 -978749 -919261 -863942 -811639 -762680 -717000 -673149 -629798 -586435 -541921 -494397 -443815
57018 -443815 -393089 -345639 -303064 -265749 -233962 -207382 -185259 -168185 -158072 -155156 -156459 -158493
57006 -158493 -160150 -161769 -162931 -162888 -161972 -160859 -159105 -155884 -151518 -146883 -141856 -135642 -128178 -119904 -110448
56991 -110448 -98761 -84571 -68842 -52766 -36841 -20783 -3995 13645 31254 47627 62474 76154
56979G6154J2001Q880N257K862J732N71q58j622j641j849k256j761j11J691L168
56964A02218M900O895Q232Q738R515J1296J3489J5191J5854J4814J1657P310L378
56951B33487J59l321p102r846j0878j1009j0835r786p605n243l480j876J64K407
56937A55236M505O703R198J1833J4768J8268K1392K2188J9872J5655J0971O012
56925C16601O47m549r049j3040j6547j8741j8963j7648j5619j3260j0921r200
56913A69711q160p072n563m287l851l797l331k366j361o62m10n27n12J61J243
56898A29216J989K352L016M171N261O163P527R590J1746J3680J5914J8629K0878
56885B50132K1521K0281J7461J3463Q902M437K20l763o813q032p741p189o647
$$ plain form
56979 76154 88155 97035 102292 105154 106886 107457 106599 104977 103336 101487 99231 97470 97359 99050 102218
56964 102218 107118 114013 122245 130983 140498 151794 165283 180474 196328 211142 222799 230109 233487
56951 233487 233646 230325 223223 213377 202499 191490 180655 170869 163264 158021 154541 152665 152829 155236
56937 155236 159741 166444 175642 187475 202243 220511 241903 264091 283963 299618 310589 316601
56925 316601 317248 312699 303650 290610 274063 255322 236359 218711 203092 189832 178911 169711
56913 169711 161551 154479 148916 144629 140778 136981 133650 131284 129923 129261 128851 128324 127812 127973 129216
56898 129216 131205 133557 136573 140744 146005 152168 159695 169285 181031 194711 210625 229254 250132
56885 250132 271653 291934 309395 322858 331760 336197 336417 332654 325841 317809 310068 302879 296232
56872B96232n205k644p3J967M494Q389J2950J7091K0966K5492L1035L7091M2461
56859D90246M5189M3391L6914K7444J6660N301n759j5002k1572k5950k8586k9029
56847E39247k7049k3397j8749j3041o584l93N395J2136K0712L0272L9872M9911
56835F08332O0512O9598P4036P1990O3315M8875L0694J1654o464k3760m0028n2946
56823I15808o0085o1621n9487n4740m7541l8953l0706k3264j5764p758L55Q468
56811E24712J6942K5695L4180M1940M7984M9990M5819L5943K3160R778l840j7831
56799H34472l1145m1798m8169m9909m8087m4490m0317l5593l0055k4047j8136
56788D22726j2373o661j231L925R460J5618K1218K4573K5039K2949J8585J2164
$$ plain form
56872 296232 291027 288383 288310 290277 294771 303160 316110 333201 354167 379659 410694 447785 490246
56859 490246 535435 578826 615740 643184 659844 665145 659386 644384 622812 596862 568276 539247
56847 539247 512198 488801 470052 457011 450427 450034 455429 467565 488277 518549 558421 608332
56835 608332 668844 738442 812478 884468 947783 996658 1027352 1039006 1032542 1008782 968754 915808
56823 915808 855723 794102 734615 679875 632334 593381 562675 539411 523647 515889 516244 524712
56811 524712 541654 567349 601529 643469 691453 741443 787262 823205 846365 856143 852303 834472
56799 834472 803327 761529 713360 663451 615364 570874 530557 494964 464909 440862 422726
56788 422726 410353 403692 402461 406386 415846 431464 452682 477255 502294 525243 543828 555992
56776E55992M427l665j1577j8896k4867k8906l1142l1794l0733k8223k5349k2820
56764C02447k0147j6905j3893j2016j0832r450q057p308o896o096n138m679m464
56751A76566l859l166l047l121k523j439o64j39O31J167O91k12k75L02J03j130
56735A59885k093k000j435r14j60Q23J317J003M15K4j81n4O28J391J457R72Q55
56718A61933J388K038K555L036L020J912M03M0J133K340K607K298K109K011J713
56703A90536J201N22k07n20j86Q4m36j090o58O17J292R78P90J285J608J075K22
56686A97113k93n38n39P0J112J692J496J190J131Q01Jn80m59m2K71O33R80Q02
56668B04841J20l08k09j74m70n34j17K51L52O89J249J116j8j043r22j1P90J270
$$ plain form
56776 555992 560419 556754 545177 526281 501414 472508 441366 409572 378839 350616 325267 302447
56764 302447 282300 265395 251502 239486 228654 219204 211147 203839 196943 190847 185709 181030 176566
56751 176566 172707 169541 166494 163373 160850 159411 158747 158608 159239 160406 161097 160885 160610 160912 161015 159885
56735 159885 157792 155792 154357 153443 153283 154106 155423 156426 156841 156865 156684 156630 157258 158649 160106 161078 161933
56718 161933 163321 165359 167914 170950 173970 175882 176285 176325 177458 179798 182405 184703 186812 188823 190536
56703 190536 191737 192259 192052 191532 191346 191430 190994 189904 189246 189863 191155 192133 192923 194208 195816 196891 197113
56686 197113 196820 196282 195743 195813 196925 198617 200113 201303 202434 203235 203236 202656 202197 202155 202426 203059 204039 204841
56668 204841 204961 204653 204444 204270 203800 203266 203149 203400 203752 204441 205690 206806 206788 205745 204823 204812 205602 206872
56650B06872J500J229M25k38l16l04p50j276j156l85L97O91M05k11o76p23p31
56633B04753j129j521j194m22k26q58j581k011k385k410j325M84J325L60j281
56618A90579k113j928j208j75Q75J311R86N35L52J73M2M89J282J304L02n24l70
56601A91912j8l04p15m72Q2K79L75R22J689K115K097J629N22q03j248n42J72Q0
56583A97772q2N05J208J022K70k4L06P51J175J636J790J512J439J998K523K357
56567B16158K004K260K931L484M253N758P453Q297Q216P857P401O593N588M702
56553B92955L634J874l61k361l796m637m757m278l873l943l984l430k640k284
56539B58119k315k252j960j528q86j91j1m92j002j094j050r96m38O46J263P34
$$ plain form
56650 206872 208372 209601 210026 209788 209472 209168 208418 207142 205986 205601 205998 206689 207094 206883 206207 205484 204753
56633 204753 203624 202103 200909 200487 200261 199403 197822 195811 193426 191016 189691 190175 191500 191860 190579
56618 190579 188466 186538 185330 185155 186030 187341 188327 188862 189214 189387 189429 189918 191200 192504 192806 192282 191912
56601 191912 191894 191590 190875 190403 190485 190764 191139 192061 193750 195865 197962 199591 200113 199310 198062 197520 197692 197772
56583 197772 197690 198195 199403 200425 200695 200671 200977 201728 202903 204539 206329 207841 209280 211278 213801 216158
56567 216158 218162 220422 223353 226837 231090 236848 244301 252598 260814 268671 276072 282665 288253 292955
56553 292955 296589 298463 298102 295741 291945 287308 282551 278273 274400 270457 266473 263043 260403 258119
56539 258119 255804 253552 251592 250064 249178 248987 248976 248484 247482 246388 245338 244342 243904 244550 245813 246547
56523B46547l31j162j801k167j480K88J621J415N77L36J88q80k215k453j847j717
56507B34919k091j855r90p53j539k261k086j387p62l46k33n42q85p22k50r2k08
56490B17917n1L38L59j08n22n07o9O85J415J450O21j73j5P82J259J135P81M21
56472B25718K04N01J209J471Q97L63N68P25n2j010q85nL25k5j06K58M17M10Q90
56453B31873J599J518O35J09N67J417J946K006J596P93M3l47p40j315j305j73
56437B40222J102J240N73K86L34j74r57p94L28J081Q22K38j03k80r5Q23J872J867
56419B48385P67k82o35n53j07Q48J700J629J080J128J480Q58n50j032NJ123J165
56402B57009P04N64N01J63l8K10M53M13N13R63J261J093Q08O43M15K13M18Q42
$$ plain form
56523 246547 246216 245054 243253 241086 239606 239894 241515 242930 243507 243843 244031 243151 240936 238483 236636 234919
56507 234919 232828 230973 229983 229230 227691 225430 223344 221957 221195 220849 220616 220074 219189 218467 218217 218125 217917
56490 217917 217866 218204 218563 218455 217933 217426 217357 218042 219457 220907 221528 221355 221340 222122 223381 224516 225297 225718
56472 225718 225922 226423 227632 229103 230000 230363 230931 231656 231604 230594 229709 229704 230029 230004 229898 230156 230573 230983 231873
56453 231873 233472 234990 235625 235734 236301 237718 239664 241670 243266 244059 244102 243755 243015 241700 240395 240222
56437 240222 241324 242564 243137 243423 243757 243583 242626 241832 242160 243241 244063 244301 244198 243918 243823 244646 246518 248385
56419 248385 249152 248870 248235 247682 247575 248423 250123 251752 252832 253960 255440 256298 255748 254716 254721 255844 257009
56402 257009 257713 258277 258778 258941 258903 259113 259566 259979 260492 261455 262716 263809 264617 265260 265675 265888 266306 267148
56384B67148Q76O74R75J684J840J274R25J241J518J258R79J080J046L76n22r48
56368B81424p13MR09J540J561J215R27O48K97L74J213K029J851J008N52O42Q26
56351B96307J247K094K413J260l12l58J020J828J239M83N14Q45J036J500K243
56336C13359K570K416K499K811K571J942K066L070L791L773L858M374M489L772
56322C57361K844K103J400J106J714K342J588Nl99O27J208O05L17J222K109K076
56306C78228K104K949L657L452L311M154N205N451N253N311N416N321N446N795
56292D41053N557M648M262N033O123O760P228P718P843P860Q626R822J0114R575
56278E42222R778J0912J1229J0187R666J0943J2870J4266J5710J7570J8712J8802
$$ plain form
56384 267148 268024 268698 269673 271357 273197 274471 275396 276637 278155 279413 280392 281472 282518 282894 282372 281424
56368 281424 280711 280715 281624 283164 284725 285940 286867 287515 287812 288186 289399 291428 293279 294287 294839 295481 296307
56351 296307 297554 299648 302061 303321 303009 302651 303671 305499 306738 307221 307735 308580 309616 311116 313359
56336 313359 315929 318345 320844 323655 326226 328168 330234 333304 337095 340868 344726 349100 353589 357361
56322 357361 360205 362308 363708 364814 366528 368870 370458 370463 370064 370691 371899 372504 372821 374043 376152 378228
56306 378228 380332 383281 386938 390390 393701 397855 403060 408511 413764 419075 424491 429812 435258 441053
56292 441053 446610 451258 455520 460553 466676 473436 480664 488382 496225 504085 512711 522533 532647 542222
56278 542222 552000 562912 574141 584328 593994 604937 617807 632073 647783 665353 684065 702867
56266G02867J9594K2159K5015K6762K8495L1679L5740L9720M4444N0934N8347
56255A085756O5484P2821Q1130Q9769R8158J07294J17819J28226J36908J44494
56245B127859J52076J58706J62600J63453J61560J56113J46379J33248J17632
56236C479626R8766P6001N1010K6079J591k2888m6372o7433q6138j02964j16935
56225C290343j26869j33427j37947j40361j40057j37673j34110j29047j22306
56216B088546j15393j09689j04345r7997r1269q5569q0534p4857o8643o2944n7898
56205A139408n3123m8873m5152m0937l5980l1937k9902k8336k5416k1808j9058
56194G58886j6910j4483j2578j2235j2359j1244r238p663o347m635l477m012n240
$$ plain form
56266 702867 722461 744620 769635 796397 824892 856571 892311 932031 976475 1027409 1085756
56255 1085756 1151240 1224061 1305191 1394960 1493118 1600412 1718231 1846457 1983365 2127859
56245 2127859 2279935 2438641 2601241 2764694 2926254 3082367 3228746 3361994 3479626
56236 3479626 3578392 3654393 3705403 3731482 3733073 3710185 3663813 3596380 3510242 3407278 3290343
56225 3290343 3163474 3030047 2892100 2751739 2611682 2474009 2339899 2210852 2088546
56216 2088546 1973153 1863464 1759119 1661122 1569853 1484284 1403750 1328893 1260250 1197306 1139408
56205 1139408 1086285 1037412 992260 951323 915343 883406 853504 825168 799752 777944 758886
56194 758886 741976 727493 714915 702680 690321 679077 669839 662176 655829 651194 647717 643705 638465
56181F38465n446m809m333l549j741n7P0n74m60R8K29Q04K779M717M764L745L614
56164F38316M239M522N123P070R092R461R192J0303J2253J3302J4019J5949J8201
56151G71042J9001J9510K2223K6563K9840L1943L5126L9678M3690M7010N1651
56140A137277N8300O5840P4224Q4474R5628J04876J10750J13461J12572J07484
56130B064886R9855R2304Q5011P6537O7420N9601N2753M4609L4658K4251J3585
56119B715470J877r820j9527k7779l6882m7098n6933o6613p7641q9210r8678j05298
56107B081868j10114j12581j11019j06033r9797r2317q2150p0383n9997n1509
56097A185968m3129l4898k8688k4326j9764j4963j1716r804p307m457l113k711
$$ plain form
56181 638465 633019 628210 623877 620328 618587 618530 618600 618026 617566 617664 617893 618697 621476 626193 630957 634702 638316
56164 638316 642555 647077 652200 659270 668362 677823 687015 697318 709571 722873 736892 752841 771042
56151 771042 790043 809553 831776 858339 888179 920122 955248 994926 1038616 1085626 1137277
56140 1137277 1195577 1261417 1335641 1420115 1515743 1620619 1731369 1844830 1957402 2064886
56130 2064886 2164741 2257045 2342056 2418593 2486013 2545614 2598367 2642976 2677634 2701885 2715470
56119 2715470 2717347 2707527 2688000 2660221 2623339 2576241 2519308 2452695 2375054 2285844 2187166 2081868
56107 2081868 1971754 1859173 1748154 1642121 1542324 1450007 1367857 1297474 1237477 1185968
56097 1185968 1142839 1107941 1079253 1054927 1035163 1020200 1008484 998680 991373 986916 983803 981092
56085I81092q88K151M023M549N489O475N806M764O274R599J1293J1136J2004J4007
56071A077774J4247J2618J2311J4043J5067J4512J4547J5563J5413J4001J3576
56060A233672J3902J2401R519Q608R951J0377R297R483J1351J2267J2204J4012
56048A367044J7372J8555J7113J6729J8510J9636J9600K1259K4566K5823K4476
56037A590683K4064K5254K4694K2122K1539K3867K5482K5657K8013L2897L5818
56026A880090L5533L6113L8994M0635M0248M1846M6213M8935M8909N0589N5201
56015B363306N8216N8348O0373O5923P0359P1949P5142Q1236Q5141Q5202Q6828
56004C162023R2467R7475R9963J04812J13632J20883J24454J29905J39500J47722
$$ plain form
56085 981092 980204 982355 986378 990927 996416 1002891 1008697 1013461 1019735 1029334 1040627 1051763 1063767 1077774
56071 1077774 1092021 1104639 1116950 1130993 1146060 1160572 1175119 1190682 1206095 1220096 1233672
56060 1233672 1247574 1259975 1269494 1278102 1288053 1298430 1307727 1317210 1328561 1340828 1353032 1367044
56048 1367044 1384416 1402971 1420084 1436813 1455323 1474959 1494559 1515818 1540384 1566207 1590683
56037 1590683 1614747 1640001 1664695 1686817 1708356 1732223 1757705 1783362 1811375 1844272 1880090
56026 1880090 1915623 1951736 1990730 2031365 2071613 2113459 2159672 2208607 2257516 2308105 2363306
56015 2363306 2421522 2479870 2540243 2606166 2676525 2748474 2823616 2904852 2989993 3075195 3162023
56004 3162023 3254490 3351965 3451928 3556740 3670372 3791255 3915709 4045614 4185114 4332836
55994D332836J52469J59700J71735J82429J89282J98676K13439K27505K38725
55985F066796K54136K76300K97926L16512L40228L72304M04668M34413M70636
55976I233919N17049N64872O11750O69471P43376Q23526R06799J006915J131120
55967A6208797J269716J421846J607335J839130K111504K432432K838516L360214
55959C3089490M006185M801933N803150P044493Q521962J0259137J2339373J4841500
55951A00707223J7820733K1379403K5552631K9863208L3028368L3454149L0302633
55944B92108348K4085430J6159200P720727o60704q734824j6106472k2160721
55937B92410984k6319686k8310207k8276686k6720867k4292592k1544105j8813587
$$ plain form
55994 4332836 4485305 4645005 4816740 4999169 5188451 5387127 5600566 5828071 6066796
55985 6066796 6320932 6597232 6895158 7211670 7551898 7924202 8328870 8763283 9233919
55976 9233919 9750968 10315840 10927590 11597061 12340437 13163963 14070762 15077677 16208797
55967 16208797 17478513 18900359 20507694 22346824 24458328 26890760 29729276 33089490
55959 33089490 37095675 41897608 47700758 54745251 63267213 73526350 85865723 100707223
55951 100707223 118527956 139907359 165459990 195323198 228351566 261805715 292108348
55944 292108348 316193778 332352978 340073705 339413001 330678177 314571705 292410984
55937 292410984 266091298 237781091 209504405 182783538 158490946 136946841 118133254
55930A18133254j6270392j3993458j1995649j0241276q696229p356413o220185
55923D3359652n262442m453478l779474l227151k768956k380410k055282j789822
55915A7642637j568140j375898j212943j079890r66125q62310p71478o96862o31300
55906H477691n68609n13297m69160m29739l89469l53245l25714l01574k75418
55897D851466k51270k33588k18228k00710j84529j73211j62704j49426j37510
55888C140290j30507j24061j14205j04847r9677r4495q5229p5999p1446o8055
55878B171769o0856n2356m7304m4503m1106l9358m1866m5310m5721m5250m7386
55867A660753n0157n0237m9061m8953m7729m3114l8047l5945l4899l2048k9346
$$ plain form
55930 118133254 101862862 87869404 75873755 65632479 56936250 49579837 43359652
55923 43359652 38097210 33643732 29864258 26637107 23868151 21487741 19432459 17642637
55915 17642637 16074497 14698599 13485656 12405766 11439641 10577331 9805853 9108991 8477691
55906 8477691 7909082 7395785 6926625 6496886 6107417 5754172 5428458 5126884 4851466
55897 4851466 4600196 4366608 4148380 3947670 3763141 3589930 3427226 3277800 3140290
55888 3140290 3009783 2885722 2771517 2666670 2566993 2472498 2387269 2311270 2239824 2171769
55878 2171769 2110913 2058557 2011253 1966750 1925644 1886286 1844420 1799110 1753389 1708139 1660753
55867 1660753 1610596 1560359 1511298 1462345 1414616 1371502 1333455 1297510 1262611 1230563 1201217
55856A201217k9480l0333k8964k7090k7247k7520k5460k3343k4142k5949k5575
55845I06114k4193k4256k4336k2141j9451j8962j9327j8059j6326j6210j6258
55834F86595j4390j2175j1731j1422r141o754o720p330n946m050m353n643n277
55821E81663m197m819o260o279n707o469p377o194l878k595j626O65K940L133
55807E33000K523L449M984M982M373N292O786O476M795L528J950j541n574p615
55793E67408q169r403j1072j1575j1467j2120j2290r921o098l644k888k248j669
55780D64844k084k771k482j997k292j775J454O126R785J2528J5446J7168J5625
55767E29575J1730P765L654j697p137j1010j4407j8791k2109k1478j8305j6390
$$ plain form
55856 1201217 1171737 1141404 1112440 1085350 1058103 1030583 1005123 981780 957638 931689 906114
55845 906114 881921 857665 833329 811188 791737 772775 753448 735389 719063 702853 686595
55834 686595 672205 660030 648299 636877 627736 620982 614262 606932 600986 596936 592583 586940 581663
55821 581663 577466 572647 566387 560108 554401 547932 540555 534361 530483 527888 526262 526927 529867 533000
55807 533000 535523 538972 543956 548938 553311 558603 565389 571865 576660 580188 582138 580597 575023 567408
55793 567408 559239 549836 538764 527189 515722 503602 491312 481391 475293 471649 468761 466513 464844
55780 464844 462760 459989 457507 455510 453218 451443 452897 459023 468808 481336 496782 513950 529575
55767 529575 541305 549070 552724 551027 543890 532880 518473 499682 477573 456095 437790 421400
55755D21400j6172j5159j3138j2353j3085j3392j2969j3218j3658j2303r532p784
55743B68637p340o104l589j606p99N1J122J206N01O26J677K109J598J243J018
55728B60350l0j313j330o35j161k793l573l155l015l342k805j386m25J11J479
55713B36977L342M099L957M620N940N989M590L610L544K845R73q11k043l536n050
55698B69046n419n210o160p673p147m337k104k013k380j715r94j168j286n76M0
55683B20904k2L43J865L438M012M129M481M562L827K708J640N04m42o08m14r65
55667B49962k047k207j099L0M86Q80J447J622J606K316L424L474K428J914K502
55652B66738K849K167J316O71q38l570n946o547n891n190m814m745n092n398m851
$$ plain form
55755 421400 405228 390069 376931 364578 351493 338101 325132 311914 298256 285953 276421 268637
55743 268637 261297 255193 251604 249998 249199 249250 250372 251578 252079 252705 254382 256491 258089 259332 260350
55728 260350 260320 259007 257677 257042 255881 253088 249515 246360 243345 240003 237198 235812 235387 235498 236977
55713 236977 240319 244418 248375 252995 258935 264924 269514 273124 276668 279513 280486 279675 277632 274096 269046
55698 269046 263627 258417 252257 244584 237437 233100 230996 228983 226603 224888 223894 222726 221440 220864 220904
55683 220904 220882 221225 223090 226528 230540 234669 239150 243712 247539 250247 251887 252391 251949 251341 250927 249962
55667 249962 247915 245708 244609 244639 245125 246005 247452 249074 250680 252996 256420 259894 262322 264236 266738
55652 266738 269587 271754 273070 273741 272903 269333 263387 256840 250949 245759 240945 236200 231108 225710 220859
55637B20859l739l347l968m461m193l828l769l460k668j961j455o77O2k15j342
55622A81838j963j668j444j734j803j377j120j108o71o6l99j530j979j349q48
55607A62779r35n99M24Q85K06o01r59j601k594k639j376l80o83j210q75l26l97
55590A49119n32j11K85J81K95J050J487Q95J46J89N66O09P83J561K263K271K239
55573A63296K884L626L703L564L990M764N243N427N432M813L355J746O39j62r36
55558B11384j442j681k217l148l746l733l753m026l787k783j993k051k251j883
55544A72890j375j165p79R4O99M64J6O4J86k46r00j106q69n49l40n13j321k225
55526A63025k327j927k263l348l608k390j152j217j871j818j156p04n52m81q03
$$ plain form
55637 220859 217120 213773 209805 205344 201151 197323 193554 190094 187426 185465 184010 183333 183395 183180 181838
55622 181838 179875 178207 176763 175029 173226 171849 170729 169621 168950 168884 168485 166955 164976 163627 162779
55607 162779 161844 161245 161669 162554 162760 162159 161200 159599 157005 154366 152990 152610 151927 150717 149842 149516 149119
55590 149119 148587 148476 148761 148942 149237 150287 151774 152669 152815 153004 153570 154179 154962 156523 158786 161057 163296
55573 163296 166180 169806 173509 177073 181063 185827 191070 196497 201929 206742 210097 211843 212482 212320 211384
55558 211384 209942 208261 206044 202896 199150 195417 191664 187638 183851 181068 179075 177024 174773 172890
55544 172890 171515 170350 169571 169665 170364 170828 170844 170908 171094 170848 169948 168842 167973 167424 167084 166571 165250 163025
55526 163025 160698 158771 156508 153160 149552 147162 146010 144793 142922 141104 139948 139244 138692 138211 137408
55511A37408j605k130j857j330j051o18J86N92R3n51m96p2O4k6j26m38p83l99
55493A26861O92J266P32Q2K13N95N75N44P27K51j191k086j015J100K156J474N3
55476A33029r71r99N0J405J768Q86l0j60j40n78q46m47j46n69r62n99j62m12p92
55457A29325o89p91j638k189j373P3Q98J266J750J688M35q79q65j67k16o49j43
55440A25836R13R46m1m87J49Q82J142J318J295M63p87j251p73l17j83K42R16R64
55422A31227L42J03P05J378J520J412J329J057N88K58ln58j154j117m67J04L79
55405A37103O65Q28M00l53o06l24k82p03q84n00j57m06r64j218q78j0R84J439
55387A34134J084N25M81P65O78R9n19r41j166r89l50J81P8k55j62J69Q0l95o94
$$ plain form
55511 137408 135803 133673 131816 130486 129435 128817 129003 129595 129688 129137 128641 128569 128633 128607 128481 128043 127260 126861
55493 126861 127553 128819 129551 129633 129846 130441 131016 131560 132287 132538 131347 129261 128246 129346 131502 132976 133029
55476 133029 132058 131059 131109 132514 134282 135168 135138 134978 134838 134260 133414 132967 132821 132252 131290 130691 130529 130117 129325
55457 129325 128636 127845 126207 124018 122645 122718 123616 124882 126632 128320 128755 127876 127011 126844 126628 125979 125836
55440 125836 126749 127695 127654 127167 127316 128198 129340 130658 131953 132416 131629 130378 129605 129288 129105 129347 130263 131227
55422 131227 131569 131672 132377 133755 135275 136687 138016 139073 139661 139919 139916 139358 138204 137087 136620 136724 137103
55405 137103 137768 138596 138996 138643 138037 137713 137431 136728 135844 135344 135187 134781 133817 132599 131721 131711 132695 134134
55387 134134 135218 135743 136224 136989 137667 137766 137247 136306 135140 134151 133801 133982 134060 133805 133643 133812 133892 133497 132803
55368A32803o98o28l67K00N75L04j41j26L4k32n14r5N54L53o16j245j099p07l27
55349A28028K01N27P8p02p02J62P79N00j69o10p76p17l85j5J10J65L00L7q70j537
55329A24404j114m04p07j489j028O92J691R69q8N4J033J665J685J501J203P50
55313A30817M08K98J02k68m49l41l56o24p07m48k82m12m38j84m6j81q8N07J079
55294A28387J090O56J25l89o99l60O84J718J872R29n78j735j765o78O10J224J259
55277A32350J301J393J192Q40P66P61K49o03j032r09q87j222j465j420j427j468
55261A28419r47K90J499J971J775J354R43N84K18k88p52n86L73J233J076L21O2
55244A37545L69L57k36p30p89p68p69m67o3k22r07j325j201j025r25m94J23K43
$$ plain form
55368 132803 132105 131477 131110 131310 131885 132189 132048 131922 131956 131724 131210 131115 131669 132022 131406 130161 129062 128355 128028
55349 128028 128229 128756 128834 128132 127430 127592 128371 128871 128702 128092 127316 126599 126214 126199 126309 126474 126774 126811 125941 124404
55329 124404 123290 122886 122179 120690 119662 120354 122045 123014 122926 122980 124013 125678 127363 128864 130067 130817
55313 130817 131225 131523 131625 131357 130908 130567 130211 129587 128880 128432 128150 127738 127300 127116 127070 126889 126801 127308 128387
55294 128387 129477 130133 130258 129869 129170 128810 129494 131212 133084 134013 133435 131700 129935 129257 129867 131091 132350
55277 132350 133651 135044 136236 137076 137842 138603 138852 138249 137217 136308 135421 134199 132734 131314 129887 128419
55261 128419 127472 127762 129261 131232 133007 134361 135304 135888 136106 135818 135066 134480 134853 136086 137162 137483 137545
55244 137545 137914 138271 138035 137305 136516 135748 134979 134512 134449 134227 133320 131995 130794 129769 128844 128350 128473 128716
55226A28716n4J65J105J791J643J232J013N62l33r45p71m35o73j180j200o33P1
55209A30074N83Q06P71O70N54O5q82j407o83N39O94k96r35n50j37m28o85k41K67
55190A28779J66L5O18J479J748J424R76M44k19n65k75J91L13K52L17L20J21Q4
55172A36208M64R27J190J415J553J147K51l46k98j77l29k71K08M64J98M9K78R8
55154A43029q44j551j293q63j042j029O4J265R77m84j320q37k2K75K21R1j74m11
55136A36052k80Q6L26O56J473K262J932L50j315j906j354l88J93N8m56o64m22
55119A36603k91m81l53M91J294J164M30L5P1m2l03j78L40P42R58J280J478J016
55101A44254K21J47J034J827J536M62l33k51L75P70M52l35r19r80p46l20N40J661
$$ plain form
55226 128716 128662 128827 129932 131723 133366 134598 135611 136173 135840 134895 134124 133689 133016 131836 130636 130003 130074
55209 130074 130657 131463 132234 132904 133458 133523 132641 131234 130551 131090 131784 131488 130553 130003 129866 129438 128753 128512 128779
55190 128779 128945 128980 129598 131077 132825 134249 135225 135669 135450 134885 134610 134801 135114 135366 135683 136003 136124 136208
55172 136208 136672 137599 138789 140204 141757 142904 143155 142809 142511 142334 142005 141734 141942 142406 142604 142653 142931 143029
55154 143029 142185 140634 139341 138478 137436 136407 136471 137736 138713 138229 136909 136072 136050 136325 136546 136637 136463 136052
55136 136052 135772 135858 136184 136840 138313 140575 142507 142857 141542 139636 138282 137894 138087 138145 137689 137025 136603
55119 136603 136312 135831 135478 135969 137263 138427 138857 138892 138963 138921 138618 138440 138780 139522 140480 141760 143238 144254
55101 144254 144475 144622 145656 147483 149019 149481 149148 148897 149272 150042 150494 150159 149240 148260 147514 147194 147734 149395
55083A49395K126J423L36n4J94K44q6k46j9K10K11J45M3k41n81o99o16m44K2P97
55063A52160J156M78n77o96K53R82N52m99j086r14m72j99m8K61P69J062O35l87
55045A53430j278j629j770j979j885j260o73n98m44M94J612J726Q91K93L16J21
55029A47367o64j125m41R03J848J960J448N92k87q12r16q73p41k67M55Q87Q03
55012A50137O39P84J006Q83L68l29r32j040m16M94Q31M44R6K50L59j24o80m24
54994A52346N25J182J087Q03R33J293J302Q01J85j15J1L64O08M99J10j72m3K57
54976A61976J24o01j222r45J01R77J107P98N15K47j4J95J152K120J973O11q41
54959A68273j361r75l68K9K03K75L81O68J170J627J617R02l00j379j794j525j024
$$ plain form
55083 149395 151521 152944 153280 153226 153420 153664 153578 153332 153313 153523 153734 153879 153922 153681 153100 152401 151785 151341 151363 152160
55063 152160 153316 153794 153217 152521 152774 153756 154308 153809 152723 151809 151337 151138 151090 151351 152120 153182 153817 153430
55045 153430 152152 150523 148753 146774 144889 143629 142956 142358 141914 142408 144020 145746 146637 146930 147246 147367
55029 147367 146703 145578 145137 146040 147888 149848 151296 151888 151601 150789 149873 149000 148259 147992 148447 149334 150137
55012 150137 150776 151560 152566 153449 153817 153488 152556 151516 151100 151594 152425 152869 152965 153215 153574 153450 152770 152346
54994 152346 152871 154053 155140 155943 156876 158169 159471 160272 160457 160342 160353 160717 161325 161824 161934 161762 161719 161976
54976 161976 162100 161499 160277 159332 159433 160410 161517 162315 162830 163077 163063 163258 164410 166530 168503 169114 168273
54959 168273 166912 165937 165569 165598 165801 166076 166457 167125 168295 169922 171539 172441 172141 170762 168968 167443 166419
54942A66419o78m46r7M36J006J409J459J089N95N51J296K587L813M492M587M560
54926A93078N107O428P782Q145P406O377N573M581K979J172k50j510l267n455
54912B38146p096p353o399n212m678m857n037m597l759l142k777k156j255o92
54898A79136o88o50j42N31J053J583K038J804Q35K14P34J823K627L420M711N845
54882B04874N835N163N223O166O702O081M944L962K869J212q49k919m780o146
54868B38337o714o695o626o540n976m945m109l832l775l619l408k978j914m65
54854A76741K96k42j353j919j798j645j817j998j835j440j130r94q20m50j37l12
54838A59147r77j569j577j020j91P04J393J476R39L41J03L2p1O2M97P01N02O56
$$ plain form
54942 166419 165741 165295 165198 165634 166640 168049 169508 170597 171192 171743 173039 175626 179439 183931 188518 193078
54926 193078 198185 204613 212395 220540 227946 234323 239896 244477 247456 248628 248378 246868 243601 238146
54912 238146 231050 223697 217298 212086 207408 202551 197514 192917 189158 186016 183239 181083 179828 179136
54898 179136 178448 177798 177656 178187 179240 180823 182861 184665 185500 185714 186448 188271 190898 194318 199029 204874
54882 204874 210709 215872 221095 227261 233963 240044 244988 248950 251819 253031 252182 249263 244483 238337
54868 238337 231623 224928 218302 211762 205786 200841 196732 192900 189125 185506 182098 179120 177206 176741
54854 176741 177037 176795 175442 173523 171725 170080 168263 166265 164430 162990 161860 160866 160046 159596 159459 159147
54838 159147 158170 156601 155024 154004 153813 154517 155910 157386 158325 158666 158769 158801 158730 158792 159289 159990 160492 161148
54820A61148J546K074J164k99n76K15L09q12j572q19N00J052J059J439K052K017
54804A70497J190K55l14n61n29j46M52R07R76O48J30k56l29k75l29l85k94k65
54786A71372m42l77L15J064J116R36J585K760K968J939J341K352L931M599M719
54771B00178N676P509Q808Q632P427O086N029M202L342K152O05r78k356l593m617
54756B48102n101n132n356o024o465o067n274m875m803m388l442k339j349n34
54742A86953j12k22m69l93j59k10m07j83N71J438K215L091M082M893N395N771
54726B12254O117O296O217N858N030L602J876L61r32k388l960m952m923m467m576
54711B21413n400n988n408l892k605k332k726k912k540j924j385j034j006j413
$$ plain form
54820 161148 162694 164768 165932 165633 165057 165272 165581 164769 163197 162378 162878 163930 164989 166428 168480 170497
54804 170497 171687 171942 171628 171067 170538 170392 170844 171751 172727 173375 173505 173249 172920 172645 172316 171931 171637 171372
54786 171372 170930 170553 170868 171932 173048 173984 175569 178329 181297 183236 184577 186929 190860 195459 200178
54771 200178 205854 213363 222171 230803 238230 244316 249345 253547 256889 259041 259646 258668 256312 252719 248102
54756 248102 243001 237869 232513 226489 220024 213957 208683 203808 199005 194617 191175 188836 187487 186953
54742 186953 186841 186619 186150 185757 185598 185388 184981 184798 185369 186807 189022 192113 196195 201088 206483 212254
54726 212254 218371 224667 230884 236742 241772 245374 247250 247611 246679 244291 240331 235379 230456 225989 221413
54711 221413 216013 210025 204617 200725 198120 195788 193062 190150 187610 185686 184301 183267 182261 180848
54697A80848j890j782r81j76J9k66n05m76k72qJ80J11k07n42p64r31r52n79Q3
54678A70910M66K43k33m19k07J70M54L61k62j011j126m53K21J60m09p88p69o25
54660A66683n02m05m35o10o17l05q2l45p33n36L32J264J809K030K063J845J357
54643A72813P76K14l54q39r88p16l21k65o87j193j188m95M24J024J295J452J286
54626A72238L71j030j936j710p56J17N09M66J86L6L20P75P45J43l25j91J22J19
54608A70199M3K44L98K3o28r82j077j298j436q96K35J091J127O47J85p4j36N4
54590A67719M08O05M50J37M0K96O38O26J41l89m68j94j06l45m85l23k24m20n49
54571A67557l02M1J95M40J011J437J203O71N79Q97R45M86o0l91n64n71k89Q7K45
$$ plain form
54697 180848 178958 177176 176195 176019 176038 175772 175267 174791 174519 174511 174691 174802 174595 174053 173289 172358 171406 170827 170910
54678 170910 171376 171619 171386 170967 170760 170930 171384 171745 171483 170472 169346 168893 169114 169274 168865 168077 167308 166683
54660 166683 166181 165776 165341 164731 164114 163809 163727 163382 162649 162113 162445 163709 165518 167548 169611 171456 172813
54643 172813 173589 173803 173449 172610 171622 170906 170585 170320 169633 168440 167252 166757 167181 168205 169500 170952 172238
54626 172238 172609 171579 169643 167933 167177 167294 167803 168269 168455 168491 168811 169586 170331 170474 170149 169958 170080 170199
54608 170199 170242 170486 170884 170907 170279 169297 168220 166922 165486 164590 164825 165916 167043 167690 167875 167801 167665 167719
54590 167719 168127 168732 169182 169319 169359 169655 170293 170919 171060 170671 170203 170009 169903 169558 169073 168750 168526 168106 167557
54571 167557 167255 167296 167491 167931 168942 170379 171582 172253 172832 173729 174674 175160 175100 174709 174145 173574 173285 173372 173617
54552A73617L09O30R68O49k85p53J42J918L139K827J336q2m53Q6N89M15j80n79
54534A84293n87l76j39p5m34j116j546j389j066j069j107o42O5K25j99l29L61
54517A74870J282J504P93l14j074r94j42P88J021M66k31m51k08O3P6n0J6L68O48
54498A78431M22k11o92p73p69q32n29L76J262J347P69K43k0l55p21n51L72J481
54480A79250K036J779R24l3n31l58J46N41Q30J211J565J680J702J816J696R31
54464A95185j25o62n31l05k33O0P03J146R89N74M16M71L47j10p23j223j408j264
54446A93307j083j126j162o95J92O87J85q48j274n10Q45J641J413P89N59O28L83
54429A93931p5P2R36J456R37J90K74Q43Q47L11J71N52O15Q7k92j74k14q17j320
$$ plain form
54552 173617 173926 174556 175524 176173 175888 175135 175277 177195 180334 183161 184497 184415 183962 184048 184637 185052 184872 184293
54534 184293 183706 183330 183191 183116 182682 181566 180020 178631 177565 176496 175389 174747 174812 175037 174838 174509 174870
54517 174870 176152 177656 178449 178135 177061 176067 175925 176713 177734 178200 177969 177518 177310 177373 177449 177399 177415 177783 178431
54498 178431 178853 178642 177950 177177 176408 175576 175047 175423 176685 178032 178801 179044 179024 178669 177948 177397 177769 179250
54480 179250 181286 183065 183989 183956 183425 183067 183213 183754 184584 185795 187360 189040 190742 192558 194254 195185
54464 195185 195060 194398 193867 193562 193329 193389 194092 195238 196227 196801 197217 197688 198035 197925 197202 195979 194571 193307
54446 193307 192224 191098 189936 189241 189433 190120 190305 189457 188183 187673 188518 190159 191572 192361 192920 193548 193931
54429 193931 193856 193928 194864 196320 197257 197447 197721 198564 199411 199722 199893 200445 201060 201147 200855 200681 200467 199650 198330
54410A98330j027k77J52R2p0p1P0K39K10j57m86q2J110K195K273J400M16O5M56
54391B04838J052J107L80n66j059j058q19k22Q41J686J427L06n38o50o37p92n53
54374B04743L11J092J268J256J484J624J454J573K431L379L599L380L531L983
54360B35108L913K997J682M01p67j738k343k552k394j846j174r61j401j886j866
54345B25173j673j917k411k506k145j892j940j904j572j226j110j042p99m48k50
54330B02338m03q28j046n07O90J673J731J101M36j41q62j488j439p76l59p63j537
54313A97820j783j147RJ094J662J483O39m44j179j269r76q20r42r30m60K22O88
54296A93667R95J372J496Q35l03q70m70J24J80k6N9L38M74O05R01R42L45m36o63
$$ plain form
54410 198330 197303 197026 197178 197270 197200 197129 197199 197438 197648 197491 197005 196923 198033 200228 202501 203901 204317 204382 204838
54391 204838 205890 206997 207377 206811 205752 204694 203875 203653 204494 206180 207607 207913 207375 206725 206088 205296 204743
54374 204743 205054 206146 207414 208670 210154 211778 213232 214805 217236 220615 224214 227594 231125 235108
54360 235108 239021 242018 243700 244101 243334 241596 239253 236701 234307 232461 231287 230326 228925 227039 225173
54345 225173 223500 221583 219172 216666 214521 212629 210689 208785 207213 205987 204877 203835 203036 202588 202338
54330 202338 201935 201107 200061 199554 200244 201917 203648 204749 205185 205044 204182 202694 201255 200479 200120 199357 197820
54313 197820 196037 194890 194899 195993 197655 199138 199777 199333 198154 196885 195909 195089 194147 193217 192757 192979 193667
54296 193667 194662 196034 197530 198365 198062 197192 196722 196846 197026 197000 197059 197397 197871 198476 199377 200319 200664 200228 199565
54277A99565l93j87q1L21R26J213J134J104J133P85J20j51L34J111J641J940K196
54260B12711K333K268K116J914J491Q42K78M9P0J42R8k65r09j277q15J22N24O8
54242B21760m53l84j97o94j730k398k214j455n18M07J040J007L57l01m33j29J56
54225B13821J63l5l24o61q75o48J56J163J738J603J129R09J151J550J706J457
54209B24003Q84J42o16j270j755j987j819j167k02O65R82N03o29j826k316j766
54193B11826o65J05J77n3p0P9n0n83j075r69j99P73J383J382R59M96K47J61P8
54174B14002K0J37L21J70m43r89q76k79P1l7q7R0j31j061j798j319q8M52j10p18
54154B07327n74j87k58m79k23K71K95j42l57j17R2n2j92J54R78J817K169J785
$$ plain form
54277 199565 199172 198985 198904 199225 200151 201364 202498 203602 204735 205520 205640 205489 205823 206934 208575 210515 212711
54260 212711 215044 217312 219428 221342 222833 223675 223953 224002 224072 224214 224312 224047 223138 221861 221046 221168 221692 221760
54242 221760 221307 220923 220726 220032 218302 215904 213690 212235 211717 212124 213164 214171 214528 214227 213794 213665 213821
54225 213821 213984 213949 213625 212964 212089 211441 211597 212760 214498 216101 217230 218139 219290 220840 222546 224003
54209 224003 224887 225029 224413 223143 221388 219401 217582 216415 216213 216878 217860 218363 217734 215908 213592 211826
54193 211826 211161 211266 211443 211390 211320 211399 211349 210766 209691 208722 208523 209296 210679 212061 213020 213516 213763 213924 214002
54174 214002 214022 214159 214480 214650 214207 213218 212342 212063 212134 212097 212010 212100 211969 210908 209110 207791 207703 208155 208045 207327
54154 207327 206753 206566 206308 205829 205606 205877 206172 206030 205673 205556 205648 205596 205404 205558 206536 208353 210522 212307
54136B12307Q93J35QL56O17N07J63k46o69r33p86l06J11K92M79Q44J120J003P06
54117B16601P46J309K016K360K161J658J304J476K158K811K824K273K006K672
54103B44375L834M488M397M324M776N123M501L108J855J033P9j303k582l130k920
54088B71958k269j416o43k70k18RO11J122J139Q94Q19Q69P48M22%n74j286j796
54070B70119j853j689j619j542j338j413k266l605m481m283l186j732m26L40M40
54055B41466J60j13l15n01m21J75R30J171Q90R02J772L014L637L297K633K614
54039B61311L554M804N382M997M331M131M319M293L955L926M649N714O262N874
54025C27502M862L845L179K773K380J958J602J222N74k30o94o33n91j116j930
$$ plain form
54136 212307 213200 213335 213343 213699 214316 214823 214986 214740 214071 213138 212352 212046 212157 212449 212928 213772 214892 215895 216601
54117 216601 217347 218656 220672 223032 225193 226851 228155 229631 231789 234600 237424 239697 241703 244375
54103 244375 248209 252697 257094 261418 266194 271317 275818 278926 280781 281814 281893 280590 278008 274878 271958
54088 271958 269689 268273 267630 267360 267142 267151 267762 268884 270023 270917 271736 272605 273353 273775 273775 273201 271915 270119
54070 270119 268266 266577 264958 263416 262078 260665 258399 254794 250313 246030 242844 241112 240686 241026 241466
54055 241466 241626 241513 241198 240697 240276 240451 241381 242552 243442 244344 246116 249130 252767 256064 258697 261311
54039 261311 264865 269669 275051 280048 284379 288510 292829 297122 301077 305003 309652 315366 321628 327502
54025 327502 332364 336209 339388 342161 344541 346499 348101 349323 349897 349667 348973 348340 347749 346633 344703
54010C44703k375k465k835l583l966l499k839l064m283n474n686n008m203l686
53996B91737l193k417j578j102r67q40p47j089j861k379k108j332p09m46l63l67
53980B70239m35l12J82O98O67O0o24j037j277j475j496j179n53K19R18J361J571
53963B67527J780K031K054J819J959L120M978O505P251P844Q994J0447J1214J0589
53949C48112Q757O485M430K731J146m74j991l192l959m224m027l709l613l490
53935C42982k644j031L58O63K28k8J88O10J258K283L200L244K559K128K429K973
53919C61400L383L996M980N657N405M740M793N839O951P089O294N557N677O304
53905D38065O301N092L336K022J270N15m54j332k070k952l827m047l524l086l426
$$ plain form
54010 344703 342328 339863 337028 333445 329479 325980 323141 320077 315794 310320 304634 299626 295423 291737
53996 291737 288544 286127 284549 283447 282480 281640 280893 279804 277943 275564 273456 272124 271415 270969 270606 270239
53980 270239 269804 269492 269674 270372 271039 271099 270475 269438 268161 266686 265190 264011 263458 263677 264595 265956 267527
53963 267527 269307 271338 273392 275211 277170 280290 285268 291773 299024 306868 315862 326309 337523 348112
53949 348112 356869 363354 367784 370515 371661 371187 369196 366004 362045 357821 353794 350085 346472 342982
53935 342982 340338 339307 339665 340328 340556 340528 340716 341326 342584 344867 348067 351311 353870 355998 358427 361400
53919 361400 364783 368779 373759 379416 384821 389561 394354 400193 407144 414233 420527 426084 431761 438065
53905 438065 444366 449458 452794 454816 456086 456601 456147 454815 452745 449793 445966 441919 438395 435309 431883
53890D31883m239m846n203n679o239o438o134n676n473n628o015o373o389n864
53876C51687m927m008l550l672m015m026l554l036k923l079l001k509j864j333
53862C06190j068j267j968k756l128l123l059k815k034j053p09j087j308r04n37
53847B79374q46j352j240o85n40j009j399j153n28k20o80j699k450k123q58K94
53831B62886O65P64J322K044K073J425R75J074J060M48k55k89L17R97J433J566
53815B78505J241M98k9L94J578K517K611K275K125K114J905J664J859K456K977
53800C04690L346M012N096O001O217N962N686N395M909M424M203L994L356K416
53786C69707J704J342R66M04j65p11j459k377l062l286l216l068k969l234m149
$$ plain form
53890 431883 427644 422798 417595 411916 405677 399239 393105 387429 381956 376328 370313 363940 357551 351687
53876 351687 346760 342752 339202 335530 331515 327489 323935 320899 317976 314897 311896 309387 307523 306190
53862 306190 305122 303855 301887 299131 296003 292880 289821 287006 284972 283919 283210 282123 280815 279911 279374
53847 279374 278528 277176 275936 275251 274711 273702 272303 271150 270622 270402 269722 268023 265573 263450 262592 262886
53831 262886 263551 264315 265637 267681 269754 271179 272154 273228 274288 274736 274481 274192 274509 275506 276939 278505
53815 278505 279746 280244 280215 280609 282187 284704 287315 289590 291715 293829 295734 297398 299257 301713 304690
53800 304690 308036 312048 317144 323145 329362 335324 341010 346405 351314 355738 359941 363935 367291 369707
53786 369707 371411 372753 373719 374123 373958 373247 371788 369411 366349 363063 359847 356779 353810 350576 346427
53771C46427n321n799n160m033l287l060k941k670k312j984j789j848k138k427
53757C01658k574k706k985l322l538l533l171k273r53K63Q65P73J95o36j395j564
53741B75104q62K76R35N92l38r47q43n03n07o86l90L87Q35N07Q2M46J423K084
53723B77595K014J604J265J062J042J254J503J626J847K308K450J727O71L15O27
53708B98910O07L5j42O14J639K334L077M178N064N260N321N774N992N142L687
53693C47492K801K656K383J501M42k83n83m03L14J161J391P09m38j399j794j587
53677C54363j068p08p11q49r71j388k266k959k568j091N32J465J625J322P96K11
53661C45735l02p15j004j017n73K21R76J298J075N75K91L97M37m9o34l32R51K030
$$ plain form
53771 346427 341106 335307 330147 326114 322827 319767 316826 314156 311844 309860 308071 306223 304085 301658
53757 301658 299084 296378 293393 290071 286533 283000 279829 277556 276603 276866 277731 278504 278699 278063 276668 275104
53741 275104 274242 274518 275453 276045 275707 274760 273917 273414 272907 272221 271831 272218 273053 273560 273642 274088 275511 277595
53723 277595 279609 281213 282478 283540 284582 285836 287339 288965 290812 293120 295570 297297 297968 298283 298910
53708 298910 299517 299552 299410 300024 301663 303997 307074 311252 316316 321576 326897 332671 338663 343805 347492
53693 347492 350293 352949 355332 356833 357275 356992 356409 356006 356320 357481 358872 359581 359143 357744 355950 354363
53677 354363 353295 352587 351876 351027 350056 348668 346402 343443 340875 339784 340316 341781 343406 344728 345524 345735
53661 345735 345433 344718 343714 342697 342124 342345 343321 344619 345694 346269 346560 346957 347394 347345 346711 346379 347330 349360
53643C49360J949J235J063J651K247K333K106J876J752J870K316K796K825K327
53629C77706J691J286J224J533K112K603K597K093J505J299J693K557L448M003
53615D07350M370M994N863O446O554O633O886O742N729M320L256K518J673Q79
53601D74213P11J210J743J801J343N00m73j110j122q62r43j483k089k361k114
53586D68964j383o75p51j727k711k939k716k667k573j874r11o42j278k094k497
53571D41526k451k008j238o40p13j147j206q86q47j248j537j440j249r94l22O16
53555D24216J077Q66P29J215J852J938J548J274J424J856K329K667K796K752K519
53540D51058J989J339J141J645K290K574K931L953N106N400N045N171N951O492
$$ plain form
53643 349360 351309 352544 353607 355258 357505 359838 361944 363820 365572 367442 369758 372554 375379 377706
53629 377706 379397 380683 381907 383440 385552 388155 390752 392845 394350 395649 397342 399899 403347 407350
53615 407350 411720 416714 422577 429023 435577 442210 449096 455838 461567 465887 469143 471661 473334 474213
53601 474213 474924 476134 477877 479678 481021 481521 481048 479938 478816 477954 477011 475528 473439 471078 468964
53586 468964 467581 466906 466155 464428 461717 458778 456062 453395 450822 448948 448037 447395 446117 444023 441526
53571 441526 439075 437067 435829 435189 434476 433329 432123 431237 430390 429142 427605 426165 424916 423922 423600 424216
53555 424216 425293 426159 426888 428103 429955 431893 433441 434715 436139 437995 440324 442991 445787 448539 451058
53540 451058 453047 454386 455527 457172 459462 462036 464967 468920 474026 479426 484471 489642 495593 502085
53526E02085O707P681R610J0981J0811J0295J1013J2561J3382J3190J3109J3742
53514F35167J4573J5230J6078J7353J8635J9528K0197K0910K1577K2015K2234
53503H43497K2264K1987K1304K0402J9644J9302J9353J9530J9609J9675J9841
53492A066408J9810J9117J7888J6934J6822J7194J7302J6913J6374J6081J6163
53481A257006J6486J6684J6466J6039J5931J6121J5781J4297J2153J0326R058
53470A416348P741N875L600J284r26l018m952o704q327r816j1078j2040j2710
53457A365277j3159j3524j3967j4556j5167j5592j5737j5754j5967j6609j7527
53446A197718j8250j8467j8336j8141j7792j6956j5599j4083j2759j1705j0776
$$ plain form
53526 502085 508792 516473 526083 537064 547875 558170 569183 581744 595126 608316 621425 635167
53514 635167 649740 664970 681048 698401 717036 736564 756761 777671 799248 821263 843497
53503 843497 865761 887748 909052 929454 949098 968400 987753 1007283 1026892 1046567 1066408
53492 1066408 1086218 1105335 1123223 1140157 1156979 1174173 1191475 1208388 1224762 1240843 1257006
53481 1257006 1273492 1290176 1306642 1322681 1338612 1354733 1370514 1384811 1396964 1407290 1416348
53470 1416348 1424089 1429964 1433564 1434848 1433922 1430904 1425952 1419248 1410921 1401105 1390027 1377987 1365277
53457 1365277 1352118 1338594 1324627 1310071 1294904 1279312 1263575 1247821 1231854 1215245 1197718
53446 1197718 1179468 1161001 1142665 1124524 1106732 1089776 1074177 1060094 1047335 1035630 1024854
53435A024854r673q047n941l970k637j575k4J990L519L951L816M108N202O779
53421A022352Q410R905J1262J2554J3862J5225J6652J8061J9130J9559J9696K0482
53409A207150K2282K4187K5122K5304K5757K6784K7887K9073L0962L3519L5880
53398A513907L7730L9738M2094M3863M4483M4880M6173M8036M9319M9693M9742
53387B009658M9931N0272N0722N1057N0669M9196M7099M5024M2939M0518L7907
53376B524992L5367L2508K8749K4297J9924J5918J2001Q053M107k39n528j1484
53364B688665j7102k1896k6355l1065l5921m0413m4087m6573m7667m7757m7804
53353B282025m8490m9504m9843m8863m6924m5010m3716m2710m1421m0053l9352
$$ plain form
53435 1024854 1015181 1007134 1001193 997223 994586 993011 992987 994977 998496 1002447 1006263 1010371 1015573 1022352
53421 1022352 1030762 1040667 1051929 1064483 1078345 1093570 1110222 1128283 1147413 1166972 1186668 1207150
53409 1207150 1229432 1253619 1278741 1304045 1329802 1356586 1384473 1413546 1444508 1478027 1513907
53398 1513907 1551637 1591375 1633469 1677332 1721815 1766695 1812868 1860904 1910223 1959916 2009658
53387 2009658 2059589 2109861 2160583 2211640 2262309 2311505 2358604 2403628 2446567 2487085 2524992
53376 2524992 2560359 2592867 2621616 2645913 2665837 2681755 2693756 2701809 2705916 2705677 2700149 2688665
53364 2688665 2671563 2649667 2623312 2592247 2556326 2515913 2471826 2425253 2377586 2329829 2282025
53353 2282025 2233535 2184031 2134188 2085325 2038401 1993391 1949675 1906965 1865544 1825491 1786139
53342A786139l9313l8885l7388l5488l4128l3043l1282k8806k6531k4823k3033
53331A433419k0702j8355j6640j5386j4052j2570j1271j0258r460r050r279r949
53319A276447j0512j0802j1213j1952j2425j1843j0243q465p027n651m118k974
53307A169222k722k742j896k9J965L581N188O906Q091Q506R039J0501J2431J3942
53293A241983J5192J6956J9156K0809K1380K1341K1331K1475K1664K1836K1863
53282A464986K1550K0828J9633J7755J5191J2501J0243Q211N775K877J27k169
53270A597508m448p171j0120j2675j4492j5726j6809j8066j9486k0874k2231k3789
53258A411621k5506k6876k7514k7688k7881k8039k7768k7127k6676k6727k6879
$$ plain form
53342 1786139 1746826 1707941 1670553 1635065 1600937 1567894 1536612 1507806 1481275 1456452 1433419
53331 1433419 1412717 1394362 1377722 1362336 1348284 1335714 1324443 1314185 1304725 1295675 1286396 1276447
53319 1276447 1265935 1255133 1243920 1231968 1219543 1207700 1197457 1188992 1181965 1176314 1172196 1169222
53307 1169222 1166500 1163758 1161862 1161833 1163798 1167379 1172567 1179473 1187564 1196070 1205109 1215610 1228041 1241983
53293 1241983 1257175 1274131 1293287 1314096 1335476 1356817 1378148 1399623 1421287 1443123 1464986
53282 1464986 1486536 1507364 1526997 1544752 1559943 1572444 1582687 1590898 1596673 1599550 1599677 1597508
53270 1597508 1593060 1585889 1575769 1563094 1548602 1532876 1516067 1498001 1478515 1457641 1435410 1411621
53258 1411621 1386115 1359239 1331725 1304037 1276156 1248117 1220349 1193222 1166546 1139819 1112940
53247A112940k6476k5358k4067k3323k3253k3197k2555k1642k1154k0918j9979
53236H61018j8189j6724j6504j6867j6604j5551j4307j2986j1307r553q369p731
53224F96326p022o071n386n409o227p798r720j1062j1268j0998j1198j1695j1617
53211E80855j0967j0524j0343r678q448p507p179o805o141n947o632p363p325
53198D75996o926o963p343p448p190o998p056p189p150o728n908n151n034n366
53184C83546n347m851m675n066m975l587j845j402k388l253k726j168R6K14n50
53169C42023j208j064m70l99j195k131k444k322k402k766k976k835k528k135j567
53154C13581r07m56l89o56j057j252r65m06j99n85j011r29n97n93q16n89K94J222
$$ plain form
53247 1112940 1086464 1061106 1037039 1013716 990463 967266 944711 923069 901915 880997 861018
53236 861018 842829 826105 809601 792734 776130 760579 746272 733286 721979 712426 704057 696326
53224 696326 689304 683233 677847 672438 666211 658413 648693 637631 626363 615365 604167 592472 580855
53211 580855 569888 559364 549021 539343 530895 523388 516209 509404 503263 497316 490684 483321 475996
53198 475996 469070 462107 454764 447316 440126 433128 426072 418883 411733 405005 399097 393946 388912 383546
53184 383546 378199 373348 368673 363607 358632 355045 353200 351798 349410 346157 343431 342263 342359 342573 342023
53169 342023 340815 339751 339281 338882 337687 335556 333112 330790 328388 325622 322646 319811 317283 315148 313581
53154 313581 312674 312218 311829 311173 310116 308864 307899 307493 307294 306709 305698 304769 304172 303579 302763 302174 302468 303690
53136C03690J495J037L16o1L26J427K647L275L088K447J790J294R66Q21Q59R92
53120C26409J097J108J021Q60P01O77R46J471J846J639J010O62Q76R52J08j331
53104C40052k312k444k255k105j715j033o78j036j630j837j740j687j639j509
53090C16432j625k135k336j450J51J220J124M41Q2L44Q84J195R62K81m03p27p26
53073C13714o06m61m75r71j878k445k060j133n86n79m57N1L14k79j434k327k526
53056B95862k086j101L20J698K267J737P28J71K85M91L45J95N74J246J466R75
53040C05173K53k92o53p35k62M95O51j56j130j393j087q14n30J71J038J358J063
53023C03150P79Q94J211J523J774J656Q48k84r31r42q82q90l92P29J560J343N38
$$ plain form
53136 303690 305185 306222 306538 306477 306803 308230 310877 314152 317240 319687 321477 322771 323737 324558 325417 326409
53120 326409 327506 328614 329635 330495 331196 331873 332819 334290 336136 337775 338785 339447 340323 341275 341383 340052
53104 340052 337740 335296 333041 330936 329221 328188 327510 326474 324844 323007 321267 319580 317941 316432
53090 316432 314807 312672 310336 308886 309037 310257 311381 311822 311904 312248 313132 314327 315289 315570 315167 314440 313714
53073 313714 313108 312647 312172 311201 309323 306878 304818 303685 303099 302520 302063 302114 302428 302149 300715 298388 295862
53056 295862 293776 292675 292995 294693 296960 298697 299425 299596 299881 300372 300717 300912 301486 302732 304198 305173
53040 305173 305426 305134 304481 303746 303484 303979 304630 304474 303344 301951 300864 300050 299520 299691 300729 302087 303150
53023 303150 303929 304823 306034 307557 309331 310987 311835 311551 310620 309678 308796 307906 307514 308243 309803 311146 311684
53006C11684M7j9j25k51N4P34J138R34M43N4j63j64K05P79J030P58N16R44J894
52987C20492K607K628K266K083K151J995J161k38j495j867j232j32P42J063R11
52972C33135N56L55N96J161J470J094L81J34N92J164J223Q39M59K41N0j27j95
52955C43128j97k66l54m01o07j258k220k993l224l004k597k143j605q72L2P70
52939C22189R06M59j9j13k2o2j06K4N3k78o04m95k75m76p47l73L14K73m46n74
52919C19628L30R76L11q41j050l28K28J86Jj20m09p86q85p61p95q64m98K47P12
52900C15282N78J48k84p14j046j016o48k19K51R82J861K404K402K124J825J514
52884C25444J199Q79L39n24j193j004j38M85M75L84O52R08P65O31J075J881K442
$$ plain form
53006 311684 311731 311712 311587 311336 311390 312124 313262 314196 314639 314693 314530 314366 314571 315350 316380 317138 317654 318598 320492
52987 320492 323099 325727 327993 330076 332227 334222 335383 335145 333650 331783 330551 330419 331161 332224 333135
52972 333135 333691 334046 334642 335803 337273 338367 338748 338882 339474 340638 341861 342700 343159 343400 343450 343323 343128
52955 343128 342931 342665 342311 341910 341303 340045 337825 334832 331608 328604 326007 323864 322259 321387 321419 322189
52939 322189 323095 323554 323535 323422 323400 323338 323232 323256 323309 323031 322427 321932 321657 321181 320434 320061 320375 320648 320202 319628
52919 319628 319958 320934 321245 320404 319354 319026 319254 319440 319441 319321 318912 318126 317241 316480 315685 314821 314323 314570 315282
52900 315282 315860 316008 315724 315010 313964 312948 312300 312081 312332 313314 315175 317579 319981 322105 323930 325444
52884 325444 326643 327522 327861 327337 326144 325140 325002 325487 325962 326346 326998 327906 328671 329302 330377 332258 334700
52867C34700K773L393M264M609L896K520J195J14r43j951k569k746k944l526m182
52852C38603m309l807l166k819k729k698k622k385j854j261j109j437j586j109
52838C05712n22o07j274j705j531j130q18l62M54J266J468R11O2m05j54M89Q15
52821C02669M76r9k75PL38N41P72R89Q57L29r7P5Q17J659K057J689O91l59r53
52802C12183j195j493j836j766j179o71r31j953l019l256k299o75N27P05L70L54
52786B93866N89L61l28n14L20J369J590J038N07K80L1l01k87K36Q20R99Q38O78
52768C02092O62P02P34P00M04l36j309j862j509n46J73K18L2K30P20R33P44O50
52750C03432J001J525J794J724J410R29N53P61J607K406K468J889J261P47J10
$$ plain form
52867 334700 337473 340866 345130 349739 353635 356155 357350 357464 356521 354570 352001 349255 346311 342785 338603
52852 338603 334294 330487 327321 324502 321773 319075 316453 314068 312214 310953 309844 308407 306821 305712
52838 305712 305190 304583 303309 301604 300073 298943 298125 297763 298217 299483 300951 301862 301924 301519 301365 301854 302669
52821 302669 303145 303046 302771 302778 303116 303657 304429 305418 306275 306604 306507 306582 307399 309058 311115 312804 313495 313136 312183
52802 312183 310988 309495 307659 305893 304714 304043 303112 301159 298140 294884 292585 291910 292437 293142 293512 293866
52786 293866 294455 294816 294488 293974 294294 295663 297253 298291 298798 299078 299109 298808 298521 298757 299577 300576 301414 302092
52768 302092 302754 303456 304190 304890 305294 304958 303649 301787 300278 299732 299905 300123 300155 300385 301105 302038 302782 303432
52750 303432 304433 305958 307752 309476 310886 311815 312368 313129 314736 317142 319610 321499 322760 323507 323617
52735C23617n27o38j71J87o7n38o30m37l50j36P12J749J723L17j157j419q93q08
52717C20534j260j248m63K51L20J91J99j07q90j295o98J02M2n07l89L82O04j81
52699C15587j029j067n77j45L16J105J853J874J076R9m54n67o13p79p79k55N45
52682C16190Q60L90k64n05n58q09q58j20R47J243O16J7N4L99P76J430K223K313
52664C24344J361K50j0N39J211J593J527R19J67J76J295K691L374L315L028K634
52648C48414J989J237N17m07j593k456k581k513k956l545l341k257j120m89k52
52633C28647k43l94l15M41J605K365K332J779J000J60k87P4Q00R31K59m32o27
52616C38095p05j068j416j359j100r82r07o14j65L16R20J571J828J524J151J117
$$ plain form
52735 323617 323090 322452 322281 322468 322401 321863 321233 320796 320446 320310 321022 322771 324494 324811 323654 322235 321342 320534
52717 320534 319274 318026 317563 317814 318134 318325 318524 318417 317527 316232 315534 315636 315678 315171 314782 315164 315768 315587
52699 315587 314558 313491 312914 312769 313085 314190 316043 317917 318993 319092 318638 318071 317458 316679 315900 315645 316190
52682 316190 317050 317440 317176 316671 316113 315304 314446 314326 315273 316516 317132 317149 317203 317602 318378 319808 322031 324344
52664 324344 325705 325955 325945 326484 327695 329288 330815 331734 331901 332077 333372 336063 339437 342752 345780 348414
52648 348414 350403 351640 352157 351750 350157 347701 345120 342607 339651 336106 332765 330508 329388 328899 328647
52633 328647 328404 328010 327695 328136 329741 332106 334438 336217 337217 337377 337090 337164 337964 338895 339154 338722 338095
52616 338095 337390 336322 334906 333547 332447 331465 330558 329944 329779 330095 331015 332586 334414 335938 337089 338206
52600C38206J041M10m35p11m11k52m41l58L19R36P83K09J56Q42J484J312M65k10
52582C43345j4R76J887J780O00o30r00l87p8l12m07N4L97r9r62j166o82m79j033
52563C41890j784k111j979j455m29P39J198O98Nk78n43j198j615j038P8O74P13
52546C33565R96J530J339J70p92n04N43J117Q47K97p1k74l50j83J87N41Q05J130
52528C40893J572J956K129K098J920J641J449J637K214K644K264J161L33P45K283
52513C66939L911M830N116N159M959M279L110J681J91j172k150k717l233l983
52499C86920m757n191n277n210m956m376l603k816j857o28L67M80j54p37q36o46
52483C46723l32J84O68O59K84K79Q51J247R10M11O46J575K403K671K571K473K667
$$ plain form
52600 338206 339247 339657 339222 338511 338100 337848 337407 337049 337368 338304 339087 339296 339452 340294 341778 343090 343555 343345
52582 343345 343331 344307 346194 347974 348574 347944 347044 346657 346579 346267 345860 345914 346311 346212 345250 344084 343402 342923 341890
52563 341890 340106 337995 336016 334561 334132 334871 336069 336767 336772 336494 335951 334753 333138 332100 332178 332852 333565
52546 333565 334561 336091 337430 337600 336808 336304 336847 337964 338811 339108 339037 338763 338413 338230 338417 338958 339763 340893
52528 340893 342465 344421 346550 348648 350568 352209 353658 355295 357509 360153 362417 363578 363911 364656 366939
52513 366939 370850 375680 380796 385955 390914 395193 398303 399984 400175 399003 396853 394136 390903 386920
52499 386920 382163 376972 371695 366485 361529 357153 353550 350734 348877 348249 348616 349096 348942 348205 347369 346723
52483 346723 346391 346575 347243 347902 348186 348465 349316 350563 351473 351884 352530 354105 356508 359179 361750 364223 366890
52466C66890L409M626N647N702M747L395K184J165K09p69j846l082m300n151n405
52451C77421n111m473l755l174k796k571k500k559k440j745o66n4m63j407j980
52436C41727j907j538j018j70Q39J391J182O36L35L69M88N61O00N54L71J81K16
52419C44817N36R49J185J155J066J217J695K295K827L338L881M399M966N963P587
52404C87876R334J0363J0370R676Q553O895M651K088n20l125n607p543q479q259
52390D16273p048n339l868l172l065k922k482j949j330l40Q35J413J159R54J664
52375C90783K908L710L874L989M216M033L168K071J281R06P67N93kj168k389k907
52359D15833k633k146j806j431q91l81P2O75J284J404J006O88P17O49K82K37R66
$$ plain form
52466 366890 370299 374925 380572 386274 391021 394416 396600 397765 397974 397205 395359 392277 387977 382826 377421
52451 377421 372310 367837 364082 360908 358112 355541 353041 350482 348042 346297 345631 345577 345114 343707 341727
52436 341727 339820 338282 337264 337094 337933 339324 340506 341142 341477 341846 342334 342895 343495 344049 344420 344601 344817
52419 344817 345353 346302 347487 348642 349708 350925 352620 354915 357742 361080 364961 369360 374326 380289 387876
52404 387876 397210 407573 417943 427619 436172 443067 447718 449806 449286 446161 440554 433011 424532 416273
52390 416273 409225 403886 400018 396846 393781 390859 388377 386428 385098 384758 385593 387006 388165 389119 390783
52375 390783 393691 397401 401275 405264 409480 413513 416681 418752 420033 420939 421706 422299 422297 421129 418740 415833
52359 415833 413200 411054 409248 407817 406926 406545 406617 407292 408576 409980 410986 411674 412391 413040 413322 413559 414525
52342D14525J894K196J950J782J859K070K686M002N500O358O640P130Q012Q640
52328D75244Q721Q775R192R611R653R508R338Q793P730O916P235Q414R254R150
52314E97534Q861R471J1033J2604J3443J3796J4358J5308J6293J7174J8262J9679
52302G67816K1045K1993K2562K2698K1933K0107J7987J6493J5549J4402J2843
52291I75428J1284R789P955N798L913K561J347N4r63j463j693j787j580j295j638
52276A007710k705l565l505l007k821k787k371j814j795k186k134j314k72N32
52262I77966J340K566M205N995P788R571J1338J2988J4264J4907J5012J5032J5142
52249A108114J4853J3604J1606R695Q378P417O340N041L878L266L153K800J358
$$ plain form
52342 414525 416419 418615 420565 422347 424206 426276 428962 432964 438464 444822 451462 458592 466604 475244
52328 475244 483965 492740 501932 511543 521196 530704 540042 548835 556565 563481 570716 579130 588384 597534
52314 597534 606395 615866 626899 639503 652946 666742 681100 696408 712701 729875 748137 767816
52302 767816 788861 810854 833416 856114 878047 898154 916141 932634 948183 962585 975428
52291 975428 986712 996501 1004456 1010254 1014167 1016728 1018075 1018129 1017166 1015703 1014010 1012223 1010643 1009348 1007710
52276 1007710 1005005 1001440 997935 994928 992107 989320 986949 985135 983340 981154 979020 977706 977434 977966
52262 977966 979306 981872 986077 992072 999860 1009431 1020769 1033757 1048021 1062928 1077940 1092972 1108114
52249 1108114 1122967 1136571 1148177 1157872 1166250 1173667 1180007 1185048 1188926 1192192 1195345 1198145 1199503
52236A199503j144l676n308o196p118q331r324r582r240q949r331j0421j1566
52223A099317j2099j2173j2529j3276j3584j2927j1962j1495j1188j0176q556
52212I69352p246o480n524l976k422j520j165r25o96n54m10j27L70J259K688M346
52196I46970N609O249O637P069P401P486P422P066N876L604Q66j429k922l874
52182A004030m599n229n819o346o709o943p279p775q016p473o125m536l337k674
52168I21170k129j155L64K001L267M124M804N266N180M475L580K908K401J755
52154I58011Q84j5p33j114r92k77P97J702K002J787J576J782K273K590K492K118
52138I74883J720J530J805K590L354L450L150L635N576Q203J0301J1678J3034
$$ plain form
52236 1199503 1198359 1194683 1189375 1183179 1176061 1167730 1158406 1148824 1139584 1130635 1121304 1110883 1099317
52223 1099317 1087218 1075045 1062516 1049240 1035656 1022729 1010767 999272 988084 977908 969352
52212 969352 962106 955626 950102 946126 943704 942184 941019 940094 939398 938844 938434 938307 938677 939936 942624 946970
52196 946970 952579 958828 965465 972534 979935 987421 994843 1001909 1007785 1011389 1012255 1010826 1007904 1004030
52182 1004030 999431 994202 988383 982037 975328 968385 961106 953331 945315 937842 931717 927181 923844 921170
52168 921170 919041 917886 918250 920251 923518 927642 932446 937712 942892 947367 950947 953855 956256 958011
52154 958011 958895 958880 958147 957033 956041 955764 956561 958263 960265 962052 963628 965410 967683 970273 972765 974883
52138 974883 976603 978133 979938 982528 985882 989332 992482 996117 1001693 1009896 1020197 1031875 1044909
52125A044909J4734J6452J7818J8730J9047J8714J8158J7891J7776J7281J6406
52114A237916J5661J5073J4114J2766J1883J2084J2952J3755J4403J5258J6435
$$ plain form
52125 1044909 1059643 1076095 1093913 1112643 1131690 1150404 1168562 1186453 1204229 1221510 1237916
52114 1237916 1253577 1268650 1282764 1295530 1307413 1319497 1332449 1346204 1360607 1375865 1392300
$$ [...]
##END NTUPLES=NMR SPECTRUM
##END=
