##TITLE=AC1638_CTIAH13371_8569428_wyTXtcWmSr
##JCAMPDX= 6.0         $$ Bruker NMR JCAMP-DX V2.0
##DATA TYPE= NMR SPECTRUM
##DATA CLASS= NTUPLES
##ORIGIN= BRUKER
##OWNER= Administrator
$$ 1.72 TOPSPIN		Version 2.1
$$ 2014-04-10 23:44:58.234 -0700  Administrator@X
$$ Compression mode = diff/dup
##.OBSERVE FREQUENCY= 400.02188249412
##.OBSERVE NUCLEUS= ^1H
##.ACQUISITION MODE= SIMULTANEOUS (DQD)
##.ACQUISITION SCHEME= undefined
##.AVERAGES= 8
##.DIGITISER RES= 22
##SPECTROMETER/DATA SYSTEM= spect
##.PULSE SEQUENCE= zg30
##.SOLVENT NAME= COFFEE_meoh
##.SHIFT REFERENCE= INTERNAL, COFFEE_meoh, 1, 14.98509
##AUDIT TRAIL= $$ (NUMBER, WHEN, WHO, WHERE, PROCESS, VERSION, WHAT)
$$ ##TITLE= Audit trail, TOPSPIN		Version 2.1
$$ ##JCAMPDX= 5.01
$$ ##ORIGIN= Bruker BioSpin GmbH
$$ ##OWNER= Administrator
$$ $$ E:\/data/COFFEE/nmr/AC1638_CTIAH13371_8569428_wyTXtcWmSr/10/pdata/1/auditp.txt
$$ ##AUDIT TRAIL=  $$ (NUMBER, WHEN, WHO, WHERE, PROCESS, VERSION, WHAT)
(   1,<2014-04-10 23:44:50.152 -0700>,<Administrator>,<X>,<go>,<TOPSPIN 2.1>,
      <created by zg
	started at 2014-04-10 23:43:44.417 -0700,
	POWCHK enabled, PULCHK disabled,
       configuration hash MD5:
       C8 4E 4E 5D D3 5C D8 9E 9F 52 82 E0 59 8A DE 15
       data hash MD5: 64K
       D5 7C 2A 35 1D 50 60 3D D3 2D CF 9F 59 EB F3 67>)
(   2,<2014-04-10 23:44:53.667 -0700>,<Administrator>,<X>,<proc1d>,<TOPSPIN 2.1>,
      <Start of raw data processing
       efp LB = 0 FT_mod = 6 PKNL = 1 PHC0 = 0 PHC1 = 0 SI = 32K 
       data hash MD5: 32K
       74 16 23 47 44 40 BE 96 D4 3B F7 0D 10 14 6E 85>)
(   3,<2014-04-10 23:44:54.073 -0700>,<Administrator>,<X>,<proc1d>,<TOPSPIN 2.1>,
      <pk PHC0 = 94.422 PHC1 = 0 
       data hash MD5: 32K
       C2 85 A5 4A E8 20 37 97 ED F3 5F 9D C8 C8 BE BF>)
(   4,<2014-04-10 23:44:54.386 -0700>,<Administrator>,<X>,<proc1d>,<TOPSPIN 2.1>,
      <abs ABSG = 1 
       data hash MD5: 32K
       D6 FD CB 84 C3 2C A0 A8 19 07 71 B3 0E 31 A6 7B>)
(   5,<2014-04-10 23:44:54.558 -0700>,<Administrator>,<X>,<proc1d>,<TOPSPIN 2.1>,
      <abs ABSG = 2 
       data hash MD5: 32K
       3A 63 DF 81 B6 06 19 D4 05 EA 9C 97 D6 84 9F 85>)
(   6,<2014-04-10 23:44:54.761 -0700>,<Administrator>,<X>,<proc1d>,<TOPSPIN 2.1>,
      <abs ABSG = 3 
       data hash MD5: 32K
       63 B7 C2 38 DD A3 99 6A 65 E1 1A 31 9B A2 76 AF>)
(   7,<2014-04-10 23:44:54.839 -0700>,<Administrator>,<X>,<proc1d>,<TOPSPIN 2.1>,
      <abs ABSG = 4 
       data hash MD5: 32K
       28 5B 73 52 F8 71 BF DA F3 74 38 7D 22 26 D5 91>)
(   8,<2014-04-10 23:44:54.902 -0700>,<Administrator>,<X>,<proc1d>,<TOPSPIN 2.1>,
      <abs ABSG = 5 
       data hash MD5: 32K
       8C 2B 4F 3B F7 A0 A1 63 D4 33 83 38 EC 43 33 20>)
$$ ##END=
$$ 
$$ $$ hash MD5
$$ $$ 79 BF D7 12 FA 62 2B AB B3 7F C9 8C 2F 80 61 D5
##$RELAX= 
##$RELAX= 
##$RELAX= 
##$RELAX= 
##$RELAX= 
##$RELAX= 
##$RELAX= 
$$ Bruker specific parameters
$$ --------------------------
##$DU= <E:\>
##$EXPNO= 10
##$NAME= <AC1638_CTIAH13371_8569428_wyTXtcWmSr>
$$ [...]
##$TP= (0..7)
150 150 150 150 150 150 150 150
##$TP07= 0
##$TPNAME0= <>
##$TPNAME1= <>
##$TPNAME2= <>
##$TPNAME3= <>
##$TPNAME4= <>
##$TPNAME5= <>
##$TPNAME6= <>
##$TPNAME7= <>
##$TPOAL= (0..7)
0.5 0.5 0.5 0.5 0.5 0.5 0.5 0.5
##$TPOFFS= (0..7)
0 0 0 0 0 0 0 0
##$TUNHIN= 0
##$TUNHOUT= 0
##$TUNXOUT= 0
##$USERA1= <user>
##$USERA2= <user>
##$USERA3= <user>
##$USERA4= <user>
##$USERA5= <user>
##$V9= 5
##$VALIST= <valist>
##$VCLIST= <CCCCCCCCCCCCCCC>
##$VD= 0
##$VDLIST= <DDDDDDDDDDDDDDD>
##$VPLIST= <PPPPPPPPPPPPPPP>
##$VTLIST= <TTTTTTTTTTTTTTT>
##$WBST= 1024
##$WBSW= 4
##$XGAIN= (0..3)
0 0 0 0
##$XL= 0
##$YL= 0
##$YMAX_a= 624455
##$YMIN_a= -530517
##$ZGOPTNS= <>
##$ZL1= 120
##$ZL2= 120
##$ZL3= 120
##$ZL4= 120
##$ABSF1= 14.98509
##$ABSF2= -5.573092
##$ABSG= 5
##$ABSL= 3
##$ALPHA= 0
##$AQORDER= 0
##$ASSFAC= 0
##$ASSFACI= 0
##$ASSFACX= 0
##$ASSWID= 0
##$AUNMP= <proc_prof1d_extract_pilot.lims>
##$AXLEFT= 0
##$AXNAME= <>
##$AXNUC= <1H>
##$AXRIGHT= 0
##$AXTYPE= 0
##$AXUNIT= <>
##$AZFE= 0.1
##$AZFW= 0.1
##$BCFW= 0
##$BC_mod= 0
##$BYTORDP= 0
##$COROFFS= 0
##$CY= 15
##$DATMOD= 1
##$DC= 0
##$DFILT= <>
##$DTYPP= 0
##$F1P= 0
##$F2P= 0
##$FCOR= 0.5
##$FTSIZE= 32768
##$FT_mod= 6
##$GAMMA= 0
##$GB= 0
##$INTBC= 1
##$INTSCL= 1
##$ISEN= 128
##$LB= 0
##$LEV0= 0
##$LPBIN= 0
##$MAXI= 10000
##$MC2= 0
##$MEAN= 0
##$ME_mod= 0
##$MI= 0
##$NCOEF= 0
##$NC_proc= -8
##$NLEV= 6
##$NOISF1= 0
##$NOISF2= 0
##$NSP= 0
##$NTH_PI= 0
##$NZP= 0
##$OFFSET= 14.98509
##$PC= 1
##$PHC0= 94.422
##$PHC1= 0
##$PH_mod= 1
##$PKNL= yes
##$PPARMOD= 0
##$PPDIAG= 0
##$PPIPTYP= 0
##$PPMPNUM= 2147483647
##$PPRESOL= 1
##$PSCAL= 4
##$PSIGN= 0
##$PYNMP= <proc.py>
##$REVERSE= no
##$SF= 400.02
##$SI= 32768
##$SIGF1= 0
##$SIGF2= 0
##$SINO= 400
##$SIOLD= 32768
##$SPECTYP= <>
##$SREGLST= <1H.CDCl3>
##$SSB= 0
##$STSI= 32768
##$STSR= 0
##$SW_p= 8223.68421052631
##$SYMM= 0
##$S_DEV= 0
##$TDeff= 65536
##$TDoff= 0
##$TI= <>
##$TILT= no
##$TM1= 0
##$TM2= 0
##$TOPLEV= 0
##$USERP1= <user>
##$USERP2= <user>
##$USERP3= <user>
##$USERP4= <user>
##$USERP5= <user>
##$WDW= 1
##$XDIM= 32768
##$YMAX_p= 458000548
##$YMIN_p= -782764
##$CURPLOT= <Network HP LaserJet P1505>
##$CURPRIN= <$Network HP LaserJet P1505>
##$DFORMAT= <normdp>
##$LAYOUT= <+/1D_H.xwp>
##$LFORMAT= <normlp>
##$PFORMAT= <normpl>
##$SURQMSG= 1
$$ End of Bruker specific parameters
$$ ---------------------------------
##NTUPLES= NMR SPECTRUM
##VAR_NAME=  FREQUENCY,     SPECTRUM/REAL,   SPECTRUM/IMAG
##SYMBOL=    X,             R,               I
##VAR_TYPE=  INDEPENDENT,   DEPENDENT,       DEPENDENT
##VAR_FORM=  AFFN,          ASDF,            ASDF
##VAR_DIM=   32768,         32768,           32768
##UNITS=     HZ,            ARBITRARY UNITS, ARBITRARY UNITS
##FACTOR=    0.250966925370066, 1,           1
##FIRST=     8223.43324360094, -52648,       -206500
##LAST=      0,             22644,           -194281
##MIN=       0,             -782764,         0
##MAX=       8223.43324360094, 458000548,    0
$$ Real data points
##PAGE= N=1
##DATA TABLE= (X++(R..R)), XYDATA
$$ [...]
19546A85548F2795N1610m4626K0147J49286a43351K4956e3147A91659E0143P9559
19535A29702b55691A30716K678h4295o806a9872l45093i5201i821j5784j9316
19524d4921k00940J06944G1460J38117d1630a6145k0271B97072b7448A08719i9893
19512B18505n6906E6306B4014b813D7639f2731A56706f1332k61519e9781l2347
19501i2128M1666F4786O6333d5624k7679B53638I4377K36862j57548b10519f7693
19489c81177J64641d7194o5000j03709j2208q2466A5735a4824r2631e0801j83602
19478b34403D66060D8985A2152c25782c4044G879g1861r6206d8089r6496O3744
19467h0841g063A15221a68453f9599k1256o0284j56028c6660j64342j89118a54371
$$ y = [185548, 62795, 114405, 69779, 89926, 239212, -143351, -118395, -53147, 191659, 50143, 129702, -255691, 130716, 133394, -84295, -91101, -19872, -364965, -95201, -9821, -25605, -44921, -245861, -138917, 71460, 209577, -41630, -16145, -36416, 297072, -27448, 108719, -99893, 218505, 161599, 56306, 24014, -2813, 47639, -62731, 156706, -61332, -322851, -59781, -92128, -50462, 64786, 131119, -45624, -73303, 253638, 94377, 331239, 173691, -210519, -67693, -381177, -216536, -47194, -112194, -215903, -228111, -310577, 15735, -14824, -107455, -50801, -234403, 466060, 48985, 12152, -325782, -34044, 7879, -71861, -168067, -48089, -144585, -80841, -7063, 115221, -168453, -69599, -90855, -151139, -307167, -36660, -201002, -390120, -154371]
19455e4269o6602c3759l39884a34169A0803a87777F9762a75913j24526K284k4243
19444c22398A47415a68783P045C16735e7926C8022K826k0046J41003D6995j7286
19433B9709b17696h5041A76654b13675a3891A64368d0392m07361e4390q0223A83613
19421E3925o200f3115L820I1967a7199j56448F9258r218b26139B08742B0433b39120
19408a94591a5853q7337c3672p8018j80854O8942G5190N6195D5517c88449A99582
19396E8206c54770B39534b24064A2560a770o5352k29021j054B72491q2246g8477
19384b19747R3038M3991k1187A18117d8243D3924a26034o9959L2137k51524B9795
19372G3041O2K8408l322J98736A33786n4541J62347j7187D9975b86840A15216
$$ y = [-54269, -120871, -33759, -373643, -134169, 10803, -187777, 69762, -175913, -300439, -298155, -322398, 147415, -168783, -161738, 316735, -57926, 38022, 40848, 20802, 161805, 46995, 29709, -217696, -85041, 176654, -213675, -13891, 164368, -40392, -447753, -54390, -134613, 183613, 53925, 47725, -63115, -59295, 91967, -17199, -173647, 69258, 60040, -226139, 208742, 20433, -239120, -194591, -15853, -103190, -33672, -111690, -292544, -223602, 75190, 131385, 45517, -388449, 199582, 58206, -354770, 239534, -224064, 12560, -1770, -67122, -296143, -297197, 272491, 190245, -78477, -219747, -126709, -82718, -103905, 118117, -48243, 43924, -126034, -195993, -163856, -415380, 29795, 73041, 73103, 101511, 98189, 296925, 133786, 79245, 241592, 224405, 49975, -286840, 115216]
19360A99706P924a14724K7849A8377a53714c4745B7263a85624A49461J62688b48847
19348e043b397l91976D2386b59773J10465A25297L713e6426r4685e0823a5780
19336F526a27858O0856K278C1002a77983A44760a10659l2492i574k76413L2107
19325b53880M9676B4793c69285A14004a88132d9498k71014e4970k71555G7752
19314b41921A90896m2009a5256m8847A86957a10286j09431P355g9439j94354k52877
19303e26670B7229Q5375P791c29509A88875j8332j71a10646j29789a11173l71344
19292d82517a76797c2221k61652a01136d2281D726b04488G8704O3547a47286H884
19280c27146C2439b93452B371d8488k30915b861B13277K51362A51024m8123K3991
$$ y = [199706, 207630, -114724, -86875, 18377, -153714, -34745, 27263, -185624, 149461, 312149, -248847, -5043, -2397, -394373, 42386, -259773, -149308, 125297, 129010, -56426, -151111, -50823, -15780, 6526, -127858, -67002, -64724, 31002, -177983, 144760, -110659, -143151, -9574, -285987, -253880, -204204, 24793, -369285, 114004, -188132, -49498, -320512, -54970, -326525, 77752, -241921, 190896, 148887, -15256, -64103, 186957, -110286, -219717, -212362, -79439, -273793, -526670, 27229, 112604, 120395, -329509, 188875, 170543, 170372, -110646, -240435, -111173, -482517, -176797, -32221, -293873, -101136, -42281, 4726, -204488, 78704, 142251, -147286, 8884, -327146, 32439, -293452, 2371, -48488, -279403, -2861, 213277, 464639, 151024, 102901, 126892]
19269A26892m4011a28556F7187R7911a08537A63470a09549b1003A92607C3134
19258b2632l93304A47720b274B5277P4855m066b15470k3394i8370B51433b06637
19246g7840A7782O3386c77835B32089J3330e6933J7341A9720K65484d7582A72535
19234A18542a03978D6020a99757b0282l87801f8254A39031a28618m9519c3936
19223b35349r3917J28890A11812d00674b5728A91176e1626D594J46638c87954
19212e1543B60011e5636j19129j3113B1405d1383j63180I3957Q632a61096A40550
19200C00627b86029B4934c04948c0713o2518B6982e6331l03294D5917a90674G6878
19188A7447P5316e7736j74830B50935a75296N6895K2999J143J6586k6940k31081
$$ y = [126892, 82881, -128556, 67187, 165098, -108537, 163470, -109549, -21003, 192607, 33134, -22632, -415936, 147720, -2274, 25277, 100132, 96066, -215470, -238864, -98370, 251433, -206637, -77840, 17782, 81168, -377835, 232089, 245419, -56933, -39592, 19720, 285204, -47582, 172535, 118542, -103978, 46020, -199757, -20282, -408083, -68254, 139031, -128618, -178137, -33936, -235349, -329266, -200376, 111812, -400674, -25728, 191176, -51626, 4594, 151232, -387954, -51543, 260011, -55636, -174765, -187878, 21405, -41383, -204563, 93957, 102589, -161096, 140550, 300627, -286029, 24934, -304948, -30713, -93231, 26982, -56331, -359625, 45917, -190674, 76878, 17447, 92763, -57736, -232566, 250935, -175296, -118401, -95402, -94259, -77673, -104613, -335694]
19177c35694J67830j06815J24415B11827d12131b5264j40572A46357b68246d2180
19166a77220M4384d2717j52474A4383a84741C0325f920D16340b39994a19756p6377
19155a96133n00028a7138A89620d01920e0539A97754H9236b41171e1502c148j20411
19144a23559m8798a1048j03279a0877D5918c2514k54697a6611k03131f4002k08716
19133b72718J27257O875B59056c2571j3899J3555B13630H326a49333e8878j69741
19122b28619A37318K9685c15029K23J50876j9717A8188J23291n259O0138f1947
19110a29065d0016n8831a4128C33990I6611O3343J06792a47008j16577R1098f5297
19098a67949H9399D2591N2366a74389l3843j28164C24451n9491h6256j37351e0831
$$ y = [-335694, -167864, -274679, -150264, 211827, -412131, -25264, -165836, 146357, -268246, -42180, -177220, -132836, -42717, -195191, 14383, -184741, 30325, -6920, 416340, -239994, -119756, -196133, -696161, -17138, 189620, -401920, -50539, 197754, 89236, -241171, -51502, -3148, -123559, -172357, -11048, -114327, -10877, 45918, -32514, -287211, -16611, -219742, -64002, -272718, -145461, -138586, 259056, -32571, -46470, -32915, 213630, 8326, -149333, -58878, -228619, 137318, 167003, -315029, -314806, -163930, -183647, 18188, 141479, 136220, 196358, -61947, -129065, -40016, -98847, -14128, 333990, 96611, 159954, 266746, -147008, -263585, -172487, -65297, -167949, 89399, 42591, 94957, -174389, -208232, -336396, 324451, 264960, -86256, -223607, -50831]
19086A65513D0353a07484r0488K0740m995d9037k4931j582B43449f8616B9157
19074i3715D1622j4350a43537A68837N2939c02954c6557l26846b979C57817f0380
19062h0388D6624K5141a40393A81750a5855k26024E0369c26843j00814B37003
19051g0420j4315A09706a34289A58819i7854j43049a5052j04185b8181j14183
19041a42364B30543A6123d2705q2216A6730P3221b2100A06084b02763D3649g6175
19029A60323R9D5717K1092a89918F4325Q6648J32860a3955k49702B4759J91566
19018B16325g3597B5302L9712c15230B48206i3988L765j31676L1435A06217d20581
19006F7964b65149a04946I7718B0252L75b45076i0505k8684k6383d4912F540a41730
$$ y = [165513, 40353, -107484, -197972, -177232, -182227, -49037, -73968, -75550, 243449, -68616, 29157, -93715, 41622, 27272, -143537, 168837, 221776, -302954, -36557, -363403, -2979, 357817, -60380, -80388, 46624, 71765, -140393, 181750, -15855, -241879, 50369, -326843, -427657, 237003, -70420, -84735, 109706, -134289, 158819, -97854, -240903, -15052, -119237, -28181, -142364, 230543, 16123, -42705, -124921, 16730, 89951, -22100, 106084, -202763, 43649, -76175, 160323, 160422, 45717, 66809, -189918, 64325, 150973, 283833, -13955, -263657, 24759, 216325, -73597, 25302, 65014, -315230, 248206, -93988, -90223, -221899, -190464, 106217, -420581, 67964, -265149, -104946, 97718, 20252, 20627, -245076, -90505, -119189, -145572, -44912, 6540, -141730]
18993A24131A4678a19461L1922j90475A71336g0609B8108d2337A03018b07894
18982a46808e1838j45392A28600J71117c20335A74373d26178A52840a66532b9221
18971A41350E4474a57838B81672a50104A18131a83290C66970j16782b42728A6108
18960a1754C51142L4676c53003d6355m1998A1032J36270n808O1272a39106B5148
18948b37886B16545b90137C14879a66098E7154j6839L59268C0955h2295E9568
18937a16597M2715I8985b9507G6985M3573a53589E4716d9654n6877j44639B24895
18925A79995b60731m2813i1784A40940a14124B43858a33455J3702A06031a07861
18914F5405a44927J1189l8768P3543B22398K69505e4578k10977A7122J04044n4517
$$ y = [124131, 14678, -119461, -87539, -278014, 171336, -70609, 28108, -42337, 103018, -207894, -146808, -51838, -197230, 128600, 299717, -320335, 174373, -426178, 152840, -166532, -29221, 141350, 54474, -157838, 281672, -150104, 118131, -183290, 366970, 250188, -242728, 16108, -11754, 351142, 385818, -353003, -46355, -88353, 11032, 147302, 141494, 202766, -139106, 25148, -237886, 216545, -290137, 314879, -166098, 57154, 40315, 399583, 30955, -82295, 59568, -116597, -73882, 98985, -29507, 76985, 120558, -153589, 54716, -49654, -106531, -251170, 224895, 179995, -260731, -303544, -91784, 140940, -114124, 243858, -133455, -119753, 106031, -107861, 65405, -144927, -133738, -172506, -98963, 222398, 491903, -54578, -265555, 17122, 121166, 66649]
18903F6649a70474n6568l0217O2897P2450j57808A01860b54399G4515b92046A24033
18891H4621Q2132J48830b67322a13973A85399J031M2325c17950A81974n0389c98220
18879B05729a31526o3403k91775a54348o4585k14116J20337J09031d2330A45369
18868B84828a3325m3623B8528c3140A33828a62618A94838K7572a38133B07536
18857f1277r4779B17737F8726J05692E1393J35510K09255B8241E455b30498B10647
18845b09690J6351a4883K458k36554R875H6360b85508c5804k81016A9663b26455
18833b40799e5509B82381b13317a9999q7362A22085L6664l8510A3675c03727M9227
18822b54500C7292i2372D2356a00193k90118A85b91403A72257E1686a85563e3342
$$ y = [66649, -170474, -227042, -257259, -194362, -121912, -279720, 101860, -254399, 74515, -292046, 124033, 84621, 166753, 315583, -267322, -113973, 185399, 186430, 228755, -317950, 181974, 131585, -398220, 205729, -131526, -194929, -486704, -154348, -218933, -433049, -312712, -203681, -42330, 145369, 284828, -13325, -56948, 28528, -33140, 133828, -162618, 194838, 222410, -138133, 207536, -61277, -156056, 217737, 68726, 174418, 51393, 186903, 396158, 28241, 5455, -230498, 210647, -209690, -193339, -14883, -12425, -248979, -239104, 86360, -285508, -35804, -316820, 19663, -226455, -240799, -55509, 282381, -213317, -19999, -107361, 122085, 158749, 120239, 13675, -303727, -254500, 37292, -92372, 42356, -100193, -390311, 185, -291403, 172257, 51686, -185563, -53342]
18810B88345a25507j7136n470G5818a09122K8171G4928J39547b93312A05461b74489
18798b15021H6012b5152j52328r3940B12099d6680k06752D2200c021F8726a44619
18786b85675j2276J5352B19731c4410l25138f7311k67198B37537b32664c5468
18775c56680A21065a44304b6083l63359i9928B2745b85027A12997b51348J00100
18765a51248L0367A9674a88799M8902k35647i5413A97794i8636j11687I7776a58214
18753a02096j3425j71019b4092C6878i4025i042C7611a98322Q0786c663k414j09811
18741a15888J0574A4661a99572g9330A24932A8848b48451A90750b22594I4937
18730B0262L26164A21426L58948a57472q496P5854k04934B63504a16753a055k19289
$$ y = [288345, -125507, -142643, -148113, 75818, -109122, -80951, 74928, 214475, -293312, 105461, -274489, -215021, 86012, -25152, -177480, -271420, 212099, -46680, -253432, 42200, -3021, 68726, -144619, -285675, -297951, -282599, 219731, -34410, -359548, -67311, -334509, 237537, -232664, -35468, -356680, 121065, -144304, -26083, -389442, -99928, 22745, -285027, 112997, -251348, -151248, -120881, 19674, -188799, -139897, -375544, -95413, 197794, -98636, -210323, 97776, -158214, -102096, -115521, -286540, -24092, 36878, -94025, -9042, 37611, -198322, -117536, -3663, -6077, -115888, -105314, 14661, -199572, -79330, 124932, 18848, -248451, 190750, -222594, 94937, 20262, 346426, 121426, 480374, -157472, -165968, -90114, -295048, 263504, -116753, -1055, -220344]
18719b20344C7966a72379b1347o0006C94625A17185a10022l7396A08837K91420
18709D00257j48992G8701g9873A360L43847A19038m6278C079R3313c40648A91864
18697h5450b4934k08769b9816B63336b18277C7969b05552A23850a24706I2807
18686a83759d646j14908B31877D2110h1303A03090r568J56543d3669k00670A93943
18674A01274Q2852f8126D0577Mb33322C7276a83274d2784j03742q2806p177q377
18662b44886n5667g0799p3419a84H8427a34828A42449e199k8321E5979b1511j28362
18650a49873f8742q0980g0670k03800A78198a05729q7735H356K03565C4946P9982
18639A14928D0634a51895m1859p4024h8361k4990A66848l5427a29297J0559k4537
$$ y = [-220344, 37966, -172379, -21347, -81353, 394625, 117185, -110022, -147418, 108837, 400257, 251265, 78701, -79873, 1360, 345207, 119038, 72760, 3079, 96392, -340648, 191864, -85450, -24934, -233703, -29816, 263336, -218277, 37969, -205552, 123850, -124706, 92807, -183759, -4646, -119554, 231877, 42110, -81303, 103090, 93522, 250065, -43669, -244339, 193943, 101274, 184126, -68126, 40577, 40581, -233322, 37276, -183274, -42784, -146526, -229332, -236509, -244886, -300553, -70799, -144218, -184, 88427, -134828, 142449, -5199, -33520, 55979, -21511, -149873, -68742, -149722, -70670, -274470, 178198, -105729, -193464, 8356, 211921, 34946, 114928, 40634, -151895, -193754, -267778, -88361, -113351, 166848, 131421, -129297, -118738, -143275]
18628a43275O2334A83388a31518H6438a09559m41301a42367n8517i9670A11024
18617d16218a69183D2938K6929J11925c61147K7452f3177c1229A48552e12759
18606A8303d83m6721j97144R924a10469B0918b52182J09869I1203m3213b87830
18594c1022R33j49612c7317m34762J38077A13408g1373A49338c69361C13025a02039
18582I1897c43536F6479k9973b49534A6163N6716b21944A04298A306g626k87792
18571b95418k6600h414H2031b87221A8036a19804k15835J00557A48838F4333a68301
18559b2643j36322d5879I1074j6268K13736A10164a58210G7345B2368f4423j84001
18548b48424P7415A97188b71152D7364L364g2836H7565k8996c67145a24667A55975
$$ y = [-143275, -80941, 183388, -131518, 86438, -109559, -550860, -142367, -200884, -99670, 111024, -416218, -169183, 42938, 69867, 181792, -361147, -333695, -63177, -31229, 148552, -512759, 18303, -483, -47204, -244348, -234424, -110469, 20918, -252182, -142313, 91203, 47990, -287830, -31022, -30089, -179701, -37317, -472079, -334002, 113408, -71373, 149338, -369361, 313025, -102039, 91897, -343536, 66479, 36506, -249534, 16163, 72879, -221944, 104298, 1306, -7626, -295418, -322018, -8414, 82031, -287221, 18036, -119804, -335639, -235082, 148838, 64333, -168301, -22643, -158965, -45879, 91074, 74806, 288542, 110164, -158210, 77345, 22368, -64423, -248424, -171009, 197188, -271152, 47364, 50728, -72836, 87565, 58569, -367145, -124667, 155975]
18536a13833q9268B03345b72631j5729a19697D0574O6623c1462o7060A58287f6618
18524a00602K1813l5192J8924j4210L283c4069l9689B92326b02643A58829B1045
18512i5654n4511G1894A3163d6245I978a8754j8968B3473Q768J04741a08402A14298
18499b52349R1812j6471d9762k80043o707a51958D3087G632J59871D7205g9789
18487B1117c34451B40149a19499j24442j02172H3945m0847a08650r3708A03415
18476a66698D975J39478c7242A85416q6849h9069G3037J23373a27964L6066A11249
18464A43415J40954c43174C153a45960B80582f1483m2298j20860H5972b38651
18453a50036K9881r3931n9084C5513J52094h1403I7025m5237a68725K5653d8821
$$ y = [-113833, -203101, 203345, -272631, -288360, -119697, 40574, 107197, -31462, -98522, 158287, -66618, -100602, -78789, -113981, -95057, -109267, -105984, -34069, -73758, 292326, -202643, 158829, 21045, -95654, -150165, 71894, 13163, -46245, 9978, -18754, -37722, 23473, 32241, 136982, -108402, 114298, -252349, -160537, -177008, -49762, -329805, -336512, -151958, 43087, 7632, 167503, 47205, -79789, 21117, -334451, 240149, -119499, -243941, -346113, 83945, 43098, -108650, -202358, 103415, -166698, 4975, 144453, -37242, 185416, 98567, -89069, 73037, 196410, -127964, -91898, 111249, 143415, 284369, -343174, 3153, -145960, 280582, -61483, -103781, -224641, 85972, -238651, -150036, -120155, -214086, -273170, 35513, 187607, -81403, 97025, 51788, -168725, -143072, -48821]
18441a95794c8548j06027A13384b40270l7426P6424B88601E6107J65234a69902
18430b49693a3740A69328p9654J2343O1770i9583A48974b29363B97L7974e4400
18418a24226b0164M039j68434A09573i3340B2988M9503J9240k7260c76543A95167
18406D1052b23396A3313K00757q6176l1435B7601a19187l00928A5211a12554M0642
18395g1912c2519D2442a19537E195L3506a89600I7041J07820a3519d554A71134
18383h2799A68617b92411J06572j7580A42671D0280L8875a81981a5255j22485
18373a37740O4841B83171a8231j6096J6972A47798n7231k6988a94245A59K11907
18362B12066c9157j03335A0612k843L3139J2581a7964k14409A78206c51205a62798
$$ y = [-195794, -38548, -144575, 113384, -240270, -277696, -201272, 288601, 56107, 221341, -169902, -249693, -13740, 169328, 89674, 102017, 163787, -99583, 148974, -229363, 297, 38271, -54400, -124226, -20164, -16125, -184559, 109573, -93340, 22988, 72491, 91731, 64471, -376543, 195167, 41052, -223396, 13313, 214070, 127894, 96459, 27601, -119187, -420115, 15211, -112554, -71912, -32519, 42442, -119537, 5195, 38701, -189600, 97041, 204861, -13519, -4554, 171134, -82799, 168617, -292411, -185839, -203419, 142671, 40280, 79155, -181981, -15255, -137740, -72899, 283171, -18231, -34327, -17355, 147798, 90567, 63579, -194245, 159, 212066, -39157, -142492, 10612, 7769, 40908, 53489, -17964, -232373, 178206, -351205, -162798]
18350a39471k21126c4864j33810L8576e6888H8526A6071h6610n3092k44799R7925
18339b86576D8440a08489F3758J28898E0065a12811B91728a22283N3200l61343
18329d30426J71816N7358A09550h8854j85888N1527a06411A34835I466J4629a8311
18317A6871g7664A24503a19329j83099B89736o2775a89619A48796M2722b2669
18306b23429b3357B50231h4681G5484f3891j06672p0877I5781l0767a27567f0924
18294F3331J6208A12g4658K2904D2718a19225j3252k2394G9742b26535Q0702K0338
18282a25495H196f5671j7390m5391B5660a04126A43206c02951c528A2079a3685
18270F7780c34463D27450a86542A39425K285c992l93395a48817L2297C17410j20880
$$ y = [-139471, -360597, -34864, -168674, -130098, -56888, 88526, 16071, -86610, -139702, -384501, -286576, 48440, -108489, 63758, 192656, 50065, -112811, 291728, -122283, -69083, -430426, -258610, -201252, 109550, -88854, -274742, -223215, -106411, 134835, 9466, 24095, -18311, 16871, -77664, 124503, -119329, -302428, 289736, 226961, -189619, 148796, 191518, -22669, -223429, -23357, 250231, -84681, 75484, -63891, -170563, -241440, 95781, 65014, -127567, -60924, 63331, 79539, 112, -74658, -51754, 42718, -119225, -132477, -154871, 79742, -226535, -145833, -125495, 8196, -65671, -83061, -128452, 25660, -104126, 143206, -302951, -3528, 12079, -13685, 67780, -334463, 427450, -186542, 139425, 141710, -3992, -397387, -148817, -116520, 317410, 196530]
18259A96530a31078B26390a41085A13261a60754a9505l76439a8977k98072E684
18248B96182B0699b82161B5378R9314b41020A27983J81621a59511j35132e5959
18237H2334A6709f2430A18851E7470a6259I6184k4342a20979F4283b76744B76693
18225B16703a53654o0918B6654a77801A41708c18A1448M0507a88010R3131m54
18214i5333A40868c06827D8428N1815a29363G1749g4533p8842C0747a11456A02297
18202a13142j94696e1943a8801k86484E3379K5544P4393a51150A64331a85377
18191a17683a0749D9739b81925A64876b67569h5068k20275a06122k435H2231e6504
18179a32937A17437b06295i3330n6921A15986B256J47213k9613a32555A12694
$$ y = [196530, -131078, 226390, -141085, 113261, -160754, -19505, -395944, -18977, -317049, 5684, 296182, 20699, -282161, 25378, 124692, -241020, 127983, 309604, -159511, -294643, -55959, 82334, 16709, -62430, 118851, 57470, -16259, 96184, 71842, -120979, 64283, -276744, 276693, 216703, -153654, -214572, 26654, -177801, 141708, -318, 11448, 51955, -188010, -94879, -95333, 140868, -306827, 48428, 100243, -129363, 71749, -74533, -153375, 30747, -111456, 102297, -113142, -307838, -51943, -18801, -305285, 53379, 78923, 153316, -151150, 164331, -185377, -117683, -10749, 49739, -281925, 164876, -267569, -85068, -305343, -106122, -108557, 82231, -56504, -132937, 117437, -206295, -93330, -150251, 115986, 2256, 149469, 119856, -132555, 112694]
18168a33929k716H8432B3386Q3496D179a19056j1279B20338F4488a81740B51288
18156b06462R0469J0584E8859g028A80088a89828P4755G2220C4842e0555n19208
18145e69763b80376l9659a43816o0805b0353j52511O8170A17172b11343i5502
18134d6427D1532j5710i2996r1216p0722O4428k47724B877c13290b3731l94906
18123d18637C4186K70093a8678H797B705a50482N9186D1434b6919A58216b4273
18111E5920b64041j8797j21146A40220N0572J02679b97743J16211A9779a05972
18100A44191g4314j12768P8416b7306l3377B05591b97954A53096a56003H0874
18089h2731A3775O6519g0461E448a26662B85576k5251c20454A11349a21829B03655
$$ y = [-133929, -136645, 88432, 23386, 106882, 4179, -119056, -130335, 220338, 64488, -181740, 251288, -206462, -115993, -105409, 58859, -7028, 180088, -189828, -115073, 72220, 34842, -50555, -569763, -280376, -320035, -143816, -204621, -20353, -172864, -104694, 117172, -211343, -95502, -46427, 41532, 25822, -92996, -184212, -254934, -190506, -438230, 2877, -313290, -23731, -418637, 34186, 304279, -18678, 8797, 2705, -150482, -91296, 41434, -26919, 158216, -24273, 55920, -264041, -282838, -403984, 140220, 190792, 293471, -297743, -181532, 19779, -105972, 144191, -74314, -187082, -108666, -27306, -60683, 205591, -297954, 153096, -156003, 80874, -82731, 13775, 80294, -70461, 5448, -126662, 285576, 260325, -320454, 111349, -121829, 203655]
18077c75641a09630E8819a7885F6088b23606A94962J41199b33228E6468N63801
18067F20269H8409L08359C0117a50055d617l7785j1780B37783a84497g5031n0967
18056a25998I2716B2353L8445A5405b64336A46132a24585A876N7876J21150c41405
18044B54714i7706G0058a02000A45038p2255a52810B73402o8528m5501J18029
18034B77402c00566c0488j57705M2197B560M8816e6537p134A42239K5295i3732
18022B8879a42962D4041e0613h424A74350A7437L40546d9930j38785j53290E7051
18010C9515K08192J8107F3207b14897A99110b88079P9478F264J40807E0999e1693
17998a71412G8929l4968b05695a6120B03839b76177J8260e4907m5293B7584c01381
$$ y = [-375641, -109630, 58819, -17885, 66088, -223606, 194962, 336161, -233228, 56468, 620269, 88409, 396768, 30117, -150055, -4617, -42402, -54182, 237783, -184497, -75031, -125998, 92716, 22353, 60798, 15405, -264336, 146132, -124585, 1876, 59752, 180902, -341405, 254714, -97706, 70058, -102000, 145038, 72783, -152810, 273402, 204874, 159373, 277402, -300566, -30488, -188193, -145996, 2560, 51376, -56537, -63671, 142239, 167534, -93732, 28879, -142962, 44041, -50613, -8424, 174350, 17437, 357983, -49930, -188715, -342005, 57051, 39515, 247707, 265814, 63207, -214897, 199110, -288079, -208601, 6264, 147071, 50999, -51693, -171412, 78929, 43961, -205695, -16120, 203839, -276177, -257917, -54907, -100200, 27584, -301381]
17986B44613h948A08101a77998A11065e9640g091j60522A99337b09991A86943
17975b2196B31470a47814G3314b7745C5153i8432I9280b11539k1104J05658c4825
17963G2537J7214h7499G8596J87039a20944o8824h4907k12853J47553A46468B9404
17951D7416k2973Q6527J36447H1929a85805l8898f4634j14554K7236I9100a66336
17939B03163J26580b69510a32403k2752K3964R478j02316O7000M1282K4780A85597
17927a52686I5367K50628A4700J8684J85676a31888D4885M0780e9140A6462a55885
17915a57550A77867j1142G6328M134a76999A9016c7153B76518b13009B25512i2757
17903B58072a2722B27304g7809C537a66476n4499I2040f7240F1497d1844j407
$$ y = [244613, -8948, 108101, -177998, 111065, -59640, -7091, -167613, 199337, -209991, 186943, -22196, 231470, -147814, 73314, -27745, 35153, -98432, 99280, -211539, -232643, -126985, -34825, 72537, 89751, -87499, 78596, 265635, -120944, -189768, -84907, -297760, -150207, 146468, 29404, 47416, 24443, 110970, 247417, 81929, -185805, -224703, -64634, -179188, -151952, 99100, -166336, 203163, 329743, -269510, -132403, -155155, -131191, -121713, -224029, -157029, -115747, -90967, 185597, -152686, 95367, 345995, 14700, 33384, 219060, -131888, 44885, 85665, -59140, 16462, -155885, -157550, 177867, 166725, 76328, 80462, -176999, 19016, -37153, 276518, -213009, 225512, -92757, 258072, -12722, 227304, -77809, 3537, -166476, -220975, 92040, -67240, 61497, -41844, -43251]
17892d3251A04390J45795p774l7796c0242A52211o3042a1912C31616a60106j21586
17881b81692A4570b6193B88301b54049i3521M1312J2900k43610j70528b4159I0609
17869B90916o4183g4227J0690I0792b40955C2413a61675H1763J85887a03983A83800
17857a5492O283j63443e5062C721a34439E25K63318b60629j53727i3618k6087
17846a19705C00573M7540B7508q274a10809j27286e6989I0020a53323A32263a61713
17834b5157r8055C2343a9048j89050P9348K7664k62705H8919J11152L5279b7417
17822A91117d80904A30697a07247n8308j93547A55333J0073E3886a32556A78151
17811B32830a17990m4296d5753A63827R3475q0028a62175m7156A921K04941Q0688
$$ y = [-43251, 104390, 250185, 242411, 204615, -30242, 152211, 89169, -11912, 331616, -160106, -281692, 14570, -26193, 288301, -254049, -93521, -52209, -39309, -282919, -453447, -24159, 90609, 290916, 226733, -74227, -63537, 90792, -240955, 32413, -161675, 81763, 267650, -103983, 183800, -15492, -9209, -172652, -55062, 3721, -134439, 525, 263843, -260629, -414356, -93618, -119705, 300573, 348113, 27508, 19234, -110809, -238095, -56989, 90020, -153323, 132263, -161713, -25157, -123212, 32343, -19048, -208098, -128750, -101086, -363791, 88919, 200071, 235350, -27417, 191117, -480904, 130697, -107247, -165555, -359102, 155333, 165406, 53886, -132556, 178151, 232830, -117990, -162286, -45753, 163827, 257302, 177274, -162175, -209331, 1921, 206862, 287550]
17800B87550m1853F5911L57772b5314A03748A5389R2162Q2217c65715a61712I1651
17788b2081B6498g3548K7605A9341a15448j04817C2214a83406B83162b65141h0967
17776A29035b30848a05696j08987B54264a56346H7304b43738I6252C383Q0264
17766H3647P7218a54745C5519b13340F1749K4853b89213I7690j6925K58050a5832
17754B35862m3244m5563a42692B06608a5049A91205a35596M6613D63594A6566
17743C0784M5901a0736C05598f7867B4104a95972g5939C95672A11782a91274R984
17732a81290D5227j2166b89701M9693J8236G9546H288Q0393b30146A40973D8447
17720B73547h0264k29639a9585I5875k3324f6876A12099A9988f7531C9899J17240
$$ y = [287550, 245697, 65911, 423683, -25314, 103748, 15389, 107551, 189768, -365715, -161712, 91651, -22081, 26498, -73548, -45943, 19341, -115448, -220265, 32214, -183406, 283162, -265141, -80967, 129035, -230848, -105696, -214683, 254264, -156346, 87304, -243738, 96252, 3383, 83647, 160865, -154745, 35519, -213340, 61749, 86602, -289213, 97690, 80765, 338815, -15832, 235862, 192618, 147055, -142692, 206608, -15049, 191205, -135596, -88983, 463594, 16566, 30784, 76685, -10736, 305598, -67867, 24104, -195972, -75939, 395672, 111782, -191274, -181290, 45227, 33061, -289701, -240008, -221772, 79546, 8288, 88681, -230146, 140973, 48447, 273547, -80264, -309903, -19585, 95875, 72551, -66876, 112099, 19988, -67531, 39899, 157139]
17709A57139O5666J5647o5704F844K27169a53934d3540C26320D9942O778c881
17697B76844c10621g6540C6888a08833j6842F4547a7646k07896K8835e8857k47667
17686c06524a2439k12042h7973p7008H2278K77590b03500A37059E3394a3481j79650
17675a93131m3379h4463I5011B2972b98929B7188J78478d2888B53367c7619B56081
17663a97912D18415a30553A551e9628G2306J18030B9113H073R1859a72107R60
17652a71147G4783f7089j6107q0773P7204J4897A2791P7766a33645a2420C2269
17640b44376C67335a74367q5001G8221e8774H4559b49836A18406a22105c9260
17629A16587a43373B2729a67578I2312P4991M6079D0359c63640e415A15296c5858
$$ y = [157139, 222805, 238452, 172748, 6844, 234013, -153934, -43540, 326320, 49942, 56720, -3881, 276844, -310621, -76540, 36888, -108833, -125675, 64547, -17646, -225542, -196707, -58857, -306524, -12439, -224481, -87973, -164981, 82278, 359868, -203500, 137059, 53394, -13481, -193131, -236510, -84463, 95011, 22972, -298929, 27188, 205666, -42888, 253367, -37619, 256081, -197912, 418415, -130553, 1551, -59628, 72306, 190336, 29113, 8073, 99932, -172107, -171147, 74783, -67089, -83196, -163969, -86765, -71868, 12791, 90557, -133645, -12420, 32269, -244376, 367335, -174367, -259368, 78221, -58774, 84559, -249836, 118406, -122105, -39260, 116587, -143373, 22729, -167578, 92312, 167303, 213382, 40359, -363640, -5415, 115296, -35858]
17617h9260k09108I6056a65057B30919c40427g2208E4730M38531A49905N1486
17607B01391b8247C60141o7615p5523j07085L8701c69332B7410b07712B2530b23420
17595B49160p8782l7601M7430d8178A23621f8374A37699C4686O0997M7042g202
17583C94731A78799J41456c4851o9257A6840a55013A062L9695J27610B5908L2543
17572E8451b56434G731K23833b54653N5483G9058L47218A13167d1208l4484D9064
17560A26011h1850K114I0459a91893D0259A4189R9740a60329A29505R3214A08936
17548b14123A62948a09542B3254a93210b5563A53600J97755j32794r2368a63885
17537b10588A3386a10876n4945A50269B1700K73807j30756h5679A99261m9129
$$ y = [-89260, -298368, 96056, -165057, 230919, -340427, -72208, 54730, 493261, 149905, 201391, -28247, 360141, 292526, 217003, 109918, 148619, -369332, 27410, -207712, 22530, -223420, 249160, 170378, 132777, 180207, -48178, 123621, -68374, 137699, 34686, 95683, 142725, -7202, 394731, 178799, 320255, -34851, -104108, 16840, -155013, 1062, 40757, 168367, 25908, 58451, -256434, 7731, 231564, -254653, -199170, 79058, 426276, 113167, -41208, -75692, 49064, 126011, -81850, -79736, 90459, -191893, 40259, 14189, 113929, -160329, 129505, 222719, 108936, -214123, 162948, -109542, 23254, -193210, -25563, 153600, 351355, 218561, 126193, -163885, -210588, 13386, -110876, -165821, 150269, 21700, 295507, 164751, -85679, 199261, 150132]
17527A50132m1376b4552j3929F0528b1801I2465a51688j5094C31588j63531h4924
17515B76121r2303f1582A07190d9311G7940b30407A88313d58833a21032B4278
17504A78828E8557b3900j02424G7026f3123A66716b12519B48821b42275r2948
17494c35223B51803g862G8553P5966Q7120A11606a07327B6302O8230K1611J354
17483A17497K82010A21707N3503J22093m8274l043Q6456B0357a94629B16593g5999
17471E42653A44966h1834A58745M324L825j450g3384A84880q9553L18850j84757
17460B29420i2526A51345A9750R6866J6657j2925O0626G5484N49362C08014C6108
17448D04101j18792L8474b62911B06730L6160k5889b5697B54985a97165l8938
$$ y = [150132, 108756, -24552, -38481, 60528, -21801, 92465, -151688, -166782, 331588, 168057, -84924, 276121, 183818, -61582, 107190, -49311, 77940, -230407, 188313, -458833, -121032, 24278, 178828, 58557, -23900, -126324, 77026, -63123, 166716, -212519, 248821, -242275, -335223, 251803, -7862, 78553, 154519, 241639, 111606, -107327, 26302, 94532, 116143, 117497, 399507, 121707, 175210, 297303, 249029, 245986, 332442, 20357, -194629, 216593, -75999, 542653, 144966, -81834, 158745, 163069, 166894, 165444, -73384, 184880, 95327, 414177, 229420, -92526, 151345, 19750, 116616, 133273, 120348, 180974, 75484, 624846, 308014, 36108, 404101, 285309, 323783, -262911, 206730, 242890, 217001, -25697, 254985, -197165, -236103]
17438b36103l2762C33179H7667M7288O9296a5966A13036L514K71527F6432J32870
17427A99302K41641A56534N6465J65872D6367O45664B50377J1637G5060J94462
17417B69522e0078B21028K13224j84284j07726e3212C11368A0926g1909B46592
17406D07117k0366j79659E1812J54686J06987c4401N770D7323K83377J29746m2537
17395D17909j44009J5427J36411E8301k2685a02253D3797O4376L0010d1745A29834
17383b0096j69366B08278K38844a3009A95904J02079A26762F2035K8232b09117
17372B44723D209M36174B15272l2254q6596L77433B9780J36335a7476A02140a46633
17360A32879L09210A79880a50404j880A42278K05571h1972D54988A96959C1441
$$ y = [-236103, -268865, 333179, 87667, 134955, 204251, -15966, 113036, 116550, 388077, 66432, 199302, 440943, 156534, 212999, 378871, 46367, 692031, 250377, 262014, 75060, 269522, -50078, 221028, 434252, 249968, 142242, -53212, 311368, 10926, -71909, 246592, 407117, 386751, 207092, 51812, 206498, 313485, -34401, -28631, 47323, 330700, 460446, 417909, 273900, 289327, 425738, 58301, 35616, -102253, 43797, 108173, 138183, -41745, 129834, -20096, -189462, 208278, 447122, -13009, 195904, 297983, 126762, 62035, 90267, -209117, 244723, 4209, 440383, 215272, 183018, 96422, 473855, 29780, 166115, -17476, 102140, -146633, 132879, 442089, 179880, -150404, -152284, 142278, 347849, -81972, 454988, 196959, 31441]
17349B36343A13325m6727L9962J34918j03939K88857b85650a41566C57812j03540
17339B54272K3556a52776B29908F353O4391J05608Q589r0673D1928k096M0190
17328H0022L34953j45651n9334r5390D4837a35086D88106A90284J62781a62316
17317E60970B13805a01410B29176p4232F070M01187f8065E4984N4957d8093D63406
17305A92896o2889n3228L54311d4595B16275b11655C66445A78179G7868N7263
17295A35131k8394d8357C35180j2539r8931l450D4386L79558R8503j98952J49258
17284D72753c2910D47709A64251E0299K69116r1236N0431H9835L28497I9397J49805
17273B49202J12870I6472K80450J21018B44738i8759A25932Q6518r3760R8281
$$ y = [236343, 113325, 66598, 106560, 241478, 137539, 426396, -285650, -141566, 357812, 254272, 277828, -152776, 229908, 6353, 70744, 176352, 184941, 94268, 41928, 39832, 80022, 414975, 269324, 209990, 114600, 44837, -135086, 488106, 190284, 353065, -162316, 560970, 213805, -101410, 229176, 154944, 6070, 407257, -68065, 54984, 109941, -48093, 463406, 192896, 130007, 76779, 431090, -44595, 216275, -211655, 366445, 178179, 77868, 135131, 106737, -48357, 335180, 322641, 223710, 220260, 44386, 423944, 522447, 323495, 472753, -32910, 447709, 164251, 50299, 319415, 228179, 278610, 89835, 418332, 99397, 249202, 362072, 96472, 376922, 497940, 244738, -98759, 125932, 212450, 118690, 216971]
17263B16971K3341R650p8379j9555Q8898E0729L0385J67758J62823A98321P5196
17252B73517j17747J9119M4292J73520o9559L4450p3253L883l3831A02357K43389
17241C45746A16111J07344R7980A17525J55957A08580n2774k002L63632A85857
17230a88590D64507D3817M48289h4518A68330K02078b2601C91548F6116a03009
17219A93693f4970r2566B86964j9644a222B18150H812O9100K87289d9831C15319
17207B72458C0700L05560J69177A76017L2893m2806L5095D1266K34570l8491O1169
17196B98514M881F8588a66717B59799J03945A36348m6578J64514J73921A79772
17185A24908J84943K23172M3375H9442L22570A53201a15520D01519b97618H3406
$$ y = [216971, 240312, 249962, 171583, 152028, 240926, 50729, 81114, 248872, 411695, 198321, 273517, 155770, 174889, 219181, 392701, 323142, 357592, 284339, 288222, 254391, 102357, 345746, 116111, 223455, 321435, 117525, 273482, 108580, 55806, 53804, 417436, 185857, -188590, 464507, 43817, 492106, -84518, 168330, 370408, -22601, 391548, 66116, -103009, 193693, -64970, -157536, 286964, 267320, -1222, 218150, 8812, 77912, 365201, -49831, 315319, 272458, 30700, 336260, 505437, 176017, 208910, 166104, 201199, 41266, 275836, 237345, 298514, 303395, 68588, -166717, 259799, 363744, 136348, 89770, 254284, 428205, 179772, 124908, 309851, 533023, 576398, 89442, 412012, 153201, -115520, 401519, -297618, 83406]
17174C00507l7560q4088R5108j24408o646K17597G0057M64439n0497j76167k5512
17163B82320Q3241J2568j639n1861O7111A8491L28035A34110K28918m561A09409
17151A19475J75126p6169E5583J92106n8397L49818j39879J80315k83019l5313
17141B61214N3201J88870B28028K38653k25185K10815l4823j5055j2265n3272
17131C36896j64556L22841k38631r7062N5236K78707A55696q174K99765R6228
17121E43515M4357j56717j93842M37802k06125A81625K06758I6984K98665Q3657
17111D79306B21021O4976K13911j82213J20224A98791J77199K17160j06471O6604
17101E53283B64531K20219l3320Q0954a31002E08164L38778C70921L43817l30197
$$ y = [300507, 262947, 178859, 273967, 149559, 142913, 360510, 70057, 534496, 483999, 307832, 282320, 365561, 378129, 376490, 324629, 391740, 18491, 346526, 134110, 363028, 358467, 109409, 119475, 294601, 218432, 55583, 247689, 189292, 539110, 399231, 579546, 296527, 261214, 314415, 503285, 228028, 466681, 241496, 452311, 417488, 402433, 390168, 336896, 172340, 495181, 256550, 159488, 214724, 493431, 155696, 147522, 447287, 543515, 587872, 431155, 237313, 675115, 468990, 181625, 388383, 96984, 395649, 479306, 221021, 285997, 499908, 317695, 437919, 198791, 375990, 593150, 486679, 553283, 264531, 484750, 451430, 532384, -131002, 508164, 846942, 370921, 714738, 384541]
17091C84541L27105k11692N33255D55778k27330L33780j31211J59770k30002L99888
17081G60673C21207p349J37728J8136L04950k16338K6131K51236k34058A98171
17070B64604K03695k25263J33231K91513k02752j09630k5951J25733j06023P8321
17060D27478K73752B25009L14449k62426L89097j83211I3299L37921r6498j6558
17050C18164K50203n1233J42005j37318j92956J53516p2788L44362k67279K93910
17040G80586k15962L91771m15854j7437J13099K98302m42307M94419j01028j98001
17030F87588r4519J83321J8632k73409q1219L94101j47408j30086n7649K24188
17020G23540j71816K61767k85499Q5578M41267l55708j47838J90647J70749j76267
$$ y = [384541, 711646, 499954, 1033209, 455778, 228448, 562228, 431017, 590787, 360785, 760673, 321207, 313858, 451586, 469722, 774672, 558334, 584465, 835701, 601643, 198171, 264604, 468299, 243036, 376267, 667780, 465028, 355398, 329447, 455180, 349157, 427478, 701230, 225009, 539458, 277032, 666129, 482918, 93299, 431220, 334722, 318164, 568367, 517134, 659139, 521821, 328865, 482381, 409593, 753955, 486676, 780586, 564624, 956395, 540541, 523104, 636203, 934505, 492198, 986617, 885589, 687588, 593069, 776390, 795022, 521613, 440394, 834495, 687087, 557001, 499352, 723540, 551724, 813491, 527992, 613570, 1054837, 699129, 551291, 741938, 912687, 736420]
17010G36420j58057R96L61527j21519j36391m224R0544K75102k93705J52555l40451
16999E62797M17856j57423M3673q7046J01708K57008l05342j36125K09495J28054
16989A034655k58477J04137j49755N07420E49805M46805j72220l8821j34111L47729
16979I99187D09930M78074J44012j15583K84632j2677m53528k2246L97300m4895
16969A065019l00919K60276j03401j80675L99157k57352l7119L54951k79268J0164
16959I30833L60810m08107r2509N06099k14727p3472J86646o0577k0718j47400
16949I66878M99003j60088J19020j63239k06333J61560p0410j16366Q8053K03113
16939A321191k32320J60870k59237J82825k56014L46721n3654k5497J36937J76116
$$ y = [736420, 578363, 579359, 940886, 819367, 682976, 678752, 769296, 1044398, 750693, 903248, 562797, 980653, 823230, 866903, 779857, 881565, 1138573, 833231, 697106, 906601, 1034655, 776178, 880315, 730560, 1237980, 549805, 996610, 824390, 785569, 651458, 999187, 409930, 888004, 1032016, 916433, 1201065, 1188388, 734860, 712614, 1109914, 1065019, 764100, 1024376, 920975, 740300, 1139457, 882105, 844986, 1199937, 920669, 930833, 1291643, 883536, 791027, 1297126, 1082399, 1008927, 1195573, 1134996, 1114278, 966878, 1465881, 1305793, 1424813, 1261574, 1055241, 1216801, 1146391, 1030025, 1118078, 1321191, 1088871, 1249741, 990504, 1173329, 917315, 1264036, 1210382, 1184885, 1321822, 1497938]
16929A497938l73917J90113J3104K42394l25885L0386L22041M1596k03193J16728
16919A551305j54965O7393K8966K61987k17131J12722n48778N03779j25479K63780
16909A743579k59013K07870k38966J28616J71543M2047j87418M34808k38608p1478
16899A732980J77652k95198J47128J99146p343j83219M75921k86523L7964M2108
16889B040616j34707o7042K41992N6182J75807n8544j18704l00281K87332K60400
16879B383051m0193j58564K85866j1841J37388j32743M1920J35670J41716k14445
16869B567825K54883l52516k3358o4359O90730q32020P28294j07456p3950J75092
16859B963165L75801n4306l20383j27623J04261K08320p3796K82542k66992L96413
$$ y = [1497938, 1124021, 1314134, 1327238, 1569632, 1243747, 1274133, 1596174, 1637770, 1434577, 1551305, 1396340, 1463733, 1492699, 1754686, 1537555, 1650277, 1101499, 1605278, 1479799, 1743579, 1484566, 1692436, 1453470, 1582086, 1753629, 1795676, 1608258, 2043066, 1804458, 1732980, 1910632, 1615434, 1762562, 1961708, 1954365, 1771146, 2247067, 1960544, 1998508, 2040616, 1905909, 1838867, 2080859, 2137041, 2312848, 2254304, 2135600, 1835319, 2122651, 2383051, 2342858, 2184294, 2470160, 2458319, 2595707, 2462964, 2504884, 2640554, 2782270, 2567825, 2822708, 2470192, 2446834, 2382475, 3073205, 2241185, 2969479, 2862023, 2788073, 2963165, 3338966, 3284660, 2964277, 2836654, 2940915, 3149235, 3075439, 3357981, 3090989, 3487402]
16849C487402J229j05709L06213r4314k90714K86697P4775J63151K47389l37796
16839C738323J89100j42813L66546k0459j80098L52532q1328M43716k10956K93578
16829D748141k03138J27990K92776O3508Q2242M8916L56845l34171J10771Q1714
16819E375594N30027k57209J20289j1295k07953M09674L67519K38805l34648L66069
16809F596872p4533L33576K348N31982k11145L59592o0313M48565N2161J63524
16799H142629J60773L08995J22381N5643L90735J21675K26935M48069K26762L38934
16789A0543531J42069M69481r2484K35989K87564K90677N12515K82813L51680
16780A3023835M91402K35674L91350O31500O01659L71588N15804N01891O24888
$$ y = [3487402, 3488631, 3382922, 3689135, 3594821, 3304107, 3590804, 3665579, 3828730, 4076119, 3738323, 3927423, 3784610, 4151156, 4130697, 3950599, 4303131, 4221803, 4665519, 4454563, 4748141, 4545003, 4672993, 4965769, 5029277, 5111519, 5160435, 5517280, 5183109, 5293880, 5375594, 5905621, 5648412, 5768701, 5757406, 5549453, 5959127, 6326646, 6565451, 6230803, 6596872, 6522339, 6855915, 6858263, 7390245, 7179100, 7538692, 7478379, 7926944, 7979105, 8142629, 8303402, 8612397, 8734778, 8790421, 9181156, 9302831, 9529766, 9977835, 10204597, 10543531, 10685600, 11155081, 11062597, 11298586, 11586150, 11876827, 12389342, 12672155, 13023835, 13515237, 13750911, 14142261, 14773761, 15375420, 15747008, 16262812, 16764703, 17389591]
16771A7389591M99547M07478O97785P82267N62987Q74470Q25319N96611J176456
16762B3812511J066851M80350J048537J186353Q26570J263164J151795J445554
16754C2281685J407731J557224J366505J693972J903689J671365J984723K520896
16746D6387790J937163K469401K476649L032820K761285L255650L123596L601080
16738F9045434L840227M211411M420861M556349M807802N034870N629784N580770
16730A07127508O348080N849441O439172O933160O664804O635472O617824N935787
16722A58551248O155877N019857N019710L993474K653188K148776L77632l54160
16714A83565602j644903l043964l589727m829875n164377o300270o241072p080377
$$ y = [17389591, 17889138, 18296616, 18994401, 19776668, 20339655, 21214125, 22039444, 22636055, 23812511, 24879362, 25359712, 26408249, 27594602, 28421172, 29684336, 30836131, 32281685, 33689416, 35246640, 36613145, 38307117, 40210806, 41882171, 43866894, 46387790, 48324953, 50794354, 53271003, 56303823, 59065108, 62320758, 65444354, 69045434, 72885661, 77097072, 81517933, 86074282, 90882084, 95916954, 101546738, 107127508, 113475588, 119325029, 125764201, 132697361, 139362165, 145997637, 152615461, 158551248, 164707125, 169726982, 174746692, 178740166, 181393354, 183542130, 183919762, 183565602, 181920699, 178876735, 175287008, 170457133, 165292756, 158992486, 152751414, 145671037]
16706A45671037o827472p074180o661680p033960o420423o083906o010562n692174
16698I3866680n659161n117663m770091m470893l863016l962500l591210l416463
16690E9015683l189295l061718k605959k813685k470441j993980j877496k440886
16682C8562223j917766j453156j882966j264007j434344j543179j236978q58985
16674B6970842j576326o10243j172057q98586q37557p04402p98395j274760n40899
16665A8557617n46243q83506m14307n09678o83227n06492o04192m64155n32797
16656A3413020l41664j38957n72042k11290m08964m00736m79191j88106k75556
16647A0396514l16344o8509l01456n41057o1731k81672r3532k8576o95855m43402
$$ y = [145671037, 138843565, 131769385, 125107705, 118073745, 111653322, 105569416, 99558854, 93866680, 88207519, 83089856, 78319765, 73848872, 69985856, 66023356, 62432146, 59015683, 55826388, 52764670, 50158711, 47345026, 44874585, 42880605, 41003109, 38562223, 36644457, 35191301, 33308335, 32044328, 30609984, 29066805, 27829827, 26970842, 25394516, 24784273, 23612216, 22713630, 21876073, 21171671, 20373276, 19098516, 18557617, 18011374, 17127868, 16713561, 16203883, 15520656, 15014164, 14409972, 13945817, 13413020, 13071356, 12932399, 12360357, 12149067, 11740103, 11339367, 10860176, 10672070, 10396514, 10080170, 10011661, 9710205, 9169148, 9107417, 8825745, 8732213, 8703637, 8007782, 7564380]
16637G564380J34751n3220j01943l96766j37131J70795l76169k02338n57635J50346
16627F195070R6358l19391j09555l09763k43983l3466K87469l87392j55248k54746
16617D765353l2018J05537l94764M3497l686P0048m32721n9029j31992K23531
16607D153756m18333J3612R4290k35313N1676l7017K0469j38577n2169N5434k39219
16596C268609R2365k23765o2930m2413J30806m57272n4123J68693K7858j78544
16586B669284n0320M6329j26368q3675K13410l76847L49830k21412k70888J67585
16576B316928p0560P8826k52695J30990n353k9227J7231l02277j62465J70877
16566A892275K30268j49072j97097K8434j69619O32326m93705j646J91043m37293
$$ y = [7564380, 7699131, 7645911, 7543968, 7147202, 7010071, 7180866, 6804697, 6602359, 6044724, 6195070, 6291428, 5972037, 5862482, 5552719, 5308736, 5275270, 5562739, 5175347, 5020099, 4765353, 4733335, 4838872, 4444108, 4487605, 4483919, 4553967, 4121246, 4062217, 3930225, 4153756, 3735423, 3749035, 3843325, 3608012, 3659688, 3622671, 3643140, 3504563, 3452394, 3507828, 3268609, 3360974, 3137209, 3074279, 3031866, 3162672, 2705400, 2651277, 2819970, 2847828, 2669284, 2618964, 2665293, 2538925, 2455250, 2668660, 2291813, 2641643, 2420231, 2149343, 2316928, 2246368, 2325194, 2072499, 2203489, 2198136, 2168909, 2186140, 1883863, 1721398, 1892275, 2122543, 1973471, 1776374, 1804808, 1635189, 2267515, 1773810, 1772164, 1963207, 1525914]
16556A525914K49686L3992k46137k16124J30219n6613j24914K17625N6787r7408
16546A473027R461J7363K3161j02736o8289m7917M68655n42350J26989M3135k27183
16535A173316J11192k08591L07448l94960L61149j90973j5748K67324l94021j15526
16525I00610Q623M7090j7270K68446J61831J7627k2745j52375E25014M74497j73293
16514H26218K19608n8791l0734P053q3004k67937K44411J14634j63817k9518Q3529
16503H61652j56541j57809M01447N833k708j3249o0589l46071K74400j69708q848
16492F27809K35297j89472J13805J63451K887k83978J83029k35672K87129r4330
16482H09955j25301K18803j93155J31628J8772l69480K51355k37513J49416J10683
$$ y = [1525914, 1775600, 1809592, 1563455, 1347331, 1477550, 1420937, 1296023, 1513648, 1570435, 1473027, 1482488, 1499851, 1523012, 1420276, 1351987, 1304070, 1772725, 1230375, 1357364, 1400499, 1173316, 1284508, 1075917, 1383365, 988405, 1349554, 1158581, 1142833, 1410157, 1016136, 900610, 909233, 956323, 939053, 1207499, 1369330, 1386957, 1364212, 1211837, 525014, 999511, 826218, 1045826, 987035, 956301, 963354, 880350, 612413, 856824, 971458, 807641, 778123, 861652, 705111, 547302, 948749, 954582, 951874, 938625, 878036, 531965, 806365, 636657, 627809, 863106, 673634, 787439, 950890, 953777, 669799, 852828, 617156, 904285, 809955, 684654, 903457, 710302, 841930, 860702, 491222, 742577, 505064, 654480, 765163]
16472G65163N0291o7890J51214D27613N8545O3251M3967j07434K32174Q731k30536
16461D96311J81105j67083j89064K28429J66853n896k77496J18150q4676O8369
16451E35002J72988l37881p9659n6452K33795J98592j57763j06221K09110B72001
16440D65144o4622j94436M87885k11076K53921k29324k2697k7127B08141j4401
16430A93740J10855L83461k66396B09086L79826A40388J92660J77555B49227J13953
16420C63180A41847K16646j24043J41837R2676j30920N2360p9185k3310J30969
16410D18877B05750K91861k01732j35844J71808Q127A52656L47362j96481A16229
16399G36054j33270k03114j38901J05715j09159M865l6083J44652A23730J45550
$$ y = [765163, 815454, 747564, 898778, 427613, 486158, 549409, 593376, 485942, 718116, 726847, 496311, 677416, 510333, 321269, 549698, 716551, 710655, 433159, 551309, 466633, 535002, 707990, 370109, 290450, 233998, 467793, 666385, 508622, 402401, 611511, 272001, 465144, 400522, 206086, 693971, 482895, 736816, 507492, 484795, 457668, 208141, 193740, 304595, 688056, 421660, 209086, 588912, 140388, 333048, 510603, 249227, 363180, 141847, 358493, 234450, 376287, 468963, 338043, 390403, 311218, 287908, 418877, 205750, 497611, 295879, 160035, 331843, 339970, 152656, 500018, 303537, 116229, 736054, 602784, 399670, 260769, 366484, 257325, 262190, 226107, 370759, 123730, 269280]
16389B69280K74912h1036C75911j45591m8638J37424K14877I3228m3533J33182
16379A82877J88694A2378J96145K8252l6747E4687L09554F6832Q2597K93900J77550
16368F20879A80253B2897J51919k9102o8216L24857B0745K51012J8919o4719M6034
16357B71991b0689B00470J36191j27731M5522a18508B63753f3981A78687a6531
16346A97837l1132a29758D59979A65235A7195K13346J9305J50095A65103K48652
16336D13755C2360L74649j72175a46902F1170f326A02487k0247e3436C5879i9940
16324h3749D14284g026A62821q0001M81490k25175j52913B5628A1844J38653J45535
16313B96032f6548D673O6156e2668Q104A45408p2249Q1205K9701B00f0049j1406
$$ y = [269280, 544192, -81036, 375911, 230320, 181682, 319106, 533983, 93228, 49695, 182877, 371571, 12378, 208523, 236775, 200028, 54687, 364241, 66832, 149429, 443329, 620879, 180253, 22897, 174816, 145714, 77498, 402355, 20745, 271757, 290676, 225957, 271991, -20689, 200470, 336661, 208930, 254452, -118508, 263753, -63981, 178687, -16531, 197837, 166705, -129758, 459979, 165235, 17195, 230541, 249846, 399941, 165103, 413755, 32360, 407009, 234834, -146902, 61170, -6326, 102487, 82240, -53436, 35879, -99940, -83749, 414284, -7026, 162821, 82820, 564310, 339135, 186222, 25628, 11844, 150497, 296032, -66548, 4673, 70829, -52668, -44564, 145408, 73159, 154364, 184065, 200, -60049, -71455]
16301g1455A47595l1162d8185k86011B69408i5297A95222E4635L43396e6677j59278
16290b15955c2428A14666K2927a2815N854C14734c54048G1466K83522G101J26141
16279A33242N4395n8793b1344k2666B62022l3031B0252a11086N0645I7797f1426
16267i3300b3978G9164C1623J15087m9262k6140h3450m9382G7126M2959B0988
16255A56394G5322a18986k4757O4443j59186N8008f0725j11987j58641A63611
16244A43653j0821J31760j6845l1499D7248K28611j13481L27005A0652J05007
16234A15659k9714c2522G3342a08385D8239N8546J15604a31310A04502O7182K77067
16223D48751B13327b99009B71435j15646c36523J44434f8913b9288B8252a46423
$$ y = [-71455, 147595, 116433, -48185, -334196, 269408, -95297, 195222, 54635, 398031, -56677, -215955, -32428, 114666, 137593, -12815, -6961, 314734, -354048, 71466, 354988, 7101, 133242, 187637, 128844, -21344, -44010, 262022, 228991, 20252, -111086, -60441, 97797, -61426, -93300, -23978, 79164, 31623, 146710, 97448, 71308, -83450, -132832, 77126, 120085, 20988, 156394, 75322, -118986, -143743, -79300, -238486, -180478, -60725, -172712, -331353, 163611, 143653, 132832, 264592, 247747, 216248, 47248, 275859, 162378, 489383, 10652, 115659, 85945, -32522, 73342, -108385, 48239, 106785, 222389, -131310, 104502, 171684, 448751, 213327, -299009, 271435, 155789, -336523, -192089, -68913, -29288, 28252, -146423]
16212h8254j80618a17138A40587H190d9775M166B25432k8693M352p7384p728Q5316
16200B01295A1740J87882i649A72123o2808J9082P9408c09498A05182c10619A98348
16188A8759J60378d7768N004A65068N9928d9952l1242C8172K41061c68373B2941
16176I8339d2196j76737E7134b65647F703J57963i1898a5114B74565e819j85229
16165a91048d3365o7118A02799a87347J6358F0955a07142C57867C4783c306A07419
16153D9777a7848j91891e4759p4402O2976F0571k0596f3612I152J53134A709O9942
16141G1651b61287D0369K0960b77249B368J52166l0225a18840F9589J65530a70609
16129C15918i3481Q480A83833B1342i8268e38B34657A15674B1105f1230j08913
$$ y = [-88254, -268872, -117138, 140587, 8190, -49775, -45609, 225432, 196739, 201091, 123707, 115979, 201295, 11740, 199622, -9649, 172123, 109315, 128397, 207805, -309498, 105182, -310619, 198348, 18759, 179137, -47768, -42764, 165068, 224996, -49952, -81194, 38172, 279233, -368373, 22941, 98339, -42196, -218933, 57134, -265647, 6703, 164666, -91898, -15114, 274565, -5819, -191048, -43365, -110483, 102799, -187347, -170989, 60955, -107142, 357867, 34783, -3306, 107419, 49777, -17848, -209739, -54759, -129161, -66185, 60571, 39975, -63612, 9152, 162286, 1709, 71651, -261287, 40369, 61329, -277249, 2368, 154534, 124309, -118840, 69589, 235119, -170609, 315918, -93481, -85001, 183833, 21342, -98268, -538, 234657, 115674, 21105, -61230, -170143]
16118a70143G3788L911i9792J2776c1589k13460R7758L6562C0554A5099J75195
16107A90294a20799o4258F980J88667n2403B3580A1714e2437H2024A1093K82542
16096B93635j44797a10540I8078a5769l77734h401B02113a71649G0284L0747N60444
16085F61475E4143f123B1249J43663c540I6471c66585J66655m6881A01794f4905
16073A09414c47381H3017a21825d5583m4687r223A75378n1212j0468b70247D372
16061h4743k73704C4668J00005b69725D338b6975N699D7504a88315a2753A7437
16049A3261a57114j55915A78359m0726k1331k1690P4800D6861J68017b08645L9561
16038a69084l24613i5011B11541E6714J25441a92106a5951b498j08682B283J3200
$$ y = [-170143, 73788, 77699, -99792, -87016, -31589, -245049, -147291, -110729, 30554, 15099, 190294, -120799, -185057, 6980, 195647, 143244, 23580, 11714, -52437, 82024, 11093, 293635, 148838, -110540, 98078, -15769, -393503, -8401, 202113, -171649, 70284, 101031, 661475, 54143, -6123, 21249, 164912, -3540, 96471, -366585, -199930, -246811, 101794, -64905, 109414, -347381, 83017, -121825, -45583, -90270, -99493, 175378, 124166, 113698, -270247, 4372, -84743, -358447, 34668, 134673, -269725, 4338, -26975, -21276, 47504, -188315, -12753, 17437, 13261, -157114, -313029, 178359, 137633, 116302, 94612, 169412, 46861, 214878, -208645, -169084, -493697, -95011, 211541, 56714, 182155, -192106, -15951, -2498, -111180, 2283, 15483]
16027A5483J5944M9224K17540b26862b5759A9572a12715M6989i727j13549L9557
16016h3719l0040k21025c6393N168q7530A12954Q5378a60867b3455A95599o6561
16005A29038e9348A33237e7631k0414p8813A00656K5311d02738G2906a72811B52477
15993c34966f2242I5358J00162C3175c17546G7311o577a8405A56288J77958j16013
15982B18233L53002k68760A15598J85354c6758A22287g6583L3881B72522f6345
15971c16830a44581e6270o4690M5504j75070J22482n5514K9062B17935q4270g4388
15959D6580K21736A25883A8923a32723d4533m360l56998J46574B4798J08363O2603
15948A95764a05869L8670n7180m3836e2231p4012d5148j80682B929J0146b75282
$$ y = [15483, 31427, 80651, 298191, -226862, -25759, 19572, -112715, -65726, -9727, -123276, -83719, -113759, -334784, -36393, -31225, -118755, 112954, 198332, -160867, -23455, 195599, 129038, -59348, 133237, -57631, -78045, -156858, 100656, 125967, -402738, 72906, -172811, 252477, -334966, -62242, 95358, 195520, 33175, -317546, 77311, 70734, -18405, 156288, 334246, 218233, 571235, 302475, 115598, 300952, -36758, 122287, -76583, -42702, 272522, -66345, -316830, -144581, -56270, -120960, -75456, -250526, -128044, -183558, -154496, 217935, 133665, -74388, 46580, 268316, 125883, 18923, -132723, -44533, -48893, -405891, -259317, 24798, 133161, 195764, -105869, -67199, -124379, -168215, -52231, -126243, -45148, -225830, 2929, 13075, -275282]
15936C28327D148b73329F9823b5834o8B11370d9075k87999P2622J3708j96141
15925d46885K2924A96905a12280m9042c5180F6266b52938A05411e6378b0134A27684
15913A52102c7187A9652a83757I9522O6266a48389B84946g890m5369A6270a04968
15901a49500p1393n3643e9807p9022B201K05384J26919c03724N6417N7452H0656
15889a20879N4928A04663a62319j8538r7415a9452H8510a03444Q681p9640O4633
15878a09770F2311a71202A73817A0630O9959C631b20903a0899b654F2664a03482
15866a25265A3771h3300o4644j74459J41565C0366m932M146b03487k10721e467
15854f6888C11927A24544r505d02451h4936I7268D0171J84117o6071a60603j74914
$$ y = [328327, 4148, -273329, 69823, -25834, -25902, 211370, -49075, -337074, -264452, -250744, -446885, -423961, 196905, -112280, -161322, -35180, 66266, -252938, 105411, -56378, -20134, 127684, 152102, -37187, 19652, -183757, 99522, 165788, -148389, 284946, -7890, -53259, 16270, -104968, -149500, -220893, -274536, -59807, -138829, 2201, 207585, 334504, -303724, -247307, -189855, 80656, -120879, -65951, 104663, -162319, -180857, -278272, -19452, 88510, -103444, -94763, -174403, -109770, 62311, -171202, 173817, 10630, 80589, 3631, -220903, -10899, -2654, 62664, -103482, -125265, 13771, -83300, -147944, -322403, -180838, 30366, 25434, 29580, -203487, -414208, -5467, -66888, 311927, 124544, 115039, -402451, -84936, 97268, 40171, 224288, 158217, -160603, -335517]
15843c35517J10816d4216A39180a98416C21174j18874f7821G9448h0286D6952
15832a02263j0606H8476a12127e5671C11276j37252h285p9634B14954n0014n3971
15821A10969a19074K8238j02809e765A9052J74056b15547A40451f0639F1635d34868
15809b68109g4875A31187B339L8452b67019A88621H2629K25666h3819r7071H4582
15797d15656c486k35075A56891a66943a1422C3289L9545c80913G7698e6228H9168
15785A13483a29376D1840b06495D5495R9132D2804e4927A1377d55171c1605A56819
15773G4847a25772A29722a25245D5421b62471c9395p2558I8342b21138l8122A22947
15761c4073j52160B96177a3214E6499B5793c13581a5225A25227c7473E95777A8261
$$ y = [-335517, -224701, -44216, 139180, -198416, 321174, 202300, -67821, 79448, -80286, 46952, -102263, -112869, 88476, -112127, -55671, 311276, 174024, -8285, -87919, 214954, 164940, 110969, -119074, -90836, -193645, -5765, 19052, 193108, -215547, 140451, -60639, 61635, -434868, -268109, -74875, 131187, 2339, 40791, -267019, 188621, 82629, 308295, -83819, -180890, 84582, -415656, -3486, -238561, 156891, -166943, -11422, 33289, 72834, -380913, 77698, -56228, 89168, 113483, -129376, 41840, -206495, 45495, 144627, 42804, -54927, 11377, -455171, -31605, 156819, 74847, -125772, 129722, -125245, 45421, -262471, -39395, -111953, 98342, -221138, -259260, 122947, -34073, -186233, 296177, -13214, 56499, 25793, -313581, -15225, 125227, -37473, 595777, 18261]
15749b6810k38259e234D47766a36915h514E17754e1301k81671J5402R6788j6821
15738b37603A86416a05618C75646b25352I3458a10860B98159h6552B11788a52996
15727A61284n6449b5279j22497m0154F1903L1111c62775f4889b8479q2168A16833
15715a71691I4182a33338M6795k20562i7362j04302E1427a25247H6076e9455J3742
15704d5713r4166m3457B45623a12686n7808A72661a66890m45751A08636B6244
15693B63702d4243j1290B70833a73294A78072p5520O4971F4859K9679a41795j02850
15682b44645A17614e12813a61073C7284j4550J0392M33073a58434q4531A18504
15671b30673c8614q6601b0426B02598j9865j6851m053J11545a77061B351f2946
$$ y = [-26810, -265069, -5234, 447766, -136915, -8514, 517754, -51301, -332972, -317570, -220782, -237603, 186416, -105618, 375646, -225352, 93458, -110860, 298159, -86552, 211788, -152996, 161284, 104835, -25279, -147776, -187930, 61903, 93014, -362775, -64889, -28479, -110647, 116833, -171691, 94182, -133338, -86543, -307105, -97362, -201664, 51427, -125247, 86076, -59455, -45713, -139879, -183336, 245623, -112686, -170494, 172661, -166890, -612641, 108636, 26244, 263702, -44243, -55533, 270833, -173294, 178072, 102552, 167523, 64859, 94538, -141795, -244645, 117614, -512813, -161073, 37284, 22734, 33126, 466199, -158434, -242965, 118504, -230673, -38614, -125215, -20426, 202598, 182733, 165882, 161829, 273374, -177061, 2351, -62946]
15659E7455a54351A16087J18786a46387k90082g3957j14585A8038b2445j62717
15649a85162j10731f1146G6209d04872b623l59538f0120B46715c1458C334c57696
15637g8922O439j48370B5950a60206C6969K06051A18461c7036a628j21473e7909
15625B96150g339D20907h392C26641A40816E7994J75827a61566B52603c39725
15614D4604b68378J13279d8643j58174e723E0230J59683f6017A76580J6227R9357
15603B92164a77929K1606G4986K7502O8154c5142B0730a38845m6282c4256m54749
15592d89005B01014p2880D0714a08294B30585h4244B62030g1732F9859a76755
15581i5701j43091k0047C7825a446n110F6634j6596J15063b16234N8930j84915
$$ y = [57455, -154351, 116087, 234873, -146387, -436469, -73957, -188542, 18038, -22445, -185162, -295893, -61146, 76209, -404872, -2623, -362161, -60120, 246715, -31458, 3334, -357696, -78922, -72483, -220853, 25950, -160206, 36969, 243020, 118461, -37036, -1628, -123101, -57909, 296150, -7339, 420907, -8392, 326641, 140816, 57994, 233821, -161566, 252603, -339725, 44604, -268378, -155099, -48643, -206817, -5723, 50230, 209913, -66017, 176580, 192807, 292164, -177929, -156323, 74986, 102488, 170642, -35142, 20730, -138845, -185127, -34256, -489005, 201014, 128134, 40714, -108294, 230585, -84244, 262030, -71732, 69859, -176755, -95701, -238792, -258839, 37825, -1446, -6556, 66634, 50038, 165101, -216234, -157304, -342219]
15570c42219I3478J28081c48j35728j30575a29948a5328j07468A82392J49585
15560C31977K7490D8368g2720A76404a8831B50665I1618B0316Q6766C3507q352
15549B5155c7009A114J01292d5481j13153e3066b3121D75815h4459G4154b31466
15537D4371b10699A94645c2766C57837A11197b49457a01572A78632a12795l1580
15527a44375E9509L4053b74781H3331K3876A1207L27596A01304G138J55607J59152
15516C21897E8986J86819a69524n4029J10099q4220D0421b81843A40449b86757
15505A59177I306a23882l1432d8901A4210K57483b34816M2764F5262k9221B150
15493B28419c4809i663k05513B975e2015J9789D0561K15143p2329A1514K65069
$$ y = [-342219, 93478, 221559, -348, -136076, -266651, -129948, -15328, -122796, 182392, 331977, 359467, 48368, -72720, 176404, -18831, 250665, 91618, 20316, 107082, 33507, 25155, -37009, 1114, 102406, -45481, -158634, -53066, -23121, 475815, -84459, 74154, -231466, 44371, -210699, 194645, -32766, 357837, 111197, -249457, -101572, 178632, -112795, -144375, 59509, 93562, -274781, 83331, 107207, 11207, 338803, 101304, 7138, 162745, 321897, 58986, 245805, -169524, -223553, -113454, -197674, 40421, -281843, 140449, -286757, 159177, 9306, -123882, -155314, -48901, 14210, 271693, -234816, -192052, 65262, 36041, 2150, 228419, -34809, -9663, -215176, 2975, -52015, -32226, 40561, 255704, 183375, 11514, 276583]
15482B76583l1153a77221j80494A98344J42471A51142h0763l08515D6365f9459
15471a965k75983C81123B0360M2981K62782a81048j19786A84296R6204E1181N6463
15460A07644C2776L54881b2834A57730k6862D9155a58678E8945k2764J69216b18239
15448G2767l4370O6712L6335d8897l03175c3029C6267J37051c43351h4992n8069
15437a43061B34887c3262k25274K3552e5517j98476B6656i6822k62122A73219
15426a07942B34493d41499A2403Q5116b43474c0109j9071H9694a74633A21541
15415a47562E2930c8113j82820j47338A68875f3766H8918b15045d0674A01864
15404A22515b99875a18472j83094C40036g1050i153j07507c5219a5686p8494C5690
$$ y = [276583, 245430, -177221, -357715, 198344, 340815, 151142, -80763, -389278, 46365, -69459, -1965, -277948, 381123, 20360, 63341, 326123, -181048, -300834, 184296, 280500, 51181, 107644, 32776, 387657, -22834, 157730, 130868, 49155, -158678, 58945, 36181, 205397, -218239, 72767, 38397, 105109, 141444, -48897, -352072, -33029, 36267, 173318, -343351, -84992, -143061, 234887, -33262, -258536, -234984, -55517, -253993, 26656, -96822, -358944, 173219, -107942, 234493, -441499, 12403, 97519, -243474, -30109, -49180, 89694, -174633, 121541, -147562, 52930, -38113, -220933, -368271, 168875, -63766, 88918, -215045, -40674, 101864, 122515, -299875, -118472, -301566, 340036, -71050, -9153, -116660, -35219, -15686, -94180, 35690]
15392h4481D406J50409i4207E4981P7043a32669j78785A50223c23447B45129A4344
15380A2918L1767j4807b7992B0584c79j28567Q193e6657B04405c74825C64086
15368B4140J59139a29630N2515I4921b49375A07286i9131j40528B0698a562q1178
15357h2740L8226p3040D7180h4952h392r500J81A23842l0079b5688A7469P3247
15345I0716P9423f6966B92190G3143a27119N411B760R7551a16891b567j17231
15334a19798N1485a265o1696K4940B21840c1463B04551c68923A46596L0137m6577
15323A30156l3123J59834n5260m176E3038J68923D3182K11043f69247d4343j71649
15312b15992H8523a5466l0412q9443G9286c73851J76526E818J3057K2443J39878
$$ y = [-84481, 4406, 154815, -94207, 54981, 132024, -132669, -311454, 150223, -323447, 245129, 14344, 12918, 44685, 29878, -27992, 20584, -379, -128946, -120753, -56657, 204405, -374825, 364086, 24140, 183279, -129630, -77115, 94921, -249375, 107286, -99131, -239659, 20698, -1562, -82740, -44514, -117554, 47180, -84952, -8392, -17892, -17711, 123842, 93763, -25688, 17469, 90716, 170139, -66966, 292190, 73143, -127119, -121708, 2760, 100311, -116891, -2567, -119798, -68313, -1265, -62961, -38021, 221840, -31463, 204551, -368923, 146596, 176733, 130156, 97033, 256867, 201607, 197431, 53038, 221961, 43182, 254225, -669247, -44343, -215992, 88523, -15466, -45878, -135321, 79286, -373851, -197325, 5818, 18875, 41318, 181196]
15301A81196K8177I6718a06023c6196B1901o883O0095d6996A31317d8158A50738
15289a71581B06021e8410B64434a70719A92884L025J232q1947M6653J78312E9687
15277E3645M4591B4411K0397c0674A35593l9418m0739b4660k46468A88799d7849
15265A33441P4507F8442a42594A81381A1636i491l9278j5577D5057N3808d5112
15253a23897A87561B3004K0180M04904Q5589K17475R14769p06037J48266M65095
15243A573245G48650B50009C8095R7709g0904J0910D7812M0719a43794C81691
15232B73934a54248e1438C00047b15445K6291B24841d2463B52214h9421E4157
15221d7818J5965B98292B4528J56797J61728c12761A71985b73435I6764b53744
$$ y = [181196, 209373, 96718, -106023, -36196, 21901, 15018, 75113, -46996, 131317, -48158, 150738, -171581, 206021, -58410, 264434, -170719, 192884, 195909, 197141, 115194, 161847, 340159, 59687, 53645, 98236, 24411, 44808, -30674, 135593, 96175, 55436, -24660, -271128, 188799, -47849, 133441, 207948, 68442, -142594, 181381, 11636, -9491, -48769, -64346, 45057, 98865, -45112, -123897, 187561, 23004, 43184, 448088, 533677, 751152, 1665921, 959884, 1108150, 1573245, 748650, 250009, 38095, 135804, -70904, -59994, 47812, 88531, -143794, 381691, 273934, -154248, -51438, 300047, -215445, -189154, 224841, -42463, 252214, -89421, 54157, -47818, -31853, 298292, 24528, 181325, 343053, -312761, 171985, -273435, 96764, -253744]
15210a01582A95601b44258C89L13345E0682a54335M9510A74552D0771c3172B1422
15198A29504h6833A14670B3740L29732J9403A74504a64390O1904G3424J20333
15188A93757J002J81547A13353c69315a31665C11824C6569q288Q5455H535b3124
15176a807A75632J08141i9574B86123I2233J21225l4124B8117l218K92026a97855
15164a27522H6650a2989K558C08593H3436P5929N9153q2738K2166j7333D1201
15152A45643g8701F7223M2568L79967A20288J38380H4843m2403L384J85910p6621
15141A55113F9527a74706A53622b531m9849A01011K5963J4371a2517A10809m6064
15130F4745K48640A01070A2028J42120d1807E0682g1892D47554i1038A94571l0921
$$ y = [-101582, 195601, -244258, 389, 313734, 50682, -154335, -104825, 174552, 40771, -33172, 21422, 129504, -86833, 114670, 23740, 353472, 372875, 174504, -164390, -102486, 73424, 193757, 194759, 376306, 113353, -369315, -131665, 311824, 36569, 28281, 113736, 8535, -23124, -1807, 175632, 283773, -99574, 286123, 92233, 213458, 179334, 28117, 24899, 316925, -197855, -127522, 86650, -12989, -10431, 308593, 83436, 159365, 218518, 135780, 157946, 140613, 41201, 145643, -78701, 67223, 109791, 489758, 120288, 258668, 84843, 42440, 45824, 231734, 155113, 69527, -174706, 153622, -2531, -52380, 101011, 126974, 141345, -12517, 110809, 64745, 313385, 101070, 12028, 154148, -41807, 50682, -71892, 447554, -91038, 194571, 163650]
15119A63650J09803k8523q1531b8073C95356a06810A4415N4489a01552k96646
15109c98198f7780H3200a75263C14893P114b3134B42555P4153D1016L17545F2650
15097c6196A50367g9101A09774l7534M44344k19034m6008Q4658j59845J9339M6468
15086B42162m4286L008P8086i0903A19830L6768m7851P3601h81C00683e2259B15292
15073H763b9320C07837J15813e1752j51334H3159d2411B36572m2423C4243K27254
15062B61497q2994P1657a56917C51447H737J76460J67409A04683Q8992C7055L75066
15051D12121A73762J05533J71343j70139J58441m6781I3864J58721N3215K35074
15041E40874B05403n8632o6215K01181H2233L31427j97818Q657j00675C9584M50090
$$ y = [163650, 273453, 244930, 163399, -28073, 395356, -106810, 14415, 68904, -101552, -398198, -67780, 83200, -175263, 314893, 322007, -23134, 242555, 316708, 41016, 358561, 62650, -36196, 150367, -79101, 109774, 72240, 516584, 297550, 251542, 336200, 176355, 195694, 242162, 197876, 200884, 278970, -90903, 119830, 156598, 108747, 182348, -881, 300683, -52259, 215292, 8763, -29320, 307837, 423650, -51752, -203086, 83159, -42411, 236572, 194149, 34243, 261497, 178503, 250160, -156917, 351447, 8737, 185197, 352606, 104683, 193675, 37055, 412121, 173762, 279295, 450638, 280499, 438940, 392159, 93864, 252585, 305800, 540874, 205403, 146771, 80556, 281737, 82233, 413660, 215842, 224499, 123824, 39584, 489674]
15030D89674b8505j28306B40262C3646J72254I0507J34436M9847l0611N0261r3711
15019B00729G1360O3014L50719j50688D8808L37221A36947J58861J4523K80508
15009E90839A71052B1129J09421L6920O6444n5087R3851a73266C05593j52338
14999A53255o9110j5063K69099l4067N5241A56587a10420c1294A57375E6704J38493
14988A95197G1041A1187P2770f2004G5582M3549K05726m3522a19777C26969c6152
14976C02191L7837J70983B42627K67169A12379J30653Q3415J33906q7857A82658
14965E71894B01176l592E8567a45771D43361J08780k14488O011A66442o495L98995
14954E58942k47261N5557c27690C64803N1399A62229J58235j24605J74951L6697
$$ y = [489674, -28505, -156811, 240262, 33646, 205900, 90507, 224943, 274790, 244179, 294440, 200729, 71360, 134374, 485093, 334405, 48808, 386029, 136947, 295808, 310331, 590839, 171052, 21129, 130550, 167470, 233914, 178827, 272678, -173266, 305593, 153255, 84145, 69082, 338181, 304114, 359355, 156587, -110420, -31294, 157375, 56704, 195197, 71041, 11187, 83957, -62004, 75582, 119131, 324857, 281335, -119777, 326969, -36152, 302191, 340028, 511011, 242627, 509796, 112379, 243032, 326447, 460353, 372496, 182658, 571894, 201176, 197584, 58567, -145771, 443361, 552141, 337653, 343664, 166442, 159947, 558942, 311681, 367238, -327690, 364803, 416202, 162229, 320464, 195859, 370810, 407507]
14944D07507j92222G5904J10756M02765I6811J20724o2360A1636e6845E2240R4115
14933A46355L57348a15551A67705K6876a56969G3736L98379j44304k1229J58712
14923D65294k8463A24538m522m54J85886E568K39167L65044k46293J41341j8288
14912D86539K0631k18468O3620J27180k31117M9478J6981A54234J76308n0692
14902B79850l8150k6655I8588K45743N8685I6017L16925A11203L5329J55749K3442
14891C25723L8583P8338N0909A98886P8703R9393j38910l3565J26616K49420A68447
14879C94255k5057K10404I0424K26432J68918I8167L08570P041Q4244j58192j19381
14868B20449K04875j52982G8664L34483l7560j54744K57699j7649j1163K2807
$$ y = [407507, 215285, 75904, 186660, 589425, 96811, 217535, 155175, 11636, -56845, 52240, 146355, 503703, -115551, 167705, 194581, -156969, 73736, 472115, 327811, 306582, 465294, 436831, 124538, 120016, 119562, 305448, 5568, 244735, 609779, 363486, 504827, 486539, 507170, 288702, 352322, 479502, 248385, 297863, 314844, 154234, 330542, 279850, 241700, 215045, 98588, 344331, 403016, 96017, 412942, 111203, 146532, 302281, 325723, 364306, 442644, 493553, 198886, 277589, 376982, 238072, 204507, 331123, 580543, 168447, 394255, 369198, 579602, 90424, 316856, 485774, 98167, 406737, 413778, 498022, 339830, 220449, 425324, 272342, 78664, 413147, 375587, 220843, 478542, 460893, 449730, 472537]
14858D72537J9133j52209Q4796B09044M61606C21450R1826J6321n0436K3922j4051
14847C89032K03369j05148O3051A27360L33008J84538B62415J70430J79819k36981
14837C75683k6073J56737k29532P3283L03551J1673k19507B18398M25649k63302
14827C80745J10484j99238J45037K5488A56434K03136J40877J60136B91380J96937
14817D88317K2701j28460K81707p8966j89940J96295B64283Q8258L35156k42041
14807D45656j01235O8567O05788A87527O18524k47822J05086l24613K54724k29396
14797C64030j53157L93907j20934N9814j41665L83625q6183k22802J68795k37712
14787D07718L49511j52998l0463k65034K96148k2422Q209Q3354k85137J71267
$$ y = [472537, 491670, 339461, 424257, 209044, 670650, 321450, 413276, 429597, 379161, 403083, 389032, 592401, 487253, 550304, 127360, 460368, 644906, 262415, 432845, 612664, 375683, 349610, 506347, 276815, 350098, 653649, 665322, 445815, 218398, 644047, 380745, 491229, 291991, 437028, 462516, 156434, 359570, 500447, 660583, 291380, 488317, 511018, 382558, 664265, 585299, 395359, 591654, 264283, 352541, 687697, 445656, 344421, 412988, 1018776, 187527, 806051, 558229, 663315, 338702, 593426, 364030, 210873, 604780, 483846, 543660, 401995, 785620, 699437, 476635, 645430, 407718, 757229, 604231, 573768, 308734, 604882, 582460, 590669, 674023, 388886, 560153]
14777E60153A87868K80525M65252l38818J48075r6289q489j45463L54437Q4774
14767I31872C10728L25985j25850K56483l59952K67446m1013n0951M9085K00009
14757H31970l52589j27097K10914K64147k13321L3420k62712J87881n7027M4273
14747E59859L97117l40565k93768K94293J46165j58365L4894K80753l52081j85866
14737C82436J8937L59297P9502k05049J21722L3558q3870j03303R7642K7819K43949
14726I72640j79031l85620K89153O2704k88181l0619K3473L67445l3679j50635
14716F47650L0974q0059K69342j75740j74013N32651m65442K09473j59917M43931
14706A078850k23530P4178k442m38953M71432m08320K93396J33884k4974D46137
$$ y = [560153, 187868, 468393, 933645, 594827, 742902, 646613, 638124, 492661, 847098, 931872, 310728, 636713, 510863, 767346, 407394, 674840, 633827, 582876, 631961, 831970, 479381, 352284, 563198, 827345, 614024, 647444, 384732, 572613, 515586, 559859, 956976, 616411, 322643, 616936, 763101, 604736, 639630, 920383, 568302, 382436, 401373, 760670, 840172, 635123, 756845, 790403, 706533, 603230, 700872, 728691, 972640, 793609, 407989, 697142, 759846, 471665, 441046, 464519, 831964, 798285, 647650, 678624, 598565, 867907, 692167, 518154, 1050805, 585363, 794836, 634919, 1078850, 855320, 929498, 927056, 488103, 959535, 551215, 844611, 978495, 953521, 446137]
14695I93694j69747J71943j22639J00324l01922K97574K156k95630L26292k7706
14685I74339j97652J24339l18952M32975J33693n02669R0564O83526n83564K05570
14675A042169N4283j96989J81747K58839l80136K3740k50374L7951L58965J064
14665A131259m5255k04966L87521l52245J7743J32114K27938l58950k55313M40324
14655A120170j69131O32703n46153J16858r8097j86989M99024l97280L70711j99354
14645A142462o0687J50323o9759J24990M6807k95793O51212k12024l64522J25156
14635A238165k34267K25488J94478j30523k50761m340j80012L63105J7611j26815
14625A112129L98541l86061Q7102K13117J26170j14338L783k06895K34407P0999
$$ y = [993694, 823947, 995890, 873251, 973575, 671653, 969227, 971383, 675753, 1002045, 974339, 776687, 901026, 582074, 1015049, 1148742, 646073, 736637, 1420163, 836599, 1042169, 1096452, 899463, 1081210, 1340049, 959913, 983653, 733279, 771230, 1130195, 1131259, 1086004, 881038, 1268559, 916314, 934057, 1066171, 1294109, 935159, 679846, 1120170, 951039, 1583742, 1037589, 1154447, 1056350, 869361, 1368385, 971105, 1341816, 1142462, 1081775, 1232098, 1162339, 1287329, 1334136, 1038343, 1689555, 1477531, 1113009, 1238165, 1003898, 1229386, 1423864, 1293341, 1042580, 1038240, 858228, 1221333, 1238944, 1112129, 1510670, 1124609, 1211711, 1424828, 1550998, 1436660, 1440443, 1233548, 1467955, 1538954]
14615A538954l72905K19712K4111J12587o2252o2058o0106m0750K47061m4973
14605A499381j62291O5769p1265J51938J3792L02409k47033J26517M8125o8531
14595A658811j90913q3008K22795J54340N9776p5139j43435o6066J92556J06888
14585A836605J47157J2564l21573K68371j92438m453L73468k70596K99657k01482
14575A947280p370q691J51649j23757L55136l37110J00494M38560l50994K49151
14565B414348l64342P35745o40837M26535K8372L85351k44385q883L19175J40715
14555C191794J30700K62681J46481K43975R71762R79817J674813M050985P220047
14546A8873055K0272314Q094952A7746630q484385D059501j564356n48991K3487
$$ y = [1538954, 1166049, 1385761, 1409872, 1522459, 1460207, 1398149, 1338043, 1297293, 1544354, 1499381, 1337090, 1402859, 1331594, 1483532, 1497324, 1799733, 1552700, 1679217, 1727342, 1658811, 1467898, 1384890, 1607685, 1762025, 1821801, 1746662, 1603227, 1537161, 1729717, 1836605, 1983762, 1996326, 1674753, 1943124, 1750686, 1746233, 2119701, 1849105, 2148762, 1947280, 1939910, 1931219, 2082868, 1959111, 2314247, 1977137, 2077631, 2516191, 2165197, 2414348, 2050006, 2785751, 2144914, 2571449, 2599821, 2985172, 2740787, 2731904, 3051079, 3191794, 3322494, 3585175, 3731656, 3975631, 4947393, 5927210, 7602023, 11653008, 18873055, 39145369, 47240321, 17746630, 9262245, 4059501, 2495145, 1946154, 1969641]
14538A969641k49747L52764k70482J37033M9521P8544j80273p1931L95893o7441
14528B143522l241J98248k01343K6648J62010P0514j04988J85144l27709L54752
14518B503557L83177m23140L45653m38302L02221J63282k62213J95354m07070
14509B362519K76296j09161R6271m5927K64647n7359K11071J93843k98548k20910
14499B672742O74956l74889J97271j56542R3300m537l7012K28651k90296K66251
14489C269895j5396J27668p1622K19323K58708k85287M37652l69289j8316K25401
14479C778737M3777J28040k18011P0870K2736L57760q8220P9298j68523K29782
14469D236246J64616j18921l66792L54772J02727j03309L82450J84556k29247
$$ y = [1969641, 1719894, 2072658, 1802176, 1939209, 1988730, 2067274, 1887001, 1815070, 2210963, 2143522, 2140281, 2338529, 2137186, 2163834, 2325844, 2396358, 2291370, 2476514, 2148805, 2503557, 2886734, 2463594, 2809247, 2370945, 2673166, 2836448, 2574235, 2769589, 2362519, 2638815, 2529654, 2625925, 2579998, 2844645, 2787286, 2998357, 3192200, 2893652, 2672742, 3347698, 2972809, 3170080, 3013538, 3106838, 3102301, 3065289, 3293940, 3003644, 3269895, 3254499, 3382167, 3310545, 3529868, 3788576, 3503289, 3940941, 3571652, 3553336, 3778737, 3822514, 3950554, 3732543, 3803413, 3826149, 4183909, 4095689, 4174987, 4006464, 4236246, 4400862, 4281941, 3915149, 4269921, 4372648, 4269339, 4651789, 4836345, 4607098]
14460D607098K52981k50278N2913J20617j56287M15246k32636L1869L94605k48442
14450D987686J55626o318J20543j59679K48930J60830Q9939j87663P26741o60237
14440E476398L98213L7294Q2764q4458K22038K59442j34889J36631j20204K32817
14430F506046M9314K69622j9735J9960N4149K47222K28909n6386k4278J93494
14420G468317j31005J41037L04864j03466L52413R3399p1657R1089K50888K13488
14410H609367M49870l13109J67776O14325p83775P06111l00517M42589M33332
14401A0025969j36805K50034r1032R8736N83744K64251n2600L59402k73087N56087
14391A1584699O0988L42194J80233K12543L0135N26658L6581K74377j0083K48162
$$ y = [4607098, 4860079, 4609801, 4662714, 4783331, 4627044, 5042290, 4809654, 4841523, 5236128, 4987686, 5143312, 5136994, 5257537, 5097858, 5346788, 5507618, 5597557, 5409894, 6136635, 5476398, 5874611, 5911905, 5994669, 5910211, 6132249, 6391691, 6256802, 6393433, 6273229, 6506046, 6555360, 6824982, 6805247, 6825207, 6879356, 7126578, 7355487, 7299101, 7274823, 7468317, 7337312, 7478349, 7783213, 7679747, 8032160, 8125559, 8053902, 8144991, 8395879, 8609367, 9059237, 8746128, 8913904, 9528229, 8744454, 9450565, 9150048, 9592637, 10025969, 9889164, 10139198, 10048166, 10146902, 10730646, 10994897, 10942297, 11301699, 11028612, 11584699, 11645687, 11987881, 12168114, 12380657, 12410792, 12937450, 12974031, 13248408, 13238325, 13486487]
14381A3486487J69293L31088M89795o0670R20548j90080J23097O85192j58734
14372A5796016L62555M29645J46252N98165M98734K44947J51632P93580L63386
14363A9384912O68648j270L01051P91008K66467J92632J066470M96929J68977
14354B3335824O65121O15431Q48104M98174O43362K34544J090180O94409P18904
14345B9344053O16930Q90181M92499J065953J160478N97960J297902L07582J297825
14336C7071363J158278J000574J457390R35507J429454J133374J407201J608074
14328D7201215J671319J374948J634834J822766J856531K106147K137589K204228
14320F2009577J962969K488693K769118K356882K677183L060719K733856L373167
$$ y = [13486487, 13655780, 13986868, 14476663, 14415993, 15336541, 15146461, 15269558, 15954750, 15796016, 16158571, 16588216, 16734468, 17332633, 17831367, 18076314, 18227946, 19021526, 19384912, 20053560, 20052290, 20353341, 21144349, 21410816, 21603448, 22669918, 23166847, 23335824, 24000945, 24616376, 25464480, 25962654, 26606016, 26840560, 27930740, 28625149, 29344053, 29960983, 30851164, 31343663, 32409616, 33570094, 34168054, 35465956, 35773538, 37071363, 38229641, 39230215, 40687605, 41623112, 43052566, 44185940, 45593141, 47201215, 48872534, 50247482, 51882316, 53705082, 55561613, 57667760, 59805349, 62009577, 63972546, 66461239, 69230357, 71587239, 74264422, 77325141, 80058997, 83432164]
14312H3432164L014657L926491L410298L830085M311911M318743M655944M448068
14304A15348361N435216N561723N793533O328200O515255O875907P363352P904968
14296A67126515P777843Q942922Q926264R894231R914855J1137817J0961713J1849611
14288B46531771J2552490J2995804J3412383J3949881J4462411J4373225J5072966
14281C43350931J4734184J5035381J4641927J3950046J3465516J2169405J0709638
14274D38057028P532257M147664K436308K241056L586235q19762k703724m316051
14266D50161011p470809j0145875j1557458j2963380j4174566j5028260j5684454
14259C63136209j5970293j5917722j5838982j5395061j5068666j3445787j3225790
$$ y = [83432164, 86446821, 90373312, 93783610, 97613695, 101925606, 106244349, 110900293, 115348361, 120783577, 126345300, 132138833, 138467033, 144982288, 151858195, 159221547, 167126515, 174904358, 183847280, 192773544, 202667775, 212582630, 223720447, 234682160, 246531771, 259084261, 272080065, 285492448, 299442329, 313904740, 328277965, 343350931, 358085115, 373120496, 387762423, 401712469, 415177985, 427347390, 438057028, 445589285, 449736949, 452173257, 454414313, 458000548, 457180786, 454477062, 450161011, 442690202, 432544327, 420986869, 408023489, 393848923, 378820663, 363136209, 347165916, 331248194, 315409212, 300014151, 284945485, 271499698, 258273908]
14252B58273908j3253417j2756051j1936235j1053235j0427628j0116047r342494
14245A79388801q880372p949583p646454p514366p087029o483690o141287n568300
14237A22117720m975743n281058n138815m473266m432360l804895l496070l565333
14229H6950180l852150k941216l237178l043557k308523k974524k496140k293795
14221F3803097k156104j773893k262661k008358j998727j601357j559784j307937
14213D9134276j314656j623902j783949j352085r03719j072713q76660j236865
14205C8969727j281458j222535r88873j135581p16998j41082j502990p46507j132294
14196C0101409n44738j064572l57508o50702o19508n94378q65596p15478l39172
$$ y = [258273908, 245020491, 232264440, 220328205, 209274970, 198847342, 188731295, 179388801, 170508429, 162558846, 154912392, 147398026, 140310997, 133827307, 127686020, 122117720, 117141977, 111860919, 106722104, 102248838, 97816478, 94011583, 90515513, 86950180, 83098030, 80156814, 76919636, 73876079, 71567556, 68593032, 66096892, 63803097, 61646993, 59873100, 57610439, 55602081, 53603354, 52001997, 50442213, 49134276, 47819620, 46195718, 44411769, 43059684, 42155965, 41083252, 40206592, 38969727, 37688269, 36465734, 35476861, 34341280, 33624282, 33483200, 31980210, 31233703, 30101409, 29556671, 28492099, 28134591, 27483889, 26864381, 26270003, 25404407, 24688929, 24349757]
14187B4349757o26548o80452n62038l65510m77728m74737l69322l00277p34642
14178A9758503j96160n09641o87795l8869q92961L30166m35068o48518j16813
14169A6562844j90759m68884l59927l09865k54997n24510J94474l72558l08944
14160A3966874n8308n38592j16380m26575r9874m5894l52433m1898q662o10202
14150A1668056k40684J57016l67117j43216k24970l9149j48721l01830l2178j45183
14140A0182024m02122K82736l27330k55129m9307j45999j50554k46244j94486
14131H693589r491j61881l3992j61564q7262o0206r3251m6705l49786L3443m02640
14120G320254J56034l51700J95856j77889o0415P6526k06686k4998m45689J38018
$$ y = [24349757, 23723209, 23042757, 22480719, 22115209, 21637481, 21162744, 20793422, 20493145, 19758503, 19562343, 19052702, 18364907, 18326038, 17433077, 17763243, 17328175, 16679657, 16562844, 16372085, 15903201, 15543274, 15233409, 14978412, 14453902, 14648376, 14275818, 13966874, 13908566, 13369974, 13253594, 12827019, 12727145, 12681251, 12328818, 12286920, 12278258, 11668056, 11427372, 11584388, 11217271, 11074055, 10849085, 10809936, 10661215, 10359385, 10327207, 10182024, 9779902, 10062638, 9735308, 9480179, 9430872, 9284873, 9134319, 8888075, 8693589, 8684098, 8522217, 8488225, 8326661, 8239399, 8179193, 8085942, 8039237, 7689451, 7722894, 7320254, 7476288, 7124588, 7320444, 7142555, 7082140, 7158666, 6951980, 6926982, 6481293, 6619311]
14110F619311P2759l8862j4792r5061j09147m0855k13499j39635O164k44088n3440
14099E748855l9557l9732j18650M4451m27997L18318n10270J95308K02113k23684
14089E149155l45182j04326j26398P228N38207l80063J36612k01167K15325j58099
14079D731292m21037K886O5987J93683r0946l19524N5855J98333m09520j08164
14069C898845J01914m1623j65035K83168J5968k09311J2328j80599L53048o6238
14059D002465M0827j07407L8496m2195l53606j60694K70298k35805J8515J81701
14049C652595j31766k30901Q774k067k68478K68202k3656k02631K63777k80203
14039C053646m3489J9530K1776r8853j11252J16214K2545j15106L45782k43458
$$ y = [6619311, 6692070, 6653208, 6638416, 6543355, 6434208, 6393353, 6179854, 6040219, 6046383, 5802295, 5748855, 5709298, 5669566, 5550916, 5595367, 5167370, 5485688, 4975418, 5170726, 5372839, 5149155, 4803973, 4699647, 4573249, 4580477, 5118684, 4738621, 4875233, 4674066, 4889391, 4731292, 4310255, 4313141, 4379128, 4572811, 4481865, 4162341, 4218196, 4416529, 4007009, 3898845, 4000759, 3959136, 3794101, 4077269, 4093237, 3883926, 3896254, 3715655, 4068703, 4002465, 4043292, 3935885, 3974381, 3932186, 3578580, 3417886, 3688184, 3452379, 3470894, 3652595, 3520829, 3289928, 3298702, 3296635, 3028157, 3296359, 3272703, 3070072, 3333849, 3053646, 3010157, 3029687, 3051463, 2952610, 2841358, 2957572, 2980117, 2865011, 3210793, 2967335]
14029B967335k85023L76117k59243p9265K50529l12992o7424j06656m0453J5590
14019B458515j94066K70575l3380n9158K68854m31796J00967o3719l23534O4743
14009B058001M7811M21348l17481L6970k04780J79410n1050P4371K8440l14968
13999A958072Q8088k78146N43642k42963k11180L51987l98556L01540K97778K57222
13989B667484J553213K395684N754551J6980186K2648382B3741228A1539162m663500
13981F875662j702330r69128p02396k88183P6885k52350m30300P6931j97498l8279
13971B449014J6404l4771O4493j32535k01986K5858m47153J78936L24815k81277
13961A961798j41215M05538p4222J69461l19401j07091L02024M2638j29723l41706
$$ y = [2967335, 2682312, 3058429, 2799186, 2719921, 2970450, 2657458, 2590034, 2483378, 2442925, 2458515, 2264449, 2535024, 2501644, 2442486, 2711340, 2279544, 2380511, 2316792, 1993258, 2058001, 2105812, 2527160, 2209679, 2246649, 2041869, 2221279, 2170229, 2244600, 2273040, 1958072, 2046160, 1768014, 2311656, 2068693, 1857513, 2209500, 1810944, 2112484, 2410262, 2667484, 4220697, 6616381, 12370932, 29351118, 51999500, 23741228, 11539162, 6875662, 5173332, 4204204, 3501808, 3213625, 3290510, 3038160, 2607860, 2684791, 2487293, 2449014, 2465418, 2430647, 2495140, 2362605, 2160619, 2186477, 1739324, 1918260, 2243075, 1961798, 1820583, 2226121, 2151899, 2321360, 2001959, 1894868, 2196892, 2239530, 2109807, 1768101]
13951A768101J24354j77309J91854k04874L89813o2087l94021M65638l26488P3519
13941A848500p4767j49969n388N4157m0755L34182k96542O2756j95629R805m1771
13930A504579L17372l28688K64496k69641J977P4863l3947O5871j13168J51508
13920A635222p4869K44467j66267l59277j98945N32477l16816j05869J28569N9566
13910A378258o1444O0085L57802n07339L540J21308J3635k18771N7557l54455
13900H50176M59010R5709k94559q5359L49269J52693k82619K05923k32588O7908
13890A285563j01674J60226K8167o0309j7098k44592K3671P6019J5439j48680
13880A016732J88109M641k46055J32873J01423k03293L90562m53009K42550j32250
$$ y = [1768101, 1892455, 1715146, 1907000, 1702126, 2091939, 2029852, 1635831, 2101469, 1774981, 1848500, 1773733, 1623764, 1618376, 1672533, 1631778, 1965960, 1669418, 1732174, 1536545, 1546350, 1504579, 1821951, 1493263, 1757759, 1488118, 1490095, 1564958, 1531011, 1596882, 1483714, 1635222, 1560353, 1804820, 1638553, 1279276, 1080331, 1612808, 1295992, 1190123, 1318692, 1378258, 1316814, 1376899, 1734701, 1227362, 1230902, 1352210, 1365845, 1147074, 1204631, 850176, 1309186, 1404895, 1110336, 1024977, 1374246, 1526939, 1244320, 1450243, 1217655, 1285563, 1183889, 1344115, 1372282, 1311973, 1294875, 1050283, 1073954, 1149973, 1165412, 1016732, 1204841, 1209482, 963427, 1096300, 1197723, 994430, 1384992, 931983, 1174533, 1042283]
13870A042283P2092j33898K01338J02267l00743J67551k62890J10048K39371l33451
13860I03968m0477J28427J88494k20134j2384J66554K83211l75774j68332l5280
13850H18273J96722L9663j79783K68329j66126q2844p629K05378l35825L89957
13840A146115k06512k47694L48718k73158N3440K88332k03190j22170k61042J46454
13830F69293M41085k02604J66007m3871j27368j5571K48972p847l46936M2305
13820H23465j55434o4095N53156m38110Q2880j76091L60201k1378l29649K78840
13810I13785j22074J69673L2243k51375k45045O08230j34571j39342P4180k88103
13800F17601O50425D24082K92318J30909l47598J79572p5939K00094p663l74079
$$ y = [1042283, 1114375, 980477, 1181815, 1284082, 983339, 1150890, 888000, 998048, 1237419, 903968, 863491, 991918, 1180412, 960278, 947894, 1114448, 1397659, 1021885, 853553, 818273, 1014995, 1054658, 874875, 1143204, 977078, 894234, 886605, 1091983, 756158, 1146115, 939603, 691909, 1040627, 767469, 820909, 1109241, 906051, 783881, 522839, 669293, 1110378, 907774, 1073781, 1029910, 902542, 886971, 1135943, 1128096, 781160, 823465, 668031, 603936, 1157092, 718982, 801862, 625771, 985972, 964594, 634945, 913785, 791711, 961384, 993627, 742252, 497207, 1105437, 970866, 831524, 905704, 617601, 1268026, 424082, 716400, 847309, 499711, 679283, 603344, 803438, 795775, 421696]
13790D21696N56234j11540k76672L50801k23764r0776L03066l65769J80831r902
13780G34205l14218M52871k06942r2099L20784k14873q5809J84567M4524p8010
13770G45000k51126K599M77397l09074j27484L6775J87802K26723j65535p0858
13760G52219k96329J85436n0044k82221J76959l6224p8347L27623k55552N51586
13750I95106j35733l69161R6805l6899L01921C62140M6266O13206B60006j01837
13740A58169O62926J22281j82939l17797L10616l40880N27947k91838l4723O1652
13730F75414j83937j33700J94113A99916J60344M08935k42619j46035K50712m7567
13720E83686R650J29180r7995J11648B40938N3719K78110k34890L99610j804j83564
$$ y = [421696, 977930, 866390, 589718, 940519, 716755, 625979, 929045, 563276, 744107, 734205, 419987, 872858, 665916, 573817, 894601, 679728, 593919, 778486, 823010, 745000, 493874, 496473, 973870, 664796, 537312, 574087, 761889, 988612, 823077, 752219, 455890, 641326, 591282, 309061, 486020, 449796, 371449, 699072, 443520, 995106, 859373, 490212, 587017, 550118, 852039, 362140, 408406, 1021612, 260006, 158169, 821095, 943376, 760437, 442640, 753256, 412376, 940323, 648485, 613762, 675414, 491477, 357777, 551890, 199916, 360260, 769195, 526576, 380541, 631253, 583686, 593336, 722516, 624521, 736169, 240938, 294657, 572767, 337877, 737487, 735683, 552119]
13709E52119j24784J23518j18201l8312j31058J19062P3781j28786K31329B23303
13698B04923p3545L16673J96816l17380L1461j52102K49436j4215n3864K90691
13688F78894C30861L0980M66486j37181B85337O24767C77225J86021J4565k60456
13678C17355N3299A38649M44326k47760K45751B04297J72814j37147M26885C29855
13667B51283J95535M0130L5379j74409Q1373J63591L982B63748M23385B72073
13656g699D34670j44124K07700j99164K0417K24106o0103L43088A76922o4450
13646A12472M19948M1256j33873K9968r5999A67997N10983C10194J04551k4737
13636C90008I6116K14946J76085p2677Q5574j13773J3728A67005L19863o8324
$$ y = [552119, 427335, 550853, 432652, 394340, 263282, 382344, 456125, 327339, 558668, 223303, 204923, 131378, 448051, 644867, 327487, 358948, 206846, 456282, 442067, 388203, 678894, 330861, 361841, 828327, 691146, 285337, 910104, 377225, 563246, 577811, 317355, 370654, 138649, 582975, 335215, 580966, 204297, 377111, 239964, 666849, 329855, 251283, 446818, 486948, 522327, 347918, 429291, 592882, 596864, 263748, 687133, 272073, -7699, 434670, 290546, 498246, 299082, 319499, 543605, 483502, 826590, 176922, 112472, 532420, 573676, 439803, 469771, 373772, 167997, 678980, 310194, 414745, 390008, 96116, 311062, 487147, 414470, 500044, 386271, 399999, 167005, 486868, 418544]
13626D18544q9659J31126L5530B17148P9568j10264M48648l05181q7446K99647
13616E42120B03934L05497B6885P79533B91096O46313C77218A42408J0906M30303
13606E83617m2038a29687B50041O4473J33442o8533A88461J09565M8097L9721
13596C85844E1023J99293N33055k10776j16465o1884C2318J18148K28964J72651
13586E52081B10018N6682M60029k75857K08440B21646J39384N122Q9719p8682
13576C77189L6078a44379B07310n162L53584N7909j58266I8553K23993J96696
13566E19242j25372J39414A93892K31691k427a138B85033J95147r0444j72813
13556B16923G7253J63942J3734I6981J77131K40449j80732A36867K63152k611
$$ y = [418544, 328885, 460011, 495541, 217148, 296716, 186452, 635100, 329919, 242473, 542120, 203934, 509431, 26885, 806418, 291096, 937409, 377218, 142408, 153314, 583617, 541579, -129687, 250041, 314514, 447956, 379423, 188461, 298026, 346123, 385844, 51023, 250316, 783371, 572595, 456130, 394246, 32318, 150466, 379430, 552081, 210018, 266700, 726729, 450872, 659312, 221646, 361030, 366152, 455871, 377189, 413267, -144379, 207310, 202148, 555732, 613641, 455375, 98553, 322546, 519242, 393870, 533284, 193892, 425583, 423156, -1138, 285033, 480180, 389736, 216923, 77253, 241195, 254929, 96981, 274112, 514561, 333829, 136867, 400019, 397408]
13546C97408o4218j22044J48432j11351J47693J05554q4825A46032J17925A07301
13535B69816j01519P6573n4710n0271K48216n3071I9675j1451J77451r1451H1725
13523B56183j7036L06917B17442q0819j8471K26023a18717A57641N39301B06728
13512A93114K40429B15645J61562j3490A79924K7591c2191B71711P2403p8104
13502B66010K85846B46498D1921J16929M48493A31680B8646R2284K58765J4962
13492C94657A41993K19444A55280Q9796A06453P6159p4600J24552a7380D96395
13481D48178I1183J5058J4724C951a88103A5157N2011P4375H752L88092j205d9373
13468H9292K24756F6736J70589L15762A68870l5373K5958J35136G1375J08946
$$ y = [397408, 333190, 211146, 359578, 248227, 395920, 501474, 416649, 146032, 263957, 107301, 269816, 168297, 244870, 190160, 139889, 388105, 335034, 99675, 88224, 265675, 174224, 81725, 256183, 239147, 546064, 217442, 136623, 118152, 344175, -118717, 157641, 696942, 206728, 193114, 433543, 215645, 377207, 363717, 179924, 207515, -32191, 271711, 344114, 266010, 551856, 246498, 41921, 158850, 607343, 131680, 28646, 120930, 379695, 394657, 141993, 361437, 155280, 245076, 106453, 182612, 108012, 232564, -17380, 496395, 448178, 91183, 106241, 120965, 3951, -188103, 15157, 67168, 141543, 8752, 396844, 395639, -49373, 89292, 314048, 66736, 237325, 553087, 168870, 133497, 159455, 294591, 71375, 180321]
13458A80321J21443A18013a0913B44269p4832m7023f4442C90281h6336A41868
13447A30988J12691f4411q1303A78525J62707B8355L26763A42072L34508j19806
13437C56774A6346O5207l9188R8630Q0514o5802J50506J17879a7285C67275p1027
13426B96248a04794C32749j0960j48779J88452o2242r5247l1493m0624J36611
13416B68467c1307k1556M784A1897J69266Q8092G3303K12891G6528K14990q9238
13405B02280g9983H5327J85740L10348b5580A16990J14969A5678K1586K38532
13395B75796j36345Q8523J96348A14927l4084M2598K63455H8820K69007A26458
13384a83471B69033H8898K1009M88624A49644E7904J52593M175E1391L18619A73269
$$ y = [180321, 301764, 118013, -10913, 244269, 169437, 122414, -64442, 390281, -86336, 141868, 130988, 243679, -64411, -145714, 178525, 341232, 28355, 355118, 142072, 476580, 356774, 16346, 81553, 42365, 140995, 221509, 155707, 306213, 424092, -17285, 367275, 296248, -104794, 332749, 321789, 173010, 361462, 299220, 203973, 172480, 131856, 268467, -31307, -52863, -48079, 11897, 181163, 269255, 73303, 286194, 76528, 291518, 202280, -79983, 85327, 271067, 581415, -25580, 116990, 231959, 15678, 37264, 275796, 139451, 227974, 424322, 114927, 80843, 123441, 386896, 88820, 357827, 126458, -183471, 269033, 88898, 109907, 598531, 149644, 57904, 210497, 214672, 51391, 370010, 173269]
13372D0706P6380J05228K62355J20996A61871A6738J05841A111O3657O73364A31948
13360B57438K05069A76902k7444j3894I492L75497G8544J57355m684J36140j00325
13349B67030N0168F7612L63116A63323M48165B40484K7059E6376J66944L2483
13339B55803m4799L29619B65896J298O1352q112L8378j50416I2203J33601P479
13328B33283L0325P1906r3898A9579R5091R3959J98737C1773K74835j05186g332
13316D8055J22110J99879j40535n0896g1049B4620L59331A38422k7617d5081A5709
13304C71934D2023a32767D03982A11481J62672H316R2797E52Q7420a23790M2541
13293h1249K4828C83397j52573N3042C9285J42552h8777A40581J53292q9263L2903
$$ y = [40706, 117086, 222314, 484669, 605665, 161871, 16738, 122579, 1111, 64768, 738132, 131948, 257438, 462507, 176902, 149458, 135564, 9492, 384989, 78544, 235899, 231215, 367355, 267030, 317198, 67612, 430728, 163323, 611488, 240484, 267543, 56376, 223320, 255803, 211004, 540623, 265896, 267194, 328546, 320434, 358812, 208396, 92203, 225804, 233283, 263608, 335514, 241616, 19579, 114670, 208629, 407366, 31773, 306608, 201422, -7332, 48055, 170165, 370044, 229509, 178613, -71049, 24620, 383951, 138422, 110805, -45081, 15709, 371934, 42023, -132767, 403982, 111481, 274153, 8316, 101113, 552, 87972, -123790, -81249, -56421, 383397, 230824, 283866, 39285, 181837, -88777, 140581, 293873, 204610, 237513]
13282B37513L34697d9729A76342E9098B9432P2251J99464a691j64887C6299J4436
13271E0735L38726Q2346d5135r8751r5558B14980J24343G8114Q9764p1467J72523
13260B68934H0298f0626M314B53733A1836a4219D65673r7792G2676K37335j5856
13249B94155M693B7053N4118Q1956o1737J23048D672b1986A39019O3259c1138
13237B52057e3270r0676E6970J83008a65408j03406A82566G5847K36782Q7196
13227C99825F6826J27554h4496j1380A23279j6223O335E4342J15954f3706D4821
13215D72832j85635A37535M7675n8518j3152R821N0755F5548L7883K7086d4631
13203A0035L3783J3106K1763P5848O2911J35131O9468H3802a08639B07112b8328
$$ y = [237513, 572210, -49729, 176342, 59098, 29432, 101683, 301147, -1691, -166578, 36299, 50735, 389461, 471807, -45135, -143886, -239444, 214980, 339323, 78114, 167878, 96411, 268934, 80298, -60626, -56312, 253733, 11836, -14219, 465673, 367881, 72676, 310011, 294155, 298848, 27053, 81171, 163127, 101390, 224438, 4672, -21986, 139019, 202278, -31138, 252057, -53270, -143946, 56970, 239978, -165408, -268814, 182566, 75847, 312629, 399825, 66826, 194380, -84496, -95876, 123279, 107056, 113391, 54342, 170296, -63706, 44821, 472832, 287197, 137535, 185210, 126692, 113540, 123361, 174116, 65548, 103431, 130517, -44631, 10035, 43818, 56924, 78687, 154535, 217446, 352577, 422045, 83802, -108639, 207112, -28328]
13191H4426J50778g8185K8436I0590K70486k5878k0008C7047j3931L9626N4890
13180A17632L6704D0247e9234B03987B7132J03514L7588f5078D65445j66941a14816
13168b3424D51750i0103A40294c38570a09202H7170J78546J1712N7478a0224l86483
13157c96707J30094B53164G6118A030Q1649J48091j05084J13176R6922r1785n2027
13146A91972P2567R1778a07217A72252k5820p2508P7232D9884j0175f383H5778
13134f2019B48732g3162B3933j540e9198D10405A471a18806D5948N682K07750
13123B59380i4449G7740k5303Q797h6675A02289b07118A70757D1104a93454A73379
13111b1594B03730q2818a8604B68856E7372L8864O9765B2454J56695a83238L8816
$$ y = [84426, 235204, -78185, -49749, 90590, 361076, 335198, 315190, 37047, 23116, 62742, 117632, 154336, 40247, -59234, 203987, 27132, 130646, 168234, -65078, 465445, 298504, -114816, -23424, 451750, -90103, 140294, -338570, -109202, 87170, 265716, 277428, 334906, -10224, -396707, -266613, 253164, 76118, 1030, 82679, 230770, 125686, 238862, 335784, 243999, 191972, 264539, 356317, -107217, 172252, 146432, 73924, 151156, 49884, 39709, -6383, 85778, -62019, 248732, -73162, 23933, 22393, -59198, 410405, 1471, -118806, 45948, 51630, 259380, -94449, 77740, 52437, 61234, -86675, 102289, -207118, 170757, 41104, -193454, 173379, -21594, 203730, 120912, -18604, 268856, 57372, 96236, 166001, 22454, 179149, -183238, -144422]
13100a44422p3859f3335C8542N8769b36923B06351M0269P2949I2151P9902b02577
13088a11522B00498C4067j0897j460a23482A53079n4995d6688C17444G4265O04775
13077F79040b60224C37093b58531C1927a21932f014B51831A9863L83842H4255
13066A18675h1960C96356C4320I394J63847C4735a10331m239I8539D6936e9849
13054A14200K33915H4309Q2760Q1009k963F3359a41865k47707E0607I8a06316
13042B27448r8532c795C7478L26343F3952K28777A0202M03890A24785B519L04981
13031C07500K5838A59611a22034B6961a08641A15904L27160A07108c495C79041
13020E3888O3331h7588a3141F133b53588B21595b9362m0037B1548a23745H5369
$$ y = [-144422, -218281, -63335, 38542, 97311, -236923, 206351, 246620, 319569, 92151, 172053, -202577, -111522, 200498, 34067, 23170, 21710, -123482, 153079, 98084, -46688, 317444, 74265, 679040, -260224, 337093, -258531, 31927, -121932, -6014, 251831, 19863, 403705, 84255, 118675, -81960, 396356, 34320, 9394, 173241, 34735, -110331, -114570, 98539, 46936, -59849, 114200, 348115, 84309, 167069, 248078, 245115, 63359, -141865, -389572, 50607, 98, -106316, 227448, 128916, -3795, 37478, 363821, 63952, 292729, 10202, 414092, 124785, 2519, 307500, 333338, 159611, -122034, 26961, -108641, 115904, 443064, 107108, -3495, 379041, 53888, 117219, -87588, -13141, 6133, -253588, 221595, -29362, -69399, 21548, -123745, 85369]
13008A62680J11564r8250J36431b42684A01627K10501M4221A40612O6140I035
12997F4680k6193F967a03959M2178A22475r899b58497J03667A72724J12504f7408
12985E8241J1932J8310b4418C69263b52775G9973i7643B54527j00108E5459K3258
12974G8717a77893f8248B58490B0583b21686i530k10300G6069L31163a8113C00293
12962G4014O4722K47888D4061R3176E5915J51218A116a84886e994I5454R4691
12951A90145c52548A24532Q876C6976K17404J36164D0253J33138o6344D7949h0365
12939b9948k04498A50212B7069b46582J22500B3986g6299C12359H9599N3335C9572
12927A69281g1716r1590o4464A55361H153h8111A56944a05503A24839l2764c605
$$ y = [162680, 274244, 175994, 312425, -242684, 101627, 312128, 356349, 140612, 206752, 9035, 64680, 38487, 6967, -103959, -61781, 122475, 112576, -258497, -154830, 172724, 285228, -67408, 58241, 70173, 88483, -24418, 369263, -252775, 79973, -97643, 254527, 154419, 55459, 78717, -177893, -68248, 258490, 20583, -221686, -9530, -219830, 76069, 407232, -18113, 300293, 74014, 138736, 386624, 44061, 137237, 55915, 207133, 1116, -184886, -5994, 95454, 190145, -352548, 124532, 133408, 36976, 254380, 390544, 40253, 173391, 107047, 47949, -80365, -29948, -234446, 150212, 27069, -246582, -124082, 23986, -76299, 312359, 89599, 142934, 39572, 169281, -71716, -163306, -227770, 155361, 8153, -88111, 156944, -105503, 124839, 92075, -3605]
12915A9175J82434D9375a41893B67618E4335J04724a53983N3956B67491I1972
12904C2794h0384k13326A09646b7396B8600a38164B63432A25777h5919a373k3205
12893b4578B47064A03992a78409D9381J07567B0362K42010M7979A18564k3062
12883I5502D4814K42510A39382j7219E437K10543A1640b5007G7979N743e68732
12871A43984n5792c8005F451Q4639d0540m2583a8623a383A09696E2096J11209
12860A63305C6160R9869K1072a1918A80138a69055e2067l8069C13803a56302H1396
12848a67059A25908L1126a65596I6607K75234a04743D18803b61079j40415I9709
12837i0706H0431O6292c495k52657P1576k12159a61895l2675J3804A74250B6520
$$ y = [19175, 201609, 49375, -141893, 267618, 54335, 159059, -153983, -100027, 267491, 91972, 32794, -80384, -293710, 109646, -27396, 28600, -138164, 263432, 125777, -85919, -1373, -24578, 247064, 103992, -178409, 49381, 156948, 20362, 262372, 310351, 118564, 95502, 44814, 287324, 139382, 122163, 5437, 215980, 11640, -25007, 77979, 83722, -568732, 143984, 88192, -38005, 6451, 91090, -40540, -83123, -18623, -1383, 109696, 52096, 163305, 36160, 136029, 157101, -11918, 180138, -169055, -52067, -90136, 313803, -156302, 81396, -167059, 125908, 157034, -165596, 96607, 371841, -104743, 418803, -261079, -401494, 99709, -90706, 80431, 146723, -3495, -256152, -184576, -396735, -161895, -194570, -180766, 174250, 26520]
12825B1224P0117c2864j19135B65880e8215A74517a2493C06748K89709b13598
12814A083K2924K7367a49144H4854J56525P1343E8626J95409h6586A7799J46821
12803A64620B8052f6151m411A53457d04875E4058K5711a99194C04916a63758b9386
12791f629A02190L0577g5845Q613l0957A9125Q8731a12810A74718g2885D9394
12779d7561D88812A25780n8537B6677d70156a64575A09009b05048g6072C6622
12768b2614I1190N8084a61561m3223K9260H4225J42437i2688k24938E65558E1819
12756B58402a33834A9675a7459k93139b5672o5158B79646c0871o6875j61962O6161
12745a93547d9611E9196p04Q9644m7901l8251J7559M1537J19641P536b18794A66700
$$ y = [21224, 91341, -32864, -151999, 265880, -58215, 174517, -12493, 306748, 596457, -213598, 1083, 24007, 51374, -149144, 84854, 241379, 312722, 58626, 254035, -86586, 17799, 164620, 28052, -66151, -70562, 153457, -404875, 54058, 79769, -199194, 304916, -163758, -29386, -6629, 102190, 132767, -75845, -67232, -98189, 19125, 107856, -112810, 174718, -72885, 49394, -47561, 488812, 125780, 67243, 26677, -470156, -164575, 109009, -205048, -76072, 36622, -22614, 91190, 149274, -161561, -204784, -175524, 84225, 226662, -92688, -317626, 565558, 51819, 258402, -133834, 19675, -17459, -310598, -25672, -90830, 279646, -30871, -97746, -259708, -193547, -49611, 59196, 58492, 148136, 100235, 61984, 79543, 121080, 240721, 248257, -218794, 166700]
12732b8381B16916b28464D72616a33072r6787C5982e8936A42399p0686L03123
12722C74836A67079a41269r695A1314a09777j12522Q4984j83625I6393L43568
12712D39961C4771R4665L67853G5010a0117C57144c72534C43097j38163J47488
12702C52422i1617B8062J43636J25355r3509q8821O7366a47043A76087C4865a41015
12690B53539I4548a89996J8076J91B5893R3246a5906m5861A60706J06189E4217
12678A61554b33959R1739B79365a12956D1791O4279A4193J36512a28503c7172
12667a22371b7297B71336A22773N8864a26641c1798E7588M8424I617a93667A80029
12655G9682G9i243A96527A2681J12768P1585i822A37798n6946B7239R1082E4339
$$ y = [-28381, 216916, -228464, 472616, -133072, -229859, 35982, -58936, 142399, 71713, 374836, 167079, -141269, -150964, 11314, -109777, -222299, -137315, -320940, 96393, 439961, 34771, 129436, 497289, 75010, -10117, 357144, -372534, 343097, 204934, 352422, -91617, 28062, 171698, 297053, 203544, 114723, 182089, -147043, 176087, 34865, -141015, 253539, 94548, -189996, -171920, -171729, 25893, 119139, -15906, -61767, 160706, 266895, 54217, 161554, -233959, -142220, 279365, -112956, 41791, 106070, 14193, 150705, -128503, -37172, -122371, -27297, 271336, 122773, 181637, -126641, -31798, 57588, 106012, 9617, -193667, 180029, 79682, 79, -9243, 196527, 12681, 125449, 197034, -9822, 137798, 80852, 27239, 118321, 54339]
12642c673A50336C5453a17711C5809K45521J04751A6771K37298l7378H7097C6028
12630A63474p3228j6143K84930a57194A82187r585J20443n4519E3049K43315K50021
12619E46385k56038L3522B1985K34024e0300e243A72201a85334B92657E2308K61249
12608C13557j34773a61017f5784k4552m527C5152J10237C6042l259J43463R0383
12597B66629E1357J67235g7216A27155e6205B78316A5432a87064A82552D8540
12586A43210E6758A053J58142b1751A1505f4435B11881G8774J884K21508F6627
12574A69923D5639a41638c2223E4917O1614J04898A1759a7824A94454c0949j77101
12563b08050l2299e3922C45455a98447A5100K20985e4778c457j74384D5278J15992
$$ y = [-3673, 150336, 35453, -117711, 35809, 281330, 386081, 16771, 254069, 216691, 87097, 36028, 163474, 90246, 74103, 359033, -157194, 182187, 172602, 293045, 238526, 53049, 296364, 546385, 290347, 323869, 21985, 256009, -50300, -5243, 172201, -185334, 292657, 52308, 313557, 178784, -161017, -65784, -90336, -94863, 35152, 145389, 36042, 32783, 176246, 266629, 51357, 218592, -77216, 127155, -56205, 278316, 15432, -187064, 182552, 48540, 143210, 56758, 1053, 159195, -21751, 11505, -64435, 211881, 78774, 80658, 302166, 66627, 169923, 45639, -141638, -32223, 54917, 116531, 221429, 11759, -17824, 194454, -30949, -208050, -240349, -53922, 345455, -198447, 15100, 236085, -54778, -3457, -177841, 45278, 161270]
12552A61270Q982E4029a4801A92314H9615J46779j18180b25943d8574H1046c86015
12540H8422d24950J65832a3170A5707f0113C89798F5136a0278C5128k405a85123
12528d19780A2497O7864l5551d5906E8750A3738h5852k00618L7355Q8729f9250
12516A66010N5130J47021h8580A49983a73525B02988o414q4075C6830a64965A44480
12504f6316H2140a4419I5770J3320k6718g7303A56474n4537i967e19A10358a35135
12491D9528K15827p1558h2899j40409B06143R4748f3154A87599c7407m766l7483
12480g9656a1272l10585J21544e7027A30722b10812e2275D5994P9113C1276A0312
12468B14348c88861C811a22443b2177B21399D8350J19579M8875Q4626a05429B69287
$$ y = [161270, 170252, 54029, -14801, 192314, 89615, 236394, 118214, -225943, -48574, 81046, -386015, 88422, -424950, -259118, -13170, 15707, -60113, 389798, 65136, -10278, 35128, 32723, -185123, -419780, 12497, 80361, 44810, -45906, 58750, 13738, -85852, -286470, -249115, -160386, -69250, 166010, 221140, 368161, -88580, 149983, -173525, 202988, 196574, 112499, 36830, -164965, 144480, -66316, 82140, -14419, 95770, 109090, 82372, -77303, 156474, 101937, -9967, -519, 110358, -135135, 49528, 265355, 193797, -82899, -223308, 206143, 300891, -63154, 187599, -37407, -42173, -79656, -11272, -321857, -200313, -57027, 130722, -210812, -52275, 45994, 125107, 31276, 10312, 214348, -388861, 3811, -122443, -22177, 221399, 48350, 167929, 216804, 301430, -105429, 269287]
12456C5939J84611O5771a31425A31846a98940A46404a61508d4776D16563b34767
12445h7479A52938b2665j97460A49681b89501D3554K31105h035m7446l8070J871
12434i1680A54009o7831A4647J7859h7522A67606b05904h5331j57037h1245H36
12422B23106b00366A91882h025o1952j03467A30449b520A10448K37742C4681J17013
12411A51694g7413A10233L9603a320A15585b57376D9086i541o3842j43161H4889
12399I0098J2511a52205C8294a21492j83826b9733D32250A42388Q0148a35542
12388A41615a20707d5564A78220C3561l867a71595A68820i6726k104a1823j9552
12377c1375k51761F5472L5187M726a32303C18345c1411l25536K6452a38728p813
$$ y = [35939, 220550, 286321, -131425, 131846, -198940, 146404, -161508, -44776, 416563, -234767, -87479, 152938, -22665, -220125, 149681, -289501, 43554, 274659, -8035, -55481, -93551, -91680, 154009, 86178, 14647, 32506, -87522, 167606, -205904, -85331, -242368, -81245, 836, 223106, -200366, 191882, -8025, -69977, -173444, 130449, -2520, 110448, 348190, 34681, 151694, -77413, 110233, 149836, -1320, 115585, -257376, 49086, -9541, -73383, -216544, 84889, 90098, 102609, -152205, 38294, -121492, -305318, -29733, 432250, 142388, 222536, -135542, 141615, -120707, -45564, 178220, 33561, 29694, -171595, 168820, -96726, -98830, -11823, -31375, -283136, 65472, 100659, 105385, -132303, 318345, -31411, -356947, -330495, -138728, -146541]
12366a46541G6085l0082K156L4992J06902K33159j55152f211k78653J31245O1643
12355i1976H6889K35477a62205C28877c4406E7524P2847B0960a19825e3131B5906
12343E0948O5051b7014A31869N6157k5113B713f4163p3145M6072a7330j70916
12332a88246B92339a06290A84100p8713b1225C0357P2437a87812e069k20843o8210
12321b94122B74387f8569B00622B0610J39882b22055A72651b13993a0156l0424
12311d0580A05439R2429K1750c2273J766A29609J12542a76000g7032C3553J59294
12300A92847f1507k7925C0783P0170f5343N496p0085A91411c54368A53709m306
12289A49403n2053g150B31893K2672L7003F8080M0506l9026a84591h1612I8984
$$ y = [-146541, 76085, 46003, 48159, 83151, 190053, 423212, 268060, -6211, -284864, -153619, -91976, 86889, 322366, -162205, 328877, -34406, 57524, 130371, 20960, -119825, -53131, 25906, 50948, 115999, -27014, 131869, 188026, 162913, 2713, -64163, -137308, -91236, -17330, -188246, 292339, -106290, 184100, 105387, -21225, 30357, 102794, -187812, -5069, -225912, -294122, 274387, -68569, 200622, 20610, 160492, -222055, 172651, -213993, -10156, -40580, 105439, 197868, 219618, -32273, -30507, 129609, 242151, -176000, -77032, 33553, 192847, -61507, -89432, 30783, 100953, -65343, -59847, -129932, 191411, -354368, 153709, 149403, 97350, -7150, 231893, 254565, 291568, 68080, 108586, 69560, -184591, -81612, 98984]
12277C48200a4126n1819C2554L63258A67573P0004K37748k26024a88327a3640
12266A52318g7576A07931J83481A41954B9190R2640b3735r3884n3941D06202G9297
12254A91273q1103N2812a12466K5928B52783b8972E18497F7145K17409J9167d9489
12242b35370K1011I7505M2541R3720I7820J13300n8201K9533H8267K316J35463
12231B26046A07685e8977A55290J40771d8537B15310D4365J9347M94418k51044
12221C07086j18498i1848A68844p0884J75444a13645C14046b23138a0712B76655
12210A91419J6973A441N2738J00637g0031A28640L26913B1514K17168q3918h1572
12198B27262j8584B9331J22925a2780A46152J68745j2691I7933a50082J3805E7735
$$ y = [348200, -14126, -65945, 32554, 395812, 167573, 237577, 475325, 249301, -188327, -13640, 152318, -77576, 107931, 291412, 141954, 29190, 121830, -23735, -117619, -171560, 406202, 79297, 191273, 110170, 162982, -112466, -86538, 252783, -28972, 518497, 67145, 284554, 303721, -49489, -235370, -214359, 97505, 140046, 233766, 97820, 211120, 152919, 182452, 88267, 90583, 226046, 107685, -58977, 155290, 296061, -48537, 215310, 44365, 63712, 558130, 307086, 188588, -91848, 168844, 97960, 273404, -113645, 314046, -223138, -10712, 276655, 191419, 208392, 1441, 54179, 154816, -70031, 128640, 455553, 21514, 238682, 154764, -81572, 227262, 208678, 29331, 152256, -12780, 146152, 314897, 302206, 97933, -150082, -136277, 57735]
12186A16995J75913A31951J16192E6921i2507A10112m4458R0746K00798A76586
12175C35984a61153A82711E8411f2055B6718J96882f6361q7737G3578K34317L2442
12164C40337L1659a47661B27678f6764r0545H8912a60284A11689e5505m08426
12154d63931I8839K97882H2018K14849a39591O0818A32205d5856I8517J50012
12144B48529b78824A14392e4943m73906E1671J15509G7857K68556B9994M3506
12134G3500J84180p6158a15525b1093j22906D1500N2639c76553A07751a75176
12123A3372Q9240a87413B49370a54234I0230g148I2509C2894b6090A2285L196
12112A5481O8941K29749b33283g3304D5859M2608L25217A53148J33924d6257j9488
$$ y = [116995, 292908, 131951, 248143, 56921, -92507, 110112, 65654, 156400, 357198, 176586, 335984, -161153, 182711, 58411, -62055, 26718, 223600, -66361, -154098, 73578, 307895, 340337, 371996, -147661, 227678, -66764, -157309, 88912, -160284, 111689, -55505, -463931, 98839, 396721, 82018, 296867, -139591, -78773, 132205, -45856, 98517, 248529, -278824, 114392, -54943, -528849, 51671, 167180, 77857, 346413, 29994, 73500, 257680, 181522, -115525, -21093, -143999, 41500, 94139, -376553, 107751, -175176, 13372, 102612, -187413, 249370, -154234, 90230, -7148, 92509, 32894, -26090, 12285, 15481, 84422, 314171, -233283, -73304, 45859, 88467, 413684, 153148, 287072, -46257, -65745]
12101f5745A60267q344k8035h2715j80807i9402J4346j87338B96288b1520r1277
12090a12797A9138b82051D5284J28271b0772B89583G5943M923Q95819O77574N93888
12079B248147G66409k81157E2878K54744q6427b02567h1808B66839a28984A61477
12068i9822C19272F3975p408a01042c4951j71456f9212A59642a04642I7962L2470
12057A30432a24613m0126A9698c8238A54299E1487K36973c84448d9228k50378
12047b99606C52402b67055A83200k506b23746k9524a11719l32348a15449F818
12036I5112C4700J17712d3551n8969M7163A62188e169n5864b9534j66133f2401
12024A0045b82725O1562f2225k61293A53232E3198R8761a29485B58305m0644e6604
$$ y = [-65745, 160267, 151923, 123888, -82715, -263522, -99402, -85056, -272394, 296288, -21520, -112797, 19138, -282051, 45284, 173555, -20772, 289583, 75943, 80866, 976685, 1654259, 2248147, 766409, 485252, 52878, 307622, 221195, -202567, -81808, 266839, -128984, 161477, -99822, 319272, 63975, 56567, -101042, -34951, -206407, -69212, 159642, -104642, 97962, 130432, -124613, -164739, 19698, -38238, 154299, 51487, 288460, -384448, -49228, -299606, 352402, -267055, 183200, 180694, -223746, -253270, -111719, -444067, -115449, 6818, 95112, 34700, 152412, -43551, -102520, -55357, 162188, -5169, -61033, -29534, -195667, -62401, 10045, -282725, -221163, -62225, -323518, 153232, 53198, 151959, -129485, 258305, 217661, -56604]
12012c31199B70154B192i1359C16319L2949a1419k5277j10351j1848A6548L42860
12001C59408A62356a10006k78122a33845M9113E7099c24256J11704B22579c35619
11990G6026a10281r363C46088B748a09232b837q0073C31207A36264d2259j79512
11979b21771Q5048l08844A3574a02848j55583A42067b50134A3151f0332j41632
11969b01964Q1672D2867d3720J3397B10320H773a30121A27844f8842m5431E8584
11957c0533l50681a06509c0947n8567G3381C0492a81328F2787L2155P3961A6688
11945I9920a66586A23717i7085A45533o5945K0438J5579a38162d101k44096g1208
11933e5864A20414a3839j52323H2981h2745A34788g9417j4398C23028a70787L8518
$$ y = [-331199, 270154, 2192, -91359, 316319, 349268, -11419, -36696, -147047, -158895, 16548, 359408, 162356, -110006, -388128, -133845, -84732, 57099, -324256, -212552, 222579, -335619, 76026, -110281, -119644, 346088, 2748, -109232, -2837, -82910, 331207, 136264, -42259, -221771, -136723, -445567, 13574, -102848, -258431, 142067, -250134, 13151, -60332, -201964, -120292, 42867, -43720, -30323, 210320, 8773, -130121, 127844, -68842, -114273, 58584, -30533, -381214, -106509, -30947, -89514, 73381, 30492, -181328, 62787, 94942, 168903, 16688, 99920, -166586, 123717, -97085, 145533, 79588, 100026, 115605, -138162, -4101, -248197, -71208, -55864, 120414, -13839, -166162, 82981, -82745, 134788, -79417, -93815, 323028, -170787, -132269]
11922a32269F5233a75730d7548p2798A2541d1554A7976b55000N6407L4513k68068
11911d32148D2435a17638c8043f72j92094H652h9794r0566q8117J19881j287K5579
11899a24304b5993m1517k1364B21996H03L70955b22597J8337a6355A67850a78900
11887E6179e4120A5540c54812a27969d9181K3791l91372B13606p0951j4306c1182
11875c44671A70796l6408J38842A10707m4587b36314d6785k03289A62510D4628
11864A79931J7074r1085l5405a99198l9807B57741G8085L3634J28620G8735a61019
11852b3349r3482F36413B28634c5257B03768a21536C33978c31222g4510k52740
11842c27250f4625C536b20048i5158k19787J39851g9721E0643a26478l1438A16617
$$ y = [-132269, 65233, -175730, -47548, -120346, 12541, -41554, 17976, -255000, -198593, -164080, -432148, 42435, -117638, -38043, -672, -192766, 8652, -89794, -180360, -268477, -148596, -149883, -124304, -25993, -67510, -88874, 221996, 803, 371758, -222597, -204260, -16355, 167850, -178900, 56179, -54120, 15540, -354812, -127969, -49181, -25390, -416762, 213606, 142655, 128349, -31182, -344671, 170796, 134388, 273230, 110707, 66120, -236314, -46785, -250074, 162510, 44628, 179931, 197005, 105920, 70515, -199198, -239005, 257741, 78085, 111719, 240339, 78735, -161019, -23349, -116831, 636413, 228634, -35257, 203768, -121536, 333978, -331222, -74510, -327250, -64625, 3536, -220048, -95158, -314945, -175094, -79721, 50643, -126478, -157916, 116617]
11830F2010a9816N208F4252h1178q7098m6922C5508a13488E7554d02015a28050
11818a79164B2669J72755b69751d0759H4399R5362a91761F0298a26073j19496
11808b45569j3332I1253A4065f8213j48706G3265O63J86324g6626p5895m5437
11797a97958J8459k4596A54408c84868h4981K9665D2066P6892b77795d876o395
11786a1271G4978l6713K24992D5397c65380n5860C78363a1886k10452I4581e6235
11774B89620a40041j29623j07742J26401m4182E5498f4780j8522j9542j93179
11764b96023N9433B27432C1973a4813o0344a355B76652a61861A44063c9037I3756
11752b76534a35771c5039m8851q0408c6883k18560A87234B4888a93668D43176
$$ y = [62010, -19816, -14608, 64252, -81178, -168276, -215198, 35508, -113488, 57554, -402015, -128050, -179164, 22669, 195424, -269751, -40759, 84399, 179761, -191761, 60298, -126073, -245569, -258901, 91253, 14065, -68213, -216919, 73265, 73928, 260252, -76626, -152521, -197958, -179499, -204095, 154408, -384868, -84981, -55316, 42066, 118958, -277795, -4876, -11271, 74978, 38265, 263257, 45397, -365380, -421240, 378363, -11886, -222338, 94581, -56235, 289620, -140041, -269664, -377406, -251005, -295187, 55498, -64780, -83302, -102844, -296023, -236590, 227432, 31973, -14813, -75157, -1355, 276652, -161861, 144063, -39037, 93756, -276534, -135771, -35039, -83890, -164298, -36883, -255443, 187234, 24888, -193668, 443176]
11741g6395m33543h1587A55134E9809a3264o7965A02218J36088n0607j1789A0215
11729a08j23260K6653K2689n027A19182E67O7061j6339e39973C97035H2186L5133
11717A17319J47177a34441j14853A06176a42348B25156a89745G4926B6375a46755
11706B87609a06789C15149O4809r8745E7998h8273C7925c31569e1270A69945a72948
11694A66278g6337C1143a6260j65489I1662P9615G3948K5458l4486Q1093k4508
11683A21505b1757C0362l934a73139b9693A76815a46055F9261b72246A91411a48742
11671A38966O7100l2235e7127a0753C8717K35930b17320A18956b26796d44j96327
11660a96771C44354a60897D57208B2586g9952k60778B5610J07872a5763j04758
$$ y = [-76395, -509938, -81587, 155134, 59809, -13264, -81229, 102218, 238306, 187699, 175910, 10215, -108, -123368, -96715, -74026, -79053, 119182, 567, 67628, 51289, -539973, 397035, 82186, 117319, 264496, -134441, -249294, 106176, -142348, 225156, -189745, 74926, 26375, -146755, 287609, -106789, 315149, 379958, 281213, 57998, -88273, 37925, -331569, -51270, 169945, -172948, 166278, -76337, 31143, -16260, -181749, 91662, 171277, 73948, 99406, 64920, 146013, 121505, -21757, 30362, 26428, -173139, -29693, 176815, -146055, 69261, -272246, 191411, -148742, 138966, 206066, 173831, -57127, -10753, 38717, 274647, -217320, 118956, -226796, -444, -196771, 344354, -160897, 457208, 22586, -79952, -340730, 25610, 133482, -15763, -120521]
11650a20521E8064J0094J43303B8317J67986D2258K53388b58510H2783m0777a65950
11638C63558G6885b80684A86424a01443j89825J32715N8607b8743j25410g0507
11627b8657B24092b77851O7937C6867a24335K8800j24555a8765A78581c32071
11616e6688C88686a54331B56310a83796N7566I5666d1197G2678a83615A95846
11605A9893a23903H5868K3103b40463D4087b32402D17328c7679A94324a04614
11594g1603B50172H5888a10368G7093e4060b4020Q956p4138m8375B14874g3019
11582a26989m1514Q688A81268a53714B24245h1276a9947m6609A29013Q1883A6188
11570A98859F633b04045A16096J87838A13108a30025B32771P9903b7831A16107
$$ y = [-120521, 58064, 68158, 211461, 28317, 196303, 42258, 295646, -258510, 82783, 42006, -165950, 363558, 76885, -280684, 186424, -101443, -291268, -158553, -99946, -28743, -154153, -70507, -28657, 224092, -277851, -209914, 36867, -124335, -95535, -220090, -18765, 178581, -332071, -56688, 388686, -154331, 256310, -183796, -126230, 95666, -41197, 72678, -183615, 195846, 19893, -123903, 85868, 108971, -240463, 44087, -232402, 417328, -37679, 194324, -104614, -71603, 250172, 85888, -110368, 77093, -54060, -24020, -15064, -89202, -137577, 214874, -73019, -126989, -168503, -159815, 181268, -153714, 224245, -81276, -19947, -66556, 129013, 210896, 16188, 198859, 6633, -204045, 116096, 303934, 113108, -130025, 232771, 312674, -27831, 116107]
11559a10954k23425d5793b0129l5225A5163K25220B5414J0846K34187q5028Q3953
11548B69372F9431L12130d7214m733j0742E55084G6806J11612q4862M55315D0868
11536C57656h6056B34275R743a01360G8345K48417p0254a7267j6722B82890A17754
11524I1137m4815a65698P8206o1565M3604B5357L7183K44056L2107d3882C64278
11512C03984A35383c9601C97634j66454a65444A01620J8634a59929B7347L01363
11502C28710j46586L9492Q9196b40277A76631L5572p9026m6569a08888D03115
11491H8790R3974i5546B51295o8894b95081A06950B8203P3050a69810E6297Q7074
11480A43371J9492J08363k1017G4583L91348A78531A6617J67048D4096a5909A58560
$$ y = [-110954, -334379, -45793, -20129, -55354, 15163, 240383, 25414, 36260, 270447, 185419, 269372, 69431, 381561, -47214, -51947, -62689, 555084, 76806, 188418, 103556, 558871, 40868, 357656, -86056, 234275, 244018, -101360, 78345, 326762, 256508, -17267, -33989, 282890, 117754, 91137, 46322, -165698, -87492, -149057, -105453, 25357, 62540, 306596, 338703, -43882, 364278, 303984, 135383, -39601, 397634, 231180, -165444, 101620, 120254, -159929, 27347, 328710, 182124, 221616, 310812, -240277, 176631, 212203, 133177, 86608, -108888, 403115, 88790, 182764, -95546, 251295, 182401, -295081, 106950, 28203, 101253, -169810, 56297, 143371, 162863, 271226, 250209, 74583, 465931, 178531, 16617, 183665, 44096, -15909, 158560]
11468E1137a45072B45522j9381r4972J60908q820H8558l0457J48650c55559I4848
11456a01030D79673A32121a38949k2184H3423B5376i4630C50579A67463a99255
11445D186J27722f1789o3286O2339A25068D342J19116A1260L70628j25133b33987
11433A47048a35614L721m6360o1925A85838a14967O949j0999b93G8153H7f3514
11420f4417n555A85127J47568B6353b70272b9365A47689D1769b30913A22644C4618
11408d15801a9947j65566D2438K62408i461H008d5375C0626a57717E6227P325
11397F3552p480J36535g2475K9134D6334L0179B3284b5558A98683a25025A02727
11385a8391k29939C3235a02080k8132C2307Q5092a54875d7373g342r1829q7278
$$ y = [51137, -145072, 245522, 226141, 131169, 292077, 283257, 88558, 58101, 206751, -355559, 94848, -101030, 479673, 132121, -138949, -161133, 83423, 25376, -94630, 350579, 167463, -199255, 4186, 131908, -61789, -125075, -62736, 125068, 4342, 123458, 11260, 381888, 256755, -233987, 147048, -135614, -131893, -178253, -240178, 185838, -114967, -108018, -119017, -293, 78153, 87, -63514, -64417, -69972, 185127, 332695, 26353, -270272, -29365, 147689, 41769, -230913, 122644, 34618, -415801, -19947, -185513, 42438, 304846, -9461, 8008, -45375, 30626, -157717, 56227, 63552, 56072, 192607, -72475, -43341, 46334, 76513, 23284, -25558, 198683, -125025, 102727, -18391, -248330, 33235, -102080, -130212, 32307, 117399, -154875, -47373, -7342, -99171, -186449]
11374a86449o3668F4067K37942K72023A7391L5363a09397e0548A36958K8121a9709
11362C2465c50120J73182C73481A14379h7270j05816Q1336c2758n9606k3335b5
11350b09783E233J07522g1192D9796e2447B19451J5012b85112R0236N5095I4287
11338c96042a58497E0252a84855G2671J41666l8329c11576a01651C85491A49509
11327B34108a46486B48086f8272B6367g6734j57654a08366r2505d1083G0613d4644
11315b30382E0659n853a77156C0849J74776C9636a73676A25998C6392R9420h297
11303B40647E888J03601g773l53498B35270f6667a2392j56070E7891Q1038F9260
11291a81047N5206b9570n6498E0486a08622C46675f9723l13730g4317I7463e3012
$$ y = [-186449, -250117, 64067, 302009, 574032, 17391, 52754, -109397, -50548, 136958, 165079, -19709, 32465, -350120, -176938, 373481, 114379, -87270, -193086, -111750, -32758, -92364, -115699, -25, -209783, 5233, 112755, -71192, 49796, -52447, 219451, 234463, -285112, -194876, -139781, 94287, -396042, -158497, 50252, -184855, 72671, 214337, 176008, -311576, -101651, 385491, 149509, 234108, -146486, 248086, -68272, 26367, -76734, -234388, -108366, -200871, -41083, 70613, -44644, -230382, 50659, 44806, -177156, 30849, 205625, 39636, -173676, 125998, 36392, 135812, -8297, 240647, 5888, 109489, -7773, -361271, 235270, -66667, -12392, -168462, 57891, 138929, 69260, -181047, -125841, -29570, -86068, 50486, -108622, 346675, -69723, -383453, -74317, 97463, -53012]
11279a24828A47420p0055h1915c2974j29487B3628L28137b81736J16095B30248
11268H0065l1680a81547p3184a26943D2255K9109a54703D5260b12812m3723D0975
11256a45572k32048e998q566I5879d0437j76400N0272r8155d2288l470G7565a93623
11243A56169a98163L1568C22969c07197f6975k2080l6292k87961b00280J1795
11233a88485B03989C4314j4877a13106K5945E7506e9867B08451a01680j84165
11223b85845A55526n7257a93918c4189D329g3297B12842a59935A56078a07132
11212a74079B86082A41370g912j8000E9097a28981C33216a39748A0888a12306
11201a24893B11578c93670A82590f9084c544B19923r460B2165A0058C34c5780
$$ y = [-124828, 147420, 77365, -81915, -32974, -162461, 23628, 351765, -281736, -165641, 230248, 80065, 48385, -181547, -254731, -126943, 42255, 71364, -154703, 45260, -212812, -256535, 40975, -145572, -377620, -5998, -14564, 95879, -40437, -216837, -166565, -264720, -42288, -45758, 77565, -193623, 156169, -198163, -166595, 322969, -307197, -66975, -89055, -125347, -413308, -200280, -188485, 203989, 34314, 19437, -113106, -87161, 57506, -59867, 208451, -101680, -285845, 155526, 98269, -193918, -34189, 4329, -73297, 212842, -159935, 156078, -107132, -174079, 286082, 141370, -7912, -25912, 59097, -128981, 333216, -139748, 10888, -112306, -124893, 211578, -393670, 182590, -69084, -3544, 219923, 210463, 22165, 10058, 334, -35780]
11189B68049e1256p1087B0148c3755B1252e7974j21646a9731B65410d48031a36337
11177a2723M655k17019c1617k50709g7997L1738A41770i3964c6459k84118J57650
11166a62927G7642B61a20301J5925j14786f1617m2912A03477b96321R3592c7320
11154D8871K73217a01013B90884F1074b23771g5024A65151a22995N442j7981O2751
11143g2783l4574A7222a73835Q1536j64713A73166g3692L5979B66966m9953J8603
11132B35616J15377r6287a77139I824i3428M1691j62245G7139h5066G5925L51511
11121D27436j63483H574K38411J22688d2872F2616J06322E115b41553k3840A03582
11109b42982d9530C16712A37423Q5610q7561a25013F1909b0075R393A91749c3517
$$ y = [268049, -51256, -122343, 20148, -33755, 21252, -57974, -179620, -19731, 265410, -448031, -136337, -12723, -8068, -225087, -31617, -282326, -77997, -46259, 141770, -93964, -36459, -320577, -162927, 77642, 261, -120301, -104376, -219162, -61617, -104529, 103477, -296321, -202729, -37320, 48871, 322088, -101013, 290884, 61074, -223771, -75024, 165151, -122995, -117553, -135534, -72783, -107357, 17222, -173835, -92299, -257012, 173166, -73692, -37713, 266966, 217013, 235616, 350993, 254706, -177139, 9824, -93428, -51737, -213982, 77139, -85066, 75925, 427436, 263953, 8574, 246985, 369673, -42872, 62616, 168938, 5115, -241553, -265393, 103582, -242982, -49530, 316712, 137423, 223033, 135472, -125013, 61909, -20075, -10682, 191749, -33517]
11097D46998A07051Q8910P763m9751D1179K98655p9942P6533j64584O7092e0963
11085c75673B03370J59809j12961R031J68219A13853b04698D32009A33816K72680
11075D06496a08722C82399p8645k5041G1077J43721L21019A92776N8452J9626
11065B70854L19473A94466M3062m51K70285A10708M60016k5282N7349j18432R5500
11054E79859q7757B35433J92291K53115j31387K91323C31364K25222m7437J08354
11044F17503q5072j01882l8370M81399m3225C96598J84390l5431O8350j2917j50924
11033D50066K41733K53717n9011k40495q3026k77659K79099M7645M8495J28144
11023G88708k06589J84205C21343o3512M07910k06031m1003r4737J49019o7776
$$ y = [446998, 107051, 195961, 203724, 153973, 41179, 339834, 259892, 336425, 171841, 238933, -50963, -375673, 203370, 363179, 250218, 259249, 427468, 113853, -204698, 432009, 133816, 406496, -108722, 382399, 303754, 278713, 71077, 214798, 535817, 192776, 251228, 270854, 590327, 194466, 237528, 237077, 507362, 110708, 570724, 545442, 602791, 484359, 579859, 492102, 235433, 427724, 680839, 549452, 840775, 331364, 556586, 509149, 617503, 532431, 430549, 392179, 873578, 830353, 396598, 580988, 545557, 613907, 600990, 450066, 691799, 945516, 886505, 646010, 562984, 285325, 564424, 612069, 660564, 788708, 582119, 766324, 321343, 257831, 665741, 459710, 418707, 323970, 472989, 405213]
11013D05213L2956K28932k39033m4191K00503j01999J50073B76861O9035J6059
11003C61955L13420k1893j83964J48715j20049J36082j00199J39413j11225j70695
10993C91560K81356k49585J42672K30842j5081B73075J39514K83325R3003K27310
10983A016227j30528k50629M02774j7135j07593N18195K855l4764M67070k87373
10973A579099O82596j00297K53748k02041L45011l69992j41268l99821j91085
10964A455950P5578k3215m0387m13566Q9932J49065j42377K28657k2328j10734
10954A246575P9422j67684k97891R9301o6865m11737q6389J51933j34133a02673
10943E65980B70006B5401J63120g7745h541G9397K59813C7294K16930F8169K02870
$$ y = [405213, 438169, 667101, 428068, 383877, 584380, 482381, 632454, 276861, 345896, 361955, 675375, 653482, 469518, 618233, 498184, 634266, 534067, 673480, 562255, 391560, 672916, 423331, 566003, 796845, 781764, 273075, 412589, 695914, 788917, 1016227, 885699, 635070, 1037844, 1020709, 913116, 1431311, 1434166, 1399402, 1866472, 1579099, 2261695, 2161398, 2415146, 2213105, 2558116, 2188124, 2046856, 1647035, 1455950, 1531528, 1508313, 1467926, 1054360, 1144292, 1293357, 1150980, 1379637, 1357309, 1246575, 1325997, 1158313, 860422, 959723, 892858, 481121, 394732, 546665, 412532, -102673, 565980, 270006, 25401, 188521, -77745, -8541, 79397, 339210, 37294, 254224, 68169, 271039]
10932B71039o7924H4154N409b28319C93002D1071L1130h9817C65201j10616A04996
10920A72535N1535J60151b45403B10736O107C1331J92734r6107M4521k0752i1823
10908I9979a43494b2772C29379H3646J72823p5017B2377g7055b8747k2531A30527
10896C1185i1825p7003j1334A7849e4237b1727A90626B8948a10648j4026n4443
10885a79117F5638g3553I1604h2479r846j02748d2460j3361k20554h7407A8640
10873A01914a10507q4480K5500I9339c28741a23061A71597a80106F1890b47854
10862a8928B02244D3674L3610a86077r4291A073K09406e2708k71008A45640K975
10851A48615d67391a11566A20902b81119g2285k334H2229j854a29092B7930J18380
$$ y = [271039, 203115, 84154, 89563, -228319, 393002, 41071, 72201, -89817, 365201, 254585, 104996, 172535, 224070, 384221, -245403, 210736, 216843, 31331, 224065, 127958, 172479, 151727, -91823, 99979, -143494, -22772, 329379, 83646, 256469, 181452, 22377, -77055, -28747, -51278, 130527, 31185, -91825, -168828, -180162, 17849, -54237, -21727, 190626, 28948, -110648, -124674, -179117, 65638, -73553, 91604, -82479, -92325, -195073, -42460, -55821, -276375, -87407, 18640, 101914, -110507, -194987, -169487, 99339, -328741, -123061, 171597, -180106, 61890, -247854, -18928, 202244, 43674, 77284, -186077, -280368, 1073, 210479, -52708, -323716, 145640, 148615, -467391, -111566, 120902, -281119, -72285, -74619, 82229, 80375, -129092, 27930, 146310]
10840A46310e8175A5350L3391a43967B80802j34417a27865N9819D8080J09894
10830A57974K17872d16817a28143D16615h5577F9938b42327G4554J44635C5423
10819a47697j24434n487a15296l39512c6835r5868e5590j47667A1286b69128b4273
10807B76486b10535R6891k20578b2648H8937A5086b11069o943i5406D0215R1077
10796A31292L97384b04025a0068j29486M2205G3164P108b17610A84647b63789
10785B6872a37707e2051E0578c4034j11561p309j05982K4031Q8513o483P1777
10774h1048F4731K70158a07832l9482B19605B261h1735A2069d6147b574l95634
10763c98208B00530c2349B8151M8208b07046B69458a67775c7387m7765G3313a73145
$$ y = [146310, -58175, 15350, 48741, -143967, 280802, 146385, -127865, -68046, 48080, 157974, 375846, -416817, -128143, 416615, -85577, 69938, -242327, 74554, 219189, 35423, -147697, -272131, -277618, -115296, -454808, -36835, -132703, -55590, -203257, 11286, -269128, -24273, 276486, -210535, -113644, -334222, -22648, 88937, 15086, -211069, -218012, -95406, 40215, 131292, 528676, -204025, -10068, -139554, -97349, 73164, 80272, -217610, 184647, -263789, 26872, -137707, -52051, 50578, -34034, -145595, -152904, -258886, -234855, -146342, -152825, -81048, 64731, 334889, -107832, -147314, 219605, 2261, -81735, 12069, -46147, -2574, -398208, 200530, -32349, 28151, 76359, -207046, 269458, -167775, -37387, -85152, 73313, -173145]
10751a71248n2958M3488F3907j9862Q1132a53190A3128a74929Q2570j84499a19617
10739A9643a89676A33629D6411c18888a43784n1709I6499l1411a65700I0573a38163
10727A55817Q5714b82911j66853h2979G0853h007k51186k9259F1308J19735H4208
10715A01511A034c9871j05261f8933F4673a9977k8505j52386A34849a71283A76162
10703A17525m0025c02235h0218j33651j41763j65144b9826k9761K4691A05187
10692a31709L2165A90932b47723C26376A484h0400j37192A57525F8544J15673
10682A84217b30915R9356F3541c3151A02853A4492b32533B0574J31164a25862
10671e2313k45876i6831j48747J03214E1424b58415L5801N6455c7126j03962k43360
$$ y = [-171248, -224206, -180718, 63907, 44045, 125177, -153190, 13128, -174929, -92359, -276858, -119617, 19643, -189676, 133629, 46411, -318888, -143784, -195493, 96499, 65088, -165700, 90573, -138163, 155817, 241531, -282911, -449764, -82979, 70853, -8007, -259193, -288452, 61308, 181043, 84208, 101511, 1034, -39871, -145132, -68933, 64673, -19977, -48482, -200868, 134849, -171283, 176162, 117525, 77500, -302235, -80218, -213869, -355632, -520776, -29826, -59587, -34896, 105187, -131709, -99544, 190932, -247723, 326376, 1484, -80400, -217592, 157525, 68544, 184217, -230915, -131559, 63541, -33151, 102853, 14492, -232533, 20574, 151738, -125862, -52313, -298189, -96831, -245578, -142364, 51424, -258415, -222614, -166159, -37126, -141088, -384448]
10660c84448C29388j63708b8567r0853M5285j14096j65299c7441A28122f2381
10649g7552a355j57727j22043b9206m79707a22721A58266J4826i07j61541B01130
10637a75299B58107r9741c83528b9526o4738H8171P9248b10343Q7594D9344a60142
10625b61624b0331D6603i947A94978B2437J28990a83608C11013a07736q7332A5236
10613F7538L7017l6621l2914J92679C6759A1550J5238a64725g1856K9435F6985
10601D6115h2557e37j62914b4381B46403e9865K4610o640l6298A63926Q9009a2153
10588A51299B1042c03291i9657k05569A91017a75023o726G9129a01672r6528A33990
10576b90874J1570B9964K1960K3258B6234D132J08284Q2898g455B08711a76825
$$ y = [-384448, 329388, 165680, -28567, -119420, -74135, -188231, -353530, -37441, 128122, -62381, -77552, -1355, -159082, -281125, -29206, -508913, -122721, 158266, 173092, -907, -162448, 201130, -175299, 258107, 158366, -383528, -29526, -94264, 88171, 167419, -210343, -122749, 49344, -160142, -261624, -20331, 46603, -9947, 194978, 22437, 151427, -183608, 311013, -107736, -195068, 15236, 67538, 104555, 67934, 35020, 227699, 36759, 11550, 26788, -164725, -71856, -42421, 66985, 46115, -82557, -537, -163451, -24381, 246403, -59865, -35255, -41895, -78193, 163926, 252935, -12153, 151299, 21042, -303291, -99657, -305226, 191017, -175023, -181749, 79129, -101672, -198200, 133990, -290874, -279304, 29964, 51924, 75182, 26234, 4132, 112416, 195314, -7455, 208711, -176825]
10564A03585J98217c8785G7196a37046K0227m9484j78087G4751c57476A70703
10553I7295i6421C32522A59165a1687o5472j52670i3346F5726K26910d3279A98117
10541B33811a46552j22338A09777a20964H0721i4360B1878N7639a8270D47465
10530d14664a34973C3529J46384A4972J73694o4391J24791a09918O404c2488j05206
10519a37694c4743G1967a5238m6581n0023e5216j96214G6907R758a43662j14481
10508b58143A7385b12762G0041C546c95164a62768g3904O579F5294h5910B8567
10496A81138a48288a5658q0026B61963o0087i3932q576j74581A28263b76016C43185
10484G3713M9035k4034k6195N87986j91365O0684j93768J27448h4555K0995B81947
$$ y = [103585, 301802, -38785, 77196, -137046, -116819, -166303, -344390, 74751, -357476, 170703, 97295, -96421, 332522, 159165, -11687, -77159, -229829, -93346, 65726, 292636, -43279, 198117, 233811, -146552, -268890, 109777, -120964, 80721, -94360, 21878, 79517, -18270, 447465, -414664, -134973, 33529, 179913, 14972, 188666, 124275, 249066, -109918, -103514, -32488, -137694, -34743, 71967, -15238, -61819, -111842, -55216, -251430, 76907, 86665, -143662, -258143, 17385, -212762, 70041, 3546, -395164, -162768, -73904, -67325, 65294, -85910, 28567, 181138, -148288, -15658, -95684, 261963, 201876, -93932, -102508, -277089, 128263, -276016, 343185, 73713, 122748, 98714, 72519, 660505, 469140, 529824, 336056, 463504, -84555, -63560, 281947]
10472d48362I1291J67761c02967Q2797A33283K45359b1185b089A03996a66604
10461A2732O4392J46929r7630a82758m6943i891o4880F9421c2553l78148J84131
10450b26570D0839h4502A60626d23759A05125N4873a46239C45242A3579e3594
10439D4690c0204A04224A1919K48130f0170q7070M0985J6952b1857m1430l44938
10428d08225A0357J13542b3508l43224I002L2404J12261b87526A51613k7488c0135
10416C0437R2825b50590f5824C4438f4835B55970q3946a05528A63738b14502N5555
10405a58947l61044K07218e3989C06425H4701a8998n1221K4008j24640B95601
10394A0801J68277b70760C45758A03216a69940d557A39166k0193a44796I8449
$$ y = [-448362, 91291, 259052, -302967, -220170, 133283, 378642, -21185, -2089, 103996, -166604, 12732, 77124, 224053, 126423, -182758, -229701, -9891, -74771, 69421, -32553, -410701, -226570, 40839, -84502, 160626, -423759, 105125, 159998, -146239, 345242, 13579, -53594, 44690, -30204, 104224, 11919, 260049, -60170, -147240, -106255, -89303, -21857, -63287, -408225, 10357, 123899, -23508, -366732, 9002, 41406, 153667, -287526, 151613, 124125, -30135, 30437, 123262, -250590, -65824, 34438, -64835, 255970, 172024, -105528, 163738, -214502, -158947, -519991, -312773, -53989, 306425, 84701, -18998, -70219, -46211, -170851, 295601, 10801, 179078, -270760, 345758, 103216, -169940, -4557, 139166, 118973, -144796, 98449]
10383D71652H608c6035a7283A80751c1784A73389j3848b1630B83591n3790J42194
10372C71995A17373J82121J96993k10045K22983k30017G9205L32216j80515L00632
10362E31538d9434J8656B85327f4026H1170L06588A11268N1383J43278j8096a84043
10350D83211j57816L5394R9165A19222N09717k66727O5985o0852J49065r6519
10340D19891C9694K67087q0540l3729J69369j78584a463B96863F9910O2100J42619
10329B74629I2823l1034b15139f1666B06658j2552K68480A81155f4660l906B9420
10317H7684J21752i1607i757B31201b79382E7730J04937g1336A308b99065J01342
10306a97723d4755A75164b33090C28288C7854b31086A81821A1059g7605k88510
$$ y = [471652, 8608, -36035, -17283, 180751, -31784, 173389, 159541, -21630, 283591, 229801, 371995, 117373, 299494, 496487, 286442, 509425, 279408, 79205, 411421, 230906, 531538, -49434, -30778, 285327, -64026, 81170, 387758, 111268, 162651, 305929, 287833, -184043, 483211, 325395, 360789, 459954, 119222, 628939, 362212, 428197, 367345, 516410, 419891, 39694, 306781, 226241, 192512, 361881, 183297, -1463, 296863, 69910, 132010, 274629, 92823, 61789, -215139, -61666, 206658, 194106, 462586, 181155, -64660, -68566, 29420, 87684, 209436, -91607, -9757, 231201, -279382, 57730, 162667, -71336, 1308, -299065, -197723, -44755, 175164, -233090, 328288, 37854, -231086, 181821, 11059, -77605, -366115]
10296c66115A53797B1718c41597D3679j6208r925J5988M5361J69006b89995a21176
10284c20791P9243a02789j82631B1536i7171B29936G295N6948K5942E03Q9404
10273H9907i6770k33230A55292B3566J12918a18077j24609N6743C9439J90239
10263B29678G2677l0398P552K44062G7283N2230a1487C65014H6473K7430A7517
10251d7572p2788B6687b76911H6577i3441C997a43194A05741o203a33299d6212
10239B5798j0987h9157C35202a13473A8947N4656a27987j2665j38566C72342A77471
10227B0265m490a53470p2145R4570A923c96644a56203D3860A6079b68303a910
10215h5206j3478l8246A32591b53903a15220B38267i9130m3375e2097o8147B98650
$$ y = [-366115, 153797, 21718, -341597, 43679, 27471, 17546, 33534, 78895, 247901, -289995, -121176, -320791, -241548, -102789, -285420, 21536, -97171, 229936, 7295, 64243, 90185, 503, 89907, -96770, -330000, 155292, 23566, 136484, -118077, -242686, -185943, 39439, 229678, 72677, 42279, 49831, 293893, 77283, 129513, -11487, 365014, 86473, 113903, 17517, -47572, -120360, 26687, -276911, 86577, -93441, 3997, -143194, 105741, 99538, -133299, -46212, 25798, 14811, -89157, 335202, -113473, 18947, 73603, -127987, -140652, -279218, 372342, 177471, 20265, 15775, -153470, -225615, -131045, 1923, -396644, -156203, 43860, 16079, -268303, -1910, -85206, -98684, -136930, 132591, -253903, -115220, 238267, -99130, -142505, -52097, -120244, 298650]
10203a42289f8961e686k30735C8227a83578A64037o2778M1240D6853L5050a2351
10191e7182j52973L9278f2325j71454B44805H4692Q5608o2837e9186A63268J8623
10180A81891E4816G528b24555d088C96644b04064j56626a42663N8858C19339d0981
10168C9605h1608A60836c62396B3272a5264E37652c03242c9061D2984a71748k12768
10157c84516I9030a14829I0981b10908E6211J70996a525A32524a72546d4455A08739
10145f3242F1981J98586a16928A19857b5677C1853E769g2724C9681a0803j76469
10134a87272O1911N4866B08159a32690c3924k35498J17590A16821a09292B30993
10123i5636M6667e902A41274E846J36536B1517c03358G4238d04203e5188J6793
$$ y = [-142289, -68961, -5686, -236421, 38227, -183578, 164037, 101259, 142499, 46853, 81903, -12351, -57182, -210155, -170877, -62325, -233779, 244805, 84692, 170300, 107463, -59186, 163268, 181891, 54816, 7528, -224555, -4088, 396644, -204064, -360690, -142663, -83805, 319339, -40981, 39605, -81608, 160836, -362396, 23272, -15264, 537652, -303242, -39061, 42984, -171748, -384516, 99030, -114829, 90981, -210908, 56211, 227207, -1525, 132524, -172546, -44455, 108739, -63242, 61981, 260567, -116928, 119857, -25677, 31853, 5769, -72724, 39681, -10803, -187272, -125361, -70495, 208159, -132690, -33924, -269422, -151832, 116821, -109292, 230993, -95636, -48969, -5902, 141274, 5846, 142382, 21517, -303358, 74238, -404203, -55188, -38395]
10112c8395n00992a9540j84845P3142F5520c70663J74037r913c2590k10832E4757
10100d3977k78159a3806A30058P0372a05229A00000a72237i899H0356a49314k2695
10089a72009A25509J35012a96844O7897J7276E0922g8835A82961g25k82246O7177
10078b15794A7633H700J14233c85697A26670b1594E7574b7363C3847J28533c63439
10066b28293Q0896l6072B6635a7416k17928a9357k2760p2875G683b13732l396
10055b17128d0539k86971R9644E6103a24241P569j03510P7884m6840d2025l53185
10044c95210H6021b17245J8408C1720N5466a09621e1882J7885k8439r2624j37108
10033b92168a29022A36260a90278J8001J4645A9839c72407N5858N0033A20847
$$ y = [-38395, -539387, -19540, -204385, -131243, 65520, -370663, -196626, -206539, -32590, -243422, 54757, -43977, -322136, -13806, 130058, 200430, -105229, 100000, -172237, -9899, 80356, -149314, -172009, 125509, 260521, -196844, -128947, -111671, 50922, -78835, 182961, -725, -282971, -215794, 17633, 8700, 122933, -385697, 126670, -21594, 57574, -27363, 33847, 162380, -363439, -228293, -147397, -183469, 26635, -17416, -235344, -19357, -42117, -114992, 7683, -213732, -217128, -40539, -327510, -227866, 56103, -124241, -116672, -220182, -142298, -189138, -42025, -395210, 86021, -217245, -198837, 31720, 87186, -109621, -51882, -33997, -62436, -155060, -292168, -129022, 136260, -190278, -172277, -157632, 19839, -372407, -316549, -266516, 120847]
10022D2637L2990K80381a95965b1638F4214a43197j1246j8119C9881K13785a34923
10010a06069l8768B46978B8536J31625a21732H1588a80092E6395i716k2445r5957
9999a28118A39772h0279j67342c5494F7168c5760k49751O7876A31165k6434P3000
9988A77731l2044a01822A79696d01464g6871A15407b07762Q1902j7039k41223
9978c84122G9758a2147j07339q4628I6368a68730p8687a15198j66834J04036B03789
9966A03415a9246k62263J15368k0279l2837A09428a21662k1705l4464b8557l04635
9955c33192N5844B37729F7640b67864p1828B9929b37319d5772A07049O1435K0711
9944A89195a56809d6281k5408q1660B79526C4851R3144a81971A6687e5262j55003
$$ y = [42637, 75627, 356008, -195965, -21638, 64214, -143197, -154443, -172562, 39881, 253666, -134923, -106069, -144837, 246978, 28536, 160161, -121732, 81588, -180092, 56395, -9716, -32161, -128118, 139772, -80279, -247621, -35494, 67168, -35760, -285511, -217635, 131165, 104731, 177731, 145687, -101822, 179696, -401464, -76871, 115407, -207762, -125860, -142899, -384122, 79758, -12147, -119486, -204114, 96368, -168730, -247417, -115198, -282032, -177996, 203789, 103415, -19246, -281509, -166141, -186420, -219257, 109428, -121662, -143367, -177831, -28557, -333192, -277348, 237729, 67640, -267864, -339692, 29929, -237319, -45772, 107049, 168484, 189195, -156809, -46281, -71689, -153349, 279526, 34851, 127995, -181971, 16687, -55262, -210265]
9933b10265A30791n9711h0909C16493n6234b60128B4098d20103E4504J90512a09180
9921d0727a2015B04387a55781n4124O9975J9592l6021f3372E736f0154j52154
9910b12308A87211a39507k68275a03917D14267b39707P7225C03085b21511C5779
9899d6163m1069d2683m01133A60286l0542J8405D8505a43063K8382n861L2993
9888h7549A6125J0828b21369a01739b7835B6580a85224j82142B2795K17121I2994
9876a33933K9925A10926b08440f3759P913A0037e3337A89428a31282p5901R2813
9865a14370a2826j49031H2254a70990J558A3035b55628B20890a80491N8265k94978
9854d17204H0523e7132a4614j29085n9277A25609a71253l621M383c7007j93655
$$ y = [-210265, 130791, 71080, -80909, 316493, 260259, -260128, 24098, -420103, 54504, 245016, -109180, -40727, -12015, 204387, -155781, -209905, -139930, -120338, -156359, -63372, 5736, -60154, -212308, 187211, -139507, -407782, -103917, 414267, -239707, -162482, 303085, -221511, 35779, -46163, -87232, -42683, -443816, 160286, 129744, 148149, 48505, -143063, -114681, -120542, -87549, 16125, 26953, -221369, -101739, -27835, 26580, -185224, -367366, 22795, 239916, 92994, -133933, -104008, 110926, -208440, -63759, -55846, 10037, -53337, 189428, -131282, -207183, -114370, -12826, -161857, 82254, -170990, -169432, 13035, -255628, 220890, -180491, -122226, -417204, 80523, -57132, -14614, -143699, -202976, 125609, -171253, -174874, -170491, -37007, -230662]
9843b30662b4389C918L1406A2002a41683J0965N2170q3359A14891g4258k47274
9832c21532l2642P7591n5093A09772J51316J18925c26062a11306p476N4848b6402
9820G6988A4579b95807D641M8275a42606l70429a24631F0479M6651a02285k3303
9809a25588q4557K9905K9109K3191j02612a5097m2952A47584J91456d33966e4025
9797B77192c13758a10948l81348H302h0971k7688A26558c86136D6197M084g7289
9785C63243A41126b5391l4424k12467B51305a61598E1672K5841c56975a13961
9774B41294b00207A02711o512b46484E2503J42684G6416h3622m3218j87167A09961
9762f1962l33009d1235I1801k8293j6835a26893a3115j82987E881J22386J83492
$$ y = [-230662, -24389, 3918, 35324, 12002, -141683, -130718, -78548, -161907, 114891, -74258, -321532, -354174, -276583, -331676, 109772, 261088, 380013, -326062, -111306, -118782, -63934, -26402, 76988, 14579, -295807, 4641, 52916, -142606, -513035, -124631, 60479, 107130, -102285, -125588, -210145, -180240, -151131, -127940, -230552, -15097, -58049, 147584, 339040, -433966, -54025, 277192, -313758, -110948, -492296, 8302, -80971, -108659, 126558, -386136, 46197, 50281, -77289, 363243, 141126, -25391, -59815, -272282, 251305, -161598, 51672, 77513, -356975, -113961, 241294, -200207, 102711, 96199, -246484, 52503, 195187, 76416, -83622, -126840, -314007, 109961, -61962, -394971, -41235, 91801, 63508, 46673, -126893, -13115, -196102, 5881, 128267, 311759]
9751C11759f0879r465C42437e9066l06355E7566b66836C378b80282d9127J2572
9740c6555o6347I9775b43790B7985o42b36251K2273G728L9456c1652n0475j21743
9728b03870b9795r0973n953j69577J26868B16314a15620k07841d5350H4705a30895
9716I2446b51152a16C8308d78866C6212a45644f3785B88406C4821a9480j46776
9705a66256L7825A18806l0888f5449K6574J5130k5352r3527j03064J22460r3142
9694b16370C48353j58440e61j06073A63479c68658i7451F8993a36948A92040d31538
9682C9163g7496r178l8122J7850h107L43A52889G721J40212b22759R4809b1997
9669c3265B05273D2788a8692A35627a29351j8715I6134c10190R7172j00717h3259
$$ y = [311759, -60879, -70344, 342437, -59066, -365421, 57566, -266836, 3378, -280282, -49127, -36555, -102902, 99775, -243790, 27985, 27343, -236251, -213978, 7728, 47184, -31652, -82127, -203870, -29795, -120768, -126721, -296298, -169430, 216314, -115620, -323461, -45350, 84705, -130895, 92446, -251152, -116, 38308, -478866, 36212, -145644, -63785, 288406, 34821, -19480, -166256, -128431, 118806, 87918, -65449, -38875, -23745, -49097, -142624, -245688, -123228, -216370, 348353, 189913, -561, -106634, 163479, -368658, -97451, 68993, -136948, 192040, -431538, 39163, -77496, -86674, -124796, -106946, -8107, -7764, 152889, 7721, 147933, -222759, -127950, -21997, -33265, 205273, 42788, -18692, 135627, -129351, -148066, 96134, -310190, -213018, -313735, -83259]
9657A47623A0717b52346l7074f8079F4300b08381N5724A42296b255j60730E2249
9645b03469D517d02048J29811A2106L0774a1231o1890m2589I4939b33318O9144
9634a64174J2353j02085A42176e4816j9265a8771j72388b3937k6608a4001H3452
9622A9675g3106b8258n2247r7233d6280j48578M1325F3084a65805e1660G1488
9610g4226b2642H3637b31954E6596K74166i1376H4757c46539e9277k30262e9838
9598b0061l91211a73824h3227o2509k03564B90180F1562K14326A358a28217j19105
9587b47322b2337B0273Q014a83613A30004c30973F6729f2266J5492F1508c4868
9575e8614m2412a9020j3712j35010G2706a11542j88643a06874o0925j55991J29791
$$ y = [147623, 10717, -252346, -289420, -68079, 64300, -208381, -152657, 142296, -2255, -162985, 52249, -203469, 4517, -402048, -272237, 12106, 42880, -11231, -73121, -115710, 94939, -233318, -164174, -151821, -253906, 142176, -54816, -74081, -18771, -191159, -23937, -50545, -14001, 83452, 19675, -73106, -28258, -80505, -177738, -46280, -194858, -153533, 63084, -165805, -51660, 71488, -74226, -22642, 83637, -231954, 56596, 330762, -91376, 84757, -346539, -59277, -289539, -59838, -20061, -411272, -173824, -83227, -145736, -349300, 290180, 61562, 275888, 1358, -128217, -247322, -22337, 20273, 28287, -183613, 130004, -330973, 66729, -62266, -46774, 61508, -34868, -58614, -101026, -19020, -32732, -167742, 72706, -111542, -300185, -106874, -167799, -323790, -193999]
9564a93999d1325E7689a24593J384K6445k8112I1701b10430Q6432C77962b75107
9552d2321G2954j5677d6389A08746b32201i2690D1853b73627C7568b96643Q3812
9541b12831A58011a22306J7971j2284N7866j76207l09799g7830D8937a79469R704
9530a69765M6868C3807g2627j83401B5349g5519m0057m45B17989d7221B61708
9518c05337a40706o645C6129a75582O8847A25988h6116l23446d3236k4873r4016
9507a62125O7586c0327l0615C3073h1401A88122a15593A92264a80882A31608c9946
9495A2021h7235E2583g9222A54126B4350a50168j24175m9233h8620J7007B13648
9483C4973L5876O0394b06649h1125R923l1876j81975A43893J41151c4254A28341
$$ y = [-193999, -41325, 57689, -124593, -123209, -96764, -124876, 91701, -210430, -123998, 377962, -275107, -42321, 72954, 57277, -46389, 108746, -232201, -92690, 41853, -273627, 37568, -296643, -212831, 158011, -122306, -104335, -116619, -58753, -234960, -544759, -77830, 48937, -179469, -169765, -122897, 33807, -72627, -256028, 25349, -75519, -115576, -116021, 217989, -47221, 261708, -305337, -140706, -147351, 36129, -175582, -106735, 125988, -86116, -409562, -43236, -68109, -162125, -94539, -30327, -60942, 33073, -81401, 188122, -115593, 192264, -180882, 131608, -39946, 12021, -87235, 52583, -79222, 154126, 24350, -150168, -274343, -323576, -88620, -71613, 213648, 34973, 70849, 131243, -206649, -81125, -71202, -103078, -285053, 143893, 285044, -34254, 128341]
9471E9557B3771b08119j63752a33089N7874j18120F205c55450A38696a06054m1508
9460a47562d5601J7499k7188l25450A18530k2647f2886J9917k77239h7613K5575
9449f2038b3003G4765b78085e579k70730E03320D3404a55238j32281c5911k92744
9438c28655J50432c0121m2772G3661l2850J5404a23403A45671o6147c32990a14545
9426A84192c6542j62351B04749a01363M1952b4206j24950I7722a17044c3833j49650
9415a83483O5327C57700A13951a65823C86329E2509c571j52049A53130b928k74045
9404b76973A49177B1050L22627f2519A05236B3552a47542A24345a49691A74352
9393b49880Q5794k26153J68417n0163g0029A18990a61986f8582H4311a80785j53683
$$ y = [59557, 23771, -208119, -371871, -133089, -75215, -193335, 6205, -355450, 138696, -106054, -147562, -45601, -28102, -55290, -380740, 118530, 95883, -62886, -42969, -320208, -87613, -62038, -23003, 74765, -278085, -5579, -276309, 503320, 43404, -155238, -287519, -35911, -328655, -178223, -30121, -72893, 73661, 40811, 56215, -123403, 145671, 79524, -332990, -114545, 184192, -36542, -198893, 204749, -101363, -59411, -24206, -149156, 97722, -117044, -33833, -183483, -118156, 357700, 113951, -165823, 386329, 52509, -3571, -155620, 153130, -2928, -276973, 149177, 21050, 343677, -62519, 105236, 23552, -147542, 124345, -149691, 174352, -249880, -164086, -390239, -221822, -271985, -70029, 118990, -161986, -68582, 84311, -180785, -334468]
9382c34468a55570b415B64957a75727j71834G1093j2251d35j81173F2121a21144
9370A9298b27695A04300c7854B03879c1762A63750b69060F4817j4498a70042j63968
9359c34010J21312A85442c09904j814j4243b5878B40968c03425B49780c03807
9348b25776J08614H2808N1214c4412k1104k37333R9855j85248J70014L692C97193
9336d5968K1769p4763k54796O3270r128Q8681j14372f4692A52754E2869J92946
9325B45815a84418A95617a61355n4723B9474b50112J09732G3295K95912a03844
9314d0341A741J65042M0517r7684a35372j39891n760J10654A4953b80400B97607
9302C3074b09364p9143J14927A45880m522A1861J60400a71558p4765a2783l3347
$$ y = [-334468, -155570, -2415, 264957, -175727, -347561, 71093, 58842, -435, -181608, 62121, -121144, 19298, -227695, 104300, -37854, 203879, -31762, 163750, -269060, 64817, 50319, -170042, -334010, -212698, 185442, -309904, -311718, -325961, -25878, 240968, -303425, 249780, -303807, -225776, -117162, 82808, 134022, -34412, -55516, -292849, -192994, -378242, -208228, -204536, 397193, -45968, -24199, -98962, -353758, -290488, -299616, -210935, -325307, -64692, 152754, 52869, 245815, -184418, 195617, -161355, -216078, 29474, -250112, -140380, 73295, 369207, -103844, -40341, 1741, 166783, 207300, 109616, -135372, -275263, -281023, -170369, 14953, -280400, 297607, 33074, -209364, -288507, -173580, 145880, 141358, 11861, 172261, -171558, -246323, -12783, -46130]
9291d6130j55829L8867m7307J01410o1062A02535g0266k10694G1194K6992a92913
9279A15173J0037a26917A40340B3934a31485B035b95683e2142N082j29679A79906
9267A01359e6462E6332b68350d3906q7328n4110B79003E2500a49264I3481J1502
9256A04983b83603c3946p5772H923c14860a19968j53171h0655L8296C6376a8107
9244A26627a04174q2033d216p8058k57825a22681C776c01062P0430j7000P9849
9233a67783A16462K37848b9840D6136f4650l9506L7636A09730a70945B7590e8218
9221a6817C2126i3414B16731F5596Q2309c30077M9118Q7383k0981A28872l0958
9210I7914g3959L3144j02120j30685E2147M9276b37725A35546L4703a43963p7495
$$ y = [-46130, -201959, -163092, -210399, -108989, -170051, 102535, -70266, -280960, 71194, 98186, -192913, 115173, 125210, -126917, 140340, 23934, -131485, 2035, -295683, -52142, -47060, -176739, 179906, 101359, -56462, 56332, -268350, -43906, -131234, -185344, 279003, 52500, -149264, 93481, 104983, -283603, -33946, -109718, 8923, -314860, -119968, -273139, -80655, -42359, 36376, -18107, 126627, -104174, -186207, -4216, -82274, -340099, -122681, 3776, -301062, -230632, -247632, -167783, 116462, 354310, -29840, 46136, -64650, -104156, -66520, 109730, -170945, 27590, -58218, -16817, 32126, -93414, 216731, 65596, 147905, -330077, -280959, -193576, -214557, 128872, 97914, -73959, -40815, -142935, -273620, 52147, 101423, -237725, 135546, 170249, -143963, -221458]
9199b21458h6268B08072b98987A92008q602c75761J04620P1813f9050a5989j42192
9188a58181M7327n5204N7115A25948C6484g7118k47673A6670a3516A303B47J49585
9176A49832a13701B85541d15679a30826F494b28306D5394d9231l99389b5252B40835
9164a25597n6851k5637j82248A45310j6445P6219b97925g7410p0187D1801g3056
9152A23821b11100H2722K07008j21585J49195d18842e4932l136B44784A15869
9141a69869E10173A21817k6357b39677c7570e353k37924J7876f4902l79520a93709
9129a15896A37690b90507A27364a01992j90125B81219a23848k0832f4084B81386
9118C9548N1806G376a33631k19531M1049e7074j09880A90117a09907e1755I1498
$$ y = [-221458, -86268, 208072, -298987, 192008, 183406, -375761, -271141, -199328, -69050, -15989, -158181, -110854, -166058, -108943, 125948, 36484, -77118, -324791, 16670, -13516, 1303, 247, 149832, -113701, 285541, -415679, -130826, 6494, -228306, 45394, -49231, -448620, -25252, 240835, -125597, -182448, -208085, -390333, 145310, 128865, 205084, -297925, -77410, -147597, 41801, -73056, 123821, -211100, 82722, 289730, 168145, 317340, -418842, -54932, -58068, 244784, 115869, -169869, 510173, 121817, 95460, -239677, -37570, -5353, -243277, -225401, -64902, -444422, -193709, -115896, 137690, -290507, 127364, -101992, -292117, 281219, -123848, -144680, -64084, 281386, 39548, 91354, 7376, -133631, -353162, -312113, -57074, -166954, 190117, -109907, -51755, 91498]
9106b19745g9424A8467h849r362H2089k0920a74587A47878a02854j52582D00780
9094B46619J8237b60553M3586d5542B14529e6945j70011j87351b0118l80325c9140
9082A61542A8441m507P1776b6177A92279o8472i5786E2723b6896f466H4375i2661
9069A81137b16854C6551b17298E8118L56227A3475K86369a74208e6386C6692L0322
9058F7014D819c03125H6588a35109D598P9662F565J04258e6261A68146a27740
9046C00004A9879e694B06531h2158B1215b57448D8321J66864b24207E6052j7521
9035C8531L8257a59924A23105d3111o1942B23657a43488H8556b62366J08239c7621
9023a87299E9279A1978a84925P0133k20105e2229A70998h4044l82211K21846F0108
$$ y = [-219745, -79424, 18467, -8849, -18211, 82089, 61169, -174587, 147878, -102854, -255436, 400780, 246619, 264856, -260553, -216967, -45542, 214529, -56945, -226956, -414307, -20118, -400443, -39140, 161542, 18441, 13934, 85710, -26177, 192279, 123807, -95786, 52723, -26896, -6466, 84375, -92661, 181137, -216854, 36551, -217298, 58118, 414345, 13475, 299844, -174208, -56386, 36692, 67014, 4819, -303125, 86588, -135109, 4598, 84260, 6565, 110823, -56261, 168146, -127740, 300004, 19879, -5694, 206531, -82158, 21215, -257448, 48321, 215185, -224207, 56052, 38531, 76788, -159924, 123105, -43111, -105053, 223657, -143488, 88556, -262366, -154127, -37621, -187299, 59279, 11978, -184925, -114792, -334897, -52229, 170998, -84044, -466255, -244409, 60108]
9011B02119d8512k34739G6440c35086E7710K31581A38283b20733a3971E4148c9499
8999a49560L8444K6720l6371A40129g31j05053j67664a06434d7344j32807j76256
8988c56407A8715a6074l2102A84659o8064a48873C260g6051B86450b53053b3305
8976C0903m4L6130b68431D7088H380a64367d5262j52010A11183a30822J9348A24846
8963E1445J9438b11488A18593b55450p9456g6592j53943o3856k33750F1727j5960
8952D5767b06671g888l59261a60147f6089j53487j29435a41283A27773c10771
8941b25396H4610a58827a0523m2404A15684i8880j85764B84628A08310J34892
8931B43202a056A67649h8826B33888a84483G8961R6942J81807R07889J384913
$$ y = [202119, -48512, -283251, 76440, -335086, 57710, 289291, 138283, -220733, -13971, 54148, -39499, -149560, -111116, -84396, -120767, 140129, -731, -105784, -273448, -106434, -47344, -180151, -356407, 18715, -16074, -48176, 184659, 116595, -148873, 3260, -76051, 286450, -253053, -23305, 30903, 30859, 66989, -268431, 47088, 8380, -164367, -45262, -197272, 111183, -130822, -111474, 124846, 51445, 70883, -211488, 118593, -255450, -334906, -76592, -230535, -294391, -528141, 61727, 45767, -206671, -7888, -367149, -160147, -66089, -219576, -349011, -141283, 127773, -310771, -225396, 84610, -158827, -10523, -52927, 115684, -98880, -284644, 284628, 108310, 243202, -1056, 167649, -88826, 233888, -184483, 78961, 175903, 357710, 1265599, 2650512]
8921B650512P636435B359254D06049C5204J88766m4342i5382B38620a68509H5218
8910e4206B104P6816J36936m6038a38514A0303a01219C5737J24893a17408A8020
8898E8651j6480L03422o5844b02043R1884A14180b42860O4394A00721a55642C63277
8886i0690j5853j15655C8547C348a8656j07016e2779j44838q8184A21347o13i6323
8873b57257A13219g9437k480B63324h0597A04874g3533B15633a8040k4395j37186
$$ y = [2650512, 10286947, 2359254, 406049, 35204, 223970, 179628, -95382, 238620, -168509, 85218, -54206, 2104, 78920, 215856, 169818, -138514, 10303, -101219, 35737, 160630, -117408, 18020, 58651, 42171, 345593, 279749, -202043, -110159, 114180, -242860, -178466, 100721, -155642, 363277, -90690, -106543, -222198, 38547, 3348, -18656, -125672, -52779, -197617, -285801, 121347, 120734, -96323, -257257, 113219, -79437, -81917, 263324, -80597, 104874, -73533, 215633, -18040, -42435, -179621]
$$ [...]
##END NTUPLES=NMR SPECTRUM
##END=
