##TITLE=AC1639_CTIAH13372_8569384_D5LupPDOS9
##JCAMPDX= 6.0         $$ Bruker NMR JCAMP-DX V2.0
##DATA TYPE= NMR SPECTRUM
##DATA CLASS= NTUPLES
##ORIGIN= BRUKER
##OWNER= Administrator
$$ 1.72 TOPSPIN		Version 2.1
$$ 2014-04-10 21:15:36.486 -0700  Administrator@X
$$ Compression mode = diff/dup
##.OBSERVE FREQUENCY= 400.02188249412
##.OBSERVE NUCLEUS= ^1H
##.ACQUISITION MODE= SIMULTANEOUS (DQD)
##.ACQUISITION SCHEME= undefined
##.AVERAGES= 64
##.DIGITISER RES= 22
##SPECTROMETER/DATA SYSTEM= spect
##.PULSE SEQUENCE= noesygpps1d.comp
##.SOLVENT NAME= COFFEE_meoh
##.SHIFT REFERENCE= INTERNAL, COFFEE_meoh, 1, 14.96127
##AUDIT TRAIL= $$ (NUMBER, WHEN, WHO, WHERE, PROCESS, VERSION, WHAT)
$$ ##TITLE= Audit trail, TOPSPIN		Version 2.1
$$ ##JCAMPDX= 5.01
$$ ##ORIGIN= Bruker BioSpin GmbH
$$ ##OWNER= Administrator
$$ $$ E:\/data/COFFEE/nmr/AC1639_CTIAH13372_8569384_D5LupPDOS9/12/pdata/1/auditp.txt
$$ ##AUDIT TRAIL=  $$ (NUMBER, WHEN, WHO, WHERE, PROCESS, VERSION, WHAT)
(   1,<2014-04-10 21:15:30.220 -0700>,<Administrator>,<X>,<go>,<TOPSPIN 2.1>,
      <created by zg
	started at 2014-04-10 21:04:00.799 -0700,
	POWCHK enabled, PULCHK disabled,
       configuration hash MD5:
       C8 4E 4E 5D D3 5C D8 9E 9F 52 82 E0 59 8A DE 15
       data hash MD5: 64K
       59 21 4F F2 6D 0B 8D 9E 30 20 6C D0 87 3D C5 BD>)
(   2,<2014-04-10 21:15:33.564 -0700>,<Administrator>,<X>,<proc1d>,<TOPSPIN 2.1>,
      <Start of raw data processing
       efp LB = 0.3 FT_mod = 6 PKNL = 1 PHC0 = 0 PHC1 = 0 SI = 128K 
       data hash MD5: 128K
       DE E9 21 80 C4 DF 4A FA 07 07 4B 71 58 5C 39 A7>)
(   3,<2014-04-10 21:15:34.658 -0700>,<Administrator>,<X>,<proc1d>,<TOPSPIN 2.1>,
      <pk PHC0 = -80.7605 PHC1 = 0 
       data hash MD5: 128K
       4E D3 90 AA B8 24 4D B9 29 00 9B CD 52 D2 31 F9>)
(   4,<2014-04-10 21:15:35.580 -0700>,<Administrator>,<X>,<proc1d>,<TOPSPIN 2.1>,
      <abs ABSG = 1 
       data hash MD5: 128K
       F7 7B C0 7F 63 99 EF 0F 63 6D C3 79 11 4C 72 B0>)
(   5,<2014-04-10 21:15:35.720 -0700>,<Administrator>,<X>,<proc1d>,<TOPSPIN 2.1>,
      <abs ABSG = 2 
       data hash MD5: 128K
       6F 63 A5 2C 0C E4 33 F9 CD AF FF 41 C4 DE 0A 3D>)
(   6,<2014-04-10 21:15:35.924 -0700>,<Administrator>,<X>,<proc1d>,<TOPSPIN 2.1>,
      <abs ABSG = 3 
       data hash MD5: 128K
       64 31 4F 14 E7 26 25 DF 50 67 2E 6D 17 D6 B0 9A>)
(   7,<2014-04-10 21:15:36.064 -0700>,<Administrator>,<X>,<proc1d>,<TOPSPIN 2.1>,
      <abs ABSG = 4 
       data hash MD5: 128K
       C1 F2 79 00 0B F5 5A A0 DA E3 1E FD E4 73 83 93>)
(   8,<2014-04-10 21:15:36.205 -0700>,<Administrator>,<X>,<proc1d>,<TOPSPIN 2.1>,
      <abs ABSG = 5 
       data hash MD5: 128K
       54 AE 18 6C 3D 7F 7D D5 AE 03 48 D7 01 2E C9 94>)
$$ ##END=
$$ 
$$ $$ hash MD5
$$ $$ CB DD A8 C8 97 B4 94 D3 9C 75 34 EA C8 52 88 81
##$RELAX= 
##$RELAX= 
##$RELAX= 
##$RELAX= 
##$RELAX= 
##$RELAX= 
##$RELAX= 
##$RELAX= 
$$ Bruker specific parameters
$$ --------------------------
##$DU= <E:\>
##$EXPNO= 12
$$ [...]
150 150 150 150 150 150 150 150
##$TP07= 0
##$TPNAME0= <>
##$TPNAME1= <>
##$TPNAME2= <>
##$TPNAME3= <>
##$TPNAME4= <>
##$TPNAME5= <>
##$TPNAME6= <>
##$TPNAME7= <>
##$TPOAL= (0..7)
0.5 0.5 0.5 0.5 0.5 0.5 0.5 0.5
##$TPOFFS= (0..7)
0 0 0 0 0 0 0 0
##$TUNHIN= 0
##$TUNHOUT= 0
##$TUNXOUT= 0
##$USERA1= <user>
##$USERA2= <user>
##$USERA3= <user>
##$USERA4= <user>
##$USERA5= <user>
##$V9= 5
##$VALIST= <valist>
##$VCLIST= <CCCCCCCCCCCCCCC>
##$VD= 0
##$VDLIST= <DDDDDDDDDDDDDDD>
##$VPLIST= <PPPPPPPPPPPPPPP>
##$VTLIST= <TTTTTTTTTTTTTTT>
##$WBST= 1024
##$WBSW= 4
##$XGAIN= (0..3)
0 0 0 0
##$XL= 0
##$YL= 0
##$YMAX_a= 6117652
##$YMIN_a= -13431786
##$ZGOPTNS= <>
##$ZL1= 120
##$ZL2= 120
##$ZL3= 120
##$ZL4= 120
##$ABSF1= 14.96127
##$ABSF2= -5.596911
##$ABSG= 5
##$ABSL= 3
##$ALPHA= 0
##$AQORDER= 0
##$ASSFAC= 0
##$ASSFACI= 0
##$ASSFACX= 0
##$ASSWID= 0
##$AUNMP= <proc_prof1d_extract.lims>
##$AXLEFT= 0
##$AXNAME= <>
##$AXNUC= <1H>
##$AXRIGHT= 0
##$AXTYPE= 0
##$AXUNIT= <>
##$AZFE= 0.1
##$AZFW= 0.1
##$BCFW= 0
##$BC_mod= 0
##$BYTORDP= 0
##$COROFFS= 0
##$CY= 15
##$DATMOD= 1
##$DC= 0
##$DFILT= <>
##$DTYPP= 0
##$F1P= 0
##$F2P= 0
##$FCOR= 0.5
##$FTSIZE= 131072
##$FT_mod= 6
##$GAMMA= 0
##$GB= 0
##$INTBC= 1
##$INTSCL= 1
##$ISEN= 128
##$LB= 0.3
##$LEV0= 0
##$LPBIN= 0
##$MAXI= 10000
##$MC2= 0
##$MEAN= 0
##$ME_mod= 0
##$MI= 0
##$NCOEF= 0
##$NC_proc= -2
##$NLEV= 6
##$NOISF1= 0
##$NOISF2= 0
##$NSP= 0
##$NTH_PI= 0
##$NZP= 0
##$OFFSET= 14.96127
##$PC= 1
##$PHC0= -80.7605
##$PHC1= 0
##$PH_mod= 1
##$PKNL= yes
##$PPARMOD= 0
##$PPDIAG= 0
##$PPIPTYP= 0
##$PPMPNUM= 2147483647
##$PPRESOL= 1
##$PSCAL= 4
##$PSIGN= 0
##$PYNMP= <proc.py>
##$REVERSE= no
##$SF= 400.020009528897
##$SI= 131072
##$SIGF1= 0
##$SIGF2= 0
##$SINO= 400
##$SIOLD= 131072
##$SPECTYP= <>
##$SREGLST= <1H.CDCl3>
##$SSB= 0
##$STSI= 131072
##$STSR= 0
##$SW_p= 8223.68421052631
##$SYMM= 0
##$S_DEV= 0
##$TDeff= 65536
##$TDoff= 0
##$TI= <>
##$TILT= no
##$TM1= 0
##$TM2= 0
##$TOPLEV= 0
##$USERP1= <user>
##$USERP2= <user>
##$USERP3= <user>
##$USERP4= <user>
##$USERP5= <user>
##$WDW= 1
##$XDIM= 131072
##$YMAX_p= 288141527
##$YMIN_p= -11668
##$CURPLOT= <Network HP LaserJet P1505>
##$CURPRIN= <$Network HP LaserJet P1505>
##$DFORMAT= <normdp>
##$LAYOUT= <+/1D_H.xwp>
##$LFORMAT= <normlp>
##$PFORMAT= <normpl>
##$SURQMSG= 1
$$ End of Bruker specific parameters
$$ ---------------------------------
##NTUPLES= NMR SPECTRUM
##VAR_NAME=  FREQUENCY,     SPECTRUM/REAL,   SPECTRUM/IMAG
##SYMBOL=    X,             R,               I
##VAR_TYPE=  INDEPENDENT,   DEPENDENT,       DEPENDENT
##VAR_FORM=  AFFN,          ASDF,            ASDF
##VAR_DIM=   131072,        131072,          131072
##UNITS=     HZ,            ARBITRARY UNITS, ARBITRARY UNITS
##FACTOR=    0.0627417313425164, 1,          1
##FIRST=     8223.62146879497, -1861,        -62014
##LAST=      0,             742,             -62751
##MIN=       0,             -11668,          0
##MAX=       8223.62146879497, 288141527,    0
$$ Real data points
##PAGE= N=1
##DATA TABLE= (X++(R..R)), XYDATA
$$ [...]
61599C97883o92q32j686k646l177l092k496j788j509j787k037j644p69j14j7k01
61583C73396m36q33j397j713j407o60%K69K20J6k71o03q59q29l20N95J421J516
61565C68105P50j93m18K68J209J682J615J454J509J640J581J330J116J050R90
61550C83688P95O46Q65J402J689J239L37j97NM11L36j15k50J75O60P04M54L58
61532C93202N53Q50J071J067O63n3n46l87P6L0p20j418j271m13K79K21l32p29
61514C92143p13o49r38j395j326l39J139K219K343J620O00j29k63O5N58J191K122
61497C98248L080L361K743J934J636J615J327J025J331J992K072J416Q63Q24Q01
61482D24268O18R64K049K806K312J246Q21R80P93J98M0M65N44k53j260j672j565
$$ y = [397883, 397191, 396359, 394673, 392027, 388850, 385758, 383262, 381474, 379965, 378178, 376141, 374497, 373728, 373614, 373597, 373396, 372960, 372127, 370730, 369017, 367610, 366950, 366950, 367219, 367439, 367455, 367184, 366581, 365722, 364893, 364573, 365168, 366589, 368105, 368855, 368662, 368244, 368512, 369721, 371403, 373018, 374472, 375981, 377621, 379202, 380532, 381648, 382698, 383688, 384483, 385129, 385994, 387396, 389085, 390324, 390661, 390464, 390469, 390880, 391216, 391101, 390851, 391026, 391686, 392390, 392844, 393202, 393755, 394605, 395676, 396743, 397406, 397353, 396807, 396420, 396496, 396526, 395806, 394388, 393117, 392704, 392983, 393204, 392872, 392143, 391430, 390781, 389843, 388448, 387122, 386783, 387922, 390141, 392484, 394104, 394704, 394575, 394312, 394377, 394935, 396126, 398248, 401328, 404689, 407432, 409366, 411002, 412617, 413944, 414969, 416300, 418292, 420364, 421780, 422643, 423467, 424268, 424886, 425850, 427899, 430705, 433017, 434263, 435084, 436064, 436857, 437055, 437095, 437560, 438104, 437851, 436591, 434919, 433354]
61465D33354j443j394j221r23o55m41l24n20j129j811k009j448l69O20R33M69
61449D21689k62o31l97L30J388K459K999K786K377K473K884K757J886J101J155
61434D44994J799K226K049J490J015J013J512K020J959J349P23L25p1m53l17M98
61418D62131J339J522J122N98J11k61j97L50O97K27o14q08j65M90M66j04p70j241
61400D64893j259o02M64J222J257R16P86J017J305J256O32m15j203r85J49J169
61384D70602J230O98O29J340K005J812J065Q21J544K602L133L085L017L129K967
61369D99679K192J173N74O53J247K119K968L370L183K855K872L029K809K331K288
61354E33342K853L381L442L442L815M166L921L332L140L380L352K682J764J028
$$ y = [433354, 431911, 430517, 429296, 428373, 427718, 427277, 426953, 426433, 425304, 423493, 421484, 420036, 419667, 420287, 421220, 421689, 421427, 420796, 420399, 420729, 422117, 424576, 427575, 430361, 432738, 435211, 438095, 440852, 442738, 443839, 444994, 446793, 449019, 451068, 452558, 453573, 454586, 456098, 458118, 460077, 461426, 462149, 462474, 462403, 461950, 461633, 462131, 463470, 464992, 466114, 466712, 466823, 466562, 466365, 466715, 467412, 467639, 467025, 466217, 466052, 466542, 467008, 466904, 466134, 464893, 463634, 463032, 463496, 464718, 465975, 466891, 467677, 468694, 469999, 471255, 471887, 471472, 470269, 469284, 469433, 470602, 471832, 472530, 473159, 474499, 476504, 478316, 479381, 480202, 481746, 484348, 487481, 490566, 493583, 496712, 499679, 501871, 503044, 503618, 504271, 505518, 507637, 510605, 513975, 517158, 520013, 522885, 525914, 528723, 531054, 533342, 536195, 539576, 543018, 546460, 550275, 554441, 558362, 561694, 564834, 568214, 571566, 574248, 576012, 577040]
61340E77040M62P4K20R49J581J436P81M84Q56J335J363J035P62O85O93P91J114
61323E91661J661K239K675K968L260L775M657N771O714P280P787Q710R914J0591
61309F69663J0171R119Q490Q707R072Q713P695O885O673O280M638J807r71k682
61295G54260l615m723o193p176p024o255n970o518p177p126o361n465m788m138
61281F71731l282k349j630j153o64LP35J358J890K519L306M010M241L878L332
61266F87925L255L851M531M545L836L045K659K567K568K837L530M126L811K469
61252G35555R26N7n7jl46j189k118k465j831n33N32P16K57J7O51K066L551M362
61234G40150M214L455K769K705L395M571N767O633P177P728Q457R076R175Q799
$$ y = [577040, 577502, 577576, 577796, 578745, 580326, 581762, 582543, 583027, 583883, 585218, 586581, 587616, 588378, 589063, 589756, 590547, 591661, 593322, 595561, 598236, 601204, 604464, 608239, 612896, 618667, 625381, 632661, 640448, 649158, 659072, 669663, 679834, 688953, 697443, 706150, 715222, 723935, 731630, 738515, 745188, 751468, 756106, 757913, 756942, 754260, 750645, 745922, 739729, 732553, 725529, 719274, 713304, 706786, 699609, 692483, 686122, 680657, 675869, 671731, 668449, 666100, 664470, 663317, 662653, 662656, 663391, 664749, 666639, 669158, 672464, 676474, 680715, 684593, 687925, 691180, 695031, 699562, 704107, 707943, 710988, 713647, 716214, 718782, 721619, 725149, 729275, 733086, 735555, 736481, 736538, 736481, 736480, 736134, 734945, 732827, 730362, 728531, 727998, 728530, 729246, 729503, 729520, 730171, 732237, 735788, 740150, 744364, 747819, 750588, 753293, 756688, 761259, 767026, 773659, 780836, 788564, 797021, 806097, 815272, 824071]
61220H24071Q351P970P377O485N759N666O084O530O830P182P626P849P665P348
61206I22793P363P803Q343Q645Q686Q676Q851R329J0103J0951J1487J1508J1281
61193A045819J1194J1163J0666R491Q022O555M823K609L86j242k509m104n963
61180A096910p265p749q168r118j0211j0858j1160j1463j1571j1135j0385r857
61168I77970r605r357r120r031q832q205p456p150p100o496n106l686k905k499
61154H81422j782n86P16J781K618L405M175M672M588L995L348K862K214J300Q58
61139I15586J654L226M341M668N098O219P505Q469R603J1424J3349J4455J4913
61126A020510J5667J7002J8356J9401K0343K1152K1432K1312K1560K2443K3177
$$ y = [824071, 832422, 840392, 847769, 854254, 860013, 865679, 871763, 878293, 885123, 892305, 899931, 907780, 915445, 922793, 930156, 937959, 946302, 954947, 963633, 972309, 981160, 990489, 1000592, 1011543, 1023030, 1034538, 1045819, 1057013, 1068176, 1078842, 1088333, 1096355, 1102910, 1107733, 1110342, 1110728, 1109486, 1106977, 1102873, 1096910, 1089645, 1081896, 1073728, 1064610, 1054399, 1043541, 1032381, 1020918, 1009347, 998212, 987827, 977970, 968365, 959008, 949888, 940857, 932025, 923820, 916364, 909214, 902114, 895618, 890512, 886826, 883921, 881422, 879640, 879054, 879770, 881551, 884169, 887574, 891749, 896421, 901009, 905004, 908352, 911214, 913428, 914728, 915586, 917240, 920466, 924807, 929475, 934573, 940792, 948297, 956766, 966369, 977793, 991142, 1005597, 1020510, 1036177, 1053179, 1071535, 1090936, 1111279, 1132431, 1153863, 1175175, 1196735, 1219178, 1242355]
61115A242355K2972K1954K0641J9080J7190J5459J4465J3871J2633J0299P401
61104A418320M531J692j281m251p125j0143j3331j6111j7969j9280k0869k2809
61092A291374k4279k4687k4395k4117k3976k3531k2529k1296k0390j9995j9666
61081A042513j8697j6902j4928j3586j2862j1970j0411q658p462o857o174m928
61069I09078l321j927j121q37p13l99K20J108K248L526M624N342O006P116Q565
61054I39515R715J0420J1305J2793J4425J5642J6643J7861J9091J9928K0602K1537
61042A129477K2366K2375K1886K2163K3747K5730K7099K7997K9180L0784L2239
61031A415043L3169L3929L5281L7638M0560M3221M5609M9014N4700O2314P0381
$$ y = [1242355, 1265327, 1287281, 1307922, 1327002, 1344192, 1359651, 1374116, 1387987, 1400620, 1410919, 1418320, 1422851, 1424543, 1423262, 1419011, 1411886, 1401743, 1388412, 1372301, 1354332, 1335052, 1314183, 1291374, 1267095, 1242408, 1218013, 1193896, 1169920, 1146389, 1123860, 1102564, 1082174, 1062179, 1042513, 1023816, 1006914, 991986, 978400, 965538, 953568, 943157, 934499, 927037, 920180, 914006, 909078, 905757, 903830, 902709, 901872, 901159, 900760, 900980, 902088, 904336, 907862, 912486, 917828, 923834, 930950, 939515, 949230, 959650, 970955, 983748, 998173, 1013815, 1030458, 1048319, 1067410, 1087338, 1107940, 1129477, 1151843, 1174218, 1196104, 1218267, 1242014, 1267744, 1294843, 1322840, 1352020, 1382804, 1415043, 1448212, 1482141, 1517422, 1555060, 1595620, 1638841, 1684450, 1733464, 1788164, 1850478, 1920859]
61020A920859P8402Q7646R9642J14808J32885J53882J78034K05446K36369K71195
61010C479168L09702L50917L94339M40779M91410N46741O07129O73215P44110
61001H037510Q15175Q78979R29078R62615R80085R84793R83393R84730R94451
60992A6550809J008150J009163R73648Q79889P16936M90011K22008n0206k86155
60983B1514253m56397n53999n95735o12915o38456o96585p96733r30952j076041
60974A5156440j201541j281088j301254j263653j180813j069512r45361q20330
60966F092888p02474n96360n03609m24069l57206l02353k57869k21088j89800
60957B538060j63419j42081j25240j11687j00517r1211q3068p5442o8398o2354
$$ y = [1920859, 1999261, 2086907, 2186549, 2301357, 2434242, 2588124, 2766158, 2971604, 3207973, 3479168, 3788870, 4139787, 4534126, 4974905, 5466315, 6013056, 6620185, 7293400, 8037510, 8852685, 9731664, 10660742, 11623357, 12603442, 13588235, 14571628, 15556358, 16550809, 17558959, 18568122, 19541770, 20421659, 21138595, 21628606, 21850614, 21800408, 21514253, 21057856, 20503857, 19908122, 19295207, 18656751, 17960166, 17163433, 16232481, 15156440, 13954899, 12673811, 11372557, 10108904, 8928091, 7858579, 6913218, 6092888, 5390414, 4794054, 4290445, 3866376, 3509170, 3206817, 2948948, 2727860, 2538060, 2374641, 2232560, 2107320, 1995633, 1895116, 1803905, 1720837, 1645395, 1576997, 1514643]
60947A514643n7169n2278m7690m4031m1532l9688l8028l6578l5435l4452l3425
60936A054337l2116l0119k7333k4504k2607k1616k0592j9063j7465j6155j4809
60925H07958j3193j1682j0561r523q288p162o477o009n454m981m807m739m527
60912G10555m317m272m193l966l846l911l737l177k843l200l682l526l046l139
60898F59700l797m139l898l841m460n231n457n194m817m361l809l556l878m248
60884E99014l859k826k185k575l380l554k964k410k475k851k948k692k405k208
60870E59682j941j548j091m46N28J465J647R03Nj25O29J541J842J395P94Q18J565
60853E67663K186J787N48n24r72j311j936k379k170j783k016k817l516l893m298
$$ y = [1514643, 1457474, 1405196, 1357506, 1313475, 1271943, 1232255, 1194227, 1157649, 1122214, 1087762, 1054337, 1022221, 992102, 964769, 940265, 917658, 896042, 875450, 856387, 838922, 822767, 807958, 794765, 783083, 772522, 762999, 754711, 747549, 741072, 735063, 729609, 724628, 719821, 715082, 710555, 706238, 701966, 697773, 693807, 689961, 686050, 682313, 679136, 676293, 673093, 669411, 665885, 662839, 659700, 655903, 651764, 647866, 644025, 639565, 634334, 628877, 623683, 618866, 614505, 610696, 607140, 603262, 599014, 595155, 592329, 590144, 587569, 584189, 580635, 577671, 575261, 572786, 569935, 566987, 564295, 561890, 559682, 557741, 556193, 555102, 554656, 555184, 556649, 558296, 559199, 559204, 559079, 559708, 561249, 563091, 564486, 565280, 566098, 567663, 569849, 571636, 572184, 571660, 570688, 569377, 567441, 565062, 562892, 561109, 559093, 556276, 552760, 548867, 544569]
60838E44569m840n207n323n502n812n930n737n560n564n398m749l887l281k943
60824D74836k496j813j234j122j393j662j717j734j907k030j695q96j76m6m83
60809D54432j073j463j495j195q24p77j176j714k050k130k003j599q92k4Q75J670
60793D38562J915J120l52j268r40j56r1p27j157j015p22n17k31Pj88n86m55K28
60775D33427N74J22m20l01J96L55K06L52R95J742K227K408K359K161J892J530
60759D49825R39J65m94q23q81p12k46L56O41M79L32N82Q45M22p70k053k652k286
60741D43669j250k01K99K32ok88r20j984k922l195k969k752k624k294j675r40
60725D20180j85M90P37K69n98j215j289r96n18M8L94K26j68q4O54J354J238K72
$$ y = [544569, 539729, 534522, 529199, 523697, 517885, 511955, 506218, 500658, 495094, 489696, 484947, 481060, 477779, 474836, 472340, 470527, 469293, 468171, 466778, 465116, 463399, 461665, 459758, 457728, 456033, 455137, 454961, 454915, 454432, 453359, 451896, 450401, 449206, 448382, 447605, 446429, 444715, 442665, 440535, 438532, 436933, 436041, 436017, 436892, 438562, 440477, 441597, 441245, 439977, 439037, 438881, 438790, 438063, 436906, 435891, 435169, 434652, 434421, 434428, 434240, 433654, 433199, 433427, 434001, 434123, 433703, 433402, 433598, 433953, 434159, 434511, 435506, 437248, 439475, 441883, 444242, 446403, 448295, 449825, 450764, 450929, 450435, 449612, 448731, 448019, 447773, 448129, 448770, 449249, 449581, 450163, 451008, 451430, 450660, 448607, 445955, 443669, 442419, 442218, 442517, 442749, 442743, 442455, 441535, 439551, 436629, 433434, 430465, 427713, 425089, 422795, 421120, 420180, 419995, 420485, 421222, 421491, 420893, 419678, 418389, 417393, 416875, 416923, 417317, 417543, 417375, 417291, 417945, 419299, 420537, 420809]
60707D20809r26j716j807j342p92o12p77q48n36o3J67M8j77j86J37N86P57N16
60689D13238K51M41R37J116Q28Q10J758L238L988L348J996J172J359J994K336
60674D38810K321K379K668K780K296J323L45k63m15k22rk38j058j975k300j966
60658D44476j538j412j389j136o73j32N79J500K213K170J391N25J08P0K0j87l69
60641D46216l30j46j02m52j175j920k240j998j505j176j032o95J6O61N69l35j292
60624D33064j471p66K15R01J235J470J680J626J110L34j80p9M17Q17R51J085J363
60607D43772J495J139M06l15q52j220j222n85M69J229J265R63J006J487J805J413
60591D52255N40N4N90J787K560K296J637J741K828L862L855L047K437K473K683
$$ y = [420809, 419883, 418167, 416360, 415018, 414226, 413614, 412837, 411989, 411453, 411390, 411557, 411605, 411428, 411242, 411379, 411965, 412722, 413238, 413489, 413930, 414867, 415983, 416811, 417621, 419379, 422617, 426605, 429953, 431949, 433121, 434480, 436474, 438810, 441131, 443510, 446178, 448958, 451254, 452577, 452922, 452659, 452244, 452022, 452013, 451775, 450717, 448742, 446442, 444476, 442938, 441526, 440137, 439001, 438328, 438196, 438775, 440275, 442488, 444658, 446049, 446574, 446682, 446752, 446772, 446585, 446216, 445886, 445740, 445638, 445186, 444011, 442091, 439851, 437853, 436348, 435172, 434140, 433445, 433461, 434122, 434691, 434356, 433064, 431593, 430827, 431042, 431943, 433178, 434648, 436328, 437954, 439064, 439398, 439218, 439139, 439556, 440373, 441324, 442409, 443772, 445267, 446406, 446812, 446497, 445645, 444425, 443203, 442618, 443087, 444316, 445581, 446544, 447550, 449037, 450842, 452255, 452795, 452849, 453439, 455226, 457786, 460082, 461719, 463460, 466288, 470150, 474005, 477052, 479489, 481962, 484645]
60576D84645K549K299K579L621M876N514N235M573M413N078O009O401O063N468
60562E49323N088M917M751M560M444M361M108L564K801K008J376R84P29M40J83
60547E93637L58J295K794M296N490O498P465Q253Q737R067R364R506R546J0056
60533F86362J1391J2752J2732J1031Q919P688P159O227M382K028l68k677m688
60520G62938o010o545o609o437o015n433m894m244k997j040J144L182N235P436
60506G29711R433J0972J2512J4635J7151J9386K1214K3113K5235K7084K8311K9240
60494I67997L0303L1381L2007L1948L1153K9417K6499K2556J8125J3598Q966M098
60482A248048r46o010j1047j6036k0864k5472l0046l4726l9019m1935m2912m2429
$$ y = [484645, 487194, 489493, 492072, 495693, 500569, 506083, 511318, 515891, 520304, 525382, 531391, 537792, 543855, 549323, 554411, 559328, 564079, 568639, 573083, 577444, 581552, 585116, 587917, 589925, 591301, 592285, 593014, 593454, 593637, 593995, 595290, 598084, 602380, 607870, 614368, 621833, 630086, 638823, 647890, 657254, 666760, 676306, 686362, 697753, 710505, 723237, 734268, 743187, 750875, 758034, 764261, 768643, 770671, 770303, 767626, 762938, 756928, 750383, 743774, 737337, 731322, 725889, 720995, 716751, 713754, 712714, 713858, 717040, 722275, 729711, 739144, 750116, 762628, 777263, 794414, 813800, 835014, 858127, 883362, 910446, 938757, 967997, 998300, 1029681, 1061688, 1093636, 1124789, 1154206, 1180705, 1203261, 1221386, 1234984, 1243950, 1248048, 1247102, 1241092, 1230045, 1214009, 1193145, 1167673, 1137627, 1102901, 1063882, 1021947, 979035, 936606]
60470I36606m1367l9999l8009l5381l2590k9801k6554k2731j9275j7257j6459
60459F17183j5559j3758j1593j0005r193q671p979o978n700m330l218k618k422
60446E15159k342k218k056j891j823j991k281k285j811j258j066r59k98P83J287
60431D94950O69l31p11n73p84j453j664q75K00N83L05J15L07N18O11Q96J461J808
60413D96032J554R83O42O74R25J363K007K601K765K515K201K027J865J589J327
60398E21070J323J659K202K682K874K816K804L051L419L604L549L417L300L175
60384E60945L063L033L023K930K819K791K695K326J833J639J847K092K117K118
60370E95271K315K558K617K588K705K940L090L111L131L227L475M007M793N397
$$ y = [936606, 895239, 855240, 817231, 781850, 749260, 719459, 692905, 670174, 650899, 633642, 617183, 601624, 587866, 576273, 566268, 557075, 548404, 540425, 533447, 527747, 523417, 520199, 517581, 515159, 512817, 510599, 508543, 506652, 504829, 502838, 500557, 498272, 496461, 495203, 494137, 493178, 492880, 493663, 494950, 495619, 495288, 494577, 494004, 493220, 491767, 490103, 489228, 489428, 490011, 490316, 490431, 490738, 491256, 491867, 492763, 494224, 496032, 497586, 498569, 499211, 499885, 500810, 502173, 504180, 506781, 509546, 512061, 514262, 516289, 518154, 519743, 521070, 522393, 524052, 526254, 528936, 531810, 534626, 537430, 540481, 543900, 547504, 551053, 554470, 557770, 560945, 564008, 567041, 570064, 572994, 575813, 578604, 581299, 583625, 585458, 587097, 588944, 591036, 593153, 595271, 597586, 600144, 602761, 605349, 608054, 610994, 614084, 617195, 620326, 623553, 627028, 631035, 635828, 641225]
60356F41225N314M561L739L468L907M735N382N391M736L827L030K243J145k43
60342F92460j533k518l411m490n647o475o732o598o521o714o810o229m942l622
60328F20218k823k323j679j103j148j653j672p04O89J818K745L809M778N180N186
60313F31318N463O250P183P952Q545Q799Q329P202O123N656N597N322M514L281
60299G21534J932R33O55P85K88j541m110o149p132p628q257q955r378r487r359
60284F54131q873q012p207o886o825o452n693n096n013n112m840m086l163k368
60270E74505j869j785k121k665l146l435l440k919j729k96N21K86m32n57L72J717
60254E53007K416K035J155O99R46J305J081M11J37P66J718J953J177J92q7L58
$$ y = [641225, 646539, 651100, 654839, 658307, 662214, 666949, 672331, 677722, 682458, 686285, 689315, 691558, 692703, 692460, 690927, 688409, 684998, 680508, 674861, 668386, 661654, 655056, 648535, 641821, 635011, 628782, 623840, 620218, 617395, 615072, 613393, 612290, 611142, 609489, 607817, 607113, 607802, 609620, 612365, 616174, 620952, 626132, 631318, 636781, 643031, 650214, 658166, 666711, 675510, 683839, 691041, 697164, 702820, 708417, 713739, 718253, 721534, 723466, 724399, 725054, 725839, 726127, 724586, 720476, 714327, 707195, 699567, 691310, 682355, 672977, 663490, 654131, 645258, 637246, 630039, 623153, 616328, 609876, 604183, 599087, 594074, 588962, 584122, 580036, 576873, 574505, 572636, 570851, 568730, 566065, 562919, 559484, 556044, 553125, 551396, 551100, 551621, 551907, 551475, 550918, 551290, 553007, 555423, 557458, 558613, 559312, 560258, 561563, 562644, 563055, 563192, 563958, 565676, 567629, 568806, 568998, 568911, 569269]
60238E69269Q05P61M36L35O75J356K225L144L922M420M735N079N519N973O445
60223F15099O966P291O996O176N678O299P795R125R645R689R735R606Q876P840
60209G26816P424Q043R038R471R121Q401P598O570N168L596K239J313P04O8q98
60194H04672k133l161l548l409l290l556m184n082o266p487q075p504o057m634
60180G36286l958m120m743n293n315m675l664k664j806j088p15q97j405j731j749
60165F92463j758j811j545r04m52n47o41q0P43P81j00p12L1J747L073L221K665
60148F96174K349K669L240L506L335L014K810K745K806L133L806M593N210N681
60134G45071O186O601O597O171N716N454N153M575L892L444L284L201K963K391
$$ y = [569269, 570074, 570835, 571271, 571606, 572281, 573637, 575862, 579006, 582928, 587348, 592083, 597162, 602681, 608654, 615099, 622065, 629356, 636352, 642528, 648206, 654505, 662300, 671425, 681070, 690759, 700494, 710100, 718976, 726816, 734240, 742283, 751321, 760792, 769913, 778314, 785912, 792482, 797650, 801246, 803485, 804798, 805502, 805570, 804672, 802539, 799378, 795830, 792421, 789131, 785575, 781391, 776309, 770043, 762556, 754481, 746977, 740920, 736286, 732328, 728208, 723465, 718172, 712857, 708182, 704518, 701854, 700048, 698960, 698245, 697348, 695943, 694212, 692463, 690705, 688894, 687349, 686445, 685993, 685446, 684805, 684725, 685468, 686249, 686149, 685437, 685468, 687215, 690288, 693509, 696174, 698523, 701192, 704432, 707938, 711273, 714287, 717097, 719842, 722648, 725781, 729587, 734180, 739390, 745071, 751257, 757858, 764455, 770626, 776342, 781796, 786949, 791524, 795416, 798860, 802144, 805345, 808308, 810699]
60120H10699J515Q09R74K062L167L335K646J904J448Q64r5j014j465j749k510
60105H22590l870n272o088o101n535m875m547m551m440l860l100k817l263l988
60091G60283m377m205l573k642j684j208j611k692l754m306m446m473m424m246
60077G12642m114m204m267l914l358l381m266n255n492n188n233n801n985n052
60063F47132l463k195j514r48k60K00K20K15O75J452J958J972J889K197L009M055
60047F56594M924N281N063M605M353M346M172L512K602J938J694J598J299O23
60033G02604m37j723k950l994n093o473p819q481q330p998q022q197q044p677
60019F17366p649q034q168p471o126m817l976l480k973k241j391p82p60j311j953
$$ y = [810699, 812214, 813023, 813997, 816059, 819226, 822561, 825207, 827111, 828559, 829423, 829328, 828314, 826849, 825100, 822590, 818720, 813448, 807360, 801259, 795724, 790849, 786302, 781751, 777311, 773451, 770351, 767534, 764271, 760283, 755906, 751701, 748128, 745486, 743802, 742594, 740983, 738291, 734537, 730231, 725785, 721312, 716888, 712642, 708528, 704324, 700057, 696143, 692785, 689404, 685138, 679883, 674391, 669203, 663970, 658169, 652184, 647132, 643669, 641474, 639960, 639012, 638752, 638952, 639172, 639387, 640062, 641514, 643472, 645444, 647333, 649530, 652539, 656594, 661518, 666799, 671862, 676467, 680820, 685166, 689338, 692850, 695452, 697390, 699084, 700682, 701981, 702604, 702167, 700444, 697494, 693500, 688407, 681934, 674115, 665634, 657304, 649306, 641284, 633087, 625043, 617366, 609717, 601683, 593515, 586044, 579918, 575101, 571125, 567645, 564672, 562431, 561040, 560258, 559498, 558187, 556234]
60004E56234k064j322J18J775L052L422K747J518O31N69R30R66O04N85J416K571
59988E73752L106K790K201J789J434R54N01K32l6n02j044j523k034k630l043l109
59972E72838l101l274l345k928k222j750j494r76j46M13L88K75O84J531K276K656
59956E61825K852L049L176L049K590J930J328R60P48M86J24j55k11j07j5k3r1
59939E81515q7Q7L96P44J145J665K117K202J972J855J932J734J097O53Q72J130
59923F01029O56n2J06R27J024j8q88m95N63J191J373J622J757J356Q46R76J538
59906F13511J740J588J824K510K821K333J653J411J418J194Q19Q06J432K439L210
59891F40709L249K739K506L087L965M179L588K985L023L584M211M590M500L799
$$ y = [556234, 554170, 552848, 552966, 554741, 557793, 561215, 563962, 565480, 566111, 566680, 567610, 568576, 569180, 569765, 571181, 573752, 576858, 579648, 581849, 583638, 585072, 586026, 586527, 586759, 586723, 586221, 585177, 583654, 581620, 578990, 575947, 572838, 569737, 566463, 563118, 560190, 557968, 556218, 554724, 553748, 553602, 554015, 554403, 554678, 555362, 556893, 559169, 561825, 564677, 567726, 570902, 573951, 576541, 578471, 579799, 580759, 581507, 581993, 582117, 581962, 581751, 581644, 581629, 581606, 581515, 581428, 581515, 581911, 582655, 583800, 585465, 587582, 589784, 591756, 593611, 595543, 597277, 598374, 599027, 599899, 601029, 601685, 601633, 601739, 602666, 603690, 603672, 602784, 602289, 602852, 604043, 605416, 607038, 608795, 610151, 610997, 611973, 613511, 615251, 616839, 618663, 621173, 623994, 626327, 627980, 629391, 630809, 632003, 632822, 633628, 635060, 637499, 640709, 643958, 646697, 649203, 652290, 656255, 660434, 664022, 667007, 670030, 673614, 677825, 682415, 686915, 690714]
59877F90714K757J969J806K190K833L313L076J909M46l38k68l4j79n93j077j666
59861G06858k168k071j266k96L76Q62J364J820K313L227M577N756O310O436O343
59846G40441N791M779L995L976M289M276M074M114M071L205J586N4r36j617k082
59831G80016k026j532j307j852k858l775m494n161n739o062o123o010n704n146
59817G22227m415l758l389l229k871k045j246j410k692l930l928k945k251k314
59803F81804k332j690r79j131k062k801k700j981j293j132j597k422l189l721
59789F52774m127m411m277l533k523j831j588j387q91l26k16o97j269j258m74
59774F23966O64J680K494L200L662L700L592L929M800N523N426M711M236M595
$$ y = [690714, 693471, 695440, 697246, 699436, 702269, 705582, 708658, 710567, 711013, 710675, 710407, 710373, 710194, 709601, 708524, 706858, 704690, 702619, 701353, 701057, 701433, 702295, 703659, 705479, 707792, 711019, 715596, 721352, 727662, 734098, 740441, 746232, 751011, 755006, 758982, 763271, 767547, 771621, 775735, 779806, 783011, 784597, 784651, 783715, 782098, 780016, 777990, 776458, 775151, 773299, 770441, 766666, 762172, 757011, 751272, 745210, 739087, 733077, 727373, 722227, 717812, 714054, 710665, 707436, 704565, 702520, 701274, 699864, 697172, 693242, 689314, 686369, 684118, 681804, 679472, 677782, 676803, 675672, 673610, 670809, 668109, 666128, 664835, 663703, 662106, 659684, 656495, 652774, 648647, 644236, 639959, 636426, 633903, 632072, 630484, 629097, 628206, 627880, 627664, 626967, 625698, 624440, 623966, 624630, 626310, 628804, 632004, 635666, 639366, 642958, 646887, 651687, 657210, 662636, 667347, 671583, 676178]
59760F76178N641O782P450P410O870O379O340O596O658O328N917N722N550N007
59746G64828M167L632L850M518M810M171K776J290L16j4n4k54p02j065j118j152
59730G89999j572k118j949p24P97J508J154M68K14N29J078J527J688J512J113
59715G95224P51O97J098J880K681L051K904K691K905L464L813L673L409L506L954
59700H35701M320M331M141L992L822L345K529J714J163O44k38j402k345k844l209
59685H55664l660l940l840l697l976m581n052n250n456n882o421o816o745o001
59671G84347m903m265m472m815m311k962j617o93J57J186K049K406K327K001J600
59656G68035J523K060K638K228Q55j27K36J193J393N82n38j629k907m253n137
$$ y = [676178, 681819, 688601, 696051, 703461, 710331, 716710, 723050, 729646, 736304, 742632, 748549, 754271, 759821, 764828, 768995, 772627, 776477, 780995, 785805, 789976, 792752, 794042, 794358, 794344, 794290, 794036, 793334, 792269, 791151, 789999, 788427, 786309, 784360, 783636, 784433, 785941, 787095, 787563, 787777, 788306, 789384, 790911, 792599, 794111, 795224, 795975, 796672, 797770, 799650, 802331, 805382, 808286, 810977, 813882, 817346, 821159, 824832, 828241, 831747, 835701, 840021, 844352, 848493, 852485, 856307, 859652, 862181, 863895, 865058, 865702, 865464, 864062, 861717, 858873, 855664, 852004, 848064, 844224, 840527, 836551, 831970, 826918, 821668, 816212, 810330, 803909, 797093, 790348, 784347, 779444, 775179, 770707, 765892, 761581, 758619, 757002, 756309, 756466, 757652, 759701, 762107, 764434, 766435, 768035, 769558, 771618, 774256, 776484, 777339, 777212, 777448, 778641, 780034, 780616, 780078, 778449, 775542, 771289, 766152]
59641G66152n477n941p079q604r702r813r051q044p315o747n829m594l863m237
59627F69856n254o020o303o480o633o475n997n495m961m078k908j966j496j170
59613F04620p03k48%J89N22R54J333J581J623J412J106R27P90M48J5n9M12J111
59595F16033J681J915J477J40j467k050j160M3R1j010j986k025j568j420j727
59580F06967k084k195k096j957j896j911j848j537j005n11l16m46o97p62m52J87
59564E87441Q85J344J414J181R21R55J354J772J764J351J060J326K039K782L319
59549F10908L661L892M163M675N431O095O414O632P190P990Q340P736O536N710
59535F95373O021P371Q784R047P574M814J753q61k741l755l798l088k231j743
$$ y = [766152, 760675, 754734, 747655, 739051, 729349, 719536, 710485, 702441, 695126, 688379, 682550, 677956, 674093, 669856, 664602, 658582, 652279, 645799, 639166, 632691, 626694, 621199, 616238, 612160, 609252, 607286, 605790, 604620, 603917, 603669, 603669, 603858, 604380, 605334, 606667, 608248, 609871, 611283, 612389, 613316, 614106, 614554, 614569, 614510, 614922, 616033, 617714, 619629, 621106, 621246, 619779, 617729, 616569, 616612, 616703, 615693, 613707, 611682, 610114, 608694, 606967, 604883, 602688, 600592, 598635, 596739, 594828, 592980, 591443, 590438, 589927, 589611, 589165, 588468, 587706, 587254, 587441, 588326, 589670, 591084, 592265, 593186, 594141, 595495, 597267, 599031, 600382, 601442, 602768, 604807, 607589, 610908, 614569, 618461, 622624, 627299, 632730, 638825, 645239, 651871, 659061, 667051, 675391, 683127, 689663, 695373, 701394, 708765, 717549, 726596, 734170, 738984, 740737, 739876, 737135, 733380, 729582, 726494, 724263, 722520]
59521G22520j646j693j839k263l024l910m635n090n339n498n653n859o164o605
59507F63302p097p372p102o173m839l614k974l018l295l057j925l20R44J525J745
59492F16730J894J818J422J185J689K791L792M307M547M709M684M514M499M620
59478F63201M377L647L130L394L885L657K832K438K822L174K835K304K374K952
59464G07022L300L133K832K806L179L902M722N169M988M507M165L939L678L735
59450G61077M541N622N796M604K845J528Q07K44m62j395k563l691m199l858l214
59435G67682k887k731k109q10Q08K428M081N799P351Q377Q695Q569Q762R983J1968
59420H35966J3469J3627J3059J3054J3858J4506J4228J3292J2311J1433J0520
$$ y = [722520, 720874, 719181, 717342, 715079, 712055, 708145, 703510, 698420, 693081, 687583, 681930, 676071, 669907, 663302, 656205, 648833, 641731, 635558, 630719, 627105, 624131, 621113, 617818, 614761, 612836, 612516, 613460, 614985, 616730, 618624, 620442, 621864, 623049, 624738, 627529, 631321, 635628, 640175, 644884, 649568, 654082, 658581, 663201, 667578, 671225, 674355, 677749, 681634, 685291, 688123, 690561, 693383, 696557, 699392, 701696, 704070, 707022, 710322, 713455, 716287, 719093, 722272, 726174, 730896, 736065, 741053, 745560, 749725, 753664, 757342, 761077, 765618, 771240, 777036, 781640, 784485, 786013, 786820, 787064, 786602, 785207, 782644, 778953, 774754, 770896, 767682, 764795, 762064, 759955, 759145, 759953, 762381, 766462, 772261, 779612, 787989, 796684, 805253, 814015, 823998, 835966, 849435, 863062, 876121, 889175, 903033, 917539, 931767, 945059, 957370, 968803, 979323]
59409I79323R518Q296O496L897O58k894o383r187j0702j1021j0793j0238q926
59396I38044o950n575n921p547r118j0147j1223j2653j3825j4041j3280j1880
59384H15884j0070q013n925l977k301j118m56P6Q29J530J741J714K091K771K945
59369G97721K431K117K647L554M180M726N674O765P379P571P992Q917J0006J0853
59355H82533J1277J1234J0903J0691J0751J0758J0568J0619J1168J1546J0938
59344A002986R548Q173O893N179L141J516L66j232l789o654r019j0861j2434j3595
59330I80218j4149j4350j4497j4519j4392j4443j4773j4880j4348j3392j2280
59319H24195j0796q850p146o436o485o430o016n658n486n090m207l021j710k66
$$ y = [979323, 988841, 997137, 1003633, 1007530, 1008188, 1005294, 998911, 989724, 979022, 968001, 957208, 946970, 938044, 931094, 925519, 919598, 912051, 902933, 892786, 881563, 868910, 855085, 841044, 827764, 815884, 805814, 797801, 791876, 787899, 785598, 784480, 784024, 784100, 784929, 786459, 788200, 789914, 792005, 794776, 797721, 800152, 802269, 804916, 808470, 812650, 817376, 823050, 829815, 837194, 844765, 852757, 861674, 871680, 882533, 893810, 905044, 915947, 926638, 937389, 948147, 958715, 969334, 980502, 992048, 1002986, 1012534, 1020707, 1027600, 1032779, 1035920, 1037436, 1037802, 1036570, 1032781, 1026127, 1017108, 1006247, 993813, 980218, 966069, 951719, 937222, 922703, 908311, 893868, 879095, 864215, 849867, 836475, 824195, 813399, 804549, 797403, 790967, 784482, 778052, 772036, 766378, 760892, 755802, 751595, 748574, 746864, 746598]
59305G46598J078J831J873J746K089K982L936M376M097L440L041L246L857M512
59291G88702N052N294M777L174Q80j246k600l093k837j955o03J118L192N371P086
59276H12312P974Q320Q634R101R742J0657J1570J1608J0318Q568P552P130O119
59263I29605M150K129P20n26k146l819n029n853o512o784o460n896n506n209m847
59248H78017m685m869m853m046k740j749j443j628k161k961l572l449k716k130
59234H35015k203k749l312l648l753l803m080m721n508o144o618p111p604p864
59220G65897p710p137o336n762n831o245o024m677l069k456k843l005k170r03
59206G01729j53l0J5K78N85P62Q92J015R83O97L73L74P53J078R46N74N81J089
$$ y = [746598, 747676, 749507, 751380, 753126, 755215, 758197, 762133, 766509, 770606, 774046, 777087, 780333, 784190, 788702, 793754, 799048, 803825, 806999, 807879, 806633, 804033, 800940, 798103, 796148, 795545, 796663, 799855, 805226, 812312, 820286, 828606, 837240, 846341, 856083, 866740, 878310, 889918, 900236, 908804, 916356, 923486, 929605, 933755, 935884, 936604, 936078, 933932, 930113, 925084, 919231, 912719, 905935, 899475, 893579, 888073, 882864, 878017, 873332, 868463, 863610, 859564, 856824, 855075, 853632, 852004, 849843, 846882, 843310, 839861, 837145, 835015, 832812, 830063, 826751, 823103, 819350, 815547, 811467, 806746, 801238, 795094, 788476, 781365, 773761, 765897, 758187, 751050, 744714, 738952, 733121, 726876, 720852, 716175, 713106, 710650, 707807, 704802, 702632, 701729, 701576, 701546, 701561, 701839, 702424, 703186, 704078, 705093, 706076, 706773, 707146, 707520, 708273, 709351, 710297, 710871, 711452, 712541]
59188G12541J449J133N78O69J586K654L196L077K419J389M03N7N07J228J604J533
59172G36023J275R63O12L95N39R39J158R16M82L97P52R88N37m84j517k367l330
59155G38278m427n125n143n032n453o232o733o815o811o771o460n936n487n012
59141F56841m248l513l418l766l664k910k306k268k072j081J91J006J617K640
59127F33049L804M375M447M797N587O220O471O891P867R110J0182J0895J1048
59114G24743J0407R217Q144P482O947O417O248O522O595N849M414K779J186j84
59100H06766r05p91l77l42o99j069j489k262l157l498l183k921l253l807l891
59085G75122l442l094l394m259n104n411n213m995n093n314n315n155n129n147
$$ y = [712541, 713990, 715123, 715701, 716370, 717956, 720610, 723806, 726883, 729302, 730691, 731094, 731151, 731658, 732886, 734490, 736023, 737298, 738261, 738873, 739268, 739807, 740746, 741904, 742820, 743302, 743699, 744451, 745439, 745976, 745492, 743975, 741608, 738278, 733851, 728726, 723583, 718551, 713098, 706866, 700133, 693318, 686507, 679736, 673276, 667340, 661853, 656841, 652593, 649080, 645662, 641896, 638232, 635322, 633016, 630748, 628676, 627595, 627786, 628792, 630409, 633049, 636853, 641228, 645675, 650472, 656059, 662279, 668750, 675641, 683508, 692618, 702800, 713695, 724743, 735150, 744367, 752511, 759993, 766940, 773357, 779605, 786127, 792722, 798571, 802985, 805764, 806950, 806766, 805861, 805070, 804693, 804351, 803652, 802583, 801094, 798832, 795675, 792177, 788994, 786073, 782820, 779013, 775122, 771680, 768586, 765192, 760933, 755829, 750418, 745205, 740210, 735117, 729803, 724488, 719333, 714204, 709057]
59071G09057m826m195l799l879l928l441k705k405k728l245l542l531l233k648
59057F60952j876j092m73k76p47j664k222j847r30l31k60k65k31n85j360j775
59041F45018j211m3R54J583K098K516K678K793L262L969M299L972L472L432L951
59026F82743M669N293N883O614P408P825P472O572N848N646N456M639L409K572
59012G62049K340J981Q36p93j982k143j358rJ500K778L532L755L763L914M293
58997G84456M663M796M745M679M554M209L835L915M408M508L620K293J581J706
58983H37968K074K435L142M182M931N262N949P411Q776R066Q676Q730R339R571
58969I27512R033Q416Q232Q009P173N996N123M571L789K441O80j210l018m578
$$ y = [709057, 704231, 700036, 696237, 692358, 688430, 684989, 682284, 679879, 677151, 673906, 670364, 666833, 663600, 660952, 659076, 657984, 657511, 657235, 656488, 654824, 652602, 650755, 649825, 649494, 649234, 648969, 648738, 648153, 646793, 645018, 643807, 643764, 644718, 646301, 648399, 650915, 653593, 656386, 659648, 663617, 667916, 671888, 675360, 678792, 682743, 687412, 692705, 698588, 705202, 712610, 720435, 727907, 734479, 740327, 745973, 751429, 756068, 759477, 762049, 764389, 766370, 767206, 766413, 764431, 762288, 760930, 760921, 762421, 765199, 768731, 772486, 776249, 780163, 784456, 789119, 793915, 798660, 803339, 807893, 812102, 815937, 819852, 824260, 828768, 832388, 834681, 836262, 837968, 840042, 842477, 845619, 849801, 854732, 859994, 865943, 873354, 882130, 891196, 899872, 908602, 917941, 927512, 936545, 944961, 953193, 961202, 968375, 974371, 979494, 984065, 987854, 990295, 990975, 989765, 986747, 982169]
58955I82169n839o964q121r255j0239j1122j1990j2662j2775j2191j1176j0126
58943H59709r270q607p997p253o232m925l505k324j620j215o17L09R16M40r47
58928H06862k154k415k029j653j336p11J61P65Q09M95J24j24p3M14J219K219L608
58911H06181N517P357Q175P867P395P552Q058Q337Q580R405J0785J2045J2871
58898I20125J3628J4603J5456J5665J5145J4251J3389J2823J2614J2638J2696
58887A073033J2724J2707J2472J1687J0177Q121N965M138K760J496j31k157m106
58874A148886n674p123q658r784r906r369r144r504r827r772r842j0368j0814
58861A029101j0650j0332j0632j1444j2027j2150j2213j2306j1966j0982r846
$$ y = [982169, 976330, 969366, 961245, 951990, 941751, 930629, 918639, 905977, 893202, 881011, 869835, 859709, 850439, 841832, 833835, 826582, 820350, 815425, 811920, 809596, 807976, 806761, 806144, 806453, 807369, 807809, 806862, 804708, 802293, 800264, 798611, 797275, 796564, 796725, 797490, 798299, 798794, 798918, 798794, 798721, 799135, 800354, 802573, 806181, 811698, 819055, 827230, 835097, 842492, 850044, 858102, 866439, 875019, 884424, 895209, 907254, 920125, 933753, 948356, 963812, 979477, 994622, 1008873, 1022262, 1035085, 1047699, 1060337, 1073033, 1085757, 1098464, 1110936, 1122623, 1132800, 1140921, 1146886, 1151024, 1153784, 1155280, 1155149, 1152992, 1148886, 1143212, 1136089, 1127431, 1117647, 1107741, 1098372, 1089228, 1079724, 1069897, 1060125, 1050283, 1039915, 1029101, 1018451, 1008119, 997487, 986043, 974016, 961866, 949653, 937347, 925381, 914399, 904553]
58850I04553r161r060r381r986j0625j0864j0448r621q862q379p996p459o757
58837G85954o112n640n118m254l235k616k554k518k049j453j201j036k89J019
58823G48898K057K259J825J141M28Q2N95J730K394J878P26j27n63j082j767k292
58807G58182k723l480m471n004m789m393m461m878n100m894m423l883l324k709
58793F99650j895q00K23N29On27k53N62J051J188J919L612N157N234L934K473
58777G22063J625J199Q70O66N34K27k35o09j209k748m983o364n857m558m458n915
58761F90248p382p560o671n437l911k017l84K59K09M93J528K677L151K896K420
58746F70519K203K424L038L833M544N041N437N918O489O948P068O806O292N697
$$ y = [904553, 895392, 886332, 876951, 866965, 856340, 845476, 835028, 825407, 816545, 808166, 800170, 792711, 785954, 779842, 774202, 769084, 764830, 761595, 758979, 756425, 753907, 751858, 750405, 749204, 748168, 747879, 748898, 750955, 753214, 755039, 756180, 756608, 756690, 757285, 759015, 761409, 763287, 764013, 763886, 763323, 762241, 760474, 758182, 755459, 751979, 747508, 742504, 737715, 733322, 728861, 723983, 718883, 713989, 709566, 705683, 702359, 699650, 697755, 696955, 697178, 697707, 697713, 697186, 696933, 697495, 698546, 699734, 701653, 705265, 710422, 715656, 719590, 722063, 723688, 724887, 725757, 726423, 726957, 727184, 726949, 726340, 725131, 722383, 717400, 711036, 705179, 700621, 696163, 690248, 682866, 675306, 668635, 663198, 659287, 657270, 656886, 657145, 657354, 657847, 659375, 662052, 665203, 668099, 670519, 672722, 675146, 678184, 682017, 686561, 691602, 697039, 702957, 709446, 716394, 723462, 730268, 736560, 742257]
58732G42257N193M934N002N312N692O034O232O026N225M149L450L299L092K349
58718H08246J509J276J500J333M80m52r33j178j577k078k629l638n462p656r323
58703G79418j0149j0680j1479j2443j3040j2974j2451j1901j1560j1367j1192
58692F50182j0972j0572r733q435p174o517o337n918m881l608k605j874j190o12
58678E69754k94o3M15J131J798K324K892L550M077M302M326M324M382M580N030
58663F12528N651O075N964N373M546L386J493j077l462m845n475o246p312p804
58649F08795p170o044n289m835m204l585l380l097j843O3J107N06q19j600j625
58634E66980j332q43j19M98O47N37N81P40P24N76N98R44J621K665L871M629M399
$$ y = [742257, 747450, 752384, 757386, 762698, 768390, 774424, 780656, 786682, 791907, 796056, 799506, 802805, 805897, 808246, 809755, 811031, 812531, 813864, 814344, 813892, 812959, 811781, 810204, 808126, 805497, 801859, 796397, 788741, 779418, 769269, 758589, 747110, 734667, 721627, 708653, 696202, 684301, 672741, 661374, 650182, 639210, 628638, 618905, 610470, 603296, 596779, 590442, 584524, 579643, 576035, 573430, 571556, 570366, 569754, 569460, 569397, 569812, 570943, 572741, 575065, 577957, 581507, 585584, 589886, 594212, 598536, 602918, 607498, 612528, 618179, 624254, 630218, 635591, 640137, 643523, 645016, 643939, 640477, 635632, 630157, 623911, 616599, 608795, 601625, 595581, 590292, 585457, 581253, 577668, 574288, 571191, 569348, 569411, 570518, 571024, 570205, 568605, 566980, 565648, 564805, 564686, 565184, 565831, 566368, 566949, 567689, 568413, 568989, 569587, 570531, 572152, 574817, 578688, 583317, 587716]
58617E87716L291J921R70R66K067L769N128N583N262M438L269K241K016K506K746
58602F33889K267J797K020K407K127J473J341J789K145K264K593L263M033N043
58588F68451O583Q167Q854Q628Q511R153J0109J0734J1028J1350J1911J2795J3867
58575H00141J4545J4327J3689J3774J4936J6296J7003J7316J8017J9280K0542
58564I79866K1156K0910K0116J9442J9328J9454J9034J7609J5231J2027Q161M201
58552A176535Q24j931m565p146r140j0336j1275j2420j3521j4203j4623j5105
58540A063094j5604j6000j6578j7731j9335k0800k1628k1731k1339k0745j9982
58529H51621j8758j6870j4623j2566j0851r270p829o774o077n446m842m434l993
$$ y = [587716, 591007, 592928, 593898, 594864, 596931, 600700, 605828, 611411, 616673, 621111, 624380, 626621, 628637, 631143, 633889, 636156, 637953, 639973, 642380, 644507, 645980, 647321, 649110, 651255, 653519, 656112, 659375, 663408, 668451, 675034, 683201, 692055, 700683, 709194, 718347, 728456, 739190, 750218, 761568, 773479, 786274, 800141, 814686, 829013, 842702, 856476, 871412, 887708, 904711, 922027, 940044, 959324, 979866, 1001022, 1021932, 1042048, 1061490, 1080818, 1100272, 1119306, 1136915, 1152146, 1164173, 1172334, 1176535, 1177359, 1175428, 1170863, 1163717, 1154577, 1144241, 1132966, 1120546, 1107025, 1092822, 1078199, 1063094, 1047490, 1031490, 1014912, 997181, 977846, 957046, 935418, 913687, 892348, 871603, 851621, 832863, 815993, 801370, 788804, 777953, 768683, 760854, 754080, 748003, 742557, 737715, 733281, 729288]
58516G29288k982j448k09J06l46j114j940k520k428j625o20J70P38J032Q54M95
58500G17451P29J778K842L224L257L612M208M593M906N706P030Q291R084R564
58486G86275J0084J0893J2076J3336J3969J3576J2751J2586J3348J4039J3462
58475I26395J1547R369P873O804N143K453n47k887m388n463o299o700o550n793
58461I30957m268k131k25P47J214K076L232L788L644L663M123M235L525K451J122
58446I58153j281m906q246r869j0231j0649j1228j1040r808q120o245m034j866
58433H60630n66k03J24J083K451L654M372M540M327M138M147L959L181K092J156
58418H99085J01j656l777n164n503n795o912q297q692p725o270n303m898m446
$$ y = [729288, 726306, 724858, 724649, 724755, 724409, 723295, 721355, 718835, 716407, 714782, 714162, 714332, 715070, 716102, 716956, 717451, 718180, 719958, 722800, 726024, 729281, 732893, 737101, 741694, 746600, 752306, 759336, 767627, 776711, 786275, 796359, 807252, 819328, 832664, 846633, 860209, 872960, 885546, 898894, 912933, 926395, 937942, 947311, 955184, 961988, 967131, 969584, 969037, 966150, 961762, 956299, 950000, 943300, 936750, 930957, 926689, 924558, 924333, 925080, 926294, 928370, 931602, 935390, 939034, 942697, 946820, 951055, 954580, 957031, 958153, 956872, 951966, 943720, 933851, 923620, 912971, 901743, 890703, 880895, 872775, 866530, 862496, 860630, 860064, 859861, 859985, 861068, 863519, 867173, 871545, 876085, 880412, 884550, 888697, 892656, 895837, 897929, 899085, 899186, 897530, 893753, 888589, 883086, 877291, 870379, 862082, 853390, 845665, 839395, 834092, 829194, 824748]
58404H24748l544k405j509j089j091j309j368q15L76J592K266K604L135L734L803
58389H29128L268K654K185J651J179J188J536J650J721K557M064N078N219N546
58375H68624O751Q025Q623R212J0538J1902J2293J2096J2294J2763J2746J2371
58363I98238J2260J2222J1731J1145J1129J1261J0693R745R351R271Q406O707
58351A122159N238M394L595K823K932M153N508O095N952N600N676O896R292J1570
58337A201883J2424J2353J2874J4120J4790J4379J3801J3529J2810J1287R843
58326A344093R150Q689P884P025O407N652M679M231M770N723O465P187Q216R306
58312A439477J0224J1224J2394J3253J3495J3489J3709J4322J5548J7491J9396
$$ y = [824748, 821204, 818799, 817290, 816201, 815110, 813801, 812433, 811618, 811994, 813586, 815852, 818456, 821591, 825325, 829128, 832396, 835050, 837235, 838886, 840065, 841253, 842789, 844439, 846160, 848717, 852781, 857859, 863078, 868624, 875375, 883400, 892023, 901235, 911773, 923675, 935968, 948064, 960358, 973121, 985867, 998238, 1010498, 1022720, 1034451, 1045596, 1056725, 1067986, 1078679, 1088424, 1097775, 1107046, 1115452, 1122159, 1127397, 1131791, 1135386, 1138209, 1141141, 1145294, 1150802, 1156897, 1162849, 1168449, 1174125, 1181021, 1190313, 1201883, 1214307, 1226660, 1239534, 1253654, 1268444, 1282823, 1296624, 1310153, 1322963, 1334250, 1344093, 1353243, 1361932, 1369816, 1376841, 1383248, 1388900, 1393579, 1397810, 1402580, 1408303, 1414768, 1421955, 1430171, 1439477, 1449701, 1460925, 1473319, 1486572, 1500067, 1513556, 1527265, 1541587, 1557135, 1574626, 1594022]
58301A594022K0086J9538J9084J9638K0735K1603K2173K2526K2502K2467K3465
58290A827839K5829K8445L0065L0652L0939L1400L2205L3394L4639L5438L5970
58279B176815L7002L8734M0467M1725M2825M4203M5949M8131N0636N2601N3223
58268B672311N3182N3957N5631N6880N7389N8530O1105O4082O6354O8219P0187
58257C337827P1832P2910P4245P6458P8925Q1019Q3272Q6429R0423R5170J01117
58246D249627J08126J15031J21246J27694J35253J43515J51946J60955J70846
58237E484239J81000J91191K02434K15498K29758K44530K60379K78149K97881
58228G585059L19628L44079L71539M01580M34426M71330N12919N58992O10603
$$ y = [1594022, 1614108, 1633646, 1652730, 1672368, 1693103, 1714706, 1736879, 1759405, 1781907, 1804374, 1827839, 1853668, 1882113, 1912178, 1942830, 1973769, 2005169, 2037374, 2070768, 2105407, 2140845, 2176815, 2213817, 2252551, 2293018, 2334743, 2377568, 2421771, 2467720, 2515851, 2566487, 2619088, 2672311, 2725493, 2779450, 2835081, 2891961, 2949350, 3007880, 3068985, 3133067, 3199421, 3267640, 3337827, 3409659, 3482569, 3556814, 3633272, 3712197, 3793216, 3876488, 3962917, 4053340, 4148510, 4249627, 4357753, 4472784, 4594030, 4721724, 4856977, 5000492, 5152438, 5313393, 5484239, 5665239, 5856430, 6058864, 6274362, 6504120, 6748650, 7009029, 7287178, 7585059, 7904687, 8248766, 8620305, 9021885, 9456311, 9927641, 10440560, 10999552, 11610155]
58219A1610155O70549P40874Q21980R15255J024743J155403J311979J500895J731242
58210B1483075K012663K352964K756510L221518L739434M301576M906987N559736
58202E0334463O259213O998692P772344Q575985R404175J0262041J1180599J2192118
58194A22979630J3261483J4243840J4931462J5157003J4867118J4134633J3137283
58187B22712452J2108742J1236838J0536744R793640Q630429O652336L590907
58180B85262088n78216n556221j0740757j5394093j8897646k0945278k1578687
58173A91571190k1088265j9863232j8258620j6517829j4766803j3060085j1429995
58166G6586361r906170q513379p268733o181676n251417m465711l806452l256364
$$ y = [11610155, 12280704, 13021578, 13843558, 14758813, 15783556, 16938959, 18250938, 19751833, 21483075, 23495738, 25848702, 28605212, 31826730, 35566164, 39867740, 44774727, 50334463, 56593676, 63592368, 71364712, 79940697, 89344872, 99606913, 110787512, 122979630, 136241113, 150484953, 165416415, 180573418, 195440536, 209575169, 222712452, 234821194, 246058032, 256594776, 266388416, 275018845, 281671181, 285262088, 284683872, 279127651, 268386894, 252992801, 234095155, 213149877, 191571190, 170482925, 150619693, 132361073, 115843244, 101076441, 88016356, 76586361, 66680191, 58166812, 50898079, 44716403, 39464986, 34999275, 31192823, 27936459]
58158B7936459k799609k420013k102844j837176j614261j425166j262255j121401
58150A3353734j000600q97302q08473p31773o65071o05933n52739n05114m62341
58141G124388m22875l86150l53171l24283k98079k73555k51522k32700k16078
58132D365975k00495j86299j74125j63479j53797j45477j38591j31889j24377
58123B947446j16665j09528j02490r5078q8196q2812p8394p4025o9960o6646o3339
58112B000313n9271n5268n2602n0953m9021m6582m4414m2611m0565l8285l6360
58101A484381l4786l3029l1131k9635k8516k7265k5927k5053k4647k4064k2988
58090A177340k1772k0761j9961j9365j8996j8658j8090j7361j6749j6319j5985
$$ y = [27936459, 25136850, 22716837, 20613993, 18776817, 17162556, 15737390, 14475135, 13353734, 12353134, 11455832, 10647359, 9915586, 9250515, 8644582, 8091843, 7586729, 7124388, 6701513, 6315363, 5962192, 5637909, 5339830, 5066275, 4814753, 4582053, 4365975, 4165480, 3979181, 3805056, 3641577, 3487780, 3342303, 3203712, 3071823, 2947446, 2830781, 2721253, 2618763, 2523685, 2435489, 2352677, 2274283, 2200258, 2130298, 2063652, 2000313, 1941042, 1885774, 1833172, 1782219, 1733198, 1686616, 1642202, 1599591, 1559026, 1520741, 1484381, 1449595, 1416566, 1385435, 1355800, 1327284, 1300019, 1274092, 1249039, 1224392, 1200328, 1177340, 1155568, 1134807, 1114846, 1095481, 1076485, 1057827, 1039737, 1022376, 1005627, 989308, 973323]
58079I73323j5751j5636j5623j5844j6410j6892j6533j5337j4249j3884j3727
58068H03437j3122j2314j1851j1576j1000j0195r571r167q833q694q784q625p833
58055F71872o799o142n880n714n737o105o471o439o243o288o398o269o227o691
58041E84469p227p003o048n191m910n017n335n825o159n966n507n390n596n521
58027E03774m980m462m339m505m839n327n661n362m495l641l081k502j671q09
58013D48100j72K27L21qm86n86k87j61m64p06m52o2j13n28p63o93p12j030j356
57994D40069j478j707k411l332l792l551l096k905k845k651k592l092l857m040
57980C98720l340k335j631j270j165j365j653j514r42o19q29r09l33L48L83M7
$$ y = [973323, 957572, 941936, 926313, 910469, 894059, 877167, 860634, 845297, 831048, 817164, 803437, 790315, 778001, 766150, 754574, 743574, 733379, 723808, 714641, 705808, 697114, 688330, 679705, 671872, 665073, 658931, 653051, 647337, 641600, 635495, 629024, 622585, 616342, 610054, 603656, 597387, 591160, 584469, 577242, 570239, 564191, 559000, 554090, 549073, 543738, 537913, 531754, 525788, 520281, 514891, 509295, 503774, 498794, 494332, 489993, 485488, 480649, 475322, 469661, 464299, 459804, 456163, 453082, 450580, 448909, 448100, 447928, 448155, 448476, 448468, 447982, 447396, 447109, 446948, 446484, 445778, 445326, 445264, 445151, 444623, 443860, 443167, 442455, 441425, 440069, 438591, 436884, 434473, 431141, 427349, 423798, 420702, 417797, 414952, 412301, 409709, 406617, 402760, 398720, 395380, 393045, 391414, 390144, 388979, 387614, 385961, 384447, 383505, 382886, 382057, 381148, 380815, 381163, 381546, 381593]
57964C81593R7N28P52O81O81O76K88l13n97o33q54r95l20J027J979K150K316K957
57946C92013L387L027K584L087M375N427N817N962O175O241N955N421M735L887
57932D58093L049K548K316J755L51j646l451m615n478o557p744q420q370q115
57918D13716q082p926p164o148n683n788n565m435k872j644r18m73l30o06j033
57903C55049j052m44M20R08O44j78q64p96j4Q48J313J525J947K773L738M357M282
57886C74456L543K526J586Q25K85J74N41R31Q88O51P97J250J314Q68P40J536K707
57869C95618L310L279L256L505L723L818M237N189O050N869M432K638J665J811
57855D48400K302K308J918J729J719J174j05j234j375r45j083k134l337l902l813
$$ y = [381593, 381690, 382218, 382970, 383651, 384332, 385008, 385296, 384983, 384386, 383753, 382899, 381904, 381584, 382611, 384590, 386740, 389056, 392013, 395400, 398427, 401011, 404098, 408473, 413900, 419717, 425679, 431854, 438095, 444050, 449471, 454206, 458093, 461142, 463690, 466006, 467761, 468112, 466466, 463015, 458400, 452922, 446365, 438621, 430201, 421831, 413716, 405634, 397708, 390544, 384396, 378713, 372925, 367360, 362925, 360053, 358409, 357491, 357018, 356688, 356082, 355049, 353997, 353553, 353973, 354881, 355525, 355347, 354483, 353687, 353673, 354521, 355834, 357359, 359306, 362079, 365817, 370174, 374456, 377999, 380525, 382111, 382936, 383221, 383395, 383936, 384867, 385755, 386406, 387203, 388453, 389767, 390635, 391375, 392911, 395618, 398928, 402207, 405463, 408968, 412691, 416509, 420746, 425935, 431985, 437854, 442286, 444924, 446589, 448400, 450702, 453010, 454928, 456657, 458376, 459550, 459445, 458211, 456836, 455891, 454808, 452674, 449337, 445435, 441622]
57840D41622l480l138k855k703k605k256j453m45L26P07R25J206J584K048K644
57825D32127L251L475K987J957Q56o8q69j418j389r09q00j661k977l661l389k898
57809D24614l001l781m789n544n762n517n304n546n948n773m843l722k818j954
57795C60312j055n69o73o73J49J482K421K677K725K920L174L363L463L282K638
57780C85636J897J726K224K722K685K308K055J963J722J183M81k35r54j758k670
57765D00985l537m045l985l545l129k904k728k519k385k282j873r91o1L02Q7n4
57749C67336M27J363K231K809L221L423L131K398J832J858K074J766R58M17N82
57734C95826R96J030O91L84K59J53jr3p7j1L5m5l39o83o71j58M55O84N07K11m7
$$ y = [441622, 438142, 435004, 432149, 429446, 426841, 424585, 423132, 422687, 423013, 423720, 424645, 425851, 427435, 429483, 432127, 435378, 438853, 441840, 443797, 444653, 444585, 443716, 442298, 440909, 440000, 439200, 437539, 434562, 430901, 427512, 424614, 421613, 417832, 413043, 407499, 401737, 396220, 390916, 385370, 379422, 373649, 368806, 365084, 362266, 360312, 359257, 358688, 358015, 357342, 357491, 358973, 361394, 364071, 366796, 369716, 372890, 376253, 379716, 382998, 385636, 387533, 389259, 391483, 394205, 396890, 399198, 401253, 403216, 404938, 406121, 406602, 406367, 405413, 403655, 400985, 397448, 393403, 389418, 385873, 382744, 379840, 377112, 374593, 372208, 369926, 368053, 367062, 367001, 367303, 367390, 367336, 367763, 369126, 371357, 374166, 377387, 380810, 383941, 386339, 388171, 390029, 392103, 393869, 394827, 395244, 395826, 396822, 397852, 398543, 398927, 399186, 399339, 399338, 399245, 399168, 399157, 399192, 399147, 398808, 398125, 397454, 397296, 397751, 398435, 398942, 399153, 399106]
57713C99106k59l77m72q28j446j731j196l15k5l58l23O59J854K193J674J203J286
57696D00645J499J361J153J489K318K845K574K051K138K872L507L721M101N212
57682D37486O729P978Q974J0371J2553J5222J7804J9835K1101K1846K2624K3562
57670F26085K3902K2875K0848J9069J8236J7869J7077J5240J1867O484r64r855
57658G88733j9178k7669l3887l6898l7143l5967l4067l1046k6740k2175j8548
57647D65415j5947j3666j1384r323p626o337n691n688n482m134j948l82l38j194
57633C76275j785j742j443j074m94J13R8q14j895k086j253l65k77p05p65j95M25
57616C62018O12M63K07j41n06o48o05p64j160j217n67K81N93L53J00J69N51J187
$$ y = [399106, 398847, 398470, 397998, 397170, 395724, 393993, 392797, 392482, 392457, 392099, 391776, 392435, 394289, 396482, 398156, 399359, 400645, 402144, 403505, 404658, 406147, 408465, 411310, 413884, 415935, 418073, 420945, 424452, 428173, 432274, 437486, 444215, 452193, 461167, 471538, 484091, 499313, 517117, 536952, 558053, 579899, 602523, 626085, 649987, 672862, 693710, 712779, 731015, 748884, 765961, 781201, 793068, 799552, 798588, 788733, 769555, 741886, 707999, 671101, 633958, 597991, 563924, 532878, 506138, 483963, 465415, 449468, 435802, 424418, 415095, 407469, 401132, 395441, 389753, 384271, 380137, 378189, 377807, 377469, 376275, 374490, 372748, 371305, 370231, 369737, 369850, 369948, 369134, 367239, 365153, 363900, 363535, 363258, 362553, 361788, 361593, 362018, 362630, 363093, 363300, 363159, 362653, 362005, 361400, 360636, 359476, 358259, 357692, 357973, 358566, 358919, 359019, 359188, 359739, 360926]
57598C60926J830J951J320M85P1q9m92r77r98p16q61j481j772j271m40K27Q15
57581C58528J370J499R95K45l96j035j599j515n75M88R14Q52P22L23n65j207o32
57564C58412R08K165K566K649K822K770K302J903J925K008J802J655J981K488
57550C88356K658K573K638K826K810K673K795L157L314L082K688K253J648J008
57536D24479Q33J352K098K399K026J233M56J42N88J642K711L258L196K718K037
57521D51168J458J411K005K734K976K752K649K989L461L625L537L540L695L679
57507D91679L284K788K639K852K984K762K545K831L494L846L515K831K227J727
57493E32004J260J049J266J642J923K386L340M339M608M116L524L087K400J425
$$ y = [360926, 362756, 364707, 366027, 366512, 366583, 366494, 366002, 365025, 364027, 363311, 362450, 360969, 359197, 357926, 357486, 357713, 358528, 359898, 361397, 362392, 362637, 362241, 361206, 359607, 358092, 357517, 358005, 358919, 359771, 360493, 360816, 360251, 359044, 358412, 359320, 361485, 364051, 366700, 369522, 372292, 374594, 376497, 378422, 380430, 382232, 383887, 385868, 388356, 391014, 393587, 396225, 399051, 401861, 404534, 407329, 410486, 413800, 416882, 419570, 421823, 423471, 424479, 425312, 426664, 428762, 431161, 433187, 434420, 434876, 435018, 435606, 437248, 439959, 443217, 446413, 449131, 451168, 452626, 454037, 456042, 458776, 461752, 464504, 467153, 470142, 473603, 477228, 480765, 484305, 488000, 491679, 494963, 497751, 500390, 503242, 506226, 508988, 511533, 514364, 517858, 521704, 525219, 528050, 530277, 532004, 533264, 534313, 535579, 537221, 539144, 541530, 544870, 549209, 553817, 557933, 561457, 564544, 566944, 568369]
57479E68369R59J628L047M383N169N216M379L042K241K537L198L236K863K987
57465F13254L598L778L352L396M636O259O945O418N384M442L772L602M141N048
57451F78025N550N344M955N019N497N847N818N721N932O306O361N926N383N220
57437G56904N536O126O815P439P668P252O463O016O401P380Q205Q277P642O976
57423H55100O944P463P788P520P268P856R087R836R395Q257P452P521Q258R037
57409I68782R227Q639P816P543P968Q522Q734Q699Q652Q619Q715R248J0132J0703
57395A091999J0543J0089J0050J0522J1158J1759J2219J2286J1980J1969J2850
57384A217424J4194J4961J4762J4089J3491J3137J3177J3701J4206J3847J2523
$$ y = [568369, 569328, 570956, 574003, 578386, 583555, 588771, 593150, 596192, 598433, 600970, 604168, 607404, 610267, 613254, 616852, 620630, 623982, 627378, 632014, 638273, 645218, 651636, 657020, 661462, 665234, 668836, 672977, 678025, 683575, 688919, 693874, 698893, 704390, 710237, 716055, 721776, 727708, 734014, 740375, 746301, 751684, 756904, 762440, 768566, 775381, 782820, 790488, 797740, 804203, 810219, 816620, 824000, 832205, 840482, 848124, 855100, 862044, 869507, 877295, 884815, 892083, 899939, 909026, 918862, 928257, 936514, 943966, 951487, 959745, 968782, 978009, 986648, 994464, 1002007, 1009975, 1018497, 1027231, 1035930, 1044582, 1053201, 1061916, 1071164, 1081296, 1091999, 1102542, 1112631, 1122681, 1133203, 1144361, 1156120, 1168339, 1180625, 1192605, 1204574, 1217424, 1231618, 1246579, 1261341, 1275430, 1288921, 1302058, 1315235, 1328936, 1343142, 1356989, 1369512]
57373A369512J1185J0740J1130J1747J2256J2656J2933J3110J3364J3774J4140
57362A506547J4340J4586J5030J5373J5249J4783J4449J4436J4549J4695J5130
57351A669167J6044J7131J7767J7630J7141J7112J7913J9051J9757J9826J9639
57340A868178J9518J9437J9372J9444J9564J9396J8925J8689J9146K0158K1290
57329B083117K2262K2796K2599K1892K1570K2194K3184K3654K3712K4113K4821
57318B335914K4940K4241K3719K4202K5203K5796K5951K6284K6831K7015K6701
57307B616797K6541K7058K8034K8947K9607L0080L0315L0140K9543K8816K8504
57296B934382K9104L0574L2106L2726L2234L1353L0911L1124L1763L2588L3357
$$ y = [1369512, 1380697, 1391437, 1402567, 1414314, 1426570, 1439226, 1452159, 1465269, 1478633, 1492407, 1506547, 1520887, 1535473, 1550503, 1565876, 1581125, 1595908, 1610357, 1624793, 1639342, 1654037, 1669167, 1685211, 1702342, 1720109, 1737739, 1754880, 1771992, 1789905, 1808956, 1828713, 1848539, 1868178, 1887696, 1907133, 1926505, 1945949, 1965513, 1984909, 2003834, 2022523, 2041669, 2061827, 2083117, 2105379, 2128175, 2150774, 2172666, 2194236, 2216430, 2239614, 2263268, 2286980, 2311093, 2335914, 2360854, 2385095, 2408814, 2433016, 2458219, 2484015, 2509966, 2536250, 2563081, 2590096, 2616797, 2643338, 2670396, 2698430, 2727377, 2756984, 2787064, 2817379, 2847519, 2877062, 2905878, 2934382, 2963486, 2994060, 3026166, 3058892, 3091126, 3122479, 3153390, 3184514, 3216277, 3248865, 3282222]
57285C282222L3791L3906L4201L5063L6174L6863L6976L6943L7034L7077L7024
57274C677274L7253L7953L8687L9032L9281L9975M0872M1089M0398L9763M0205
57263D111782M1510M2527M2582M2134M1986M2364M2922M3339M3562M3606M3490
57252D581804M3337M3242M3008M2321M1324M0643M0644M0862M0575L9743L9032
57241E036535L8886L9033L9057L9088L9637M0907M2588M4225M5607M6830M8119
57230E500512M9607N1173N2537N3579N4459N5335N6120N6593N6579N5977N4740
57219F097211N3040N1265M9619M7896M5887M3941M2692M2243M1943M1159M0049
57208F596945L9367L9554M0188M0384L9705L8640L8145L8824M0700M3656M7620
$$ y = [3282222, 3316013, 3349919, 3384120, 3419183, 3455357, 3492220, 3529196, 3566139, 3603173, 3640250, 3677274, 3714527, 3752480, 3791167, 3830199, 3869480, 3909455, 3950327, 3991416, 4031814, 4071577, 4111782, 4153292, 4195819, 4238401, 4280535, 4322521, 4364885, 4407807, 4451146, 4494708, 4538314, 4581804, 4625141, 4668383, 4711391, 4753712, 4795036, 4835679, 4876323, 4917185, 4957760, 4997503, 5036535, 5075421, 5114454, 5153511, 5192599, 5232236, 5273143, 5315731, 5359956, 5405563, 5452393, 5500512, 5550119, 5601292, 5653829, 5707408, 5761867, 5817202, 5873322, 5929915, 5986494, 6042471, 6097211, 6150251, 6201516, 6251135, 6299031, 6344918, 6388859, 6431551, 6473794, 6515737, 6556896, 6596945, 6636312, 6675866, 6716054, 6756438, 6796143, 6834783, 6872928, 6911752, 6952452, 6996108, 7043728]
57197G043728N2100N5989N8343N9246N9479N9516N9272N8782N8456N8514N8583
57186G682008N8167N7117N5363N2578M8488M3383L8045L3144K8936K5322K2049
57175H144600J8871J5716J2633R495N915J610l288q432j3534j8357k2603k6074
57163H116552k8804l0835l2058l2517l2656l2930l3171l2723l1233k9031k6638
57152G773956k4133k1199j7613j3511r268n292j949L92J477J311Q7k168n792j1141
57138G665157j8013k5588l2994l9670m5215m9138n0974n0407m7183m1168l2771
57127G232036k3039j3045l326N798J3686J9606K3475K5909K7736K9966L4279M2870
57115G415951N7392P8274J05060J37024J73257K12791K55511L03203L59662M29719
$$ y = [7043728, 7095828, 7151817, 7210160, 7269406, 7328885, 7388401, 7447673, 7506455, 7564911, 7623425, 7682008, 7740175, 7797292, 7852655, 7905233, 7953721, 7997104, 8035149, 8068293, 8097229, 8122551, 8144600, 8163471, 8179187, 8191820, 8201315, 8207230, 8208840, 8205552, 8197120, 8183586, 8165229, 8142626, 8116552, 8087748, 8056913, 8024855, 7992338, 7959682, 7926752, 7893581, 7860858, 7829625, 7800594, 7773956, 7749823, 7728624, 7711011, 7697500, 7688232, 7682940, 7680991, 7681383, 7682860, 7684171, 7684258, 7682090, 7676298, 7665157, 7647144, 7621556, 7588562, 7548892, 7503677, 7454539, 7403565, 7353158, 7305975, 7264807, 7232036, 7208997, 7195952, 7192626, 7198424, 7212110, 7231716, 7255191, 7281100, 7308836, 7338802, 7373081, 7415951, 7473343, 7551617, 7656677, 7793701, 7966958, 8179749, 8435260, 8738463, 9098125, 9527844]
57105I527844N18076O28391P62868R22783J110097J329204J587204J892223K250875
57096B0529565K666677L139923L666833M233886M805911N314660N661567N743959
57088E5762981N497506M932359M140494L267687K462268J823141J370072J050840
57080H0307348P82098M99462J84186j48793m84786q32148j215797j653013k136948
57071G5301609k640259l130160l579275l966513m273478m483366m583590m569267
57063D4075701m445206m225860l933214l592734l228869k862192k508785k180467
57055A7098374j884534j623752j397664j204554j042285r07747p96539p03826
57047G537473o25481n58387n00132m48856m03340l62956l27478k96774k70307
$$ y = [9527844, 10045920, 10674311, 11437179, 12359962, 13470059, 14799263, 16386467, 18278690, 20529565, 23196242, 26336165, 30002998, 34236884, 39042795, 44357455, 50019022, 55762981, 61260487, 66192846, 70333340, 73601027, 76063295, 77886436, 79256508, 80307348, 81089446, 81588908, 81773094, 81624301, 81139515, 80307367, 79091570, 77438557, 75301609, 72661350, 69531190, 65951915, 61985402, 57711924, 53228558, 48644968, 44075701, 39630495, 35404635, 31471421, 27878687, 24649818, 21787626, 19278841, 17098374, 15213840, 13590088, 12192424, 10987870, 9945585, 9037838, 8241299, 7537473, 6911992, 6353605, 5853473, 5404617, 5001277, 4638321, 4310843, 4014069, 3743762]
57038C743762k46864k25064k04297j84794j66676j49428j32602j16545j01900
57029B215592q8740p6726o5857n6380m8116m0488l3244k6596k0640j5321j1279
57018A732205j0255j4173k3805l8117n4508o9669q0775q6489q7027q3466p7212
57007A106709o9774o2320n5192m8164m1260l4909k9298k4176j9517j5817j3313
56996F92969j1419r307o797m281k122n40K90N11P64J528K442K712K121J188L44
56981F70403n55j826l454n166o808q551j0775j3673j6782j9022j9445j7979j5319
56968E31048j2240r189o403l966j761M07K558M505N955O540N997M660L569L592
56954E35272M383M581L131J28l613p352j0654j3209j4799j5274j4482j2354r197
$$ y = [3743762, 3496898, 3271834, 3067537, 2882743, 2716067, 2566639, 2434037, 2317492, 2215592, 2126852, 2050126, 1984269, 1927889, 1879773, 1839285, 1806041, 1779445, 1758805, 1743484, 1732205, 1721950, 1707777, 1683972, 1645855, 1591347, 1521678, 1440903, 1354414, 1267387, 1183921, 1106709, 1036935, 974615, 919423, 871259, 829999, 795090, 765792, 741616, 722099, 706282, 692969, 681550, 672243, 665446, 661165, 659043, 658503, 658793, 659304, 660068, 661596, 664038, 666750, 668871, 670059, 670403, 669848, 668022, 664568, 659402, 652594, 644043, 633268, 619595, 602813, 583791, 564346, 546367, 531048, 518808, 509619, 503216, 499250, 497489, 497896, 500454, 504959, 510914, 517454, 523451, 528111, 531680, 535272, 539655, 544236, 547367, 547495, 543882, 536530, 525876, 512667, 497868, 482594, 468112, 455758, 446561]
56941D46561n696k494J55K318M141N786P370Q816R905J0516J0740J0687J0367
56928E19172R750Q718O864L613j279p369j3679j9174k3062k5015k5292k4517k3099
56915C85631k0944j7862j4209j0931q843q005p750p328o385m936l104j135N05
56902B74704J404J763K312L537N196O779Q114R193R931J0421J1107J2074J2608
56889C69143J2114J1213J0975J1310J1233J0689J0745J1520J1337Q962N502K832
56877D87575R29j619m772o469n223j992J251L845O588J0159J4254J8110K1239
56864E43875K3522K4907K5272K4708K3962K4150K5622K7269K7415K5275K1057
56853H17034J4932O867k314j0648j6370j9045j9028j6484j1518m759K907J0971
$$ y = [446561, 440865, 438371, 438526, 440844, 444985, 450771, 458141, 466957, 476862, 487378, 498118, 508805, 519172, 528922, 537640, 544504, 548117, 546838, 539469, 525790, 506616, 483554, 458539, 433247, 408730, 385631, 364687, 346825, 332616, 321685, 312842, 304837, 297087, 289759, 283374, 278438, 275334, 274199, 274704, 276108, 277871, 280183, 283720, 288916, 295695, 303809, 313002, 322933, 333354, 344461, 356535, 369143, 381257, 392470, 403445, 414755, 425988, 436677, 447422, 458942, 470279, 479241, 484743, 487575, 488504, 486885, 482113, 475644, 470421, 468429, 469680, 473525, 480113, 490272, 504526, 522636, 543875, 567397, 592304, 617576, 642284, 666246, 690396, 716018, 743287, 770702, 795977, 817034, 831966, 838833, 836519, 825871, 809501, 790456, 771428, 754944, 743426, 738667, 741574, 752545]
56841G52545J9154K6798L2974L7137L9321L9872L9307L8333L7526L7041L6668
56830A136676L5752L2782K5738J3696j946j8417l3500m6029n4904n8807n7229
56819I73812n1137m2305l2319k2260j2677l653M707J1668J6244J8245J8538J8188
56807H97051J7849J7888J8255J7960J5497J0178K464p134j8484l0612m1172m8106
56795H51634n1215n1208m8064m1633l3274k5284j8605j2458o337j052K576M787
56783E69867O072O365N770N099M876M511L231J077j823o225j2715k0236k6790
56770E39079l1483l4673l6365l5770l2840k8916k5332k2135j8856j5730j3411
56759B43568j1966j0886r822q671p265n560m026l193k850k269j214k87j94j031
$$ y = [752545, 771699, 798497, 831471, 868608, 907929, 947801, 987108, 1025441, 1062967, 1100008, 1136676, 1172428, 1205210, 1230948, 1244644, 1242698, 1224281, 1190781, 1144752, 1089848, 1031041, 973812, 922675, 880370, 848051, 825791, 813114, 809461, 814168, 825836, 842080, 860325, 878863, 897051, 914900, 932788, 951043, 969003, 984500, 994678, 997142, 990008, 971524, 940912, 899740, 851634, 800419, 749211, 701147, 659514, 626240, 600956, 582351, 569893, 563556, 562504, 565080, 569867, 575939, 582304, 588074, 593173, 598049, 602560, 605791, 606868, 605045, 598820, 586105, 565869, 539079, 507596, 472923, 436558, 400788, 367948, 339032, 313700, 291565, 272709, 256979, 243568, 231602, 220716, 210894, 202223, 194958, 189398, 185372, 182179, 179329, 177060, 175846, 175559, 175365, 174334]
56745A74334k339l477l870l324k281j558j563j925j967j357k93P70J366J251O22
56730A54389P1J19O91J169R95K77k78q4O80J315J441J328J329J309R28L00l8K27
56712A66168Q93J534J785J449O84O8P0M60O91P92J275K051K194J162l26j168j163
56695A78619q29l86L10J037J250R16O58Q75J264J357J170J069J306J770K003J469
56679A93858J64j137j585j224q35q58r58p59m23k19p4J80M44N72N97N58L36l4
56661A88603k82k88k18j11K38P40Q71M22j28l03k37j52J49O97Q74K98k91O4J036
56642A91982J431R03K51j4k95q96j362j289r65p37m48k2K7o66j560j818j429j083
56624A82010j189j493j584j319q54n27n61o89l40N88J394J388O94l9m89p26p37
$$ y = [174334, 171995, 168518, 164648, 161324, 159043, 157485, 155922, 153997, 152030, 150673, 150380, 151150, 152516, 153767, 154389, 154460, 154579, 155270, 156439, 157434, 157711, 157433, 157349, 158029, 159344, 160785, 162113, 163442, 164751, 165679, 165979, 165941, 166168, 167061, 168595, 170380, 171829, 172513, 172581, 172651, 173111, 173802, 174594, 175869, 177920, 180114, 181276, 180950, 179782, 178619, 177790, 177404, 177714, 178751, 180001, 180917, 181575, 182450, 183714, 185071, 186241, 187310, 188616, 190386, 192389, 193858, 194022, 192885, 191300, 190076, 189241, 188383, 187425, 186666, 186243, 186024, 185950, 186130, 186574, 187146, 187743, 188301, 188637, 188603, 188321, 188033, 187815, 187704, 187942, 188682, 189553, 189975, 189847, 189544, 189307, 189155, 189304, 190001, 190875, 191173, 190882, 190946, 191982, 193413, 194316, 194567, 194553, 194258, 193362, 192000, 190711, 189746, 189009, 188561, 188539, 188566, 187900, 186340, 184522, 183093, 182010, 180821, 179328, 177744, 176425, 175571, 175044, 174483, 173794, 173454, 174042, 175436, 176824, 177518, 177479, 176990, 176264, 175527]
56607A75527l90J97O97R39Q77M66j23l15K57J054J104K28o86p38O3J023J538J485
56589A83203J166J008J109J075N76l1%P78J550J645J295J206J658K304K727K856
56573B04125K921L177L668M172M445M534M672M909N046N030N095N395N716N786
56559B68691N651N511N325M862M067L127K202J240J15j185k490l483l873l645
56545B86115l139k794k795k984l038k805k460k370k623k824k595k173k153k603
56531B48759k883k571k119k111k303j922q30K27N72K54l64j104j802k061j599
56516B28143p27j43k68r23j534j566r34j52P7m09j016j058m77K53O84O61K32l58
56498B20485o66m39O6L77L92L65M42N31O21P55P33K88l60o03k81O6J9j73j37n
$$ y = [175527, 175137, 175334, 176031, 176970, 177847, 178313, 178190, 177875, 178132, 179186, 180290, 180518, 179832, 179094, 179157, 180180, 181718, 183203, 184369, 185377, 186486, 187561, 188137, 188106, 188106, 188884, 190434, 192079, 193374, 194580, 196238, 198542, 201269, 204125, 207046, 210223, 213891, 218063, 222508, 227042, 231714, 236623, 241669, 246699, 251794, 257189, 262905, 268691, 274342, 279853, 285178, 290040, 294107, 297234, 299436, 300676, 300791, 299606, 297116, 293633, 289760, 286115, 282976, 280182, 277387, 274403, 271365, 268560, 266100, 263730, 261107, 258283, 255688, 253515, 251362, 248759, 245876, 243305, 241186, 239075, 236772, 234850, 234020, 234247, 234819, 235073, 234709, 233605, 231803, 229742, 228143, 227416, 227273, 227005, 226082, 224548, 222982, 222048, 221896, 221973, 221564, 220548, 219490, 219013, 219266, 219950, 220611, 220843, 220485, 219819, 219380, 219446, 219823, 220215, 220580, 221022, 221553, 222174, 222929, 223662, 223950, 223590, 222987, 222706, 222772, 222791, 222618, 222481, 222476]
56478B22476m1o0K09M79K60l32o77n14j52J31L38M45L65K48L46N03L35q2k51j12
56458B23914j80o39r73q18n10l79r1P57J827K430K355J782Q01l86j041n80N21
56441B28790J107P17q0o47r00r27o53k08k7k57m59k07K67M22J43r5K94J414K673
56422B31367L174K564J498R61J137J307R25K49j89l06k61k8L93O06K36m22o32
56405B42579j41N61J022J423K077K676K499J462M47L54R75J304Q28P3k25rL75
56388B58280Q16J326J599J341R01R50J530J977J871J470J105P47L58J07l7l31
56372B74010o31k88Q36J889K097J787J747J985J906J426J087J146J238J084Q85
56357B92204R14J201J687K235K514K302J943J919K090J945J553J504J824J827
$$ y = [222476, 222435, 222375, 222584, 223063, 223323, 222991, 222314, 221800, 221648, 221779, 222117, 222562, 222927, 223175, 223521, 224024, 224359, 224277, 224026, 223914, 223734, 223095, 222122, 221304, 220794, 220415, 220324, 221081, 222908, 225338, 227693, 229475, 230276, 229890, 228849, 228269, 228790, 229897, 230614, 230534, 229887, 228987, 228060, 227407, 227199, 227172, 226915, 226456, 226249, 226516, 226938, 227081, 226986, 227280, 228694, 231367, 234541, 237105, 238603, 239564, 240701, 242008, 242933, 243182, 242993, 242687, 242426, 242398, 242791, 243397, 243633, 243211, 242579, 242438, 242999, 244021, 245444, 247521, 250197, 252696, 254158, 254605, 254959, 255934, 257238, 258066, 258139, 257914, 257905, 258280, 259096, 260422, 262021, 263362, 264263, 265213, 266743, 268720, 270591, 272061, 273166, 273913, 274271, 274378, 274341, 274010, 273379, 273091, 273927, 275816, 277913, 279700, 281447, 283432, 285338, 286764, 287851, 288997, 290235, 291319, 292204, 293118, 294319, 296006, 298241, 300755, 303057, 305000, 306919, 309009, 310954, 312507, 314011, 315835, 317662]
56343C17662J382J337K146K944K836K356K608L455L774L313K988L241L329K739
56329C56110K179K420K982K892K226J917K333K971L455L898M186L791K690J726
56315C95776J550J764J653J304J421K189L078L681M187M822N386N634N762O106
56301D44313O597O831O655O369O350O693P279P978Q616Q919Q723Q286Q225Q943
56287E50777J0161J1104J1283J1086J1492J3094J5350J6998J7372J7255J8107
56276G04079K0378K2970K4629K5568K7184L0284L4202L7809M0802M3675M6861
56265A058441N0479N4704N9875O6098P3065Q0231Q7068R3314R9273J05705J13011
56254A941264J20571J27323J32927J37925J42646J46458J48408J48191J46158
$$ y = [317662, 319044, 320381, 322527, 325471, 328307, 330663, 333271, 336726, 340500, 343813, 346801, 350042, 353371, 356110, 358289, 360709, 363691, 366583, 368809, 370726, 373059, 376030, 379485, 383383, 387569, 391360, 394050, 395776, 397326, 399090, 400743, 402047, 403468, 405657, 408735, 412416, 416603, 421425, 426811, 432445, 438207, 444313, 450910, 457741, 464396, 470765, 477115, 483808, 491087, 499065, 507681, 516600, 525323, 533609, 541834, 550777, 560938, 572042, 583325, 594411, 605903, 618997, 634347, 651345, 668717, 685972, 704079, 724457, 747427, 772056, 797624, 824808, 855092, 889294, 927103, 967905, 1011580, 1058441, 1108920, 1163624, 1223499, 1289597, 1362662, 1442893, 1529961, 1623275, 1722548, 1828253, 1941264, 2061835, 2189158, 2322085, 2460010, 2602656, 2749114, 2897522, 3045713, 3191871]
56245C191871J42589J37324J30013J20400J08339R3854P7278N9163L9938J9739
56235D120508j294k2624m3430o3208q1991r9728j15574j28288j37457j43865j48377
56224C134672j50837j50559j47668j43357j38758j34019j28612j22193j15005
56215A903664j07627j00478r3485q6346p9200p2749o7369o2415n7017n1347m6376
56204A079255m2440l8810l4929l1178k8057k5382k2823k0586j8879j7182j4904
56193G84085j2444j0833j0401j0437j0117r174p742o142m840m048l345k168o84
56180F91710M15R26J316J791J985J810J954K943M320N276N757O359P420Q765J0143
56165G52890J1374J2207J2599J3107J4440J6644J9149K1604K4115K6693K9209
$$ y = [3191871, 3334460, 3471784, 3601797, 3722197, 3830536, 3924390, 4001668, 4060831, 4100769, 4120508, 4119214, 4096590, 4053160, 3989952, 3907961, 3808233, 3692659, 3564371, 3426914, 3283049, 3134672, 2983835, 2833276, 2685608, 2542251, 2403493, 2269474, 2140862, 2018669, 1903664, 1796037, 1695559, 1602074, 1515728, 1436528, 1363779, 1296410, 1233995, 1176978, 1125631, 1079255, 1036815, 998005, 963076, 931898, 903841, 878459, 855636, 835050, 816171, 798989, 784085, 771641, 760808, 750407, 739970, 729853, 720679, 712937, 706795, 701955, 697907, 694562, 692394, 691710, 692125, 693051, 694367, 696158, 698143, 699953, 701907, 704850, 709170, 714446, 720203, 726562, 733982, 742747, 752890, 764264, 776471, 789070, 802177, 816617, 833261, 852410, 874014, 898129, 924822, 954031]
56154I54031L2012L5815M0587M5206M8830N1995N5763O0297O5061O9951P5178
56143A534726Q0252Q4217Q7076Q9882R3103R5896R7394R7672R6663R3224Q6349
56132B536454P6743O6097N5176M3778L2313K2099J3775O363j700j1195k1910l3020
56120B784973m3386n2160n9460o6057p2229p7548q1928q6073r0477r4542r7190
56109A963923r7908r6715r3553q8363q1494p3529o4780n5367m5794l7065l0093
56098A199262k5005k1019j7134j3119r748p723o570n080k767l03J544K699L423
56085A098460L832M140M771N870P054P975Q690R331R929J0729J2070J3663J4717
56072A211231J5079J5529J6502J7364J7495J7320J7545J7931J7761J7047J6487
$$ y = [954031, 986043, 1021858, 1062445, 1107651, 1156481, 1208476, 1264239, 1324536, 1389597, 1459548, 1534726, 1614978, 1699195, 1786271, 1876153, 1969256, 2065152, 2162546, 2260218, 2356881, 2450105, 2536454, 2613197, 2679294, 2734470, 2778248, 2810561, 2832660, 2846435, 2852798, 2851098, 2839903, 2817993, 2784973, 2741587, 2689427, 2629967, 2563910, 2491681, 2414133, 2332205, 2246132, 2155655, 2061113, 1963923, 1866015, 1769300, 1675747, 1587384, 1505890, 1432361, 1367581, 1312214, 1266420, 1229355, 1199262, 1174257, 1153238, 1136104, 1122985, 1113237, 1105514, 1098944, 1093864, 1091097, 1090794, 1092338, 1095037, 1098460, 1102292, 1106432, 1111203, 1117073, 1124127, 1132102, 1140792, 1150123, 1160052, 1170781, 1182851, 1196514, 1211231, 1226310, 1241839, 1258341, 1275705, 1293200, 1310520, 1328065, 1345996, 1363757, 1380804, 1397291]
56061A397291J6479J6871J7387J7780J7876J7982J8707J9916K0529K0082J9686
56050A600586K0505K1953K2716K2948K3996K6070K7780K8271K8481K9707L1990
56039A885003L4393L6165L7094L7419L7873L9267M1548M3711M4956M5592M6489
56028B329510M8099N0274N2664N4925N6818N8344N9729O1208O2953O5139O7779
56017B967442P0561P3184P5855P9029Q2716Q6410Q9776R3077R6835J01334J06519
56006C922738J12185J18210J24662J31589J38765J45918J53264J61446J70777
55997E179554J80932J91566K02779K14823K27774K41776K57025K73492K91189
55988G260910L10851L33644L59938L89228M21459M57456M97896N43003N93717
$$ y = [1397291, 1413770, 1430641, 1448028, 1465808, 1483684, 1501666, 1520373, 1540289, 1560818, 1580900, 1600586, 1621091, 1643044, 1665760, 1688708, 1712704, 1738774, 1766554, 1794825, 1823306, 1853013, 1885003, 1919396, 1955561, 1992655, 2030074, 2067947, 2107214, 2148762, 2192473, 2237429, 2283021, 2329510, 2377609, 2427883, 2480547, 2535472, 2592290, 2650634, 2710363, 2771571, 2834524, 2899663, 2967442, 3038003, 3111187, 3187042, 3266071, 3348787, 3435197, 3524973, 3618050, 3714885, 3816219, 3922738, 4034923, 4153133, 4277795, 4409384, 4548149, 4694067, 4847331, 5008777, 5179554, 5360486, 5552052, 5754831, 5969654, 6197428, 6439204, 6696229, 6969721, 7260910, 7571761, 7905405, 8265343, 8654571, 9076030, 9533486, 10031382, 10574385, 11168102]
55979A1168102O51918P19067P96021Q84925R90012J116025J267414J450035J672317
55970B0715836J943824K273182K665952L121132L629664M180657M770918N405590
55962D8706755O089662O824254P611422Q454174R348843J0287591J1272684J2308920
55954A20904305J3357283J4297055J4956345J5195446J4967714J4325039J3403426
55947B21406613J2405179J1533305J0861907J0228217R252069P481308M568022
55940B87736620M04907m788826j0455102j5813199k0100642k2822001k3865412
55933A90296345k3448971k1971290j9862319j7485417j5098356j2859155j0851872
55926F8718965r110177p633315o400138n381646m547139l865234l306148k845527
$$ y = [11168102, 11820020, 12539087, 13335108, 14220033, 15210045, 16326070, 17593484, 19043519, 20715836, 22659660, 24932842, 27598794, 30719926, 34349590, 38530247, 43301165, 48706755, 54796417, 61620671, 69232093, 77686267, 87035110, 97322701, 108595385, 120904305, 134261588, 148558643, 163514988, 178710434, 193678148, 208003187, 221406613, 233811792, 245345097, 256207004, 266435221, 275687290, 283168598, 287736620, 288141527, 283352701, 272897599, 257084400, 236983758, 214161757, 190296345, 166847374, 144876084, 125013765, 107528348, 92429992, 79570837, 68718965, 59608788, 51975473, 45575335, 40193689, 35646550, 31781316, 28475168, 25629641]
55918B5629641k464917k148958j884225j660443j470246j307228j165618j041650
55910A2486356r33417q39132p56651o84341o20996n64926n14417m68863m28321
55901F675292l92239l59588l29946l03323k79269k57176k37008k18815k02060
55892D095868j86434j72654j61243j51104j40618j29749j19723j11056j03343
55883B819944r6604r1330q7152q2838p7842p2794o8408o4822o2018n9969n8409
55872A997758n7263n7129n8330n9704n9505n7463n4874n2655n0497m8023m5470
55861A396845m2895l9841l6314l3232l1271l0039k8913k8033k7759k7721k7061
55850A043766k5545k3840k2669k2004k1226j9966j8648j8013j8148j8275j7707
$$ y = [25629641, 23164724, 21015766, 19131541, 17471098, 16000852, 14693624, 13528006, 12486356, 11552939, 10713807, 9957156, 9272815, 8651819, 8086893, 7572476, 7103613, 6675292, 6283053, 5923465, 5593519, 5290196, 5010927, 4753751, 4516743, 4297928, 4095868, 3909434, 3736780, 3575537, 3424433, 3283815, 3154066, 3034343, 2923287, 2819944, 2723340, 2632010, 2544858, 2462020, 2384178, 2311384, 2242976, 2178154, 2116136, 2056167, 1997758, 1940495, 1883366, 1825036, 1765332, 1705827, 1648364, 1593490, 1540835, 1490338, 1442315, 1396845, 1353950, 1314109, 1277795, 1244563, 1213292, 1183253, 1154340, 1126307, 1098548, 1070827, 1043766, 1018221, 994381, 971712, 949708, 928482, 908516, 889868, 871855, 853707, 835432, 817725]
55839H17725j6586j5431j4342j3163j2070j1427j1182j0973j0692j0438j0057
55828F81364r329q553q302q521q408p360n718m393m031m612n597o361o583o280
55814E87316n531m424l224k258j443l79R72K124K795L202L362K850J691Q16Q53
55799E88722J110N24q39k100k934l706m549n264o012p134q357q992q893q424p551
55784E15601n879l623j635l36O41J601K364K812L090L069K406J296N05M27P32
55769E23071J111J605J989J554j38k792n985r547j3112j5875j7235j7280j6411
55756D30955j5000j3579j2646j1980j0784q932p439p116p380p061o013n145n058
55743C12822n258m890l730k376j592j615k002k188k067j916j932k114k502l082
$$ y = [817725, 801139, 785708, 771366, 758203, 746133, 734706, 723524, 712551, 701859, 691421, 681364, 672035, 663482, 655180, 646659, 638251, 630891, 625173, 620780, 616749, 612137, 606540, 600179, 593596, 587316, 581785, 577361, 574137, 571879, 570436, 570057, 571029, 573153, 575948, 579150, 582512, 585362, 587053, 587869, 588722, 589832, 590356, 589517, 587417, 584483, 580777, 576228, 570964, 564952, 557818, 549461, 540469, 531576, 523152, 515601, 509722, 506099, 504464, 504128, 504769, 506370, 508734, 511546, 514636, 517705, 520111, 521407, 521912, 522339, 523071, 524182, 525787, 527776, 529330, 529192, 526400, 520415, 510868, 497756, 481881, 464646, 447366, 430955, 415955, 402376, 389730, 377750, 366966, 358034, 350595, 343479, 336099, 329038, 323025, 317880, 312822, 307564, 302674, 298944, 296568, 294976, 293361, 291359, 289171, 287104, 285188, 283256, 281142, 278640, 275558]
55729B75558l452l107k168j353j131j295j506j666j654j190l43L03L76K20L54
55714B57946P91J260J761K445L192L677L683L108J875J95j266j903j797j599j766
55699B71602k165k421k498k770l491m207m052k830j491j088j427j362l40J035
55685B42495K047K696L228L565L632L716L951L948L388K630K173J913J468R16
55671B81766O15M88J43m33q72j130j564k229k567k130j240o50o64q83p72l10O5
55654B67633N9j69l89p24j365k048k345k405k891l992n014n239m784m340m389
55639B27598m917n600n948n605m805m233m150l994l213k112j466j545j925k104
55625A75981j912j502j226j354j684j720j373j073j038r08n37m73j088j856k139
$$ y = [275558, 272106, 268999, 266831, 265478, 264347, 263052, 261546, 259880, 258226, 257036, 256693, 256996, 257372, 257592, 257946, 258737, 259997, 261758, 264203, 267395, 271072, 274755, 277863, 279738, 279933, 278667, 276764, 274967, 273368, 271602, 269437, 267016, 264518, 261748, 258257, 254050, 249998, 247168, 245677, 244589, 243162, 241800, 241460, 242495, 244542, 247238, 250466, 254031, 257663, 261379, 265330, 269278, 272666, 275296, 277469, 279382, 280850, 281766, 282381, 282869, 283012, 282579, 281707, 280577, 279013, 276784, 274217, 272087, 270847, 270197, 269533, 268650, 267878, 267568, 267633, 267692, 267523, 267134, 266410, 265045, 262997, 260652, 258247, 255356, 251364, 246350, 241111, 236327, 231987, 227598, 222681, 217081, 211133, 205528, 200723, 196490, 192340, 188346, 185133, 183021, 181555, 180010, 178085, 175981, 174069, 172567, 171341, 169987, 168303, 166583, 165210, 164137, 163099, 162191, 161654, 161181, 160093, 158237, 156098]
55610A56098k193k494k624j887p09k48o66r79p40o13r44j021l39M28N20K28J53
55593A41970K0o96j526j501o46M7J09J07N33J008R54M78K55Q24K192L805M778
55576A52711M551L505K631K447K564K441K133K028K223K516K855L317L729L604
55562A93255K644J101l89j341j794k201k859l521l705l344k863k608k514k456
55548A67405k460k341j570q6J141J020k36j254j145l56K76O46J102J606J706J193
55532A66647K72p72j717k349k613k742k960l169l182l083l051l003k805k575k404
55517A30494j939q57L45O92k6r24j211j083j184j594j896j896j801j739j559j181
55501A12641q40q32j135j376j214p34l87m59p16o63j43N39J014J163J051Q15O20
$$ y = [156098, 153905, 151411, 148787, 146900, 146191, 145943, 145277, 144298, 143558, 142945, 142001, 140980, 140641, 141069, 141589, 141817, 141970, 141990, 141294, 139768, 138267, 137621, 137668, 137777, 137884, 138417, 139425, 140379, 140857, 141112, 141936, 144128, 147933, 152711, 157262, 160767, 163398, 165845, 168409, 170850, 172983, 175011, 177234, 179750, 182605, 185922, 189651, 193255, 195899, 197000, 196611, 195270, 193476, 191275, 188416, 184895, 181190, 177846, 174983, 172375, 169861, 167405, 164945, 162604, 161034, 160948, 162089, 163109, 162873, 161619, 160474, 160118, 160394, 161040, 162142, 163748, 165454, 166647, 166919, 166147, 164430, 162081, 159468, 156726, 153766, 150597, 147415, 144332, 141281, 138278, 135473, 132898, 130494, 128555, 127698, 128043, 128735, 128709, 127785, 126574, 125491, 124307, 122713, 120817, 118921, 117120, 115381, 113822, 112641, 111801, 110969, 109834, 108458, 107244, 106510, 106123, 105664, 104948, 104285, 104142, 104681, 105695, 106858, 107909, 108724, 109344]
55484A09344N86O63P29P44O40K64l35o85m04J73L02j58n78m87j43ll8J01N18R59
55464A12192J037N50k53o77k58N34P63K46k62k03Q9J55J06J59N9m43j010j178
55446A11606j048r40q20n90n44q44r54l50N56Q99N74J54r6k90j94N24J338J237
55428A10218K45m28p0O01O23J16k64l54l62j66M62J272J812K031K082J776Q83
55411A20477j75o25l37k6l76j343k337k702k028n12Q67J030j6j034r57j13K91
55394A10084k49j008j090m80J71M15K58j37n63o71k74K07J16n67j129j081p45
55377A03257o07n89l72p6m0j89j99q9p1R1Q35J904K360J780Q09K92L02L53J69
55358A09920j36l36k48J81O61O90J72l72m61k83l27o49q51o87k99N3K33J90o1
$$ y = [109344, 109930, 110593, 111322, 112066, 112706, 112970, 112635, 111950, 111546, 111719, 112021, 111863, 111285, 110798, 110655, 110652, 110614, 110715, 111233, 112192, 113229, 113779, 113526, 112849, 112591, 113125, 113888, 114134, 113872, 113669, 113758, 113913, 114019, 114178, 114237, 113794, 112784, 111606, 110558, 109618, 108798, 108208, 107664, 106820, 105866, 105516, 106072, 106971, 107545, 107699, 107603, 107313, 107119, 107643, 108981, 110218, 110463, 110035, 109965, 110566, 111189, 111305, 111041, 110687, 110325, 110159, 110621, 111893, 113705, 115736, 117818, 119594, 120477, 120302, 119677, 119340, 119314, 118938, 117595, 115258, 112556, 110528, 110016, 110883, 111913, 111897, 110863, 109906, 109793, 110084, 109835, 108827, 107737, 107257, 107428, 107843, 108101, 107964, 107401, 106730, 106456, 106663, 106779, 106212, 105083, 104002, 103257, 102650, 102061, 101689, 101613, 101573, 101384, 101185, 101096, 101025, 101116, 101951, 103855, 106215, 107995, 108804, 109096, 109398, 109751, 109920, 109784, 109448, 109200, 109381, 110042, 110732, 110904, 110532, 110071, 109788, 109461, 108812, 107961, 107274, 106975, 107028, 107261, 107451, 107390]
55339A07390m13p52j012j004m48O12J546J688J086M11J13j0l18p60r83q46n47
55322A05753k91q3J65L92M35K31p7k57j87J13N12P83O74J32n55r82r18m34K53
55303A05659P85Q28L90r3k82m29r19j454j260k22Q05J133J108J347J618J223J24
55286A10361r59j549j771j685j050K0Q07Q48N29M21M03O4l62j52Q12J752J950
55269A10439J498Q53J07q75j831k195j851j387j349j472r87L37J712K099J338
55254A06436L14l3L04O25N19L53N92R88P85k55j439j899j509q30k83K54R44J449
55236A07315J223L06m80l30O69J624J833J401Q77M99J01l75o97o89n05l85k88
55219A12099k6L49N18K97n3p5L55Q11P65K21k48j47L76Q17Q42L94m83j423j639
$$ y = [107390, 106977, 106225, 105213, 104209, 103761, 104373, 105919, 107607, 108693, 109104, 109217, 109207, 108889, 108129, 107146, 106300, 105753, 105462, 105379, 105544, 105936, 106371, 106602, 106525, 106268, 106081, 106194, 106706, 107489, 108163, 108295, 107740, 106758, 105840, 105406, 105659, 106444, 107272, 107662, 107569, 107287, 106858, 105939, 104485, 103225, 103003, 103808, 104941, 106049, 107396, 109014, 110237, 110361, 109402, 107853, 106082, 104397, 103347, 103367, 104174, 105022, 105551, 105972, 106375, 106439, 106077, 105925, 106737, 108489, 110439, 111937, 112790, 112897, 112022, 110191, 107996, 106145, 104758, 103409, 101937, 100950, 101287, 102999, 105098, 106436, 106750, 106717, 107021, 107646, 108165, 108518, 109110, 110098, 110883, 110628, 109189, 107290, 105781, 104951, 104668, 104922, 105866, 107315, 108538, 108844, 108364, 108034, 108703, 110327, 112160, 113561, 114438, 114937, 115038, 114663, 113966, 113277, 112772, 112387, 112099, 112073, 112422, 112940, 113237, 113184, 113109, 113464, 114275, 115040, 115261, 115013, 114866, 115242, 116059, 116901, 117295, 116812, 115389, 113750]
55200A13750o68O64Q13n94k091k136r29J27M09N40J031J423J127L44k89n30n05
55183A12486j81N77J526K041J763R87L32J30K34L45L67L74L60J79j73m21k89J74
55165A20811O33P65M98N7j92j28j00n19j175j385r34m06l02l94l88o56j548k390
55147A12247k119q40J86K09j85j76K45O84J031J205Q45r8q98q12n0N72O78N03
55129A13227K75kj62J02P27J202J087M20m63j241j601j284l32P25J175P28j28
55112A14455n46j48O62J261J456J368R90L34j88r6M03O26M52M89J031J464J193
55095A25206N25J85K98M25L23J94K82O53J176J507J296O96L24M48N65J85m49q02
55077A33037q24p25m12K34Q15Q38M81K49J28k51p18o66l1N84P73O67L98k6l07
$$ y = [113750, 113082, 113746, 114559, 113965, 111874, 109738, 108809, 108936, 109345, 109885, 110916, 112339, 113466, 113810, 113521, 112991, 112486, 112305, 112882, 114408, 116449, 118212, 119199, 119531, 119661, 119895, 120240, 120607, 120981, 121341, 121520, 121347, 120926, 120637, 120811, 121444, 122209, 122707, 122764, 122572, 122444, 122344, 121825, 120650, 119265, 118331, 117925, 117623, 117229, 116841, 116185, 114637, 112247, 110128, 109288, 109474, 109683, 109498, 109322, 109567, 110251, 111282, 112487, 113332, 113234, 112336, 111524, 111474, 112046, 112724, 113227, 113502, 113500, 113338, 113440, 114167, 115369, 116456, 116876, 116413, 115172, 113571, 112287, 111955, 112680, 113855, 114583, 114455, 113909, 113761, 114423, 115684, 117140, 118508, 119498, 119832, 119644, 119548, 119951, 120577, 121029, 121518, 122549, 124013, 125206, 125731, 125916, 126214, 126639, 126962, 127156, 127438, 128091, 129267, 130774, 132070, 132766, 133090, 133538, 134103, 134288, 133839, 133037, 132213, 131488, 131076, 131310, 132125, 132963, 133444, 133693, 133821, 133570, 132852, 132186, 132155, 132739, 133512, 134179, 134577, 134551, 134244]
55058A34244p7L33J26p27j313j100o23m99n35l95l32o10p60k61M82O52K45m6n
55039A28799j62p61j264j127n23k0J12l8l00m68k76L86J222J690J458O67k29q39
55021A28327j032q09j44Q53J654J544M45q33j388j184q59p26m37K45Q99R75N54
55004A28084J14k60q93j659j717n27J169J962J389M17J57N57P45L07k35j98M95
54987A29907J328J726J423O61M5L5M86R13J160J434J633J215j4j370j925j515
54971A37142o87Q0P04J183J342J105O89M19M80Q51J268J345R29L39k5j63l22l98
54953A46281k6O59Q37k5j384k140j754n24R46K103K428J687L22p93j191j029n28
54936A45869L87J604K519K642K272K116K414K811L031L208L549L982M256M144
$$ y = [134244, 134167, 134500, 134626, 133899, 132586, 131486, 130863, 130364, 129829, 129434, 129102, 128492, 127732, 127471, 127953, 128605, 128850, 128804, 128799, 128637, 127876, 126612, 125485, 124962, 124942, 125054, 125016, 124716, 124248, 123972, 124358, 125580, 127270, 128728, 129395, 129166, 128327, 127295, 126486, 126342, 127195, 128849, 130393, 130838, 130005, 128617, 127433, 126574, 125848, 125411, 125656, 126555, 127530, 128084, 128198, 127938, 127045, 125386, 123669, 123142, 124311, 126273, 127662, 128079, 128236, 128793, 129538, 129845, 129610, 129412, 129907, 131235, 132961, 134384, 135045, 135090, 135125, 135611, 136524, 137684, 139118, 140751, 141966, 141952, 140582, 138657, 137142, 136455, 136535, 137239, 138422, 139764, 140869, 141558, 141977, 142457, 143308, 144576, 145921, 146850, 147189, 147164, 147001, 146679, 146281, 146255, 146914, 147751, 147726, 146342, 144202, 142448, 141924, 142870, 144973, 147401, 149088, 149410, 148617, 147426, 146397, 145869, 146256, 147860, 150379, 153021, 155293, 157409, 159823, 162634, 165665, 168873, 172422, 176404, 180660, 184804]
54922A84804L554K675J976J806J956J888J332M74m12j198j814k321k993m020n107
54907A82600n723n666n048l895k362j185j052j485j290l57N8o45j198j57J958
54892A54553L404L465K864K313J942J994K767L740L915L265K787K887K798K074
54878A94768J496J742K151J757Q01K10J8o04j882l068l582l748m077m482m569
54863A76931m336m162m197m080l357k168j306j411k144k495j990j215r51j209
54849A41910j442j353j069p51n29o02r82j238r74m92m77r93j307q70n6L62J78
54832A29315j22o8K71N35N85O05P17P35M83J85K53O33P54L05l04m68j40L12P30
54813A35316J195J554J408P28M6j15J75M30L57J28J31N54J249J895K251K176J577
$$ y = [184804, 188358, 191033, 193009, 194815, 196771, 198659, 199991, 200465, 200053, 198855, 197041, 194720, 191727, 187707, 182600, 176877, 171211, 166163, 162268, 159906, 158721, 157669, 156184, 154894, 154537, 154595, 153950, 152752, 152595, 154553, 157957, 161422, 164286, 166599, 168541, 170535, 173302, 177042, 180957, 184222, 187009, 189896, 192694, 194768, 196264, 198006, 200157, 201914, 202715, 202925, 202943, 202339, 200457, 197389, 193807, 190059, 185982, 181500, 176931, 172595, 168433, 164236, 160156, 156799, 154631, 153325, 151914, 149770, 147275, 145285, 144070, 143119, 141910, 140468, 139115, 138046, 137295, 136766, 136164, 135182, 133944, 132970, 132478, 132001, 131008, 129701, 128831, 128775, 129137, 129315, 129193, 129125, 129396, 129931, 130516, 131121, 131838, 132573, 133056, 133241, 133494, 134127, 134881, 135186, 134882, 134414, 134274, 134586, 135316, 136511, 138065, 139473, 140201, 140247, 140132, 140307, 140737, 141094, 141222, 141353, 141907, 143156, 145051, 147302, 149478, 151055]
54796A51055N34m85q51m52O9Jn86r66o05K78J071J414J477J729K413L250L699
54779A63045L541L039K507K025J750K056K946L635L317K280J699K311L691M889
54765B02731N310M839L625K080P42j36q04j615k592l522m231m613m589m200l635
54750A89390l101k763k767l031l032k287j132n07p39j052p31k15l23p70m52Q93
54734A67381K210K638K596K873L348L319K741K292K289K367K237K158K351K497
54720B03297K183J443N40m73j622k659l306l677m085m477m509m102l582l185k834
54705A68952k475k243k178k104j977k002k237k346k024j380p60l25l6K11N76J150
54689A48802J623J410M61l95m22M4O9n48j102j097q61q44r39p85l70N9L68N15
$$ y = [151055, 151589, 151104, 150253, 149801, 149870, 149871, 149285, 148319, 147714, 147992, 149063, 150477, 151954, 153683, 156096, 159346, 163045, 166586, 169625, 172132, 174157, 175907, 177963, 180909, 184544, 187861, 190141, 191840, 194151, 197842, 202731, 208041, 212880, 216505, 218585, 219327, 219191, 218387, 216772, 214180, 210658, 206427, 201814, 197225, 193025, 189390, 186289, 183526, 180759, 177728, 174696, 172409, 171277, 170770, 170031, 168979, 168248, 168033, 167710, 166940, 166488, 167381, 169591, 172229, 174825, 177698, 181046, 184365, 187106, 189398, 191687, 194054, 196291, 198449, 200800, 203297, 205480, 206923, 207463, 206990, 205368, 202709, 199403, 195726, 191641, 187164, 182655, 178553, 174971, 171786, 168952, 166477, 164234, 162056, 159952, 157975, 155973, 153736, 151390, 149366, 147986, 147226, 146901, 146865, 147076, 147652, 148802, 150425, 151835, 152296, 151901, 151479, 151523, 151592, 151044, 149942, 148845, 147984, 147140, 146201, 145416, 145046, 145105, 145473, 145988]
54671A45988M41K48J95K59lp49j320r46J11P46L99k92m67k08k26p38j159r77l90
54652A40912P3K40L05L39J54k82o63o69l54l1J35K84N97R72J042O12j7k54J12
54633A43507O07O14R0n04q61j025r65m79K90P60O58M26M72M58o8p05o62J6M61
54614A43090K96M1O6k3m85p80l88L00O54Q36J341J805J357O9q69p08lL98M76N87
54594A48060M80k93j294j356m5J592K096J103m29j343j335r59p94q16o10l3N38
54577A44562O82M46J91J16J35J38J72L04O05J148J818K095J425k2j294j593j097
54560A49831n59l77l71l32l22l28j09M20R09R76P35O70R71J257J006K35l71j16
54542A54125R05J830J947J440J004Q78O77J38m98r33j193j296j023m35j85o70
$$ y = [145988, 146429, 146677, 146872, 147131, 147128, 146379, 145059, 144113, 144224, 144970, 145369, 145077, 144610, 144402, 144176, 143438, 142279, 141302, 140912, 140985, 141225, 141530, 141869, 142023, 141741, 141078, 140409, 140055, 140024, 140159, 140443, 141040, 142012, 143054, 143666, 143649, 143395, 143507, 144114, 144728, 144818, 144314, 143453, 142428, 141463, 140984, 141274, 142034, 142692, 143118, 143590, 144048, 143980, 143275, 142613, 142629, 143090, 143386, 143427, 143493, 143470, 142985, 142205, 141817, 142117, 142771, 143607, 144948, 146753, 148110, 148179, 147310, 146602, 146599, 146997, 147473, 148060, 148540, 148247, 146953, 145597, 145552, 147144, 149240, 150343, 149914, 148571, 147236, 146277, 145483, 144667, 144057, 144024, 144562, 145244, 145690, 145881, 145997, 146132, 146270, 146442, 146746, 147351, 148499, 150317, 152412, 153837, 153815, 152521, 150928, 149831, 149272, 148895, 148524, 148192, 147870, 147542, 147433, 147853, 148762, 149738, 150473, 151143, 152114, 153371, 154377, 154612, 154241, 154125, 155030, 156860, 158807, 160247, 161251, 162129, 162806, 162944, 162446, 161513, 160320, 159024, 158001, 157566, 157381, 156711]
54526A56711j233r34k7K27n80j266o95N63J056N09L6L24O57J68o97p80J35J025
54508A55199J011M06O5K87O92Q76P28K55m51j022j025m44K37N69N13K36k12p28
54490A57192r01l47P29J573J627J080N46L60L70L15J78P5O6K35Q29J941L015L117
54472A72000J921K25q35q79l11M89J436K312K616K120J087j02j174j647j007L83
54456A78634J114J78j690k814k532j736j431j579j541j111n86j92J19L92M93L09
54440A66027m2k38m6L73N78L68R5J66L90K15l76o51q2Q91J364J010K66l70p80
54421A69158r32o41J02Q06Q83L63q3L4M54O27M54K52J48pj32J15O69R25N68J40
54401A73903K86Q08J040Q86Q37J057J114P70L92L80O42Q60Q69N88o1q51j176o38
$$ y = [156711, 155478, 154544, 154517, 154744, 154164, 152898, 152203, 152766, 153822, 154331, 154367, 154691, 155348, 155516, 154819, 154039, 154174, 155199, 156210, 156616, 156681, 156968, 157660, 158536, 159264, 159519, 159068, 158046, 157021, 156577, 156814, 157383, 157896, 158132, 157920, 157192, 156291, 155944, 156673, 158246, 159873, 160953, 161499, 161859, 162229, 162544, 162722, 162797, 162863, 163098, 163927, 165868, 168883, 172000, 173921, 174146, 173311, 172432, 172121, 172610, 174046, 176358, 178974, 181094, 182181, 182079, 180905, 179258, 178251, 178634, 179748, 179926, 178236, 175422, 172890, 171154, 169723, 168144, 166603, 165492, 164906, 164714, 164833, 165225, 165718, 166027, 165985, 165747, 165701, 166074, 166652, 167020, 167115, 167281, 167671, 167886, 167510, 166859, 166777, 167668, 169032, 170042, 170308, 169938, 169158, 168226, 167585, 167687, 168493, 169376, 169739, 169656, 169690, 170144, 170771, 171225, 171477, 171625, 171618, 171486, 171601, 172270, 173195, 173763, 173903, 174189, 174997, 176037, 176923, 177760, 178817, 179931, 180701, 181093, 181473, 182115, 182975, 183844, 184432, 184371, 183520, 182344, 181706]
54383A81706M39J318J585J402J217J350J786K180K166J689R63K00m23n84j7J022
54367A97999J822J920J493R88O46M98M90M23O7m51o52l38Q9J15l06q87j437j888
54349B00591k137k156k093k009j742j279r54r51q96l73L58O46L31j20l87o58j126
54332A85045j564j617j257p22j82K83N80O59N98M93K90p5m60n62k73J36L19K53
54314A81944K16L32L35m3o50r89p31l5M83R8j388l070l386j685Q07K134J683N16
54296A76571k23l66j72L46J031J336J119R71J178J031M3q29l16J146J803R77j51
54279A85495l61J52N46N77M06J9m38m06K75Q42O24J42K89Q46P98N3l08K62Q78
54260A90691O19l7J5Q02J299R97N00M77P42P99O29M59K06k51n43k40L50M50m6
$$ y = [181706, 182145, 183463, 185048, 186450, 187667, 189017, 190803, 192983, 195149, 196838, 197801, 198001, 197578, 196994, 196977, 197999, 199821, 201741, 203234, 204222, 204868, 205366, 205856, 206279, 206346, 205895, 205243, 204905, 204994, 205109, 204803, 203916, 202479, 200591, 198454, 196298, 194205, 192196, 190454, 189175, 188221, 187270, 186374, 186001, 186359, 187005, 187336, 187216, 186829, 186171, 185045, 183481, 181864, 180607, 179885, 179703, 179986, 180566, 181225, 181823, 182316, 182606, 182531, 182071, 181509, 181236, 181372, 181691, 181944, 182160, 182492, 182827, 182784, 182134, 181145, 180414, 180379, 180862, 180960, 179572, 176502, 173116, 171431, 172238, 174372, 176055, 176571, 176348, 175982, 175810, 176156, 177187, 178523, 179642, 180613, 181791, 182822, 182865, 182036, 181720, 182866, 184669, 185646, 185495, 185134, 185286, 185832, 186409, 186815, 186834, 186396, 185990, 186265, 187107, 187731, 187873, 188162, 189008, 189806, 189859, 189551, 189813, 190691, 191310, 191273, 191288, 192090, 193389, 194386, 194886, 195363, 196105, 196904, 197533, 197992, 198198, 197947, 197404, 197164, 197514, 197964, 197918]
54241A97918l93j63J28q3m21j63N69R21N40O4K11Q33J128N85n20j430j647j382
54223A96695j216j319j210n13L14M35l01j181j524j304q00j45M73O45J80n00p97
54206A87932o62n07m51j95L57P71O73L24K26L42J75l95q01n32J63O57P25N82L53
54187A89737j7l66l63n2P9k05n31m87j95mL9J42L64O03P79P60M00o8l2O91J330
54166A92604J006j04j052j383j478j575j299m24N05P56K85m16j017j502j819j809
54150A81278j413p22J35R34J355J273R89Q87R49Q73N77K98J84J18O2K40P88J450
54132A90255J870K017K046J906J513J205J497K291K814K634K242K332K873L422
54118B20917L882M299M236L182J603O88R16J571J835J592R46j40j344j958j961
$$ y = [197918, 197525, 197362, 197490, 197407, 196986, 196823, 197392, 198313, 198853, 198917, 199128, 199961, 201089, 201674, 201154, 199724, 198077, 196695, 195479, 194160, 192950, 192437, 192751, 193186, 192885, 191704, 190180, 188876, 188076, 187931, 188404, 189049, 189229, 188729, 187932, 187270, 186763, 186312, 186117, 186474, 187245, 187918, 188242, 188468, 188810, 188985, 188590, 187789, 187257, 187420, 188077, 188802, 189384, 189737, 189720, 189354, 188991, 188939, 189018, 188813, 188282, 187795, 187600, 187596, 187635, 187777, 188141, 188744, 189523, 190283, 190683, 190615, 190583, 191274, 192604, 193610, 193506, 192454, 191071, 189593, 188018, 186719, 186295, 186800, 187556, 187841, 187425, 186408, 184906, 183087, 181278, 179865, 179143, 179278, 180212, 181567, 182840, 183829, 184716, 185665, 186538, 187115, 187413, 187597, 187715, 187777, 188017, 188805, 190255, 192125, 194142, 196188, 198094, 199607, 200812, 202309, 204600, 207414, 210048, 212290, 214622, 217495, 220917, 224799, 229098, 233334, 236516, 238119, 238807, 239723, 241294, 243129, 244721, 245667, 245527, 244183, 242225, 240264]
54103B40264k296l431m378m035k896k385k903l473l222k256j187n42o48j312j690
54088B03610j157j66M21N94R79J495J356M41l54l99p1J09K79P38J358J814J956
54071B13003J669R50K13n5L3N0J31P08J341R84l46j321j162o33n34l56O13J796
54053B17084K097J574J245J528J927K037K012K103K371K798L204L242K936K869
54039B49027L424M181M543M549M535M479M297M255M417M152L037J834J638K367
54025C00735K988L016K753K223J028n90j554j253l64j0n54j495k155k277k177
54010C00314k359k782k834k292j927k462l331l373k566k086k561l239l204k554
53996B62744j905j403p92j15J98j02o88r27n66j41l32q74o37Q04K348K787K471
$$ y = [240264, 237968, 234537, 230159, 226124, 223228, 220843, 217940, 214467, 211245, 208989, 207802, 207260, 206612, 205300, 203610, 202453, 202287, 202708, 203302, 204281, 205776, 207132, 207573, 207219, 206820, 206749, 206858, 207137, 207875, 209233, 211047, 213003, 214672, 215622, 215835, 215780, 215813, 215863, 215994, 216702, 218043, 219027, 218681, 217360, 216198, 215565, 215031, 214675, 215288, 217084, 219181, 220755, 222000, 223528, 225455, 227492, 229504, 231607, 233978, 236776, 239980, 243222, 246158, 249027, 252451, 256632, 261175, 265724, 270259, 274738, 279035, 283290, 287707, 291859, 294896, 296730, 298368, 300735, 303723, 306739, 309492, 311715, 312743, 312153, 310599, 309346, 308982, 308972, 308418, 306923, 304768, 302491, 300314, 297955, 295173, 292339, 290047, 288120, 285658, 282327, 278954, 276388, 274302, 271741, 268502, 265298, 262744, 260839, 259436, 258644, 258529, 258727, 258625, 257937, 257010, 256444, 256303, 255971, 255097, 254460, 255264, 257612, 260399, 262870]
53979B62870K519K951K841K103J712K033K239J838J506J758J930J176k95j731
53965B85450k846l671l987l715l297l068k722j946j069n26j97J25K33J02L66J393
53949B60625K384K349J604J312J801K345K506K668L101L416L257K807K311J718
53935B94204J122R89J580K482L038L027K669K276K139K513L400M379M919M853
53921C33590M498M291M398M666M865M927M924M922M995N268N667N719M958L585
53907D01273K387J853J680J362Q29L07j25m97p52r59j438k330l303l991m483m980
53891C86833n293n174m902m966n323n491n365n316n483n513n197m857m927n371
53877C13655n771n740n180m274l354k645k183k021k286k790k892k235j431j457
$$ y = [262870, 265389, 268340, 271181, 273284, 274996, 277029, 279268, 281106, 282612, 284370, 286300, 287476, 287181, 285450, 282604, 278933, 274946, 271231, 267934, 264866, 262144, 260198, 259129, 258603, 258406, 258531, 258764, 258866, 259232, 260625, 263009, 265358, 266962, 268274, 270075, 272420, 274926, 277594, 280695, 284111, 287368, 290175, 292486, 294204, 295326, 296315, 297895, 300377, 303415, 306442, 309111, 311387, 313526, 316039, 319439, 323818, 328737, 333590, 338088, 342379, 346777, 351443, 356308, 361235, 366159, 371081, 376076, 381344, 387011, 392730, 397688, 401273, 403660, 405513, 407193, 408555, 409384, 409691, 409566, 409069, 408317, 407358, 405920, 403590, 400287, 396296, 391813, 386833, 381540, 376366, 371464, 366498, 361175, 355684, 350319, 345003, 339520, 334007, 328810, 323953, 319026, 313655, 307884, 302144, 296964, 292690, 289336, 286691, 284508, 282487, 280201, 277411, 274519, 272284, 270853, 269396]
53863B69396k319k945k550j569r77j100j501j737j774j764j761j700j520j247
53849B44932r89p85n37j73K06M95P92J166J329R09R0m43l19P5J56j24l75l03L5
53830B46137L78M37N4n36q21n17L7K94J88J83O47J392J939K067J943J817J741
53813B57380J704J838K311L051L678L838L468K761J979J442J500K320L676N096
53799B96042O093O296N611M440L515L190L120K807K307K009J866J403M78m38q77
53784C37862q95q38r37j234j656k055k422l040m027m751m300k775j504j589k665
53769C03174l596l909l960l963l685l084k582k459k433k117j590j226j213j451
53755B65906j768j966j827j308p15n05p62j015o81K52J099J165M94k33n55o74
$$ y = [269396, 267077, 264132, 261582, 260013, 259036, 257936, 256435, 254698, 252924, 251160, 249399, 247699, 246179, 244932, 243943, 243158, 242621, 242448, 242654, 243149, 243941, 245107, 246436, 247345, 247435, 246992, 246673, 246748, 246904, 246780, 246405, 246102, 246137, 246515, 246952, 247006, 246470, 245649, 245132, 245169, 245463, 245651, 245834, 246481, 247873, 249812, 251879, 253822, 255639, 257380, 259084, 260922, 263233, 266284, 269962, 273800, 277268, 280029, 282008, 283450, 284950, 287270, 290946, 296042, 302135, 308431, 314042, 318482, 321997, 325187, 328307, 331114, 333421, 335430, 337296, 338699, 339177, 338739, 337862, 336967, 336129, 335192, 333958, 332302, 330247, 327825, 324785, 320758, 316007, 311707, 308932, 307428, 305839, 303174, 299578, 295669, 291709, 287746, 284061, 280977, 278395, 275936, 273503, 271386, 269796, 268570, 267357, 265906, 264138, 262172, 260345, 259037, 258322, 257817, 257055, 256040, 255359, 255611, 256710, 257875, 258369, 258136, 257581, 256907]
53739B56907r08r97m13P28J597J575R39L67J03p5k14l3N49J145J370J363J520
53722B65523J830J844J385J011J439K607L575L441K221P79PJ79R81J931K705L139
53706B94597L175K865K437K143K048K000J926J950K173K534K966L547M131M153
53692C32645L249J976J337J426J258K55p58p27jR9p66j466j011J47Q77Q05L73
53675C39718J7j17J11O51R79N01o24j587j895j829j859k027k055j723j014j62
53659C27085L17pr35j689j699j043j20P57J263J092N01L28J006J842J871J194
53643C31763Q45J367K183K510K276J951J823J820J780J661J577J685J927K037
53629C57205J982K241L158M147M154L019J737J147J060R59R04J152J469J533J621
$$ y = [256907, 255999, 255002, 254589, 255317, 256914, 258489, 259428, 259795, 259898, 259823, 259609, 259576, 260125, 261270, 262640, 264003, 265523, 267353, 269197, 270582, 271593, 273032, 275639, 279214, 282655, 284876, 285655, 285662, 285841, 286822, 288753, 291458, 294597, 297772, 300637, 303074, 305217, 307265, 309265, 311191, 313141, 315314, 317848, 320814, 324361, 328492, 332645, 335894, 337870, 339207, 340633, 341891, 342146, 341388, 340661, 340660, 340759, 339993, 338527, 337516, 337663, 338540, 339345, 339718, 339735, 339618, 339729, 340380, 341359, 341860, 341236, 339649, 337754, 335925, 334066, 332039, 329984, 328261, 327247, 327085, 327402, 327395, 326460, 324771, 323072, 322029, 321909, 322666, 323929, 325021, 325522, 325850, 326856, 328698, 330569, 331763, 332608, 333975, 336158, 338668, 340944, 342895, 344718, 346538, 348318, 349979, 351556, 353241, 355168, 357205, 359187, 361428, 364586, 368733, 372887, 375906, 377643, 378790, 379850, 380809, 381713, 382865, 384334, 385867, 387488]
53614C87488K150K782K807K297K103K626L310L559L436L202K775K063J380J078
53600D23056J018R00Q13J034J442J578J285R28Q26Q11M71k88j107j510j300p09
53584D29248k16j99o49j243j667j880j970j833j222k23N37M47l72j218j681j972
53568D13887k271k263j673q91n53o16m35K82J078J423J389J333J260Q26m3q06
53552D11927p07M56J985K772K290J039O4O9R97K240L070L127K727K612L199M237
53536D42104N265O145O919P497P804Q005Q178Q053P571P349P997R209J0199J0906
53522E53201J1920J3303J4438J5129J5950J7118J7913J7774J7252J7268J7935
53511G29201J8748J9500K0333K1189K1813K2162K2319K2225K1889K1594K1554
$$ y = [387488, 389638, 392420, 395227, 397524, 399627, 402253, 405563, 409122, 412558, 415760, 418535, 420598, 421978, 423056, 424074, 424974, 425787, 426821, 428263, 429841, 431126, 432054, 432880, 433691, 434162, 433874, 432767, 431257, 429957, 429248, 429032, 428833, 428184, 426941, 425274, 423394, 421424, 419591, 418369, 418146, 418683, 419130, 418758, 417540, 415859, 413887, 411616, 409353, 407680, 406789, 406236, 405620, 405185, 405467, 406545, 407968, 409357, 410690, 411950, 412776, 412733, 411927, 411220, 411676, 413661, 416433, 418723, 419762, 419826, 419895, 420892, 423132, 426202, 429329, 432056, 434668, 437867, 442104, 447369, 453514, 460433, 467930, 475734, 483739, 491917, 499970, 507541, 514890, 522887, 532096, 542295, 553201, 565121, 578424, 592862, 607991, 623941, 641059, 658972, 676746, 693998, 711266, 729201, 747949, 767449, 787782, 808971, 830784, 852946, 875265, 897490, 919379, 940973, 962527]
53500I62527K1554K1347K1124K1131K1131K0714J9930J9121J8339J7426J6498
53489A180842J5873J5662J5854J6582J7779J8765J8743J7724J6426J5377J4574
53478A364201J3926J3420J2828J1779J0218Q370O317M029J858M14j91o15j620
53465A444934l407n601p604q995r954j1170j3000j4842j5840j5970j5913j5945
53453A306693j5761j5404j5500j6300j7179j7435j7107j6581j5952j5127j4215
53442A130132j3393j2668j1971j1265j0426r402q513q110p734o338l615n59J632
53429A027770K737L234L571M134N389P331R191J0354J1235J2617J4447J5954J6786
53416A144750J7314J7956J8904K0367K2402K4498K5952K6767K7625K8917L0383
$$ y = [962527, 984081, 1005428, 1026552, 1047683, 1068814, 1089528, 1109458, 1128579, 1146918, 1164344, 1180842, 1196715, 1212377, 1228231, 1244813, 1262592, 1281357, 1300100, 1317824, 1334250, 1349627, 1364201, 1378127, 1391547, 1404375, 1416154, 1426372, 1434742, 1441059, 1445088, 1446946, 1447360, 1447169, 1446554, 1444934, 1441527, 1435926, 1428322, 1419327, 1409373, 1398203, 1385203, 1370361, 1354521, 1338551, 1322638, 1306693, 1290932, 1275528, 1260028, 1243728, 1226549, 1209114, 1192007, 1175426, 1159474, 1144347, 1130132, 1116739, 1104071, 1092100, 1080835, 1070409, 1061007, 1052494, 1044384, 1036650, 1030312, 1026697, 1026138, 1027770, 1030507, 1033741, 1037312, 1041446, 1046835, 1054166, 1063357, 1073711, 1084946, 1097563, 1112010, 1127964, 1144750, 1162064, 1180020, 1198924, 1219291, 1241693, 1266191, 1292143, 1318910, 1346535, 1375452, 1405835]
53405A405835L1764L3182L4736L6279L7796L9526M1410M2946M3867M4568M5529
53394A837438M6693M7764M8786M9889N0699N0556M9335M7661M6231M5157M4162
53383B364371M3120M2101M0976L9268L6548L2913K8871K4857K1007J7359J3970
53372B705361J0675P038K767j882o387j0543j4559j8675k2865k6840l0198l2732
53360B561160l4773l7132m0330m3908m6738m8076m8122m7606m7097m6712m6267
53349B074399m5533m4498m3349m2231m1100l9898l8716l7616l6506l5346l4344
53338A635262l3657l3078l2283l1219k9955k8377k6351k4094k2050k0522j9631
53327A334045j9309j9002j7828j5623j3482j2536j2509j2301j1699j1387j1407
$$ y = [1405835, 1437599, 1470781, 1505517, 1541796, 1579592, 1619118, 1660528, 1703474, 1747341, 1791909, 1837438, 1884131, 1931895, 1980681, 2030570, 2081269, 2131825, 2181160, 2228821, 2275052, 2320209, 2364371, 2407491, 2449592, 2490568, 2529836, 2566384, 2599297, 2628168, 2653025, 2674032, 2691391, 2705361, 2716036, 2723074, 2725841, 2723959, 2717572, 2707029, 2692470, 2673795, 2650930, 2624090, 2593892, 2561160, 2526387, 2489255, 2448925, 2405017, 2358279, 2310203, 2262081, 2214475, 2167378, 2120666, 2074399, 2028866, 1984368, 1941019, 1898788, 1857688, 1817790, 1779074, 1741458, 1704952, 1669606, 1635262, 1601605, 1568527, 1536244, 1505025, 1475070, 1446693, 1420342, 1396248, 1374198, 1353676, 1334045, 1314736, 1295734, 1277906, 1262283, 1248801, 1236265, 1223756, 1211455, 1199756, 1188369, 1176962]
53316A176962j0892r594q376p643o536m407k041m01Q66K566M348N262N500O243
53302A151857P937R892J1532J2961J4184J4929J5437J6444J8001J9330K0037K0672
53290A333213K1552K1989K1374K0236J9535J9366J9093J8349J7177J5522J3376
53279A540782J1276R876Q955P496M904J706j168l390n261p066q793j0443j2281
53266A536593j4534j6957j8947k0195k1054k2056k3178k3906k4041k4104k4715
53255A302906k5832k6789k6991k6406k5515k4886k4750k4852k4720k4131k3285
53244A024749k2600k2390k2658k2971k2697k1682k0572k0092j9963j9157j7297
53233G92670j5309j4310j4334j4517j4227j3550j2792j2028j1183j0273r500r099
$$ y = [1176962, 1166070, 1156476, 1148100, 1140457, 1133921, 1129514, 1127473, 1127072, 1127938, 1130504, 1134852, 1140114, 1145614, 1151857, 1159794, 1169686, 1181218, 1194179, 1208363, 1223292, 1238729, 1255173, 1273174, 1292504, 1312541, 1333213, 1354765, 1376754, 1398128, 1418364, 1437899, 1457265, 1476358, 1494707, 1511884, 1527406, 1540782, 1552058, 1561934, 1570889, 1578385, 1583289, 1584995, 1583827, 1580437, 1575176, 1568110, 1559317, 1548874, 1536593, 1522059, 1505102, 1486155, 1465960, 1444906, 1422850, 1399672, 1375766, 1351725, 1327621, 1302906, 1277074, 1250285, 1223294, 1196888, 1171373, 1146487, 1121737, 1096885, 1072165, 1048034, 1024749, 1002149, 979759, 957101, 934130, 911433, 889751, 869179, 849087, 829124, 809967, 792670, 777361, 763051, 748717, 734200, 719973, 706423, 693631, 681603, 670420, 660147, 650647, 641548]
53221F41548r078r095q864q661r026r913j0560j0484j0141j0197j0582j0723j0425
53208E13799r998r666r321q756p838o618n597n475o253o947o752o087n843n957
53194D12691n704n170n293o260o973o584n682n259n230m784l802l052l058l469
53180C42371l677l587l529l557l208k062n46K45k30j217j613j445j703k718l549
53165C09975l294k316j572j280q77r0O88J007Q76O13M72M61L44j03p46j171j216
53148C01771j176j313j475j421j232j095r73q03p39q42q00l58K39N99Q00J196
53132B92378J752K048J910J589J363J342J568J957K105J618O26k65o53o37m70
53117C08231j55M61J342K074K087J171j31r76j110j071j319j616j513j085p19
$$ y = [641548, 632470, 623375, 614511, 605850, 596824, 586911, 576351, 565867, 555726, 545529, 534947, 524224, 513799, 503801, 494135, 484814, 476058, 468220, 461602, 456005, 450530, 444277, 437330, 430578, 424491, 418648, 412691, 406987, 401817, 396524, 390264, 383291, 376707, 371025, 365766, 360536, 355752, 351950, 348898, 345840, 342371, 338694, 335107, 331578, 328021, 324813, 322751, 322205, 322450, 322220, 321003, 319390, 317945, 316242, 313524, 309975, 306681, 304365, 302793, 301513, 300636, 300546, 301234, 302241, 303117, 303730, 304202, 304663, 305007, 304904, 304158, 302987, 301771, 300595, 299282, 297807, 296386, 295154, 294059, 293086, 292283, 291544, 290702, 289902, 289544, 289783, 290382, 291182, 292378, 294130, 296178, 298088, 299677, 301040, 302382, 303950, 305907, 308012, 309630, 310256, 309991, 309338, 308701, 308231, 308076, 308537, 309879, 311953, 314040, 315211, 315080, 314104, 312994, 311923, 310604, 308988, 307475, 306390, 305671]
53102C05671n62n70q38j299j502j200r18j232j804j772r81j06L38L99J87k66o35
53085B92910n84l62m52o34l28J41k95j719k696k110p00o7p21j777k149j479j92
53068B76786Q54J017M77k2j59k66n20n37j55J82J93K58O13Q07M95J34K09M39M13
53049B81218M03O50N89k74j220j198m53q7k85k04M63J043J162J242J455J285N35
53032B86324j84m09m50n48k69P06J728J890J112O8o05o57j43N08O72K02l31l34
53014B89280Q9M46N07M32M73Q17J456K054K213J984J754J576J169O81P56J494
52998C07181K006J568O53J55J07r9n14n08J96J037J358J131Q10P32Q32P91M94
52981C17930L10O71J294J273L10o28m76M61R43N13LK06Q12R85M94j80n37n18l43
$$ y = [305671, 305109, 304539, 303701, 302402, 300900, 299700, 298782, 297550, 295746, 293974, 292993, 292887, 293225, 293624, 293811, 293545, 292910, 292326, 291964, 291512, 290878, 290550, 290691, 290396, 288677, 285981, 283871, 283171, 283104, 282383, 280606, 278457, 276978, 276786, 277640, 278657, 279134, 279112, 278953, 278687, 278167, 277630, 277475, 277657, 277850, 278108, 278721, 279528, 280023, 280157, 280366, 280805, 281218, 281621, 282271, 282860, 282586, 281366, 280168, 279715, 279628, 279343, 279139, 279602, 280645, 281807, 283049, 284504, 285789, 286324, 286140, 285731, 285281, 284733, 284464, 285170, 286898, 288788, 289900, 289968, 289363, 288706, 288563, 289071, 289743, 289945, 289614, 289280, 289369, 289815, 290322, 290754, 291227, 292044, 293500, 295554, 297767, 299751, 301505, 303081, 304250, 304931, 305687, 307181, 309187, 310755, 311408, 311563, 311670, 311571, 311057, 310549, 310745, 311782, 313140, 314271, 315081, 315813, 316645, 317436, 317930, 318240, 318911, 320205, 321478, 321788, 321160, 320684, 321145, 322088, 322601, 322604, 322810, 323622, 324607, 325101, 324921, 324384, 323866, 323523]
52962C23523j71K1K11R7o60j780k305j598k50N14K35n07j199j941k730k854j796
52945C06810k70L30l91j357j405o81k85p53j399j349p25l72n58n71J63J129J352
52928B99668P06k8k81k71l21k14L41J002J000J42q29r63j28Q44J150R03P87Q78
52910C04386L92j015k268j972l32R05N97n46j185j059q57r08r09o37k63J05N49
52893B94983R47R95P49O58R20J190J142R52R86J277J599J765J650J122K69m33
52877C10771n41j20L96P80J181J690K073K035J604J097P96P60Q27P40L21l90j206
52860C22814k009k787l517m067m281l997l059j588l55l98j877l520l819k719j571
52845B83250j339j482j033q3M81L41M9j3j34n03o15K5J081J731J566P90k62j274
$$ y = [323523, 323352, 323373, 323584, 323681, 323021, 321241, 318936, 317338, 317088, 317602, 317837, 317330, 316131, 314190, 311460, 308606, 306810, 306540, 306870, 306479, 305122, 303717, 303036, 302751, 301998, 300599, 299250, 298525, 298153, 297595, 297024, 297187, 298316, 299668, 300374, 300346, 300065, 299794, 299473, 299259, 299600, 300602, 301602, 301744, 300915, 299952, 299824, 300668, 301818, 302721, 303508, 304386, 304778, 303763, 301495, 299523, 299191, 300096, 300693, 300147, 298962, 297903, 297046, 296138, 295229, 294592, 294329, 294434, 294983, 295930, 296925, 297674, 298332, 299252, 300442, 301584, 302536, 303522, 304799, 306398, 308163, 309813, 310935, 311204, 310771, 310230, 310110, 310506, 311286, 312467, 314157, 316230, 318265, 319869, 320966, 321762, 322522, 323349, 324089, 324410, 324020, 322814, 320805, 318018, 314501, 310434, 306153, 302156, 299097, 297509, 297154, 296756, 294879, 291359, 287540, 284821, 283250, 281911, 280429, 279396, 279313, 279794, 280135, 280184, 280171, 280037, 279534, 278919, 278944, 280025, 281756, 283322, 284112, 283850, 282576]
52827B82576j813j571q00j43J03J77L48N29N32L88K08J20M17J328K395K525J205
52810B88524o10j361o29N48J013N79l23j454k696l593l572k616j381n37k54k16
52794B71422%N45J127J283Q82K93p1j16J41P79J609J981J487O48K87L62J38n26
52776B82271q84m92J34L95L64K46k21j095j650j283n09k37l84j75M75R82J275
52759B79212J881K623K461J106k56m78J13M95M98P11J276J678J612J313J047Q23
52743B96115O33N65O50Q91J363J931K127J698J114J037J369J409R00L52J87J65
52727C12506j03m56m11J49P49P74kj203k112k274j874j474j329j187p25j3N42
52710C01557O32L42N3P5K88K93j06o46r30q14l67K72P68O94P0m49l79j55m58j069
$$ y = [282576, 280763, 279192, 278392, 278249, 278352, 278529, 278877, 279406, 279938, 280326, 280534, 280654, 281071, 282399, 284794, 287319, 288524, 287914, 286553, 285924, 286472, 287485, 288064, 287741, 286287, 283591, 279998, 276426, 273810, 272429, 271892, 271638, 271422, 271422, 271967, 273094, 274377, 275259, 275552, 275481, 275365, 275506, 276285, 277894, 279875, 281362, 282010, 282297, 282659, 282797, 282271, 281387, 280895, 281029, 281424, 281788, 282034, 281813, 280718, 279068, 277785, 277276, 277039, 276655, 276480, 276955, 277937, 279212, 281093, 283716, 286177, 287283, 287027, 286549, 286662, 287157, 287655, 288366, 289642, 291320, 292932, 294245, 295292, 296115, 296748, 297313, 297963, 298854, 300217, 302148, 304275, 305973, 307087, 308124, 309493, 310902, 311802, 312154, 312341, 312506, 312403, 311947, 311536, 311685, 312434, 313208, 313206, 312003, 309891, 307617, 305743, 304269, 302940, 301753, 301028, 301015, 301557, 302189, 302531, 302584, 302659, 302947, 303240, 303134, 302488, 301558, 300744, 300377, 300649, 301417, 302111, 302181, 301732, 301353, 301198, 300740, 299671]
52690B99671j060j80O92O96J1o00p16m08Q7M52L82k0k20K4K58nn03n64l2N92Q59
52669B99416Q14O89N79M77M50O11R45J223J178Q85Q39J348J903J631M54o90r74
52652C11778n15J88J027J963K414J782L36j031j805k034j792j125n02m45p15n16
52636C09008K94Q92O45j14p52j209j674j925j542o42J02J75k72o27m22K00O03
52619C02740L97j02l68m51p47j126r57k02L04L4l62L0J086J804J559O48j76l20
52601C03791K94J053J082K18o73p42j78K72M55P78J273J415R53K69j78l28l12
52584C09442k37k07j86J14Q41J525J534Q78J71j94k55l4M55P66M05l18n54k08
52566C13938r5n09o49M3P79N16n30j276j289j044r48r20q24o65l90m2L0l65p57
$$ y = [299671, 298611, 298431, 299123, 299819, 299830, 299230, 298514, 298106, 298193, 298645, 299027, 299007, 298787, 298811, 299069, 299064, 298561, 297997, 297965, 298557, 299416, 300230, 300919, 301498, 301975, 302425, 303036, 303981, 305204, 306382, 307267, 308106, 309454, 311357, 312988, 313442, 312752, 311778, 311263, 311451, 312478, 314441, 316855, 318637, 318973, 317942, 316137, 314103, 312311, 311186, 310684, 310239, 309524, 309008, 309302, 310194, 310839, 310725, 309973, 308764, 307090, 305165, 303623, 302981, 303083, 303258, 302986, 302359, 301937, 302137, 302740, 303137, 303035, 302667, 302216, 301469, 300343, 299386, 299184, 299488, 299522, 299160, 299190, 300276, 302080, 303639, 304287, 304111, 303791, 304085, 305138, 306220, 306438, 305765, 305023, 304845, 305117, 305572, 306350, 307623, 309038, 309991, 310260, 310082, 309754, 309442, 309205, 308998, 308812, 308926, 309767, 311292, 312826, 313704, 313875, 313681, 313426, 313392, 313847, 314613, 315018, 314700, 314146, 313938, 313843, 313334, 312685, 312728, 313507, 314023, 313493, 312217, 310928, 309884, 308936, 308016, 307192, 306527, 306137, 306095, 306125, 305760, 305003]
52547C05003n52O6L29q7p05r01l74P70J938K211J240j09o59l10J83N10R73J431
52529C10957J280O85O26J344J765J203N40Q41J667J858J449J504K303K837K272
52514C33131J006N7K9Q28J791J999J107n9l18L19N90l23j694k269j850j316j387
52497C31641j949k497k768k823k767k542j989j110k10L52N32N07L63J33J43Q10
52481C15826J935K681K505J819J333J181J077J054J370J828J874J475J344J953
52467C39255K759K889K264J577J285J121O99J95M7K84M40J50n35j428k501l664
52451C44837m475m430l575k574k052k026k099k030j912j874j883j843j699j358
52437C11007o71K97J101J268Q18K49j8L0K73P16J280J605J478J192J101R49K95
$$ y = [305003, 304451, 304517, 304846, 304759, 304054, 303153, 302779, 303549, 305487, 307698, 308938, 308829, 308170, 307860, 308043, 308553, 309526, 310957, 312237, 312922, 313548, 314892, 316657, 317860, 318400, 319241, 320908, 322766, 324215, 325719, 328022, 330859, 333131, 334137, 334194, 334223, 335051, 336842, 338841, 339948, 339889, 339571, 339890, 340480, 340157, 338463, 336194, 334344, 333028, 331641, 329692, 327195, 324427, 321604, 318837, 316295, 314306, 313196, 312986, 313338, 313870, 314377, 314740, 314873, 315016, 315826, 317761, 320442, 322947, 324766, 326099, 327280, 328357, 329411, 330781, 332609, 334483, 335958, 337302, 339255, 342014, 344903, 347167, 348744, 350029, 351150, 351849, 352044, 352091, 352375, 352815, 352965, 352430, 351002, 348501, 344837, 340362, 335932, 332357, 329783, 327731, 325705, 323606, 321576, 319664, 317790, 315907, 314064, 312365, 311007, 310336, 310633, 311734, 313002, 313820, 314069, 314051, 314081, 314354, 315070, 316350, 317955, 319433, 320625, 321726, 322675, 322970]
52420C22970m13J6J868L759M156L243K478K605K979K936K808L169L789L960L610
52405C63933L397L782M383M389L419J925P52K70Lp31j921k900l267l328l539l916
52389C66651m176m096l485k219o30N40R06Q78R75J099R98R46J365K010K238K001
52373C66001J859K039K185K159K338K934L589L978M165M118L399J830O2j028j244
52358C98384j030q12p69r10r53l76Q78J975K007J162N50Q70J752K491K901L222
52342D11342L570L790L754L603L696M306N240N936O150O388P298Q716R841J0285
52328D93915J0495J0860J1071J0766J0317J0411J1053J1591J1749J1981J2680
52317F16889J3477J3740J3434J3131J3220J3487J3594J3651J4086J4984J5814
$$ y = [322970, 322557, 322573, 324441, 328200, 332356, 335599, 338077, 340682, 343661, 346597, 349405, 352574, 356363, 360323, 363933, 367330, 371112, 375495, 379884, 383303, 385228, 385980, 386250, 386253, 385522, 383601, 380701, 377434, 374106, 370567, 366651, 362475, 358379, 354894, 352675, 352045, 352585, 353491, 354369, 355344, 356443, 357441, 358387, 359752, 361762, 364000, 366001, 367860, 369899, 372084, 374243, 376581, 379515, 383104, 387082, 391247, 395365, 398764, 400594, 400656, 399628, 398384, 397354, 396542, 395773, 394863, 393910, 393534, 394412, 396387, 398394, 399556, 400106, 400976, 402728, 405219, 408120, 411342, 414912, 418702, 422456, 426059, 429755, 434061, 439301, 445237, 451387, 457775, 465073, 473789, 483630, 493915, 504410, 515270, 526341, 537107, 547424, 557835, 568888, 580479, 592228, 604209, 616889, 630366, 644106, 657540, 670671, 683891, 697378, 710972, 724623, 738709, 753693, 769507]
52306G69507J6000J5597J5234J5278J5363J4858J3729J2600J2020J1800J1322
52295I23308J0294R052Q018P070N648L524J285k41r25j393k060k484k040j019
52281I58037m67r07j703j952j589j206j000m46R12K734M198M823M835M830N271
52266I76370O239P461Q496R007Q944Q615Q525R066J0188J1376J2077J2164J1913
52253A100441J1602J1307J1071J0975J0882J0332Q951O957N056L767L004K253
52241A196598J063n81k257l397l709l409k991k820k930l201l538l920m333m705
52227A155870m850m552l822l028k615k688k959l113l000k566j784p83J92J041
52213A121343J847K621L194L529L874M382M858N133N445O034O562O492O013N935
$$ y = [769507, 785507, 801104, 816338, 831616, 846979, 861837, 875566, 888166, 900186, 911986, 923308, 933602, 942654, 950672, 957742, 963390, 966914, 968199, 967958, 967033, 965640, 963580, 961096, 959056, 958037, 957570, 956663, 954960, 953008, 951419, 950213, 949213, 948767, 949679, 952413, 956611, 961434, 966269, 971099, 976370, 982609, 990070, 998566, 1007573, 1016517, 1025132, 1033657, 1042723, 1052911, 1064287, 1076364, 1088528, 1100441, 1112043, 1123350, 1134421, 1145396, 1156278, 1166610, 1175561, 1182518, 1187574, 1191341, 1194345, 1196598, 1197661, 1197080, 1194823, 1191426, 1187717, 1184308, 1181317, 1178497, 1175567, 1172366, 1168828, 1164908, 1160575, 1155870, 1151020, 1146468, 1142646, 1139618, 1137003, 1134315, 1131356, 1128243, 1125243, 1122677, 1120893, 1120110, 1120302, 1121343, 1123190, 1125811, 1129005, 1132534, 1136408, 1140790, 1145648, 1150781, 1156226, 1162260, 1168822, 1175314, 1181327, 1187262]
52199A187262O516P002O721O118O075O528O518N577M389L773L608L161K089O62
52185A255999q01k233l567m632n352n806o012n915n682n706o145o591o430n535
52171A185592m393l631l474l652l673l182k119p21N88J380J484J185J086J536
52157A168006K169K168J156l21j313j468j295j431j818j823j125k24J20j74m75
52142A162152l44k7J28L66J119K129K626K430K258K704L448L893M152M888O309
52127A198231P960R430J0812J2365J3978J5188J5596J5334J5072J5429J6228J6677
52115A362300J6497J6411J7073J7924J7819J6589J5209J4447J4123J3790J3320
52104A535502J2605J1457J0197R595R714R489Q053N887L947K261K47j959l649
$$ y = [1187262, 1193778, 1200780, 1207501, 1213619, 1219694, 1226222, 1232740, 1238317, 1242706, 1246479, 1250087, 1253248, 1255337, 1255999, 1255198, 1252965, 1249398, 1244766, 1239414, 1233608, 1227596, 1221681, 1215999, 1210293, 1204148, 1197557, 1191127, 1185592, 1181199, 1177568, 1174094, 1170442, 1166769, 1163587, 1161468, 1160747, 1161335, 1162715, 1164199, 1165384, 1166470, 1168006, 1170175, 1172343, 1173499, 1173178, 1171865, 1170397, 1169102, 1167671, 1165853, 1164030, 1162905, 1162681, 1162801, 1162627, 1162152, 1161808, 1161781, 1161909, 1162275, 1163394, 1165523, 1168149, 1170579, 1172837, 1175541, 1178989, 1182882, 1187034, 1191922, 1198231, 1206191, 1215621, 1226433, 1238798, 1252776, 1267964, 1283560, 1298894, 1313966, 1329395, 1345623, 1362300, 1378797, 1395208, 1412281, 1430205, 1448024, 1464613, 1479822, 1494269, 1508392, 1522182, 1535502, 1548107, 1559564, 1569761, 1579356, 1589070, 1598559, 1606612, 1612499, 1616446, 1618707, 1618954, 1616995, 1613346]
52091A613346m875o547q916j0861j1263j0456r738r727r757q895p195n754n564
52078A503798o356o792n873l907j961o82k9K50M62J134K571M240N299N789O525
52063A504468P723Q569Q571Q467R087J0053J0410J0065R626R134P989O152M400
52050A614714L138J757l63k849m898o348p599q757r503r810j0139j0771j1302
52037A537270j1180j0538j0117j0388j1035j1465j1586j1756j2075j2115j1513
52026A413502j0587j0052j0232j0784j1188j1316j1403j1677j2068j2278j2106
52015A289811j1656j1221j0978j0915j1033j1363j1761j1952j1936j2084j2595
52004A162317j3127j3338j3561j4442j5978j7394j8041j7984j7566j6875j5954
$$ y = [1613346, 1608471, 1601924, 1593008, 1582147, 1570884, 1560428, 1550690, 1540963, 1531206, 1522311, 1515116, 1509362, 1503798, 1497442, 1490650, 1484777, 1480870, 1478909, 1478227, 1478198, 1478448, 1478910, 1480044, 1482615, 1486855, 1492154, 1497943, 1504468, 1512191, 1520760, 1529331, 1537798, 1546885, 1556938, 1567348, 1577413, 1587039, 1596173, 1604162, 1610314, 1614714, 1617852, 1619609, 1619246, 1616397, 1611499, 1605151, 1597552, 1588795, 1579292, 1569482, 1559343, 1548572, 1537270, 1526090, 1515552, 1505435, 1495047, 1484012, 1472547, 1460961, 1449205, 1437130, 1425015, 1413502, 1402915, 1392863, 1382631, 1371847, 1360659, 1349343, 1337940, 1326263, 1314195, 1301917, 1289811, 1278155, 1266934, 1255956, 1245041, 1234008, 1222645, 1210884, 1198932, 1186996, 1174912, 1162317, 1149190, 1135852, 1122291, 1107849, 1091871, 1074477, 1056436, 1038452, 1020886, 1004011, 988057]
51993I88057j5177j5025j5603j6561j7456j7996j8166j8223j8438j8683j8455
51982G98274j7484j6095j4829j3926j3387j3141j2801j1609r177o163l730k288
51970F63644j326m30J65K52K56P77J824K899L545L556K882J822J023Q51R21O81
51954F83342L38O30J688K770L371L972N272P052Q381Q810Q835R113R610R707Q936
51939G71827P459N898M755L920K762P85j820m425o603q352r715j0571j0979j1409
51925G33532j2301j3493j4349j4479j4037j3329j2444j1406j0449r780r188q179
51913E90098o565m688l009j662n71J85M00R8l75p04q66r67j010r72j053j664l042
51896E63633m944o693p652p667p092o356n560m585l438k296j190N4J446K621L236
$$ y = [988057, 972880, 957855, 942252, 925691, 908235, 890239, 872073, 853850, 835412, 816729, 798274, 780790, 764695, 749866, 735940, 722553, 709412, 696611, 685002, 675825, 669662, 665932, 663644, 662318, 661888, 662053, 662305, 662561, 663338, 665162, 668061, 671606, 675162, 678044, 679866, 680889, 681740, 682661, 683342, 683680, 684310, 685998, 688768, 692139, 696111, 701383, 708435, 716816, 725626, 734461, 743574, 753184, 762891, 771827, 779286, 785184, 789939, 793859, 796621, 797406, 795586, 791161, 784558, 776206, 766491, 755920, 744941, 733532, 721231, 707738, 693389, 678910, 664873, 651544, 639100, 627694, 617245, 607465, 598277, 590098, 583533, 578845, 575836, 574174, 573603, 573788, 574188, 574286, 573911, 573207, 572341, 571374, 570364, 569392, 568339, 566675, 563633, 558689, 551996, 544344, 536677, 529585, 523229, 517669, 513084, 509646, 507350, 506160, 506214, 507660, 510281, 513517]
51881E13517L409L606M117M806N342N496N307N021M822M591M061L261K505J804
51867E71665P02r37k315k473j557o75n36q17r93j123j490k003k411k762l209l674
51851E45392m039m390m798n092n239n593o267o616n948m583l560l310l285k941
51837D79731k397j906j308m10M93R03P39L64J31J55L98O91P76M53k60j123j730
51820D75700j640p52M20J103J030O34M18M27L99J15m59j066j125l03P62R57J07
51803D76727o35l63K99J83o06p87L08J901K800K589J661P15L38N34N77j37j095
51786D85009j178k03Q61J369J757K392K710K238J636J786K383K546K341K597L343
51771E11587L686L325L019L280L564L240K484J631M39j292k985l952m402n015
$$ y = [513517, 516926, 520532, 524649, 529455, 534797, 540293, 545600, 550621, 555443, 560034, 564095, 567356, 569861, 571665, 572367, 571430, 569115, 566642, 565085, 564410, 563874, 563057, 562064, 560941, 559451, 557448, 555037, 552275, 549066, 545392, 541353, 536963, 532165, 527073, 521834, 516241, 509974, 503358, 497410, 492827, 489267, 485957, 482672, 479731, 477334, 475428, 474120, 473710, 474203, 475106, 475845, 476209, 476340, 476495, 476893, 477584, 478360, 478813, 478553, 477430, 475700, 474060, 473308, 473728, 474831, 475861, 476495, 476913, 477340, 477739, 477854, 477395, 476329, 475204, 474901, 475663, 476620, 476727, 476092, 475729, 476028, 476211, 475605, 474818, 475126, 477027, 479827, 482416, 484077, 484792, 485130, 485664, 486241, 486104, 485009, 483831, 483628, 484489, 485858, 487615, 490007, 492717, 494955, 496591, 498377, 500760, 503306, 505647, 508244, 511587, 515273, 518598, 521617, 524897, 528461, 531701, 534185, 535816, 536255, 534963, 531978, 528026, 523624, 518609]
51757E18609n772o027n641n285n456n812n703n018m204l618l044j920j37J497
51743D62469J930J193N69J094K254K783K417K090K497L241L617L544L347L164
51729D96209K971K824K682K282J531Q32O00O17K77n32j176j012k37K01l93j665
51713E06011k582k616k288k314k525k153j073j39j17p52j171q57N5J088J727J680
51697D91974J123N11M2m65j070j487j591j662j856j819j261n70m05q80j573k076
51681D76935k137j511k13J217K113K291K024J612J278J261J576J927K188K642
51667D93203L416M059M245M350M736M903M323L607L749M396M084K281R2j354k040
51652E38050k334k255j959j920k074j718r12r04k317l937m331l925m210n434o408
$$ y = [518609, 512837, 506810, 501169, 495884, 490428, 484616, 478913, 473895, 469691, 466073, 463029, 461109, 460972, 462469, 464399, 465592, 466161, 467255, 469509, 472292, 474709, 476799, 479296, 482537, 486154, 489698, 493045, 496209, 499180, 502004, 504686, 506968, 508499, 509331, 509931, 510548, 510825, 510293, 509117, 508105, 507868, 508069, 507676, 506011, 503429, 500813, 498525, 496211, 493686, 491533, 490460, 490321, 490204, 489452, 488281, 487424, 487479, 488567, 490294, 491974, 493097, 493608, 493650, 493185, 492115, 490628, 489037, 487375, 485519, 483700, 482439, 481869, 481464, 480584, 479011, 476935, 474798, 473287, 473074, 474291, 476404, 478695, 480719, 482331, 483609, 484870, 486446, 488373, 490561, 493203, 496619, 500678, 504923, 509273, 514009, 518912, 523235, 526842, 530591, 534987, 539071, 541352, 541444, 540090, 538050, 535716, 533461, 531502, 529582, 527508, 525790, 524878, 523974, 521657, 517720, 513389, 509464, 505254, 499820, 493412]
51637D93412o371n849n594n713n948o017n509m226k676j607j102p52n51p93j164
51622D39540r40k74k22j154k043j855r12k81l90q26j062q39j93N15Q70R96J475
51605D32405K384K976K763K418K962M437N950O753O725O040N025M302M421N276
51591D94837O180O446N714M024K083J109J617K547K396J248Q08K179M503O308
51577E41999P427Q718J0435J1865J2581J3084J3952J4969J5641J6114J7037J8505
51565G02327J9716J9779J8730J7504J6987J7276J7813J8074J8010J7873J7721
51554I01810J7130J5432J2321Q246M090L29l368p548j2047j5958j8675k0631k2732
51541H58399k5170k7177k7958k7548k6535k5286k3780k2070k0476j9161j7790
$$ y = [493412, 487041, 481192, 475598, 469885, 463937, 457920, 452411, 448185, 445509, 443902, 442800, 442048, 441497, 440704, 439540, 438600, 438326, 438104, 436950, 434907, 433052, 432140, 431859, 431469, 430643, 429581, 428742, 428549, 429064, 429934, 430930, 432405, 434789, 437765, 440528, 442946, 445908, 450345, 456295, 463048, 469773, 475813, 480838, 485140, 489561, 494837, 501017, 507463, 513177, 517201, 519284, 520393, 522010, 524557, 526953, 528201, 529009, 531188, 535691, 541999, 549426, 558144, 568579, 580444, 593025, 606109, 620061, 635030, 650671, 666785, 683822, 702327, 722043, 741822, 760552, 778056, 795043, 812319, 830132, 848206, 866216, 884089, 901810, 918940, 934372, 946693, 954939, 959029, 959358, 955990, 948442, 936395, 920437, 901762, 881131, 858399, 833229, 806052, 778094, 750546, 724011, 698725, 674945, 652875, 632399, 613238, 595448]
51530E95448j5828j3236j0655q852p991p588p122o603o302o126n634m795m236
51517D90480m318m407l606k166j316j674k451k630k251j994k034j958j554r97
51503D57124l95K68P51P14K65j11j98q7K97J145K153K622K272J447L93r34k181
51486D65545k541j882j201j391k166k790l261l871m139l342j938j294j825k366
51472D31538j837o98j62o23j459k033k294k457k597k553k060j050J48J095J823
51457D14781K735L817M407M104L528L600M353N027N277N629O567P628P820O797
51443D86070N307M476M696N300N333M581L597K740J595l26k595m180m627m531
51429E07436m683n212n761o084o181o094n848n478m908l998k845j894j462j386
$$ y = [595448, 579620, 566384, 555729, 546877, 538886, 531298, 524176, 517573, 511271, 505145, 499511, 494716, 490480, 486162, 481755, 478149, 475983, 474667, 472993, 470542, 467912, 465661, 463667, 461633, 459675, 458121, 457124, 456729, 456997, 457748, 458462, 458727, 458616, 458418, 458331, 458628, 459773, 461926, 464548, 466820, 468267, 468660, 467726, 465545, 463004, 461122, 459921, 458530, 456364, 453574, 450313, 446442, 442303, 438961, 437023, 435729, 433904, 431538, 429701, 429003, 428841, 428218, 426759, 424726, 422432, 419975, 417378, 414825, 412765, 411715, 411863, 412958, 414781, 417516, 421333, 425740, 429844, 433372, 436972, 441325, 446352, 451629, 457258, 463825, 471453, 479273, 486070, 491377, 495853, 500549, 505849, 511182, 515763, 519360, 522100, 523695, 523369, 520774, 516594, 511967, 507436, 502753, 497541, 491780, 485696, 479515, 473421, 467573, 462095, 457187, 453189, 450344, 448450, 446988, 445602]
51415D45602j330j232j184r80k87P47J463J412R48Q93J734L185M518N255N568
51400D66312N966O628P216P466P721Q613J0290J2187J3527J3981J3966J4423J6084
51387F04380J8648K0992K2410K3420K4905K6794K8259K8947K9232K9271K8775
51376H86033K7812K6901K5948K3973K0488J6197J1742O604K04o630j2507j7313
51364A009452k2036k6943l1145l4028l5920l7082l7104l5804l3824l1839k9790
51353F53937k7411k4908k2555k0154j7426j4585j2038r894q181p160o897o806
51341D75922o124m769l403k755l047l860m355l955k995k402k550k850k622j886
51327D28349j034k88J16j79j038j592j237m67n8J36P78J764K229J829J190R79
$$ y = [445602, 444272, 443040, 441856, 440876, 440589, 441336, 442799, 444211, 445159, 446052, 447786, 450971, 455489, 460744, 466312, 472278, 478906, 486122, 493588, 501309, 509922, 520212, 532399, 545926, 559907, 573873, 588296, 604380, 623028, 644020, 666430, 689850, 714755, 741549, 769808, 798755, 827987, 857258, 886033, 913845, 940746, 966694, 990667, 1011155, 1027352, 1039094, 1045698, 1045902, 1039272, 1026765, 1009452, 987416, 960473, 929328, 895300, 859380, 822298, 785194, 749390, 715566, 683727, 653937, 626526, 601618, 579063, 558909, 541483, 526898, 514860, 504966, 496785, 489625, 482728, 475922, 469798, 465029, 461626, 458871, 455824, 451964, 447609, 443654, 440659, 438257, 435707, 432857, 430235, 428349, 427315, 427027, 427143, 426964, 425926, 424334, 423097, 422630, 422572, 422708, 423486, 425250, 427479, 429308, 430498, 431477]
51311D31477J131J233J152J076J180J388J348P17m02j528k437l235l663l052j502
51296D24883l19l93q19k05J187J906J623J431J826K010J571J343J917K610K725
51281D43296K649K836K766K077J650K323L230K921J595P43P79N84m56j387j190
51266D64416k06N55P29N14p3j077k075k449k193j985k337l051l494l294k612j858
51250D39510j317j082j250j839k547k883k632k020j322n97LJ80n2k69k92m43p87
51233D20361o67L00J259J056j44j094j200j074j211j211o70Q7O55J208J923K334
51217D21912K005J358J183J567J970K147K324K593K731K652K529K340J859J206
51203D50376R76J507K347K723K353J598Q96L46j74p37j261j615j651j284o92l65
$$ y = [431477, 432608, 433841, 434993, 436069, 437249, 438637, 439985, 440702, 440300, 438772, 436335, 433100, 429437, 426385, 424883, 424564, 424171, 423352, 423147, 424334, 426240, 427863, 429294, 431120, 433130, 434701, 436044, 437961, 440571, 443296, 445945, 448781, 451547, 453624, 455274, 457597, 460827, 463748, 465343, 466086, 466865, 467449, 466993, 465606, 464416, 464210, 464765, 465494, 466008, 465935, 464858, 462783, 460334, 458141, 456156, 453819, 450768, 447274, 443980, 441368, 439510, 438193, 437111, 435861, 434022, 431475, 428592, 425960, 423940, 422618, 422021, 422024, 422204, 422152, 421883, 421591, 421148, 420361, 419694, 419994, 421253, 422309, 422165, 421071, 419871, 418797, 417586, 416375, 415705, 415792, 416447, 417655, 419578, 421912, 423917, 425275, 426458, 428025, 429995, 432142, 434466, 437059, 439790, 442442, 444971, 447311, 449170, 450376, 451352, 452859, 455206, 457929, 460282, 461880, 462776, 463122, 462948, 462211, 460950, 459335, 457684, 456400, 455708, 455343]
51187D55343o70j280j304k90J093J735J297M23k58p78j375j895k006j744j423
51172D46868j165q51m33n0J92L04K81J09j52l61m35l93k70o9K48P12J230J558
51154D47323J548J386J319J159N21m13q43l83K49J33o45j217j120o35r7M25O94
51137D49404L21n41j106r11l46O4L97R14J361J321R25O91Q01J068J430J911K183
51120D59887J859J246J136J638J965J659J368J818K552K483J429L41k6N2J1q3
51104D79335K14Q92J439J545J422J399J456J334R01L22j47l63l30j39K2p8m88
51087D88736q69p07J82J430K485L049L073K664K162K086K607L210L319L163L532
51072E20122M659N938O831P564Q522R488R992J0102J0268J0603J0869J1068J1503
$$ y = [455343, 454673, 453393, 452089, 451799, 452892, 454627, 455924, 456347, 456089, 455311, 453936, 452041, 450035, 448291, 446868, 445703, 444852, 444419, 444369, 444561, 444865, 445146, 445255, 445103, 444742, 444307, 443914, 443644, 443575, 443823, 444535, 445765, 447323, 448871, 450257, 451576, 452735, 453256, 452843, 452000, 451617, 451866, 451999, 451354, 450137, 449017, 448382, 448285, 448710, 449404, 449725, 449184, 448078, 447167, 446821, 446885, 447282, 448196, 449557, 450878, 451803, 452494, 453295, 454363, 455793, 457704, 459887, 461746, 462992, 464128, 465766, 467731, 469390, 470758, 472576, 475128, 477611, 479040, 479381, 479355, 479407, 479418, 479335, 479549, 480441, 481880, 483425, 484847, 486246, 487702, 489036, 489937, 490259, 490112, 489749, 489419, 489280, 489302, 489224, 488736, 487867, 487160, 487342, 488772, 491257, 494306, 497379, 500043, 502205, 504291, 506898, 510108, 513427, 516590, 520122, 524781, 530719, 537550, 545114, 553636, 563124, 573116, 583218, 593486, 604089, 614958, 626026, 637529]
51059F37529J2122J2364J1876J1062J0589J0525J0173Q802O406L789J917J102
51047G38256Q75O06O9o64j574k645l609m237m768n688p032q224q771q707q299
51032F75588p631o627n292l757k292j424j664k903m149m251k814m50J844L493
51018F37671M607N589O465O793O311N476N041N132N183M771M065L359K623J774
51004G04860R96M20j91j076j922k083j302RJ149J626J472J251J718L208N345P413
50988G22893Q915R859J0663J1848J3502J5039J5781J5872J6219J7408J9085K0654
50976H97738K1967K3082K3846K4364K5332K7229K9454L1052L2132L3773L6453
50965A206422L9375M1531M2792M3666M4506M5322M6046M6580M6734M6324M5266
$$ y = [637529, 649651, 662015, 673891, 684953, 695542, 706067, 716240, 725042, 731448, 735237, 737154, 738256, 739131, 739737, 739806, 739142, 737568, 734923, 731314, 727077, 722309, 716621, 709589, 701365, 692594, 683887, 675588, 667957, 661330, 656038, 652281, 649989, 648565, 646901, 643998, 639849, 635598, 632784, 632334, 634178, 637671, 642278, 647867, 654332, 661125, 667436, 672912, 677953, 683085, 688268, 693039, 697104, 700463, 703086, 704860, 705856, 706276, 706085, 705009, 703087, 701004, 699702, 699711, 700860, 702486, 703958, 705209, 706927, 710135, 715480, 722893, 731808, 741667, 752330, 764178, 777680, 792719, 808500, 824372, 840591, 857999, 877084, 897738, 919705, 942787, 966633, 990997, 1016329, 1043558, 1073012, 1104064, 1136196, 1169969, 1206422, 1245797, 1287328, 1330120, 1373786, 1418292, 1463614, 1509660, 1556240, 1602974, 1649298, 1694564]
50954A694564M3562M1367L8953L6461L3751L0793K7956K5519K3148K0396J7555
50943B034025J5307J3600J1743R613P862O587M779J679k179n946r763j4182j8873
50930B054252k2966k6417k9989l3882l7413m0179m2656m5280m7706m9418n0550
50919A627796n1492n2099n1792n0305m7934m5165m2347l9658l7079l4387l1399
50908A144139k8239k5259k2715k0620j8867j7368j6074j4896j3728j2514j1341
50897I42518j0307r297q017o455n066m233l646k554p80R55J840J895J858K409
50883I01120L659N196O398O898P007P497Q700J0097J1078J1915J3371J5425J7102
50870A025463J7819J8265J9488K1568K3808K6003K8673L1995L5269L7905M0448
$$ y = [1694564, 1738126, 1779493, 1818446, 1854907, 1888658, 1919451, 1947407, 1972926, 1996074, 2016470, 2034025, 2049332, 2062932, 2074675, 2084288, 2092150, 2098737, 2103516, 2105195, 2103016, 2097070, 2087307, 2073125, 2054252, 2031286, 2004869, 1974880, 1940998, 1903585, 1863406, 1820750, 1775470, 1727764, 1678346, 1627796, 1576304, 1524205, 1472413, 1422108, 1374174, 1329009, 1286662, 1247004, 1209925, 1175538, 1144139, 1115900, 1090641, 1067926, 1047306, 1028439, 1011071, 994997, 980101, 966373, 953859, 942518, 932211, 922914, 914897, 908442, 903376, 899143, 895497, 892943, 892163, 893118, 894958, 896853, 898711, 901120, 904779, 909975, 916373, 923271, 930278, 937775, 946475, 956572, 967650, 979565, 992936, 1008361, 1025463, 1043282, 1061547, 1081035, 1102603, 1126411, 1152414, 1181087, 1213082, 1248351, 1286256, 1326704]
50859A326704M3930M8435N2910N6575O0007O4423P0114P6033Q0982Q4845Q8385
50848B053343R2025R5250R7336R8307R8852R9424R9711R9028R6977R3685Q9640
50837C113578Q5324Q0817P5665O9352O1948N4095M6376L8979L2052K5936K0768
50826C704890J6332J2535R641P540N295K090j675n055q196j2397j8411k5614l3275
50813C653700m1740n1654o2628p3520q3742r3399j02214j09230j13850j16531
50803B805192j18043j18431j17106j13806j09027j03414r7063q9602q0963p1770
50793A785967o2886n4728m7248m0480l4676k9832k5519k1452j7958j5547j4148
50782A421493j3146j2040j0735r309p881o800o608p552r267j1005j2157j2551
$$ y = [1326704, 1370634, 1419069, 1471979, 1528554, 1588561, 1652984, 1723098, 1799131, 1880113, 1964958, 2053343, 2145368, 2240618, 2337954, 2436261, 2535113, 2634537, 2734248, 2833276, 2930253, 3023938, 3113578, 3198902, 3279719, 3355384, 3424736, 3486684, 3540779, 3587155, 3626134, 3658186, 3684122, 3704890, 3721222, 3733757, 3743398, 3750938, 3756233, 3758323, 3756648, 3751593, 3743397, 3731000, 3712589, 3686975, 3653700, 3611960, 3560306, 3497678, 3424158, 3340416, 3247017, 3144803, 3035573, 2921723, 2805192, 2687149, 2568718, 2451612, 2337806, 2228779, 2125365, 2028302, 1938700, 1857737, 1785967, 1723081, 1668353, 1621105, 1580625, 1545949, 1516117, 1490598, 1469146, 1451188, 1435641, 1421493, 1408347, 1396307, 1385572, 1376263, 1368382, 1361582, 1354974, 1347422, 1338155, 1327150, 1314993, 1302442]
50770A302442j2391j1966j1413j0757j0203j0138j0703j1435j1546j0559q596
50759A182735o230m149k759j836o27J468M382P579J0623J3353J5728J7905K0314
50746A258486K3336K6796L0029L2429L3906L4907L6237L8574M1864M5235M7800
50735A649599M9406N0449N1212N1810N2440N3084N3133N1920M9637M7089M4598
50724B204377M1811L8645L5552L2627K9196K4835K0101J5722J1570P138K597j294
50712B462877m156o206p620q278q205p761p240o647n957n389n285n914p412r813
50698B366994j3092j7204k2024k7287l2746l8401m4221m9655n3913n6883n9269
50687A952299o1423o2516o1399n7954n3060m7556m1820l6172l0876k5729k0291
$$ y = [1302442, 1290051, 1278085, 1266672, 1255915, 1245712, 1235574, 1224871, 1213436, 1201890, 1191331, 1182735, 1176505, 1172356, 1169597, 1167761, 1167134, 1168602, 1172984, 1180563, 1191186, 1204539, 1220267, 1238172, 1258486, 1281822, 1308618, 1338647, 1371076, 1404982, 1439889, 1476126, 1514700, 1556564, 1601799, 1649599, 1699005, 1749454, 1800666, 1852476, 1904916, 1958000, 2011133, 2063053, 2112690, 2159779, 2204377, 2246188, 2284833, 2320385, 2353012, 2382208, 2407043, 2427144, 2442866, 2454436, 2461574, 2464171, 2462877, 2458721, 2452515, 2444895, 2436617, 2428412, 2420651, 2413411, 2406764, 2400807, 2395418, 2390133, 2384219, 2376807, 2366994, 2353902, 2336698, 2314674, 2287387, 2254641, 2216240, 2172019, 2122364, 2068451, 2011568, 1952299, 1890876, 1828360, 1766961, 1709007, 1655947, 1608391, 1566571, 1530399, 1499523, 1473794, 1453503]
50676A453503j4647r437n065j335K032N018P582R888J2036J3969J5685J7179J8135
50663A524543J8154J7429J6734J6597J6911J7417J8067J8727J9152J9618K0878
50652A724227K3073K5209K6384K7049K8378L0698L3269L5424L7152L8557L9549
50641B068969M0283M1206M2382M3217M3211M2652M2201M2007M1555M0211L7711
50630B525605L4232L0240K6241K2501J8998J5610J2190Q458M128p11n525r866
50618B682101j3769j7393k0422k2194k2425k1515k0147j8888j8271j8749k0203
50607B468125k1795k2834k3773k5828k9497l3965l8230m2380m7081n2093n6091
50596B074558n8156n8873n9467o0294o0628n9782n7813n5170n2053m8431m4419
$$ y = [1453503, 1438856, 1429419, 1424354, 1423019, 1425051, 1430069, 1437651, 1447539, 1459575, 1473544, 1489229, 1506408, 1524543, 1542697, 1560126, 1576860, 1593457, 1610368, 1627785, 1645852, 1664579, 1683731, 1703349, 1724227, 1747300, 1772509, 1798893, 1825942, 1854320, 1885018, 1918287, 1953711, 1990863, 2029420, 2068969, 2109252, 2150458, 2192840, 2236057, 2279268, 2321920, 2364121, 2406128, 2447683, 2487894, 2525605, 2559837, 2590077, 2616318, 2638819, 2657817, 2673427, 2685617, 2694075, 2698203, 2697492, 2691967, 2682101, 2668332, 2650939, 2630517, 2608323, 2585898, 2564383, 2544236, 2525348, 2507077, 2488328, 2468125, 2446330, 2423496, 2399723, 2373895, 2344398, 2310433, 2272203, 2229823, 2182742, 2130649, 2074558, 2016402, 1957529, 1898062, 1837768, 1777140, 1717358, 1659545, 1604375, 1552322, 1503891, 1459472]
50585A459472m0276l6174l2157k8360k5003k2068j9044j5292j0828o526l350j329
50573A219065M61K907O046R288J2119J4311J5756J6481J6817J7226J7920J8818
50561A367215J9767K0637K1296K1791K2481K3645K4950K5774K6121K6739K8102
50550A628518K9668L0630L1060L1800L3274L5005L6452L7789L9533M1684M3731
50539B019144M5514M7658N0974N5609O0959O6162P0557P3865P6365P8852Q1939
50528B727598Q5242Q7637Q8496Q8293Q7658Q6252Q3237P8640P3478O8393O2781
50517C617705N5520M6141L5079K3250J1704J198q389j7877k7620l6765m4146m9572
50505C606228n3735n7012n8998n9150n7311n3585m8271m1958l5289k8529k1827
$$ y = [1459472, 1419196, 1383022, 1350865, 1322505, 1297502, 1275434, 1256390, 1241098, 1230270, 1223744, 1220394, 1219065, 1219526, 1222433, 1228479, 1237767, 1249886, 1264197, 1279953, 1296434, 1313251, 1330477, 1348397, 1367215, 1386982, 1407619, 1428915, 1450706, 1473187, 1496832, 1521782, 1547556, 1573677, 1600416, 1628518, 1658186, 1688816, 1719876, 1751676, 1784950, 1819955, 1856407, 1894196, 1933729, 1975413, 2019144, 2064658, 2112316, 2163290, 2218899, 2279858, 2346020, 2416577, 2490442, 2566807, 2645659, 2727598, 2812840, 2900477, 2988973, 3077266, 3164924, 3251176, 3334413, 3413053, 3486531, 3554924, 3617705, 3673225, 3719366, 3754445, 3777695, 3789399, 3790597, 3782208, 3764331, 3736711, 3699946, 3655800, 3606228, 3552493, 3495481, 3436483, 3377333, 3320022, 3266437, 3218166, 3176208, 3140919, 3112390, 3090563]
50494C090563j5848j1535r116p996p833r089j2221j6948k2752k9619l7674m6530
50482B863402n5555o4509p3347q1551q8300r3128r5938r6495r4616r0799q6069
50471A943095q1020p5480o9195o2443n5731m9322m3254l7497l1962k6583k1477
50460A389131j6795j2431q160m011j86L362O779R829J2193J4217J6623J9252K0929
50447A450732K1037K0469K0376K0534J9890J8303J6777J5969J5324J3912J1440
50436A644763Q233M794J701m89j685k338k799k784j739L82K975N373P416R402
50422A673205J1615J4009J6378J8724K1324K4386K7829L1423L4904L7825L9668
50411A951290M0385M0656M1180M1853M1950M0962L8888L5846L1871K7097K1675
$$ y = [3090563, 3074715, 3063180, 3054064, 3046068, 3038235, 3029146, 3016925, 2999977, 2977225, 2947606, 2909932, 2863402, 2807847, 2743338, 2669991, 2588440, 2500140, 2407012, 2311074, 2214579, 2119963, 2029164, 1943095, 1862075, 1786595, 1717400, 1654957, 1599226, 1549904, 1506650, 1469153, 1437191, 1410608, 1389131, 1372336, 1359905, 1351745, 1347734, 1347548, 1350910, 1357689, 1367518, 1379711, 1393928, 1410551, 1429803, 1450732, 1471769, 1492238, 1512614, 1533148, 1553038, 1571341, 1588118, 1604087, 1619411, 1633323, 1644763, 1652996, 1657790, 1659491, 1659002, 1657317, 1654979, 1652180, 1649396, 1647657, 1648039, 1651014, 1656387, 1663803, 1673205, 1684820, 1698829, 1715207, 1733931, 1755255, 1779641, 1807470, 1838893, 1873797, 1911622, 1951290, 1991675, 2032331, 2073511, 2115364, 2157314, 2198276, 2237164, 2273010, 2304881, 2331978, 2353653]
50400B353653J5609R071K800k462p019j2042j8136k4628l0547l5637m0011m3412
50388B167239m5487m6466m6856m6574m4999m1827l7476l2630k7784k3195j8889
50377A755056j4645j0394o543l706k057j350j441k394m041n972q160j1146j5288
50364A667919k0093k4606k8278l1181l3518l5309l6488l7032l6878l5926l4295
50353A314315l2451l0965l0092k9598k8980k7860k6176k4090k1797j9417j6962
50342A025927j4378j1642q873o366m407l019j845k93J951M513O529P507P869Q357
50328A011830R037R239Q586P644P343Q031R353J0739J1728J2115J2114J2243J2690
50315A142692J3003J2711J2071J1736J1961J2514J3261J4165J4844J4812J4368
$$ y = [2353653, 2369262, 2378333, 2381133, 2378671, 2371652, 2359610, 2341474, 2316846, 2286299, 2250662, 2210651, 2167239, 2121752, 2075286, 2028430, 1981856, 1936857, 1895030, 1857554, 1824924, 1797140, 1773945, 1755056, 1740411, 1730017, 1723474, 1719768, 1717711, 1716361, 1714920, 1712526, 1708485, 1702513, 1694353, 1683207, 1667919, 1647826, 1623220, 1594942, 1563761, 1530243, 1494934, 1458446, 1421414, 1384536, 1348610, 1314315, 1281864, 1250899, 1220807, 1191209, 1162229, 1134369, 1108193, 1084103, 1062306, 1042889, 1025927, 1011549, 999907, 991034, 984668, 980261, 977242, 975397, 975104, 977055, 981568, 988097, 995604, 1003473, 1011830, 1020867, 1030106, 1038692, 1046336, 1053679, 1061710, 1071063, 1081802, 1093530, 1105645, 1117759, 1130002, 1142692, 1155695, 1168406, 1180477, 1192213, 1204174, 1216688, 1229949, 1244114, 1258958, 1273770, 1288138]
50304A288138J4565J5920J7588J8202J7257J5350J3344J1623J0042Q207N846L006
50292A439088j62l802q213j3207j7922k1565k3982k5281k5272k3760k1160j8157
50280A236605j4905j1079o817l022m79R80K151L554N157O765Q280R554J0360J0662
50266A257766J0796J1154J1699J1927J1404J0229Q898P866P242O817O171M968
50254A366937L325J876J098O71j90j735l429m777n947p267q578r462r819r798
50240A312905r445q848q402q415q548q200p440o995p344q340r754j1551j3380
50227A196243j4431j4307j3634j3392j3821j4384j4561j4232j3513j2621j1937
50216A045410j1806j2156j2562j2684j2512j2185j1735j1094j0269r421q773q405
$$ y = [1288138, 1302703, 1318623, 1336211, 1354413, 1371670, 1387020, 1400364, 1411987, 1422029, 1430236, 1436082, 1439088, 1438926, 1435124, 1426911, 1413704, 1395782, 1374217, 1350235, 1324954, 1299682, 1275922, 1254762, 1236605, 1221700, 1210621, 1203804, 1200782, 1200303, 1201283, 1203434, 1206988, 1212145, 1218910, 1227190, 1236744, 1247104, 1257766, 1268562, 1279716, 1291415, 1303342, 1314746, 1324975, 1333873, 1341739, 1348981, 1355798, 1361969, 1366937, 1370262, 1372138, 1373236, 1373907, 1373717, 1371982, 1368553, 1363776, 1357829, 1350562, 1341984, 1332522, 1322703, 1312905, 1303460, 1294612, 1286210, 1277795, 1269247, 1261047, 1253607, 1246612, 1239268, 1230928, 1221174, 1209623, 1196243, 1181812, 1167505, 1153871, 1140479, 1126658, 1112274, 1097713, 1083481, 1069968, 1057347, 1045410, 1033604, 1021448, 1008886, 996202, 983690, 971505, 959770, 948676, 938407, 928986, 920213, 911808]
50204I11808q168p920p754p781p727p110o019n219n197n430n072m140l380l119
50190H27772k921k479k119k140k197j827j221r76j194j352j033l81J72L60K27
50175H08691Nl8J83M80O46P65J117J819K713L626M460N137N660O253P175Q294
50159H56986R227R955J0961J2460J3895J4658J5067J6068J7938J9800K0686K0589
50147A038290K0231K0077J9998J9740J9269J8645J7874J6917J5671J3890J1419
50136A232021Q571O056M330L146J848n5k601n497q318j0780j2992j5304j7766
50123A182659j9823k0840k0764k0044j9003j7674j6247j5170j4606j4081j3027
50112I91380j1462r844q484p384o602o288o314o251n821n163m551m110l898l977
$$ y = [911808, 903640, 895720, 887966, 880185, 872458, 865348, 859329, 854110, 848913, 843483, 838411, 834271, 830891, 827772, 824851, 822372, 820253, 818113, 815916, 814089, 812868, 811892, 810698, 809346, 808313, 807932, 808104, 808464, 808691, 808696, 808658, 808841, 809321, 809967, 810732, 811849, 813668, 816381, 820007, 824467, 829604, 835264, 841517, 848692, 856986, 866213, 876168, 887129, 899589, 913484, 928142, 943209, 959277, 977215, 997015, 1017701, 1038290, 1058521, 1078598, 1098596, 1118336, 1137605, 1156250, 1174124, 1191041, 1206712, 1220602, 1232021, 1240592, 1246648, 1250978, 1254124, 1255972, 1255917, 1253316, 1247819, 1239501, 1228721, 1215729, 1200425, 1182659, 1162836, 1141996, 1121232, 1101188, 1082185, 1064511, 1048264, 1033094, 1018488, 1004407, 991380, 979918, 970074, 961590, 954206, 947604, 941316, 935002, 928751, 922930, 917767, 913216, 909106, 905208, 901231]
50098I01231m231m401m472m698n024m832l748k392j710j669j255J08J798K939
50084H67644L538M179N035N784O242O569O901P314Q038R198J0334J0772J0539
50071I62087J0344J0476J0301R191P533O285N879N942N890N394M405L181K226
50058A049134J763J427P27k03p94q51p29o67m00L37J362K275K970L651M610O013
50042A070625P689R081R768J0155J1231J3406J5912J7708J8601J9196J9991K0909
50030A244272K1553K1479K0363J8387J6371J5066J4307J3238J1390R049O557L788
50018A415820O96k165m145n408o878r264j2429j5709j8574k0807k2287k2987k3232
50005A252631k3705k4782k5875k5820k4112k1525j9229j7505j5767j3743j2028
$$ y = [901231, 897000, 892599, 888127, 883429, 878405, 873573, 869825, 867433, 865723, 864054, 862799, 862907, 864705, 867644, 871182, 875361, 880396, 886180, 892422, 898991, 905892, 913206, 921244, 930442, 940776, 951548, 962087, 972431, 982907, 993208, 1002399, 1009932, 1016217, 1022096, 1028038, 1033928, 1039322, 1043727, 1046908, 1049134, 1050897, 1052324, 1053051, 1052848, 1052054, 1051203, 1050474, 1049807, 1049407, 1049744, 1051106, 1053381, 1056351, 1060002, 1064612, 1070625, 1078314, 1087395, 1097163, 1107318, 1118549, 1131955, 1147867, 1165575, 1184176, 1203372, 1223363, 1244272, 1265825, 1287304, 1307667, 1326054, 1342425, 1357491, 1371798, 1385036, 1396426, 1405475, 1412032, 1415820, 1416516, 1414351, 1410206, 1404798, 1397920, 1388656, 1376227, 1360518, 1341944, 1321137, 1298850, 1275863, 1252631, 1228926, 1204144, 1178269, 1152449, 1128337, 1106812, 1087583, 1070078, 1054311, 1040568, 1028540]
49994A028540j1317j1521j1963j2098j1807j1163j0300r444q885q826r384j0453
49982I01379j1507j1759j0857r347q194p821p811p532o818o036n604n511n315
49969G97267m627l566k592j891j181k60N95J023J083J063R72P13O30J363L048
49954G93640M997O390O987P019O659N846M562L043J694P88J59o98k030l448m432
49939H31176n110o070p309q022p743p199p438q407r052q710p773o871o054n108
49925G30310m135l352k636j738q36l24p6O04K116L971N337N923O097O278O524
49910G54063O668O607O431O385O730P460Q117Q091P162N745M505L775L330K644
49896H37713J371l32j996l297m261n011n547n971o636p727q842r398r358r112
$$ y = [1028540, 1017223, 1005702, 993739, 981641, 969834, 958671, 948371, 938927, 930042, 921216, 911832, 901379, 889872, 878113, 867256, 857909, 849715, 841894, 834083, 826551, 819733, 813697, 808093, 802582, 797267, 792640, 789074, 786482, 784591, 783410, 783150, 783745, 784768, 785851, 786914, 787886, 788599, 789229, 790592, 793640, 798637, 805027, 812014, 819033, 825692, 831538, 836100, 839143, 840837, 841625, 841784, 841086, 839056, 835608, 831176, 826066, 819996, 812687, 804665, 796922, 789723, 782285, 773878, 764826, 756116, 748343, 741472, 735418, 730310, 726175, 722823, 720187, 718449, 717613, 717289, 717213, 717817, 719933, 723904, 729241, 735164, 741261, 747539, 754063, 760731, 767338, 773769, 780154, 786884, 794344, 802461, 810552, 817714, 823459, 827964, 831739, 835069, 837713, 839084, 838752, 836756, 833459, 829198, 824187, 818640, 812669, 806033, 798306, 789464, 780066, 770708, 761596]
49882G61596q703p803o514n512n079m685l911l173k906k594j429M05J979L029
49868G14700M175N666O797O945O495O270O518O936P274P460P369O886O238N876
49854H05605N990O281O223N504M235K716J048p87k470l431l716m308n888p619
$$ y = [761596, 752893, 745090, 738576, 733064, 727985, 723300, 719389, 716216, 713310, 710716, 709287, 709692, 711671, 714700, 718875, 724541, 731338, 738283, 744778, 751048, 757566, 764502, 771776, 779236, 786605, 793491, 799729, 805605, 811595, 817876, 824099, 829603, 833838, 836554, 837602, 836815, 834345, 830914, 827198, 822890, 817002, 809383]
$$ [...]
##END NTUPLES=NMR SPECTRUM
##END=
