##TITLE=AC1640_CTIAH13373_8569490_Fnc7o7APd1
##JCAMPDX= 6.0         $$ Bruker NMR JCAMP-DX V2.0
##DATA TYPE= NMR SPECTRUM
##DATA CLASS= NTUPLES
##ORIGIN= BRUKER
##OWNER= Administrator
$$ 1.72 TOPSPIN		Version 2.1
$$ 2014-04-10 17:15:41.977 -0700  Administrator@X
$$ Compression mode = diff/dup
##.OBSERVE FREQUENCY= 400.02188249412
##.OBSERVE NUCLEUS= ^1H
##.ACQUISITION MODE= SIMULTANEOUS (DQD)
##.ACQUISITION SCHEME= undefined
##.AVERAGES= 8
##.DIGITISER RES= 22
##SPECTROMETER/DATA SYSTEM= spect
##.PULSE SEQUENCE= zg30
##.SOLVENT NAME= COFFEE_meoh
##.SHIFT REFERENCE= INTERNAL, COFFEE_meoh, 1, 14.98509
##AUDIT TRAIL= $$ (NUMBER, WHEN, WHO, WHERE, PROCESS, VERSION, WHAT)
$$ ##TITLE= Audit trail, TOPSPIN		Version 2.1
$$ ##JCAMPDX= 5.01
$$ ##ORIGIN= Bruker BioSpin GmbH
$$ ##OWNER= Administrator
$$ $$ E:\/data/COFFEE/nmr/AC1640_CTIAH13373_8569490_Fnc7o7APd1/10/pdata/1/auditp.txt
$$ ##AUDIT TRAIL=  $$ (NUMBER, WHEN, WHO, WHERE, PROCESS, VERSION, WHAT)
(   1,<2014-04-10 17:15:34.509 -0700>,<Administrator>,<X>,<go>,<TOPSPIN 2.1>,
      <created by zg
	started at 2014-04-10 17:14:27.620 -0700,
	POWCHK enabled, PULCHK disabled,
       configuration hash MD5:
       C8 4E 4E 5D D3 5C D8 9E 9F 52 82 E0 59 8A DE 15
       data hash MD5: 64K
       98 5D CC 88 AC 62 D6 B6 DD D8 92 70 5F 60 8D 12>)
(   2,<2014-04-10 17:15:37.712 -0700>,<Administrator>,<X>,<proc1d>,<TOPSPIN 2.1>,
      <Start of raw data processing
       efp LB = 0 FT_mod = 6 PKNL = 1 PHC0 = 0 PHC1 = 0 SI = 32K 
       data hash MD5: 32K
       41 34 1D CA E4 B6 83 22 DA D6 65 DD 2F EE 16 9A>)
(   3,<2014-04-10 17:15:38.149 -0700>,<Administrator>,<X>,<proc1d>,<TOPSPIN 2.1>,
      <pk PHC0 = 92.35657 PHC1 = 0 
       data hash MD5: 32K
       EA 5E 96 EE 6E 9B 9E 92 8A 84 64 73 09 93 3C 63>)
(   4,<2014-04-10 17:15:38.352 -0700>,<Administrator>,<X>,<proc1d>,<TOPSPIN 2.1>,
      <abs ABSG = 1 
       data hash MD5: 32K
       D8 F0 D9 F9 83 8E 4B 21 42 0B 90 F0 F8 0F 9E D4>)
(   5,<2014-04-10 17:15:38.431 -0700>,<Administrator>,<X>,<proc1d>,<TOPSPIN 2.1>,
      <abs ABSG = 2 
       data hash MD5: 32K
       46 20 8B BD 1C 89 32 35 CD CC 93 F1 8A 11 2D 45>)
(   6,<2014-04-10 17:15:38.602 -0700>,<Administrator>,<X>,<proc1d>,<TOPSPIN 2.1>,
      <abs ABSG = 3 
       data hash MD5: 32K
       48 52 25 08 6D DA 1E E3 3F E8 60 05 23 8E B5 96>)
(   7,<2014-04-10 17:15:38.806 -0700>,<Administrator>,<X>,<proc1d>,<TOPSPIN 2.1>,
      <abs ABSG = 4 
       data hash MD5: 32K
       BC 3D 6D 81 92 E4 7C 4A 60 BA CD 02 E3 C0 40 8A>)
(   8,<2014-04-10 17:15:38.868 -0700>,<Administrator>,<X>,<proc1d>,<TOPSPIN 2.1>,
      <abs ABSG = 5 
       data hash MD5: 32K
       83 89 FC 92 9C 26 BB 90 5C 23 84 BC 10 92 18 9E>)
$$ ##END=
$$ 
$$ $$ hash MD5
$$ $$ F5 24 25 F6 43 D0 55 C9 C4 EC CD 85 B6 15 8A 8D
##$RELAX= 
##$RELAX= 
##$RELAX= 
##$RELAX= 
##$RELAX= 
##$RELAX= 
##$RELAX= 
$$ Bruker specific parameters
$$ --------------------------
##$DU= <E:\>
##$EXPNO= 10
##$NAME= <AC1640_CTIAH13373_8569490_Fnc7o7APd1>
$$ [...]
150 150 150 150 150 150 150 150
##$TP07= 0
##$TPNAME0= <>
##$TPNAME1= <>
##$TPNAME2= <>
##$TPNAME3= <>
##$TPNAME4= <>
##$TPNAME5= <>
##$TPNAME6= <>
##$TPNAME7= <>
##$TPOAL= (0..7)
0.5 0.5 0.5 0.5 0.5 0.5 0.5 0.5
##$TPOFFS= (0..7)
0 0 0 0 0 0 0 0
##$TUNHIN= 0
##$TUNHOUT= 0
##$TUNXOUT= 0
##$USERA1= <user>
##$USERA2= <user>
##$USERA3= <user>
##$USERA4= <user>
##$USERA5= <user>
##$V9= 5
##$VALIST= <valist>
##$VCLIST= <CCCCCCCCCCCCCCC>
##$VD= 0
##$VDLIST= <DDDDDDDDDDDDDDD>
##$VPLIST= <PPPPPPPPPPPPPPP>
##$VTLIST= <TTTTTTTTTTTTTTT>
##$WBST= 1024
##$WBSW= 4
##$XGAIN= (0..3)
0 0 0 0
##$XL= 0
##$YL= 0
##$YMAX_a= 626382
##$YMIN_a= -532870
##$ZGOPTNS= <>
##$ZL1= 120
##$ZL2= 120
##$ZL3= 120
##$ZL4= 120
##$ABSF1= 14.98509
##$ABSF2= -5.573092
##$ABSG= 5
##$ABSL= 3
##$ALPHA= 0
##$AQORDER= 0
##$ASSFAC= 0
##$ASSFACI= 0
##$ASSFACX= 0
##$ASSWID= 0
##$AUNMP= <proc_prof1d_extract_pilot.lims>
##$AXLEFT= 0
##$AXNAME= <>
##$AXNUC= <1H>
##$AXRIGHT= 0
##$AXTYPE= 0
##$AXUNIT= <>
##$AZFE= 0.1
##$AZFW= 0.1
##$BCFW= 0
##$BC_mod= 0
##$BYTORDP= 0
##$COROFFS= 0
##$CY= 15
##$DATMOD= 1
##$DC= 0
##$DFILT= <>
##$DTYPP= 0
##$F1P= 0
##$F2P= 0
##$FCOR= 0.5
##$FTSIZE= 32768
##$FT_mod= 6
##$GAMMA= 0
##$GB= 0
##$INTBC= 1
##$INTSCL= 1
##$ISEN= 128
##$LB= 0
##$LEV0= 0
##$LPBIN= 0
##$MAXI= 10000
##$MC2= 0
##$MEAN= 0
##$ME_mod= 0
##$MI= 0
##$NCOEF= 0
##$NC_proc= -8
##$NLEV= 6
##$NOISF1= 0
##$NOISF2= 0
##$NSP= 0
##$NTH_PI= 0
##$NZP= 0
##$OFFSET= 14.98509
##$PC= 1
##$PHC0= 92.35657
##$PHC1= 0
##$PH_mod= 1
##$PKNL= yes
##$PPARMOD= 0
##$PPDIAG= 0
##$PPIPTYP= 0
##$PPMPNUM= 2147483647
##$PPRESOL= 1
##$PSCAL= 4
##$PSIGN= 0
##$PYNMP= <proc.py>
##$REVERSE= no
##$SF= 400.02
##$SI= 32768
##$SIGF1= 0
##$SIGF2= 0
##$SINO= 400
##$SIOLD= 32768
##$SPECTYP= <>
##$SREGLST= <1H.CDCl3>
##$SSB= 0
##$STSI= 32768
##$STSR= 0
##$SW_p= 8223.68421052631
##$SYMM= 0
##$S_DEV= 0
##$TDeff= 65536
##$TDoff= 0
##$TI= <>
##$TILT= no
##$TM1= 0
##$TM2= 0
##$TOPLEV= 0
##$USERP1= <user>
##$USERP2= <user>
##$USERP3= <user>
##$USERP4= <user>
##$USERP5= <user>
##$WDW= 1
##$XDIM= 32768
##$YMAX_p= 456462833
##$YMIN_p= -742026
##$CURPLOT= <Network HP LaserJet P1505>
##$CURPRIN= <$Network HP LaserJet P1505>
##$DFORMAT= <normdp>
##$LAYOUT= <+/1D_H.xwp>
##$LFORMAT= <normlp>
##$PFORMAT= <normpl>
##$SURQMSG= 1
$$ End of Bruker specific parameters
$$ ---------------------------------
##NTUPLES= NMR SPECTRUM
##VAR_NAME=  FREQUENCY,     SPECTRUM/REAL,   SPECTRUM/IMAG
##SYMBOL=    X,             R,               I
##VAR_TYPE=  INDEPENDENT,   DEPENDENT,       DEPENDENT
##VAR_FORM=  AFFN,          ASDF,            ASDF
##VAR_DIM=   32768,         32768,           32768
##UNITS=     HZ,            ARBITRARY UNITS, ARBITRARY UNITS
##FACTOR=    0.250966925370066, 1,           1
##FIRST=     8223.43324360094, 50150,        -235211
##LAST=      0,             -109350,         -148565
##MIN=       0,             -742026,         0
##MAX=       8223.43324360094, 456462833,    0
$$ Real data points
##PAGE= N=1
##DATA TABLE= (X++(R..R)), XYDATA
$$ [...]
23889 -84297 -90349 -91604 125991 18104 -221916 -156960 223924 64671 31922 -125416 -98147
23878 -98147 -95544 -214527 -60816 57204 -105076 4305 -300361 -154733 24385 -113692 172494
23866 198202 85993 -47898 7825 -16361 -140492 129150 67079 107911 380558 -153300 144774
23854 43459 -62300 -371534 127751 -242928 235767 248469 112033 -536751 -38355 -94859
23844 -94859 -83486 -15784 -111128 -385657 -66687 155019 -135720 -225188 57598 48367 -101915
23832 314040 -186858 106529 -174462 45894 -145278 -130043 -129687 95497 -325980 152487 22996
23820 -28047 -187923 145789 271963 -163549 7891 -235117 -291195 45902 142619 -48604 -135222
23809 -135222 -346317 -119070 76176 326078 16541 -305355 -130964 196996 -43824 -196158
23799 -196158 -27537 188117 -59586 -62732 104049 66662 450006 116931 -64516 -14341 298795
23787 53493 161294 -21594 -198745 112924 189438 -35198 203102 54973 49089 178126 -82362
23775 108902 -72074 141611 -229548 166017 56829 -159125 -145812 -112024 353014 -189117
23764 -124194 -68752 36501 27123 -137738 36667 -159051 225047 260621 149652 20560 241958
23753 241958 398742 -175143 -126708 76187 -38729 -210598 246429 -345617 144950 -152423
23742 -248867 276581 -301033 51151 99325 -127615 -24754 85333 44103 -116243 165349
23731 60714 -103473 -160441 -122033 -55479 -23192 -133771 -39749 -72560 51563 -290464 288356
23719 -72858 -154116 382862 -36339 -131121 40522 -250297 -98502 -48156 251171 -48820 -95171
23708 -95171 185006 148768 -11835 339898 367886 -194975 358238 70326 132372 -45073 29428
23696 16932 -248640 28641 93275 176230 38571 158952 -168808 -66507 -19046 2 -275800 -194799
23684 -194799 -65488 100078 -396517 -128223 227097 369888 -313459 -18297 26486 176596
23674 176596 77363 -4007 -165783 53937 156555 -21896 381280 -81539 76723 -548509 68673
23662 -20179 -128294 -211816 -91748 -231967 -112796 -86626 -197926 -11134 -209284 41649 -124444
23650 -113093 181620 -199309 -65748 127395 262067 -152792 -71943 57626 -18092 243823
23639 313421 -136030 -76050 -130765 38072 67870 81531 -262837 32617 221724 -306563 -398498
23628 -398498 84034 69092 -49604 -219000 -182832 286290 146302 -140698 315558 271221
23618 271221 36291 -261253 -8927 -19421 -247646 -147745 242459 -72948 -145238 -81568 198932
23606 -119445 -55986 65958 -10179 -125126 -39608 -125559 -69894 246945 -154666 204853 145376
23595 145376 -117124 124793 80051 210865 63351 269897 -38951 200298 -6390 154996
23584 102569 40316 -108837 146269 108139 191922 74804 98106 127501 93223 230111 -298726
23572 -20256 -85004 -60806 12708 33643 -149401 -287754 30039 -20273 -76843 257398 -239417
23560 -357305 239430 72964 -204124 -199440 86257 32729 -34518 -366768 -40135 -101379 -154339
23549 -154339 18320 85384 227442 -135471 -107329 52389 -9906 -59451 188178 -327731 8518
23537 286098 7208 311658 -4459 -70401 -95641 161202 63262 160481 -179592 -187068 102843
23525 34150 -129134 157550 69773 -20996 74957 -75197 -183467 419396 38833 52160 -416348
23513 -72728 278865 85608 -654 152014 -209702 -91797 51839 -84213 -278052 47092 -280984
23501 108106 -322101 367883 150615 98849 -56038 91943 58391 -50198 -228029 60893 -206908
23489 41699 51825 -86455 -112599 -81786 -178185 -369260 -230519 262829 110750 242358 -156400
23477 -56373 38727 149269 -187158 175016 50843 5225 -298153 -183702 323160 -4944 -77502
23466 -77502 -139571 -340717 164761 -101515 -15910 169647 52415 -181824 231710 85577
23455 55619 85237 392540 16442 -218347 39153 79725 130839 -152 -355532 -82331 127726
23443 -32139 114301 -223850 72162 -56616 -64378 135622 75761 188240 61723 -104356 124435
23431 1127 -295279 -305839 -179837 -284277 11717 116081 110847 -84152 -265869 198073 141974
23420 141974 117741 -63810 228349 304702 -267823 -216962 -88438 -59146 85360 -144706 126934
23408 66668 -42100 71211 -75604 -363245 -28319 206772 279966 36630 -302054 -53646 1435
23396 -164536 -112597 -209197 -112610 -43680 80609 221999 -274293 -442566 -76603 -110457 19287
23384 -189982 47443 -153926 449 -64816 286553 80413 -265954 -112776 179365 -234573 -114367
23372 75530 -232069 -19897 -7101 -257239 125027 -82810 -280907 115373 22031 -152580 104266
23360 -147023 -181534 43766 -521878 -80739 -184887 -43168 53457 -380285 -167583 -167481 -9125
23348 -164359 -133448 -190190 20439 -86731 -230594 -10974 -321236 -46307 89451 161072 -161676
23336 -270669 -132413 18480 308412 60834 233771 55627 -93733 -215218 203007 -17680
23325 -75422 20774 -101354 -88578 12456 45330 -90939 -123198 308583 16301 109201 -26863
23313 204600 98020 -49483 -73068 121259 -35055 -239505 137256 -104489 -116493 143407
23302 -102798 -10132 -197282 144322 -26967 16953 -12904 -119110 331024 13267 221165
23292 221165 -113775 -37334 -405766 -73897 -116612 170579 -117365 -307251 304276 78695
23281 -229826 293162 -282573 12808 -95707 -55104 101984 -63071 -95106 -255684 -244070 -68693
23269 276839 -91386 125878 44343 -108981 -2494 -113423 -124367 -226170 -79015 166538 -20839
23257 -260381 -63684 -36480 36116 64881 107435 -38428 -153925 208880 41230 152036 -163818
23245 45247 -108131 41783 -58439 -106611 47269 227159 148171 72995 -166824 -79435 8403
23233 126897 259384 5794 36045 -130461 -73171 14115 -249900 895 176656 11826 -90675
23221 -122721 158540 114990 -55164 -205403 -17540 -108793 -31013 241107 -187623 -71560 24653
23209 -66309 -25720 -49940 16400 -84996 -33113 122457 107625 192260 -449328 -17662 -31741
23198 -31741 104110 -58861 -262812 27472 -91400 302680 23802 -228905 -223732 -446263 175450
23186 157832 -285691 -221175 -301207 43863 129308 146364 -23099 -100273 195815 213792 114547
23175 114547 -91370 -316462 -430283 -117980 20672 -48291 -78830 -104882 -95255 -145544 186930
23163 418998 -180507 219189 72855 10651 -138466 -128150 -36797 -262511 -169080 -159411 -174393
23152 -174393 98521 -45394 273185 -120122 154144 -217329 102756 30206 -17844 -120596
23142 -120596 -73445 -82103 126793 -119874 105169 13212 -27038 47962 43278 311290 157866
23131 157866 145991 220340 -53334 90312 210945 -36463 45626 152375 41338 82610 -48130
23119 549923 -325712 -31055 -274014 -147404 122675 -288143 -17602 271700 129886 -127848
23108 71654 -40487 -215972 278664 68632 79968 201882 108874 275731 187052 197422 56340
23096 -28353 -94839 194261 66598 56993 52072 -98031 15813 -6508 -45894 -603068 69662 -41228
23083 94299 -61187 26557 128568 -144588 3814 -23283 75107 -109231 94218 231249 203583
23072 203583 48012 238052 157036 -178972 -250461 11807 95487 -271507 -59069 35641 -240287
23060 20290 -38447 -11156 71880 127455 -108081 221187 -117705 139592 -38495 -336665 225233
23048 -120872 -375760 -26359 282841 104162 47121 -1970 -164543 60139 -223002 -110630
23037 67728 314045 168130 85752 -82443 -50660 -54881 -126388 -361969 189158 -452872 -141284
23025 194460 127954 168267 -220616 -208815 -347436 137187 324335 33194 -367728 394711
23014 -15246 6416 -17328 -156609 59234 35047 -231454 -227650 114931 -3595 -2616 181068 87071
23001 -363574 -159575 -261864 50700 -37211 -114383 252063 -34626 -227312 -46492 81676 -47859
22989 101044 50836 -84501 -38978 128961 -445792 -15670 -218783 -92986 10390 -7023 -182576
22978 -182576 222662 -227560 -43157 62900 95278 76576 -247631 -200662 -272370 -53642 98708
22966 116089 -131434 -247555 -155385 -205814 -255083 -361958 410231 -50621 -92846 45206 43852
22955 43852 383335 166314 27569 13214 1929 -185386 -277631 86036 242647 16797 15652
22944 15652 250569 348971 -153942 -15636 79398 -263517 -416647 42910 153958 -304749
22933 14171 152413 24344 21288 -267520 -193384 -77557 -171551 -2690 -131672 331935 -151221
22921 -266376 -201511 -129426 -105328 -561377 -114237 -180325 -414112 -143692 -91035 -163583 -554863
22910 -554863 200890 205630 -37718 -303042 164143 351144 98906 6998 -7324 -59872 -17960
22898 -27857 106699 71706 103716 60228 97109 48869 35308 151774 70616 9447 167444
22887 167444 17161 171917 30349 85284 -210296 -80203 30038 -108918 205831 38611 -41627
22875 42832 6481 91317 -120574 114864 -346743 73367 57947 262537 97224 83827 -217663
22863 -110202 16106 131731 189009 46071 -283652 15841 359592 174722 4729 153394 -128722
22851 -215457 -126263 99153 -187893 224099 -93671 119619 47712 -16836 -76214 -186418 313067
22839 5667 -20608 -128239 -50066 102310 -23369 52623 483 314248 37393 -227414 25559
22827 130539 166160 162788 -148895 104797 209544 87647 204070 -227563 -266407 -175390 -2268
22815 -112813 -30951 -210992 -543437 -151142 -280002 -132449 40572 -223790 21612 70046
22805 70046 -32552 -1964 370219 -190110 163019 57113 -68383 -167011 -8853 208877 67660
22793 -133408 -80272 181407 -293347 -187780 -68479 130566 105427 61306 -254440 223987
22782 -270669 -87407 -470049 258065 -148369 -95248 130293 -158462 -373450 -161720 122693
22771 -48308 -242266 194605 164784 131881 28167 55370 -103439 239275 -409336 -94874 97613
22759 -175960 18304 -113022 -97892 -268266 55588 213148 -26240 -31840 214992 -135496 173263
22747 -132 10774 -264312 174035 90410 -221928 131633 -100131 -125629 13040 -320527 121897
22735 270698 -203800 -132323 -76203 159557 -552150 -19751 70857 -96665 199281 -200387
22724 -20334 9229 -91541 19531 -146425 -158198 -94782 47131 128869 220999 72231 -276720
22712 -336567 -234877 -178081 -133884 -130204 45067 80220 216663 -153331 262878 -292004 -484476
22701 -484476 54568 -27035 -6871 14338 -82262 -1291 299324 -38253 -260359 -5264 -186384
22690 -186384 164079 -154521 520 -187930 -77339 161303 154108 -38808 115103 14806 68844
22679 68844 -247464 -221315 11848 -71320 666 -170506 132292 -161885 304812 -516680 -49394
22667 94202 -119664 196979 -245050 15517 -184209 190030 119953 7707 -49376 75451 -188174
22655 -188170 -33111 -438575 -229058 20956 -38334 -122816 212558 -246305 -36928 -252797
22645 -252797 281491 179842 -270505 -117686 -8958 251117 -211586 120698 -198483 -100880
22635 -100880 -28482 181388 55376 -132059 11934 312411 16809 -88 -68786 -89492 73769
22623 34113 -150628 -86481 -60132 -261344 96473 -88032 41852 -125298 -313372 -43400 242486
22611 -81646 98456 252769 53143 -287232 19852 72081 -324242 179305 -152201 -85574 68306
22599 -58658 -658 322199 28294 -168754 -16669 51215 148382 36692 175180 245979 49320
22587 -97784 -364216 -53090 -282432 135674 -35797 85354 -13792 -22023 147524 -65119 82585
22575 186872 419780 29849 -121026 28521 -304680 -337124 -46380 201811 -62640 143856
22564 -292211 11989 17044 -281425 -264028 126666 78704 119578 -186644 155717 -46471 6596
22552 7004 325113 12194 65472 -192974 59263 75836 13068 200510 -119385 -119148 272523
22540 88385 -111247 25077 -26423 -537483 -130126 83455 299964 -69068 204833 -142031
22529 -132011 27668 79748 47322 -85967 202022 167827 100535 13511 -168106 83180 233403
22518 233403 -41597 -54958 -190088 -176706 -103583 -122077 -166969 153223 -71413 -36177 -280098
22507 -280098 -47353 -211248 -77702 52416 -189806 -316358 -80144 -134971 -39454 3642 -73961
22495 -112014 199551 116691 -188871 -362541 21658 64587 -104529 -74370 -67098 -210273 54877
22483 197661 -281617 61209 -44659 68321 -363852 144791 -375743 -117980 -202353 -167565
22473 -167565 176669 54784 -22856 -26715 -211758 116805 343703 -602 -204124 -186715 177025
22461 -14207 -307676 -211933 -249190 -157571 -254671 -101661 -76480 99526 284962 15628 -141667
22449 -427368 -380207 -326129 43266 180382 257579 49781 -168118 101934 67178 238999 -308024
22437 -208525 46047 -300315 -16603 -123168 -83988 73082 127587 21269 -59453 169221 -87886
22425 -428812 94600 -36279 161484 146894 -132327 -201795 -458369 -396973 -334 -225809 138136
22413 -38393 -491726 102719 -198990 -40550 47568 -363307 -129553 -35367 -96667 -100588 -90711
22402 -90711 100243 451182 42765 -131443 -120357 11033 -119789 161783 -223299 -122307
22392 -122307 -107182 -242242 271255 -59492 159707 -118344 -178749 30593 -165994 225718
22381 145086 159071 -274300 -195518 -327579 -53942 -98699 199755 -56183 63935 -290424 -108463
22369 96012 257951 -45472 170894 85815 -95483 147615 370238 -254603 -21893 164843
22358 -271927 168562 -84720 164257 97608 -315676 -330082 -89871 114939 8829 -309731 54450
22346 410153 165669 58374 16776 -183957 254898 39995 28567 -167945 229978 -19858
22335 -232368 1105 110597 62822 -304171 33010 -171268 43114 160481 3547 462171 -159052
22323 179069 34221 -43283 50094 180952 -57464 49392 23724 -225976 31924 -205046 -132596
22312 -132596 158659 -299827 -110429 -110415 -223834 62432 75933 43046 31701 10491 -156780
22300 -242035 -115104 -73461 -79988 22879 179573 -115318 -202133 -119156 208600 -84730 -14354
22288 145475 -107936 29356 105743 -580445 163089 557293 -249710 85465 322954 49365
22277 297057 257396 22407 -191744 -38037 40462 133006 108397 -65786 276678 -189747 -21872
22265 -273215 -228100 -16161 222866 -309157 -70617 -323737 178246 117271 58924 -175613
22254 95990 -151470 -85652 -366158 -131678 1140 131184 30317 -85427 215332 -170519 -11044
22242 139480 102150 -142854 174958 83723 -140656 -133771 81652 55266 117987 -479439 202387
22230 -14121 -482076 318111 -149638 151280 260568 -58260 -74818 -412363 70364 39758
22220 39758 -144813 -291756 -370585 -104039 1887 -104106 -61402 -144077 -56338 -328781 213327
22208 29608 -18389 164208 190400 -18976 -306904 41165 221298 -119530 -238304 -280708 141004
22196 -477071 14002 131989 19680 100601 -30178 -114084 -179303 -32581 -169887 -227102 292636
22184 -472302 -346875 13648 78548 113331 255856 174128 170596 462681 -324253 171334 133976
22173 133976 -21698 -250683 -131048 10846 -4018 -22561 114157 -146059 -188486 -157134 -172562
22162 -172562 -81777 42815 -193643 15752 25402 12589 -6345 328575 -127203 -101026 -189963
22151 -189963 -77661 -68330 149713 -114709 81643 6699 -328434 26117 58532 183474 -179152
22139 95186 67880 -131683 71573 131670 -128046 -12298 132469 -8188 41820 293316 -74607
22127 182387 -49114 -225838 -273948 -471049 -98040 -154046 -21001 192937 -37270 -252232 -92570
22115 -108617 98165 -230440 3742 133340 -115687 -193024 -50505 -37625 92990 -67941 90966
22103 115089 -295495 9229 -26164 -96497 -84730 28074 -150381 -103661 -53201 -254825 -35904
22091 -60150 -333545 65357 61341 -161062 213924 -69087 143408 -112799 -38037 58809 77521
22080 77521 -325031 44173 42919 -27433 -204227 -65371 132608 -243072 -50633 -56914 -429907
22069 -429907 279783 -71678 414337 8599 -471488 291248 41513 -236386 -90930 83963 -50668
22057 -41283 -248423 -152270 74029 -110477 40274 30563 -48419 -83668 -171062 333039 -108376
22045 49964 102894 -290634 -160557 -55943 -204317 -116817 -182653 -42410 -143975 -151787 -237175
22034 -237175 73621 -227838 50185 -161193 -327354 263950 -51467 236385 17282 -220210
22023 -76613 17458 8264 -329534 -97843 -55010 87606 -92122 165649 -305679 -98385 -64656
22012 -64656 -239755 39784 247936 85098 -51939 156626 -49541 -75062 -113510 -33790 -73414
22001 -73414 -8227 -87401 -6148 -121673 -56362 104300 -56283 84778 -256638 79083 -236766
21989 17132 -242323 79334 75008 -19470 -42303 273989 140948 -13110 -164911 122929 -94176
21977 -77589 27482 -276210 -373909 -449500 45368 75277 -2346 -3394 -293617 50073 132620 -95653
21964 125564 -233879 -297737 169787 40025 -334571 226462 -208352 62982 482052 -60485
21953 -113860 -102184 -58662 -284585 -44652 -266023 142542 157673 83685 179458 -163711 185912
21941 -262551 60463 -157356 -127804 -4255 -142107 -151834 -79655 -315317 -30749 67242 -210949
21929 -145587 -6789 95990 -97089 4237 -28050 -94680 -110704 -271218 157742 -198319 108300
21917 -168444 -121696 -17511 -171122 32121 255159 -29109 133593 69799 -212837 -216214 352173
21905 -204091 -18955 -47667 -56482 -170941 122895 -67294 -245208 55420 235315 215691 -25440
21893 -66288 105051 -110827 126461 -3968 -9706 28519 305570 -331025 103349 356984 -170528
21881 -4423 180728 -289828 78158 27423 129772 38324 -176430 -78681 -308215 90292 31809
21869 -101312 61442 38307 -104943 -403384 -50816 235090 -168228 57833 -35918 -125037 -154613
21858 -154613 92309 286146 -12659 -84285 -45529 -125458 160579 -223581 -22635 188632 37259
21846 -112509 52468 -222258 -249300 -4450 161101 83114 -111203 -88549 18051 91612 -3786
21834 -72336 390901 -140553 -196052 -164120 25316 163817 -64136 -19657 119379 -175153 -82302
21822 253066 -378431 33897 -37375 64701 -150740 62502 -64555 -200855 -158066 155890 -58821
21810 -151876 20603 -92295 -348040 186506 -137884 -19883 -83192 -23989 -9101 60953 -19880
21798 392818 -99980 24781 -104724 -84264 -65796 12307 142678 300451 -196858 170595
21787 -231868 114216 328971 198671 213301 -34458 -101069 -264265 -375456 -97612 68029
21776 34081 111976 -77680 -163426 -32954 112512 79535 -45395 -319714 -339633 -23009 -168040
21765 -168040 125348 -299449 -24066 82971 47498 -120061 88132 -61704 19792 -33286 -120550
21754 -120550 -122836 -22703 -268081 -141312 -351379 -193040 -116107 45281 74809 192185 101927
21743 101927 -253680 -297176 -69792 -8897 66991 -394197 -200900 -232670 -85373 -302596 -58308
21731 -254320 179547 -348795 167353 -192249 26464 -24625 -24092 -367673 -166106 -395051
21721 -395051 -124467 -247906 -165662 -203536 -13894 -73152 -78575 39029 -186396 -297755 -187275
21710 -187275 149175 -77367 -324405 -42315 -415079 127315 278354 -297640 -204207 -234897
21700 -234897 308225 192439 -87842 -4215 30400 -433443 -8 -415856 -83873 -97234 272215
21688 404292 261194 146821 -251526 13747 -50098 62653 -6443 -23357 172909 -310934 9042
21676 -284311 -195152 -62381 -72692 205252 -9140 -163914 -55565 348714 33026 38083 181499
21665 181499 357318 270564 -87023 46823 -141537 82379 -43933 -49574 -296952 46078 -302332
21653 57452 -67041 -57597 -83475 106481 44057 91232 -174879 13477 -369942 -218034 128581
21641 111472 351795 34232 76707 69486 26083 52272 -260272 -177324 -39081 -173228 232031
21629 -105467 122411 26781 -393771 56769 13940 55687 122232 -239250 -240788 -169946 -135565
21618 -135565 307414 -10194 142989 -57939 -60408 -403575 -124215 -60179 11264 -198172 -130311
21607 -130311 -232491 -97499 203450 6027 -99991 24059 -207390 19291 -60842 76829 166879
21596 166879 -89796 -331119 -159971 -60487 -515439 -117140 -138038 -259479 -151660 117174
21585 114451 61332 -211702 63181 -91232 -361025 -239725 123754 -36294 11015 -128947
21574 -110191 5933 -50169 3358 -174113 -159236 81559 -101655 225482 148076 78748 15640
21562 323 42497 150540 -22968 117954 -285953 -176122 -102938 178649 -250856 -200422 -45673
21550 126080 52097 -15986 64358 54443 -119769 -167240 -159518 -33387 -137725 82737 -182375
21538 -48237 121286 202794 -129155 18807 -204878 144071 127976 76580 -30706 -65032 -129370
21527 -129370 34338 38050 -34971 -210386 -48050 -284482 -92064 -286342 -159832 -278014 70317
21515 13675 -164907 -151479 -369619 -257393 -124694 -90007 -98600 -255581 -21667 -69674 56744
21503 -221764 -428585 -161120 -35661 -61009 126274 6049 -378328 -137521 -224470 -32446 344772
21491 -5464 93438 13267 107322 161326 -318439 -212154 114564 40779 180733 63046 -280240
21479 -136002 115036 -35188 43567 191358 32780 -167571 -100157 -212571 40018 -293451
21468 -79800 -138515 -29090 237577 -13004 42405 -186906 -21695 -170577 8140 154068 178709
21457 178709 -332662 300460 -48263 52388 -280309 176156 153607 -103155 29546 -165961
21446 116121 44223 -313335 271651 -56802 203181 -150794 257179 351276 210471 73194
21435 40395 115066 436957 123405 237271 -145486 -104050 -227707 34942 -95105 175161
21424 7251 -85266 351447 -64525 -116905 -81119 44782 -206416 257948 -66387 202651 -249308
21412 -42105 267930 196640 191139 -321140 25063 -204585 -258390 -295745 22927 -201436 -109140
21401 -109140 -47091 -286634 -156268 -195407 29875 -75238 16622 -125319 96675 -222413 26576
21389 -228486 31967 23746 -192351 44788 56201 232709 -7685 -433252 -142848 370694 3465
21377 -45735 -199465 -59055 277909 82025 32704 -120951 109795 182100 -397500 232 -186792
21365 231000 -145358 7967 125689 -108988 -154324 -212046 -61520 9870 -13636 -117053 -116012
21354 -116012 -241094 -22443 12580 18167 -37674 -334678 255470 -412165 -43029 -233873 -354301
21343 -354301 -245875 -213673 -123498 158344 374872 -5604 -224691 87136 -272883 -96714 -364297
21332 -364297 -191569 287161 -88140 -272784 151468 -302993 101016 -212070 -364835 574519
21321 -170623 -115799 -243773 -156224 62316 -120010 -151114 119362 -90419 -201276 3648 -4540
21309 -345774 81595 -204426 104112 -368517 -68080 116050 -40844 95775 -182148 -343956
21299 -343956 57535 -112758 172940 61419 119150 22330 104255 -88536 -237527 60974 -493321
21287 -41255 124666 -22462 -95779 -47321 -283489 191507 -18559 71957 -333254 -273385 -85059
21275 77657 -143858 -27044 -150515 -112581 2296 327283 -39272 -172518 -141542 -258711 -108868
21263 -433582 -131177 78345 -129824 77748 -228489 -274049 78575 -73908 280435 -75955 -212358
21252 -212358 -37330 2319 165320 -248616 -154301 -59250 -31761 -34850 -155286 9860 12630 -421734
21239 -299835 -20664 -195619 -265384 -52232 -44983 -87517 43285 -278888 -49082 -790 -111886
21228 -111886 13953 37118 -56152 -265177 -17406 44925 205417 -376222 248959 81832 121743
21217 121743 110924 -25513 218348 17538 123683 -430455 -99203 -186350 -316112 81061 266486
21206 266486 -156695 -129684 -132728 22617 13336 283271 76347 -255879 -518 115128 -199002
21194 53904 -4012 -7924 223462 -270066 -185033 28884 -86517 190844 -85018 147535 -101139
21182 36944 -97438 -178424 -93786 -431436 -189554 -31943 48560 135212 250283 -351660 442074
21170 -100111 -141779 -45299 -37335 94686 -12957 -60783 29061 -354505 -21070 217314 27476
21158 -13005 -232496 -257022 -110347 -113707 -8773 80354 -18633 -38272 -116354 4020 -11558 -121690
21146 -121690 256179 -1788 2449 -61095 -59973 -104162 -245891 339858 -306622 141103 -110760
21134 -63642 -85142 50937 -150553 109915 -230597 78443 23192 -128976 -95490 -86285 172498
21122 -132147 -180551 -246907 106365 253166 -146242 -153970 197429 -105847 -58430 -6605 -45789
21111 -45789 50666 -179509 -268690 -44955 -53669 80017 -283435 -192630 -106222 61732 98085
21100 98085 -89721 156397 62082 130597 42770 103940 229392 -202336 -11486 75142 -213612
21088 -60458 -139937 -193856 -168698 -110262 -88425 -219485 91819 232762 131780 197864 37765
21076 19495 -128346 -18956 221704 -174762 60044 -40528 -282193 -59507 -231504 17207 -79405
21064 -110761 105572 112589 191711 -134827 7283 61729 34995 -428000 -193460 -183720 -232871
21053 -232871 -154083 -15852 106743 -45158 116498 -90010 -124814 -205817 -256887 -188256 68081
21041 -62159 45199 137398 -46735 131250 -250196 89089 -34294 -153275 54484 17072 37150
21030 37150 -100233 253666 112314 -61312 45813 76252 50244 205816 -144587 194990
21019 423919 -226634 -378797 303710 197396 -116910 -81844 301219 -201653 -175650 50419
21008 23955 328315 59619 18014 8758 -32769 12063 -93230 -30432 -59798 9585 -208861 -106335
20996 -106335 -5574 190192 3179 -148226 -215550 -21618 -111230 -41082 520493 109390 91933
20985 91933 57645 18778 -133673 -100902 -426647 112993 14026 57034 -311315 -30605 35425
20973 -162158 -274458 -121340 -36324 -179007 -323244 -70101 86922 66257 -143827 -179901
20963 -179901 80909 -246410 58048 175306 3650 -328250 46849 -84331 -36711 -228650 5076
20951 -148354 17830 -330450 115335 -19247 -192049 122966 -385774 -236183 -330280 -43663
20940 -56535 232371 -226695 -140009 -29384 42187 -160341 29665 -290985 123510 -335332
20929 -259301 31888 132962 -188888 -95270 -455999 -44143 -121272 74659 123888 -7059 -193691
20918 -193691 -40131 -30566 311849 122675 -190566 -67861 -248699 -92983 -213542 131018
20907 -63493 -106060 -88781 -274545 -126712 -306558 -251381 198144 -189056 -116375 84233 -7973
20895 -32710 -157677 -188428 228702 -325155 6578 -253503 76470 238009 -237376 143518
20884 33090 61271 -152103 -134389 -323341 196777 -12955 20635 -172693 -230695 -37441 -224025
20873 -224025 96883 -77462 -9144 -81135 -3277 -41275 362416 769 367626 -38702 125275 35665
20860 -246270 244441 256178 -461696 -131595 -258787 -210365 188895 62144 -350838 -33482
20849 -37135 199652 6857 -163291 214606 -287331 86028 -213144 84684 84022 159369 -232872
20837 -327568 26624 -161244 77580 347236 -25220 -205786 -205333 83375 -32878 -66119 -82921
20826 -82921 167484 115569 -433507 -193608 -189773 -159102 -462568 -148817 2742 -301854 284029
20814 89581 -95989 -163530 -151305 -401265 -270379 135623 -387717 -219 146457 -282949 -70169
20802 196436 -53564 -97395 -180409 -204780 -325074 -452036 -354016 -114912 59021 -25835 -195582
20791 -195582 186831 118753 144695 156598 146249 -201751 111916 -182589 -27467 -32469 -69590
20780 -69590 66676 141624 149921 -92559 -65072 -189158 185093 144068 -91063 -63386 -211664
20769 -211664 300566 -81944 53595 -241123 -124123 1093 -54655 113465 57822 231725 -187128
20757 153395 189239 -10097 -150830 131842 -83082 234684 -210461 -8821 -130113 -116862 21012
20745 -281959 -189059 -58849 -89546 -166454 -31831 -331382 -19695 -163210 -73468 -38728 -68648
20734 -68648 -118618 -128838 9010 -147238 -361738 144648 -306135 -210634 -196248 385772 16152
20722 -34530 132116 147513 -29116 -331730 -78604 -37101 60146 -265315 -22521 -14551 -249359
20711 -249359 101862 149882 -219578 -70521 288926 -225862 206581 -347510 -42247 -1069
20700 -181905 -193761 16252 -305323 -104104 -115801 -51785 -338 -245210 365095 -66796 154716
20688 -394653 -99796 102950 44244 -128530 -81088 -18924 -20924 75905 47920 45486 -66752
20676 -8575 47767 -119255 41847 203074 -36675 -195579 -14749 173819 85184 128782 -18609
20664 33042 -153793 90412 -96231 71269 -137120 -103809 -114762 -53442 42770 -155241 -229258
20653 -229258 71204 -316011 -53323 -268052 -102293 112667 -133955 267794 91875 40647
20642 -5799 -145025 156730 -52509 -216037 -235144 118900 -45273 -377768 -146477 -278852
20632 -278852 159576 29108 -498060 69988 14465 -304636 -104929 -386764 -278266 104817
20621 -49131 -217286 160327 -10369 -176532 -368477 65201 -32619 108604 -90492 222335
20610 59670 -14486 -102136 160567 84867 -203689 -360857 127017 148660 153786 -188341 -317543
20599 -317543 65217 -131409 189131 8461 -238291 -224193 206018 116538 32982 172939 73291
20587 -18627 172961 -35364 271606 364751 181834 67583 64996 186595 180161 295766 -130888
20575 267603 -60721 -145460 -141138 38763 -164562 -211585 -181886 178986 -149417 -146366 -416496
20564 -416496 -247837 54366 107057 -22661 4453 -95523 -45758 -115187 -108807 45705 -145777
20552 -205833 -292795 -151754 -313547 -32145 158445 -165631 -268003 -35005 -93991 -120696
20542 -120696 -279169 1093 -143787 15461 100561 -52691 -222800 -103954 370592 83862 -207617
20530 -542715 -235949 103691 -122046 174073 -80237 27426 -361730 -103298 -110031 -10518
20519 -10260 -53573 385511 -136868 -71043 14124 72589 59371 100892 145180 274208 -28082
20507 12605 -90288 60708 -179794 -99953 -425410 -46084 -223535 74186 49341 54069 37585
20496 37585 -126702 -69073 -121725 94842 107160 -202018 171686 -299611 -52507 5560 -114439
20484 54048 -48917 -329978 189989 -175108 227382 -348576 50301 -349215 29152 -94067
20473 216999 -168747 26477 -19656 36704 -45118 -70886 -60463 -149251 -66531 55015 -127007
20461 43949 -20274 201324 161157 -185292 496011 -304559 -54592 146480 58196 -177201
20450 -160525 15731 190345 -152679 -189364 -250176 50856 -78506 -133623 20905 -222573 -90166
20438 116417 150051 -103838 -116960 -238158 115705 -107025 -467692 12095 -59757 -77740
20428 -77740 153596 -199223 -240470 105060 85077 -96082 -278002 292451 360737 -89315 101883
20416 -85560 -370342 -80958 -438631 177844 310848 49159 -156124 7320 23659 3508 -135698
20404 -377740 -85742 -33359 -303251 109393 20667 -112163 -83943 -157767 -38745 -303035 204460
20392 -20754 -323951 111683 -190494 114794 -62951 125660 -78594 -332697 -177551 -335530
20382 -335530 3638 -59459 -83336 -269022 -328079 -175097 185096 83331 95855 -182172 228669
20370 -135202 -115173 -24385 255169 -185762 417782 -223297 -35317 -144655 184468 -47367
20359 -28315 83499 -130925 -253959 178493 -150128 109358 -295052 -186982 -81670 -67640
20349 -67640 -275009 -84295 -11110 -194722 -76183 -11898 115590 113372 -38596 99612 -113473
20337 -209345 58509 224356 -65114 -260785 -59281 -38720 -85308 66070 -24186 -85900 31679
20325 137267 -99614 12295 32707 -558224 -6567 126944 7236 69198 -250335 -69714 4690
20313 -90904 -445487 110400 176825 -70645 -38137 38324 -182676 144131 -421013 -108349
20302 -25927 67325 -74317 97749 36530 26503 -153980 15429 163478 -19127 -213744 63279
20290 -47617 190222 71404 73724 -8559 -51479 -31414 -179050 -63570 -72276 37348 -374919 56458
20277 -17080 21057 -226414 302673 -191420 93197 -148765 61518 -9169 -158110 106392 -84102
20265 31765 117384 33530 169998 -88311 -68873 -162578 -189536 -16865 -253136 -44328 -141704
20254 -141704 231579 -97899 -227637 331938 -1978 218159 -377083 -128907 466444 -276560
20243 380819 33056 -344292 -245343 -241067 -110249 -84330 -86533 -78686 -47052 101401 51062
20232 51062 -87967 197016 45964 -126095 -247923 -36994 -13055 -114955 77258 2952 194928
20221 194928 -318030 38761 83507 -13943 -82298 59799 97144 111731 10174 64494 -246600
20209 176493 -129664 -2734 95958 -291390 -45051 223064 -120683 -145541 15363 126702 -126252
20197 -188777 -123204 -416951 -12819 -61646 41958 -293768 82646 -39292 -1639 3110 -109727
20185 26416 -155448 -16571 -56824 -118152 -485385 178114 -49923 -106011 -119993 -70839 -55720
20174 -55720 -175589 145775 -199113 83362 6847 292375 -142661 225163 277754 -431980
20163 78429 10397 -179689 -189346 254570 -187817 183894 -22242 -4996 -84547 -212084 41086
20151 -62317 266106 -111784 -161658 26704 -13509 -33794 -284545 -49401 256246 -49020 59856
20139 -265699 -138214 3735 146044 22646 -191197 121706 -46115 -182930 -186895 -346577 -28462
20127 63714 -304509 32328 -233428 -38424 -72027 175214 200592 -10039 -218523 14301 -165876
20115 -117137 55835 59866 47607 -112510 -490303 -316735 -326569 149706 -287695 -39529 -53730
20104 -53730 -55097 -69233 -65228 -279443 -385364 -71145 199576 -174559 -178356 62772 -60318
20092 227324 286069 119064 -256511 -185435 -131904 -66405 302151 -157702 -248311 -143549
20082 -143549 -218818 246637 179955 -51016 -183373 -178870 -15003 201584 142821 -194562 -108876
20071 -108876 -119696 -183219 -352031 110534 -18698 131823 281421 96180 -61614 -103214 354735
20059 -319463 -284544 161862 -129872 89869 -240869 -331767 95678 -295052 -152442 -201842
20049 -201842 -70691 166085 -73005 -88114 242729 -48947 1676 79582 -306840 -169705 208031
20037 207737 -344738 202455 -20999 39772 69537 -252265 -55078 212593 -202079 -98960
20026 -26021 304678 2627 -88372 -112718 -375572 -126264 479688 27842 -13822 90036 -137703
20014 -36216 243608 -152615 240711 166412 30393 -53177 -184053 -68400 -7785 14431 291032
20003 291032 181566 20593 125279 21451 210171 223557 135330 251212 309786 -200663
19992 61325 135843 -175882 -19241 -188619 160942 269744 -135853 -38626 -108041 -82646 -130460
19981 -130460 1030 201327 -105237 -33402 -349549 -118275 -417949 -262000 232956 -139212
19970 -42018 14943 258642 -217929 -169161 -113951 229764 260365 133675 -303919 -239251 62458
19958 -110076 -116683 -81619 115740 38028 -84262 187496 -336529 -93440 86657 -119278 -286071
19947 -286071 4484 22883 -149408 273605 -158902 -5405 56188 -103267 -348870 113910 16119
19935 -146413 -4699 64903 -86146 8579 -128609 -17280 -37954 -163992 28450 -48442 -114441
19924 -114441 -44713 -122202 3488 -177153 -292724 -127834 -3834 -98787 111157 -89363 -198734
19913 -198734 153000 106165 187382 65702 -87492 -2402 -99360 -328024 63003 -135139 -68802
19902 -68802 174404 46356 74379 21273 136110 4343 -106330 89600 -84279 12311 -9325
19890 67742 111179 -195969 242879 -113351 309657 58524 -37258 -13583 7463 -304077 248470
19878 -113197 -223617 -10662 -180484 182182 -116791 -181091 151051 8603 336931 -74432
19867 -275028 -315368 85010 -144660 46531 -33428 -536482 -65453 59919 50594 65186 232117
19856 232117 130001 -159348 -90984 180682 -209086 -161329 -109549 160262 139488 -28393
19845 -200841 97051 -316253 -110385 -282423 182907 35619 -186393 5481 -27664 -134521
19835 -134521 -107930 143131 -347079 -71469 -379161 -116789 -104499 494900 -305260 -83244
19824 -203503 344513 -315864 28822 -214109 -145029 -15208 -368582 -53594 -87793 -78052 -60715
19813 -60715 -148317 -60732 -53795 -370675 2648 -215562 -107231 -14634 -352465 135196 -184674
19801 -388447 -146034 -109644 -65888 -7277 -241195 -120006 -102631 -276736 -209498 158682 -111372
19789 9360 79389 16494 -116913 -37358 -135364 -4191 -219772 -95172 157980 91667 59649
19778 59649 -275485 4292 93016 -157295 52661 146330 167194 -55698 132264 35427 -138041
19766 -12401 10599 -168043 -287235 -273097 64230 -383883 19890 146389 -8536 -22795 -346246
19755 -346246 -38817 10164 -56580 -69400 236992 203256 17578 194014 -196477 55491 -53265
19743 -228754 136606 17954 -148178 -33357 -157171 20015 118681 -24827 -18239 -375460 244213
19731 81000 -230243 364332 237339 -143030 -16683 289210 107849 91114 89491 -121307
19720 -234999 -63405 174956 -102326 -18081 144048 -275321 -212812 -264890 -183028 -145688 97353
19708 -219485 -137919 -20621 -212105 41825 18416 215339 -341697 -297759 -215674 -104180 -69943
19697 -69943 367041 123763 -162564 -205347 103843 -53508 111787 14688 -142720 32415
19686 93807 52157 -22665 -112404 -111749 -288215 240847 -18960 -260535 428704 -182696 -137005
19675 -137005 -48831 12435 501 -349842 90791 5889 -256502 80136 -223585 -96387 44814
19663 -372434 -113419 140703 4739 179513 -424535 -70942 66690 -247421 -211595 -223773 -264832
19652 -264832 -1356 -257969 79746 -200124 -189236 -370006 207277 -249264 -180668 -17103 188264
19640 168257 86024 -226553 -106064 60809 57302 100935 72799 -184857 -155859 -197033 21986
19628 35153 40647 -405834 63539 -64517 -57155 -13865 342775 -183140 -44462 117078 -352181
19616 -56880 280998 -130090 260907 -40598 -244003 96174 -92078 65351 -166434 -22978 -34622
19605 -34622 285398 -81757 -30055 116433 25270 -151467 66002 -8579 276611 191041 -32493
19593 -94880 -72764 78192 -8052 172242 -59802 -27178 198670 -135615 -82419 60708 -411188
19581 -108164 146312 -31709 -230717 -184684 41238 -117290 -135466 -18037 -29759 -47375 -134203
19570 -134203 -80569 -149281 19840 -106650 11794 -106529 -141508 57572 165065 585 12529
19559 12529 7323 -5044 -123277 -181284 -10411 98040 -24601 -58566 107894 -251257 80459
19547 188761 -3511 -325681 -71649 61920 11644 8654 -155353 61833 73753 -3792 -4411 -69112
19535 -69112 -11179 -187902 23741 179726 206732 44832 -61772 -79465 -204511 -121375 -4112
19523 -34844 -396738 -389249 -188824 167232 24884 -211576 -136393 226229 -23702 82916 -265966
19511 -22542 253359 -143622 294126 -37591 264921 157115 255099 -255436 -114106 -301 -321070
19500 -321070 -113328 223178 99270 -201347 -11601 -165596 -353990 -370216 11413 -45596
19489 59619 85723 -235761 -153617 61824 -30821 -13060 -300729 -206712 -107762 217337 -80822
19477 10887 -158042 37873 -435606 142820 18353 -29341 369677 -197305 49657 -72760 28571
19465 93784 68754 -205100 -67082 24380 -250551 -23860 -268607 62834 150336 53890 -137584
19453 -321708 -18172 -39106 200885 217280 71328 145336 -449005 -395230 85178 -83502 -421403
19442 -421403 -74575 5462 253168 -222579 -89012 33154 -112162 358239 455821 -420074 -296583
19431 -296583 -215918 37079 -162893 -98252 127360 237433 71037 -154455 3459 -76576 57357
19419 -14055 179148 -213694 66078 -61259 89677 -341646 143700 -123240 26911 33122 -207952
19407 -110570 -282976 316904 24065 239629 -30300 141116 -415866 -305958 245948 51958
19396 -250680 -259562 -35069 -261590 -81625 7448 -165753 -17926 -251618 54290 63733 25475
19384 15030 138205 73513 145474 -260776 -122320 -376122 -376599 237849 106196 -131271 -134784
19373 -134784 -466105 -76050 231734 123634 50880 119234 -89675 272283 215730 154260 202285
19362 202285 68969 -19096 -306817 -231727 -155109 -74226 -304629 -98497 7172 -34477 -338098
19351 -338098 -177921 19881 -274205 -80010 12343 -70112 76027 -236291 -332017 125852 -86287
19339 132576 59785 38015 -260876 -163873 33349 106671 -152415 230758 82986 -313296 -327511
19328 -327511 -254491 -509823 24313 105440 94083 -104343 -61456 -69368 81703 93972 -76277
19316 24580 -105352 -97281 -237692 -180569 -188526 82855 112349 -129370 138059 -143979 -78898
19305 -78898 -26323 109874 51837 -192564 52901 -79511 -232502 -172933 23504 -57744 -98148
19294 -98148 192985 -178183 33572 276558 7245 -25232 -76475 166587 88127 -54879 -69812
19283 -69812 -212965 -49296 -150540 113355 -199722 -213923 105979 -211576 174810 -177779
19272 44546 794 12217 -67965 -36772 15519 -73801 -246258 -128120 -114782 -503229 257811
19260 -86985 -127527 -33290 351144 74923 107975 -40286 15648 -183152 -243037 -35222 130070
19248 -79760 79360 260777 142900 32827 22064 73083 -64142 -79271 -32604 -91423 -36484
19236 -179471 153017 -19445 -160316 -12475 255721 29230 -127389 -70974 62449 -167961
19225 -304978 12884 -198471 -290591 -255931 193038 -61638 59283 -79396 -243155 97681 -66013
19213 -330895 -329729 69657 -82754 -38098 -287711 -259458 -201980 -217998 25232 44610 89582
19202 89582 -116258 -118590 -97236 397988 -148787 -203770 -200327 -82340 -384694 -215891 -246518
19191 -246518 4611 6442 213082 -150357 57184 -106290 -179464 -40279 -28948 145472 -733342
19179 -37905 -24524 -198042 -223652 44279 164557 -69692 13508 177745 236170 -192856 -96714
19168 -96714 91317 113725 242492 -106154 -235359 -7210 -198593 2513 -237551 188495 -230597
19156 -100559 -111270 87096 -216346 -242337 -53772 -254782 52821 -173337 39523 -415633 111602
19144 -200812 -118931 -98735 -1484 -234933 -180013 -171483 -174958 -246759 -548986 -266621 -56960
19132 -149270 -45983 -118775 54117 63705 12715 37002 -283646 191207 -589885 143167 -213201
19120 -244948 98323 -193586 109920 71267 -147393 36976 -100732 -96427 132184 -62929 13621
19108 87566 -19096 -140565 33374 -284125 -79501 268347 134762 -413771 -199342 -66866
19097 -56892 128392 63348 296797 -12190 -123303 -57978 137152 46023 -356266 -79226 -306444
19086 -306444 -14248 -399278 -49782 -220194 -103794 -257075 -128978 17503 154135 116160
19076 116160 66045 -111011 234047 -40090 46751 190908 144771 -307494 -212440 -139863 -20953
19064 -96576 -37915 82174 28692 -85562 29086 -214808 -47298 -254511 -72333 -95381 -92876
19053 -92876 72996 164771 -19730 219419 -166231 -88249 -248392 -124783 183238 58596 -37328
19041 -123392 -224272 -28156 360085 220212 -124132 31974 -174223 5861 114613 -307111
19030 -44252 72579 -58793 -217904 159608 -113335 -13217 109866 64959 94419 192570 -55817
19018 -73226 -18174 6395 -50186 -123091 -226908 286037 -132175 -22195 52297 -143308 -59041
19006 -152650 232265 -68836 -65525 -37714 -207971 117815 -3157 96017 -258084 7387 41401
18995 41401 -92891 -37149 -86697 132606 -290866 39790 -232564 -94485 -394415 16962 -94168
18983 -182534 -190328 53140 -25445 -135245 120720 4546 72362 -248211 110932 191669 68449
18971 -264667 45690 3705 -281105 -276890 -265158 41453 137128 -177182 -50917 7512 58053 -41908
18958 -165630 147834 -118081 156230 -8691 -34530 -316712 -61023 -44255 -164086 -104519 -73454
18947 -73454 168407 170389 -256329 221013 -98952 -16111 -19927 264397 17346 87589 57603
18936 57603 339938 130377 18568 -82122 -32288 67911 195058 -168173 -269659 32436 36887
18925 36887 -265339 140234 -78246 -93230 130940 16685 -175649 -6264 15022 138156 58458
18913 258752 -89231 12359 -83422 17537 -16188 -90633 -174415 70131 -184170 209039 -166184
18901 -138589 57487 -2394 289436 -200457 16133 -95158 -81611 409878 -152763 -96088 89719
18889 -227619 61236 125725 115473 -275240 -89862 -63908 173818 52134 -686 92313 82035
18878 82035 -174880 -304991 -332589 358545 -138439 260160 -185410 64726 25878 99746
18868 99746 -118290 180859 71637 -11768 -268140 105333 208857 157217 -109505 -298541
18858 -298541 -198025 12489 -160445 -154783 39901 -78895 -76581 -69144 -195696 309572 132075
18846 105168 143231 9804 -114386 -64173 -22311 -108149 -134409 -337511 -23204 -114777 40440
18834 77146 28436 -112859 342123 -378428 -177989 -67599 -228553 -65912 -215986 31749
18823 -141753 -41451 -213868 -257929 -271783 268743 -13573 62301 -239098 283985 76929 130501
18812 130501 -13933 60296 144808 -11561 178847 113822 67626 255639 -103773 -39563 116434
18800 424752 -124500 -212108 21458 -78882 -304843 3075 451889 -300988 -29041 211087 -366267
18788 -61881 -266032 -119196 52338 -283462 23873 -178240 -425796 -51807 212576 -289354
18777 11968 -80091 -58774 173886 -141293 -269187 38388 -301506 62345 -215543 -251114 76712
18765 -119539 11987 -83531 -240599 76074 119773 336016 147253 228969 -119193 -295416
18755 -295416 -342581 156612 103067 24115 -91006 -140920 57073 -308292 52214 -225967 25264
18743 37331 177510 100800 57831 44268 -123484 -38840 -2022 -149031 26903 155139 345533
18732 345533 -101764 -16698 8773 -20875 29281 190178 17972 -102666 42094 -275932 -156242
18721 -156242 -219351 298022 114752 -112936 -56765 -130667 266323 -333761 7548 -239708
18710 -83482 125940 -96976 204621 -53266 -179411 -27549 158726 128486 -438311 -64955 -17599
18698 -236100 -109898 -287573 82472 -61754 72185 -55124 218428 -360431 55672 -222166
18687 -118281 272436 -181101 -35671 143808 -187548 -37455 151878 53652 29129 -169986
18676 -299832 -153015 -18857 50682 56175 32434 -306875 -158533 -23395 -205981 87553 -205661
18664 95229 84574 99778 -97244 -163167 210889 51337 -153344 40343 32202 -119431 -198636
18653 -198636 -90456 -4718 -36622 -92235 -214228 -21805 -22095 86438 59396 -267287 -302648 -98679
18640 -99151 184525 10221 -8743 6139 -17013 -60872 -32645 -207571 46469 99466 98073 -285419
18627 -151376 131562 -147710 -135451 -184748 86960 -25005 -176924 -109016 201517 -138493
18616 -242103 64581 -263583 6575 12314 -462719 -210859 -181707 -65317 145498 198579 -154447
18604 193297 26218 -118637 -310062 78244 365421 -86789 191944 -298701 -339577 23850
18593 -39467 1761 90379 -109570 -124227 -60093 -29943 -127001 -77007 -161347 -226179 -191530 -42290
18580 -123678 -47997 -246110 -90593 -278299 181744 -123329 90952 -365230 -119466 -168015
18570 -168015 -145958 190911 -328669 442404 -34354 -15221 319836 90483 31550 233385
18560 233385 -20691 -394179 -368256 96046 -145843 -50016 -455458 285686 -340745 -54985
18549 -96694 197023 47250 338636 -207735 -34374 -92942 7340 -175517 106159 83001 -334346
18537 68551 -212743 -246759 -51496 -128489 -35181 -107527 -86481 71314 208293 -157279 -90654
18526 -90654 345456 -434057 -91037 36920 76532 -175382 127322 -164396 -385283 134468
18515 -162608 150498 49131 157732 -103965 -9548 -5559 -122585 -243449 -38607 -227410 -10420
18503 -74352 -230611 261941 -9120 -252989 -232463 147226 -282940 51979 -53290 17810 -279520
18491 -24732 -156749 -169808 158775 24508 -384549 -89968 94078 -233158 79662 -181931 255186
18479 -337182 224971 90227 279405 -75574 148604 -228655 40477 -203600 66079 -7462 8841
18467 -17395 143001 -62347 -376170 -55222 48707 -169263 90284 -52035 80725 25503 34150
18456 34150 -158508 170474 171454 -70324 -88058 35808 3155 -70996 -113308 260347 192677 57190
18443 91147 123175 95604 -72225 -120315 -77668 -258972 -48135 -359864 219535 186031 -326307
18431 -314566 -125524 -42082 -222438 -174312 -189722 -304038 -104353 10063 -175035 387687
18420 -31148 83879 -49123 181960 -326739 -30141 -259321 37910 100731 -45240 1965 -47695
18408 -19400 -62061 309202 -61959 166841 -115696 -57427 -248940 -203901 -318929 155007
18397 313487 -242705 -413350 -264495 -157712 -456329 110379 -69701 -364219 -154447 216764
18386 17303 101182 138966 -179162 -198937 58865 -182053 -6953 100228 6539 326132 71195
18374 8824 146711 -28675 -113451 100786 19937 -358364 -195665 -3294 -117091 -106958 196537
18362 276947 290723 -225424 -146954 109814 -32647 419436 -68740 -293338 283948 -306113
18351 181828 7871 -41641 345022 -397548 156121 -64785 -18627 -209160 74163 81174 -110154
18339 213140 66480 -140296 376939 -101466 28979 -168358 -45211 -161036 -148201 -212399
18329 -212399 168927 -46086 -163770 103821 -323090 21158 -74574 -188955 -16959 346286
18318 219207 -46397 -47413 -160817 94474 72608 128187 179023 -202797 -11512 -109953 -209047
18307 -209047 -86264 -338394 210260 -191102 -363594 -74611 25303 -99066 -136665 -38018 125509
18295 168030 47937 66578 -48403 -16531 -22417 183231 39597 -456852 -139558 381707 -80988
18283 30140 -16014 286001 -41395 64461 -56469 -160393 156893 -307806 -193756 95172 150926
18272 150926 -223356 -2501 -57968 31757 -243672 262085 106148 -207328 71431 -265998
18261 -64918 -60922 20513 84913 134138 20643 -282039 -218541 -198326 -130417 -124133 96884 32756
18248 138518 -31343 -120107 -16532 2989 -303521 -449609 -6445 -10041 49935 -255446 136409
18236 -201343 -106524 -24358 -151263 -13879 -223016 5336 -332843 103122 53887 -12746 48889
18224 -176032 89812 -298575 101378 -13782 -308871 264785 -218294 -20566 61795 156662
18214 156662 -248602 -146307 -217808 -42069 -295730 10220 62642 -103846 31715 -204477
18203 113666 -151708 27554 83012 90487 -48686 114853 56537 24308 -18742 186777 47514
18191 130751 -101373 -32326 -55871 -252447 121526 -216672 -74634 -44147 -172847 -5250 83319
18179 -22493 97480 159707 4979 102498 -310748 34988 11453 49986 119066 68810 -107617
18167 19689 225034 -93110 -540373 -150811 -344381 225982 169812 216788 15657 -203731
18156 -123430 -21816 -124426 20170 137082 -63989 224152 -4857 34385 30840 -209579 -90394
18144 -217669 -38716 -142378 141818 94297 171391 -188309 158253 -143602 -4696 -43813 2641
18132 -291498 155789 -59153 -103908 120097 -312641 110380 -97059 160934 5531 54808 -195009
18120 -408467 258874 -30479 163037 -23252 -342065 -350534 -47585 -15327 -133052 -109623 -20614
18108 -212374 73069 -226787 93881 -184732 26965 176216 89435 -4003 -190250 -352913 -460765
18097 -460765 23614 -37352 78046 -173897 -170985 274774 10814 -236020 -143108 -51888 -100507
18086 -100507 -50072 209366 62556 -131126 -213444 211078 -137580 -152872 82670 -114057
18075 57235 75346 -42077 81975 -37318 -307829 -1956 -125021 52128 -77363 -119610 -166212
18064 -166212 101766 296777 -94237 321545 -32680 -303843 -2098 -120373 74631 -28277 -172579
18053 -172579 -74737 -279311 137211 -192989 -185346 26026 -18341 -110105 -198481 -37162 -61218
18042 -61218 265967 20458 -168104 -271739 -165817 -134518 -38691 -70777 -300675 -279584 114730
18030 146181 -160944 37973 -47247 24184 -140160 61035 97511 57526 44930 52910 -56701
18018 156246 -29268 -340080 -270021 -89005 202136 -16937 86548 -82851 241417 -121740 186321
18006 42033 5185 -310523 79616 238843 -9253 -8294 -70930 -287468 -250603 -126964 -328509
17995 -328509 -55975 56128 12975 50958 -50328 -85262 178183 315239 -198226 69317 -130303
17983 -69628 107000 117977 -218118 8870 -5880 412624 128408 -57878 356696 260543 40458
17971 124007 -188972 35580 -182091 -138967 189223 -39817 90507 39008 -20751 253907 -331847
17959 -199462 -89078 134566 160045 -43734 42209 71224 213164 107972 -364565 -20047 1193
17947 201366 137708 31052 -128113 -194938 48683 -10776 -351477 222675 -62022 -166201 -240414
17936 -240414 84913 -249985 148723 190871 33329 -21477 -134030 -63653 129202 -330067
17925 -114573 27900 171166 120984 -31180 -65709 -42269 276474 51388 68574 91001 -158715
17913 -306330 144748 143972 23208 -64680 313455 77019 -116711 77282 174632 -63721 211692
17901 -79783 62750 150637 -102796 52883 -41078 269359 -143558 -186524 111181 -68767 -41656
17890 -41656 -176985 -279911 132474 -31559 245989 155734 -200264 -81381 -47048 -194741
17880 -194741 221850 -239615 -79579 416462 74310 251515 -278533 7968 73436 81428 -122864
17868 -11985 47174 145083 -12796 -47428 -20370 40170 -4588 -68357 -29870 223708 57148 116088
17856 116088 -131676 -34947 -205985 -44443 -9011 -113137 -23886 -120498 192459 -177655 -261259
17845 -261259 -138014 22472 388533 -48000 217372 -26719 -56575 108752 -185070 99530
17834 -298167 -110712 -74731 100378 -82517 -41086 116052 103372 -102833 -136694 187533
17823 -136593 62729 123123 43096 -99317 103857 -175172 -170378 101762 -79548 291699 5296
17811 276187 -99244 -2675 44701 190703 127748 -11543 192178 -33835 47455 36836 -90115
17799 75121 -39432 124074 12975 -363860 147825 -331421 -76071 334751 -194493 -146278
17789 -146278 240546 53437 -278483 -49878 -38927 135052 -84172 162544 150659 257055
17779 257055 -215271 -40605 -71222 -239826 -66853 -102313 -241303 80119 -93832 -327154 4236
17767 -348495 257709 -14757 -60256 249927 -166373 -357234 -272634 224536 -33342 -139813
17757 -139813 5252 127575 64203 -138271 318386 -71199 -127266 -86434 27693 -217917 311015
17745 -405015 -136675 29549 -51729 154941 -211354 -138121 127028 -300621 -202735 5859 -103824
17733 288900 -172449 -95847 34115 -229629 151478 -341914 -159955 89494 148501 -44329
17722 -146893 88016 409408 353455 112626 12212 -135208 -136028 -27136 -150604 -43996 -180715
17711 -180715 69347 25697 -106248 -198917 -132468 -136822 108461 145115 325477 239358 -177180
17699 279821 209933 -182966 282772 -27258 -285394 51318 -132351 -14466 34871 434139
17689 434139 -93824 180739 -18933 -119202 404140 -23298 193761 -73966 -18495 -118954
17679 -118954 -792 57825 -175374 -58335 -26068 468857 69975 -54135 -166465 156883 338813
17668 338813 57933 2668 -21561 138317 172729 136612 223304 -118019 327262 18369 -242427
17656 229796 64189 -120553 -41845 -127627 -122229 -132632 125574 -11642 -53762 145307 -98138
17644 146878 13760 60036 307973 -121815 -407636 4876 96939 151218 -92838 200861 -76708
17632 206572 255942 55008 -76224 -485966 229284 35446 57147 -125161 32658 -16631 287499
17620 23985 372602 154978 -33655 122524 246789 122465 -159940 17520 -52394 -118733
17610 -118733 -83318 -18990 -44640 -25302 356923 1018 220529 -32023 66908 306388 -97277
17598 24281 384810 33632 190725 140762 109335 -72120 217339 -329659 109858 -88870 -10166
17586 -191594 107585 95148 -100783 85836 239076 -136632 89289 25936 -190569 -57259
17575 -88333 -42681 135148 -17782 -245075 -107197 133162 -177392 -69127 238140 -8565 99824
17563 83877 113243 85226 56379 -38515 -111144 -135145 -33382 -57359 14519 -58786 72992 303421
17551 303421 -3689 8056 -89394 -34018 72966 268405 150806 61388 379585 127895 84321
17540 84321 159750 423103 249164 46357 -402707 -144694 -62421 95066 179255 104440 202916
17529 202916 266564 21446 -87659 81086 -99959 81887 297200 304885 6336 223969 314793
17518 314793 -12537 45819 171102 -82688 412249 268459 6513 78601 395413 230898 45794
17506 195948 249857 -80253 285635 -90100 -21165 329885 265555 150600 -298925 212678
17495 -23589 49676 57477 68433 73927 116822 -150689 152436 354532 25381 125365 346982
17484 346982 58442 234246 309151 -3720 163493 18939 372871 30785 215936 -5007 246594
17472 175048 420599 57257 319203 362089 343046 -184931 -297197 449725 169935 -43709
17461 -53320 363249 -137843 -46709 266918 -23447 -103562 305997 437040 49579 -17205 229939
17449 1906 160978 -343319 340915 67190 209340 347672 11847 282196 282734 85742 347922
17438 347922 35775 274773 314576 178765 -155629 417490 58744 463250 48202 348318
17428 348318 305364 245271 224731 350150 -28720 104739 120183 354192 273422 2781 370108
17417 370108 67271 26791 328028 -12196 519683 -92567 164495 84413 229513 166394 303231
17406 303231 384910 -94318 -145639 244979 75938 297509 -108686 -283 54078 306350 2476
17394 78211 400637 252043 59457 176520 -87221 130916 11337 388520 63894 -64132 17744
17382 110121 49634 145204 291848 2282 375310 -194788 326389 -106817 115360 38304
17371 137192 411937 93543 276561 -11209 657217 -166217 154552 28729 160042 37790
17360 98820 281511 93278 169998 560863 -13801 53725 347674 120360 270113 20664 96083
17349 96083 105795 235522 164308 427088 54200 -147135 -95008 21418 62988 3538 -17706
17337 -200285 381262 173511 166031 -160353 -121430 24554 244363 -130647 146577 -71505
17326 213215 178581 54884 199147 153983 -29508 373219 81928 33786 252283 350811 97091
17314 242266 -33002 186238 354403 50720 276544 160748 -24743 5024 134991 66046 307931
17303 307931 177818 136289 286849 301277 375471 76155 218877 196050 205970 275611 67874
17291 276088 25778 210150 41342 273601 272708 -61575 183469 450895 218847 160127 312584
17280 312584 102554 229113 439904 138160 444569 -203833 -49521 209240 242332 290030
17270 290030 -69508 266900 370198 601904 401967 319344 490107 -239947 162808 241285
17260 241285 601564 62759 144571 277326 -15463 104943 -251073 366782 188511 253582
17250 253582 341220 -12164 390476 126741 171141 213382 74932 20711 390133 -27039 272189
17238 -57845 192483 -7060 78928 370418 311970 314320 276324 216879 480126 -320642 93567
17226 666103 182025 273307 277552 132421 444952 289990 417817 360272 444303 309762
17216 309762 249260 75618 136027 335216 282465 17458 322643 166125 406178 240311
17206 240311 192813 31260 143747 115515 -145081 213027 529239 251471 74255 354146
17196 354146 132516 322534 437620 203966 244784 149780 120661 203112 185625 295152
17186 295152 256864 275229 185359 -42430 133015 62057 324777 265257 140050 -50416 229755
17174 343184 72379 373425 348412 362404 450229 264962 495390 177902 241258 269390 7312
17162 292708 386471 291482 169420 388867 475611 461096 418916 386924 194774 327870 548061
17151 548061 192950 77239 334267 504621 309971 408824 324779 558756 165615 -111446
17140 216975 435066 364170 356960 231407 191417 145366 541311 406383 226709 245149 211428
17129 211428 572654 169477 378056 396397 284464 498032 596689 627418 330599 462883
17119 462883 420189 79774 472761 424568 346160 515528 715930 604644 461904 326471
17109 326471 298547 449213 468028 438109 342425 323028 376185 448506 543823 155392 562046
17098 562046 403017 368544 25316 561953 645355 371268 504469 145690 243397 134532
17088 134532 351520 605660 402759 595791 405844 468735 513354 573179 351693 472583
17078 472583 454177 602085 479337 686058 643735 7108 642066 767104 610044 573304
17068 573304 376040 471803 467860 685078 615742 225395 742574 608455 235478 527870
17058 527870 633748 609882 531722 553976 544020 581408 631590 726739 481821 595996 759172
17047 759172 169883 458800 593873 653733 573527 670914 556835 621956 391265 439603
17037 439603 615264 426874 518381 415740 219425 575629 566384 570000 507091 623322 843174
17026 843174 821952 927331 510353 559608 636842 636056 850453 872580 677649 500126 864707
17015 864707 758387 583453 607364 795465 625397 925698 538721 677108 1032146 735674
17005 735674 753821 542886 765889 250245 1012988 994006 756108 627962 750360 1097300
16995 1097300 784400 787733 797534 596354 860633 621080 625005 824242 1037528 884180
16985 884180 689555 894768 837743 869401 1106243 798817 1063631 1049595 1014091 831657
16975 831657 800890 872126 782188 1017851 1008946 841438 638978 1037327 573888 773858
16965 773858 1125660 1200377 850449 1309337 1295317 910933 999170 1186924 1042826 1049686
16955 1049686 1131027 1001176 945927 1258795 875493 1063171 1005401 1416738 1099405 1271867
16945 1271867 1041891 1226764 1276400 1006475 1245211 863950 1063269 1312855 1115730 1296527
16935 1296527 1272014 1053670 1377993 1620145 1468010 1303695 1214158 1296747 1460282 1630934
16925 1630934 1283146 1423805 1260477 1561994 1763145 1351042 1626602 1552767 1713423 1487911
16915 1487911 1647000 1533526 1582209 1767991 1787524 1739726 1764133 1891199 1601637 1830293
16905 1830293 1740219 1829135 1674160 1615935 1942797 1842844 1962775 1689593 1764670 1814653
16895 1814653 2015840 2251049 1764580 2145553 2020899 2175098 1930742 2004446 1983672 1896420
16885 1896420 2219648 2159245 2331986 1667740 2161016 2058592 2457773 2372797 2058621 2420798
16875 2420798 2650809 2439428 2673101 2726074 2669881 2663508 2824137 2582377 2813546 2588271
16865 2588271 3150142 2657738 3136242 2952654 2841029 3321034 2988924 2938089 3088754 3306476
16855 3306476 3245734 3238721 3108287 3411705 3498623 3484254 3320834 3141679 3548310 3421264
16845 3421264 3592054 3742755 3408020 3800593 3924440 3966269 4051166 4003850 4444251 4182259
16835 4182259 4084729 4316409 4562281 4387113 4985338 4655009 5119246 5014044 4615621 4760763
16825 4760763 5115127 5174227 5107808 5397061 5466784 5615657 5419307 5923757 6194661 6009696
16815 6009696 6227663 6280355 6237478 6559380 6852659 6668356 6817988 7065788 7252732 7107810
16805 7107810 7708867 7447091 7680604 7994739 7964039 8513695 8506934 8702719 8968462 8751925
16795 8751925 9226041 9516839 9805133 9907223 10307841 10357659 10627036 11092760 11297455 11437815
16785 11437815 12128275 12169744 12608874 12808783 13482445 13799436 14101818 14162561 14771783 15487500
16775 15487500 15722937 16565379 16823791 17490067 17837523 18644359 19332263 19747744 20389548
16766 20389548 21477624 22199627 22980677 23782865 24628025 25829560 26401464 27499261 28685091
16757 28685091 29726336 31309023 31957010 33835437 35052412 36817213 38162925 39944772
16749 39944772 41617215 44312101 46001174 48317447 50632618 52962859 55756368 58753715
16741 58753715 61597556 65229059 68334980 72271068 76178729 80033815 84143650 89170725
16733 89170725 94120579 99669903 104986645 110671389 116505655 122988115 129406781 135955044
16725 135955044 142569466 149415962 155378044 161193105 167155324 172046305 176518812 179713791
16717 179713791 182075264 183449102 183790866 182571841 180828586 177824659 173475282 168593172
16709 168593172 162615832 156473831 149872400 143078125 136293588 129230999 122493468 115936999
16701 115936999 109059906 103196633 97043681 91803859 86597024 81361528 76738580 72385844
16693 72385844 68232508 64194754 60944234 57511937 54385890 51324322 48929223 46249851
16685 46249851 44021701 41887796 39717919 38309865 36155640 34332066 32781808 31333232
16677 31333232 30059147 28607402 27704357 26370608 25358730 24264953 23131003 22404934
16669 22404934 21585613 20922100 20035595 18919736 18473477 17712214 17184771 16458458 15962546
16660 15962546 15514653 14978637 14194995 14369045 13488578 13051037 12502354 12300883 11685021
16651 11685021 11268428 10974429 10727805 10497754 9991160 9687075 9643261 9282935 9253671 9064452
16641 9064452 8584581 8384476 7960202 7998500 7691357 7252152 7625962 7307992 6859138 6658535
16631 6658535 6981998 6414391 6382401 6206535 5861602 5891682 5736739 5428124 5707372 5343645
16621 5343645 5504404 5407970 5280688 4879681 5098178 4724520 4550680 4633854 4437198 4317738
16611 4317738 4566150 4506621 4332398 3956009 4099628 3757292 3751582 3913308 3485218 3756972
16601 3756972 3685932 3617608 3494484 3238244 2875263 3006548 2805731 3220511 3289165 3091412
16591 3091412 3103181 3124008 2849805 2978483 2936566 2675705 2622563 2635751 2741130 2687859
16581 2687859 2582968 2717597 2596996 2574857 2057561 2515294 2083167 2069963 1961419 2389294
16571 2389294 1887264 2092264 2077208 1995984 2173144 1984741 2190881 1976594 2138894 2223525
16561 2223525 1826090 1676384 1594760 1843914 1777201 1820144 1492184 1767509 1777446 1515318
16551 1515318 1848417 1814909 1176362 1404306 1079281 1895733 1411283 1432831 1402117 1706101
16541 1706101 1377269 1703762 1297698 1374967 1420777 1042802 1308741 1481584 1229122 1029694
16531 1029694 1274850 1283968 1386227 1649888 1167594 1266286 1087005 1258143 1103074 1343338
16521 1343338 924910 1321780 1076312 1144228 849716 856911 957154 1412183 1169971 1187978
16511 1187978 992521 1075899 943772 1060220 1156938 727859 923786 1040444 730519 699825
16501 699825 838000 1197736 1006151 871732 962997 884498 1006242 832803 1060002 852761
16491 852761 753354 1019305 736683 609366 870558 757045 640959 713785 788876 1051936
16481 1051936 794847 607829 674611 509277 826672 488514 808941 651623 669894 713548
16471 713548 872908 627373 589704 705087 710923 540771 446056 635833 393636 446006
16461 446006 529008 882772 451287 220733 722238 313421 689556 349886 809571 1342
16450 806206 741166 705189 546688 583396 384268 218941 542461 646955 736551 494410
16440 494410 489900 334660 231609 260322 327816 452063 513044 203670 348193 268124 536217
16429 536217 150901 440169 424285 355686 138162 384101 94952 142777 214921 341958
16419 341958 194478 228822 234589 461222 296972 376801 385891 449233 147255 163155 182030
16408 182030 131261 390743 666611 335636 -25797 410887 336206 289477 329193 185845
16398 185845 254861 212731 609551 144213 176090 386872 257550 358274 325945 570530
16388 570530 398432 464592 550824 117517 398415 387461 267903 195368 293321 248340 348349
16377 348349 340988 236810 530499 424791 140265 192532 273705 101403 305904 -75612
16366 39860 140264 149283 448340 339282 345645 337368 250732 268103 430140 14412 166156
16355 166156 265600 -87884 29211 212202 -50958 213853 378316 54304 303380 86708 220393
16344 220393 98812 140830 133742 160985 404975 107983 55562 372668 162092 476964 160440
16332 233964 167653 467215 2791 -103840 159149 32082 158451 210489 13128 126501 206461
16321 206461 104351 227440 26828 140416 493584 240116 217962 178115 69822 19687
16310 -47441 27520 -202831 129277 -16715 400303 243989 338946 393797 -13913 -112678 63734
16298 -45171 262573 86155 -150957 -22568 -109775 379505 -325258 20186 39787 424145 256281
16287 256281 318867 -143504 73549 170174 123374 -100155 31504 -45098 397625 -72218 172962
16275 -107421 -83333 188546 -33361 -37699 130152 231405 217257 398305 205146 225516 16245
16263 273618 201146 187280 66402 -52557 205694 -16993 76224 6882 61187 -107398 130197
16251 -90802 80139 -179320 385596 236759 287522 8411 168122 12560 45119 -119344 34521
16239 94171 -145898 -28373 -17821 -169244 -89807 -49641 -312000 119944 15306 267028 126159
16227 69702 109409 95482 90258 36846 82657 39005 -184043 28911 118110 114105 -147187 102323
16214 40453 349190 -105851 -90416 -161315 218270 291554 188018 -4200 -148773 226120 -101174
16202 -489985 96 326075 -46376 -2253 56527 -45729 136166 -96130 178060 45576 -266268
16190 185110 -284094 227953 -171939 153369 182159 219541 80448 -41285 211724 203964 -350795
16178 107476 -109818 33039 -14728 -313467 -90308 29767 148064 -31604 178679 27831 -192535
16166 24657 14133 98976 18937 60521 360141 50690 -98463 67571 -216681 -52669 241458
16154 -225488 -372411 -106793 74629 -255316 -122683 -141564 -135314 81112 268959 -289249
16143 205740 125298 -201318 -268931 -363736 -154905 37214 -370187 228380 -25384 -107745 86792
16131 262526 -155522 -79873 9949 253289 400052 12224 53295 -107353 114496 155368 -161436
16119 -103493 -105499 -135058 -159071 225237 25724 51062 -102544 -148037 -409552 85658 103783
16108 103783 55100 -74116 1446 52148 -191714 365941 -3483 105652 -64634 268674 18012
16096 -250330 -70225 142713 154974 -316842 420471 35385 32076 -134102 224040 -363812
16085 -16258 48807 -204986 50294 -88120 142691 73059 -270443 172878 271940 108708 -316388
16073 -198636 326143 116507 -96322 -91007 20151 -133326 90636 -8439 -32094 -10624 -129489
16062 -129489 43735 103413 3026 -79847 70925 115965 261303 -15029 -86362 216211 30045
16050 -84715 -254141 -285237 -290130 -22067 105476 185388 -221067 -228663 -198239 121667 -245740
16038 91476 -258622 -302562 -71772 94505 -209743 -99574 -203035 -162840 223776 -95531 119692
16026 -154712 -261756 24297 -241807 262331 -201757 172918 -373728 -115383 -90311 292222
16015 108790 170221 136549 -296283 -327620 93975 -5133 35882 -102496 -68048 -242402 -53384
16003 121799 -58778 -292252 183657 -65460 113045 406833 -145660 21089 -332650 -69263
15992 45642 -174495 -36386 124730 -296735 179083 -103890 350514 137502 252089 674053
15982 674053 568819 392272 351356 137318 223671 -70134 146140 -5151 60942 -527697 128806
15970 -134783 -10357 -107298 -375009 377735 -161879 -153105 101306 -267311 -27203 -57429 -83549
15959 -83549 -71589 -73031 -316640 20462 -14894 -158341 -131675 61441 280327 -61822 -349637
15948 -349637 10655 -136885 -15012 -204752 -256242 -93134 211732 -177647 -423363 27632
15937 204329 -125999 141300 -53360 31111 -74061 -377456 26354 -195547 -87339 186607
15926 -57089 -118419 -100577 -68623 65747 -147134 131589 -281187 -2911 -34469 -143078 -3283
15914 -32041 -136942 3469 -71630 28217 -41984 70213 -22690 120097 -17569 194578 213855
15903 213855 101908 -170262 153920 255487 -93031 12579 -91314 -104784 38002 -74650 -223229
15892 -223229 -120882 -124487 -230394 -3768 29915 164085 26275 -284549 -29997 127243 -148074
15880 93521 -19409 125211 -170880 -65716 -253032 -68111 82317 27024 95337 47020 65302
15869 65302 176263 125778 319769 -129142 -118755 -69371 -444691 -87485 100143 -274439
15858 65275 -104729 -119205 387772 -83001 -138663 -99354 81258 197365 -168346 235646 -3093
15846 -117507 244503 64703 11535 71081 -34633 -13052 -135095 254008 -19641 27730 -19814
15834 126767 12744 236587 46044 32797 17501 77610 29164 -226909 -258541 -16716 -288362
15823 -288362 -23660 17626 -91261 224789 -286216 -155911 -450990 58446 -184952 -26461
15812 39977 25756 -124734 237702 48678 -153090 -108272 266430 39448 -114699 66212 192773
15801 192773 1005 66552 -57845 59437 -53501 244145 157004 -158317 8857 -84439 384016
15789 110341 66077 -145764 -51442 -15308 43434 -92396 214661 235807 -146244 -251380 -27090
15777 48070 9520 65533 8389 260466 33639 29726 -103920 -228386 19421 88672 133373 -81342
15764 -147307 59764 397386 159054 -126429 34277 6391 -123684 34582 96195 110425 -224264
15752 -112374 -161420 -270350 -86096 -98625 -1888 -60343 71157 109086 248279 39533 225259
15741 225259 233156 45133 168956 -288149 51330 -206846 -91727 138202 -138495 -185172 -104151
15730 -104151 -82202 -39596 -61367 -311335 -128034 84295 82261 -280794 67091 209656 -64682
15718 495373 -184558 673 -62235 209 179656 25353 -415335 -37339 25564 152107 192770
15707 192770 83953 -398245 174267 -244187 268038 190430 66283 -243205 143517 -94351
15696 83007 38405 106492 105578 4301 44666 226322 243468 -36034 27619 -55862 334578 -218264
15683 -111584 52374 -84616 350105 -304702 201680 6892 73375 308687 85667 304273 -23288
15671 80670 161541 -188190 -47851 -73414 85122 96446 -17636 -126455 290468 41458 85329
15660 85329 -246858 -93440 -203798 78016 -226032 31873 -114903 -137661 -39938 211418 -41786
15648 56207 344562 -342067 99742 -1671 -180983 35637 71225 42226 56835 -20585 6272
15636 96434 -9848 -25510 139332 -60853 -216641 153757 137806 16966 4462 -157690 78048
15624 -151754 133474 71584 129526 -191153 175769 -113215 27550 147461 178806 -31160
15613 -135468 -83333 -20613 -120619 248977 -117205 -49379 -126648 -172036 -205322 155211 -47147
15601 -121242 -112284 -26139 167938 -58971 275824 -161280 -130597 -86584 -54752 54157 -110434
15589 -403166 82920 141727 2692 -113674 -2728 68016 -185337 -403199 242208 -7713 -88545
15578 -88545 -209250 174552 -12467 -40111 165891 -156190 -71404 238692 233842 -69982 188143
15566 148966 250872 -116368 169956 220729 -6836 244670 -154436 40349 -97433 -37255 -64793
15555 -64793 -107899 -146487 159617 -214631 101618 218328 100119 144897 -219180 107063
15544 60905 7077 -196146 -11944 3308 233951 -121491 -92266 272848 -368147 85871 326728
15533 326728 46112 -41484 95676 253922 -253807 196284 -359295 -243126 38860 370764
15523 370764 -251623 23641 14639 229983 -212514 30109 -53321 -240010 65462 305366 -151106
15511 102352 -155297 -23709 -20434 -144006 37012 -34960 -56015 -66744 117153 5515 -313724
15499 123656 18512 -29218 -45613 151829 -193836 -142432 187535 148912 120750 -340326 -112492
15487 -290801 -111048 211079 49079 -170696 174695 -6851 -75342 -106747 -154109 -192548 317886
15475 -180893 -108140 -78954 57587 -129394 -385169 -227318 21062 -58753 -34391 -177284 -108483
15464 -108483 193102 34983 -217175 -181052 102799 64761 -255366 439330 116298 228803
15454 228803 -116169 -216245 -359928 -173295 307110 -192342 -86468 -105630 -52693 54759
15443 -82069 -154978 -304140 -88987 207290 -128794 219738 20868 171620 233513 349781
15433 349781 -130528 -240087 -38585 106091 -181009 -275791 53791 213032 61780 130381
15423 130381 272630 8020 -67393 -182352 219611 167034 -326606 118808 85482 35701 -9875
15411 -123059 -17910 -203387 308902 22755 -353162 -11736 165904 247789 -171190 93361
15400 172425 -360541 108236 -86562 96527 -128108 131190 -228435 -155331 134022 -228035
15389 -27010 133546 -22564 -108295 -101050 58507 58682 72039 118958 277486 -115398 111781
15377 -67954 -201956 475291 -21488 -240163 85638 -169997 42236 -63749 136812 77702 10078
15365 151826 -163853 104472 24587 62536 42650 291976 5056 -26246 74567 -119254 129395
15353 56819 -303460 101564 177608 -38376 181903 199971 121437 -132772 -11270 -360766 47669
15341 170665 33 13761 -151096 18562 132283 -38276 -466 -9776 -26145 63996 -259742 -31535
15328 226017 -166564 -19582 -36506 -5584 200623 -94143 -4665 151257 270195 26192 5256
15316 338250 -103906 73873 31912 -41091 54939 -26539 212929 -132932 -43364 -316541 162574
15304 -78381 -178433 41923 369324 -215411 -159622 119685 146659 5706 63350 -80502 170898
15292 -2262 277776 129383 106766 129951 63954 -111508 24543 56328 -206657 -341581 -280022
15281 -280022 66757 -28121 107046 141508 470324 -21943 34848 288816 -8957 338541 -301116
15269 102380 -104338 86600 75084 277873 118757 89978 167289 -58050 173678 -216659
15258 65170 -31366 197416 -70524 -5343 -2002 75849 71251 112860 311429 216890 432623 1022061
15246 1022061 1127642 1198190 1556914 799964 286675 44953 -52028 369131 -171401 81912
15235 111982 282958 243548 172745 290905 -215408 -214882 189229 176311 -169401 -161223 -69857
15223 -79913 162493 122142 -139102 155255 58567 -41515 -168295 2894 -98714 276227 90746
15211 61328 -123887 219312 276287 66088 346328 -107227 -119178 65979 -98823 -212805 66748
15199 -126717 73596 50255 -129320 420424 4412 37507 50967 -398631 -261309 -14942 386070
15187 104440 141332 141877 -53616 476981 63808 57074 123209 62263 -29957 57607 161663 170451
15175 170451 -26949 -279948 374914 416241 -80173 -80871 -108176 -273772 -77752 161003 81439
15164 81439 162207 131132 109352 -15981 140601 -184824 182752 -139800 -150351 80134 -96151
15152 -200179 -61078 199308 306182 137211 171345 93156 214021 77958 33086 -50636 280089
15140 207729 39540 109004 185349 97288 97026 69635 148496 -69721 -99914 100485 309709
15129 309709 240426 272456 308137 -100728 -27516 55695 317136 318474 86238 -139848 -59830
15117 -52398 -22431 469157 224051 -88196 108569 -42912 232661 -38599 307192 276953 119710
15105 168022 230513 186633 -7475 182273 -33529 285588 193543 489022 146913 216915 156264
15094 156264 116856 389638 33647 99916 42689 452160 112246 466426 282499 81078
15083 106296 1124 61792 74534 146461 -65559 170997 99463 431830 -165836 -30164 77718
15071 66208 91184 1591 232318 166414 123132 186431 9161 102001 129335 484998 155953
15059 -144492 304741 548254 217157 126677 125264 -230466 359517 336032 334560 3796 276863
15048 276863 144425 150447 -82535 -49299 377613 133497 73267 -128020 -55825 109337 -10404
15036 166552 170342 324341 111276 210074 73250 12367 309235 131008 149914 -33301 -51519
15025 -51519 497515 51104 -84281 878692 -144096 329551 188069 235061 -106934 192566
15014 389100 204469 229947 482387 400290 243145 189058 206144 436333 254853 71887
15003 270897 105053 -116269 171230 184694 102163 113468 268211 253141 424600 178446
14992 28042 73977 323087 150514 246248 125551 126475 630395 245769 292931 547275 214536
14980 361515 134148 15058 42434 180086 61783 129555 103060 381695 -72153 263653 101198
14968 297726 382317 456815 227081 440618 242994 244420 65511 348682 386362 406362 391486
14957 391486 -41212 2639 57667 143321 470504 124274 146701 504328 263738 337717 375449
14946 375449 299331 430023 229345 431700 65124 37078 273736 -51384 492273 38919
14935 303430 124923 365632 513639 187409 232115 409340 122009 -154684 302111 -122815
14924 117429 94272 347111 518026 226344 109513 72200 517792 154901 558818 423231
14914 423231 34884 127249 299489 436910 311683 297845 278368 228733 327808 422684 285556
14903 285556 215568 420902 161916 274600 327112 359626 708006 363083 113396 206496
14893 206496 749722 204971 81807 371921 405819 700417 460368 243984 352298 60572
14882 73725 232327 401089 91159 450916 336205 219024 -33361 398461 258530 525881
14872 525881 415124 223216 232410 148503 264899 638596 513865 283873 444169 449261
14862 449261 486667 357206 324062 432619 149957 335408 371617 466111 277860 298526
14852 298526 481307 626451 413634 360133 482066 510599 685175 384360 473508 606649
14842 606649 196539 306730 360901 898084 526398 119522 552111 716787 645831 374621
14832 374621 492324 608343 428707 383433 468760 402987 713751 472733 571885 587468
14822 587468 484794 521560 391580 593387 516964 464589 348989 544900 980589 553089
14812 553089 491113 479419 501220 410278 820106 572885 820179 311135 609961 688239
14802 688239 219380 613644 481045 468206 305399 618224 334959 645785 370770 643737
14792 643737 612079 905319 546171 503519 307350 587848 521510 723485 391707 441450
14782 441450 325023 716331 449084 325018 774742 636621 636993 892920 527508 824518
14772 824518 670059 659401 554588 772621 385563 488576 497552 568725 364332 685201
14762 685201 778164 516025 567401 521654 213955 473429 450923 150901 560699 436013
14752 436013 173763 759817 811527 523261 333584 778687 726178 1071457 819831 710628
14742 710628 840944 931325 800741 891672 820299 693762 833973 699670 646203 595823
14732 595823 728491 674203 823815 653623 792574 924577 600245 575832 723441 889904
14722 889904 1087311 931176 555315 755917 774289 452103 832559 580188 700410 514560
14712 514560 795787 878683 704259 907865 721073 650535 770468 800650 856889 1252198
14702 1252198 1195941 924043 971972 998323 850144 870042 1113581 715566 903425 1063942
14692 1063942 829988 819902 937374 1250525 988851 847245 594706 994505 855407 1196095
14682 1196095 1297282 941639 1293085 1008022 1088254 806292 1002419 851199 815928 982256
14672 982256 1002552 1023726 1086306 791864 994871 1088760 1263163 1009490 1106457 896257
14662 896257 778943 991123 903152 961190 1053023 981591 1073091 1218914 1254834 1120020 1244188
14651 1244188 1267087 1392589 1031383 960485 1112449 1076028 957084 1182129 1390330 1548629
14641 1548629 1412670 1323753 1477938 1210073 1267108 1251455 1304377 1235827 1329605 1500469
14631 1500469 1222694 1154475 1300928 1130142 1475156 1436472 1210514 1417434 1474099 1409837
14621 1409837 1308186 1433179 1081241 1277175 1267011 1552719 1571548 1293957 990025 1110939
14611 1110939 1552157 1308289 1378547 1358477 1343572 1698392 1572766 1276866 1423115 1848028
14601 1848028 1341243 1725715 1376932 1581575 1457320 1788331 1857502 1636574 1942094 1538433
14591 1538433 1970159 1871635 1812379 1835152 1902687 1782300 1705258 1930338 2130195 1928396
14581 1928396 1501300 2001281 1946892 2302922 1813677 2102040 2082519 2204990 2408612 2004200
14571 2004200 1953742 2043810 2231745 2051878 2343868 2606047 2380349 2489534 2470273 2791575
14561 2791575 2474953 2845234 2505999 2532797 3348064 3411910 3123049 3576280 3877158 4256727
14551 4256727 4707652 5822232 8198732 12404184 19746902 39369374 42405789 18929613
14542 10646935 5594524 2964982 2264586 1877506 2155188 1803626 2009500 2017517 1906337
14533 1906337 1975254 2058778 2171846 2128067 2358210 1981602 2221335 2053386 2383997 1958485
14523 1958485 2425969 2615825 2570966 2348717 2481896 2509535 2373952 2745989 2774841 2514778
14513 2514778 2743600 2766718 2820305 2707143 2757841 2496325 3065770 2774901 2687997 2982260
14503 2982260 3310512 3078769 3070237 2997269 3069553 3127063 3135083 3308527 3446934 2999246 3223650
14492 3223650 3001573 3325851 3572118 3517520 3631697 3287057 3641686 3579979 3579658 3655007
14482 3655007 3852598 3913048 3607271 3914564 3954551 4104040 3621627 3951809 4009897 3946955
14472 3946955 4238715 4127893 4029352 4178414 4450482 3956115 4380875 4396878 4354670 4478969
14462 4478969 4827121 4611717 4724614 4806352 4549153 4708022 4789507 4874428 4944973 5179391
14452 5179391 5006512 4963625 5496356 5843394 5480353 5492512 5559316 5644021 5791272 5620741
14442 5620741 5627627 5933672 5986244 6050653 5943399 6130019 6351361 6195817 6295314 6638019
14432 6638019 6701843 6536119 6501122 6889148 6641509 6940219 7301256 7110392 7569306 7342893
14422 7342893 7625269 7388140 7696346 7713774 8044201 8280048 8497849 8618581 8257548 8433136
14412 8433136 8810822 8820372 8818149 9105020 9156615 9288670 9260152 9732465 9814385 10044090 10122298
14401 10122298 10629079 10453562 10791651 10698850 10816102 10939682 11629541 11552677 11828519 12112994
14391 12112994 11820291 12208104 12596028 12926223 12830587 13182221 13573863 13486560 13851580 14385071
14381 14385071 14504158 14950400 15090242 15074089 15430060 15872093 16515458 16762836 16687258 17158909
14371 17158909 17462803 17609877 18372121 18918194 19030111 19284799 19850468 19949580 20630516
14362 20630516 21092403 21638283 21993792 22577281 22798743 23912336 24341153 24683565 25492807
14353 25492807 25980567 26485973 26863522 27418938 28592168 29486808 29940478 31193425 31456792
14344 31456792 32382243 33405281 34094590 35480895 36173695 36906116 38179904 39428120 40532314
14335 40532314 41132178 42853666 44161985 45423993 46873093 48363895 49615480 51194556
14327 51194556 52811363 54554742 56956081 58643979 60700874 62501449 64948256 67382019
14319 67382019 69750208 72089505 74907203 77687466 80948576 83983934 86979620 90890705
14311 90890705 94640153 98880417 102760345 107272591 111755968 116802289 122243014 127456643
14303 127456643 132909544 139110164 145353964 151957298 159052824 166488806 174411529 182754721
14295 182754721 191870652 200817307 210745567 221037650 232014258 243495969 255144062
14288 255144062 267618519 280424902 293939913 307483317 321377492 335891319 350584131
14281 350584131 364871461 379507366 393707608 407509718 420389093 432422469 442692926
14274 442692926 450587589 453501386 453348153 454645786 456462833 452436054 448315227 442787018
14266 442787018 437711382 429007382 417096622 403241377 388259402 372841928 357034408
14259 357034408 340965902 324909611 309123152 294158932 279040621 265641196 252493606
14252 252493606 239668972 227118499 215656512 204808413 194133289 184497913 175375877
14245 175375877 166900099 159040565 151481632 144244385 137574615 131252074 125048706 120050010
14237 120050010 115090985 109909487 104893314 100152614 96198845 92605118 89354325 85564701
14229 85564701 82246697 78779461 75994967 72836267 70424119 67624964 65198914 62829003
14221 62829003 60937551 58919914 56937622 54763104 53161951 51331382 49957970 48723768
14213 48723768 46979420 45381846 43915139 42795470 41483044 40657179 39879814 38924941
14205 38924941 37146934 36184203 35089574 34179885 33161267 32836052 31648720 30786595 30067944
14196 30067944 29224083 28468148 27777993 27241001 26690733 25875395 24902324 24656320 23867316
14187 23867316 23225505 23010258 22597263 21805582 21376316 20971695 20876623 20017912 19643606
14178 19643606 19310360 18750313 18620006 18053510 17602723 17693201 17093568 16910490 16666501
14169 16666501 16140411 16071166 15777837 15348762 14912449 14773767 14560166 14195774 13899882
14160 13899882 13842123 13470688 13375282 12899222 12584293 12700412 12494213 12189363 12384481 11746054
14150 11746054 11616186 11577127 11120051 10982314 10998306 10779711 10563006 10350756 10521455 10562732
14140 10562732 9814505 9892098 10005402 9455699 9438165 9172045 9137050 9452025 8952236 8838749
14130 8838749 8601476 8619401 8393142 8208579 8072747 7956480 7875011 7921191 7725524 7456991
14120 7456991 7646270 7286274 7302264 7226664 7321161 7173063 7102307 7195031 7026752 6745331
14110 6745331 6717406 6592821 6408292 6675071 6390882 5949826 6061328 6117636 5630100 5905548
14100 5905548 5820347 6054560 5733427 5792462 5543231 5711077 5375859 5611807 5495187 5198669
14090 5198669 5088274 5138580 4841680 5397195 5218530 5177009 4811390 4596103 5030548 4901415
14080 4901415 4537041 4398904 4638479 4430504 4398550 4311215 4756234 4389753 4470730 4357920
14070 4357920 4284288 4265384 4300077 4221229 4095026 4068100 3765599 4044670 3987272 4238465
14060 4238465 4154464 4125302 3926238 3997366 4019187 3748809 3689360 3675381 3885918 3514824
14050 3514824 3698180 3429046 3289887 3242879 3273664 3129341 3357572 3445692 3401657 2988752
14040 2988752 2953231 3228013 2987585 3159129 3233629 2962319 2970554 3089224 2910095 3304632
14030 3304632 3256466 3058313 3006385 2805690 2462041 2694293 2540737 2380568 2899531 2568371
14020 2568371 2629517 2610621 2726825 2499959 2490709 2509281 2429144 2196582 2502425 2736845
14010 2736845 2763114 2176034 2210995 2136963 2257693 2601198 2300734 2066336 2470372 2364569
14000 2364569 1954810 2328139 2136119 2045591 2179824 1873210 2105264 1754798 2305883 2431323
13990 2431323 2946931 4330739 7382322 12878947 30373189 45476516 24412738 13102305
13982 13102305 8042818 5431763 4225056 3604417 3168332 3306378 2609346 2439396 2579661
13973 2579661 2692980 2563341 2174197 2620277 2454452 2419884 2153560 1755472 1923503 1968843
13963 1968843 2224765 2152759 2096617 2050157 2263410 2072118 1841102 1930043 1783029 1720790
13953 1720790 1927194 1998094 1744480 1630200 1886560 1815343 1838068 1603186 1956677 1516362
13943 1516362 2101530 1755201 1640350 1611425 1759877 1747852 1772558 1801846 1808267 1541382
13933 1541382 1731013 1801770 1572769 1622412 1334220 1529737 1613250 1351904 1946820 1612331
13923 1612331 1427919 1632688 1562456 1354297 1678826 1457390 1346407 1473406 1428205 1443824
13913 1443824 982686 1272438 1324433 1187590 1197976 1599257 1438973 1464963 1406341 1075567
13903 1075567 1272073 1262783 1522628 1135750 1175704 1315494 1314308 1121793 1340406 940805
13893 940805 1188639 1557177 1210844 1535105 1164243 1324287 1531304 1217848 1324756 1167447
13883 1167447 1179061 949440 1395172 1697150 1032372 1177128 1431516 1035231 1211473 1422303
13873 1422303 1215466 1136948 821861 1562069 1309194 938168 1052706 1259741 822652 731571
13863 731571 1326616 1335404 1066597 905510 1077725 1087441 1308302 840022 829294 1155669
13853 1155669 1043394 1177941 912309 1354452 771540 796066 956893 886093 1100035 792709
13843 792709 883266 911598 890219 717512 919943 832463 753346 860386 903579 1106172 753566
13832 753566 1311641 742533 1097702 988083 841787 918870 931453 682232 783488 986511
13822 986511 992604 970897 680706 1054866 818320 773569 918628 772218 1057245 1294987
13812 1294987 879893 504697 688152 744308 913330 499218 900085 634799 538202 825335
13802 825335 760354 822049 656650 664215 559077 791695 789800 563630 459434 704535 972004
13791 972004 824970 881831 982043 858763 1099063 543743 543048 1257051 1150723 780997
13781 780997 877485 757677 514864 437437 725764 793351 894697 506875 536950 575521
13771 575521 575824 460369 680896 625750 644312 669368 842339 635986 636708 723151 746454
13760 746454 696653 910612 657250 605504 614418 836019 577661 430503 352625 879949
13750 879949 721958 761437 545017 378341 587588 525480 461490 648762 793486 699161
13740 699161 737748 900483 769871 583370 469274 546154 521976 521205 299953 578069 455983
13729 455983 197659 469018 579065 790421 664318 474081 782141 979057 414721 521339
13719 521339 345729 679242 499156 415872 420985 513541 385625 444448 423554 443556 517262
13708 517262 602551 328050 749962 496000 386511 691084 410030 549484 462283 268069
13698 268069 593949 286480 489418 614540 465048 454557 578900 533050 436046 530026
13688 530026 690063 441652 299958 555206 400058 536211 380046 450246 350862 363840
13678 363840 372749 595841 384414 464197 386013 377481 940362 489653 602847 401695 517544
13667 517544 637171 607253 567348 258473 281949 23058 875635 261376 591839 602608
13657 602608 515200 321044 543367 369079 312209 172834 513141 162682 383811 602369
13647 602369 362122 761230 1060478 353819 360048 518771 207896 496226 699600 167657
13636 539305 -157119 673288 224856 424720 748219 62819 509223 321547 349592 269049
13626 269049 196328 115424 338817 430793 36957 501803 388611 365831 417773 537750 424591
13615 424591 463263 439200 317269 282118 329167 368327 153106 98785 391045 382133 298388
13604 298388 256193 486830 376213 250526 405174 554188 448402 379947 323766 408248
13594 408248 91198 205947 155089 40581 197841 268714 347663 18913 359831 751549 45202
13582 223239 421084 366540 366218 66129 140261 135395 606624 295459 222894 414035 216297
13571 216297 397765 270273 277403 282636 216254 325236 658549 329938 266157 327183 143716
13559 329290 179952 436966 154915 169914 331375 433797 135450 183704 467561 111595
13548 342647 402661 229150 353267 203062 202326 -70955 19335 574959 392524 401101 232944
13537 232944 549227 131943 366660 274916 237091 178545 216082 280227 162023 26250 99903
13526 99903 249499 328888 331010 282910 426085 162075 -134773 458026 241208 342864
13516 342864 215376 319905 73394 -98743 481820 229518 189821 527026 175397 271038
13506 271038 314916 322222 315055 21920 219006 522707 -244636 462217 407464 197720 -37580
13494 146717 512189 418680 198944 350574 272981 528132 322040 111084 77192 365565
13484 365565 24340 -1510 288543 128176 -2514 239920 262754 194092 522558 290325 409967
13473 409967 491224 372307 357775 226351 230446 392677 473051 254453 -85745 -27731 76081
13461 503525 129182 340619 105500 88681 156797 153991 128701 517344 158401 206802 479082
13450 479082 17467 -5506 -46904 -18300 84830 199372 399349 196845 424005 308022 370119
13439 370119 222094 -12235 189606 280755 333051 220202 174339 271789 -173063 -1203 195150
13427 373806 233784 138385 533066 212714 156613 374800 88383 205656 31712 185017
13417 185017 242080 193369 28297 439427 260369 451730 -243905 22057 471778 -35450
13406 96393 -9189 205441 275332 -3350 142918 390758 100133 612758 211907 486816 100518
13394 218041 142073 242533 444854 127391 -95148 546890 429773 209572 278873 -104783
13383 -207524 -18834 429413 59036 -252237 288127 168500 159942 -65369 82590 195960 467360
13372 467360 460994 -27138 167431 209220 224188 200424 483077 358855 332579 190935 434580
13361 434580 42379 85877 235498 230295 117452 92170 23265 164290 290854 274044 129663
13349 248535 -64137 499561 588499 90194 367074 524398 293319 390851 514076 -5893 213967
13337 368608 147996 283848 136279 331894 164259 76689 236726 153711 313330 8958
13326 381493 168593 347387 476412 171812 205945 -178446 405930 271435 2066 22538
13316 22538 119736 78474 423197 241492 247561 171813 380009 325443 87175 329366 -168965
13304 79888 132759 435544 -147660 243583 267569 -157509 -44304 166586 51424 -108616
13293 -997 182347 -74533 6058 306287 290422 123373 136484 127105 -159321 -32959 28137 -204574
13280 83734 312524 220688 101237 -29878 -160384 -115182 -56703 454240 431797 162895 352544
13269 352544 236301 -191985 23031 149607 179584 -344756 77767 218099 282086 -231540
13258 -300720 -54906 -32342 677473 -24897 346942 340331 321071 115069 358215 -148466 272895
13246 76175 322769 85899 384588 132324 323390 268962 -292493 -131340 160870 228325
13236 228325 127466 213666 -198871 -46121 168131 76053 470282 -54061 104009 241206
13226 241206 22955 222347 17533 -223620 492605 39850 -39632 336453 170342 219317
13216 219317 44925 119451 34088 207744 86786 -141656 417608 216962 121861 -208318
13205 93568 -100958 -114432 40403 399798 -25836 -15284 26265 113450 -150642 218620 272332
13194 272332 10251 -63793 413911 -56016 328358 46780 19353 11260 195256 -198395 -444804
13183 -444804 216700 -34061 153188 -73677 301307 -39375 119889 -79087 105994 350371
13173 350371 103797 -15667 34328 -7585 140264 39619 65560 237797 -20981 114670 132963
13162 132963 -154369 247539 -201482 127402 -77628 322116 104118 104355 257961 6574 243114
13151 243114 308599 108660 -160535 -96335 317654 -52585 -131330 -58985 162473 248870 -265341
13139 -23751 -14568 36048 180557 334272 -69467 -368841 -44125 112946 175075 143671 67216
13127 88828 -102333 -135844 34209 -60646 49324 68723 -227014 -47403 68175 299868 -140745
13115 -70009 346813 219889 56572 -148538 91059 103429 -26101 3672 -13069 -3069 -168674
13104 -168674 -88217 76407 58898 -176444 257082 -20261 158047 99547 115836 -364511 -42805
13092 108651 247161 -13969 -125820 285668 -78742 108487 56371 247753 291700 -129736
13081 -137185 -14397 280642 -57786 -123857 209418 -76637 167597 -121560 -27189 2105 -66405
13069 79052 -13357 89126 -90367 141629 63379 134539 171011 18153 64119 44302 -13905
13057 145149 170313 333145 -186894 -330300 131624 194111 -212793 226220 381543 -50215
13046 227586 -94379 183793 15929 48960 358345 -25557 -153506 141928 281160 213501
13036 213501 172877 218388 125278 16812 113934 -128295 -73153 291552 104159 58914 121928
13025 121928 145976 230447 156552 181577 235111 187249 150589 55942 -35449 -41450 368611
13013 293183 287160 62710 -243693 263233 213450 440181 230367 66872 256488 365305
13003 365305 51139 69823 250671 -25818 -63951 -73072 31832 187384 295729 118577 -156897
12991 15168 74611 141123 144110 92867 64476 -97905 -137859 -216499 184192 35397 139444
12980 139444 402101 149850 67796 -201773 78300 30196 152673 -72412 40937 232278
12970 232278 -168464 -268972 104558 244182 81739 95164 186508 155791 83188 257032
12960 257032 113657 -4404 205657 35684 -19561 6212 -176445 -20892 21714 165593 148113
12949 148113 -33874 -38913 -113609 -94387 -123411 181906 -44691 -221679 202200 162670 15485
12937 -75517 -7250 49696 24822 -175379 92477 339950 221393 -67366 198787 129866 344224
12926 344224 -20967 -166630 146282 -200981 -293441 -253279 251739 263534 291501 98219 -37492
12914 -27017 114286 58366 -203284 -98979 251418 259277 276962 -224338 236137 181476 387709
12903 387709 215535 43533 -103892 45794 21778 -29025 -121223 231932 -233529 -42520 191789
12891 146133 68267 -216854 -119147 -130128 119205 62170 73267 136595 -107021 89158 -507222
12879 210135 -138819 137480 -39429 -8791 -293365 124251 -31965 -54765 -14103 161999 94661
12868 94661 -227344 -39876 -68818 -144295 129987 -158586 143523 151302 -158646 36889 128510
12857 128510 -63149 -120298 -2292 -187172 171729 -66294 -17723 -225997 135888 -52996 -61019
12846 -61019 -220551 21947 129796 151274 52569 -101396 73316 -357887 177876 -97328 -110567
12835 -110567 145593 -130682 243969 92369 334798 99716 103824 -303765 39682 135103 -114973
12823 205439 -34617 -183942 -30864 272863 127722 283871 -208100 280974 287638 -207938
12812 190042 -44772 13943 197316 -167060 41897 47415 -209853 -62566 -61700 -80271 -80122 -20982
12799 144025 3335 -236012 -55178 -68762 177844 242201 31298 102212 37629 91131 152137
12788 152137 277595 115073 115228 286178 -7867 -126421 -21926 132927 -49110 -179762 -152053
12777 -152053 -336559 315716 -191244 58833 -8552 261833 -19496 229522 5108 45526 -325808
12765 103628 84067 -143874 -67053 -85733 16375 58606 -132957 -223360 183988 -119854 -98481
12754 -98481 -153616 94526 191983 -22612 146716 -103391 -139450 62535 -219742 157907 532844
12743 532844 -26040 305466 -108221 54639 193436 194959 378015 105979 281925 125682
12732 130358 380105 321592 241337 267180 26378 37972 68812 -81168 -223221 -68686 -145882
12721 -145882 468148 -194429 -79691 81730 -25459 -36798 -244236 211146 -139674 62780
12710 231554 121327 134876 262938 220065 348730 314587 -112034 297596 513024 246894
12699 -119453 350861 198227 44455 205126 -216778 -203121 -298644 -104250 430936 -121110
12688 -80410 186530 15031 -30967 -345115 22487 -120023 95375 28059 512766 -62113 37734
12676 -80844 249664 -89732 220939 157034 76064 -189308 -86898 -12174 -9953 155884 224450
12665 224450 -6786 -135809 166045 106789 137068 80896 -65730 -272749 -24263 174584 81054
12653 236373 -147166 -22983 143533 294941 199182 44703 -120869 -227145 -88174 86701
12642 239752 6988 156151 -226523 100968 -265710 45069 107215 310127 298369 107860
12631 84778 165260 205437 66516 56174 276138 372059 218734 257579 191736 58560 -92363
12619 -35315 243055 70437 -140482 -41269 -70198 -32836 210315 193804 153091 63024 174339
12608 174339 -39579 -18093 230336 167027 477109 350648 16390 100474 63349 89287 142950
12597 142950 93984 99303 278625 56206 198149 -284559 -184410 24855 310704 -351308
12586 262170 169490 23112 276017 -114525 -48358 -15816 -277067 -36034 59526 -171871 31190
12574 174805 95614 -2439 77542 28792 -14263 107362 -175375 73509 -225954 163351 191670
12563 191670 26181 -21443 241949 -58155 150554 170182 62622 48348 -133211 212248 259740
12552 259740 76879 -37529 15829 -6118 116310 291182 107314 22075 -74778 -9974 34951
12540 -3432 -30161 133098 154255 323757 -154695 61956 483899 -270291 -128453 211788
12529 -231628 -119444 314158 89406 -43880 70078 -114126 -93996 349615 -84189 -9917 -18564
12518 -18564 273971 -63591 -97341 144112 128114 -198102 -64392 -76197 126424 -118611 187509
12506 -199929 -412084 110369 -50437 177757 -285990 -60196 -57514 110245 -415889 40518
12495 16797 12305 105887 105215 -44303 -30364 -141112 154778 481230 327196 -83844 -1068 -366825
12483 -366825 1665 74258 89733 -40557 -230225 22782 129535 -117355 194168 321547 37672
12471 -240950 119831 99883 -374758 -275726 44804 -54983 272329 2275 56141 -83233 14478
12459 157423 160971 -53228 -73318 -277475 266649 67720 92866 -125552 223930 -56018 -108040
12448 -108040 -193831 -54242 182254 -97939 1189 -82246 263670 242551 260809 -70046 -739 191299
12435 -3077 221565 104850 48845 -267150 45119 -6304 -283109 -77115 250331 -30053 48105
12423 129308 -99038 -65926 57056 218581 -251106 135782 120802 229449 142414 -134457
12412 47217 -232054 -85640 110540 304 180125 193146 40513 145648 -16487 -206466 39371
12400 41338 30561 -132280 7597 150288 -194629 -48865 -227928 -15970 82030 16910 -85419
12388 50168 -124699 66755 124190 -1880 139164 216946 273636 90001 175049 -301622 17242
12376 -157247 249546 111955 9009 201187 -163036 180875 93330 203873 265262 -51566
12365 -113075 -35612 152109 196345 -118403 9859 -192528 -94529 -352381 -93858 -14140 94463
12353 -196059 -36981 -17011 25541 141132 192596 225693 -206479 1601 -92366 225914 60943
12341 -315887 183961 -176152 147402 39627 -204118 -71814 151862 -10805 -4592 -114990
12331 -114990 -286733 -30812 68190 983 -89089 -70207 91035 74190 64253 -86090 -279156 -159070
12319 -159070 -15262 -297225 198535 131479 224878 186467 64842 277582 74634 121083 15597
12307 102868 95341 61312 -199803 -80049 -113469 -14390 225867 -415255 91480 90734 212340
12296 212340 361442 -193785 -125356 13264 62543 -114643 -27928 515567 107954 207988
12286 207988 109800 -51961 -68301 177336 164338 137305 296050 151265 214933 -36878 29340
12274 101288 67409 191321 218627 378756 177449 568446 -39236 388144 -54454 -116967
12264 -116967 -17518 91359 -27982 -223941 39213 -116428 -224740 178844 217155 -34355 12220
12252 387588 383797 54171 28135 29459 -131972 124935 78879 35309 475590 293865 -68250
12240 281285 -89336 186447 229989 -85167 311465 72865 134640 -47509 -142172 29727 470034
12229 470034 -163717 -191974 2831 -146013 22505 146639 362219 288095 114143 64020 23932
12217 128050 334818 334134 -25457 171329 155216 20361 263187 20971 191443 180174 -99764
12205 -3646 503763 149802 -50449 126426 159975 335006 66126 257171 219434 273879 131538
12193 250802 245236 262872 326130 450475 -42996 427238 -80208 71222 96006 -118299 270659
12181 69639 81329 207914 165944 96757 230114 -123188 92891 -150128 -85092 -48746 202226
12169 299297 70237 182507 239779 823990 115698 281110 -132021 -117012 -185003 20770
12158 -233865 426271 -76264 170450 -14105 -59989 209589 -61295 184346 69840 296125
12148 296125 -206135 -66294 156422 69838 51453 -59110 -23250 -16183 25789 21627 -49605
12136 218520 276886 72422 9219 77875 -78178 109098 -135920 -130665 -199879 -117772 99008
12124 165554 158895 -280969 -358902 45380 -168130 -280244 -143404 40887 159741 151682 -64847
12112 -132201 390688 319815 333497 -57959 -56142 -17205 129461 204773 -153230 178882 -85809
12100 -62602 -264518 150934 22878 -27927 337637 83586 124248 197332 -90615 69109 -227616
12088 292752 297576 -262695 -38743 14238 150052 495571 120062 373874 808161 1992005
12078 1992005 935961 476756 -62263 162065 180 -122225 299815 47872 92756 -35849 227645
12066 289355 166018 -83098 -466278 -8890 -36583 338532 -102927 -110917 -119606 351701 -16095
12054 -168608 -25473 95658 -17486 164528 -243665 94610 -246771 16111 61400 65550 -290015
12042 -123741 273400 -126754 270185 198117 113506 339824 -268956 -1174 -95952 118601
12031 250391 -56478 20700 40645 87526 42136 22920 65755 127201 -155769 182286 187830
12020 187830 -162652 -161669 -106897 79530 -64433 -295506 138448 -175717 157108 217337 -131980
12008 -84304 -117481 148512 -192880 40882 -79607 -211158 -184275 -376234 26460 -94468 360862
11996 -158035 29413 23339 41956 -382047 961 -154975 317976 -50605 -116953 171804 -170137
11984 -7674 36017 152718 105081 331288 70102 121392 188573 -7132 181342 -94814 240846
11972 -29727 -203530 38003 -28678 -23187 -3809 -127436 227520 287664 -87159 2133 133188
11961 133188 116592 -204712 93889 226872 -12344 -117308 -172968 148151 323756 -177871
11950 -137360 97060 -23845 -78704 -86925 104255 -224123 -178463 86044 -24125 38622 151925
11939 151925 40761 30145 -28704 -158170 -82864 17482 -6879 132272 -238316 -298350 -180851
11928 -180851 -9397 -99429 -122350 140670 -164703 142369 480139 79188 98338 -254025 24925
11916 118188 72690 -170293 56720 -11963 97073 -80264 -110210 268507 119190 99003 13948
11904 -114329 -52082 58028 -107616 127241 102828 274456 11906 -136692 83977 130488 -126298
11892 -72775 -42173 33937 136526 -29124 76498 1535 -174646 -146777 45866 229903 -134226
11880 -127859 -221846 -44719 -442458 -320016 -88656 -295894 199662 -27903 -95841 161085
11869 -61973 -26382 -202746 -62962 144033 137299 -148258 72520 -393617 -277575 40539 -104731
11857 -24758 -203145 17014 -177853 264469 -9311 -119953 -136009 -55791 -95690 194519 61158
11845 -63678 -85756 56446 95640 -160765 -179090 -75706 -24207 -240190 244413 174595 7849
11833 195572 -190546 -353707 51304 89262 -281772 -5446 26108 19833 44428 425595 -78938
11821 -181223 -172765 30602 -113723 36145 263504 52715 159185 -98396 51796 -215942 202234
11809 -230907 -193385 -50388 -40783 -94027 -66093 -96962 -25999 1192 100980 -45242 444399 166034
11796 92547 -68501 -69071 28796 265704 -23378 -305088 -60153 131045 -16997 -211575 214819
11784 156728 -193215 265954 113437 112101 -103510 335890 268414 104393 273949 189699
11774 189699 50690 -115206 2570 -38067 -99657 -353486 -31962 -68000 85519 -41837 21695
11762 -360582 87502 268081 6092 87198 -32375 148253 -48022 -180644 84589 23206 343984
11751 343984 -12979 172867 -89575 295280 -331107 15626 358014 22921 -109876 43011
11740 104677 52799 65824 338488 99762 -106539 -167111 -21688 -49172 -168978 -173179 33240
11728 79665 219093 382196 -76725 23873 -8930 114048 73712 261323 -17025 -264645 -79563
11716 41653 179335 -66346 244710 -55204 243364 5609 -240251 243190 37353 275108 460973
11705 460973 291616 87786 -74311 95320 69848 -28277 225280 293217 77994 -11079 -189928
11694 -189928 -2582 -151389 17339 -11838 -214234 -78603 80691 37950 190831 44410 -406647
11682 42667 -230174 213564 -153146 127200 -112753 253498 73588 278723 142772 122825
11672 122825 -129936 26529 -124220 45517 -96516 -226451 -370433 77243 119222 -154503
11661 130628 224062 -149581 179886 -230721 -285242 33616 128108 -49471 -550366 98762 83827
11650 83827 -152935 -227597 138518 -41799 -60940 2251 502001 187282 20394 -133134 241387
11638 92206 -16894 -188446 -337377 -40058 245347 3181 -92468 -44101 37951 223253 73580
11626 -67773 108613 283350 80231 -49381 189324 28125 -114682 138468 170146 4898 -333983
11614 -87085 -199771 197763 299969 53903 336213 67850 -282935 -439340 339761 -98933
11603 -91338 45138 366469 219297 104005 -64551 346027 390651 151141 83021 -96763 17032
11591 151118 474367 284670 -1887 307957 207943 278946 204307 94172 -4402 216136 -38969
11579 -26109 -228612 -135723 -226110 -60272 366111 -68878 -9180 -385913 103794 40953 389084
11568 389084 -19521 504440 256334 103095 331867 39639 9817 123464 191694 -51347 21204
11556 154271 131114 -44010 23727 172980 -153963 90009 179170 173206 116265 172533 -54882
11544 214255 -137952 38955 -85049 282811 118066 45075 10545 -473194 -107233 -81628
11534 -81628 -3858 192787 233309 202463 200571 59738 -183471 338990 148711 40275 307603
11523 307603 89530 332825 80800 8333 237619 308593 -3140 210002 155654 -214429 43653
11511 334328 139296 444699 85209 153201 86592 362874 -11434 456804 215198 188845
11501 188845 150269 143574 -120725 159913 34616 486191 104633 37347 202109 101156
11491 101156 118086 61655 242703 -37455 58423 -92554 4594 128611 -195722 90152 -40260
11479 451108 -2168 -4040 169911 106801 60681 158246 165626 202249 66024 455687 356576 201002
11467 201002 47584 -244194 109949 607173 273551 119695 -123729 -177229 48548 222844
11457 222844 -197406 255088 4705 -220526 48051 239532 -126438 53153 74064 73422 1695
11445 456172 202880 54382 5267 -315890 93623 11556 -245072 74288 63036 188545 -275970
11433 184232 154677 55250 -328296 -122546 -342279 21966 -134183 102467 61902 189713
11423 189713 84363 138069 -284136 -196778 48534 -158209 -361948 -369434 -341832 -47576 -65598
11412 -65598 62723 -363183 267840 438485 -44103 114962 148762 -25607 46450 201208 24862
11400 360305 131123 -34177 129068 -3993 -39381 142 246318 -18791 -107744 74496 -166594
11388 -115985 -10929 -331418 -110687 37623 -1820 116334 167766 -24969 -255997 -186156 15585
11376 20186 -116507 162598 459519 -155276 146384 4652 30160 101367 61184 145950 -89905
11364 -26898 -41061 274241 447296 -118426 -129329 59441 21366 152429 227467 -130896 114528
11352 24793 -29588 -174234 -445461 253964 -46213 158070 170984 255740 -238909 -65679 145208
11340 19449 -72957 -26280 -41557 -153265 -1058 -78526 272447 441779 -175527 -153120 27783
11328 -120474 52143 -49427 -61989 -163352 -43323 -72984 -346868 -37406 -22368 85495 -378762
11316 175020 16152 162487 83784 232065 -26033 161008 195980 154188 429900 -284227
11305 78764 36364 -55422 82808 -167574 214477 -75005 -171241 -245861 193901 245178 -19715
11293 -26893 -137440 -276603 166417 -48477 -207123 210433 -172429 -26261 -326829 -88589
11282 108225 161688 -145429 146297 191599 40238 -50190 -100773 127214 -145097 -92405 -126966
11271 -126966 -292030 -49323 -123135 -245878 -149950 66026 373046 -148998 -98229 -43080 -70509
11260 -70509 -78197 -79049 -267717 -303083 135028 -169957 -164337 163705 -107893 -120314 -98394
11249 -98394 226127 2561 -209971 -289675 -27085 -10092 213779 35674 63695 -196946 -6324
11237 113737 129758 -155297 158329 -213567 -101562 -248244 -184543 -431057 -366361 -173200
11226 1873 -173282 -207498 -98250 41701 43261 -24525 -195266 12065 75286 -68103 31346 252112
11214 252112 100280 232689 2592 -144191 368075 287775 -80200 -322744 -260631 -403220
11204 -403220 33630 238117 98993 -130808 190848 -62635 -109839 152569 138492 -466048
11193 -90087 182703 -122943 -44790 -38900 -102995 196795 -45786 83300 113837 -322736 -79467
11181 175322 92018 -218279 43422 -328462 -89218 209713 -11619 33537 -299368 -255671 187726
11169 44791 1458 -234487 -283801 118225 9175 155376 146713 -367740 -152489 -50895 -22183
11157 -340092 243683 186146 133722 -187917 -75028 -55280 -39339 -168000 -31703 -101819 303573
11145 27204 173587 20489 26473 -52891 167154 -71774 -117061 -146477 168688 -244103 -48598
11133 -136475 215995 -112585 -130629 63031 337557 -287934 407170 22129 246749 338146
11123 338146 169160 -144451 134672 -56182 -253214 -162868 -3802 -226112 39210 -50632 -59472
11112 -59472 -281134 151182 178961 254335 125103 -222011 891 157871 145588 -9881 330050
11100 -169965 226581 233652 67622 129885 148269 227762 244379 10718 550919 -43965 7060
11088 13906 -229223 359978 115814 162710 107076 323123 53353 85539 275838 277715 1025
11076 -21864 359071 433918 359793 594196 332663 198246 408917 546972 828645 231170
11065 280718 278425 233519 478955 329139 86668 671659 344056 487952 538400 670929
11055 670929 537355 532594 505442 539091 853008 722346 568116 836046 641364 740036
11045 740036 818633 698657 531235 494109 897361 621748 762985 596961 587693 654660
11035 654660 580332 659436 784558 715254 444082 562082 665204 546224 811724 673252
11025 673252 666218 614122 808136 406766 373401 465482 452521 627119 743749 375481 432722
11014 432722 443607 638346 597233 847261 360325 617892 502004 702406 688280 642486
11004 642486 736797 916541 747159 505877 602844 513791 538551 462189 743932 872442
10994 872442 768320 400934 750240 525411 795618 696240 874565 743301 753461 852056
10984 852056 980369 1118622 1112021 1356388 1117064 1504682 1716286 1633488 1590805 1986734
10974 1986734 2199888 2231493 2478791 2341038 2445384 2561586 2407649 2077749 1876205 2040444
10964 2040444 1955424 1786036 1771186 2174704 1645842 2031134 1893186 2116763 2399890 2215926
10954 2215926 1749982 1623029 1569145 1250186 1252545 1450949 1117806 456323 507466 345750
10944 345750 458806 360048 120502 523974 216122 404206 254761 29671 113042 53253
10933 97402 -16777 613546 -14673 -258726 72800 139984 20924 236898 -22858 261538 257018
10922 257018 -7183 -153585 -69266 -8362 118035 35653 -174152 70017 -174985 -19534 -183624
10911 -183624 207049 104288 14309 -276873 -44153 -136243 103249 71750 14337 206197
10901 206197 267412 -6238 85359 -248870 -109269 193348 -144794 -63445 -64162 181472 -161280
10889 141204 -27634 26090 111131 -66010 -372914 -70179 -148444 -119368 192096 -80330 -80889
10878 -80889 -165390 -7840 -73138 -89192 102584 -121030 151442 104961 54168 18409 -41790
10866 85663 -257107 203635 -16861 177821 -499955 15946 168101 -374348 -70956 204796
10855 -50160 -347655 -224007 149041 -64094 120702 67798 15864 106672 -106590 2438 -157182
10843 830 -322681 -298603 20772 52040 258870 -334894 257240 77323 -43176 66955 111827
10832 111827 76389 5616 -373535 152979 -18218 -119940 -137043 26455 -81918 211542 -117011
10820 -11075 -31166 -162958 -187476 63322 -266587 47511 238228 -221984 157499 212603 95811
10808 340703 165096 -47629 -311477 -175537 149206 -148332 -115163 63875 -78051 130317
10797 -248149 -393557 -50763 391599 -251876 188267 -24575 194384 -160447 -43019 -86919
10787 -86919 95611 354560 303570 100373 21524 232083 -347513 -175210 -193507 65806 278571
10776 278571 573110 69550 -12773 -311385 22509 -317479 -150504 223102 325059 -120051
10765 -27354 -16364 -106498 123184 -65606 103452 199427 -214529 -150759 -215767 48973 47550
10754 47550 -48493 -16652 21307 90687 -208281 -244731 -124266 177106 -86482 -189875 8523
10742 -160945 -45697 -332487 -70431 -107504 -168967 102406 188807 -120797 -361738 -259540
10732 -259540 -49882 30000 57325 -186987 97492 -81854 17910 138412 138350 -55493 8658 -255355
10719 -43094 -72528 19335 -19865 -308635 219462 -208688 -112967 81859 -42315 -389470 146026
10707 86545 37958 -2442 125321 331229 165662 -44763 -142077 -100934 -123979 55947 116501
10696 116501 186267 12000 452 -76768 -17312 168947 31502 120446 -272208 27209 -136750
10684 -19988 42671 203422 186632 -190457 200726 -205635 112083 -378413 248976 101799
10673 3387 -321274 -136134 411556 198135 159752 -114445 215052 117617 -409870 -261118
10663 -261118 -211916 -50062 -176701 151016 110016 254105 222188 237077 31210 -101878 -28935
10651 -66081 -81384 54349 -313735 -212072 -17566 -375067 -40244 -124940 -182667 -120015 46848
10639 -119284 237933 -347164 -153640 -141691 21083 -105911 -102720 -68604 -148717 -140396 -17665
10627 -309244 -242206 173298 -286251 283608 -202252 -99260 -12499 -110309 -2110 142714 -23937
10615 -142889 -226169 -156471 78217 -164971 122077 -220269 -586205 -50016 -350902 -37972
10604 160281 31739 24122 -137042 255386 -66069 47118 -314533 154750 -141067 102758
10593 5509 -189297 -91377 211487 -155940 -59258 -382138 -200886 -118871 -261616 4662 -67760
10581 -95153 174086 -283294 127037 -102685 -153152 62356 453672 194995 91210 -43640
10570 88119 -450675 -88649 -254257 285339 -40404 -87715 -15844 -168577 34240 -251771 -219946
10559 -219946 186764 37943 -30789 263380 264495 -56747 158786 41189 -234082 -619529 58249
10547 -54850 -74311 -218190 -50386 -1632 88089 -191892 -64082 45266 438 356577 155241
10535 275196 104126 -188938 60123 435037 -119916 -12777 154995 8848 -318830 -111172
10524 -131839 247594 43726 -180950 39756 -180034 -202618 -423330 16882 126604 -38176
10513 133992 -126843 249282 85912 131757 -113586 -19241 32713 -38114 -153247 -203394 -83212
10501 96264 6709 424755 134745 -156264 122022 -104964 -144842 -165433 -118890 -118002 56960
10489 -134960 94236 -65205 42991 132524 -57244 97963 335670 211998 412519 848839 664052
10478 664052 478747 556129 309009 211695 -129016 -13373 263398 -50355 -36619 -61902 334715
10466 -19463 -152136 -324203 253025 36151 -52134 -212744 -240398 3261 -48892 -128209 266322
10454 -16558 235573 -45055 -231198 -32125 -79283 -61214 -228018 -34764 -232037 104851 269989
10443 269989 173653 -193068 -5307 -33490 77012 -71197 -742026 -306985 129560 -113093 -318736
10432 -318736 -44131 83222 -94383 -86418 124861 -153256 84923 261894 52278 -43746 102174
10420 277155 -103431 268178 -433709 -5845 -281757 -223622 -59302 -16809 -146943 -72170 -276161
10409 -276161 76502 -2330 47645 11040 -72989 -237811 174637 -130576 -20381 145465 33937
10397 -128659 -3668 -137636 54837 291440 451235 -2798 303845 102649 -257650 -43687 146780
10385 168971 78080 248791 -329357 111818 74003 174892 245437 115665 223394 137633
10375 137633 167939 443761 154537 39893 358985 339369 175076 260943 202961 651038
10365 651038 466280 251488 211058 71763 191513 190370 322594 72143 322536 146704
10354 347187 29805 317367 -122886 659522 447525 329053 578817 264621 697364 477172
10344 477172 426221 178089 410738 350712 -16086 28073 20797 353511 197397 -27754 -149527
10333 -149527 -77999 254287 -85801 -265615 163608 -342570 21680 -12674 -94154 -124501 141885
10321 -6836 127305 255805 237178 144999 219875 175141 73352 -638 -171780 286013 -58339
10309 196561 119042 -5674 -195148 -89020 179548 256627 -161050 -113169 -74887 -231797 59690
10297 67197 -105366 142457 -125407 -237057 -258313 -144720 155364 12615 -493371 -73007
10286 -235979 280474 -100631 174887 202913 -159199 -199783 -122286 395240 53315 135746
10276 135746 -13196 29824 89549 -94650 -291540 4628 -114406 -159819 83697 -102560 -83845
10265 -83845 -193689 68156 85759 -4399 405436 508167 349094 247143 173773 522255 192226
10253 244672 282315 46327 107484 -159321 113046 260569 -52311 -122438 320461 -166285
10242 -89327 117355 -138049 159468 105303 -29595 -181450 -46611 10255 8088 7381 238178
10231 238178 -34388 -232322 -91537 68322 -142745 -129474 84890 -28962 -15768 -38198 -71378
10220 -71378 -127687 108269 324901 164116 -98607 181392 -113099 -220254 -38406 82189
10209 -240831 -247253 -436181 -2192 138416 -254413 -221500 -219349 10592 31460 -35344 -309283
10198 -309283 9582 185865 88859 16371 -75995 14965 -67869 -190605 488023 90537 -359692
10186 -201967 -406173 -30065 -165511 -181072 103085 -329 68255 -210494 -22225 -141761 -33656
10174 -96338 251623 -51328 72562 -166534 15978 -144593 582732 -154308 7687 -188953 90278
10162 261556 103976 18711 236825 278858 182007 -275596 -69664 -63223 -151938 -229357 -139234
10151 -139234 -153325 -178814 -222399 -248761 -284895 190528 -84311 -166134 114082 -2383 -21089
10140 -21089 -116095 211644 -387470 -87740 29958 -14001 5743 -73757 -301054 -265675 -358928
10129 -358928 -138861 271197 -141725 4315 -50507 -357800 65966 -131526 85292 94037 -395014
10117 -123309 200282 141582 -21719 -124456 -231629 -206898 57436 -76945 96286 3611 194687
10106 194687 -164927 -321018 -38508 -231217 -266400 -414289 160854 -53966 -418909 -43743
10095 -260844 -218258 2769 -94238 -59574 -197679 -68964 -116744 172546 -330865 -96806 42864
10083 -12199 -112970 -43 -23921 -64732 78848 -84639 -169656 130440 101999 -114020 -92599 -106844
10071 -106844 -126009 53213 216287 -269814 -312268 -97120 57615 -140943 -20722 45837 -19909
10059 161039 -271155 -72287 150442 -147186 -263199 34538 -75201 -680466 192362 125477
10049 125477 4492 122137 156795 163095 -283241 16703 53373 69192 -185234 7929 -103080
10037 -132406 -327117 -312299 -193394 184225 -323089 -77339 112721 -49753 126856 -503744
10026 -28523 -502933 -86362 -228509 -167132 -391378 -354425 -192781 -244345 66471 102588 -364329
10014 203456 30062 -396795 22343 -21311 -159036 72387 -177257 -229133 -53507 -20374 -98476
10003 -98476 -223568 -157650 -324597 -76214 -325394 -335359 99019 -403941 52546 -207887 -25502
9991 -52630 123281 -28154 -64960 -127920 -226434 -193336 -283226 150994 -72337 -192363 280176
9979 -32466 200703 141011 -248656 -245424 -128069 -194529 -298864 -286590 -238714 -32513 -486376
9968 -486376 52273 -126319 147702 -169574 -214735 -243855 -410953 -57418 -127266 -15991 -320667
9957 -320667 266947 -328768 -169484 -11518 -195806 -473126 -143919 7649 98407 -93170 -136854
9946 -136854 73984 147470 -330367 -295989 158870 130208 80136 -13744 -219708 -45044 -68107
9935 -68107 -119826 -325627 12077 -232755 -149735 51706 1742 -322218 -17597 213070 96692
9923 -32841 -110024 13434 -200257 -209990 -5733 -40045 -21396 -311625 -52225 -40455 187367 -341355
9910 74399 314226 374898 -287232 -267024 -179233 -25699 -7905 -54195 -436230 181065 -330151
9898 164482 208174 -49161 236432 -67456 -130061 -152403 -173370 -84051 -285938 -161066 -131061
9887 -131061 -368195 -5933 -224443 158050 -172889 44878 -428525 -82459 210612 -19242 -253447
9876 -253447 210712 198074 -307212 68533 165019 -193054 -229697 -275481 -45623 -189315 -309558
9865 -309558 -22928 -237713 1544 -2268 -128916 -163846 -148387 -252444 -166666 -331299 120377
9853 -176951 9421 -8565 307293 -84445 -284953 -189407 -13375 -93475 132730 -91828 134216
9841 48617 101466 5086 -6098 -192736 -266966 -69682 -13218 6025 133220 110778 -249534 -195797
9829 -195797 40213 -278050 -397061 141760 -185898 -5829 -196565 18083 -79445 169826 -53673
9817 -88306 -437936 -263918 121360 135942 -196089 -62798 -9695 -144498 -281560 198093 -87838
9805 -177312 -120682 -312296 23519 -5746 280943 -401439 -246310 -97325 -54480 12960 -174576
9793 38505 -2181 162210 -108996 66110 157675 143968 -79317 -252797 -13255 169447 -392 -77199
9781 -77199 43890 -286008 12626 -95634 -24244 -71772 -78252 -102769 -259545 -248193 -201103 -224343
9769 -224343 -112675 -71971 129832 -643 178512 -162311 192070 -35316 -83613 -121069 51060
9757 -218636 69506 -282136 159839 -183787 -177822 77430 -93152 20282 -300794 118353 -103404
9745 -460336 169586 -36367 183942 124944 231044 20988 -294128 -266636 -233300 56263 -101178
9733 -166339 -69305 68066 -209629 106999 -121195 148921 181433 -356995 156129 -283139
9722 -6679 176231 -247880 52706 -13085 -292043 -34843 14747 217044 60359 141018 -133028
9710 -163836 14666 -267928 -207258 418419 -202948 -86370 -239378 263876 -88938 -60186 -299388
9699 -299388 -255367 -259063 -79671 -13897 -24776 175568 4826 181838 -179681 -228997 -269904
9688 -269904 99666 -23428 115408 155810 33415 88614 -224134 -119347 -114861 -114059 108287
9676 -175384 382927 -57719 -99561 -263794 -78063 31794 -169873 -14517 -54665 -124616 -145208
9665 -145208 -41951 -92559 -156733 23193 -28736 -66183 -385238 135915 -202385 -99341 -72 -98553
9653 -98553 -76997 1886 -389739 -7106 50180 -158465 119105 67679 -43363 54177 -9386 -255389
9641 -255389 -575215 60682 110059 -60639 -112435 -38371 -163798 -132077 -271773 101370 307019
9630 307019 -277310 -206431 -31835 196782 18279 58375 8555 163372 -230947 23484 6312
9618 192902 196371 -72869 -301774 -85754 -280926 194326 -103242 -73184 -70249 -44434 -20803
9606 318271 -63106 -206827 171208 -3932 -71246 128077 2720 15207 -171202 -174027 -243005
9595 -243005 -441727 -53148 -33780 -80753 47934 -441012 41342 277175 94080 86089 -88693
9583 -81942 87521 -94103 -194259 -374183 -135797 -158134 -205685 -20635 -75607 -74488 338322
9571 -215742 229730 -177102 228305 188575 -108419 -135273 61405 -179074 -304920 -148580
9560 -45839 -31526 -172979 -52283 58786 -382969 -266701 214623 -114653 -43072 -190500 101891
9548 -344319 -25115 -56490 -101993 59386 120054 128538 -113437 106646 80918 -208023 -141296
9537 -141296 37219 -160388 -13076 -18831 142559 -174001 219157 -376350 -169827 -50274 -51534
9526 -51534 -155455 -79327 4174 -64490 -15102 33739 -71124 118397 -184807 -21507 72790
9514 2801 -354718 -194417 -234501 17471 -94082 -391371 -101133 -587455 6724 4595 -469831
9502 111828 174453 398282 -47700 144038 -117412 -90502 -248992 289563 156129 32968
9491 128695 136470 37608 32362 11878 -107230 182601 -203983 -470570 212988 -45226 -2906
9479 -21508 134480 130807 -341192 -49137 -198236 -40815 -18685 91094 -184785 -182705 -69597
9467 64677 208442 -71230 -391409 286201 -123969 -149893 -50664 41718 109793 -227794 -49914
9455 110140 -386201 -86011 204445 149758 -51704 -228130 -83160 121505 63535 98586 16501
9443 -240345 136918 126305 -184222 87821 -324563 -208908 131973 152747 -133585 -481665
9433 -481665 -373207 -40725 47016 126631 -470911 -165270 20649 10480 55418 170246 -141593
9421 -125505 -70303 -449843 -67459 -154221 -43279 -146641 -351519 -38504 344626 -49984 48066
9409 -221831 48922 -213612 200189 -75060 27504 -168631 189635 74565 132730 -178488 279004
9397 -196931 78277 -92868 -91334 -16996 -41277 -315635 197910 -45818 -6730 -132903 -345901
9386 -345901 131886 31157 -181279 -224936 -105023 -105069 -341766 -22164 27075 -101687 -127939
9375 -127939 -181935 -18138 240048 -160749 -32001 -101315 154348 82582 -99348 160479 52396
9363 159603 -200524 94739 -92414 -117793 -356165 32637 -94266 188106 -159443 81593 -117972
9351 -40171 -78914 53705 -221456 -350255 270156 -150960 -1319 -358150 -140351 -8673 -171691
9340 -171691 -11398 -410340 -19709 -19504 -235352 169744 180552 -396239 95841 14403 -142757
9328 69341 183903 23093 130484 -36228 285529 3833 -27683 351385 -129557 -73409 -288180
9317 -288180 394695 312124 163835 22714 -324319 47057 -91037 -358910 -281666 -64994 -141883
9306 -141883 103171 -140780 -246630 -159825 112510 145052 -198601 134881 -313483 30960
9295 92937 -8656 -198749 -353744 -171899 -189493 -17069 -287543 77738 -201985 343755 -13905
9283 -207092 -44878 70404 -102739 -160994 -1112 169106 170767 -287376 140669 240812 -87324
9271 39274 73922 99641 -302189 -304770 -98440 275719 -266168 -246402 77469 87437 -232903
9259 198750 135369 -69268 -48031 47348 -196525 -93193 35725 -309929 47081 -195313 67202
9247 -705 -104407 -19943 -264209 -284609 2262 152842 2772 7888 -30878 -7320 -5493 -251913
9235 -251913 13372 -38093 -88049 92018 215754 -226714 -248198 63427 -104375 5349 -54243
9223 92625 -28043 -2659 -41793 -346374 -335289 14732 -129160 -259851 -950 190744 16759 93454
9211 93454 -9656 -191529 -180734 -23483 -14049 -174312 -51251 -303517 523 270923 139387 -95934
9198 -199902 -73610 -468999 131153 -23482 26566 -166736 -112236 142456 -384592 52558 109585
9187 109585 200796 -58019 -78680 -285569 95679 127462 -443219 155511 22385 -205304 -91321
9175 -20018 121804 -168217 -67646 -137344 114727 232376 45698 -302474 -247422 -296394 -112653
9163 -28964 -26372 -241240 -33242 -4262 -85182 34714 -319623 115499 -76967 -136679 -505959
9152 -505959 -226157 -89915 -13888 275236 47674 12106 -44127 -69042 -29516 -44387 -297259
9141 -297259 -94027 -349229 -35425 -58601 187265 -17076 68960 -126128 143808 46329 -177159
9129 -35086 -4214 -101681 -99271 -60712 239078 71464 -280680 -186534 -12760 -87660 -152250 -316130
9117 -316130 -3154 85468 -61287 -106186 27301 -98420 -319462 165412 122722 -25376 15529
9105 252691 -129283 149978 11705 247692 229197 46577 10565 -360757 -124071 -415813
9095 -415813 -223231 -146779 103534 384346 -109771 65796 345766 82636 -136887 -810 7459
9083 87058 -185696 8428 -64102 -283217 111039 -119998 -293065 -141766 -435236 -48311 -165603
9072 -165603 198766 -520829 -105431 242229 -118572 29850 -68454 78665 3463 -38340 -294513
9061 -294513 -231383 -179633 117284 -172722 327239 -78716 -485126 -103495 -132247 -59652 -267048
9050 -267048 161287 -78543 -88435 31470 46471 -167424 -115194 52065 340940 5081 19292
9039 19292 -122965 -109867 -271498 -52450 -90893 83872 84652 39256 13037 -23681 -30050 -6841
9026 -165681 189581 -98873 10516 23939 -111011 -135951 -145815 -7784 -178459 -201684 199167
9014 -380806 -101743 -337155 -185209 162663 15477 81104 55943 -54859 -149545 237786 -141133
9002 178705 -17874 -97702 7641 57020 -241012 -159759 129666 269198 287755 232507 -52148
8990 73235 131434 39631 29080 -88560 174791 -103142 105300 -89204 -83594 159696 400557
8979 400557 -228246 214477 107236 308650 18291 -185209 -41382 -400588 -99075 -102327 75855
8967 111160 -129707 18823 5862 -177800 81663 -212596 10890 -388247 70342 72890 -304375
8955 124291 -133601 48937 -161874 -314328 -184365 -282991 -60596 -240528 -75703 -82521 74697
8943 101458 -452084 -222666 -112796 248131 145795 -85628 -220293 -206028 198355 -63301
8932 104228 -217408 245457 -51014 -21235 -54718 103637 397665 656572 323273 1197373
8922 1197373 2728636 6856416 2124007 1133914 198333 -14844 -34772 -121352 -201714 -3787
8911 138597 -67071 -175660 -76951 277026 119226 -187584 67892 31599 -254392 -87640 -67211
8900 -67211 92502 -134394 150718 -176254 151825 31321 -74889 48472 -211722 53150 -61198
8888 -44110 -126206 96192 310084 -24876 33769 42130 -77771 -94805 -237475 100043 239537
8877 239537 -348457 9800 -189408 28986 -49011 144715 -286657 70193 -289647 -62942 140272
8865 -119117 110816 198158 44500 -252997 -260798 129169 119514 3399 -300627 -7170 -31516 90958
8852 -186285 -13358 -127577 6729 -97267 337902 -152799 8588 -126201 92095 -258857 -156194
8841 -156194 -307318 24450 -80843 -79150 145830 -13896 151125 -34313 -95496 99087 -58908
8829 186110 143406 -18600 170582 -21279 183496 -140857 -194895 -3393 -100218 -186896 237905
8817 90627 46622 -4165 -29673 -49653 -82665 -207355 -156817 -127831 151562 87248 99659 45451
8804 -284158 -73032 152507 178768 -381656 -15900 -76715 -255364 4310 157044 -127869 -107799
8793 -107799 23929 145451 -118910 -175811 -188927 105249 -96377 -46722 -124076 -285085 181663
8781 61588 -220158 -206518 -269846 -231079 -97088 78439 116575 208958 136750 -159163 -93387
8770 -93387 -25512 151494 -108019 -15986 -32502 -106382 -69808 187914 -113890 22133 -174235
8758 -166298 53756 141587 95858 96595 -119006 58202 -42468 80560 -112130 -203630 -161338 33153
8745 -208809 -249646 -332667 287231 2018 235527 186851 -145575 -11098 28541 -329568 -131960
8733 -115401 37952 110525 -254470 -234326 -71307 203449 -236540 -188384 69910 -191676 -143934
8722 -143934 115575 7178 155814 59784 -28284 -120899 -208369 308971 -135910 -87054 -62403
8711 -62403 -191827 4552 -67785 60487 -210011 -131506 -82139 -189001 -214711 179907 -310735
8699 -83176 -325994 -312436 -17173 -35557 -117692 304411 -166760 -262542 21796 -651950 -7517
8687 -87142 332 -299412 30460 -141971 86440 -198444 141950 -424987 112478 -111240 -12822
8675 -121770 6423 -27328 149197 99087 107684 -79270 -211003 8342 -175641 201714 -88193
8663 -292246 107931 -299635 -313871 -185594 -427837 -125710 24558 -286216 -71193 -53345
8653 -53345 -375704 393121 152304 92173 -67385 130254 5181 -31407 50131 193505 -119873
8641 -118481 -298394 44029 226690 -142825 -200880 -49859 480502 -8611 -227889 73485 217090
8630 217090 120964 141354 -158663 -225814 55523 -206045 -192370 -162716 5928 -78664 121910
8618 143675 -77611 -96965 -117269 -140286 -83872 -305879 -170795 -273756 -316673 42859 64994
8607 64994 -102036 160413 -117576 -159876 -305772 -217061 -24534 -82786 34326 -75086 -284348
8596 -284348 -170047 123736 -234131 139662 -166850 59418 34054 67856 -280539 -2630 -70406
8585 -70406 62551 224695 -328130 -223569 96765 40468 -110442 -44505 3995 -307799 26452
8573 256818 -76798 -91888 76438 -340739 91728 2469 -99333 -265543 36513 231511 39640
8561 -336886 -75658 -79406 96691 46605 -167107 -244414 182526 169628 171025 -82182 -23651 32705
8548 -289686 -220166 113590 -361000 83430 63593 123938 64949 411462 -30291 -59495 -30230
8537 -30230 -174973 -14664 -259324 -137266 -182466 -128079 123671 -157158 -244255 -130485 -126879
8526 -126879 -12615 -30534 44705 147039 -123630 -408663 -41282 -232389 -117772 -89758 278380
8514 -103484 -277403 -45157 -17815 -149247 -373374 -238666 58223 -53765 -84303 -13706 -131570
8503 -131570 -49081 56759 -165015 40431 -468829 25078 62657 299187 -51979 290780 78424
8491 -25943 -137740 -118591 80236 -205054 110031 122964 -236277 -118102 130940 -83143 -81333
8480 -81333 -126631 116615 -171842 48488 -88772 198552 143025 20321 14631 48296 -501251
8468 -210953 -350011 -255973 -42726 52487 -51177 -65437 61621 -198688 328612 -413552 -260509
8457 -260509 304752 -143075 -119459 80067 12009 -221481 -63518 391953 -28592 -154132 -87756
8446 -87756 31171 -184285 -196809 68954 -146782 -31134 -94682 -133053 -44599 -116749 128351
8434 -265278 2903 57466 -6296 -9033 920 252088 79255 -403455 114598 73026 -71857 -93249
8422 -93249 -191263 115689 -13016 -44351 -264213 358471 -122365 303007 169594 -356067
8411 55306 -126394 -161794 20530 -41854 -198270 146243 125776 153562 251009 -237996 234380
8399 89284 421803 -129904 -133208 -208951 229111 98463 -93338 -75811 275906 -254887 135828
8387 -207854 -186330 47367 154899 -161777 -286505 -249922 -413874 -192479 96776 36503 95838
8376 95838 -64939 -307099 -32386 88025 30591 36619 128446 -279532 176255 -277892 65676
8364 -8270 -240627 -125379 -26349 -85319 -289689 105746 -321693 -43227 -106781 -81205 -47586
8353 -47586 -64868 105332 -40474 -53332 -127928 15699 196095 -459081 -166993 -147683 -227587
8342 -227587 -174410 438297 162645 17899 -99279 62672 267686 107956 206920 -305647 -42718
8330 64543 -50240 96873 -40674 -179691 -70860 -171005 48651 -187183 -415120 366039 235494
8319 235494 37364 -78385 -223243 -135976 -162832 35112 16239 -270616 -448136 -395751 114873
8307 -124310 -4450 109777 -37387 -424570 -413916 129839 150989 177232 93797 -26348 61400
8295 -68705 27671 -344647 -114057 -162226 288817 100307 42467 -206852 -283281 80548 -383521
8283 -2629 93040 -63959 255073 42704 -166176 -65908 -57916 -421538 -78557 204052 -224132
8271 -13809 -90436 -121001 -386277 -76216 -185683 -249612 10837 -310918 -201820 -45722 -122558
8260 -122558 -108058 -251949 312105 85221 47139 87275 34413 -121070 97329 -209200 -182176
8249 -182176 -15222 -257795 -36339 -85627 -205800 -11342 -369178 31850 -266925 -444226 31825
8237 229238 73450 -295964 -158630 -280550 -296628 -75545 256859 8952 64171 -63795 210671
8225 97494 -184561 -189030 366272 -28285 94903 -80202 -183456 51334 -44129 -165761 -63365
8213 -208421 -73549 -17671 108461 83959 42564 -255047 158934 34633 177650 -95493 31283
8201 -281378 -175560 -217032 -40074 -205458 -12880 -11553 -15747 -200252 48038 196109 51954
8189 -154522 -337610 -81445 -55638 -32926 -191667 -152492 5123 28065 165766 -291015 193776
8177 -114300 -166299 91592 107510 -73950 -49424 119496 6457 -15507 -124776 -178747 49449
8165 -96 251134 67795 -164392 -117991 11582 -177388 123663 167391 -95701 -210310 -168026
8154 -168026 -109716 -97971 -253900 -69799 333082 -244521 -142119 149179 -332579 -66944
8143 107764 -32972 -332171 -7545 15490 -26309 -85379 -223077 159274 -169761 -323858 -114358
8131 -27909 -38502 -99350 41973 334729 -341578 -16508 -73198 171936 -118448 -1105 -442641
8120 -442641 123487 -193865 79338 37338 213454 126583 509 -188041 36410 3245 -19405
8108 -215706 -158198 142126 17780 -62854 185735 -380144 -142264 22906 -72945 -264857 -82673
8096 105609 -276273 -18616 -269600 166500 -162048 -58581 -329486 167187 472793 -101084
8085 -174167 103806 -76768 -62471 -6100 -216335 -128041 -31076 231383 -118154 -364397 278085
8073 -239198 334120 253339 203277 -221349 -216535 -156503 -100412 -209672 -91402 108192 -190392
8061 -101809 135792 280862 -103111 -246833 -154667 -92942 280576 74621 64502 -44459 -63761
8050 -63761 51343 -181822 32728 -14523 58521 -40594 -34577 114137 -136851 68226 -46450
8038 -71591 -349158 238456 -30453 43358 -135349 -35087 -146312 -188757 -44502 10761 -248259
8026 -54741 -204010 3912 307438 220575 -344254 -235102 121281 -7684 -69199 -296635 -362928
8015 -362928 201990 -160424 152155 55091 124410 -332784 -114199 -47253 -47038 76936 -75509
8003 -201182 -279904 -320733 -121191 174009 157551 45011 -210783 -269004 -165192 -157299 -118351
7992 -118351 -145075 -339757 -237078 86066 -20811 -165960 -89370 160943 -251627 224454
7981 -46649 -24578 40358 -54671 -351636 -218735 -35515 -77255 89745 -385257 61415 -244174
7969 115742 5968 -84444 -128240 -5216 242716 339052 -356564 -3199 118025 -83982 -203352
7958 -203352 -114466 -260264 -123855 242443 -123705 -133281 -78810 -202968 -396311 60576 -229335
7946 -84674 266796 -430412 -324556 -176002 -189953 102909 243685 138938 230013 -45622
7935 -430667 381692 -70351 47077 112582 122016 308330 -94656 -46668 204201 135200 -204041
7923 -179723 -61449 120755 -97039 178191 203087 -831 5671 -336320 -200671 -270492 -75838
7911 -140542 31515 -150111 -446379 -107518 -3896 119078 -36993 -39214 -205316 105511 -147435
7899 2039 -52453 212893 181199 3010 126330 305005 -260392 113738 74583 -114212 352871
7887 -53243 154388 -172221 -245326 271907 164299 -341326 -61425 -109045 69033 -186156 -33861
7875 85118 -26832 -188457 -453712 59149 154817 35315 -81408 17849 -110779 -321495 27263
7863 -241063 118327 166804 -159185 -103104 -9700 -205573 -113164 216603 -1669 113353 45975
7851 45081 -97109 -155157 -25155 248161 -225224 72388 -86728 -64702 586 -180986 144877
7839 68823 181957 136406 -301549 88808 -350037 83291 162114 370530 204734 356793 -219441
7827 -29865 2282 -123801 -292420 -307832 337000 -157654 205490 -299749 -155108 -233319 96746
7815 61935 5970 -185395 14852 -66351 375581 -49982 -334674 -82957 -103103 -150706 -54179
7803 159241 355187 -132881 251042 -237759 -293000 176606 -125544 -35680 105191 -293144
7792 -105967 -216825 20910 -68354 -97792 -53824 -236171 -89773 125334 22735 201699 64095
7780 -172105 -128854 -260411 -134771 245177 -244166 -122841 50500 85970 114992 -267357
7769 -79021 83007 89798 -55500 -70643 -169024 -18782 10282 1706 -122615 -287730 141843 11082
7756 121637 20163 -17155 134074 -14750 -135576 123869 -100493 3285 10051 -71473 107882
7744 -525010 -169941 -93281 69476 -58666 40455 -32544 180446 98977 203374 79127 -346606
7732 -167826 -123901 342814 -169461 -253099 4754 4815 -112750 -37151 66173 -32723 -29414 -176083
7720 -176083 -361529 -141819 4304 74669 -363313 -324862 -29907 176866 -107083 20195 -82550
7708 130190 45340 -23103 112562 -72900 88998 -165820 132008 -6812 162709 99814 14948
7696 -169046 -248377 508321 -13304 -52327 -72097 -105820 269204 89563 58414 46324 -19461
7684 -147000 114442 -80710 -246299 120505 -141068 77022 99921 12213 147261 13395 -64132
7672 -203443 77168 -82322 -334901 -229148 -37552 -139425 -37532 49616 -82615 62457 67984
7661 67984 -33246 120165 34976 62762 -26127 -226775 51221 -280189 104730 -36023 49209
7649 249027 220362 -177024 -39721 135940 -156897 -159267 -70555 67482 30740 187300 -163658
7637 247714 -108805 -59641 -109885 -315001 -330321 -162740 -11999 -147197 208629 -108279
7626 -23070 -304086 -155801 -234223 -162834 -102807 210824 -230492 -357635 4020 -135793 -31804
7614 -214631 70766 -246820 174820 43535 251141 -143804 -20716 -253564 297034 15176
7603 -208381 15676 -157773 -337394 -149781 -144107 -195658 -5608 -213227 45183 131630 245430
7592 245430 -17050 -238100 -248964 82096 12842 -222802 82982 86068 23595 181963 -25504
7580 -70403 -32960 261945 332500 -66231 74493 -218666 -35764 211360 154964 -244526 186751
7568 -78055 -69632 -152810 -64157 -138351 79534 -135313 -258111 53857 229807 26825 -250092
7556 67990 -264052 -231427 -138507 -203275 -407046 207765 103458 -349152 133747 -79883 426414
7544 -201586 -92934 -274256 -260794 54926 95280 17532 8521 -153850 388493 170261 202694
7533 202694 -72361 -251349 -65678 -115327 90767 -78424 -112958 53814 -38350 155100 17341
7521 176399 -185096 -146833 46704 109828 181153 170386 -89701 -181028 -134951 374519 -218723
7509 71287 -2317 90161 152422 -8805 13712 -47277 -167639 -180365 19168 -75644 -166987 195518
7496 -158522 -209432 66882 71095 -50289 106543 -346043 -43067 28115 -251766 223345 70590
7484 -72137 99067 299142 -105990 47868 437057 -149264 244631 127373 159056 145726 -27631
7472 37039 -73736 20206 -67630 -89411 42133 -233158 -114778 260023 75347 119769 -100858
7460 58512 -185564 -51540 -160406 -106742 47046 -305212 -153751 -328890 -102014 83352 -55980
7448 -35239 -228466 76064 64107 182609 -158553 -27523 -122194 -332837 -54562 -191088 -32742
7436 -205767 98931 115330 -271632 -239311 -270856 170727 -97132 269514 -43945 -91307 -51966
7425 -51966 104817 -246353 -122032 -185079 105511 -142940 94694 -182599 -449528 -140561
7414 -71034 193008 -155494 66333 266849 -219152 -165971 -83238 64512 -140364 -105881 30405
7402 -239480 54305 173014 268329 429126 -399387 158604 88687 9274 -14824 -131789 88753
7390 184089 -191925 -60852 -64199 -20660 -634188 -143075 -196421 -3035 -204108 -109618 263650
7378 -29601 86685 6646 4394 -35171 32257 -139460 105848 -296999 46307 -156814 395358
7366 214593 -274474 -338977 182884 106766 436610 149922 14193 -77824 73636 -50111 333689
7354 -248220 -93868 -81349 15963 209565 -168333 -117722 104763 73175 224500 -494412 -160294
7342 20639 153986 120238 181335 83872 -24879 -163190 38593 -27444 -19297 -81698 -140747 -38082
7329 57145 131027 96813 19209 -138671 266818 -7085 88952 -26671 77801 -190952 116039
7317 87511 -30317 573588 -93127 17980 25244 -17714 33955 -444145 383877 -488039 59741
7305 9794 -34414 -49713 -42060 61329 -290658 -110275 -140949 163825 113323 -111224 85415
7293 -69796 -97192 -1918 -17756 100217 -214048 -232009 -4644 -190525 -115301 -69199 -356946
7282 -356946 115622 143798 -65203 -204260 -88691 69063 76409 124819 -90402 -331208 71753
7270 -97613 102820 -293261 -34760 278811 -141049 -416527 -168771 -104740 -87446 -36808 -51474
7259 -51474 44031 -133396 -189259 -198029 -8338 -298935 -30366 135288 114279 -94120 61080 -16066
7246 184898 151748 213194 243863 -180110 -155927 -50429 -21460 8131 -81412 147302 2882 -213737
7233 5414 67468 74249 322225 -294337 251478 -48620 -279793 222868 -86118 38282 144862
7222 144862 -350693 -111656 15751 60911 -179429 -134940 -85745 -3850 -199617 -158213 -114309
7211 -114309 86093 -60945 115250 46205 227607 98660 54142 -295303 111430 -26785 225836
7199 150676 -278300 -115456 -117637 12503 -280769 -70705 -100198 -212442 -58917 -123108 -164286
7188 -164286 -310070 118443 -240157 205269 166354 -69662 100349 1612 137620 -156355
7177 124369 66998 19075 -148234 267209 -55173 -53886 -72999 345143 -235189 -17246 -232046
7166 -232046 -210604 -108383 -48951 -412495 -491642 251487 289644 149380 208320 -96685 -209553
7155 -209553 -421220 -16425 77423 -130799 326324 19219 9491 -61358 -184602 33719 -120001
7143 -126757 112680 152483 95601 839 -78550 117813 42197 55819 180024 -317642 -110016
7131 -212988 -143955 -84598 -126967 69933 36628 -190106 -182517 60473 -88362 -304023 -25413
7119 -24217 31360 -42348 -144014 107168 160264 38235 -63980 43164 125853 -12452 -8566 45841
7106 -10143 58855 357306 215128 77672 -108468 145030 -21000 -67331 -215841 -63385 202786
7094 -75541 -111351 340997 -287537 66251 -100678 -158212 -22838 112600 73897 -325395 -21086
7082 -194150 -136802 -80583 240244 200412 188441 -288215 -131972 289984 -92012 -129149 -68674
7071 -68674 -356721 59429 -1155 48023 115910 -182109 -57530 48418 127121 -174420 -200510
7060 -200510 17357 108730 8104 244676 140780 -200749 -136019 -124856 -35646 -78215 9690
7048 -206422 -229498 -424244 -5946 -230662 -90860 309659 61000 93159 50121 -52314 -39158
7037 -39158 278964 119312 -30669 80678 72988 -110761 -192922 49124 17977 -124888 -1871
7025 203324 19541 -17569 -204246 -23401 19375 -82136 88318 -302506 29026 95289 -158406
7013 246045 42213 -141689 109294 25770 -201320 138920 -13808 -7820 -228580 -217770 40883
7001 136708 34273 88145 -133634 62501 -40470 93193 27353 -103283 99731 -218747 -91640
6989 63230 -180322 108035 353980 318937 -72484 -300448 -61727 56007 -2597 69475 -10317
6977 269341 -176625 167317 79824 153856 16777 20758 49694 -29547 -82924 38300 87166
6966 87166 -136985 -244204 -294155 364992 -108897 -186822 197323 -626681 -65441 -307681
6956 -307681 -243757 65012 -381857 -40917 189373 -203491 -82416 -42865 -23102 57335 -630754
6944 198171 -3108 167898 313136 128667 -23542 40384 66869 -263814 16121 -21145 -74653
6933 -74653 -40489 -390336 -148515 61892 -26395 -299587 -131007 -249277 95539 -301591 60364
6921 -169417 -210225 -98674 -72983 140892 -294209 -15802 -121850 -121031 -83573 62463 191142
6910 191142 -515075 -5403 -198478 -43076 151437 -19105 -36168 -261368 -19512 51693 -53693
6898 -57987 -370440 156533 -22489 -294976 113335 151315 107659 77306 112424 -19354 27903
6886 -98145 216514 -15662 5673 157483 -218634 185286 149814 -49918 209460 334478 60324
6874 -37465 245991 7317 47858 -443843 -55286 34851 -71331 -11472 61754 -104762 14764
6862 164260 211883 -135638 121298 47588 -120263 10835 172376 99890 209642 -108060
6851 -46793 -80549 -132420 -251504 180234 -286299 72410 279409 73884 -39682 -155383 -44761
6839 -251187 21245 -440765 56928 28221 -42745 540094 -399273 -262425 -109104 150176
6828 -87064 216257 88858 -273408 308502 47633 246599 66685 -174833 11490 -222524 483255
6816 -19783 -283979 -184028 -105827 152339 -205333 7867 -147271 336469 -2676 36835 245798
6805 245798 -195331 -206226 131010 -222788 3991 57230 -337282 140099 23585 -275313 -224119
6794 -224119 213176 -84160 142171 60411 -38615 -9383 -44785 -69757 -138459 -147529 89271 -195646
6781 148106 -48049 -5968 -27598 39044 -246425 273142 -158881 132093 58471 173402 -71171
6769 -230433 -11250 227420 207480 32799 123081 112860 -165987 -159282 -302737 -320750 -41415
6757 -104268 158155 -96909 183901 -247824 -340142 112854 27307 135385 46538 -292334
6746 -74264 -235513 49128 24528 250398 312999 126511 -11075 29011 -123285 84633 -101848
6734 107805 -123517 -204110 -55842 65067 -189534 23507 16653 24768 -252883 -76545 32807
6722 100728 333389 -229252 -48912 1867 -243869 135916 -64053 -9125 -116701 -91848 -47940
6711 -47940 -231623 106542 -94893 -60762 -269533 170563 -107360 81734 177643 -53022 112677
6699 191929 -107966 262830 -5906 8557 10360 156361 11260 57539 -196341 -241377 36138
6687 194314 -43408 13231 -2276 -236150 35393 -73531 -60647 -17741 -195088 -210501 -81915
6675 48947 -51112 365493 45513 -3829 -51691 11931 -256560 92586 -167887 306312 -163336
6663 129569 -209625 -167553 -257386 -1564 -3341 -5121 -17730 -131930 -34051 -206157 258408
6651 1336 -99370 -124089 -283692 -229055 -69 -97027 24240 -66090 -15067 -130775 -210786 -173834
6639 -173834 102100 -223001 -296416 -150314 -372520 -213390 -236273 -94383 216918 42558
6628 40182 -194834 275670 -46095 -9996 -87778 43443 274050 134881 -336250 -57290 -90023
6617 -90023 219639 -82417 246949 345035 -170496 118809 -109606 -21665 104446 172862 262521
6606 262521 -306891 34043 27550 84597 93436 119041 -103884 63294 -56916 106100 -222723
6594 -216352 -260300 -318540 49511 -47898 -60185 40028 -2882 33280 -106429 244275 29244
6582 -161914 -256919 -192951 -90756 34203 138681 8047 -70402 -309518 -46886 182777 -127146
6570 268673 -152653 -109278 -49634 120985 -247164 -213763 89807 85845 -76946 108788 10976
6558 112766 148228 -94351 44876 -86 126083 -439231 49449 -27589 -192565 -147082 -158281 201027
6545 60110 -111030 6313 189902 64913 -110684 11446 52757 355098 136776 -134952 365897
6533 -299786 51468 22368 -23587 -23692 -30036 -289426 -91943 -57940 161752 -80893 40871 -57542
6520 120757 141831 -60458 -96929 -105200 79837 170061 231708 -165698 -84261 85370 88626 -167143
6507 -74707 148096 142900 -446973 190407 -5977 -47010 61792 -119030 169829 51057 -108123
6495 251635 -246910 14349 -61296 95401 229618 180328 -508403 182853 -175400 -76522 -147157
6484 -147157 -118013 31952 38589 -60303 143850 97870 -211259 21821 32807 -192143 -91467
6472 22324 -3189 -181724 88144 2146 -194292 -265143 -123054 -79521 71219 -68456 -72261 162141
6459 191149 13084 312146 214844 93902 45569 -76063 -268912 106975 -5138 265171 265926
6448 265926 -325445 -128988 31994 108225 92519 177548 229034 -28642 -45402 -95022 205681
6436 -386128 54499 -12528 -217444 76761 35098 -424210 -401603 -307680 -166119 102272 -53743
6424 -123837 131515 378 -201844 -199410 241272 -119023 75758 417262 273324 -159057 175948
6412 -169254 20846 -147992 -11828 -277091 58135 79182 222843 37935 -273261 45534 106417
6401 106417 77252 -96309 89387 -173693 155209 -116101 -114748 44107 -102110 -133631 -241303
6390 -241303 -82694 -485462 -114275 18453 -43437 -154700 -180660 -38990 52980 -58866 -157630
6379 -157630 -204269 241639 -266855 -97095 -98981 9368 -176600 -62539 260126 257395 -148645
6367 275358 -71044 232211 166682 35925 -12356 -82213 -116739 -90280 131068 -32151 -62288
6356 -62288 221936 -123225 247985 -38012 -61610 308863 -50918 -272884 104512 -113124
6345 -164068 261212 -21077 173047 -30933 15581 141390 155627 -133522 -347737 -295288 -61605
6333 66352 210865 132864 -120744 -178734 -97253 318282 72751 -290827 60925 -387410 56170
6321 261132 100207 -25291 260562 -223940 24253 -199338 5532 59530 101051 287029 -91814
6309 -17175 21238 97412 69281 -98793 -113963 89350 -4494 140919 64877 -360803 146038
6297 -67973 -202581 47011 -157004 -1787 52705 180095 27111 -53262 22447 -321606 319986
6285 74313 -49540 -75686 -77699 -112844 43938 -273388 116392 -71020 23647 -211855 25837
6273 -100810 -93232 202184 146283 -89924 21082 227468 80698 -297600 -200189 618 -18586 -87000
6261 -87000 271850 -112383 -173145 -217408 55101 67396 34206 27874 10592 79332 615 -68566
6248 -63913 -6927 161143 63569 30949 257678 -167191 -175550 319459 -20790 -107380 -115240 127707
6235 -434639 39268 159457 180274 -136293 78621 15135 -106904 149304 85876 122584 239362
6224 239362 31177 -46097 62138 166558 -115891 -52376 -203672 -30906 -416543 136028 -332195
6212 -123068 346182 -18347 -78020 -382048 102781 -152572 319373 202396 94776 -566 184245
6200 31160 112584 -62936 144067 -192502 -55047 12024 126956 -110227 197646 -100925 6938
6188 -97479 -326749 67361 -23239 174183 113211 -8202 54570 169121 83971 -13166 -193412
6177 -193412 -239250 -68419 8294 -160302 35004 -285521 61536 19753 -79205 55004 24282
6165 -138758 -202782 183392 -201003 -88594 -86433 -35196 -157406 138680 -114225 285900 46454
6153 -271763 -187988 126730 242852 -146638 -61686 -8835 51465 84859 170454 46066 258080
6142 258080 -85577 -63821 66713 57094 -251836 188034 -287481 55798 -111188 -156376 29194
6130 -210198 5142 107422 -328401 111664 -77049 -258291 -72115 9838 140983 -218425 -265904
6119 -265904 72246 -12046 -192143 -238981 366908 116204 69585 -99672 -86068 -96727 165711
6107 -121968 -217239 -21128 -157222 -66569 -229418 -98245 -91760 -184724 -19393 152258 -170206
6095 17255 -69594 -100879 -96513 43608 216599 40101 -10157 -190897 -74289 177136 -69456
6083 45578 55238 -186196 245619 -260424 -45402 175686 22269 62380 -101654 133120 45584
6071 73950 -155103 200691 105162 235496 54935 37588 144329 -34215 -210686 45819 -60141
6059 174538 -86352 189581 -174620 418263 -39017 -7293 67036 129550 -128077 184501 -156290
6047 264165 -115807 -161236 32861 -38236 -34436 -163202 -325776 350478 -207689 76870 268037
6036 268037 -223343 18908 -266027 288232 175479 -7657 -242199 40758 -108474 74357 -198560
6024 125688 139458 9149 -277963 112494 161215 16556 164811 -178419 16970 24898 217771
6013 217771 234049 -93577 200581 88996 -283695 -158004 -16422 -6643 -110525 11036 224726
6002 224726 22720 95975 121698 158850 -11978 -194329 2209 -20892 9565 252748 151922
5991 151922 114340 77573 83531 -58336 -16480 -81524 5166 319334 -50156 -9710 109713 54099
5978 25418 -359482 -43324 -33017 31528 69606 124191 -35690 134819 106367 197648 116979
5967 116979 105181 105912 129048 -111200 -133871 244447 181730 -77194 -266663 62018 159182
5956 159182 149666 -166131 81791 -262752 14329 142705 -331751 -11109 228703 151510 -197491
5944 -190724 -87279 152798 -306945 -124516 -280541 -45422 -1800 -7153 -32120 -309662 158165
5932 79670 -139062 -139080 -43423 -72523 -100699 214279 -227387 -111193 -246795 -313551 -256630
5921 -256630 289673 187663 -199589 132393 292233 -181630 286000 -16807 25650 -457800
5910 187130 -54308 -436421 -95611 113397 258014 -29404 -12508 -40978 105793 67436 138064
5899 138064 21613 330244 65653 237795 -285480 -276786 -17823 250042 -53122 -26296 285442
5887 -35810 -27204 120674 -59220 35808 111051 -183426 184881 -13886 200943 239771 20658
5875 155810 38891 116589 118677 -185907 -208768 -147783 -68771 182450 306121 -315590 61532
5863 248822 35324 59443 147905 -84555 198336 -14604 -212287 -46904 422194 116811 80265
5852 80265 -132372 97296 -77598 97064 160122 131203 129696 -81431 145875 -264923 77158
5840 -168314 -240207 -112234 166113 -110431 -104782 -274260 -180634 -50348 40768 58089 39310
5829 39310 258392 -2449 139250 -73975 -338671 171461 -370036 -133320 -52143 -59500 -83742
5818 -83742 81184 -355386 163780 195922 -93836 -145350 -60154 -229500 -49132 -55557 -69738
5807 -69738 5863 46824 218323 -142368 234298 40316 57868 -189404 -142890 -114680 -165343
5796 -165343 -167968 -361370 -279772 102081 -280512 -164327 -145219 -135965 148368 -63734 -310262
5785 -310262 72227 -75656 -113494 -74757 73693 -228230 -123081 -22558 27332 96843 -155916
5773 25732 -161409 -116139 -208990 14912 -93349 -60900 -31442 37612 129083 -137925 319570
5761 -280953 -48935 -295766 -39687 74958 140059 -296156 -258349 149207 50625 262703 299539
5750 299539 -11711 -125362 282685 66131 -181184 16688 -83104 -166915 36644 74240 -195231
5738 -10808 118293 -96990 117455 134365 327116 115975 -59268 -49489 25498 165433 86584
5727 86584 -72181 202387 -256305 4071 11553 -144568 226979 252494 149540 7899 223455
5716 223455 -381999 28048 179148 114896 151033 211256 637060 -124380 -9443 -316524 196572
5704 -1547 -185242 27902 -127466 -23825 -547967 -93104 -16506 287036 -200068 31548 55112
5693 55112 39591 273058 -24785 98888 50471 -347925 95352 -237698 -265018 -56375 -92021
5682 -92021 -28785 -263747 -233265 126634 64387 3983 -103955 75011 -160894 131291 -149882
5670 -126515 215949 264261 43140 -56314 -138122 13149 -27758 6609 26931 -147690 -48830
5658 -4817 -8425 342766 52999 242808 -63297 97663 -356266 135835 24436 -119587 123879
5646 -164674 197544 169599 96902 11555 -234315 -73753 68286 -158110 -156499 -226109 -136113
5635 -136113 24768 76580 -212308 -23462 -171398 118275 -14170 221563 281286 -157250 -72922
5623 148610 357779 -198668 88968 330114 70587 -86422 -80715 105607 64289 20105 -10887
5611 -20213 144422 -53760 -541272 140449 -217751 -46595 38257 20656 -127547 69697 -66847
5599 17559 174074 -19997 -6499 246328 -34219 -117958 -131702 167726 -122500 435494 -143570
5587 304084 169939 171117 -227622 46872 260888 -343785 69309 305327 189304 4490 -328459
5575 -267478 16418 53996 -6957 1832 73662 78242 10861 -63825 144422 -172108 400868 -202604
5562 204597 197131 90353 -16156 92958 -78162 -202424 20244 87994 -180306 -352348 119622
5550 104089 -188355 -16809 -196465 355975 64048 16946 58369 75650 -31540 -177430 -96539
5539 -96539 124234 80641 -100562 192376 -24366 -92509 153150 -197176 151820 32587 10746
5527 10120 335445 -224286 274509 61820 61056 -295477 -34854 36670 42725 294725 -309032
5515 -28511 -76735 -43093 -40768 297292 92468 -154031 48606 220064 142140 -173513 -6778
5503 85228 4758 -81492 -186410 137704 377859 -237126 -20262 72239 -114080 -187030 -159941
5492 -159941 186320 29672 45862 18776 -353107 -72142 -111118 -230658 -90284 101861 -59846
5480 -7077 25565 -222299 -97023 27251 -103483 -524104 129875 270849 -108801 118597 227114
5469 227114 -132970 -264900 76998 -64401 53242 -31103 -80484 13304 -159357 172063 -5781
5457 308292 96536 189068 168150 -9599 -30827 188626 120216 189927 377583 -7335 -133705
5446 -133705 56597 122163 -112634 -72339 164478 -271177 60490 -247831 -126306 53342 357518
5435 357518 -37672 -248996 -49052 221535 25459 180983 313069 24742 -125620 14144 -287702
5423 50336 18584 22075 208820 -113171 -184671 86219 62121 112679 -184460 283835 53956
5411 286154 -148223 105220 -142172 -60881 -135120 38729 -15726 -204167 39273 16995 510381
5400 510381 18410 90099 -161404 30994 10962 -96337 38329 130346 188185 -123612 255340
5388 75861 -245992 -190309 103498 -145476 -151632 -282897 66689 82241 77935 -146107 -121467
5377 -121467 358572 163714 283037 -178100 141297 243057 101500 5670 10233 -156100
5366 -168347 -200604 -75353 -297412 387263 -44891 -209322 -321007 -88127 336679 92912 -294626
5354 197164 -242960 54724 -210076 84720 55518 -3290 80691 58798 87306 -173795 -117671
5343 -117671 -47970 20911 -46684 -155061 -154584 53335 -79292 194187 -218488 88507 229890
5332 229890 -109406 160235 97802 77412 -246382 -190039 116675 -273518 -8324 239870 -53269
5320 -58024 32699 -73555 165069 135337 296739 271022 211 192886 -1043 -17576 30742 -138033
5307 55760 120716 134356 22587 266093 -32686 123303 -5559 146583 20384 -330817 209525
5295 -244489 -244100 -32546 132427 -139970 -72957 -86269 68597 117703 -99209 -64625 -120819 90377
5282 -160892 337865 -87544 90539 381229 -156853 220644 -237567 61097 76076 152143 195757
5271 195757 -70767 69066 177064 -123638 98439 123280 -44545 95314 313289 -247247 -31576
5259 136463 74620 303279 -6673 23997 -27976 51434 169584 69673 -188909 -24513 -330260
5248 -330260 218745 -131250 -159433 35868 -87705 -242958 -169360 80515 6018 -29408 -68840
5237 -68840 120951 -130338 -10035 156926 -279587 -188789 -6539 196761 126554 91727 47288
5226 47288 66639 227526 -319679 -207111 -104217 106230 -78184 42374 -143458 -188014 87383
5214 -80637 50346 151161 -307186 63087 -89141 137828 -38747 381173 -222334 143634 -179558
5202 198867 -53137 4308 -106979 265291 -42544 51393 207344 -280640 -2068 -35726 -153258
5191 -153258 -232992 5389 188975 -138415 -169773 -86391 90021 145723 216550 -25814 -56231
5180 -56231 102031 -32453 84283 130027 110589 -221208 -37971 -74765 56301 -60280 145822
5168 6199 -210850 18188 -79818 56922 143027 -292376 -43365 51360 -185341 -43016 -15628
5156 25628 -240821 409414 -8964 88295 197222 -175258 -19446 125844 270831 -223561 132545
5144 14652 199062 30190 243131 200782 -26472 83341 175055 -282354 -82598 122261 16072
5132 46757 40016 -253037 82418 59890 136439 146996 211525 -230179 197171 101941 36067
5120 -108868 102926 47648 -207294 -112598 -162636 76279 -369351 112834 67312 -2682 276057
5108 -216062 -97547 -237510 -38684 442064 17236 -362444 -57554 3278 80041 6099 180423
5097 180423 229680 411720 213411 22436 -106950 -126259 90223 -244295 -61038 135216 86004
5086 86004 -593352 323736 256713 76159 214952 -218287 161476 -142521 -64958 -409734
5076 -409734 -130317 -120272 428573 -112017 -282766 -76616 -351685 75574 -344192 -167739
5065 -119757 -134784 -219658 122719 17860 187709 -79969 109243 104228 37247 -81890 -202848
5054 -202848 -404946 6513 -184906 -131272 139979 -72824 140186 22621 -297866 152009 106991
5043 106991 -80621 65352 -263341 -48453 -92173 24873 -22037 123292 -231582 195351 171792
5032 171792 9085 -183679 295465 -82792 9466 -61972 145232 131637 -53126 -15702 221133
5020 164477 -135946 -20801 -94030 240434 106110 89630 51909 -138502 -4131 67434 -101134
5008 9498 59059 108489 164433 -117015 136361 183586 323762 194929 19009 127346 -150892
4996 147688 9808 13894 16288 35892 425454 214553 136178 -300751 269376 -26971 -140628
4985 -140628 -15529 -167178 -269422 155770 -114923 -90027 16219 -83858 149329 -17265 -274795
4974 -274795 154036 106584 48525 114968 -13981 165443 8107 187085 564928 -354094 -216318
4963 -216318 -27375 240784 115522 21999 52101 314090 -67697 197542 -164892 89476 -261477
4951 10054 -64216 84579 -12915 212974 -46154 219747 63678 -22102 -138172 -62843 -119286
4940 -119286 -65562 9444 -40272 -29987 117246 -103167 177493 -246200 22302 149893 -70462
4928 -42672 -31384 148133 69056 198672 190709 -11119 185718 -131108 119757 50916 -278372
4916 139028 -142592 481808 12394 -20963 -163149 -132077 111813 -324220 -351667 -198964
4906 -198964 44500 188609 -12434 69292 -66600 101909 -225145 230200 -171571 123218
4895 -162137 18064 -287918 269472 15499 74174 -50627 -151741 -60244 66181 420532 -268488
4883 -206669 -47985 -267768 81927 105807 121975 -175874 -171464 73170 -27182 51829 294780
4872 294780 -96738 -260999 93300 -153297 -202024 137282 -148705 -89965 254402 70685 -48299
4860 179444 -140371 171931 -41069 264622 203153 -259985 -1106 -475496 174800 -119465
4849 -120238 223362 -319524 91334 -117037 144449 -15564 253485 147484 -81564 65059
4838 -63370 150437 263719 259652 -96040 206313 11811 4980 -155682 -3167 -210033 295165
4826 -205807 8083 99326 231112 -113367 -224921 345940 -51504 -128029 9964 -85927 -27939
4814 -152960 116992 16113 22017 110731 -54999 -116422 271797 -61761 -31792 -16133 -429650
4803 -429650 -257955 -27243 -33916 -55515 67413 -195405 130463 -113996 283937 -242952 494187
4791 305786 -43727 105979 132461 -9875 55420 -80719 -157287 148387 77222 103488 -139857
4779 -140644 152298 -366784 -256519 -40036 124977 -138486 5239 -324085 206745 167816
4769 167816 -20098 -32173 -201786 160471 -66424 -179552 -236272 -242282 -101497 -7341 187330
4757 -71171 62924 -85624 32480 43069 165419 360574 14883 -257724 17656 114118 285728
4746 285728 -259676 -295193 -173437 -259027 90047 -368169 118173 -5017 247909 108160 -123469
4734 190736 370518 -12608 -147382 -103374 93192 315645 119626 -21259 39919 98272 48120
4722 -4077 110071 -191561 53007 -50534 -24312 264252 -375336 157709 39833 120606 239412
4711 239412 49367 137866 -30638 -79922 -3495 -172889 373203 -208867 75648 1568 23675
4700 23675 -228615 257450 -67272 331615 62168 10251 -317300 2536 -35407 203689 -118858
4688 -19496 106597 -130721 -50986 136112 76701 -124149 124070 35817 -55642 171995 -28699
4676 165917 -127669 17859 126308 -4329 -180431 -175994 -89242 377862 -4485 90778 129957
4665 129957 11279 -4269 35248 -143470 -23388 57937 87653 219819 -48875 74319 62733
4654 62733 51911 -10761 170667 33862 -31838 -209094 -64145 8990 -178268 15587 -74563
4642 -157961 360527 -194834 8070 150390 -61051 9427 83204 -194540 -27976 -72911 -176449
4631 -176449 179046 171937 28408 -218172 8802 -82529 235005 -19429 -48809 21819 493211
4620 493211 234741 -118408 166153 248015 -76995 254487 128951 99170 -70874 218385
4609 106660 154856 -204169 186054 -60590 24443 -136995 75805 -112844 99716 187866 144725
4598 144725 -1540 261014 -23788 -182617 105579 -74382 -45846 245708 162954 3950 -197000
4586 174902 -382764 -70496 -130207 136962 -27306 159318 124519 -125093 -178685 346684 121798
4574 137464 169024 5401 96541 -344662 24033 226838 118066 -74479 -81960 -113545 -227438
4563 -227438 -191523 -94037 -70260 -176882 -289400 -322607 -205762 -231737 -215420 -310460 -169803
4552 -169803 -182525 63945 -162407 91084 165177 380207 -191221 -110659 -126186 54862 -44810
4540 40890 -182498 -60489 58432 33823 -274135 -2393 -13170 260559 -93722 -92852 17813 284624
4528 284624 52305 357108 142681 205207 474323 -12874 117726 -49702 -158717 -8436 15713
4516 -64643 297840 216255 -72676 -19012 -221316 -286588 -168914 155240 309200 -268660 149556
4504 -106977 -6142 242098 -197983 106070 -32189 181916 -96661 2574 126729 -106882 120460
4492 149497 -43567 114773 -47253 -307738 -60557 -183933 83650 -191827 -220857 272421 295569
4481 295569 -66241 273611 -69342 102051 -274199 9889 -361782 -201689 -152133 79652 69567
4470 69567 -85636 -107098 -4554 44794 -38372 -71977 6541 44718 73773 1498 -224260 171962
4457 -96453 75348 -147449 361846 -211674 110445 -94403 204672 -17992 -144009 -35165 -78947
$$ [...]
##END NTUPLES=NMR SPECTRUM
##END=
