##TITLE=AC1640_CTIAH13373_8569490_Fnc7o7APd1
##JCAMPDX= 6.0         $$ Bruker NMR JCAMP-DX V2.0
##DATA TYPE= NMR SPECTRUM
##DATA CLASS= NTUPLES
##ORIGIN= BRUKER
##OWNER= Administrator
$$ 1.72 TOPSPIN		Version 2.1
$$ 2014-04-10 17:28:42.684 -0700  Administrator@X
$$ Compression mode = diff/dup
##.OBSERVE FREQUENCY= 400.02188249412
##.OBSERVE NUCLEUS= ^1H
##.ACQUISITION MODE= SIMULTANEOUS (DQD)
##.ACQUISITION SCHEME= undefined
##.AVERAGES= 64
##.DIGITISER RES= 22
##SPECTROMETER/DATA SYSTEM= spect
##.PULSE SEQUENCE= noesygpps1d.comp
##.SOLVENT NAME= COFFEE_meoh
##.SHIFT REFERENCE= INTERNAL, COFFEE_meoh, 1, 14.96111
##AUDIT TRAIL= $$ (NUMBER, WHEN, WHO, WHERE, PROCESS, VERSION, WHAT)
$$ ##TITLE= Audit trail, TOPSPIN		Version 2.1
$$ ##JCAMPDX= 5.01
$$ ##ORIGIN= Bruker BioSpin GmbH
$$ ##OWNER= Administrator
$$ $$ E:\/data/COFFEE/nmr/AC1640_CTIAH13373_8569490_Fnc7o7APd1/12/pdata/1/auditp.txt
$$ ##AUDIT TRAIL=  $$ (NUMBER, WHEN, WHO, WHERE, PROCESS, VERSION, WHAT)
(   1,<2014-04-10 17:28:36.590 -0700>,<Administrator>,<X>,<go>,<TOPSPIN 2.1>,
      <created by zg
	started at 2014-04-10 17:17:06.962 -0700,
	POWCHK enabled, PULCHK disabled,
       configuration hash MD5:
       C8 4E 4E 5D D3 5C D8 9E 9F 52 82 E0 59 8A DE 15
       data hash MD5: 64K
       00 99 2F CB 17 80 13 E7 3E 87 2F 4D 16 B6 32 9E>)
(   2,<2014-04-10 17:28:39.981 -0700>,<Administrator>,<X>,<proc1d>,<TOPSPIN 2.1>,
      <Start of raw data processing
       efp LB = 0.3 FT_mod = 6 PKNL = 1 PHC0 = 0 PHC1 = 0 SI = 128K 
       data hash MD5: 128K
       A7 AE 25 4D 3B 3C EB 54 91 C6 90 0B 6D 3B F9 94>)
(   3,<2014-04-10 17:28:41.075 -0700>,<Administrator>,<X>,<proc1d>,<TOPSPIN 2.1>,
      <pk PHC0 = -85.50659 PHC1 = 0 
       data hash MD5: 128K
       BC 86 DF D7 37 18 D0 75 8B 22 38 70 FC 74 73 60>)
(   4,<2014-04-10 17:28:41.871 -0700>,<Administrator>,<X>,<proc1d>,<TOPSPIN 2.1>,
      <abs ABSG = 1 
       data hash MD5: 128K
       6E 6B 1C AB DD D1 3E 59 7D F8 6F A9 27 E6 39 D2>)
(   5,<2014-04-10 17:28:42.075 -0700>,<Administrator>,<X>,<proc1d>,<TOPSPIN 2.1>,
      <abs ABSG = 2 
       data hash MD5: 128K
       4F F2 B5 EB 9A CF D8 F0 B2 47 B4 04 8C 7C 72 FA>)
(   6,<2014-04-10 17:28:42.231 -0700>,<Administrator>,<X>,<proc1d>,<TOPSPIN 2.1>,
      <abs ABSG = 3 
       data hash MD5: 128K
       D6 39 4B BB F9 7F 2B 26 C8 1E AE A6 F4 42 EF 33>)
(   7,<2014-04-10 17:28:42.340 -0700>,<Administrator>,<X>,<proc1d>,<TOPSPIN 2.1>,
      <abs ABSG = 4 
       data hash MD5: 128K
       89 59 66 82 C7 10 71 06 8D E9 B3 B1 16 04 70 E8>)
(   8,<2014-04-10 17:28:42.450 -0700>,<Administrator>,<X>,<proc1d>,<TOPSPIN 2.1>,
      <abs ABSG = 5 
       data hash MD5: 128K
       F0 96 20 7C E4 7C D4 4B F4 94 BE 41 B6 7C F0 4C>)
$$ ##END=
$$ 
$$ $$ hash MD5
$$ $$ 09 C2 18 46 EC 21 F4 A9 FC 05 9B 58 5F 56 F4 1F
##$RELAX= 
##$RELAX= 
##$RELAX= 
##$RELAX= 
##$RELAX= 
##$RELAX= 
##$RELAX= 
##$RELAX= 
$$ Bruker specific parameters
$$ --------------------------
##$DU= <E:\>
##$EXPNO= 12
$$ [...]
##$TP07= 0
##$TPNAME0= <>
##$TPNAME1= <>
##$TPNAME2= <>
##$TPNAME3= <>
##$TPNAME4= <>
##$TPNAME5= <>
##$TPNAME6= <>
##$TPNAME7= <>
##$TPOAL= (0..7)
0.5 0.5 0.5 0.5 0.5 0.5 0.5 0.5
##$TPOFFS= (0..7)
0 0 0 0 0 0 0 0
##$TUNHIN= 0
##$TUNHOUT= 0
##$TUNXOUT= 0
##$USERA1= <user>
##$USERA2= <user>
##$USERA3= <user>
##$USERA4= <user>
##$USERA5= <user>
##$V9= 5
##$VALIST= <valist>
##$VCLIST= <CCCCCCCCCCCCCCC>
##$VD= 0
##$VDLIST= <DDDDDDDDDDDDDDD>
##$VPLIST= <PPPPPPPPPPPPPPP>
##$VTLIST= <TTTTTTTTTTTTTTT>
##$WBST= 1024
##$WBSW= 4
##$XGAIN= (0..3)
0 0 0 0
##$XL= 0
##$YL= 0
##$YMAX_a= 6638009
##$YMIN_a= -13943458
##$ZGOPTNS= <>
##$ZL1= 120
##$ZL2= 120
##$ZL3= 120
##$ZL4= 120
##$ABSF1= 14.96111
##$ABSF2= -5.597072
##$ABSG= 5
##$ABSL= 3
##$ALPHA= 0
##$AQORDER= 0
##$ASSFAC= 0
##$ASSFACI= 0
##$ASSFACX= 0
##$ASSWID= 0
##$AUNMP= <proc_prof1d_extract.lims>
##$AXLEFT= 0
##$AXNAME= <>
##$AXNUC= <1H>
##$AXRIGHT= 0
##$AXTYPE= 0
##$AXUNIT= <>
##$AZFE= 0.1
##$AZFW= 0.1
##$BCFW= 0
##$BC_mod= 0
##$BYTORDP= 0
##$COROFFS= 0
##$CY= 15
##$DATMOD= 1
##$DC= 0
##$DFILT= <>
##$DTYPP= 0
##$F1P= 0
##$F2P= 0
##$FCOR= 0.5
##$FTSIZE= 131072
##$FT_mod= 6
##$GAMMA= 0
##$GB= 0
##$INTBC= 1
##$INTSCL= 1
##$ISEN= 128
##$LB= 0.3
##$LEV0= 0
##$LPBIN= 0
##$MAXI= 10000
##$MC2= 0
##$MEAN= 0
##$ME_mod= 0
##$MI= 0
##$NCOEF= 0
##$NC_proc= -2
##$NLEV= 6
##$NOISF1= 0
##$NOISF2= 0
##$NSP= 0
##$NTH_PI= 0
##$NZP= 0
##$OFFSET= 14.96111
##$PC= 1
##$PHC0= -85.50659
##$PHC1= 0
##$PH_mod= 1
##$PKNL= yes
##$PPARMOD= 0
##$PPDIAG= 0
##$PPIPTYP= 0
##$PPMPNUM= 2147483647
##$PPRESOL= 1
##$PSCAL= 4
##$PSIGN= 0
##$PYNMP= <proc.py>
##$REVERSE= no
##$SF= 400.020009592619
##$SI= 131072
##$SIGF1= 0
##$SIGF2= 0
##$SINO= 400
##$SIOLD= 131072
##$SPECTYP= <>
##$SREGLST= <1H.CDCl3>
##$SSB= 0
##$STSI= 131072
##$STSR= 0
##$SW_p= 8223.68421052631
##$SYMM= 0
##$S_DEV= 0
##$TDeff= 65536
##$TDoff= 0
##$TI= <>
##$TILT= no
##$TM1= 0
##$TM2= 0
##$TOPLEV= 0
##$USERP1= <user>
##$USERP2= <user>
##$USERP3= <user>
##$USERP4= <user>
##$USERP5= <user>
##$WDW= 1
##$XDIM= 131072
##$YMAX_p= 428016337
##$YMIN_p= -12130
##$CURPLOT= <Network HP LaserJet P1505>
##$CURPRIN= <$Network HP LaserJet P1505>
##$DFORMAT= <normdp>
##$LAYOUT= <+/1D_H.xwp>
##$LFORMAT= <normlp>
##$PFORMAT= <normpl>
##$SURQMSG= 1
$$ End of Bruker specific parameters
$$ ---------------------------------
##NTUPLES= NMR SPECTRUM
##VAR_NAME=  FREQUENCY,     SPECTRUM/REAL,   SPECTRUM/IMAG
##SYMBOL=    X,             R,               I
##VAR_TYPE=  INDEPENDENT,   DEPENDENT,       DEPENDENT
##VAR_FORM=  AFFN,          ASDF,            ASDF
##VAR_DIM=   131072,        131072,          131072
##UNITS=     HZ,            ARBITRARY UNITS, ARBITRARY UNITS
##FACTOR=    0.0627417313425164, 1,          1
##FIRST=     8223.62146879497, 33,           -64166
##LAST=      0,             2162,            -63880
##MIN=       0,             -12130,          0
##MAX=       8223.62146879497, 428016337,    0
$$ Real data points
##PAGE= N=1
##DATA TABLE= (X++(R..R)), XYDATA
$$ [...]
61457E71639m614m246l482k483j356j4J330K033J733R02L41M33J124K277L616
61442E69233M704N301N476N177M199K844J889J450O70q64k211k406j946j881k043
61427E89592j403J59J694K545K820K668K243K265L373M866N179L836J961P01P2
61412F22571m14r03j298j529j460j052o45o23q62j095j479k134k557k413k469
61397F01638l529m825m870l754l081l565m166l940l231k551j686n61K53N37R15
61382E63584J727K472K914L627M821N713N819N779O052N906M720L380L190L998
61368F23702M515M046K929J599K43q34j280j126n88L14J471K315K319J755J446
61353F42826J907L069M598O072O970O841N516L136K47k164l253l096k535k201
$$ plain form
61457 571639 567025 562779 559297 556814 555458 555444 556774 558807 560540 561442 561783 562216 563340 565617 569233
61442 569233 573937 579238 584714 589891 594090 596934 598823 600273 600943 600079 597868 595462 593516 591635 589592
61427 589592 588189 588348 590042 592587 595407 598075 600318 602583 605956 610822 616001 619837 621798 622499 622571
61412 622571 622157 621254 619956 618427 616967 615915 615270 614647 613785 612690 611211 609077 606520 604107 601638
61397 601638 598109 593284 588414 584660 581579 578014 573848 569908 566677 564126 562440 561879 562132 562669 563584
61382 563584 565311 567783 570697 574324 579145 584858 590677 596456 602508 608414 613134 616514 619704 623702
61368 623702 628217 632263 635192 636791 637034 636200 634920 633794 633206 633520 634991 637306 639625 641380 642826
61353 642826 644733 647802 652400 658472 665442 672283 677799 680935 681182 679018 675765 672669 670134 667933
61339F67933k104k140k308k328j748p08L6M1m29j066j820k386k237j505j018j026
61323F45187o96O38K446L742M240M338M499N166O655Q665J0356J1392J2338J3706
61309G32672J5197J6369J7428J8775K0202K1001K0545J8466J4814J0332O036K239
61297I14076j475n136q035r811j1006j2113j2855j2970j2896j3034j3052j2553
61285G89140j1843j1341j0793r713q186o625n106l430j505O05K579L677L395K482
61271G33336K360L268L909L449K671K517K648K566L021N076Q262J0911J1969J1471
61257H07434R662O755L436O56j124j983k114j852j719j795j356K03K422M322N446
61242H28393N917N848N364M777M201L327K086J054P00P57Q41J144J971L200M719
$$ plain form
61339 667933 665829 663689 661381 659053 657305 656597 656633 656674 656245 655179 653359 650973 648736 647231 646213 645187
61323 645187 644491 645129 647575 651317 655557 659895 664394 669560 676215 684880 695236 706628 718966 732672
61309 732672 747869 764238 781666 800441 820643 841644 862189 880655 895469 905801 911837 914076
61297 914076 912601 907465 899430 889619 878613 866500 853645 840675 827779 814745 801693 789140
61285 789140 777297 765956 755163 745450 737264 730639 725533 722103 720598 721203 723782 727459 730854 733336
61271 733336 735696 738964 742873 746322 748993 751510 754158 756724 759745 764821 773083 783994 795963 807434
61257 807434 817096 823851 827287 827943 826819 824836 822722 820870 819151 817356 816000 816203 818625 822947 828393
61242 828393 834310 840158 845522 850299 854500 857827 859913 860967 861667 862424 863265 864409 866380 869580 874299
61227H74299O693Q847J0233J0403J0055R849R417Q306P069O392N988N414N192
61214I78157N904O783O576N338M130L251K064M09q77r25M99L077N972Q130R371
61199A037859J0710J2900J5254J6925J8462K0798K3188K3656K1332J7075J2038
61188A230197O928K564k97j898l177m422n222n670o492p951r598j1108j2462j3367
61174A158025j3571j3580j4035j4422j3649j1814j0241r656r436q866p962o854
61162A023939n392l714k321j320k73J154L039N528Q484J1042J2514J3548J5279
61149A081507J7443J8522J7634J5130J1462O824K012j689l804m743m608l180j147
61136A151363J80O46J431L073M734N774O666P783Q635Q984R468J0468J1445J2005
$$ plain form
61227 874299 880992 889839 900072 910475 920530 930379 939796 948102 955171 961563 967551 972965 978157
61214 978157 984061 990844 997420 1002758 1006888 1010139 1012203 1012612 1011735 1010810 1011309 1014386 1020358 1028488 1037859
61199 1037859 1048569 1061469 1076723 1093648 1112110 1132908 1156096 1179752 1201084 1218159 1230197
61188 1230197 1237125 1239689 1239392 1237494 1234317 1229895 1224673 1219003 1212511 1204560 1194962 1183854 1171392 1158025
61174 1158025 1144454 1130874 1116839 1102417 1088768 1076954 1066713 1057057 1047621 1038755 1030793 1023939
61162 1023939 1018547 1014833 1012512 1011192 1010919 1012073 1015112 1020640 1029124 1040166 1052680 1066228 1081507
61149 1081507 1098950 1117472 1135106 1150236 1161698 1168522 1170534 1168845 1165041 1160298 1155690 1152510 1151363
61136 1151363 1151543 1152189 1153620 1156693 1161427 1167201 1173867 1181650 1190285 1199269 1208737 1219205 1230650 1242655
61122A242655J2536J3228J3606J3653J4216J5615J6932J7327J7007J6270J4860
61111A407905J2937J1454J0735R836Q139O396N272M071J907j014m318q468j3687
61098A451165j8937k3277k7109l0769l3106l3050l1688l0941l0833k9957k8162
61087A133336k6760k6192k5377k3654k1740k0316j9033j7408j5638j4008j2432
61076I10778j0885r605q528p312o019n086m575m135l658l212k422r03P18J325
61062H46481J026J227K651M313N021M948N105N927P063Q170R296J0677J2437J4339
61048I38681J5763J6321J6447J6933J7849J8566J8833J9121J9714K0246K0460
61037A138934K0722K1346K1963K2034K1543K0869K0321K0101K0295K0724K1266
$$ plain form
61122 1242655 1255191 1268419 1282025 1295678 1309894 1325509 1342441 1359768 1376775 1393045 1407905
61111 1407905 1420842 1432296 1443031 1452867 1461006 1467402 1472674 1476745 1478652 1477638 1473320 1464852 1451165
61098 1451165 1432228 1408951 1381842 1351073 1317967 1284917 1253229 1222288 1191455 1161498 1133336
61087 1133336 1106576 1080384 1055007 1031353 1009613 989297 970264 952856 937218 923210 910778
61076 910778 899893 890288 881760 874448 868429 863343 858768 854633 850975 847763 845341 844438 845156 846481
61062 846481 847507 848734 851385 855698 860719 865667 870772 876699 883762 891932 901228 911905 924342 938681
61048 938681 954444 970765 987212 1004145 1021994 1040560 1059393 1078514 1098228 1118474 1138934
61037 1138934 1159656 1181002 1202965 1224999 1246542 1267411 1287732 1307833 1328128 1348852 1370118
61026A370118K2380K4661K7817L0854L3378L5777L7927L9025L9286M0624M4591
61015A746438N0708N7805O5939P5687Q6488R7315J08363J20578J34270J50054
61005B693645J70509J98751K35571K80165L33204L96330M69048N50073O42472
60996E969768P53278Q87943J052625J263502J536326J842885K076011K085973
60988A7468311J784958J228500N90033N2966k74806l64207k31612O1003L80875
60979B0696021N45498M14220j9930o24969j214657j646792j866857j893940j785257
60970A2603337j605467j405975j215533j044017q93047p62510o50506n53213m67697
60961D005372l93534l30892k78731k35582k00502j72301j49142j29735j13946
$$ plain form
61026 1370118 1392498 1417159 1444976 1475830 1509208 1544985 1582912 1621937 1661223 1701847 1746438
61015 1746438 1797146 1854951 1920890 1996577 2083065 2180380 2288743 2409321 2543591 2693645
61005 2693645 2864154 3062905 3298476 3578641 3911845 4308175 4777223 5327296 5969768
60996 5969768 6723046 7610989 8663614 9927116 11463442 13306327 15382338 17468311
60988 17468311 19253269 20481769 21071802 21124768 20849962 20485755 20254143 20315146 20696021
60979 20696021 21241519 21655739 21635809 21010840 19796183 18149391 16282534 14388594 12603337
60970 12603337 10997870 9591895 8376362 7332345 6439298 5676788 5026282 4473069 4005372
60961 4005372 3611838 3280946 3002215 2766633 2566131 2393830 2244688 2114953 2001007
60952B001007j01509r1186q1765p2851o4268n5860m8488m3825m2215m1882m1130
60941A316028m0222m0097m0370l9932l8638l7067l5193l2603k9626k7078k5114
60930I30088k3289k1456j9728j7895j5764j3747j2332j1285j0131q985q224p809
60918G59443p601p745p939p154n083l106k613l020k797j830j276j454j524j189
60904G05112j050j231j118p10q79k012l536n002o446p520p593p038p066p800p820
60889F38291o250m154l040k968k992k711k453k378k277k034j767j611j684k083
60875E99889k733l475m257m933m988m024k480j239n33J03Q50J305J223R15P71
60860E76394J009J784K884L426K683J189J57j50n28j312j923k034k076k166j631
$$ plain form
60952 2001007 1899498 1808312 1726547 1653696 1589428 1533568 1485080 1441255 1399040 1357158 1316028
60941 1316028 1275806 1235709 1195339 1155407 1116769 1079702 1044509 1011906 982280 955202 930088
60930 930088 906799 885343 865615 847720 831956 818209 805877 794592 784461 775476 767252 759443
60918 759443 751842 744097 736158 729004 723921 720815 718202 715182 712385 710555 709279 707825 706301 705112
60904 705112 704062 702831 701713 701003 700124 698112 694576 689574 683128 675608 668015 660977 653911 646111 638291
60889 638291 632041 627887 624847 621879 618887 616176 613723 611345 609068 607034 605267 603656 601972 599889
60875 599889 597156 593681 589424 584491 579503 575479 572999 571760 571227 571330 572180 573485 574708 575623 576394
60860 576394 577403 579187 582071 585497 588180 589369 589526 589376 588848 587536 585613 583579 581503 579337 577706
60845E77706j93J270J704R47n71k456m282n589o381p006p388p059o172n547n422
60830E23561n105m295l739l998m438m134l036j713n52J52L2q09j642j972k048
60815D86264k097j865j340j183j750k370k248j505p47j99J41P9l66o40l82J5Q5
60798D69892J2Q2l2o98j494j666j148n51l55n80j009j287j188j013j356k137k458
60781D53014j848j041r70j479j694j253n52l5J80J48Pj20k65m93n23j5P51J091
60763D44903R92J204K004K695K737K529K490K202J199k7o12m18J05O70J123J165
60747D64961Q33Q44J777L224M286M489L766K029m11k494l239k815k199j988k089
60732D70974k265k385k309k065j928j953j687p85L17Q17M32m33j214j578j577
$$ plain form
60845 577706 577513 578783 580487 581434 580863 578407 574125 568536 562155 555149 547761 540702 534530 528983 523561
60830 523561 518456 514161 510422 506424 501986 497852 494816 493103 492551 492703 492735 491926 490284 488312 486264
60815 486264 484167 482302 480962 479779 478029 475659 473411 471906 471159 470960 471101 471180 470814 470174 469792 469807 469892
60798 469892 469904 469986 469954 469256 467762 466096 464948 464397 464042 463462 462453 461166 459978 458965 457609 455472 453014
60781 453014 451166 450125 449155 447676 445982 444729 444177 444142 444322 444470 444477 444357 444092 443599 443076 443061 443812 444903
60763 444903 445895 447099 449103 451798 454535 457064 459554 461756 462955 462928 462316 461898 462003 462673 463796 464961
60747 464961 465794 466638 468415 471639 475925 480414 484180 486209 485798 483304 480065 477250 475051 473063 470974
60732 470974 468709 466324 464015 461950 460022 458069 456382 455597 455914 456731 457163 456730 455516 453938 452361
60717D52361j574j803j903j328k50N32O46M88L82J62j63k31j10l73j019j238p29
60700D43850l10o21j127j130q76r05j073j038r69r89o42K79J054J071P83Q65J136
60683D39358J252J692K940M303M743M426M313M601M686M351L994L759L451L102
60669D90971K831K301J120m32j761k731l427l597l094k472k248k016j155j0O14
60654D74894P08Q70J132J072P93Q23J116J195J092J236J417R34k13j144j264r70
60638D83691j031j754k788l302k550o86J144J930J754J249O83J10j48P4L31K43
60622D78950J24L02L89k1n00m23P3N60J078J563J363L28l83J97J251J405Q83Q57
60604D87996J292J108K42k39n2o5n61p61l48m6k25j50Q25K319L563M161L987L181
$$ plain form
60717 452361 450787 448984 447081 445753 445503 446035 446681 447169 447551 447713 447550 447319 447209 446836 445817 444579 443850
60700 443850 443540 442919 441792 440662 439786 438881 437808 436770 435801 434812 434170 434449 435503 436574 437357 438222 439358
60683 439358 440610 442302 445242 449545 454288 458714 463027 467628 472314 476665 480659 484418 487869 490971
60669 490971 493802 496103 497223 496791 495030 492299 488872 485275 482181 479709 477461 475445 474290 474280 474894
60654 474894 475602 476472 477604 478676 479469 480292 481408 482603 483695 484931 486348 487282 487069 485925 484661 483691
60638 483691 482660 480906 478118 474816 472266 471580 472724 474654 476408 477657 478340 478450 478302 478376 478707 478950
60622 478950 479074 479376 479765 479744 479244 478821 478894 479454 480532 482095 483458 483786 483403 483600 484851 486256 487139 487996
60604 487996 489288 490396 490638 490399 490347 490282 489721 488960 488612 488566 488341 488191 489016 491335 494898 499059 503046 506227
60586E06227K438K415K758K561J765J165J018Q12M71N77J207J650J677J988L054
60571E31783M400N433O145O662O879O877P002P334P696Q295R470J0774J1128J0075
60557F39953Q099N624K712j38j968k488k335j990j291l09K80K60M61J708L740
60542F52318N640O885P597Q156Q953J0194J1816J3699J5902J8378K0748K2745
60530H03031K4541K6089K6593K5317K2466J8547J3357O713l46o222j0527j4004
60518I35555j6955j8921j9704j9439j7849j4702j1046q531p434o564n186l678
60506G85546k165NL037O272R333J2541J5858J8717K1256K4469K8662L2962L6726
60493I93219M0209M3366M5265M5311M3899M1299L7088L1416K5772K1720J9616
$$ plain form
60586 506227 508665 511080 513838 516399 518164 519329 520347 521159 521630 522207 523414 525064 526741 528729 531783
60571 531783 536183 541616 547761 554423 561302 568179 575181 582515 590211 598506 607976 618750 629878 639953
60557 639953 648052 653676 656388 656250 654282 651794 649459 647469 646178 645869 646149 646409 646870 648578 652318
60542 652318 657958 664843 672440 680596 689549 699743 711559 725258 741160 759538 780286 803031
60530 803031 827572 853661 880254 905571 928037 946584 959941 966654 966308 960086 949559 935555
60518 935555 918600 899679 879975 860536 842687 827985 816939 808408 800974 794410 789224 785546
60506 785546 783381 783386 786423 792695 802028 814569 830427 849144 870400 894869 923531 956493 993219
60493 993219 1033428 1076794 1122059 1167370 1211269 1252568 1289656 1321072 1346844 1368564 1388180
60482A388180J8961J9026J8635J6422J1931N637k441j2953k5528l8045m8385n5976
60470A295464o0972o3118o2319n9393n5301n0287m4580l9214l5228l2478k9949
60459G62625k6926k3478k0173j7677j6137j4862j3108j1173r930r365q600p340
60447E83856o160n222m033k720k165k505k798k600k471k489j773j95R41P59mn12
60431E49909j126k164k837k545k082k296k619k049o44J048K996M987N928N149
60417E51655L578K447J685P58J20N02J483K114K329K511K394J687J187J855L203
60402E79508L926L729L335L106K857K725K933L068K677K323K868L970M457L984
60388F25466L264K809K546K531K931L375L304K958L065L580L676L093K567K732
$$ plain form
60482 1388180 1407141 1426167 1444802 1461224 1473155 1478792 1476351 1463398 1437870 1399825 1351440 1295464
60470 1295464 1234492 1171374 1109055 1049662 994361 944074 899494 860280 825052 792574 762625
60459 762625 735699 712221 692048 674371 658234 643372 630264 619091 609161 599796 591196 583856
60447 583856 577696 572474 568441 565721 563556 561051 558253 555653 553182 550693 548920 548725 549666 550425 550421 549909
60431 549909 548783 546619 543782 541237 539155 536859 534240 532191 531547 532595 535591 540578 546506 551655
60417 551655 555233 557680 559365 560123 560243 560745 562228 564342 566671 569182 571576 573263 574450 576305 579508
60402 579508 583434 587163 590498 593604 596461 599186 602119 605187 607864 610187 613055 617025 621482 625466
60388 625466 628730 631539 634085 636616 639547 642922 646226 649184 652249 655829 659505 662598 665165 667897
60374F67897L291L527L141K442J951J931K105K010J656J461J530J564J657K346
60360F98509L526M242M066L829M348N311O151P104Q471R649J0003R990J0322J0547
60346G96068R580P261M416J682p87k793m205n342o491p344p557p418p254o748
60332G63068n642m549m273m740n406o151o973p332o745n553m364l268k245j619
60318F94208j257j95J970M145N296O067P620R723J1385J2558J3600J3741J1914
60305G90775Q785O249M975M125L398L550M657N462M956L375J244j388m374p191
60291H28598r637j1908j3727j4258j3274j1677j0500r937r512q691p343n993n503
60278F96638o076o884p161p117p180p079o520o060o188o238n410m238l646l176
$$ plain form
60374 667897 671188 674715 677856 680298 682249 684180 686285 688295 689951 691412 692942 694506 696163 698509
60360 698509 702035 706277 710343 714172 718520 723831 729982 737086 745557 755206 765209 775199 785521 796068
60346 796068 805648 812909 817325 819007 818220 815427 811222 805880 799389 792045 784488 777070 769816 763068
60332 763068 757426 752877 748604 743864 738458 732307 725334 718002 711257 705704 701340 698072 695827 694208
60318 694208 692951 692756 694726 698871 704167 710234 717854 727577 738962 751520 765120 778861 790775
60305 790775 799560 805809 810784 814909 818307 821857 826514 831976 836932 840307 841551 840163 835789 828598
60291 828598 818961 807053 793326 779068 765794 754117 743617 733680 724168 715477 708134 702141 696638
60278 696638 690562 683678 676517 669400 662220 655141 648621 642561 636373 630135 624725 620487 616841 613665
60264F13665j798l3O30J66L7O65R17L83K80J334K463K495J826J501J750K264K940
60247F31485L471L134J786M11q4M6L3l50r47j723k431k426j411J8J107J829K608
60230F36556L558M499N375O288P261Q211Q975R402R642J0244J1422J2486J2607
60217G46526J2082J2047J2876J3658J3469J2482J1538J1183J1406J1826J1903
60206H80996J1377J0632J0277J0329J0203R473Q252O892N726M925M212K952R94
60193I77240r61k370l769n873q202r596r879r883r977r668q683p458o361n354
60179H79206m544m237m256m031l451k876k325j507o75n17j104j834k502l469m635
60164H37243n264n108m768m676m520l976l208k371j359l12L62O96J210K051K756
$$ plain form
60264 613665 611867 611834 612464 612630 612667 613332 614249 614632 614912 616246 618709 621204 623030 624531 626281 628545 631485
60247 631485 634956 638090 639876 640287 640203 640249 640282 639932 638985 637262 634831 632405 630994 631012 632119 633948 636556
60230 636556 640114 644613 649988 656276 663537 671748 680723 690125 699767 710011 721433 733919 746526
60217 746526 758608 770655 783531 797189 810658 823140 834678 845861 857267 869093 880996
60206 880996 892373 903005 913282 923611 933814 943287 951539 958431 964157 969082 973294 976246 977240
60193 977240 976279 973909 970140 964267 956065 946469 936590 926707 916730 907062 898379 890921 884560 879206
60179 879206 874662 870425 866169 862138 858687 855811 853486 851979 851304 850787 849683 847849 845347 841878 837243
60164 837243 831979 826871 822103 817427 812907 808931 805723 803352 801993 801681 802043 802739 803949 806000 808756
60149H08756L020K976K695K144J666J710K035K038J924K498L736M554M401M005
60135H48158M123M536M738M823N150N726O341O747O501N263L519K387K419L231
60121I13662M333N576O659P092O902O649O509O117N435M914M561L754K339J091
60107I85593O81Q98J209J331R84q5j400j874j008N20J761K290J989Q69n81j688
60091I91489k490l649n273o666p538q399r479j0172j0135j0002j0421j1102j1399
60078H84764j1165j0530r514q412p893q167q552q416q021p920p977p561o406m858
60064G69372l535k916k974l076k596j743j348j792k579k938k403r99O74J666J690
60049G44503J638K450L794M781N497O682Q098Q629P998P031O100M693K770J176
$$ plain form
60149 808756 811776 814752 817447 819591 821257 822967 825002 827040 828964 831462 835198 839752 844153 848158
60135 848158 852281 856817 861555 866378 871528 877254 883595 890342 896843 902106 905625 908012 910431 913662
60121 913662 917995 923571 930230 937322 944224 950873 957382 963499 968934 973848 978409 982163 984502 985593
60107 985593 986274 987172 988381 989712 990696 990611 989211 987337 986329 986849 988610 990900 992889 993758 993177 991489
60091 991489 988999 985350 980077 973411 965873 957474 947995 937823 927688 917686 907265 896163 884764
60078 884764 873599 863069 853555 845143 837250 829083 820531 812115 804094 796174 788197 780636 774230 769372
60064 769372 765837 762921 759947 756871 754275 752532 751184 749392 746813 743875 741472 740473 741147 742813 744503
60049 744503 746141 748591 752385 757166 762663 769345 777443 786072 794070 801101 807201 811894 814664 815840
60035H15840K95m95j582k597l403m404n461n858n807o515q204r462r365q814q898
60020G35270r209q934q369q161p940o962n470m322l728l302k903k612k336k060
60006F58962k051k305k389k220k255k421j869m12Q26R50O28R82J984K855L389
59991F54654L950M681N535O551P518P845P365O610N793M345K086j14j532k610
59977G12677l867m757m635m084m134m695m921m621m268l898l060j776o80k22k18
59962F62841j10O35K082L542M157M005L872L829L025J348J06L13J303J954K329
59947F95231L024L719L635K884K202J700R10k13j200j791j935j362J25K154M170
59932G13253N995P509Q287Q106P375O480N212L401J564K81n15j077j179o15K77
$$ plain form
60035 815840 816135 815640 814058 811461 808058 803654 798193 792335 786528 780013 771809 762347 752982 744168 735270
60020 735270 726061 717127 708758 700597 692657 685695 680225 675903 672175 668873 665970 663358 661022 658962
60006 658962 656911 654606 652217 649997 647742 645321 643452 643040 643866 644816 645444 646426 648410 651265 654654
59991 654654 658604 663285 668820 675371 682889 690734 698099 704709 710502 714847 716933 716819 715287 712677
59977 712677 708810 704053 699418 695334 691200 686505 681584 676963 672695 668797 665737 663961 663281 663059 662841
59962 662841 662731 663366 665448 668990 673147 677152 681024 684853 687878 689226 689332 689645 690948 692902 695231
59947 695231 698255 701974 705609 708493 710695 712395 713305 713092 711892 710101 708166 706804 706929 709083 713253
59932 713253 719248 726757 735044 743150 750525 757005 762217 765618 767182 767463 766948 765871 764692 764077 764354
59917G64354J199K456M264O114P433Q287Q845Q773P846O442M830K673Kk188l176
59902H28154l630m526n588n880n413n066n161n116m331k772q56P41J517J710K050
59887G85833K638K889K833L438M994O352O569O283O462O817O573N978N769N785
59873H59213N374M545L699K694J296qp28j343k491l723m190m022l849l442k060
59858H50965R0J861K497K096J032j81q60q60r07j477j861j124O02K661M978P604
59842H67116R851J0979J1238J1098J0107P707M716K778K603L788N815Q104R546
59829I65446R300P768N808L411K07l220n720o964p300o717n069k946j108N15K175
59814I55586L117K343J98k017l705n024n762n463m448l452k480j241l26o69k021
$$ plain form
59917 764354 765553 768009 772273 778387 785820 794107 802952 811725 819571 826013 830843 833516 833518 831330 828154
59902 828154 824524 819998 814410 808530 803117 798051 792890 787774 783443 780671 779815 780556 782073 783783 785833
59887 785833 788471 791360 794193 797631 802625 808977 815546 821829 828291 835108 841681 847659 853428 859213
59873 859213 864587 869132 872831 875525 876821 876813 876085 874742 872251 868528 864338 860316 856467 853025 850965
59858 850965 851055 852916 855413 857509 858541 858360 857500 856640 855733 854256 852395 851271 851873 854534 859512 867116
59842 867116 876967 887946 899184 910282 920389 928096 932812 935590 938193 941981 947796 955900 965446
59829 965446 974746 982514 988322 991733 991940 988720 983000 976036 968736 962019 956950 954004 952896 953411 955586
59814 955586 958703 961046 961244 959227 955522 950498 944736 939273 934825 931373 928893 927652 927326 926657 924636
59799I24636l255l981m638n242n284m776m292m066m018m360n106n461m865m183
59785H61109m576n628o003n514n120n167n121m859m690m322l205j797j059p94
59771H03254L6J448K382K471K467K878L509M354N601O807P391P831R016J0536
59757H69981J1157J0866J0897J1623J2001J1308R984Q538P034N831N433N417M730
59744I84800L290K023J304O69O7p3j3m98j219j109k21K16j44k63L32P77M91L3
59726I90462k18p85j801k336j800q77m14l46l00k92l30j18M25J070J906L243M907
59709I92396O425P890R618J1245J2233J3086J4672J6510J7247J6742J6150J5934
59697A150148J5471J4759J4736J5577J6182J5809J4705J2944J0234P218N264M487
$$ plain form
59799 924636 921381 917400 912762 907520 902236 897460 893168 889102 885084 880724 875618 870157 865292 861109
59785 861109 856533 850905 844902 839388 834268 829101 823980 819121 814431 810109 806904 805107 804048 803254
59771 803254 803290 804738 807120 809591 812058 814936 818445 822799 828400 835207 842598 850429 859445 869981
59757 869981 881138 892004 902901 914524 926525 937833 947817 956355 963389 969220 974653 980070 984800
59744 984800 988090 990113 991417 992086 992153 992080 992067 991569 990350 989241 989020 989236 989092 988829 989161 989938 990429 990462
59726 990462 990244 989459 987658 985322 983522 982645 982231 981885 981585 981293 980963 980845 981270 982340 984246 987489 992396
59709 992396 998821 1006711 1016329 1027574 1039807 1052893 1067565 1084075 1101322 1118064 1134214 1150148
59697 1150148 1165619 1180378 1195114 1210691 1226873 1242682 1257387 1270331 1280565 1287783 1293047 1297534
59685A297534L554J901M29m90j903m359o762q020q498q963r457r901j0597j1305
59671A223163j1092r826q528p648o281l830j130Q76K439M195O122Q001R861J1452
59657A217774J2305J2647J3122J3357J2249R959P914O356L712p90n706r546j2764
59644A280589j6452k0464k3944k6419k7452k6519k4284k2574k2047k1217j8801
59633A030416j5656j3306j1972j1240j1354j2424j3601j4347j5351j6919j7743
59622H76503j6728j4895j3837j3307j2072j0257r048q574p815o372m842l590k407
59609G52759j320o00n3P75J791K518K845K945K695J916R05J82j19r6K56Q74J440
59592G69713J642J322L40j097k057j776r36r85k068k908k935l084m043n111n513
$$ plain form
59685 1297534 1301088 1302989 1303418 1302928 1301025 1296666 1289904 1281884 1273386 1264423 1254966 1245065 1234468 1223163
59671 1223163 1212071 1202245 1193717 1186069 1179788 1175958 1174828 1175704 1178143 1182338 1188460 1196461 1206322 1217774
59657 1217774 1230079 1242726 1255848 1269205 1281454 1291413 1299327 1305683 1309395 1308605 1302899 1293353 1280589
59644 1280589 1264137 1243673 1219729 1193310 1165858 1139339 1115055 1092481 1070434 1049217 1030416
59633 1030416 1014760 1001454 989482 978242 966888 954464 940863 926516 911165 894246 876503
59622 876503 859775 844880 831043 817736 805664 795407 786359 777785 769970 763598 758756 755166 752759
59609 752759 751439 750839 750786 751561 753352 755870 758715 761660 764355 766271 767176 767358 767239 767143 767399 768273 769713
59592 769713 771355 772677 773017 771920 769863 768087 767151 766166 764098 761190 758255 755171 751128 746017 740504
59577G40504n489n368m811l743k866k501k128j673j891k741k836j463K31R41Q07
59562G04973M02l52j167q74P57K069J760Q24Q06J481J768J837K535L677M556N414
59546G30466O776P995Q067P437P531Q796J0496J2133J4087J6954K0848K4683K5806
59533I02075K1603J2607K935l418n851n985m885k924j078l14l61n58j290l130
59519I09426n302o594p139p879q828r338r512r886j0231j0047r663r545r130p814
59505G88518o373n931o000n181l358j634m64O19J721K481L124M189N412O112O499
59490G89734P267Q214Q505Q127P817P645O980N703M300K926J419J44k66Q6N16
59475H59117P73R65Q40J04p68r65m55J68N88Q32Q06M98K79M08P38J396K912M999
$$ plain form
59577 740504 735015 729647 724836 721093 718227 715726 713598 711925 710034 707293 704457 702994 703225 704166 704973
59562 704973 705375 705023 703856 702982 703739 705808 707568 708392 709198 710679 712447 714284 716819 720496 725052 730466
59546 730466 737242 745237 753304 760741 768272 777068 787564 799697 813784 830738 851586 876269 902075
59533 902075 923678 936285 939220 935802 929951 923966 919081 916157 915079 914765 914404 913846 912556 909426
59519 909426 904124 897530 890391 882512 873684 864346 854834 844948 834717 824670 815007 805462 796332 788518
59505 788518 782145 776214 770214 765033 761675 760041 759577 760196 761917 764398 767522 771711 777123 783235 789734
59490 789734 797001 805215 813720 821847 829664 837309 844289 849992 854292 857218 858637 858781 858515 858601 859117
59475 859117 859890 860855 861695 861799 861031 860066 859611 859779 860367 861199 862005 862503 862782 863190 863928 865324 868236 873235
59457H73235O296O168N766O319P387P926P919P650O539M213J829O46O6j308l321
59442I37330m696n221n783o569o858o415n616m492k876j323n38k72J73P67J230
59427H88841K058L820N968P628R055J1000J3225J4907J5955J6728J7080J6952
59415A023217J7174J8478K0502K2817K5617K7925K6529J9013P121m728j3501j8414
59403A171750j9225j6304j1576o737r83O826J4072J5497Q900k484j3612k1497
59391A124627k5420k5877k4278k2029j9129j4956j0326p075n505m120k072o7J449
59378I65222L041M858O117O551O782O909O301N106M389M427M389M014M048M656
59364A036810M971M648M503N117O117P126Q221R242R817J0198J0963J1923J2547
$$ plain form
59457 873235 879531 885699 891465 897784 905171 913097 921016 928666 935205 939418 941247 941893 941959 940651 937330
59442 937330 932634 927413 921630 915061 908203 901788 896172 891680 888804 887481 886943 886671 886844 887611 888841
59427 888841 890899 894719 900687 908315 917370 928370 941595 956502 972457 989185 1006265 1023217
59415 1023217 1040391 1058869 1079371 1102188 1127805 1155730 1182259 1201272 1208393 1203665 1190164 1171750
59403 1171750 1152525 1136221 1124645 1117908 1116925 1123751 1137823 1153320 1162220 1159736 1146124 1124627
59391 1124627 1099207 1073330 1049052 1027023 1007894 992938 982612 975537 970032 965912 963840 963773 965222
59378 965222 968263 973121 979238 985789 992571 999480 1005781 1010887 1015276 1019703 1024092 1028106 1032154 1036810
59364 1036810 1041781 1046429 1050932 1056049 1062166 1069292 1077513 1086755 1096572 1106770 1117733 1129656 1142203
59351A142203J3136J4279J5457J5795J5800J6552J7513J7169J5580J4185J3070
59340A310739J0794P146L712J259j300m639p885j0483j3186j6297j8717j9704
59328A241439k0010k0435k0739k0671k0606k0467j9517j7825j6526j5998j5291
59317A033354j3878j2455j1423j0256r031q940j0359j1887j2201j1608j0903j0003
59305I00410q552o824n202l679k336j356k44J802M533O926Q935J1533J4664J6693
59291I37303J6392J4030J0186N036o00n022p163p268n774k869O28L533N735P989
59277I72136J0157J1317J1792J3048J5189J6588J6532J6220J6380J5997J4463
59266A129819J3013J2746J2764J1533Q823N280J403k224m887o799q933j1275j2583
$$ plain form
59351 1142203 1155339 1169618 1185075 1200870 1216670 1233222 1250735 1267904 1283484 1297669 1310739
59340 1310739 1321533 1328679 1332391 1333650 1332350 1327711 1319826 1309343 1296157 1279860 1261143 1241439
59328 1241439 1221429 1200994 1180255 1159584 1138978 1118511 1098994 1081169 1064643 1048645 1033354
59317 1033354 1019476 1007021 995598 985342 976311 967371 957012 945125 932924 921316 910413 900410
59305 900410 891858 885034 879832 876153 873817 872461 872217 874019 878552 885478 894413 905946 920610 937303
59291 937303 953695 967725 977911 982947 982347 977325 970162 962894 957120 954251 954879 958412 964147 972136
59277 972136 982293 993610 1005402 1018450 1033639 1050227 1066759 1082979 1099359 1115356 1129819
59266 1129819 1142832 1155578 1168342 1179875 1188698 1193978 1195381 1193157 1188270 1181471 1172538 1161263 1148680
59253A148680j2494j2315j3030j4060j4686j5068j5173j4320j2587j1104j0131
59242A003712q582o212m523m478n052n045m716m566m161l362l155m090n287o007
59228I34476o724p637p800o866o120o510p129o901o262n902n304l968k676k188
59214H52489j913j155n15o75j061r54q25j274j730j419o28K5N53R28O12k86o15
59197H41557J60J144J671K321L419M156M216M620N757O311N403M204L922L800
59183H92661K726J277N11L6j037k382l302m152n307n914n259m338m455n240n514
59168H50311n137m558l521j773j12O35Q58J145J065J70q61j423k163l631m870
59153H26135m787l870l184k782k415k642l847n258o263p432q985r695q818p638
$$ plain form
59253 1148680 1136186 1123871 1110841 1096781 1082095 1067027 1051854 1037534 1024947 1013843 1003712
59242 1003712 995130 988918 984395 979917 974865 969820 965104 960538 956377 953015 949860 945770 940483 934476
59228 934476 927752 920115 912315 905449 899329 892819 885690 878789 872527 866625 861321 857353 854677 852489
59214 852489 850576 849421 848906 848231 847170 846216 845391 844117 842387 840968 840340 840365 840918 841846 842458 842172 841557
59197 841557 841717 842861 844532 846853 850272 854428 858644 863264 869021 875332 880735 884939 888861 892661
59183 892661 895387 896664 897175 897211 896174 893792 890490 886338 881031 875117 869858 865520 861065 855825 850311
59168 850311 845174 840616 837095 835322 835210 835845 836703 837848 838913 839083 838222 836799 834636 831005 826135
59153 826135 821348 817478 814294 811512 809097 806455 802608 797350 791087 783655 774670 764975 756157 748519
59139G48519p421p292n987m219l304k791j537m3N59Q65K267M365N596N835O290
59124G41702P247P946Q379R341J0836J2117J3059J4045J4815J4783J4152J3496
59112H81918J2723J1590J0448R346P409M415J912J131R67l08k364l704m281n146
59098I26056o274o803o907p401p903p286n612l952k647j447q60j553k801l201
59084H61409k709k419k741l275m039n193n953n387l970k954k565k223j977k277
59070H13727k854l132l297l681l868l612l744m640m989l745k243k393l709m248
59056G63572l700l315l356k885j853j259j302j239q82n89p0J112K200K126J333
59041G49893J050J215R01K40P9J08o63j956k538k236j763r83Q34L267N179O575
$$ plain form
59139 748519 741098 733806 727819 723600 720296 717505 715968 715925 716484 717349 719616 723981 729577 735412 741702
59124 741702 748949 756895 765274 774615 785451 797568 810627 824672 839487 854270 868422 881918
59112 881918 894641 906231 916679 926025 933434 937849 939761 940892 941859 941551 939187 935483 931202 926056
59098 926056 919782 912979 906072 898671 890768 883482 877870 873918 871271 869824 868964 867411 864610 861409
59084 861409 858700 856281 853540 850265 846226 841033 835080 829693 825723 822769 820204 817981 816004 813727
59070 813727 810873 807741 804444 800763 796895 793283 789539 784899 779910 776165 773922 771529 767820 763572
59056 763572 759872 756557 753201 750316 748463 747204 745902 744663 743781 743192 743122 744234 746434 748560 749893
59041 749893 750943 752158 753059 753299 753378 753486 752823 750867 748329 746093 744330 743347 744181 747448 752627 759202
59025G59202Q253R966J0798J0937J1179J1016R343O753M948M009K431j43k367
59012H46325l515m297n062n127m307l348k499j195N14J668J959K263L297M797
58998H31473O152O959O947O271N570N117M405L352K860L265L506L007K946M049
58984H95879M874M258L856N753Q966J1077J2231J4399J7451J9193J9042J8621
58972A035600J8609J7948J6372J4997J4010J2285R708P633O621N807M662L375
58960A167627J520j525m884p075q481j0721j3744j5978j7257j8846k0590k0824
58948A029222j9407j8181j7894j7292j5748j4191j2898j0857q085o070n148l818
58936H79633j539J53L01M7M81R78P89M17L73J81m31q55q41r73j356j252m94J96
$$ plain form
59025 759202 767455 777421 788219 799156 810335 821351 830694 837447 842395 846404 848835 848692 846325
59012 846325 842810 838513 833451 828324 824017 820669 818170 816975 817489 819157 821116 823379 826676 831473
58998 831473 837625 844584 851531 857802 863372 868489 872894 876246 879106 882371 885877 888884 891830 895879
58984 895879 900753 905011 908867 914620 923586 934663 946894 961293 978744 997937 1016979 1035600
58972 1035600 1054209 1072157 1088529 1103526 1117536 1129821 1139529 1147162 1153783 1159590 1164252 1167627
58960 1167627 1169147 1167622 1162738 1155663 1147182 1136461 1122717 1106739 1089482 1070636 1050046 1029222
58948 1029222 1009815 991634 973740 956448 940700 926509 913611 902754 894669 888599 883451 879633
58936 879633 878094 878247 878548 878595 879076 880054 880843 881260 881633 881814 881383 880528 879687 878714 877358 876106 875612 875808
58918H75808O08J209J804J722J455K282M078N366N770O509Q207J0095J1632J3066
58904I49611J4119J4083J3445J3549J4482J5156J5478J6404J7769J8282J7784
58893A120162J7365J7249J6794J6608J8174K1183K3597K4560K4851K4464K2420
58882A347427J9191J6556J4706J2200R096P154O461M860J530j821m213o794r999
58869A416354j2260j2808j3067j3980j4564j4330j4637j6180j7607j7899j7884
58858A251138j8297j8560j8545j9123j9991j9412j7270j5771j6010j6449j6027
58847A055683j6001j7206j8155j7654j6878j7133j7626j7142j5914j4482j2695
58836H74797j1042j0714j1125r862o384l289k437k410j451k44J02L82J556K827
$$ plain form
58918 875808 876416 877625 879429 881151 882606 884888 888966 894332 900102 906611 914818 924913 936545 949611
58904 949611 963730 977813 991258 1004807 1019289 1034445 1049923 1066327 1084096 1102378 1120162
58893 1120162 1137527 1154776 1171570 1188178 1206352 1227535 1251132 1275692 1300543 1325007 1347427
58882 1347427 1366618 1383174 1397880 1410080 1419176 1426330 1432791 1437651 1439181 1437360 1433147 1426353 1416354
58869 1416354 1404094 1391286 1378219 1364239 1349675 1335345 1320708 1304528 1286921 1269022 1251138
58858 1251138 1232841 1214281 1195736 1176613 1156622 1137210 1119940 1104169 1088159 1071710 1055683
58847 1055683 1039682 1022476 1004321 986667 969789 952656 935030 917888 901974 887492 874797
58836 874797 863755 853041 841916 832054 825670 822381 819944 817534 816083 815839 815941 816323 817879 820706
58822H20706L438M306N990P027O242M839M345M304L775L278L447L490K644J543
58808H79374O86o07k461l560l449l634m982o164o115n778n893n455m005l085l503
58793H21369l573k021k89J84O81K866N777P575Q476R702J1145J2203J3327J4785
58779I02207J5513J5016J4666J5301J5374J3361R991O293J479m987j1261j5298
58767I77655j7544j9320k0321j9802j8504j7322j5665j3120j0971j0150r480p904
58755G97552o516o349o202m872l496l402l535k467j023m64J42K211M952O864Q242
58740G81637R873J0798R902Q228P367O984O160N596O148O786O273N354N104M747
58726H80957L423K254K409K853K459K387L954N943O749P287R080J1088J1312R997
$$ plain form
58822 820706 824144 828450 834440 841467 847709 852548 856893 861197 864972 868250 871697 875187 877831 879374
58808 879374 880060 879453 876992 873432 869983 866349 861367 855203 849088 843310 837417 831962 827957 824872 821369
58793 821369 817796 815775 815486 815670 816351 819217 824994 832569 841045 850747 861892 874095 887422 902207
58779 902207 917720 932736 947402 962703 978077 991438 1001429 1007722 1009201 1004214 992953 977655
58767 977655 960111 940791 920470 900668 882164 864842 849177 836057 825086 814936 805456 797552
58755 797552 791036 784687 778485 773613 770117 766715 763180 760713 759690 759226 759368 761579 766531 773395 781637
58740 781637 791510 802308 812210 820438 827805 834789 840949 846545 852693 859479 865752 871106 876210 880957
58726 880957 884380 886634 889043 891896 894355 896742 900696 906639 913388 920675 929755 940843 952155 962152
58712I62152Q529O701L760N85j885m817r361j3996j6739j8396k0684k2823k3098
58699H49928k2246k2109k2246k1043j9009j7837j7167j5424j2879j1098j0129
58688F58741q956p759p128o193m110k223k133k907k774k132k087j761m3J523R04
58673F10962p26p59N80J167J043K127M661P239R620J2416J4638J4587J2559R955
58659G00069O578J607l732p412r639j1829j3600j3617j2420j1535j0764r190p575
58646E96941o997o405m508k585k365k667j450L43N64PQ95K565K626J325Q74J267
58630E80430O92o36r73o84j546l008k963j645j046j009K69K426L422L418M360
58615E81507O092O693O196O285O657N568L645L296M543N215N037N670O828O346
$$ plain form
58712 962152 970681 977382 981142 981727 979842 975025 965664 951668 934929 916533 895849 873026 849928
58699 849928 827682 805573 783327 762284 743275 725438 708271 692847 679968 668870 658741
58688 658741 649785 642026 634898 628705 624595 622372 620239 617332 614558 612426 610339 608578 608535 610058 610962
58673 610962 610236 609477 610057 611224 612267 614394 619055 626294 635914 648330 662968 677555 690114 700069
58659 700069 706647 708254 704522 697110 687471 675642 662042 648425 636005 624470 613706 604516 596941
58646 596941 589944 583539 579031 576446 574081 571414 569964 570307 570871 570878 571773 574338 576964 578289 579163 580430
58630 580430 581122 580486 579513 578829 577283 574275 571312 569667 568621 567612 567881 570307 573729 577147 581507
58615 581507 587599 594292 600488 606773 613430 618998 622643 625939 630482 635697 640734 646404 653232 659578
58601F59578M104K285J606Q15j16J28J217J536J309K113L711M730N859Q620J1735
58586G09230J2674J2194J3175J5383J5900J4394J3497J3831J3162J0908R102Q428
58574H61878P385N894N879P662R554J1320J4405J8523K1782K4295K7906L2253
58562A048736L4936L5621L5952L5419L1496K4106J5944Q255L04o990j1187j2316
58550A240276j2593j2181r425n315l145l599m574n904r564j5065j9534k2713k6965
58537A089699l1931l4214l3095l1509l0642k8525k4824k1901k0080j6997j2802
58526H03179j0831j1738j1964r600p003n995n261m100m035m992m456k138r96k092
58512G17978k851j936j268j689j271M31R97k47p38N36J251L90J05J291J780P20
$$ plain form
58601 659578 663682 665967 667573 668388 668272 668400 669617 671153 672462 674575 678286 683016 688875 697495 709230
58586 709230 721904 734098 747273 762656 778556 792950 806447 820278 833440 844348 853450 861878
58574 861878 869263 875157 881036 888698 898252 909572 923977 942500 964282 988577 1016483 1048736
58562 1048736 1083672 1119293 1155245 1190664 1222160 1246266 1262210 1270465 1270769 1263779 1252592 1240276
58550 1240276 1227683 1215502 1206077 1200762 1197617 1194018 1189444 1183540 1173976 1158911 1139377 1116664 1089699
58537 1089699 1057768 1023554 990459 958950 928308 899783 874959 853058 832978 815981 803179
58526 803179 792348 780610 768646 759046 752043 746048 740787 736687 732652 727660 723204 721066 720070 717978
58512 717978 715127 713191 711923 710234 708963 709394 710391 710144 709406 709942 711193 711583 711688 712979 714759 715479
58496G15479K97J414K087J729K545N099P016P559Q896J1374J2481J1904J2641
58483H00521J5475J7580J8209K0310K4485K6909K5578K3217K1462J7624J0100
58472A021470J877m297r461j4482j7369j7223j6248j5359j2522p710m441l790
58460I00445k110K691P703J0580J3259J7220K0193K0644K0412J9972J6278Q405
58448A055692K34n623j1285j8002k2630k3145k2336k2382k1068j7002j3254j1954
58436H67245j0446o720l477k852k200P25L499M064M955Q214J0989J0620R380R756
58422I03752R667O683K606m02l774q517j1814j1737j0892j1522j1620r709q421
58409H34300r378r550o918m610n077n451l181r66j392j831M03K859K859K593M449
$$ plain form
58496 715479 715776 717190 719277 721006 723551 728650 735666 743225 752121 763495 775976 787880 800521
58483 800521 815996 833576 851785 872095 896580 923489 949067 972284 993746 1011370 1021470
58472 1021470 1023347 1019050 1009589 995107 977738 960515 944267 928908 916386 908676 904235 900445
58460 900445 898335 901026 908729 919309 932568 949788 969981 990625 1011037 1031009 1047287 1055692
58448 1055692 1055926 1050303 1039018 1021016 998386 975241 952905 930523 909455 892453 879199 867245
58436 867245 856799 850079 846602 843750 841550 842275 845774 849838 854793 863007 873996 884616 893996 903752
58422 903752 913419 920102 922708 922306 918532 910015 898201 886464 875572 864050 852430 842721 834300
58409 834300 824922 815372 808454 803844 798767 793316 790135 789169 787777 785946 786349 789208 792067 794660 799109
58394G99109O075N083L826M724N630M520L771N113N549L085J091K137L105J456
58380H54274N64L356O468O390N746P639R489Q521P698R948J2079J0786R244J1277
58366I63479J4349J4838J4909J7563K0114J9266J7483J7844J7759J4274J0150
58355A142028Q322O034R91k705j610K32j335k811o4L373L044K222N434R510R767
58340A182432R140J2276J6237J6124J4501J6147J8874J8507J7568J9749K1389
58329A362944J7762J2440J0902J0405N911M47m50Q17o87k224R84N320M842K658
58315A432071N228J0336J1725J0856J2903J5835J4833J2849J5418J9551J9192
58304A580797J6949J8873K2410K1415J8293J9122K1531J9705J6618J8721K3206
$$ plain form
58394 799109 805184 810267 814093 818817 824447 828967 832738 837851 843400 846485 847576 849713 852818 854274
58380 854274 854838 858194 864662 871052 876798 884437 893926 902447 910145 920093 932172 942958 952202 963479
58366 963479 977828 992666 1007575 1025138 1045252 1064518 1082001 1099845 1117604 1131878 1142028
58355 1142028 1150350 1156384 1157375 1154670 1153060 1153292 1151957 1149146 1149082 1152455 1155499 1157721 1163155 1172665 1182432
58340 1182432 1191572 1203848 1220085 1236209 1250710 1266857 1285731 1304238 1321806 1341555 1362944
58329 1362944 1380706 1393146 1404048 1414453 1420364 1420811 1420361 1421178 1420491 1418267 1419251 1424571 1429413 1432071
58315 1432071 1437299 1447635 1459360 1470216 1483119 1498954 1513787 1526636 1542054 1561605 1580797
58304 1580797 1597746 1616619 1639029 1660444 1678737 1697859 1719390 1739095 1755713 1774434 1797640
58293A797640K3189K0868K2590K5855K4356K1103K2919K6749K5274K1261K2285
58282B054089K6046K5401K3009K5991L0871K9259K4011K4321K9281L1907L4571
58271B358757M4137N6463O2334O4231P0484P7842P7395P2805P4456Q0214Q0477
58260C119595P7409P9887Q4319Q0579P2503P1963P6978P6616P3102P7263Q6422
58249C976636Q9345Q8921R6700J09129J13184J11692J18222J30704J35747J35509
58239E105789J43725J58407J65797J68145J79492J97102K06247K10042K24228
58230F758974K45744K58102K64524K82642L09765L28167L41354L68224M04706
58221I562202M30136M48635M82997N30505N68579O01620O55456P27633P92967
$$ plain form
58293 1797640 1820829 1841697 1864287 1890142 1914498 1935601 1958520 1985269 2010543 2031804 2054089
58282 2054089 2080135 2105536 2128545 2154536 2185407 2214666 2238677 2262998 2292279 2324186 2358757
58271 2358757 2402894 2459357 2521691 2585922 2656406 2734248 2811643 2884448 2958904 3039118 3119595
58260 3119595 3197004 3276891 3361210 3441789 3514292 3586255 3663233 3739849 3812951 3890214 3976636
58249 3976636 4065981 4154902 4251602 4360731 4473915 4585607 4703829 4834533 4970280 5105789
58239 5105789 5249514 5407921 5573718 5741863 5921355 6118457 6324704 6534746 6758974
58230 6758974 7004718 7262820 7527344 7809986 8119751 8447918 8789272 9157496 9562202
58221 9562202 9992338 10440973 10923970 11454475 12023054 12624674 13280130 14007763 14800730
58212A4800730Q56524R47609J062804J172897J285717J439840J636210J844226
58204B5046557K076485K383067K770834L211924L734778M412663N257073O227708
58196E5121089P351954Q709629J0296355J2061649J4101366J6628024J9749918
58189A44019984K3568547K8501148L4868501M1536538M5222879M2086644L0664409
58182C90468650J3305153n280678k0757109l0810125l5150111l4854078l1742226
58175B45179476k7719813k4119956k1437313j9558302j8129970j6790005j5302187
58168A02121930j3639402j1928069j0292797q785981p438982o288545n332594
58161C8415560m525662l838302l272841k814814k422841k077121j790056j560276
$$ plain form
58212 14800730 15657254 16604863 17667667 18840564 20126281 21566121 23202331 25046557
58204 25046557 27123042 29506109 32276943 35488867 39223645 43636308 48893381 55121089
58196 55121089 62473043 71182672 81479027 93540676 107642042 124270066 144019984
58189 144019984 167588531 196089679 230958180 272494718 317717597 359804241 390468650
58182 390468650 403773803 398493125 377736016 346925891 311775780 276921702 245179476
58175 245179476 217459663 193339707 171902394 152344092 134214122 117424117 102121930
58168 102121930 88482528 76554459 66261662 57475681 50036699 43748154 38415560
58161 38415560 33889898 30051596 26778755 23963941 21541100 19463979 17673923 16113647
58153A6113647j361184j182575j039709r32622q37139p44289o69812o16669n65138
58144H164510n08141m61107m28558l94282l52898l19190k97877k74359k43740
58135D884358k20033k08479j96258j78652j67769j67325j64141j52672j43771
58126C285258j41585j35312j21452j11379j09247j04327r2637q4850q5137q2948
58116B216384p3483o6408o6545o5047n7464n2130n3040n1965m5122m0573m2025
58105A602582m1752l6488l4019l7146l7157l0149k4307k4111k2592j6220j2433
58094A286208j5262j7831j6313j7354k4371k9973k9189k7449k8627k7787k2576
58083A029476j9402k1470k2578j9271j7367k0089k1513j8327j6424j9222k0723
$$ plain form
58153 16113647 14752463 13569888 12530179 11597557 10760418 10016129 9346317 8729648 8164510
58144 8164510 7656369 7195262 6766704 6372422 6019524 5700334 5402457 5128098 4884358
58135 4884358 4664325 4455846 4259588 4080936 3913167 3745842 3581701 3429029 3285258
58126 3285258 3143673 3008361 2886909 2775530 2666283 2561956 2469319 2384469 2299332 2216384
58116 2216384 2142901 2076493 2009948 1944901 1887437 1835307 1782267 1730302 1685180 1644607 1602582
58105 1602582 1560830 1524342 1490323 1453177 1416020 1385871 1361564 1337453 1314861 1298641 1286208
58094 1286208 1270946 1253115 1236802 1219448 1195077 1165104 1135915 1108466 1079839 1052052 1029476
58083 1029476 1010074 988604 966026 946755 929388 909299 887786 869459 853035 833813 813090
58072H13090j7011j3654j4847j5841j2960j0817j2668j3550r921o707p960r525
58060F67629p517n400o416p418o151o271r521j1254r161p976j0255j1177p885
58047E61227n176o345p120m498k864n336p471n863m737p618j0321q810o524p374
58033D71170q522o641m642n792p475o775o184q023r280p438n490n994o187l894
58019C78833k145l037l439j482p82l294m836k699q69k364l409q74J484J86j309
58004C49964N98K671J203p27Q87L456K899J153J953L812L555K495L059L545J938
57989C82461O61K079L554K303O68J356K110M67r54N64K319J319J84K113M566M031
57973D09801K707M251O906P085N979O435O880M494J073k40r32l901p392q005o846
$$ plain form
58072 813090 796079 782425 767578 751737 738777 727960 715292 701742 691821 685114 677154 667629
58060 667629 660112 654712 648296 640878 634727 628456 618935 607681 598520 590544 580289 569112 561227
58047 561227 556051 549706 542586 538088 535224 529888 522417 516554 511817 504199 493878 485068 478544 471170
58033 471170 462648 456007 451365 445573 438098 431323 425139 417116 407836 400398 394908 388914 382727 378833
58019 378833 376688 373651 370212 368730 367948 364654 359818 357119 356250 353886 350477 349603 351087 351273 349964
58004 349964 350562 353233 354436 353709 354596 358052 360951 362104 364057 367869 371424 373919 376978 380523 382461
57989 382461 383122 385201 388755 391058 391726 393082 395192 395659 394705 395269 397588 398907 399091 401204 405770 409801
57973 409801 412508 416759 423665 430750 436729 443164 450044 454538 455611 455371 454439 450538 443146 435141 428295
57958D28295p086q063p354o056o574p695p022n766o180o821n304k994k213j573
57944C47594J009L673L897L495N299P835Q443Q686J1296J4485J4794J3152J2697
57931D56355J2869J1028P681M955J953l171q592j1277j2079j3567j4963j4182
57919D17010j2609j2728j3120j1006p732o464o362m376j088N09N43J355K515J836
57905C48283R8k73O8j288l624m402m127n089o470n579k907j203n76Q75K631K613
57889C19030J607K115L678L790K621K316K536J155j294k242j570j300j644j362
57875C29436j167k570m272l769j719o33l13J290L705M788M960O289Q269Q764Q292
57860C61350R026J0384J0057Q620Q654R918R814Q129O929O297M481J861M84Q5
$$ plain form
57958 428295 421209 413146 405792 399736 393162 385467 378445 372679 366499 359678 354374 351380 349167 347594
57944 347594 348603 352276 356173 359668 364967 372802 381245 389931 401227 415712 430506 443658 456355
57931 456355 469224 480252 487933 492888 494841 491670 483078 471801 459722 446155 431192 417010
57919 417010 404401 391673 378553 367547 359815 353351 346989 342613 341525 342034 342577 343932 346447 348283
57905 348283 348381 348108 348176 346888 343264 338862 334735 329646 323176 317597 314690 313487 312911 313786 316417 319030
57889 319030 320637 322752 326430 330220 332841 335157 337693 338848 337554 335312 333742 332442 330798 329436
57875 329436 328269 325699 321427 317658 315939 315306 314993 316283 319988 324776 329736 336025 344294 353058 361350
57860 361350 370376 380760 390817 399437 408091 418009 427823 435952 442881 449178 453659 455520 456004 456089
57846D56089j303l366m236m472o032p944p569n562n023o107o165m840m303m569
57832C84598l376q70L56O1O88K531L173K177J891K993L490K795K590K959J813
57817D07869r93k952k991k670k681j940o50n16j392j380o86j585m128n761n725
57802C71819n861o568o018m088l010l228k541l13J295J338J557K775L472L039
57788C53668K968L679L614K434J785K044J699P69J208L065L887K936K325K871
57774C88952K593O02j186j619k123l546m574m770n767p947r217q584p809q017
57760C26988p850o501n411n393n139m060l535l850l050m98J565J719J573K513
57746B89071L322K961K763L780M613M039L288L682M293L935L366L583L924L580
$$ plain form
57846 456089 454786 451420 447184 442712 436680 428736 421167 415605 410582 404475 398310 393470 389167 384598
57832 384598 381222 380352 380708 380769 381457 383988 387161 389338 391229 394222 397712 400507 403097 406056 407869
57817 407869 406876 403924 400933 398263 395582 393642 392992 392476 391084 389704 389018 387433 383305 377544 371819
57802 371819 365958 359390 353372 349284 346274 343046 340505 340192 341487 342825 344382 347157 350629 353668
57788 353668 356636 360315 363929 366363 368148 370192 371891 372660 373868 376933 380820 383756 386081 388952
57774 388952 391545 392147 390961 389342 387219 383673 379099 374329 368562 360615 351398 342814 335005 326988
57760 326988 319138 312637 307226 301833 296694 292634 289099 285249 282199 281701 283266 284985 286558 289071
57746 289071 292393 295354 298117 301897 306510 310549 313837 317519 321812 325747 329113 332696 336620 340200
57732C40200L131L126K898K097J547J554J437J432K651M363M143J801K22R30J764
57717C73296O63j156j702j349j340j449j114j047j844k751l155l535l863l147
57703C46507j656j237k209k480r79N81Q03P83J614K314K006J728K224K356J402
57688C53757O12P40N47m50l33J992M446M905M512N542Q005J0689J3670J7436K1213
57673D47283K4384K8091L3488L9895M6701N5425O7807Q2589R5333J00007R0422
57662A111425O3494K3590j8261n1898p3870q5344q7630q2251p2720o2704n3316
57651F10515m4345l6652l1136k6787k2215j7882j4909j2846j0713q944q338q255
57639C67493p711p069o935o649n578m543m298m043l048k139j945j470k28J32j574
$$ plain form
57732 340200 343331 346457 349355 351452 352999 354553 355990 357422 360073 364436 368579 370380 370602 371532 373296
57717 373296 373959 372803 371101 369752 368412 366963 365849 364802 362958 360207 357052 353517 349654 346507
57703 346507 344851 343614 341405 338925 337946 338527 339330 340113 341727 344041 346047 347775 349999 352355 353757
57688 353757 354369 355109 355656 355206 354873 356865 361311 366216 370728 376270 384275 394964 408634 426070 447283
57673 447283 471667 499758 533246 573141 619842 675267 743074 825663 920996 1021003 1111425
57662 1111425 1174919 1198509 1180248 1128350 1054480 969136 881506 799255 726535 663831 610515
57651 610515 566170 529518 498382 471595 449380 431498 416589 403743 393030 384086 375748 367493
57639 367493 359782 352713 345778 339129 333551 329008 324710 320667 317619 315480 313535 312065 311837 311969 310395
57624C10395l558l551k135j325j192m84O43R36L89M4J16N1j72m02r95j899k191
57607B94670j707j646k345k282p34O56O39M38J120J283k11j533p23P95O18n21
57591B88517l01J026J402Q43J114K180K229R02l73j010j583j904j296m61o64j456
57575B89165j537j305k068l320l385k436k187k808k787j796j163j378j503j238
57561B60254j347j824j702r59o53j010j098n70ON51J565K810L553M037N143O617
57545B75373P191O398M910L320J900J250J656K216J967J367J344J509R30p9n94
57530C10658p85j190j056N75K715L433K612J810J747J869K044K746L722M262M512
57515C39674M968N131M409L705M206N143M829L484K880L478M048L940L698L529
$$ plain form
57624 310395 306837 303286 301151 299826 298634 298150 298793 299729 300118 300162 300278 300329 300157 299755 298760 296861 294670
57607 294670 292963 291317 288972 286690 285956 286612 287251 287689 288809 290092 289881 288348 287625 288420 289038 288517
57591 288517 288216 289242 290644 291487 292601 294781 297010 297912 297539 296529 294946 293042 291746 291285 290621 289165
57575 289165 287628 286323 284255 280935 277550 275114 272927 270119 267332 265536 264373 262995 261492 260254
57561 260254 258907 257083 255381 254422 253769 252759 251661 251091 251097 251648 253213 256023 259576 263613 268756 275373
57545 275373 282564 288962 293872 297192 299092 300342 301998 304214 306181 307548 308892 310401 311331 311252 310658
57530 310658 309873 308683 307627 308202 310917 314350 316962 318772 320519 322388 324432 327178 330900 335162 339674
57515 339674 344642 349773 354182 357887 362093 367236 372065 375549 378429 381907 385955 389895 393593 397122
57501C97122L128K873L344L807L033J429N56P61J099J252J610J811J208N36J041
57486D24610K194K332J356P32R67J173J103J476K274K691K759L168L558K966J825
57471D55184J482J832J520M70R5R09J962K620L052L028K288J924L195N135N605
57456D90301M621M182M854N144M525M384N339O089N742N163N221N658O256P282
57442E64761Q252Q211P582P759Q595Q518P504P443Q856R762Q887P686P824Q647
57428F80287Q616P664O774O386O359O518O465N832N129N301O130O426N917N565
57414G69369N854O331P016Q476J0315J1338J1440J1599J1776J0827Q800P239O736
57401H87116O289N561N710P175Q672R211R385R865J0351J0727J1557J2726J3297
$$ plain form
57501 397122 400250 403123 406467 410274 413307 414736 415292 416053 417152 418404 420014 421825 423033 423569 424610
57486 424610 426804 429136 430492 431224 432191 433364 434467 435943 438217 440908 443667 446835 450393 453359 455184
57471 455184 456666 458498 460018 460488 460583 461492 463454 466074 469126 472154 474442 476366 479561 484696 490301
57456 490301 494922 499104 503958 509102 513627 518011 523350 529439 535181 540344 545565 551223 557479 564761
57442 564761 573013 581224 588806 596565 605160 613678 621182 628625 637481 647243 656130 663816 671640 680287
57428 680287 688903 696567 703341 709727 716086 722604 729069 734901 740030 745331 751461 757887 763804 769369
57414 769369 775223 781554 788570 797046 807361 818699 830139 841738 853514 864341 873141 880380 887116
57401 887116 893405 898966 904676 911851 920523 929734 939119 948984 959335 970062 981619 994345 1007642
57388A007642J3282J3785J4887J5223J4378J3710J4151J5032J5681J6248J6418
57377A170437J5328J3554J3019J4105J4986J4648J4310J4866J5175J4272J3171
57366A327871J3019J3329J3445J3942J5199J6235J6374J6393J6854J6964J6395
57355A496020J6456J7959J9577J9800J9092J8719J8792J8833J8924J9123J9036
57344A702331J8950J9904K1651K2286K1091J9894K0336K1588K2250K2659K3619
57333A936559K4527K4546K4317K4713K5171K4873K4384K4575K5054K5242K5757
57322B209718K7231K8824K9426K9320K9311K9356K9287K9668L0650L1237L1001
57311B535029L1116L2365L3585L3647L3446L4247L5439L5797L5764L6524L7785
$$ plain form
57388 1007642 1020924 1034709 1049596 1064819 1079197 1092907 1107058 1122090 1137771 1154019 1170437
57377 1170437 1185765 1199319 1212338 1226443 1241429 1256077 1270387 1285253 1300428 1314700 1327871
57366 1327871 1340890 1354219 1367664 1381606 1396805 1413040 1429414 1445807 1462661 1479625 1496020
57355 1496020 1512476 1530435 1550012 1569812 1588904 1607623 1626415 1645248 1664172 1683295 1702331
57344 1702331 1721281 1741185 1762836 1785122 1806213 1826107 1846443 1868031 1890281 1912940 1936559
57333 1936559 1961086 1985632 2009949 2034662 2059833 2084706 2109090 2133665 2158719 2183961 2209718
57322 2209718 2236949 2265773 2295199 2324519 2353830 2383186 2412473 2442141 2472791 2504028 2535029
57311 2535029 2566145 2598510 2632095 2665742 2699188 2733435 2768874 2804671 2840435 2876959 2914744
57300B914744L8373L8225L8131L8234L8363L8966M0266M1337M1406M1219M1750
57289C351014M2592M2933M3082M3672M4419M4990M5886M7009M6873M4856M2874
57278C840200M2834M3779M3604M2423M2051M3023M4401M5824M7673M9609N0940
57267D336361N2117N4135N6818N9226O1210O3170O4874O5996O7077O8520O9552
57256E019056O9688P0135P1966P4027P4583P4024P3885P4105P3585P2674P2715
57245E820443P3606P4168P4576P6140P8811Q1152Q2601Q3728Q4320Q3513Q1932
57234F694990Q1629Q3521Q6644R0054R3665R7017R9025R9419R8982R8048R6118
57223G719112R3093Q9560Q5668Q1004P5651P0237O5029O0108N6128N3701N2283
$$ plain form
57300 2914744 2953117 2991342 3029473 3067707 3106070 3145036 3185302 3226639 3268045 3309264 3351014
57289 3351014 3393606 3436539 3479621 3523293 3567712 3612702 3658588 3705597 3752470 3797326 3840200
57278 3840200 3883034 3926813 3970417 4012840 4054891 4097914 4142315 4188139 4235812 4285421 4336361
57267 4336361 4388478 4442613 4499431 4558657 4619867 4683037 4747911 4813907 4880984 4949504 5019056
57256 5019056 5088744 5158879 5230845 5304872 5379455 5453479 5527364 5601469 5675054 5747728 5820443
57245 5820443 5894049 5968217 6042793 6118933 6197744 6278896 6361497 6445225 6529545 6613058 6694990
57234 6694990 6776619 6860140 6946784 7036838 7130503 7227520 7326545 7425964 7524946 7622994 7719112
57223 7719112 7812205 7901765 7987433 8068437 8144088 8214325 8279354 8339462 8395590 8449291 8501574
57212H501574N0962M9979N0102N1059N2073N3487N6027N8897O0533O1130O2443
57201I108266O5042O7659O9444P1043P2932P4382P4650P3897P2402O9929O6245
57190I885891O1405N5530M9111M3198L8270L3340K7453K1529J7264J4564J1706
57179A0259261P816L523n97m505p710r514j0252j0752j0728r338p171n788n298
57166A0188947m257k044N47L175O397J0002J2811J4594J6315J8065J8644J7608
57154A0300804J5806J3256Q527R89q207j8369l0527m5265o0934p5388q8163r9651
57142I912878j09320j16166j20028j21325j20184j16722j11391j04245r4911q4150
57132H814436p4424o7953o4998o4915o7792p3794q1832r0182r7887j04417j08615
$$ plain form
57212 8501574 8552536 8602515 8652617 8703676 8755749 8809236 8865263 8924160 8984693 9045823 9108266
57201 9108266 9173308 9240967 9310411 9381454 9454386 9528768 9603418 9677315 9749717 9819646 9885891
57190 9885891 9947296 10002826 10051937 10095135 10133405 10166745 10194198 10215727 10232991 10247555 10259261
57179 10259261 10267077 10270600 10270003 10265498 10257788 10248274 10238022 10227270 10216542 10207204 10200033 10194245 10188947
57166 10188947 10184690 10182646 10183193 10186368 10192765 10202767 10215578 10230172 10246487 10264552 10283196 10300804
57154 10300804 10316610 10329866 10338393 10339382 10331175 10312806 10282279 10237014 10176080 10100692 10012529 9912878
57142 9912878 9803558 9687392 9567364 9446039 9325855 9209133 9097742 8993497 8898586 8814436
57132 8814436 8740012 8672059 8607061 8542146 8474354 8400560 8318728 8228546 8130659 8026242 7917627
57121G917627j09345j06760j01812r4843q5842p5633o5385n4989m3122k8876j2148
57110G138872P509L0931N8079Q8120J21347J59878K06187K62469L32001M19591
57100H824984N29705O66009Q33909J041689J297232J605239J969134K392463K874593
57091B2034957L407566L982322M596826N253367N950281O681415P432384Q150189
57083F7489307Q704658Q905034Q595239P753603O498699M999722L387015J735406
57075A18068683R8175j467632k901490m146829n158604n915545o427365o724019
57067H5425374o837538o796621o631432o371362o036248n636979n186247m703744
57059C7225203m210836l726006l265891k844333k467870k135879j846323j597943
$$ plain form
57121 7917627 7808282 7701522 7599710 7504867 7419025 7343392 7278007 7223018 7179896 7151020 7138872
57110 7138872 7146381 7177312 7235391 7323511 7444858 7604736 7810923 8073392 8405393 8824984
57100 8824984 9354689 10020698 10854607 11896296 13193528 14798767 16767901 19160364 22034957
57091 22034957 25442523 29424845 34021671 39275038 45225319 51906734 59339118 67489307
57083 67489307 76193965 85098999 93694238 101447841 107946540 112946262 116333277 118068683
57075 118068683 118166858 116699226 113797736 109650907 104492303 98576758 92149393 85425374
57067 85425374 78587836 71791215 65159783 58788421 52752173 47115194 41928947 37225203
57059 37225203 33014367 29288361 26022470 23178137 20710267 18574388 16728065 15130122
57051A5130122j387059j207175j053209r22548q11672p15843o32840n62848n03924
57042G333004m51674m04225l63286l29190k99045k71102k46771k26618k08236
57033D532857j90055j73592j59942j47256j33799j20440j08102r5592q1878o7743
57023C254458n3254l6411j6777J404J1579Q981p913l6848p0852j00592j20074
57012B833701j29162j30222j25035j15831j05984r7416q9416q1424p4721p0051
57002A814439o6021o1442n6937n2919m8348m2977l8306l4912l1304k6800k2848
56991A331625k0010j6513j1480o763l535L1N490J1185J4885J6776J7322J4690
56979A353703P210l362j3576k1699k7302k9623k8802k7007k5878k4353k1149j7553
$$ plain form
57051 15130122 13743063 12535888 11482679 10560131 9748459 9032616 8399776 7836928 7333004
57042 7333004 6881330 6477105 6113819 5784629 5485584 5214482 4967711 4741093 4532857
57033 4532857 4342802 4169210 4009268 3862012 3728213 3607773 3499671 3404079 3322201 3254458
57023 3254458 3201204 3164793 3148016 3149420 3160999 3169980 3162067 3125219 3054367 2953775 2833701
57012 2833701 2704539 2574317 2449282 2333451 2227467 2130051 2040635 1959211 1884490 1814439
57002 1814439 1748418 1686976 1630039 1577120 1528772 1485795 1447489 1412577 1381273 1354473 1331625
56991 1331625 1311615 1295102 1283622 1276859 1273324 1273355 1278845 1290030 1304915 1321691 1339013 1353703
56979 1353703 1360913 1357551 1343975 1322276 1294974 1265351 1236549 1209542 1183664 1159311 1138162 1120609
56967A120609j5345j3757j1049p565m777k583P8L216O671J1536J8215K4053K5236
56954A154538K0365J0602k296j6062k7415l3945l6007l5388l3071k9610k6060
56943I45651k2871j9194j4799j1047q505n522q99M039P940J1985J7814K4831L1628
56930I61051L7813M1957L9920K8580J0081j0093k7805m0885m7490m7398m3777
56919I01954m0329l7359l3151k8039k3990k1292j8701j6296j5200j4981j4074
56908F38542j2394j1035r974q441o973o547o413n215l578k996k892j468J067K859
56894E64542L599M784P057R696J2521J6066K0200K4649L0131L6536M0684L8613
56882H09078K9948J7842N242o321j5093j9478k0166j9334j7699j4586j0494o939
$$ plain form
56967 1120609 1105264 1091507 1080458 1072893 1068116 1065533 1065611 1068827 1075498 1087034 1105249 1129302 1154538
56954 1154538 1174903 1185505 1183209 1167147 1139732 1105787 1069780 1034392 1001321 971711 945651
56943 945651 922780 903586 888787 877740 869235 863713 862814 866853 874793 886778 904592 929423 961051
56930 961051 998864 1040821 1080741 1109321 1119402 1109309 1081504 1040619 993129 945731 901954
56919 901954 861625 824266 791115 763076 739086 717794 699093 682797 667597 652616 638542
56908 638542 626148 615113 605139 596698 589725 583178 576765 571550 567972 564976 562084 560616 561683 564542
56894 564542 568141 572925 579982 589678 602199 618265 638465 663114 693245 729781 770465 809078
56882 809078 839026 856868 862110 855789 840696 821218 801052 781718 764019 749433 738939 732000
56870G32000l912l9M722R110J3220J8516K5065L1406L7677M6288N8504P1813Q1004
56857A125374Q0599O6982M0872Q440k1865m4371n7726o2708o0776n4381m6198
56846I74242l7473k8292j9089j0385j616P959J7818K7283L7263M9012O2327P7122
56834A156171R5138J16448J34340J37278J17349P5872K1814l2764p6715j03703
56824A641228j14336j13542j05762r3626p9776o6770n5099m3655l2202k1412j0955
56813I04093M2J0986K0794L0662M3309N9481P6984R2124R9444R1664O4531K2861
56801A516975k1255n7105q0630r2284r3922q8551p9684o9288n7963m7202l8797
56790G90294l2044k4496j5820q013j594N193J2961K0378K7493L6222M5980N1821
$$ plain form
56870 732000 728088 728049 732771 741881 755101 773617 798682 830088 867765 914053 972557 1044370 1125374
56857 1125374 1205973 1272955 1313827 1322267 1300402 1256031 1198305 1135597 1074821 1020440 974242
56846 974242 936769 908477 889388 879003 877387 885346 903164 930447 967710 1016722 1079049 1156171
56834 1156171 1251309 1367757 1502097 1639375 1756724 1832596 1854410 1821646 1744931 1641228
56824 1641228 1526892 1413350 1307588 1213962 1134186 1067416 1012317 968662 936460 915048 904093
56813 904093 904135 915121 935915 966577 1009886 1069367 1146351 1238475 1337919 1429583 1494114 1516975
56801 1516975 1495720 1438615 1357985 1265701 1171779 1083228 1003544 934256 876293 829091 790294
56790 790294 758250 733754 717934 709921 708327 713520 726481 746859 774352 810574 856554 908375
56778I08375M8782L5975J5680q576l1749m8263n5792n6659n4365n0433m5362m0139
56766F17474l5309l0455k5772k2422k0431j8279j5374j2928j1513j0008p940o566
56754D00477o515o536n725m946m881m687l814l183l331l264k335j486j515j784
56740C46475j693j688j861j308J65J295J265P62M37M8l32rP88R61N63Q51J800
56723C48519J883Q52L87J216J924J537R59Q82O35N4J94J101J163j28j104o73R8
56706C59499L20Q39K074K610J496qn28m99p04p26k22L8k99l08M72J110J107J265
56688C67536J774J493J72o99l07J95l2k7R21J824J879J833K294K513J949J241
56672C84559O66m04j713j976j344j634l221m194l606k892k916k420q67lq38j688
$$ plain form
56778 908375 957157 993132 1008812 1000236 968487 920224 864432 807773 753408 702975 657613 617474
56766 617474 582165 551710 525938 503516 483085 464806 449432 436504 424991 414983 407043 400477
56754 400477 393962 387426 381701 376755 371874 367187 363373 360190 356859 353595 351260 349774 348259 346475
56740 346475 344782 343094 341233 339925 340090 341385 342650 343412 343849 343897 343565 343556 344344 345305 345868 346719 348519
56723 348519 350402 351254 351641 352857 354781 356318 357277 358159 358794 358848 359042 360143 361306 361178 360074 359401 359499
56706 359499 359819 360658 362732 365342 366838 366830 366302 365803 365099 364373 364151 364189 363890 363582 364054 365164 366271 367536
56688 367536 369310 370803 370975 370276 369969 370164 370132 370105 371026 372850 374729 376562 378856 381369 383318 384559
56672 384559 385225 384821 383108 381132 379788 378154 374933 370739 367133 364241 361325 358905 358038 358035 357197 355509
56656C55509j061qK51N61J764K642K095J231J368J848J693J479J783J748Q69K69
56640C74041N43M19q45j846j508r81j387j880j687j782k755l283k553j979k574
56625C49943k997k117j241j704k532k506k322k671k462j060j3m04q41j56L31n17
56609C26731j234l78P52N42j64j66l66j585k315j309q4j33j19J282K323J203k64
56592C24716N22K422K531R76J25M93P99R55J702K336J778Q40P79Q74J05l57Q37
56575C42433K291K050J131J752L404L917L233K935L149L000L093M495O231O743
56561C89857O897Q660J1814J4616J6499J7342J5539J0040L173j631l982n600o601
56548D76623n991m658m489n253n350m857m867m857l679k278k374l427l822l925
$$ plain form
56656 355509 354448 354440 354691 355252 357016 359658 361753 362984 364352 366200 367893 369372 371155 372903 373772 374041
56640 374041 374584 375003 374158 372312 370804 369823 368436 366556 364869 363087 360332 357049 354496 352517 349943
56625 349943 346946 344829 343588 341884 339352 336846 334524 331853 329391 328331 328318 327914 327073 326917 327248 326731
56609 326731 325497 325119 325871 326413 326249 326083 325717 324132 321817 320508 320424 320291 320172 321454 323777 324980 324716
56592 324716 325238 327660 330191 331167 331292 331785 332584 333539 335241 337577 339355 340195 340974 341848 341953 341596 342433
56575 342433 344724 346774 347905 349657 353061 356978 360211 363146 366295 369295 372388 376883 383114 389857
56561 389857 396754 405414 417228 431844 448343 465685 481224 491264 494437 492806 488824 483224 476623
56548 476623 470632 465974 461485 456232 450882 446025 441158 436301 432622 430344 427970 424543 420721 416796
56534D16796m887n631m444k502k366l791m413l822l518l541k631j211q88j414
56520C71737j292q54j477k448j939o02p93k509l482l047k687k870k525j619j292
56505C42301j472j142p09j432k815l244k731k403j978n17J056J074J24N5P83R43
56489C27893P56J235J519K51j337j077L01L81p75j209q96j297j835p56J095J285
56473C25534J34J71J526J876Q27L72R45Q83M8J83J322J447J17q92q63q50r56j54
56455C31670J074J085J38K5P93R07M07O54J361J215R37K187L793K999J48j639
56439C47754j387j011j351j284q12j109j525l03J664J689j32j060m05j25p36o64
56423C39203J51O1o87j76J261J361K53K53J333J152k20j87J374J643K0q23J10
$$ plain form
56534 416796 411909 406278 401834 399332 396966 393175 388762 384940 381422 377881 375250 374039 373151 371737
56520 371737 370445 369591 368114 365666 363727 363125 362332 359823 356341 353294 350607 347737 345212 343593 342301
56505 342301 340829 339687 338978 337546 334731 331487 328756 326353 324375 323858 324914 325988 326112 326167 326950 327893
56489 327893 328649 329884 331403 331654 330317 329240 329541 329922 329147 327938 327042 325745 323910 323154 324249 325534
56473 325534 325668 325839 327365 329241 330068 330440 331385 332268 332316 332499 333821 335268 335385 334493 333630 332780 331824 331670
56455 331670 332744 333829 333967 333992 334785 335692 336099 336753 338114 339329 340266 342453 346246 349245 349393 347754
56439 347754 346367 345356 344005 342721 341909 340800 339275 338972 340636 342325 342193 341133 340728 340603 339867 339203
56423 339203 339354 339415 338728 338552 339813 341174 341427 341680 343013 344165 343945 343758 345132 346775 346795 345972 346082
56406C46082O67p6l37M18L46q62j049L87J438J425J941L124L055J692J285K089
56390C61625J857L11k07O10K85j574k198n98Q55R60J335K334J889k02j173L0J219
56373C67358J322J922L235L107J387P76J919K257J074R64K666L291J559M4K97
56358C93178L83o84p90Q93J897J089P87K092K593J040r4Q54J896J475J213K151
56342D09973K438J101J67Q03J237O39R23K733L815L386L807N868O877N555M340
56327D53662M679M641L408L371N282O065M079J978J717J377l89j491p40l88j494
56312D85757j496P83K431J685J191K887M488M186M173O065P548O955O655Q409
56298E41717R827Q944P851Q328Q401O712N772P270Q660Q030P818R968J1917J1325
$$ plain form
56406 346082 346749 346673 346336 346754 347100 346238 345189 345576 347014 348439 350380 353504 356559 358251 359536 361625
56390 361625 363482 363793 363586 364196 364481 362907 360709 360111 360966 361926 363261 365595 367484 367282 366109 366139 367358
56373 367358 368680 370602 373837 376944 378331 379107 381026 383283 384357 385321 387987 391278 392837 392881 393178
56358 393178 393561 392877 392087 392980 394877 395966 396753 398845 401438 402478 402384 403238 405134 406609 407822 409973
56342 409973 412411 413512 413679 414482 415719 416358 417281 420014 423829 427215 431022 436890 443767 449322 453662
56327 453662 458341 462982 466390 469761 475043 481108 485187 487165 488882 490259 489870 488379 487639 487251 485757
56312 485757 484261 485044 487475 489160 490351 493238 497726 501912 506085 512150 519698 526653 533308 541717
56298 541717 551544 560488 568339 576667 585068 591780 597552 604822 613482 621512 629330 639298 651215 662540
56284F62540J0357J1419J2860J2810J2886J4363J5011J3599J3024J5190J7240
56273H11299J6848J6558J8758K1115K1374K2034K5654K9899L1947L3647L7688
56262A086821M2752M6912N1820N9093O6585P2534P9333Q9066R9603J09179J20158
56251A923856J34064J47651J58442J69165J82019J93588K00409K04474K07859
56242C521527K07164J98918J85718J70974J52306J26200R4901O2582K8969p133
56232D742126m2143p1908r7748j22332j43414j57773j67493j76139j82293j83021
56222C397862j80067j76593j71424j62556j52695j45203j38234j28848j19096
56213B023146j11988j05374r6166q6692q0446p5455o8395o1301n7480n4602m8813
$$ plain form
56284 662540 672897 684316 697176 709986 722872 737235 752246 765845 778869 794059 811299
56273 811299 828147 844705 863463 884578 905952 927986 953640 983539 1015486 1049133 1086821
56262 1086821 1129573 1176485 1228305 1287398 1353983 1426517 1505850 1594916 1694519 1803698 1923856
56251 1923856 2057920 2205571 2364013 2533178 2715197 2908785 3109194 3313668 3521527
56242 3521527 3728691 3927609 4113327 4284301 4436607 4562807 4657708 4720290 4749259 4742126
56232 4742126 4699983 4628075 4530327 4407995 4264581 4106808 3939315 3763176 3580883 3397862
56222 3397862 3217795 3041202 2869778 2707222 2554527 2409324 2271090 2142242 2023146
56213 2023146 1911158 1805784 1709618 1622926 1542480 1467025 1398630 1337329 1279849 1225247 1176434
56202A176434m2073l8442l6550l2679k7924k5357k3494j9461j5253j4089j3936
56191H87176j1458q719r053j0075p938m821m825o173m965k874l473m558k087J661
56177H07818J887l7M21K521K698K194M266O925O467N012O657R504R508Q661J1012
56162H85514J4121J3242J0573J1483J4863J6076J6155J8997K2694K3082K2709
56151A069509K6855L3602L7455L9792M5904N4638O1141O7171P8458R4200J09332
56140A718057J24728J44658J66209J81569J88824J90455J83749J64013J35760
56131C198022J09906R0958P6712O7925O6852O7805O0895M4781K5785O268j5225
56120C800684l4351m3834m5691m9720o0367p5273r4861j21528j50056j70437j80226
$$ plain form
56202 1176434 1134361 1095919 1059369 1026690 998766 973409 949915 930454 915201 901112 887176
56191 887176 875718 866999 857946 847871 839933 835112 830287 824114 819149 816275 812802 808244 806157 807818
56177 807818 809705 809668 810089 812610 815308 817502 821768 828693 835160 840172 846829 856333 865841 874502 885514
56162 885514 899635 912877 923450 934933 949796 965872 982027 1001024 1023718 1046800 1069509
56151 1069509 1096364 1129966 1167421 1207213 1253117 1307755 1368896 1436067 1514525 1608725 1718057
56140 1718057 1842785 1987443 2153652 2335221 2524045 2714500 2898249 3062262 3198022
56131 3198022 3307928 3398886 3475598 3543523 3610375 3678180 3739075 3783856 3809641 3815909 3800684
56120 3800684 3766333 3722499 3676808 3627088 3566721 3491448 3396587 3275059 3125003 2954566 2774340
56109B774340j83879j81518j69664j51575j34934j20157j02421q3756p0969o2938
56099A512529n2567m0385l3473l1608k7456k0123j5665j4406j0642m788k952m522
56087A253942l005J180J654p57R11O131P792O175Q143J2991J3318R706J0009J4302
56073A342492J5241J3175J5698K2125K3901K0774K0963K4862K4442J9487J8210
56062A561370K0959J9615J4114J2968J6416J5860J1165J1253J6378J7330J3645
56051A731073J4660K0895K2701J9146J9674K5076K5768K1100K0976K6062K6161
56040A973292K0694K0514K6555K7508K1847K1164K8291L3373L5000M3080N7074
56029B308392O4061O2517O5030P3251P4079O5451O1312O5548O5997O0085O0793
$$ plain form
56109 2774340 2590461 2408943 2239279 2087704 1952770 1832613 1730192 1646436 1575467 1512529
56099 1512529 1459962 1419577 1386104 1354496 1327040 1306917 1291252 1276846 1266204 1261416 1258464 1253942
56087 1253942 1250937 1252117 1253771 1253014 1253925 1260056 1267848 1274023 1282166 1295157 1308475 1318181 1328190 1342492
56073 1342492 1357733 1370908 1386606 1408731 1432632 1453406 1474369 1499231 1523673 1543160 1561370
56062 1561370 1582329 1601944 1616058 1629026 1645442 1661302 1672467 1683720 1700098 1717428 1731073
56051 1731073 1745733 1766628 1789329 1808475 1828149 1853225 1878993 1900093 1921069 1947131 1973292
56040 1973292 1993986 2014500 2041055 2068563 2090410 2111574 2139865 2173238 2208238 2251318 2308392
56029 2308392 2372453 2434970 2500000 2573251 2647330 2712781 2774093 2839641 2905638 2965723 3026516
56018C026516P0706P5966P2897P4492Q3610Q6717Q1478Q2918R4408J00807R8270
56007C948785J01662J14195J20076J16151J19502J34110J42362J39728J44357
55998E080928J61412J72529J72342J79533J99212K11559K11204K19374K42567
55989F850660K59205K62558K75289L04923L28353L38117L58759L98329M31002
55980I807195M48209M77319N27900N71867O00529O45817P19465P89893Q47090
55971A5435284R27605J044849J162196J269068J411337J609136J823124K044387
55963B6726986K332545K718198L162318L666548M318859N166912O162461P301604
55955F1556431Q682816J0341140J2193188J4263810J6776624J9894266K3667403
$$ plain form
56018 3026516 3097222 3173188 3246085 3320577 3404187 3490904 3572382 3655300 3749708 3850515 3948785
56007 3948785 4050447 4164642 4284718 4400869 4520371 4654481 4796843 4936571 5080928
55998 5080928 5242340 5414869 5587211 5766744 5965956 6177515 6388719 6608093 6850660
55989 6850660 7109865 7372423 7647712 7952635 8280988 8619105 8977864 9376193 9807195
55980 9807195 10255404 10732723 11260623 11832490 12433019 13078836 13798301 14588194 15435284
55971 15435284 16362889 17407738 18569934 19839002 21250339 22859475 24682599 26726986
55963 26726986 29059531 31777729 34940047 38606595 42925454 48092366 54254827 61556431
55955 61556431 70239247 80580387 92773575 107037385 123814009 143708275 167375678
55948A67375678K8463733L4907162M2512802M8317516M7807006L8115225K0517215
55941D28016337k55616j8966281l2291762l9340953m0989961l9016448l5274461
55934B21880855l1045524k6910313k3091090j9734057j6884293j4444708j2311384
55927G7459486j0469448q908823p558405o366403n354178m534003l852173l260821
55919B7155232k771221k390539k074824j788797j549934j372215j223555j077474
55911A2906673r52994q65982p90805p05686o29409n78930n34147m77243m25886
55902F945591l96008l70047l32080k97925k81749k67494k41068k17671k10343
55893D331206k03325j82746j63301j58894j55893j40607j25477j23262j21732
$$ plain form
55948 167375678 195839411 230746573 273259375 321576891 369383897 407499122 428016337
55941 428016337 427760721 408794440 376502678 337161725 296171764 257155316 221880855
55934 221880855 190835331 163925018 140833928 121099871 104215578 89770870 77459486
55927 77459486 66990038 58081215 50522810 44156407 38802229 34268226 30416053 27155232
55919 27155232 24384011 21993472 19918648 18129851 16579917 15207702 13984147 12906673
55911 12906673 11953679 11087697 10296892 9591206 8961797 8382867 7848720 7371477 6945591
55902 6945591 6549583 6179536 5847456 5549531 5267782 5000288 4759220 4541549 4331206
55893 4331206 4127881 3945135 3781834 3622940 3467047 3326440 3200963 3077701 2955969
55884B955969j08192r4082r1644q9990p7202o3480o0193n7943m7044l8681m4312
55873B183206n3915n5249n5401o3345o9912o5020n7141n6574n6394m8198l9850
55862A562207l9657l9418l0682k1855k1976k3331j7170j1111j4164j9515j8821
55851A304507j8821k7078l5699l5725l3815l8345m2636l8259l1825l2226l3847
55840I36231k8512k1897k2159k3970j9554j4259j5730j8569j5011j0175j1699
55829G34696j4563j1119o158p231r780o477j941l683p485o020l192n796r532p265
55815F34454k977l757n945k836J735J045j073K193P017O327L567N805R801Q281
55801F63637L797L313M840K052l335n895p639j3053j8570j8586j6401j7921k0133
$$ plain form
55884 2955969 2847777 2753695 2662051 2572061 2494859 2431379 2371186 2313243 2266199 2227518 2183206
55873 2183206 2129291 2074042 2018641 1955296 1885384 1820364 1763223 1706649 1650255 1602057 1562207
55862 1562207 1522550 1483132 1452450 1430595 1408619 1385288 1368118 1357007 1342843 1323328 1304507
55851 1304507 1285686 1258608 1222909 1187184 1153369 1115024 1072388 1034129 1002304 970078 936231
55840 936231 907719 885822 863663 839693 820139 805880 790150 771581 756570 746395 734696
55829 734696 720133 709014 702856 695625 685845 679368 677427 673744 666259 660239 657047 651251 641719 634454
55815 634454 631477 627720 621775 618939 620674 621719 620646 622839 629856 636183 639750 645555 655356 663637
55801 663637 667434 670747 675587 677639 674304 668409 660770 647717 629147 610561 594160 576239 556106
55788E56106j7164j2004j0681j0458n443J283K724K72k04L15k396n602l995J51
55774D92904J540J972N794J0329J1088J1243J5182J7893J1938L90q180j3033j8630
55761E40430k3302k2136j7529j5663j5657j2697q448p773q577n558q25l22k823
55748C99120k979k109n224j0265j1021q397q213j0037q569m235k158k395r57J123
55734C23684m89m260m834k692k614m190l172n47r45l544l631j831k605n070m457
55719B78803j453j022k928k426N34J541M11J090L598M380L842N350P577O127J972
55704C07396J78J054M89j823k542k161m210p691q209n942m836m869k881k8k81
55689B63644k472j999N25N49j351l12L422M656K750K403M660N494L892L341M466
$$ plain form
55788 556106 538942 526938 516257 505799 500356 501639 504363 504635 504431 504746 502350 496748 492753 492904
55774 492904 494444 496416 502210 512539 523627 534870 550052 567945 579883 580273 572093 559060 540430
55761 540430 517128 494992 477463 461800 446143 433446 424998 417225 408648 403090 402265 401943 399120
55748 399120 396141 394032 388808 378543 367522 359125 350912 340875 332306 328071 325913 323518 322561 323684
55734 323684 323195 318935 314101 311409 308795 304605 301433 300886 299941 296397 292766 290935 288330 283260 278803
55719 278803 277350 276328 273400 270974 271508 273049 273460 274550 278148 282528 286370 291720 299297 305424 307396
55704 307396 307574 308628 309117 307294 304752 302591 298381 290690 282481 276539 271703 266834 263953 263925 263644
55689 263644 261172 259173 259698 260247 258896 258584 262006 266662 269412 271815 276475 281969 285861 289202 293668
55674B93668L958J555P07J521M05k628l507j600n90j305o87J472J850K79K65K154
55658B97517K552J135J173K764K397o2q37N49L43k339m187m280n389p740q177
55643B75419o479o129p655p583n109l556m112m213l097k939l559k192O75J376
55629B20847k16k19K135L244J904J031J514P02j727k615j410j360l236l840k159
55614B14595j133j854j808l38p1j481j654N5P36l75n39Q52R19j087k336j975k499
55597B00007m316m572k777j914k690k364o09n72k635l144j069P0j184j680J05
55582A70656J217O8m95J321L027K711K253L162L827L259L140M118M467M079N166
55567B11976P489P744N265L315L242K517J88j212j033k157n195o569m807l245
$$ plain form
55674 293668 297626 299181 299888 301409 301814 299186 295679 294079 293489 292184 291497 292969 294819 295098 295363 297517
55658 297517 300069 301204 302377 305141 307538 307476 306639 307188 307531 305192 301005 296725 291336 283596 275419
55643 275419 268940 262811 255156 247573 242464 238908 234796 230583 227486 224547 220988 218796 219471 220847
55629 220847 220631 220412 222547 225791 227695 228726 230240 230942 229215 226600 225190 223830 220594 216754 214595
55614 214595 213462 211608 209800 209462 209391 207910 206256 206311 207047 206672 206133 206985 207904 206817 204481 202506 200007
55597 200007 195691 191119 188342 186428 183738 181374 180765 180193 177558 174414 173345 173415 172231 170551 170656
55582 170656 171873 171941 171446 172767 175794 178505 180758 183920 187747 191006 194146 198264 202731 206810 211976
55567 211976 219465 227209 232474 235789 239031 241548 241736 240524 239491 237334 232139 225570 220763 217518
55553B17518m029m678l339k159k646k672j056k40j470k071m76P13l44j289j40
55538A91622J119N70j94L27N40p46j699j111q33k018k800k114j847k860l020j577
55522A73359j186l003m128k633q89j085j685j155j043k292k748j295m81j967l280
55507A44489k255p20o99q50J52M81j185k559j599l1J43J92J598K837K455K044
55491A44493L015L589K155M68N03J204J160J424K812L570K574J620J944J780O0
55476A72371j105m60m03k621m580l747j878j632k254k060k000l230m098l044j628
55461A37631j512j364P2R48k47j389l07J305J120L19Q86J651P67n31k86M89K7
55444A39579p17k66J79q75k024j494m56n31n56Q00J833P24q31m36R40J148O61
$$ plain form
55553 217518 213489 208811 205472 203313 200667 197995 196939 196699 195229 193158 192682 193395 193051 191762 191622
55538 191622 192741 193311 193117 193444 193984 193238 191539 190428 189595 187577 184777 182663 180816 177956 174936 173359
55522 173359 172173 169170 165042 162409 161520 160435 158750 157595 156552 154260 151512 150217 149736 147769 144489
55507 144489 142234 141514 140815 139965 140117 140598 139413 136854 135255 135224 135367 135559 137157 139994 142449 144493
55491 144493 147508 151097 153252 153720 154223 155427 156587 158011 160823 164393 166967 168587 170531 172311 172371
55476 172371 171266 170806 170403 167782 163202 159455 157577 155945 153691 151631 149631 146401 142303 139259 137631
55461 137631 136119 134755 134827 135775 135528 134139 133832 135137 136257 136576 137462 139113 139880 139349 139063 139552 139579
55444 139579 138862 138596 138775 137900 135876 134382 133926 133395 132839 133639 135472 136196 135365 134929 135869 137017 137678
55427A37678P74M88j221k516j641l28o48j075M92K366J898K99L78J473J051l94
55411A39074m55O35P43M3L19J185P88n07q26l26o18j472j414o85n85p57j31N16
55393A35527r4r74l88R90J293P12P36J339J576J670K032J686J64p92J3P22n31
55376A45681k209k018q34p09j067m32M4j368l144k595m58M40k00m44Qj8k15N18
55358A30980J357Q77K8N17J431Q21n63n97L42L48l25j36L56m16j556j071K80K01
55340A32874r03p43N72Q77ml11K6m79j444r95O10J261P41P35J301P78p90j418
55322A32688n79K01J78O0o8p40j280n92N38N65NM25J406J382P49R64J410M22j229
55303A36505j317j37pj157j592q17k60j32O79J694J237j90l16R52J410M82n7L79
$$ plain form
55427 137678 138452 138940 137719 135203 133562 133234 132586 131511 132003 134369 136267 136566 136944 138417 139468 139074
55411 139074 138619 139254 139997 140040 140359 141544 142332 141825 140999 140673 140055 138583 137169 136484 135899 135142 135011 135527
55393 135527 135433 134459 134071 135061 136354 137066 137802 139141 140717 142387 144419 146105 146269 145477 145490 146212 145681
55376 145681 143472 141454 140620 139911 138844 138412 138456 137088 133944 131349 130891 131331 131131 130687 130695 130677 130462 130980
55358 130980 132337 133214 133242 133759 135190 136011 135448 134851 135193 135541 135216 135080 135436 135020 133464 132393 132673 132874
55340 132874 131971 131228 131800 132677 132673 132362 132388 131909 130465 129470 130080 131341 132082 132817 134118 134896 134106 132688
55322 132688 132109 132310 132488 132548 132480 131740 130460 129868 130406 130971 130976 131401 132807 134189 134938 135902 137312 137734 136505
55303 136505 135188 135051 135044 133887 132295 131478 131218 131086 131765 133459 134696 134506 134190 135142 136552 137034 136977 137356
55285A37356K93p76j404j130j190j790j564l06M41J04j85J2j67p36o08J36J91
55268A28677m78m64M53R59O98P39J312J420R01P25J038J045P73Q72R39J81o65
55251A39125m12J57n02j710j529j98L75N3L75J319J353N15K74M62l79j653j192
55234A36433P40J443J78q43m97l27j252j859j126p9L85P85J256R35q6n29k41m87
55216A34829j435j754j141p79q77l27Q26J153N65O39J719K246J527O22N0q09j609
55199A35445j035N53J174M43P8O93R08K21q6L61K55o34p28L57Q79O6n06J83Q49
55180A39476L27n33p32o90q91p89j70K33K35N40J076Q74k2m67l27n11p91j1J377
55161A38204J581N46M3M17J13j106j474m99J71q9J36J181J284j14r85p6J076R66
$$ plain form
55285 137356 137649 136873 135469 134339 133149 131359 129795 129489 129930 130034 129849 129861 129694 128958 128350 128486 128677
55268 128677 128199 127735 128188 129147 129845 130584 131896 133316 134217 134942 135980 137025 137798 138670 139609 139790 139125
55251 139125 138713 138870 138368 136658 135129 134931 135306 135359 135734 137053 138406 138921 139195 139657 139278 137625 136433
55234 136433 137173 138616 138794 137951 137454 137127 135875 134016 132890 132811 133196 133981 135237 136172 136086 135557 135316 134829
55216 134829 133394 131640 130499 129720 128843 128516 129342 130495 131060 131699 133418 135664 137191 137813 137863 137054 135445
55199 135445 134410 134963 136137 136580 136658 137351 138259 138480 138394 138755 139010 138376 137648 138005 138884 138950 138444 138627 139476
55180 139476 139803 139270 138538 137848 136957 136168 135998 136231 136466 137006 138082 138956 138934 138467 138140 137629 136838 136827 138204
55161 138204 139785 140331 140374 140791 140904 139798 138324 137825 137996 137907 138043 139224 140508 140394 139409 139333 140409 141375
55143A41375L63K91K25k11r2Q71J390Q73M76P94P52j56q36q35j204k136k230j183
55125A38527o25j112j052J66P85j36r42m29R8l44l03J293K747K286R66O53J046
55108A43624R06M99O16P50K36j97K06O74L88K6L77Q10O20L94P03R37P52R86J864
55089A55171J958M53j195j339l34O44J386J956J777P96R8J81J57m03n95j22j35
55072A60454r96j293l09N86L90J45O99R55k7j141j174p54p35n32L00O70j49r95
55054A56094q14m78r31j360q82k76l18k10O20R73p7j313j339p80p57r03o14n95
55036A46040j263j392j19J303J556J349J614J529L29p00k15Q14Q54L82N49Q14
55020A53444J59o74m80J67L5m84l29J56Q5j80PO0n03o35M63J494J060J25K86J013
$$ plain form
55143 141375 141738 142029 142254 142043 141951 142822 144212 145085 145561 146355 147107 146951 146115 145280 144076 141940 139710 138527
55125 138527 137902 136790 135738 135904 136689 136553 135611 135182 135280 134936 134633 135926 138673 140959 141925 142578 143624
55108 143624 144530 145029 145645 146395 146631 146434 146640 147314 147702 147728 148105 148915 149535 149929 150632 151569 152321 153307 155171
55089 155171 157129 157582 156387 155048 154714 155358 156744 158700 160477 161273 161371 161552 161709 161306 160711 160589 160454
55072 160454 159458 158165 157856 158442 158832 158977 159676 160631 160604 159463 158289 157535 156800 156268 156568 157238 157089 156094
55054 156094 155280 154802 153871 152511 151629 151353 151035 150825 151445 152418 152341 151028 149689 148909 148152 147249 146635 146040
55036 146040 144777 143385 143266 144569 146125 147474 149088 150617 150946 150246 150031 150845 151699 152081 152630 153444
55020 153444 153603 152929 152449 152616 152651 152167 151838 151994 152079 151899 151906 151966 151463 150828 151291 152785 153845 153970 154256 155269
55000A55269Q70K23L45Q95P09J48L08P96N26j2L99J316J296L49l30m88o95p20
54982A61204j7P22M29m53o88k67K2L14J180K082K090J521J276J203P20K74N05
54965A72117P62J03r55j263q62m60J4P47J004L14k77K37J059R89M39K98Q1q43
54947A73504j471o87N28N48k62m67j30k18l73M16J657K052J698J591J671J467
54931A81524J715L250N049N672N779O891Q442Q673P775P545Q221Q243O933N081
54917B70793K964R4l105n454o863q085q886q401p060o141n733n030m328m527n022
54902A95216m284k412j005o07l42Ok34q14o53J66M64J27K73J222K141K838M027
54885A96129N650O704O947P213P906Q644R266R740R322P343M589K255k9l313o940
$$ plain form
55000 155269 156139 156362 156707 157602 158311 158459 158767 159563 160089 160077 160476 161792 163088 163437 163107 162619 161924 161204
54982 161204 161187 161909 162338 161885 161197 160930 160952 161266 162446 164528 166618 168139 169415 170618 171338 171612 172117
54965 172117 172879 172982 172027 170764 169902 169442 169456 170203 171207 171521 171244 171481 172540 173529 173968 174266 174347 173504
54947 173504 172033 171346 171874 172422 172160 171693 171563 171345 170972 171388 173045 175097 176795 178386 180057 181524
54931 181524 183239 186489 191538 197210 202989 209880 218322 226995 234770 242315 250536 258779 265712 270793
54917 270793 273757 273851 270746 265292 258429 250344 241458 233057 225997 219856 214123 209093 204765 200238 195216
54902 195216 190932 188520 187515 186908 186566 186572 186338 185524 184871 185037 185501 185628 185901 187123 189264 192102 196129
54885 196129 201779 208483 215430 222643 230549 239193 248459 258199 267521 274864 279453 281708 281679 278366 271426
54870B71426r042r254q921q732q110o951o038n605n148m693m646m542l625k409
54856A83710j999k143j727q44m99o21l85j82j017k255k250j133o37j116j230o77
54840A64995p28j587j661k88J003Q67n9o28q04r98j176j291j457j308l61Q00J103
54823A56422O75N29O54J62p03o36M10R19K43m98m36j31j47p8L68P57J000J664
54805A61174K695L077K301J080K59pJ97P03R02K97n97q99o85n32k10P30J580J282
54787A73347L01j0M93R77J436K337K884J961N98J026L247M926M995M866N558O145
54771B15087N918N888O989Q495R261R097Q143O293L888J665m45l100n888p408
54757B63883p329o819o583o149n433n241n708n856n257m632m375l988l264k561
$$ plain form
54870 271426 262384 253130 244209 235477 227367 220416 214378 208773 203625 198932 194286 189744 186119 183710
54856 183710 181711 179568 177841 176997 176498 175877 175492 175310 174293 172038 169788 168655 168018 166902 165672 164995
54840 164995 164267 162680 161019 160731 161734 162601 162542 161914 161110 160112 158936 157645 156188 154880 154519 155319 156422
54823 156422 157097 157626 158280 158442 157739 157103 157513 158432 158675 158177 157741 157610 157463 157385 157753 158510 159510 161174
54805 161174 163869 166946 169247 170327 170586 170579 170776 171479 172381 172678 172081 171182 170497 169965 169755 170485 172065 173347
54787 173347 173648 173638 174131 175108 176544 178881 181765 183726 184324 185350 188597 193523 198518 203384 208942 215087
54771 215087 221005 226893 233882 242377 251638 260735 268878 275171 279059 280724 280279 277179 271291 263883
54757 263883 256554 249735 243152 237003 231570 226329 220621 214765 209508 204876 200501 196513 193249 190688
54743A90688j662rJ727K074J029J55J70K48M6L87J532K621L393M555O017O660
54727B19631O413O615P681Q355P879O936N830L808R36j380k680m236o642q578
54713B50568q999q659q354p525n786m103l284k836k342k342k801k500j145l41
54699A89551j174k420k552j987j829j807j065O3N60K46l76j063j613j537q26k43
54683A71928j55m9K04j48j312k128j587j00J320K127J949N68j185j813j119n28
54667A67972q88j399j354j318j667j518k70J073J280N63j32n02o92o34l83k85
54651A59846k98nL88K31j93J71J324J971J497O38j06j003j735j338j40K39n22
54634A60965p38N44K037K359J912J521J025K92QL00J96n64q36j47L01k52p82l87
$$ plain form
54743 190688 189026 189017 190744 192818 193847 194002 194172 194420 194466 194853 196385 199006 202399 206954 212971 219631
54727 219631 226044 232659 240340 248695 256574 263510 269340 273148 274084 272704 270024 265788 259146 250568
54713 250568 241569 232910 224556 217031 211245 207142 203858 201022 198680 196338 193537 191037 189892 189551
54699 189551 188377 185957 183405 181418 179589 177782 176717 176780 177340 177586 177210 176147 174534 172997 172171 171928
54683 171928 171773 171724 171928 171780 170468 168340 166753 166653 167973 170100 172049 172617 171432 169619 168500 167972
54667 167972 167084 165685 164331 163013 161346 159828 159558 160631 161911 162474 162342 161840 161148 160514 160131 159846
54651 159846 159548 159543 159931 160162 159969 160140 161464 163435 164932 165570 165464 164461 162726 161388 161248 161487 160965
54634 160965 160227 160771 162808 165167 167079 168600 169625 169917 169925 170225 170421 169857 169021 168874 169175 168923 168141 167754
54616A67754K08K34K73Q16J106O31J65J50k15j143j373m20J79o35j511q68O25
54599A65976J431J358R15%j147j313k12N46r5q54l70N11M94J45M37O39k21j189
54581A67051q57J47L19j53p5N09P08O02P98R58M89j06j18O5o0P7Q28J156L47m48
54561A72237p8N45J51n97m21K85N48Q11J683K058Q53n74k70J092J407N92J85L05
54543A80812j99j020o27Q80J709J266P70R14J000N94J22k86q49j140o34n1m48
54526A82813j307j292n28k44n34m34Q7J45q9M13J505J859J147M34K65J29j68k27
54508A83974k30q04j634j684q93k19n5mJ2j71j6J004K037J732L10p64r65r35q39
54489A79856k73L99L51j43o7N33P31N02O17R47O72J24M62J558K072J700J525J895
$$ plain form
54616 167754 167962 168196 168469 169285 170391 171022 171187 171337 171122 169979 168606 168186 168365 167730 166219 165351 165976
54599 165976 167407 168765 169680 169680 168533 167220 167008 167554 167459 166605 166235 166746 167240 167385 167822 168461 168240 167051
54581 167051 166194 166341 166660 166507 166432 166941 167649 168251 169049 170007 170496 170390 170272 170337 170277 170354 171182 172338 172685 172237
54561 172237 172159 172704 172855 172258 171837 172122 172670 173481 175164 177222 178075 177501 177231 178323 179730 180322 180507 180812
54543 180812 180613 179593 178966 179846 181555 182821 183591 184505 185505 186099 186221 185935 185086 183946 183312 183261 182813
54526 182813 181506 180214 179686 179442 178908 178474 178561 178706 178617 179030 180535 182394 183541 183975 184240 184369 184201 183974
54508 183974 183744 182940 181306 179622 178729 178510 178455 178451 178463 178292 178276 179280 181317 183049 183359 182595 181630 180695 179856
54489 179856 179583 179982 180333 180190 180123 180656 181387 181889 182506 183453 184125 184249 184711 186269 188341 190041 191566 193461
54471A93461J957J579J837L010L801L281K167J462J105N95q3p20j266j623j763
54456B08800k052k669l007k512j729j475j417q20j36l33j010r36j08L87L76O19
54440A91978R32K86j061j514n65M26M01j37m89q22j209j005P0J300J946J992J638
54423A94167R47K92J66M21N12L91L57J90m10q70m09N55Q99N03J24n2l97o03l8
54404A96745Q54J017N24L45O21P26P92J470K276K008Q95M42J075J656J504J136
54388B14086Q12J18p37r64p47j071j802j700o16K45N32J266K619L257K617J962
54372B19877K247K675K381J966K214K617K265J216Q9p61j080o46nk13j346k222
54356B31274k013j165l69K60O34L90l77j061j475j960k503k756k890l275l414
$$ plain form
54471 193461 195418 196997 198834 201844 205645 208926 211093 212555 213660 214255 214172 213452 212186 210563 208800
54456 208800 206748 204079 201072 198560 196831 195356 193939 193119 192983 192650 191640 190704 190596 190983 191359 191978
54440 191978 192910 193196 192135 190621 190056 190482 190883 190746 190257 189435 188226 187221 187291 188591 190537 192529 194167
54423 194167 195114 195406 195572 195993 196505 196896 197253 197443 197033 196163 195754 196309 197208 197711 197835 197783 197386 196783 196745
54404 196745 197599 198616 199140 199485 200106 200832 201624 203094 205370 207378 208273 208715 209790 211446 212950 214086
54388 214086 214898 215016 214279 213315 212568 211497 209695 207995 207379 207624 208156 209422 212041 215298 217915 219877
54372 219877 222124 224799 227180 229146 231360 233977 236242 237458 237547 236786 235706 235060 235055 234842 233496 231274
54356 231274 229261 228096 227727 227987 228621 229011 228634 227573 226098 224138 221635 218879 215989 212714 209300
54341B09300k526j104m54p12q23m33j82q2N48J398J230J3p90m11L56Q05J077J046
54323B08256K98n11j69Q16O06r14j694p70L34L29L6L40M37m60j502j714j512j389
54305B00817p23P39J740J334M66L42N66K70j95j01K79L71L98N48K29p02j123k73
54287B04982R01J237J087J299J622J413R75Q80Q31L67j27k02k51o43q65n34k90
54270B12682o44r08l13P13J407J804K063J760R11N97J401K235J943R93M58L58
54254B27460K33L34Q21Q49j86j289j236n38n55j368j979k067k128k216j898j203
54238B13034n02K19J031J431J006K78lO6Mj06K3J91K16N31J352J956J640P63J
54219B23131p07j604k266k283k049k013j806j112m93m53m73m6K12l22r06n04M77
$$ plain form
54341 209300 206774 205670 205216 204504 203681 203248 203066 202984 203532 204930 206160 206173 205383 204972 205328 206133 207210 208256
54323 208256 208554 208043 207874 208690 209296 208382 206688 205918 206252 206581 206617 206957 207394 206934 205432 203718 202206 200817
54305 200817 200094 200833 202573 203907 204373 204715 205281 205551 205356 205255 205534 205905 206303 206851 207080 206378 205255 204982
54287 204982 205883 207120 208207 209506 211128 212541 213516 214396 215227 215594 215467 215265 215014 214371 213506 212972 212682
54270 212682 212038 211130 210817 211530 212937 214741 216804 218564 219475 220072 221473 223708 225651 226644 227102 227460
54254 227460 227693 228027 228848 229697 229511 228222 226986 226448 225893 224525 222546 220479 218351 216135 214237 213034
54238 213034 212532 212751 213782 215213 216219 216497 216494 216560 216564 216458 216481 216672 216888 217419 218771 220727 222367 223130 223131
54219 223131 222424 220820 218554 216271 214222 212209 210403 209291 208798 208345 207872 207826 208038 207716 206810 206306 206783
54202B06783Q42M56J38J74J63N6J62L79M22M71P05O87J00l64R9J077J489J125
54184B14964P20Q54J606K805L886L943K788J490J068J201R67K14o23j437k239
54169B32207k672k585k477k574k213j033J1r0r19j423j488j573j490q12J5K43
54153B11127P1K34P25R16O40K09j81l21J77J093J415Q11M15J093J887J512N25
54136B22348N19J721K955L497L481K837J340l48j109p95j56N05J432K412K838
54121B43477K721K603K569K225J483M96q08k277l036k505j532j383j988k213j628
54106B38204q81n40n79q36j087q90k30J54k00o56n83m76r25j271o36L80N85J54
54088B29687J45M69R8r00j309p86k81k50L6J016K046K561K825L136L284L169L094
$$ plain form
54202 206783 207625 208081 208219 208393 208556 208612 208774 209153 209575 210046 210751 211438 211538 211174 211273 212350 213839 214964
54184 214964 215684 216538 218144 220949 224835 228778 231566 233056 234124 235325 236292 236506 235883 234446 232207
54169 232207 229535 226950 224473 221899 219686 218653 218664 218574 217655 216232 214744 213171 211681 210869 210884 211127
54153 211127 211198 211432 212157 213073 213713 213922 213741 213420 213597 214690 216105 216916 217331 218424 220311 221823 222348
54136 222348 222867 224588 227543 231040 234521 237358 238698 238350 237241 236446 236290 236795 238227 240639 243477
54121 243477 246198 248801 251370 253595 255078 255574 254766 252489 249453 246948 245416 244033 242045 239832 238204
54106 238204 237323 236783 236204 235368 234281 233391 233161 233315 233115 232459 231876 231400 230475 229204 228568 228948 229533 229687
54088 229687 229832 230301 230399 229499 228190 227404 227123 226873 226909 227925 229971 232532 235357 238493 241777 244946 248040
54071B48040L111K904K520K444K696K628J769L21j259k503k927k439j716j521
54057B54068j705j590j061n26n7N93J263J561J667K164L032L654L706L446L188
54042B73403L090L385M146N026N623N956O113N942N516N397N790O128O052O046
54028C47613O397O442N737N023M894M466K768O90oQ20J703J769J455J178O85j78
54012C91456j171k217l407m556n444o217o878o938o277n618n304m559l066k097
53998C27707k664l623l268j986j389j600j478r75j101j677j312K92J912K834L566
53983C15238M397N001N525O323O555M835J523j489l489n526p901r148q283o369
53969C07192m865l876k909k089j700j461j067o92m50j65O7o1k53K17J280K000
$$ plain form
54071 248040 251151 254055 256575 259019 261715 264343 266112 266433 265174 262671 259744 257305 255589 254068
54057 254068 252363 250773 249712 249186 249129 249722 250985 252546 254213 256377 259409 263063 266769 270215 273403
54042 273403 276493 279878 284024 289050 294673 300629 306742 312684 318200 323597 329387 335515 341567 347613
54028 347613 354010 360452 366189 371212 376106 380572 383340 384030 384024 384844 386547 388316 389771 390949 391634 391456
54012 391456 390285 388068 384661 380105 374661 368444 361566 354628 348351 342733 337429 332870 329804 327707
53998 327707 325043 321420 318152 316166 314777 313177 311699 310724 309623 307946 306634 306926 308838 311672 315238
53983 315238 319635 324636 330161 336484 343039 347874 349397 347908 344419 338893 330992 321844 313561 307192
53969 307192 302327 298451 295542 293453 291753 290292 289225 288533 288083 287918 287985 287924 287671 287888 289168 291168
53953B91168J927J551J303J094R90J370K214L099L881M559M795M515M544N410
53939C32420O110N535M518M565N005L814J184k04R55K781L168K507K249K566K788
53924C79961K927L384M067M667N175N536N582N669O371P367P753P650Q189R558
53910D63856J0532J0315R439Q372O802M818L261K203O21j622l109l024k542k984
53896E06938l905m203m037m404n549o824p606p666p281p268q174r211r055p874
53882D13881p256p751q058p198n909n138m611l942l697m264m833m589l973l734
53868C38928l715l465l177l104k940k574k574l180l707l649l425l372l032k142
53854B94872j276q78o47m76q24j560j704j027o16j049j426j047o11p22o28K87
$$ plain form
53953 291168 293095 294646 295949 297043 298033 299403 301617 304716 308597 313156 317951 322466 327010 332420
53939 332420 338530 344065 348583 353148 358153 361967 363151 362947 363902 366683 369851 372358 374607 377173 379961
53924 379961 382888 386272 390339 395006 400181 405717 411299 416968 423339 430706 438459 446109 454298 463856
53910 463856 474388 484703 494142 502514 509316 514134 517395 519598 520219 518597 515488 512464 509922 506938
53896 506938 503033 498830 494793 490389 484840 478016 470410 462744 455463 448195 440021 430810 421755 413881
53882 413881 406625 398874 390816 383618 377709 372571 367960 364018 360321 356057 351224 346635 342662 338928
53868 338928 335213 331748 328571 325467 322527 319953 317379 314199 310492 306843 303418 300046 297014 294872
53854 294872 293596 292718 292071 291595 290771 289211 287507 286480 285864 284815 283389 282342 281731 281009 280381 280668
53838B80668J102P90n8k73J00L55M71O62M43n18j409j331o59k20K8N10R72J008
53820B82641Q96R38Q39O40J183K649L736L452K682K647L003K860K624L134L869
53805C17793L752L156L375M546N657O259O712P022O851O500O589O882O627N782
53791C97503M934M224L414K629K101J538O65j20n20j157k508l776m005l680l936
53776C97306m736n202n221n430n891o118o046n836n123l733k650k850l602l395
53762C31473k275j694k250l095l566l906m210m055l467l035k817k192j055j83
53748B93673j08n28r57j234j269j000o49m69k81R0K71j43p93j064r38o65j01P74
53730B84609J269R55N94R51J299N96m93m03P51J335Q62O53J425K113J796J321
$$ plain form
53838 280668 281770 282560 282502 282229 282329 282684 283155 283817 284260 283742 282333 281002 280343 280123 280151 280661 281633 282641
53820 282641 283537 284475 285314 285954 287137 289786 293522 296974 299656 302303 305306 308166 310790 313924 317793
53805 317793 321545 324701 328076 332622 338279 344538 351250 358272 365123 371623 378212 385094 391721 397503
53791 397503 402437 406661 410075 412704 414805 416343 417008 416888 416368 415211 412703 408927 404922 401242 397306
53776 397306 392570 387368 382147 376717 370826 364708 358662 352826 347703 343970 341320 338470 334868 331473
53762 331473 329198 327504 325254 322159 318593 314687 310477 306422 302955 299920 297103 294911 293856 293673
53748 293673 293565 293037 292080 290846 289577 288577 287928 287459 287178 287268 287539 287396 286603 285539 284601 283936 283835 284609
53730 284609 285878 286833 287427 288378 289677 290273 289780 289377 290128 291463 292325 292978 294403 296516 298312 299633
53714B99633J936L407M452M316L195J668M30k5O4j06p04p53P35L509O361Q328
53698C36446R169R000P883N896L426J228j8l22k75k40m2L47M25n0m78k46K91L57
53680C72797j04n47q08j103j298r84k46L09L03j36o80r71o82N0N52M44J78K79
53662C67353N65O68P62J001Q71J0p73m06Q22J567J199L27l17n27k34N97J555K016
53644C77056J903J585J183N42j19k55L03J215K114K789L017K778K431K295K240
53629D01077K037J722J283N74r6j9Q09J382J148Q90J373J991J796J025N48N00
53613D18040O22J273K772M269M617L974L325K937K491K229K627L317L646L853
53599D59992M359M436L132J176K64O21R32N89L32N50O43K69j51m65j001j570j601
$$ plain form
53714 299633 301569 304976 309428 313744 316939 318607 319037 319012 319076 318970 318266 317513 318248 321757 328118 336446
53698 336446 345615 354615 362498 368394 371820 373048 373030 372708 372433 372193 372151 372498 372923 372873 372395 372149 372440 372797
53680 372797 372693 372146 371338 370235 368937 367953 367707 368016 368319 368183 367503 366532 365850 365900 366452 366896 367074 367353
53662 367353 367918 368586 369348 370349 371220 371230 370457 370051 370873 372440 373639 373966 373649 373122 372888 373485 375040 377056
53644 377056 378959 380544 381727 382269 382150 381895 382198 383413 385527 388316 391333 394111 396542 398837 401077
53629 401077 403114 404836 406119 406693 406597 406578 407387 408769 409917 410807 412180 414171 415967 416992 417540 418040
53613 418040 418662 419935 422707 426976 431593 435567 438892 441829 444320 446549 449176 452493 456139 459992
53599 459992 464351 468787 471919 473095 473359 473980 474912 475501 475833 476383 477026 477295 477144 476679 475678 474108 472507
53582D72507j401j877k842l032k060j049r59j522k144k650k796k270j400q92o71
53567D44942j32M85L89j37N0R09J049N5o67m0J150J677J518J243R24N12L35M86
53549D54748N76N66R42J557J478N29o9O28J911K480K060J357J132J809L307M757
53533D79768N185M795M783N638O629P254P956Q970R624R582R598J0287J1139J1541
53519E92749J1804J2375J2918J3089J3433J4587J6201J7516J8466J9480K0594
53508G63212K1485K1982K2126K2074K2248K2980K3782K3654K2444K1050K0048
53497A007085J8998J7642J6697J6800J7443J7716J7453J7033J6695J6612J7012
53486A197186J7622J7720J7201J6912J7391J8033J8095J7776J7597J7412J6786
$$ plain form
53582 472507 471106 469229 466387 463355 461295 460246 459287 457765 455621 452971 450175 447905 446505 445613 444942
53567 444942 444810 445295 445684 445547 445597 446506 447555 447610 446943 446903 448053 449730 451248 452491 453415 453927 454262 454748
53549 454748 455324 455890 456832 458389 459867 460396 460327 460955 462866 465346 467406 468763 469895 471704 475011 479768
53533 479768 484953 489748 494531 500169 506798 514052 522008 530978 540602 550184 559782 570069 581208 592749
53519 592749 604553 616928 629846 642935 656368 670955 687156 704672 723138 742618 763212
53508 763212 784697 806679 828805 850879 873127 896107 919889 943543 965987 987037 1007085
53497 1007085 1026083 1043725 1060422 1077222 1094665 1112381 1129834 1146867 1163562 1180174 1197186
53486 1197186 1214808 1232528 1249729 1266641 1284032 1302065 1320160 1337936 1355533 1372945 1389731
53475A389731J5844J5023J4342J3462J2147J0277P891N438L398J490j007l999
53463A484037o511q194r834j1870j3470j3734j2932j1863j0890j0261j0517j1689
53451A352272j2893j3461j3819j4491j5060j4976j4662j4878j5552j6110j6424
53440A189946j6550j6039j4405j1928r256o518l573q11R95J473Q72j57p19j20
53426A113210J364K696L427M191N549P119Q385R627J1295J3167J4782J6102J7188
53413A228102J7828J8115J8685J9784K0778K1254K1768K2868K4130K5009K5841
53402A464162K7123K8529K9623L0919L3174L6128L8983M1658M4517M7163M8620
53391A870599M8671M8176M8060M8563M9338M9767M9362M8272M7198M6491M5787
$$ plain form
53475 1389731 1405575 1420598 1434940 1448402 1460549 1470826 1478717 1484155 1487553 1489043 1488036 1484037
53463 1484037 1477526 1469332 1459498 1447628 1434158 1420424 1407492 1395629 1384739 1374478 1363961 1352272
53451 1352272 1339379 1325918 1312099 1297608 1282548 1267572 1252910 1238032 1222480 1206370 1189946
53440 1189946 1173396 1157357 1142952 1131024 1121768 1115250 1111677 1110866 1111861 1113334 1114206 1114049 1113330 1113210
53426 1113210 1114574 1117270 1120697 1124888 1130437 1137556 1145941 1155568 1166863 1180030 1194812 1210914 1228102
53413 1228102 1245930 1264045 1282730 1302514 1323292 1344546 1366314 1389182 1413312 1438321 1464162
53402 1464162 1491285 1519814 1549437 1580356 1613530 1649658 1688641 1730299 1774816 1821979 1870599
53391 1870599 1919270 1967446 2015506 2064069 2113407 2163174 2212536 2260808 2308006 2354497 2400284
53380B400284M4739M3440M1832L9435L6166L2628K9041K4854J9974J5403J1820
53369B739616Q518M644N03l416p729j3234j9445k5311l0697l5879m0243m2918
53357B534409m4220m5125m5715m5529m4974m4859m4815m3704m1566l9661l8471
53346B055770l7112l5068l3186l2448l2706l3089l2981l2314l1415l0691l0051
53335A694709k8794k6593k4175k2261k0420j7924j5280j3586j2687j1416r664
53324A491909q800r800j2123j4662j6687j7628j7185j6004j5298j5281j4955j3732
53312A319754j2316j1457j0813r655q011o463n308m417l563k569j437m55K41J166
53298A244697K948N321P420R053J0840J2999J4902J6166J7176J8232J9025J9486
$$ plain form
53380 2400284 2445023 2488463 2530295 2569730 2605896 2638524 2667565 2692419 2712393 2727796 2739616
53369 2739616 2748134 2752778 2753281 2749865 2742136 2728902 2709457 2684146 2653449 2617570 2577327 2534409
53357 2534409 2490189 2445064 2399349 2353820 2308846 2263987 2219172 2175468 2133902 2094241 2055770
53346 2055770 2018658 1983590 1950404 1917956 1885250 1852161 1819180 1786866 1755451 1724760 1694709
53335 1694709 1665915 1639322 1615147 1592886 1572466 1554542 1539262 1525676 1512989 1501573 1491909
53324 1491909 1483109 1473309 1461186 1446524 1429837 1412209 1395024 1379020 1363722 1348441 1333486 1319754
53312 1319754 1307438 1295981 1285168 1275513 1267502 1261039 1255731 1251314 1247751 1245182 1243745 1243290 1243531 1244697
53298 1244697 1247645 1252966 1260386 1269439 1280279 1293278 1308180 1324346 1341522 1359754 1378779 1398265
53286A398265K0225K1458K2258K1681K0067J8462J7126J5464J3222J0950R178
53275A588356P717N914L376L65k383m295n571p067r402j2311j5002j6976j8359
53262A514362j9539k0742k1913k2909k3703k4350k4872k5291k5748k6299k6544
53251A252452k5870k4291k2690k1804k1380k0774k0071j9894k0302k0661k0596
53240A014119k0415k0318j9884j8653j6899j5392j4609j4380j4188j3679j2861
53229H32841j1918j0799r234p263n524m683m772n394o368p720r189j0271j0888
53216G28818j1593j2877j4601j6165j7031j7006j6254j5160j4044j3004j2040
53205E69043j1265j0766j0393r889r229q618q229q088q162q379q616q791q933
$$ plain form
53286 1398265 1418490 1439948 1462206 1483887 1503954 1522416 1539542 1555006 1568228 1579178 1588356
53275 1588356 1596073 1601987 1605363 1605728 1603345 1599050 1593479 1586412 1577010 1564699 1549697 1532721 1514362
53262 1514362 1494823 1474081 1452168 1429259 1405556 1381206 1356334 1331043 1305295 1278996 1252452
53251 1252452 1226582 1202291 1179601 1157797 1136417 1115643 1095572 1075678 1055376 1034715 1014119
53240 1014119 993704 973386 953502 934849 917950 902558 887949 873569 859381 845702 832841
53229 832841 820923 810124 800890 793627 788103 783420 778648 773254 766886 759166 749977 739706 728818
53216 728818 717225 704348 689747 673582 656551 639545 623291 608131 594087 581083 569043
53205 569043 557778 547012 536619 526730 517501 508883 500654 492566 484404 476025 467409 458618 449685
53192D49685r146r499r953j0235r882q713p182n974n225m582l925l519l391l192
53178C55267k862k776l000l018k572k138k157k328k128j560r57m67j55j65m28
53163C28556n90n55n76o61n53n61j438k958l626k576r36l21p70j123q30k74J98
53146C10406M88L65j50l87R7O76O20L36N40P85J83p69o78N00J243P59M5J82Q31
53127C16072J123J050J163J599K076K466K842L199L519L897M362M773M911M615
53113C57667L844K891K249K024J727R78j2j000k189l616m642m838m787n134n357
53098C39805m545l013j998j942k190k237k140j875j367j157j827k745k605j355
53084C08809l88n67j223j484j380j226r26m64k56l78k69L44Q86P53J07n74j116
$$ plain form
53192 449685 440539 431040 421087 410852 400970 392257 385075 379101 373876 369294 365369 361850 358459 355267
53178 355267 352405 349629 346629 343611 341039 338901 336744 334416 332288 330728 329771 329304 329149 328984 328556
53163 328556 327966 327411 326835 326174 325621 325060 323622 320664 317038 314462 313526 313205 312435 311312 310482 310208 310406
53146 310406 310894 311259 311109 310722 310819 311495 312115 312451 312991 313776 313959 313190 312512 313012 314255 315014 315059 315241 316072
53127 316072 317195 318245 319408 321007 323083 325549 328391 331590 335109 339006 343368 348141 353052 357667
53113 357667 361511 364402 366651 368675 370402 371380 371368 370368 368179 364563 359921 355083 350296 345162 339805
53098 339805 335260 332247 330249 328307 326117 323880 321740 319865 318498 317341 315514 312769 310164 308809
53084 308809 308421 307854 306631 305147 303767 302541 301615 301151 300895 300517 300248 300592 301478 302231 302338 301764 300648
53067C00648j442j346q81m16j30J21K69Q5j83O3P16R21L57j49K05J115J684J497
53049C03134P89K6l43j45K62L25Rk89m46o32o74k59K52P2o98r95l17M93M94j53
53029C00905o83p45m26J47O88P43K64k12k32J33O50J232J662J626J236R36Q15
53012C08739O17N26J037J889K067J254L63J58K53J8l08k32N0R5P4M61J183J760
52994C20004J999K028J937J881K191K908L456L213K187R04j52p05p02m05j56K8
52978C40616K88L63j70r31q15N97K289K932K287J169M94O51J380J964J911J581
52962C56606J602J736J093l45j395j267o62o21j089j319j072o46k54n3m05j402
52946C50507k360k512j962j506j601j952j977j336k01Q06J135R07O84O10K90l89
$$ plain form
53067 300648 299206 297860 296979 296563 296433 296554 296823 296908 296725 296788 297504 298425 298782 298633 298838 299953 301637 303134
53049 303134 303923 303949 303606 303461 303723 304048 304057 303768 303322 302690 302016 301757 302009 302081 301383 300388 300071 300564 301058 300905
53029 300905 300222 299477 299051 299198 299886 300629 300893 300681 300449 300582 301232 302464 304126 305752 306988 307924 308739
53012 308739 309356 309882 310919 312808 314875 316129 316492 316650 316903 316921 316613 316381 316431 316526 316600 317061 318244 320004
52994 320004 322003 324031 325968 327849 330040 332948 336404 339617 341804 342708 342556 341851 341149 340744 340588 340616
52978 340616 340904 341267 341097 340166 339351 339948 342237 345169 347456 348625 349119 349770 351150 353114 355025 356606
52962 356606 358208 359944 361037 360692 359297 358030 357368 356747 355658 354339 353267 352621 352367 352314 351909 350507
52946 350507 348147 345635 343673 342167 340566 338614 336637 335301 335100 335906 337041 337948 338632 339242 339532 339143
52930C39143j004j280j403j390r02M5Q08R95R27Q60N05j58l84K91J131J063J05
52913C39352q18j130j010p67m65j08K10L35Q5n83j251j324p29J8N51R45J181J003
52895C35495N11K17K48J42k56m04L4O45J011J254J412J079K22l96k48K12M50P61
52877C42389J537K369K708K874L492M347M656M196L389K576J771R59N6j134k442
52862C73743l251l344l365l824m205l736k621j797j742k218k828l214l004k212
52848C32382j486j441j950k466k649k365j587p71o85j325j640r70j38k95j288
52833C11326j985j794r61J61J242J773J576J228J157P80m87j847j881n89N35M96
52817C10730j50m01n0N55J203J861K401K618K353J590N92k52r20j782k787l143
$$ plain form
52930 339143 338139 336859 335456 334066 333164 333209 334017 335012 335939 336799 337304 337146 336762 337053 338184 339247 339352
52913 339352 338534 337404 336394 335627 335162 335054 335264 335599 335684 335101 333850 332526 331797 331815 332366 333311 334492 335495
52895 335495 336006 336223 336471 336613 336357 335953 335987 336632 337643 338897 340309 341388 341610 341214 340966 341178 341628 342389
52877 342389 343926 346295 349003 351877 355369 359716 364372 368568 371957 374533 376304 377263 377319 376185 373743
52862 373743 370492 367148 363783 359959 355754 352018 349397 347600 345858 343640 340812 337598 334594 332382
52848 332382 330896 329455 327505 325039 322390 320025 318438 317667 316982 315657 314017 313047 312909 312614 311326
52833 311326 309341 307547 306586 306747 307989 309762 311338 312566 313723 314503 314016 312169 310288 309699 310234 310730
52817 310730 310580 310179 310129 310684 311887 313748 316149 318767 321120 322710 323302 323050 322130 320348 317561 314418
52801C14418k344j095n25p86j141j156j008p95l94j9j61q20j425j615j589j603
52785B97942j591j392r97m41K83J094J793K126J909J265P00O15P18L75l71p88
52769C03240o39n09p44q03k95K22J13l23m41k06J32P06J525J939J474O79L87N51
52751C07008O47O58Q51J044R78R44J193J283R31Q28J572K393K158J221Q18J121
52735C25648J191P01K41Rl67o48m1J331K288K170J453N50p14k109k677k001q75
52718C26150j98nL0m5j15J78P79J056O74O1k69l43l77m38o23r48r18L6J469K086
52698C28240J363K62j16J55L65L15K53J86m0k19K4N36O87J20p82j343j313j089
52680C27604j165j498j602j266q46o74o24m82l16j32L56J087J330O56j65J1J173
$$ plain form
52801 314418 312074 310979 310454 309668 308527 307371 306363 305568 305174 305155 304994 304174 302749 301134 299545 297942
52785 297942 296351 294959 293962 293521 293804 294898 296691 298817 300726 301991 302691 303306 304024 304399 304028 303240
52769 303240 302601 302092 301348 300545 300250 300472 300585 300262 299821 299615 299747 300453 301978 303917 305391 306070 306457 307008
52751 307008 307655 308313 309164 310208 311186 312130 313323 314606 315537 316365 317937 320330 322488 323709 324527 325648
52735 325648 326839 327540 327781 327790 327423 326775 326734 328065 330353 332523 333976 334526 333812 331703 329026 327025 326150
52718 326150 325952 325947 325977 325932 325817 325995 326774 327830 328504 328565 328296 327953 327576 327138 326515 325567 324649 324685 326154 328240
52698 328240 329603 329865 329749 329904 330269 330584 330837 331023 330983 330764 330788 331324 332011 332131 331349 330006 328693 327604
52680 327604 326439 324941 323339 322073 321227 320553 319929 319447 319131 318999 319355 320442 321772 322428 322263 322274 323447
52663C23447K167K104J143N8l69K45J443K178K070K004K819L893L939K800J390
52648C51331J39j245k563k931k074q42j45j29n26j036j274j083r52j355j752j131
52632C32432M79K039K953L555M027L987L403K849K546J941O84q36k149l120l507
52617C51283k988j856r19m28M4N36N17j9l23j20n0m03m56K74J098J187Q21P69
52599C48967J085J220R65N67K21l2j23p7j2Q2L10N05M08K64O41J493K060J910
52581C60454J395Q93L17l81q62r59r83j185j425j548j543j217m06M41O28L09L28
52564C54256Q11R23K83l93n13m54o73q64o74m20m34m82m06o29j321j793j479q67
52546C44871p18r13q14l18J84N01O50N28J44j70k82n16r11p91K78J558J932J317
$$ plain form
52663 323447 325614 327718 328861 328919 328550 328795 330238 332416 334486 336490 339309 343202 347141 349941 351331
52648 351331 351470 350225 347662 344731 342657 341815 341670 341541 341015 339979 338705 337622 336670 335315 333563 332432
52632 332432 332911 334950 337903 341458 345485 349472 352875 355724 358270 360211 360895 360059 357910 354790 351283
52617 351283 348295 346439 345520 345092 345136 345672 346189 346170 345847 345727 345677 345274 344818 345092 346190 347377 348198 348967
52599 348967 350052 351272 352237 352804 353025 352993 352870 352793 352781 352863 353173 353678 354086 354350 354991 356484 358544 360454
52581 360454 361849 362742 363059 362678 361816 360857 359874 358689 357264 355716 354173 352956 352550 352991 353619 353928 354256
52564 354256 355067 355990 356273 355880 355367 354913 354240 353376 352702 352282 351848 351366 350960 350331 349010 347217 345738 344871
52546 344871 344153 343240 342426 342108 342292 342793 343443 343971 344115 343945 343663 343147 342236 341445 341723 343281 345213 346530
52528C46530O57P40J530K484K979K636J727J057J150J662J951J858J668J624J867
52513C72120K542L510M229M267L818L415L187K654J205j153l452m427l904l198
52499C84813l614m822n457m979l993k935j703o61o20j412j720r33qR9j84l6L89
52482C52224N31M99O43O92K87j09K59J256J997J937J293O81P49J740L047L656
52466C71382L427L319L952M710M734M021K948J533j21j403k031k642l753m780
52452C85296m944m478m087l752l103k420k288k495k313j649j093r47r53q38n23
52437C49413J6N44N11k48j097j350j050n15K94J312J919J763J484J762K184J937
52421C58879J190P35O74M85J77K32O01P44O59R34J722K481K830K947L067L355
$$ plain form
52528 346530 347187 347927 349457 351941 354920 357556 359283 360340 361490 363152 365103 366961 368629 370253 372120
52513 372120 374662 378172 382401 386668 390486 393901 397088 399742 400947 399794 396342 391915 388011 384813
52499 384813 381199 376377 370920 365941 361948 359013 357310 356649 356029 354617 352897 351964 351956 352055 351871 351835 352224
52482 352224 352755 353254 353897 354589 354876 354767 355026 356282 358279 360216 361509 362190 362939 364679 367726 371382
52466 371382 374809 378128 382080 386790 391524 395545 398493 400026 399905 398502 396471 393829 390076 385296
52452 385296 380352 375874 371787 368035 364932 362512 360224 357729 355416 353767 352674 351727 350774 349936 349413
52437 349413 349429 349973 350484 350236 349139 347789 346739 346224 346518 347830 349749 351512 352996 354758 356942 358879
52421 358879 360069 360804 361478 361963 362140 362372 362973 363717 364376 365310 367032 369513 372343 375290 378357 381712
52405C81712M225O068Q456J0228J0413Q750N489J334k512m922n697n480m953m415
52391D08696l933l447k818k180j967k213k229j498n13j06k85l79p4M22J007J800
52375C90283K756L732M784N890O650O789O596O358N716M270K448R78j48j369k465
52360D43268k689j913q29KN68R36J069J086J148J057N38j48l99k6O70J371J911
52343D47620K188K348K801L574M074M031M101M902N964O478O591O994P681Q206
52329E17553Q818J0191J2106J3570J4257J4777J5441J5784J5517J5017J4616J4216
52317F81863J3819J3790J4367J5466J6997J8801K0333K1202K1943K3345K5140
52306H87066K6178K6097K5811K6153K6912K7506K7728K7505K6615K5081K3243
$$ plain form
52405 381712 385937 392005 400461 410689 421102 429852 435341 436675 434163 429241 423544 418064 413111 408696
52391 408696 404763 401316 398498 396318 394351 392138 389909 388411 387898 387792 387507 387128 387054 387476 388483 390283
52375 390283 393039 396771 401555 407445 414095 420884 427480 433838 439554 443824 446272 447250 447102 445733 443268
52360 443268 440579 438666 437837 437839 438407 439343 440412 441498 442646 443703 444241 444093 443694 443668 444338 445709 447620
52343 447620 449808 452156 454957 458531 462605 466636 470737 475639 481603 488081 494672 501666 509347 517553
52329 517553 526371 536562 548668 562238 576495 591272 606713 622497 638014 653031 667647 681863
52317 681863 695682 709472 723839 739305 756302 775103 795436 816638 838581 861926 887066
52306 887066 913244 939341 965152 991305 1018217 1045723 1073451 1100956 1127571 1152652 1175895
52295A175895K1057J7964J3819R504O113L991K749J841Q52m16j814l064m169n372
52281A238950o630p554p912p833p526p102o689o294n598m275k560j058k7P68J557
52266A170217K360L263M476O054P877R847J1830J3509J4738J5936J7726K0187
52254A298020K2714K4460K4823K3732K1739J9530J7163J4245J0928P981N609L070
52242A494014R5k319l381l861m952o582q075r678j1988j4459j6007j6750j7582
52229A378475j8275j7819j6562j6195j7201j8072j7615j6547j5947j5480j4180
52218A194582j2158j0501r896r982r778q529o431m576l643k918j374N23J298P20
52204A117337K52R94K447L663M486N064N370N755O936Q796J0083R989R116Q205
$$ plain form
52295 1175895 1196952 1214916 1228735 1238239 1244352 1248343 1251092 1252933 1253785 1253369 1251555 1248491 1244322 1238950
52281 1238950 1232320 1224766 1216854 1209021 1201495 1194393 1187704 1181410 1175812 1171537 1168977 1167919 1167892 1168660 1170217
52266 1170217 1172577 1175840 1180316 1186370 1194247 1204094 1215924 1229433 1244171 1260107 1277833 1298020
52254 1298020 1320734 1345194 1370017 1393749 1415488 1435018 1452181 1466426 1477354 1485335 1490944 1494014
52242 1494014 1494109 1491790 1488409 1484548 1479596 1473014 1464939 1455261 1443273 1428814 1412807 1396057 1378475
52229 1378475 1360200 1342381 1325819 1309624 1292423 1274351 1256736 1240189 1224242 1208762 1194582
52218 1194582 1182424 1171923 1162027 1152045 1142267 1133738 1127307 1122731 1119088 1116170 1114796 1115319 1116617 1117337
52204 1117337 1117589 1118583 1121030 1124693 1129179 1134243 1139613 1145368 1152304 1161100 1171183 1181172 1190288 1198493
52190A198493O929M788K342N41o63k091m140o449q493r852j0185r487q179o721
52176A146833n399m592m626n204n546n329m875m236l013j342j31K25N41J628L104
52161A108038M085M383M319L938L122K011P85o03j915k439j845p59Q5P51J549
52146A125505K207K294K126K386L091L523L158K157J062L90M17J050J949K936
52132A154251M051N241O409P856J0068J2866J5353J6978J8105J9239K0337K1298
52120A312052K2453K3995K5422K6140K6220K6094K5896K5507K4957K4296K3450
52109A586482K2542K2018K2081K2336K2394K2382K2512K2524K1939K0549J8353
52098A826112J5313J1542P421L281p54m501p693j0292j2439j4052j5015j5787
$$ plain form
52190 1198493 1205422 1210210 1212552 1213093 1212430 1210339 1206199 1199750 1191257 1181405 1171220 1161733 1153554 1146833
52176 1146833 1141434 1136842 1132216 1127012 1121466 1116137 1111262 1107026 1104013 1102671 1102540 1102765 1103306 1104934 1108038
52161 1108038 1112123 1116506 1120825 1124763 1127885 1129896 1130681 1130078 1128163 1125724 1123879 1123120 1123205 1123956 1125505
52146 1125505 1127712 1130006 1132132 1134518 1137609 1141132 1144290 1146447 1147509 1147899 1148316 1149366 1151315 1154251
52132 1154251 1158302 1163543 1169952 1177808 1187876 1200742 1216095 1233073 1251178 1270417 1290754 1312052
52120 1312052 1334505 1358500 1383922 1410062 1436282 1462376 1488272 1513779 1538736 1563032 1586482
52109 1586482 1609024 1631042 1653123 1675459 1697853 1720235 1742747 1765271 1787210 1807759 1826112
52098 1826112 1841425 1852967 1860388 1863669 1862915 1858414 1850721 1840429 1827990 1813938 1798923 1783136
52086A783136j7054j8658j9649j9660j9388j9360j9121j8196j7001j6131j5431
52075A583487j4425j3148j1810j0178p916n215k539o4K201M166N989Q181J0906
52062A549635J3636J5880J7784J9593K1135K2243K3092K3578K3045K1293J9163
52051A770077J7348J5189J1575O704K013j464l910n887p467q370q570q637r405
52038A769196j1174j3271j4746j5509j6241j7120j7525j7234j7125j8101j9943
52027A591207k1721k2823k3077k2551k1658k0999k0661k0225j9714j9720k0166
52016A357892j9958j8446j6406j4761j3322j1697j0550j0767j1984j3146j4057
52005A202798j5251j6619j7347j7175j6639j6063j5164j3700j1916j0335r602
$$ plain form
52086 1783136 1766082 1747424 1727775 1708115 1688727 1669367 1650246 1632050 1615049 1598918 1583487
52075 1583487 1569062 1555914 1544104 1533926 1526010 1520795 1518256 1518192 1520393 1524559 1530548 1538729 1549635
52062 1549635 1563271 1579151 1596935 1616528 1637663 1659906 1682998 1706576 1729621 1750914 1770077
52051 1770077 1787425 1802614 1814189 1820893 1822906 1821442 1817532 1811645 1804178 1795808 1787238 1778601 1769196
52038 1769196 1758022 1744751 1730005 1714496 1698255 1681135 1663610 1646376 1629251 1611150 1591207
52027 1591207 1569486 1546663 1523586 1501035 1479377 1458378 1437717 1417492 1397778 1378058 1357892
52016 1357892 1337934 1319488 1303082 1288321 1274999 1263302 1252752 1241985 1230001 1216855 1202798
52005 1202798 1187547 1170928 1153581 1136406 1119767 1103704 1088540 1074840 1062924 1052589 1042987
51994A042987j0256j2096j4100j5595j7062j9130k1191k2013k1392k0322j9646
51983H50184j9403j9426j9600j9496j8538j6759j4906j3590j2685j1539r462o242
51971F68538k546M40K155L181M329N649O761P551P937P458N853L710J868N19n16
51956G22887j076j017o70j44J401M733R128J2994J5693J7750J9376J9829J8413
51943H39297J5206J0699N438L19l524n420n564m717l851l798m761o278p970r976
51929H15100j2249j4017j4707j4911j5667j6997j8062j8419j8281j7692j6399
51918F37699j4566j2833j1515j0342q909o983m583k214o48J04J066K900M749N363
51904E79288M828M093L228J504r76l171m737o512q993j1408j2758j2902j2215
$$ plain form
51994 1042987 1032731 1020635 1006535 990940 973878 954748 933557 911544 890152 869830 850184
51983 850184 830781 811355 791755 772259 753721 736962 722056 708466 695781 684242 674780 668538
51971 668538 665992 666432 668587 671768 676097 681746 688507 696058 703995 711453 717306 721016 722884 723403 722887
51956 722887 721811 720794 720124 719980 721381 726114 735242 748236 763929 781679 801055 820884 839297
51943 839297 854503 865202 870640 870959 867435 862015 856451 851734 847883 844085 839324 833046 825076 815100
51929 815100 802851 788834 774127 759216 743549 726552 708490 690071 671790 654098 637699
51918 637699 623133 610300 598785 588443 579534 572551 567968 565754 565106 565210 566276 569176 573925 579288
51904 579288 584116 588209 591437 592941 591965 588794 584057 577545 568552 557144 544386 531484 519269
51891E19269j0918r210p512o129m983l808k328l33K016M058N312O113P064Q128
51877E06739Q946R617J0387J0736R777P572N083K903Q65r99k070k012j272m57
51863E65815K80J034J840K673L336L473L040K555K308J643k32k969n381o888p951
51848E64576r101j0279j1023j0885r805q508p939p888o949m627k484k046k565
51835D70477k290j076J7R82K549M025L730J762R1l51n88j213j397r75j276k669
51819D71798l289j717P19J893J703J374J135L63p53j434j682k005k150j375J86
51804D64766J567K173K132J700J174J069J615K355K788L043L278L009J797J40
51790D92606j104j686j753j208j96L91j84j416k242k414k324j886o79J005K368
$$ plain form
51891 519269 508351 499141 491629 485500 480517 476709 474381 474048 476064 480122 485434 491547 498611 506739
51877 506739 515685 525302 535689 546425 556202 563774 568857 571760 572625 571626 569556 567544 566272 565815
51863 565815 566095 567129 568969 571642 574978 578451 581491 584046 586354 587997 587765 584796 579415 572527 564576
51848 564576 555475 545196 534173 523288 513483 504975 497036 489148 482199 477572 475088 473042 470477
51835 470477 468187 467111 467128 468110 470659 474684 478414 480176 480267 479916 479328 478115 476718 475743 474467 471798
51819 471798 468509 466792 467511 469404 471107 472481 473616 473979 473226 471792 470110 468105 465955 464580 464766
51804 464766 466333 468506 470638 472338 473512 474581 476196 478551 481339 484382 487660 490669 492466 492606
51790 492606 491502 489816 488063 486855 486659 487050 486866 485450 483208 480794 478470 476584 475905 476910 479278
51775D79278L310M479O043P348P909Q064Q291Q523Q341P442N798L676J563l09
51761E59756k263m649p050q460q382p356o351n895n914o139o429o757o950o607
51747D70554n477l868k407j369n32L02J020J514J866K125K267K487L069L803M118
51732D79472L929L811M002L868K797J147j64n08L90K604N461P320O784M116Q55
51717E25884j847l878n237n367l914j692k29l00j216j809j811j829k019j550J76
51702D93362K283L184K355O12j151k734m037m656m402l542k308p84N24P95n1j033
51686D78417j356j346j649k127k151j669j258j291j490j373q28l01l78j067j614
51671D58519j323m13M78J356K806M936P279R654J2124J4031J4147J2196R220O077
$$ plain form
51775 479278 482588 487067 493110 500458 508367 516431 524722 533245 541586 549028 554826 558502 560065 559756
51761 559756 557493 552844 545794 537334 528952 521596 515245 509350 503436 497297 490868 484111 477161 470554
51747 470554 465077 461209 458802 457433 456901 457203 458223 459737 461603 463728 465995 468482 471551 475354 479472
51732 479472 483401 487212 491214 495082 497879 499026 498862 498354 498744 501348 506809 514129 520913 525029 525884
51717 525884 524037 520159 514922 509555 505641 503949 503720 503420 502204 500395 498584 496755 494736 493186 493362
51702 493362 495645 498829 501184 501796 500645 497911 493874 489218 484816 481274 478966 478182 478706 479501 479450 478417
51686 478417 477061 475715 474066 471939 469788 468119 466861 465570 464080 462707 461879 461578 461200 460133 458519
51671 458519 457196 456783 457261 458617 461423 466359 473638 483292 495416 509447 523594 535790 545010 551087
51657E51087K616j127m025m975m187k564n25J853M125N695O273N562L119q27n017
51642E57083q338j0720j2364j2888j2118j0894j0088r355p985o329n266m596l344
51629D42798j433N0L87Om07o19n88l11j78p46j887k771k892k639k607k741k514
51612D20908j677o60j44k83m25J25J145J762J785J996K873L733L815L557M058
51597D42568N652P796J0069J2332J4035J4195J2247Q554M063j72l304n033n632
51584E17370n460m608l219j750n17P14K281M110N946P699R137R795R651R515J0208
51569E70872J1710J3417J4773J5217J4328J2671J1888J3134J5938J9270K2968
51558G36186K7227L1291L3813L4165L2379K8271K1878J4463P736K021l687r809
$$ plain form
51657 551087 553703 552576 548551 543576 539389 536825 536300 538153 542278 547973 554246 559808 562927 562100 557083
51642 557083 548745 538025 525661 512773 500655 489761 479673 470318 462333 456004 450738 446142 442798
51629 442798 441365 441415 441802 441808 441401 440782 440194 439883 439705 438959 437072 434301 431409 428770 426163 423422 420908
51612 420908 419231 418571 418427 418144 417719 417844 418989 420751 422536 424532 427405 431138 434953 438510 442568
51597 442568 448220 456016 466085 478417 492452 506647 518894 527448 531511 531339 528035 523002 517370
51584 517370 511910 507302 504083 502333 501816 502530 504811 508921 514867 522566 531703 541498 551149 560664 570872
51569 570872 582582 595999 610772 625989 640317 652988 664876 678010 693948 713218 736186
51558 736186 763413 794704 828517 862682 895061 923332 945210 959673 967409 969430 965743 955934
51546I55934j5485j9986k3658k7089l0226l2654l4004l3786l1636k8065k4429
51535F54916k1662j9569j7475j5180j2986j1260j0164r493q772p795o981o695
51523E06884o499n661m288l256k992l029k837k408j990j810k126k889l371k807
51509D60921j492n23l24j91M72J203J254P50N06J004J926K558K487J978J686J853
51493D76068J918J238jj010j308j000l33L99O18j91j718l032l659l926m213m351
51477D55499l979l078j976j135r32j317j691j536j142j244j959k576k470j764
51463D28700r62l50R6M46O11L56l46r16n22R45K664L935M942O022O899P286P592
51446D67398Q177Q462P868P118P350Q101P658N456K837J107Q7q76j605j623j218
$$ plain form
51546 955934 940449 920463 896805 869716 839490 806836 772832 739046 707410 679345 654916
51535 654916 633254 613685 596210 581030 568044 556784 546620 537127 528355 520560 513579 506884
51523 506884 500385 494724 490436 487180 484188 481159 478322 475914 473924 472114 469988 467099 463728 460921
51509 460921 459429 458906 458582 458391 458863 460066 461320 462070 462576 463580 465506 468064 470551 472529 474215 476068
51493 476068 477986 479224 479223 478213 476905 475905 475572 475971 476589 476398 474680 471648 467989 464063 459850 455499
51477 455499 451520 448442 446466 445331 444399 443082 441391 439855 438713 437469 435510 432934 430464 428700
51463 428700 427738 427388 427484 427930 428541 428897 428551 427635 427113 428058 430722 434657 439599 445621 452520 459806 467398
51446 467398 475575 484037 491905 499023 506373 514474 522132 527588 530425 531532 531619 530743 529138 527515 526297
51431E26297j277k360m351o614q268q733q311p767p324o560n297l910k655j429
51417D51441l52J23p3m76p78r62o56O68K556L585L062J901J302J294J295J350
51401D65280J945K993L863M269M572N146N919O486O567O377O552P477Q704R474
51387E45624R766J0339J1725J3775J6278J9329K2871K6501K9990L3448L6757L9531
51375H15934M1697M3263M3246L9808L2167K1647J0300p76j1143j9944k6333l0597
51363I59269l3856l6640l8487l8886l7934l6059l3686l1188k8733k6081k2907
51352E94812j9373j6043j3310j1189r657q876q948r602j0166r859q356o174m357
51339D58902l651l949m544m701m135l149k410k243k200j687r00o51j184j744j535
$$ plain form
51431 526297 525020 522660 518309 511695 503427 494694 486383 478616 471292 464732 459435 455525 452870 451441
51417 451441 451089 451212 451139 450663 449885 448923 448267 448935 451491 455076 458138 460039 461341 462635 463930 465280
51401 465280 467225 470218 474081 478350 482922 488068 493987 500473 507040 513417 519969 527446 536150 545624
51387 545624 555390 565729 577454 591229 607507 626836 649707 676208 706198 739646 776403 815934
51375 815934 857631 900894 944140 983948 1016115 1037762 1048062 1047286 1036143 1016199 989866 959269
51363 959269 925413 888773 850286 811400 773466 737407 703721 672533 643800 617719 594812
51352 594812 575439 559396 546086 534897 525240 516364 507416 497814 487648 477789 469433 463259 458902
51339 458902 455251 451302 446758 442057 437922 434773 432363 430120 427920 426233 425333 424682 423498 421754 420219
51324D20219n91M55J074R87K31o48q21o4R46J496J724K259L354M656N665O010
51308D46952N487M163K401O51p47j547j709j621j827k391k784k618k098j662j435
51293D39215j350j438j721j975j879j318m42M35J048J443J977K844L760M376M777
51278D49752N101M928L802K218J257J140R64J45p65j041p58k81M92J696K837L300
51262D74787L135K710J921M67j293k442k492j826j082n47k00k7j16n29j187j835
51246D69444k231k336k288k297k638l513m644n241m796l742k903k440j902j137
51232D27336m42J25Q15J512J745J563J575J925J982J364N84K66L89P02J200J696
51216D44337J685J176J106K195L802M560L881K361R33K05L81J323K600L718M285
$$ plain form
51324 420219 419628 420083 421157 422144 422375 421727 420906 420842 421788 423284 425008 427267 430621 435277 440942 446952
51308 446952 452439 456602 459003 459654 458907 457360 455651 454030 452203 449812 447028 444410 442312 440650 439215
51293 439215 437865 436427 434706 432731 430852 429534 429092 429527 430575 432018 433995 436839 440599 444975 449752
51278 449752 454853 459781 463583 465801 467058 468198 469162 469307 468542 467501 466743 466462 466954 468650 471487 474787
51262 474787 477922 480632 482553 483020 481727 479285 476793 474967 473885 473338 473138 473111 472995 472466 471279 469444
51246 469444 467213 464877 462589 460292 457654 454141 449497 444256 439460 435718 432815 430375 428473 427336
51232 427336 426894 427019 427834 429346 431091 432654 434229 436154 438136 439500 440084 440350 440739 441441 442641 444337
51216 444337 446022 447198 448304 450499 454301 458861 462742 465103 466036 466241 466622 467945 470545 474263 478548
51201D78548M044L093K079J653J668J461R39O87Q27O18l75j482j889j763j782
51186D88326k051k181k112k207k620l090l254k922k141j187l11M84J170J293M43
51171D67640r27j798j833j565j308p33K66J215J944K889M029M532M002L215K920
51156D84488K827K462K159K294K289J419J9j035j616k169k691k734k213j445o87
51141D83367k35n32j477k110j721q51m29m28j89L68P89R81J191J347J297J450
51125D82818K343L720M714M777L876K207L69o05l03L59K58l98m60N20J894K914
51109E09003L319L071K358J698J443J371J320J633K379K736K128J339J476K269
51095E37543K609K266J839J351L51p62j030n62m60j029j385j112q47q73m61P33
$$ plain form
51201 478548 482592 485685 487764 489417 491085 492546 493485 494172 494999 495617 495242 493760 491871 490108 488326
51186 488326 486275 484094 481982 479775 477155 474065 470811 467889 465748 464561 464250 464734 465904 467197 467640
51171 467640 466713 464915 463082 461517 460209 459476 459742 460957 462901 465790 469819 474351 478353 481568 484488
51156 484488 487315 489777 491936 494230 496519 497938 497957 496922 495306 493137 490446 487712 485499 484054 483367
51141 483367 483132 482600 481123 479013 477292 476441 476012 475584 475395 475763 476552 477533 478724 480071 481368 482818
51125 482818 485161 488881 493595 498372 502248 504455 504824 504219 503916 504275 504533 504135 503675 504195 506089 509003
51109 509003 512322 515393 517751 519449 520892 522263 523583 525216 527595 530331 532459 533798 535274 537543
51095 537543 540152 542418 544257 545608 545959 545197 544167 543605 543145 542116 540731 539619 538772 537899 537438 538171
51079E38171J827J959J496J241J299J394J677K485L628M525M843M756M810N641
51065E79752P359R192J0240J0584J1148J2426J4029J5483J6643J7111J5998J2739
51053G32704P696J936l104n795n180k070J283L051L075K300J631J482J619J183
51039G41811o71l766o896q761q562o032j838J980L102J029k478n322o720o863
51025F90013n914l989j491J102L483N247N905N553N026N059N624O260O522N999
51011G34399M546K752J573J132N34p95k234k825k476j760j044l46K52O18Q14J002
50995G36142J289J853K952M623O547Q359R847J0873J1511J2229J3456J4965J6271
50982H50917J7578J9654K2600K5461K7286K7976K7895K7424K7207K8067L0204
$$ plain form
51079 538171 539998 541957 543453 544694 545993 547387 549064 551549 555177 559702 564545 569301 574111 579752
51065 579752 587111 596303 606543 617127 628275 640701 654730 670213 686856 703967 719965 732704
51053 732704 740400 742336 739232 733437 728257 726187 727470 730521 733596 735896 737527 739009 740628 741811
51039 741811 741140 737374 730478 721717 713155 707123 705285 707265 710367 711396 708918 703596 696876 690013
51025 690013 684099 680110 678619 679721 683204 688451 694356 699909 704935 709994 715618 721878 728400 734399
51011 734399 738945 741697 743270 744402 744936 744141 741907 739082 736606 734846 733802 733456 733708 734326 735140 736142
50995 736142 737431 739284 742236 746859 753406 761765 771612 782485 793996 806225 819681 834646 850917
50982 850917 868495 888149 910749 936210 963496 991472 1019367 1046791 1073998 1102065 1132269
50971A132269L3015L6135M0027M5148N1130N7271O3336O9295P4770P9304Q2899
50960A764599Q5785Q7829Q8646Q8005Q5787Q1773P5834O8210N9409M9945M0189
50949B576011L0275K0184J0247J329o021j2311j8133k2703k4557k3947k3260k4413
50937B482701k6910k9139l0511l1289l1306l0308k9133k9252l1139l4031l7163
50926B142520m0408m3722m6929n0114n3461n6520n8391n8796n8305n7363n5707
50915A562804n3106m9961m6792m3453l9586l5506l2115k9849k8164k6257k3980
50904A154035k1747j9796j7927j5960j3971j1987r899p838o185m943l598k038
50892A018146j046j235j956k024j178m9J089K471L933M924N536O456P775Q883
$$ plain form
50971 1132269 1165284 1201419 1241446 1286594 1337724 1394995 1458331 1527626 1602396 1681700 1764599
50960 1764599 1850384 1938213 2026859 2114864 2200651 2282424 2358258 2426468 2485877 2535822 2576011
50949 2576011 2606286 2626470 2636717 2638046 2632025 2619714 2601581 2578878 2554321 2530374 2507114 2482701
50937 2482701 2455791 2426652 2396141 2364852 2333546 2303238 2274105 2244853 2213714 2179683 2142520
50926 2142520 2102112 2058390 2011461 1961347 1907886 1851366 1792975 1734179 1675874 1618511 1562804
50915 1562804 1509698 1459737 1412945 1369492 1329906 1294400 1262285 1232436 1204272 1178015 1154035
50904 1154035 1132288 1112492 1094565 1078605 1064634 1052647 1042748 1034910 1028725 1023782 1020184 1018146
50892 1018146 1017100 1015865 1013909 1011885 1010707 1010658 1011747 1014218 1018151 1023075 1028611 1035067 1042842 1051725
50878A051725R744J1134J3196J4947J5783J6433J7682J9165K0263K1265K2626
50867A233963K3909K4607K5377K7286L0165L2971L5570L9060M4234N0655N7478
50856A625275O4400P1676P9732Q8947R9388J10728J22639J35040J47522J58982
50846B704329J68575J76802J84828J92722J99095K02439K02118J97848J89035
50837D417791J75064J55866J31917J04044P3549M2197J1845j5951m0108o0125
50827D996089p6074q8112r5892r8698r6307q9550p9923o8898n7677m7520m0035
50816D157403l6881l8860m5162n3857o3446p3803q5423r8070j10669j22212j32141
50805C296879j39802j44260j45123j43129j39342j34012j26657j17287j06892
$$ plain form
50878 1051725 1061469 1072603 1085799 1100746 1116529 1132962 1150644 1169809 1190072 1211337 1233963
50867 1233963 1257872 1282479 1307856 1335142 1365307 1398278 1433848 1472908 1517142 1567797 1625275
50856 1625275 1689675 1761351 1841083 1930030 2029418 2140146 2262785 2397825 2545347 2704329
50846 2704329 2872904 3049706 3234534 3427256 3626351 3828790 4030908 4228756 4417791
50837 4417791 4592855 4748721 4880638 4984682 5058231 5100428 5112273 5096322 5056214 4996089
50827 4996089 4920015 4831903 4736011 4637313 4541006 4451456 4371533 4302635 4244958 4197438 4157403
50816 4157403 4120522 4081662 4036500 3982643 3919197 3845394 3759971 3661901 3551232 3429020 3296879
50805 3296879 3157077 3012817 2867694 2724565 2585223 2451211 2324554 2207267 2100375
50796B100375r6616q6871p7602o9006o1334n4252m7087l9822l3197k7629k2745
50785A484214j8245j4514j1879r895q096o844o595o785o434n601n229n648o255
50772A372194o694p313q243r000r269r302r303r183r125r507j0073j0062r360
50759A255760q636q010o717m472k132l53J382L761O627R645J3025J6715J9794
50746A296389K1761K3585K6408K9829L2695L5046L8051M2225M7015N2109N8068
50735A703181O5363P3551Q1633Q8720R4303R8417J01511J03879J05251J05250
50725B621059J03929J01509R7896R2895Q6470P8287O7467N3372L6359J7285l180
50714C353348k4126m3794o0190p2129p9106q0816p7642p1232o3526n5296m6341
$$ plain form
50796 2100375 2003759 1916888 1839286 1770280 1708946 1654694 1607607 1567785 1534588 1506959 1484214
50785 1484214 1465969 1451455 1439576 1429681 1421585 1414741 1408146 1401361 1394927 1389326 1384097 1378449 1372194
50772 1372194 1365500 1358187 1349944 1340944 1331675 1322373 1313070 1303887 1294762 1285255 1275182 1265120 1255760
50759 1255760 1247124 1239114 1232397 1227925 1225793 1225440 1226822 1230583 1237210 1246855 1259880 1276595 1296389
50746 1296389 1318150 1341735 1368143 1397972 1430667 1465713 1503764 1545989 1593004 1645113 1703181
50735 1703181 1768544 1842095 1923728 2012448 2106751 2205168 2306679 2410558 2515809 2621059
50725 2621059 2724988 2826497 2924393 3017288 3103758 3182045 3249512 3302884 3339243 3356528 3353348
50714 3353348 3329222 3285428 3225238 3153109 3074003 2993187 2915545 2844313 2780787 2725491 2679150
50703B679150l6883k7947k0570j5356j2689j2632j4802j9050k5986l6008m7983
50692B409244n9729o9646p7196q2091q4136q3742q1696p8262p3255o7005o0391
50681A592095n3929m7545m1244l5214k9306k3284j7525j2635q384l918Q71N148
50669A325130Q423J1013J3059J4094J3982J3470J3253J3216J3081J3136J3876
50658A465733J5292J6953J8366J9131J9253J9408K0377K1934K2980K3037K2988
50647A685452K3957K5993K8403L0897L3793L7294M1037M4351M6865M8804N0694
50636B097540N2582N3723N3307N1385M8773M6127M3549M0853L7927L4954L2698
50625B593418L1955L1946K9622K1918Q980n563j7658k5361k8602k7891k4097j8682
$$ plain form
50703 2679150 2642267 2614320 2593750 2578394 2565705 2553073 2538271 2519221 2493235 2457227 2409244
50692 2409244 2349515 2279869 2202673 2120582 2036446 1952704 1871008 1792746 1719491 1652486 1592095
50681 1592095 1538166 1490621 1449377 1414163 1384857 1361573 1344048 1331413 1323029 1319111 1319982 1325130
50669 1325130 1333553 1344566 1357625 1371719 1385701 1399171 1412424 1425640 1438721 1451857 1465733
50658 1465733 1481025 1497978 1516344 1535475 1554728 1574136 1594513 1616447 1639427 1662464 1685452
50647 1685452 1709409 1735402 1763805 1794702 1828495 1865789 1906826 1951177 1998042 2046846 2097540
50636 2097540 2150122 2203845 2257152 2308537 2357310 2403437 2446986 2487839 2525766 2560720 2593418
50625 2593418 2625373 2657319 2686941 2708859 2717839 2712276 2694618 2669257 2640655 2612764 2588667 2569985
50613B569985j3184q516m915k253j66J518K366J771j65k908o693j2534k0757l0343
50599B473206m0148m9828n8996o6421p1135p3684p5352p6346p5716p2920o8683
50588A743977o4209o0130n6323n2305m7698m2649l7841l3846l0481k7034k3148
50577A268313j9205j5717j2594r143m914l71L439N994P795R660J1804J3903J5751
50564A274715J7300J8342J8737J8909J9458K0342K1037K1537K2425K3832K5120
50553A501754K5911K6661K7806K8866K9056K8236K6835K5175K3478K2304K2367
50542A788449K3859K6225K8736L1225L4391L9339M6448N4576O1615O6062O8023
50531B268948O8847P0151P3079P7871Q3963R0678R7779J04948J11050J14703J15724
$$ plain form
50613 2569985 2556801 2548285 2543370 2541117 2540951 2542469 2544835 2546606 2546441 2543533 2536840 2524306 2503549 2473206
50599 2473206 2433058 2383230 2324234 2257813 2186678 2112994 2037642 1961296 1885580 1812660 1743977
50588 1743977 1679768 1619638 1563315 1511010 1463312 1420663 1382822 1348976 1318495 1291461 1268313
50577 1268313 1249108 1233391 1220797 1211654 1206740 1206369 1209808 1215802 1223597 1233257 1245061 1258964 1274715
50564 1274715 1292015 1310357 1329094 1348003 1367461 1387803 1408840 1430377 1452802 1476634 1501754
50553 1501754 1527665 1554326 1582132 1610998 1640054 1668290 1695125 1720300 1743778 1766082 1788449
50542 1788449 1812308 1838533 1867269 1898494 1932885 1972224 2018672 2073248 2134863 2200925 2268948
50531 2268948 2337795 2407946 2481025 2558896 2642859 2733537 2831316 2936264 3047314 3162017 3277741
50520C277741J15129J13464J09906J03451R4210Q2961P0003N5207L8817K1499
50510D082388L691j4439l2406m9266o4110p6471q6200r3122r6807r6639r2257
50499C384362q3939p2484n8780m3730k8440j4007j017J0479K0446K8639L4630
50488C176159L7605L6187K9187J6647k89k0380m2453o4647q4632j00931j13378
50477B869075j22003j26388j26566j23653j18868j12592j04923r6471q7914p9368
50467A770329p0921o3152n6387m9973m3230l6621l1035k6240k1097j5203r325
50456A347145m156M64M880R006J2659J5950J9040K1928K4701K7568L0454L2991
50444A542630L5178L7721M1142M4555M5643M2203L3875K2501J0755N51p326j2554
$$ plain form
50520 3277741 3392870 3506334 3616240 3719691 3813901 3896862 3966865 4022072 4060889 4082388
50510 4082388 4086079 4071640 4039234 3989968 3925858 3849387 3763187 3670065 3573258 3476619 3384362
50499 3384362 3300423 3227939 3169159 3125429 3096989 3082982 3081965 3092444 3112890 3141529 3176159
50488 3176159 3213764 3249951 3279138 3295785 3295496 3275116 3232663 3168016 3083384 2982453 2869075
50477 2869075 2747072 2620684 2494118 2370465 2251597 2139005 2034082 1937611 1849697 1770329
50467 1770329 1699408 1636256 1579869 1529896 1486666 1450045 1419010 1392770 1371673 1356470 1347145
50456 1347145 1342989 1343453 1348333 1357339 1369998 1385948 1404988 1426916 1451617 1479185 1509639 1542630
50444 1542630 1577808 1615529 1656671 1701226 1746869 1789072 1822947 1845448 1856203 1856754 1849428 1836874
50432A836874j4968j5001j3785j2400j1224j0163r114p922o294m202k131n28Q25
50419A729967K658N581R780J5028K0730K6217L1249L6075M0791M5097M8838N2281
50407B064292N5379N7256N7085N5267N3025N0895M8214M4166L8805L2844K6721
50396B583949K0107J2149K120r971k3278l6559m8744n9203o7624p3777p7249p7574
50384B144346p4753o9574o3048n5607m7195l8040k8783j9754j0727j643O937J4264
50372A756423J9843K3216K3853K1594J6815R911J218q317j7012k3545k7819l0502
50360A765678l2307l4104l6998m1451m6568n0807n3183n3565n2246m9794m6835
50349A267820m3491l9316l4259k9186k4891k1153j7334j3532j0355p917n817l787
$$ plain form
50432 1836874 1821906 1806905 1793120 1780720 1769496 1759333 1750219 1742297 1736003 1731801 1729670 1729142 1729967
50419 1729967 1732625 1738206 1747986 1763014 1783744 1809961 1841210 1877285 1918076 1963173 2012011 2064292
50407 2064292 2119671 2176927 2234012 2289279 2342304 2393199 2441413 2485579 2524384 2557228 2583949
50396 2583949 2604056 2616205 2618325 2608354 2585076 2548517 2499773 2440570 2372946 2299169 2221920 2144346
50384 2144346 2069593 2000019 1936971 1881364 1834169 1796129 1767346 1747592 1736865 1735222 1742159 1756423
50372 1756423 1776266 1799482 1823335 1844929 1861744 1871655 1872873 1864556 1847544 1823999 1796180 1765678
50360 1765678 1733371 1699267 1662269 1620818 1574250 1523443 1470260 1416695 1364449 1314655 1267820
50349 1267820 1224329 1185013 1150754 1121568 1096677 1075524 1058190 1044658 1034303 1026386 1020569 1016782
50337A016782j785L19K341L517L336K482K188K872M084N453O859P902Q225Q299
50323A072874R030J0524J2016J3076J4013J5066J5987J6630J7186J7601J7441
50312A231444J6623J5752J5508J6138J7648K0007K3136K7089L2181L8484M5544
50301A499554N3225O2347P2926Q1490Q1582O8264M2205R399k2473m7539o3328
50290A837652p0628p1956o9564o4653n8220n1721m6346m2079l8097l3857k9316
50279A261215k4537j9617j4914j0796p165l571K37M070P470R929J1191J1594J1921
50266A237027J2578J3124J2891J1902J0869J0374J0447J0842J1359J1818J2011
50255A365242J1739J0802Q937O070K549j109m762q604j2435j5376j6629j6330
$$ plain form
50337 1016782 1014997 1015316 1017657 1021174 1024510 1026992 1029180 1032052 1036136 1041589 1048448 1056350 1064575 1072874
50323 1072874 1081904 1092428 1104444 1117520 1131533 1146599 1162586 1179216 1196402 1214003 1231444
50312 1231444 1248067 1263819 1279327 1295465 1313113 1333120 1356256 1383345 1415526 1454010 1499554
50301 1499554 1552779 1615126 1688052 1769542 1851124 1919388 1961593 1970992 1948519 1900980 1837652
50290 1837652 1767024 1695068 1625504 1560851 1502631 1450910 1404564 1362485 1324388 1290531 1261215
50279 1261215 1236678 1217061 1202147 1191351 1184186 1180615 1180852 1184922 1192392 1202321 1213512 1225106 1237027
50266 1237027 1249605 1262729 1275620 1287522 1298391 1308765 1319212 1330054 1341413 1353231 1365242
50255 1365242 1376981 1387783 1396720 1402790 1405339 1404230 1399468 1390864 1378429 1363053 1346424 1330094
50243A330094j5177j3327j0302o243k706j575l360p017j1189j5011j7731j8560
50231A207896j7359j5108j3113j1925j1216j0458r441q386p817q079q857r426
50219A076711r506r414r276q715p721p065p317p922p951p296o490n765n091m789
50205I72393n163n705n616n083n179o391q021r124r348q780p707o761o482o526
50191H76507n932m483l125k753l136l394l048k176j060p8L47L5p65j649k264k282
50175H40744j642r25r44j744k441k285j463o14k7M03P45R52J021J032J194J892
50159H35898L323N073O480P548R022J1367J4185J6882J9432K2124K4822K6850
50147A003006K7436K6216K3632K0904J9165J8449J7930J7183J6652J6584J6256
$$ plain form
50243 1330094 1314917 1301590 1291288 1285045 1282339 1280764 1277404 1270387 1259198 1244187 1226456 1207896
50231 1207896 1190537 1175429 1162316 1150391 1139175 1128717 1119276 1110890 1103073 1094994 1086137 1076711
50219 1076711 1067205 1057791 1048515 1039800 1032079 1025014 1017697 1009775 1001824 994528 988038 982273 977182 972393
50205 972393 967230 961525 955909 950826 945647 939256 931235 922111 912763 903983 896276 889515 883033 876507
50191 876507 870575 866092 862967 860214 857078 853684 850636 848460 847400 847322 847669 847704 846939 845290 843026 840744
50175 840744 839102 838177 837233 835489 833048 830763 829300 828686 828659 829062 829807 830759 831780 832812 834006 835898
50159 835898 839221 844294 850774 858322 867344 878711 892896 909778 929210 951334 976156 1003006
50147 1003006 1030442 1056658 1080290 1101194 1120359 1138808 1156738 1173921 1190573 1207157 1223413
50136A223413J4654J1497P168K167k880p256j0850j4451j8676k2860k5645k6463
50124A129818k5794k4176k1748j8773j5887j3552j1745j0367r509r114q804q292
50112I52057p674p051o086m285j627J246L516M745N012M587L598K031J00j659
50098I48510k851l632m457n412o054n957n180m083k931j836r72n42n31o73p39
50083I02660o86n18j45N23J507K804M299N568O058N769N492N992P072P925Q254
50068I62574Q497Q946R297R251Q852Q022O489M568L336L363L799L366J814k61
50054A041913k415m278m973l903k009j134j824k816k880k200j467n69J037L260
50040A015742N464P356R195J1217J3371J5480J7436J9233K0983K2850K4832K6682
$$ plain form
50136 1223413 1238067 1249564 1256732 1258899 1256019 1248763 1237913 1223462 1204786 1181926 1156281 1129818
50124 1129818 1104024 1079848 1058100 1039327 1023440 1009888 998143 987776 978267 969153 960349 952057
50112 952057 944383 937332 931246 926961 925334 926580 930096 934841 939853 944440 948038 950069 950169 948510
50098 948510 945659 942027 937570 932158 926104 920147 914967 910884 907953 906117 905145 904603 904072 903399 902660
50083 902660 901974 901456 901311 901834 903341 906145 910444 916012 922070 927839 933331 939323 946395 954320 962574
50068 962574 971071 980017 989314 998565 1007417 1015439 1021928 1026496 1029832 1033195 1036994 1040360 1042174 1041913
50054 1041913 1039498 1035220 1030247 1026344 1024335 1023201 1021377 1018561 1015681 1013481 1012014 1011445 1012482 1015742
50040 1015742 1021206 1028562 1037757 1048974 1062345 1077825 1095261 1114494 1135477 1158327 1183159 1209841
50028A209841K7957K8032K6386K3289J9945J7365J5243J2672R764P709P000O503
50016A411706M619O54n228j2477j9944k5995k9693l1533l2505l2836l2228l0722
50004A163818k8636k6021k2928j9909j7516j5447j2895r739o720m504l097k196
49992I94210j586j234j452k836n578q809j1252j2553j3470j4545j5267j4868j3507
49979H77253j2173j1538j1293j0634r163p202n413m231l690l584l641l599l358
49966G87734l107l133l372l390k888j992r24L94K167M283O303P804Q567Q554P886
49951H14886O847N712M581L457K481J942J943K054J424m78l125n139n494m467
49937H26624l230k727l195m499o300p985q907q891q215p152n916m868m289l951
$$ plain form
50028 1209841 1237798 1265830 1292216 1315505 1335450 1352815 1368058 1380730 1390494 1398203 1405203 1411706
50016 1411706 1416325 1416979 1411751 1399274 1379330 1353335 1323642 1292109 1259604 1226768 1194540 1163818
50004 1163818 1135182 1109161 1086233 1066324 1048808 1033361 1020466 1010727 1004007 999503 996406 994210
49992 994210 992624 991390 989938 987102 981524 972715 961463 948910 935440 920895 905628 890760 877253
49979 877253 865080 853542 842249 831615 822452 815250 809837 805606 801916 798332 794691 791092 787734
49966 787734 784627 781494 778122 774732 771844 769852 768928 769322 771489 775772 782075 789879 798446 807000 814886
49951 814886 821733 827445 832026 835483 837964 839906 841849 843903 845327 844849 841724 836585 831091 826624
49937 826624 823394 820667 817472 812973 806673 798688 789781 780890 772675 765523 759607 754739 750450 746499
49923G46499l499l132l257l459k706q18J135K238K749L324L974M440M899N629
49909G58016O439P076P772Q759R685J0119J0196J0063R232P399N504M896N427
49896H60583N413L666P86j907l972n882p953r757j0653j0591j0265j0284j0283
$$ plain form
49923 746499 743000 739868 736611 733152 730446 729628 730763 733001 735750 739074 743048 747488 752387 758016
49909 758016 764455 771531 779303 788062 797747 807866 818062 828125 837357 844756 850260 855156 860583
49896 860583 865996 869662 870448 868541 864569 858687 850734 840977 830324 819733 809468 799184 788901
$$ [...]
##END NTUPLES=NMR SPECTRUM
##END=
