##TITLE=AC1641_CTIAH13374_8569537_Be0Vl6GaTi
##JCAMPDX= 6.0         $$ Bruker NMR JCAMP-DX V2.0
##DATA TYPE= NMR SPECTRUM
##DATA CLASS= NTUPLES
##ORIGIN= BRUKER
##OWNER= Administrator
$$ 1.72 TOPSPIN		Version 2.1
$$ 2014-04-10 15:06:06.855 -0700  Administrator@X
$$ Compression mode = diff/dup
##.OBSERVE FREQUENCY= 400.02188249412
##.OBSERVE NUCLEUS= ^1H
##.ACQUISITION MODE= SIMULTANEOUS (DQD)
##.ACQUISITION SCHEME= undefined
##.AVERAGES= 8
##.DIGITISER RES= 22
##SPECTROMETER/DATA SYSTEM= spect
##.PULSE SEQUENCE= zg30
##.SOLVENT NAME= COFFEE_meoh
##.SHIFT REFERENCE= INTERNAL, COFFEE_meoh, 1, 14.98509
##AUDIT TRAIL= $$ (NUMBER, WHEN, WHO, WHERE, PROCESS, VERSION, WHAT)
$$ ##TITLE= Audit trail, TOPSPIN		Version 2.1
$$ ##JCAMPDX= 5.01
$$ ##ORIGIN= Bruker BioSpin GmbH
$$ ##OWNER= Administrator
$$ $$ E:\/data/COFFEE/nmr/AC1641_CTIAH13374_8569537_Be0Vl6GaTi/10/pdata/1/auditp.txt
$$ ##AUDIT TRAIL=  $$ (NUMBER, WHEN, WHO, WHERE, PROCESS, VERSION, WHAT)
(   1,<2014-04-10 15:05:59.245 -0700>,<Administrator>,<X>,<go>,<TOPSPIN 2.1>,
      <created by zg
	started at 2014-04-10 15:04:52.322 -0700,
	POWCHK enabled, PULCHK disabled,
       configuration hash MD5:
       C8 4E 4E 5D D3 5C D8 9E 9F 52 82 E0 59 8A DE 15
       data hash MD5: 64K
       BC 9E 03 B5 1D 93 43 88 BD 97 14 59 F3 85 C1 11>)
(   2,<2014-04-10 15:06:02.574 -0700>,<Administrator>,<X>,<proc1d>,<TOPSPIN 2.1>,
      <Start of raw data processing
       efp LB = 0 FT_mod = 6 PKNL = 1 PHC0 = 0 PHC1 = 0 SI = 32K 
       data hash MD5: 32K
       E5 C4 DA 8E 0F 96 55 BA E1 05 B3 06 20 6C CF 4A>)
(   3,<2014-04-10 15:06:02.917 -0700>,<Administrator>,<X>,<proc1d>,<TOPSPIN 2.1>,
      <pk PHC0 = 93.24646 PHC1 = 0 
       data hash MD5: 32K
       45 A3 A1 2D 66 FB 8E CD 26 34 58 D0 CD 73 34 56>)
(   4,<2014-04-10 15:06:03.027 -0700>,<Administrator>,<X>,<proc1d>,<TOPSPIN 2.1>,
      <abs ABSG = 1 
       data hash MD5: 32K
       03 6A A7 D4 0D F9 F5 3E 79 E7 75 71 D0 B4 C1 1F>)
(   5,<2014-04-10 15:06:03.167 -0700>,<Administrator>,<X>,<proc1d>,<TOPSPIN 2.1>,
      <abs ABSG = 2 
       data hash MD5: 32K
       67 0F D6 F6 F1 05 4E A8 BB 37 EE DE EA 0E A3 85>)
(   6,<2014-04-10 15:06:03.386 -0700>,<Administrator>,<X>,<proc1d>,<TOPSPIN 2.1>,
      <abs ABSG = 3 
       data hash MD5: 32K
       99 0B 4B DC B7 27 19 A7 34 C7 F9 AB CB DA 3B D2>)
(   7,<2014-04-10 15:06:03.464 -0700>,<Administrator>,<X>,<proc1d>,<TOPSPIN 2.1>,
      <abs ABSG = 4 
       data hash MD5: 32K
       0D 06 01 01 CB 47 9D CE EE DC 8F E8 4E FC 38 50>)
(   8,<2014-04-10 15:06:03.542 -0700>,<Administrator>,<X>,<proc1d>,<TOPSPIN 2.1>,
      <abs ABSG = 5 
       data hash MD5: 32K
       9A BA 34 5E 6A BB 03 52 86 CD 86 1D 08 F2 46 A2>)
$$ ##END=
$$ 
$$ $$ hash MD5
$$ $$ 33 9F D9 14 DE 81 F2 5B FE FA D1 F5 C8 39 BB 69
##$RELAX= 
##$RELAX= 
##$RELAX= 
##$RELAX= 
##$RELAX= 
##$RELAX= 
##$RELAX= 
$$ Bruker specific parameters
$$ --------------------------
##$DU= <E:\>
##$EXPNO= 10
##$NAME= <AC1641_CTIAH13374_8569537_Be0Vl6GaTi>
$$ [...]
##$TP= (0..7)
150 150 150 150 150 150 150 150
##$TP07= 0
##$TPNAME0= <>
##$TPNAME1= <>
##$TPNAME2= <>
##$TPNAME3= <>
##$TPNAME4= <>
##$TPNAME5= <>
##$TPNAME6= <>
##$TPNAME7= <>
##$TPOAL= (0..7)
0.5 0.5 0.5 0.5 0.5 0.5 0.5 0.5
##$TPOFFS= (0..7)
0 0 0 0 0 0 0 0
##$TUNHIN= 0
##$TUNHOUT= 0
##$TUNXOUT= 0
##$USERA1= <user>
##$USERA2= <user>
##$USERA3= <user>
##$USERA4= <user>
##$USERA5= <user>
##$V9= 5
##$VALIST= <valist>
##$VCLIST= <CCCCCCCCCCCCCCC>
##$VD= 0
##$VDLIST= <DDDDDDDDDDDDDDD>
##$VPLIST= <PPPPPPPPPPPPPPP>
##$VTLIST= <TTTTTTTTTTTTTTT>
##$WBST= 1024
##$WBSW= 4
##$XGAIN= (0..3)
0 0 0 0
##$XL= 0
##$YL= 0
##$YMAX_a= 583183
##$YMIN_a= -496291
##$ZGOPTNS= <>
##$ZL1= 120
##$ZL2= 120
##$ZL3= 120
##$ZL4= 120
##$ABSF1= 14.98509
##$ABSF2= -5.573092
##$ABSG= 5
##$ABSL= 3
##$ALPHA= 0
##$AQORDER= 0
##$ASSFAC= 0
##$ASSFACI= 0
##$ASSFACX= 0
##$ASSWID= 0
##$AUNMP= <proc_prof1d_extract_pilot.lims>
##$AXLEFT= 0
##$AXNAME= <>
##$AXNUC= <1H>
##$AXRIGHT= 0
##$AXTYPE= 0
##$AXUNIT= <>
##$AZFE= 0.1
##$AZFW= 0.1
##$BCFW= 0
##$BC_mod= 0
##$BYTORDP= 0
##$COROFFS= 0
##$CY= 15
##$DATMOD= 1
##$DC= 0
##$DFILT= <>
##$DTYPP= 0
##$F1P= 0
##$F2P= 0
##$FCOR= 0.5
##$FTSIZE= 32768
##$FT_mod= 6
##$GAMMA= 0
##$GB= 0
##$INTBC= 1
##$INTSCL= 1
##$ISEN= 128
##$LB= 0
##$LEV0= 0
##$LPBIN= 0
##$MAXI= 10000
##$MC2= 0
##$MEAN= 0
##$ME_mod= 0
##$MI= 0
##$NCOEF= 0
##$NC_proc= -8
##$NLEV= 6
##$NOISF1= 0
##$NOISF2= 0
##$NSP= 0
##$NTH_PI= 0
##$NZP= 0
##$OFFSET= 14.98509
##$PC= 1
##$PHC0= 93.24646
##$PHC1= 0
##$PH_mod= 1
##$PKNL= yes
##$PPARMOD= 0
##$PPDIAG= 0
##$PPIPTYP= 0
##$PPMPNUM= 2147483647
##$PPRESOL= 1
##$PSCAL= 4
##$PSIGN= 0
##$PYNMP= <proc.py>
##$REVERSE= no
##$SF= 400.02
##$SI= 32768
##$SIGF1= 0
##$SIGF2= 0
##$SINO= 400
##$SIOLD= 32768
##$SPECTYP= <>
##$SREGLST= <1H.CDCl3>
##$SSB= 0
##$STSI= 32768
##$STSR= 0
##$SW_p= 8223.68421052631
##$SYMM= 0
##$S_DEV= 0
##$TDeff= 65536
##$TDoff= 0
##$TI= <>
##$TILT= no
##$TM1= 0
##$TM2= 0
##$TOPLEV= 0
##$USERP1= <user>
##$USERP2= <user>
##$USERP3= <user>
##$USERP4= <user>
##$USERP5= <user>
##$WDW= 1
##$XDIM= 32768
##$YMAX_p= 460450794
##$YMIN_p= -666619
##$CURPLOT= <Network HP LaserJet P1505>
##$CURPRIN= <$Network HP LaserJet P1505>
##$DFORMAT= <normdp>
##$LAYOUT= <+/1D_H.xwp>
##$LFORMAT= <normlp>
##$PFORMAT= <normpl>
##$SURQMSG= 1
$$ End of Bruker specific parameters
$$ ---------------------------------
##NTUPLES= NMR SPECTRUM
##VAR_NAME=  FREQUENCY,     SPECTRUM/REAL,   SPECTRUM/IMAG
##SYMBOL=    X,             R,               I
##VAR_TYPE=  INDEPENDENT,   DEPENDENT,       DEPENDENT
##VAR_FORM=  AFFN,          ASDF,            ASDF
##VAR_DIM=   32768,         32768,           32768
##UNITS=     HZ,            ARBITRARY UNITS, ARBITRARY UNITS
##FACTOR=    0.250966925370066, 1,           1
##FIRST=     8223.43324360094, -210451,      64952
##LAST=      0,             22535,           -41316
##MIN=       0,             -666619,         0
##MAX=       8223.43324360094, 460450794,    0
$$ Real data points
##PAGE= N=1
##DATA TABLE= (X++(R..R)), XYDATA
$$ [...]
19558A01791l8900a12895A8932a41880N2671n1184j42541N1087K4359A22716a66769
$$ 101791 62891 -112895 18932 -141880 -89209 -140393 -282934 -231847 -207488 122716 -166769
19546c1484G8316c25843n946i9637n1468l95572g018j02490d0438A46989M8031
$$ -31484 78316 -325843 -331789 -99637 -151105 -546677 -7018 -109508 -40438 146989 195020
19535A95020a22213k3650L0447N6269b1058j47581I7129b53683H6559j1331j8474
$$ 195020 -122213 -145863 -115416 -59147 -21058 -168639 97129 -253683 86559 75228 56754
19524E6754d026I4403C7298a16606A06922a31978K325o0977A83145d29091a11507
$$ 56754 -4026 94403 37298 -116606 106922 -131978 -129653 -190630 183145 -429091 -111507
19512c3768A01907c3683j09391b3004C1653b70548A59108E146b41605L2414o2458
$$ -33768 101907 -33683 -143074 -23004 31653 -270548 159108 5146 -241605 -209191 -271649
19501b71649a03809j44944J7389H1802J1802J08824b8191k5301q4782B85509c07423
$$ -271649 -103809 -248753 -231364 81802 93604 202428 -28191 -53492 -138274 285509 -307423
19489g7887p3068K8606a7064j26705I8115a52946M6385L9406j90621k7156a08755
$$ -77887 -150955 -122349 -17064 -143769 98115 -152946 -106561 -67155 -257776 -284932 -108755
19477A00176a33625A95042b40119N5108O8965A01345f5751f738k78842e6262a1331
$$ 100176 -133625 195042 -240119 -185011 -116046 101345 -65751 -6738 -285580 -56262 -11331
19465h1441B24668b57285d6204j8912j66058D90454d1841K81k32343Q0240A93290
$$ -81441 224668 -257285 -46204 -65116 -231174 490454 -41841 -41560 -273903 -193663 193290
19453A62388a21226H6551c8634m8101o1398L9685C8638a65474j46711O0516C1944
$$ 162388 -121226 86551 -38634 -86735 -148133 -108448 38638 -165474 -312185 -251669 31944
19441E2072c60059a75309j38527A4348c24574b2818j38095l37266J69777R1851
$$ 52072 -360059 -175309 -313836 14348 -324574 -22818 -160913 -498179 -328402 -236551
19431b36551J17449F9396b17697k42950c0947j53084C19814b17374B21270c69770
$$ -236551 -119102 69396 -217697 -460647 -30947 -184031 319814 -217374 221270 -369770
19420b39134B9194b62553R0459B23295a67979k4800c2719j6476k0609A71136q429
$$ -239134 29194 -262553 -172094 223295 -167979 -192779 -32719 -49195 -69804 171136 162707
19409A62707a54368n3500P6297e2224P503A85349c08993h5430K0048j17184A09023
$$ 162707 -154368 -207868 -131571 -52224 -44721 185349 -308993 -85430 -65382 -182566 109023
19397a16853P430A83950a12154d7612A8450i8018j52580R7194N8414M1275j6503
$$ -116853 -109423 183950 -112154 -47612 18450 -98018 -250598 -153404 -94990 -53715 -70218
19386g0218o5053A13478K51108D4272M7174b24741A97139a9531l2066B3642L2408
$$ -70218 -135271 113478 364586 44272 91446 -224741 197139 -19531 -51597 23642 56050
19375E6050a82239h3572B6220f2555B8021b03993e9878A49505c00645l9192b5699
$$ 56050 -182239 -83572 26220 -62555 28021 -203993 -59878 149505 -300645 -339837 -25699
19363a46483j89017J51515F0921b24962i3104D1998J57772a08620L949l55252
$$ -146483 -335500 -183985 60921 -224962 -93104 41998 199770 -108620 -104671 -459923
19353d59923B68648a29457l846O577k51951a05801k78061a37868j57721J23746
$$ -459923 268648 -129457 -133303 -126726 -378677 -105801 -383862 -137868 -295589 -171843
19343a71843B18674a58582O3413B5293a36408j69130B1760L015K17080a77544
$$ -171843 218674 -158582 -95169 25293 -136408 -305538 21760 24775 241855 -177544
19332D108b17741L0951C9766f1572H0324a16861I2932K30924H9871a1458B4275
$$ 4108 -217741 -186790 39766 -61572 80324 -116861 92932 323856 89871 -11458 24275
19320d53469E4361R3416g3952C31317B5976c0167A29896g4507A0705K64491a36785
$$ -453469 54361 147777 -73952 331317 25976 -30167 129896 -74507 10705 275196 -136785
19308B715c11586A58278d15353b6827j92063P1231O8503j32627B26975a00273
$$ 2715 -311586 158278 -415353 -26827 -218890 -147659 -79156 -211783 226975 -100273
19297b05659j55699a51018o4850a01015G5378g5159k00031R5205m7005A00600
$$ -205659 -361358 -151018 -215868 -101015 75378 -75159 -275190 -179985 -226990 100600
19286d7184j6953a0529B42415a85142H2972e1151A38518K3334e22059a52737f9008
$$ -47184 -64137 -10529 242415 -185142 82972 -51151 138518 161852 -522059 -152737 -69008
19274a8766m40208b5091L499G1450d7792k93004O4629J24342n2990b8654k75368
$$ -18766 -458974 -25091 -21592 71450 -47792 -340796 -276167 -151825 -204815 -28654 -304022
19263c04022f5903A96260a31380A8465g8075j98709C26928A33094J36735N2620
$$ -304022 -65903 196260 -131380 18465 -78075 -276784 326928 133094 269829 322449
19253C22449A13850m1855J12490L03a5928m41446B27897B1018K03597f923k1249
$$ 322449 113850 71995 184485 184788 -15928 -457374 227897 21018 224615 -6923 -28172
19242b8172l05751H2822a59332A19648g5009C3887a90853f3600B26374b67969
$$ -28172 -333923 82822 -159332 119648 -75009 33887 -190853 -63600 226374 -267969
19231b01582A66632a75619A33877P5785a1872l02218Q8854J00325c6616B01212
$$ -201582 166632 -175619 133877 209662 -11872 -314090 -225236 -124911 -36616 201212
19220B3476K3125a91541j06346C2015a18596a0968A97969p8456i2570c8217j67208
$$ 23476 46601 -191541 -297887 32015 -118596 -10968 197969 119513 -92570 -38217 -205425
19209b05425j5435k6939B2551J7356Q2509c87198J33470i4939L1501k12447L950
$$ -205425 -220860 -247799 22551 39907 122416 -387198 -253728 -94939 -63438 -275885 -271935
19198b71935C302R6550J46467f9333j43824f9857A728c5788k5946K6405l76786
$$ -271935 3302 99852 246319 -69333 -213157 -69857 1728 -35788 -61734 -35329 -412115
19187d12115i0435J389j93211G4883K71145G1242b950D7233f9214j41205a992
$$ -412115 -90435 -89046 -282257 74883 346028 71242 -2950 47233 -69214 -210419 -1992
19175f9414j30099O9955B939b6245l55500a64791E2989a31331j17753A42878m4849
$$ -69414 -199513 -129558 2939 -26245 -381745 -164791 52989 -131331 -249084 142878 98029
19164I8029E458f683j55448g4649m04818J03542J48508L8248n0816J03368d0247
$$ 98029 5458 -6683 -162131 -74649 -479467 -375925 -227417 -189169 -239985 -136617 -40247
19152h0220j08964b0187j26091B12998E8294M8255J4461J52151b0668B2787a62244
$$ -80220 -189184 -20187 -146278 212998 58294 106549 121010 273161 -20668 22787 -162244
19140A06089e8393H2164b13230E4836i7922C8417a14720l52403c5392J6367k16929
$$ 106089 -58393 82164 -213230 54836 -97922 38417 -114720 -467123 -35392 -19025 -235954
19129b35954B61844D0343a47888l25924a80530C0856K11449A3983c7764j38567
$$ -235954 261844 40343 -147888 -473812 -180530 30856 242305 13983 -37764 -176331
19119a76331A52380a10841j58212a11303A57189i4905O689j11016D3755a74891
$$ -176331 152380 -110841 -269053 -111303 157189 -94905 -88216 -199232 43755 -174891
19108b00784A6374f66619i7546B92086C4413Q2041b57635B24106f010p0307k05138
$$ -200784 16374 -666619 -97546 292086 34413 116454 -257635 224106 -6010 -76317 -281455
19097b81455A70101H3128J8438c6676l7379c1592C3964g9485j11756E8365L3976
$$ -281455 170101 83128 101566 -36676 -74055 -31592 33964 -79485 -191241 58365 92341
19086I2341c11483B46948g2554H1035b75473B8325i2490a0499j27328D8271N5880
$$ 92341 -311483 246948 -72554 81035 -275473 28325 -92490 -10499 -137827 48271 104151
19075A04151i402B34377Q7158E247M3223O1013D8394e2015p5606b9044l35158
$$ 104151 -9402 234377 321535 5247 48470 109483 48394 -52015 -127621 -29044 -364202
19064c64202i8159b93j27389j56590J15968I3325A8752b60755m5421A87643a38896
$$ -364202 -98159 -293 -127682 -284272 -168304 93325 18752 -260755 -306176 187643 -138896
19052a3961o2056c4332B00186f2993k47771a21980j40128J19622l3501f7092k5021
$$ -13961 -76017 -34332 200186 -62993 -310764 -121980 -262108 -142486 -175987 -67092 -92113
19041i2113C0044P9847a54681A600c12646A88618O2910O0080a26669A00959L38639
$$ -92113 30044 109891 -154681 1600 -312646 188618 251528 311608 -126669 100959 439598
19030D39598c9236k12002j638B44178b09351l2841F2723a52477A16895J04175
$$ 439598 -39236 -251238 -252876 244178 -209351 -242192 62723 -152477 116895 221070
19020B21070i5062B481a09961b2212B0347p836a34081A63262h7898l25043A60826
$$ 221070 -95062 2481 -109961 -22212 20347 12511 -134081 163262 -87898 -412941 160826
19008d0283m92185D2105M0350C3417a12302G9005a17146M8235j27292I3266e7947
$$ -40283 -532468 42105 82455 33417 -112302 79005 -117146 -68911 -196203 93266 -57947
18996a40440B18176E4303b56912R3592K2820m1286c5143J0804k31079c4044I6546
$$ -140440 218176 54303 -256912 -163320 -140500 -181786 -35143 -24339 -255418 -34044 96546
18984a43936k2064A28640N6686i1150k6465A9163K0025b0650B80517d27841A56440
$$ -143936 -166000 128640 185326 -91150 -117615 19163 39188 -20650 280517 -427841 156440
18972e009H6231a08299A0840J06703c4209n9311m3615n6751k8855H6816f3152
$$ -5009 86231 -108299 10840 117543 -34209 -93520 -137135 -193886 -222741 86816 -63152
18960B1690c03597A42717E1256b23762Q6377b2006B81637b4307j112m2109A61969
$$ 21690 -303597 142717 51256 -223762 -137385 -22006 281637 -24307 -25419 -67528 161969
18948g7923c7259j32619O0892j00379B79322F9346J46606E1518k5464c663j70698
$$ -77923 -37259 -169878 -108986 -209365 279322 69346 215952 51518 26054 -3663 -174361
18937a74361j76621A33066k3355c51822G5077M618Q8435k6317c41650H2074L5666
$$ -174361 -350982 133066 109711 -351822 75077 79695 168130 141813 -341650 82074 117740
18926A17740O6051k488a76791N6501A20428a69904a5768A0811a44846d9366A68269
$$ 117740 183791 181303 -176791 -120290 120428 -169904 -15768 10811 -144846 -49366 168269
18914C462J65795l2639c6109k35796c1471h06B77886e5378j13875C07064G7289
$$ 3462 169257 136618 -36109 -271905 -31471 -806 277886 -55378 -169253 307064 77289
18902A58980a38340A23992f10j39187A9607c92037a21023a1403I7495g2382A89883
$$ 158980 -138340 123992 -610 -139797 19607 -392037 -121023 -11403 97495 -72382 189883
18890a52957I2638c30221G9637J42718c42723f5984C1692h379B2806l644R2142
$$ -152957 92638 -330221 79637 222355 -342723 -65984 31692 -8379 22806 19162 111304
18879A11304a08136j99595Q5290K8210k2950e5655j64259c5286n9906F8541e1086
$$ 111304 -108136 -307731 -222441 -194231 -217181 -55655 -219914 -35286 -95192 68541 -51086
18867d8362l08810c3198F5421b7948j18923i065j64369C8515a03814n7944A61302
$$ -48362 -357172 -33198 65421 -27948 -146871 -9065 -173434 38515 -103814 -161758 161302
18855a88529B33135q8224e46726f6747K4767B07010B6669j3098b2417r5989N1853
$$ -188529 233135 144911 -546726 -66747 -41980 207010 26669 13571 -22417 -118406 -66553
18844f6553B04111k9454a95010J9284g3338B57821e9314j1570k85662J53927g0832
$$ -66553 204111 174657 -195010 -175726 -73338 257821 -59314 -70884 -356546 -202619 -70832
18832F1858J0084a19206K9030c3793I4069f5873A692b61004j72284a24442j1675
$$ 61858 71942 -119206 -90176 -33793 94069 -65873 1692 -261004 -433288 -124442 -136117
18821a36117B8527d6823k21630A98084A6506K07013a14148A49406E2341a85751
$$ -136117 28527 -46823 -268453 198084 16506 223519 -114148 149406 52341 -185751
18810d5455k9809B37024N5021j24115d1729O323a2260j06327l7015k89357a21756
$$ -45455 -75264 237024 292045 167930 -41729 -35406 -12260 -118587 -155602 -444959 -121756
18798a23661F6384J33967R3464c6835k65685A69042d2443j91648F0444d27762
$$ -123661 66384 200351 293815 -36835 -302520 169042 -42443 -234091 60444 -427762
18787g9112l30a6183H1913b90419a10033H0831J83132a52962G5273b67913J29086
$$ -79112 -79442 -16183 81913 -290419 -110033 80831 263963 -152962 75273 -267913 -138827
18776a38827a9414j32603g1j33440C9642i6701J2944j14600I12b40486k34576
$$ -138827 -19414 -152017 -71 -133511 39642 -96701 -83757 -198357 912 -240486 -475062
18765d75062h8006m9528E9181b2296k92068b1621k61192i6889r190j13465h1748
$$ -475062 -88006 -137534 59181 -22296 -314364 -21621 -282813 -96889 -106079 -219544 -81748
18753a97650b4282B6212a88560h6420H7184a99788I4714h6375q443A20252a29443
$$ -197650 -24282 26212 -188560 -86420 87184 -199788 94714 -86375 -94818 120252 -129443
18741h8725k09039D2488M5101b75648F7832B8675g2927A07623c4984j11158B06066
$$ -88725 -297764 42488 87589 -275648 67832 28675 -72927 107623 -34984 -146142 206066
18729B19599b43865J9029c7927F5306K0765b96123J02930d3285B3167b69882G676
$$ 219599 -243865 -224836 -37927 65306 86071 -296123 -193193 -43285 23167 -269882 7676
18717B8351c59617j08426d568G0448L3777D021d31410c7926A47347i9259c5759
$$ 28351 -359617 -468043 -4568 70448 104225 4021 -431410 -37926 147347 -99259 -35759
18705b70465E7424L0322L76524j52755a22406b7732B1467b41101a03884c8771
$$ -270465 57424 87746 464270 311515 -122406 -27732 21467 -241101 -103884 -38771
18694D9708i6244j07945b4836j36054f6276K5692B45232a98153C75383m6988G5221
$$ 49708 -96244 -204189 -24836 -160890 -66276 -40584 245232 -198153 375383 328395 75221
18682I2560N0581F5988b04149J1017g309E2854K24953a15992c5651a0414j74628
$$ 92560 143141 65988 -204149 -193132 -7309 52854 277807 -115992 -35651 -10414 -185042
18671a85042A37201a50475D9357b06778R6057A02720C5552J50718a58740l54834
$$ -185042 137201 -150475 49357 -206778 -110721 102720 35552 186270 -158740 -513574
18661e13574A58003d2381k40537B3003b58188A81862d21322a33689n8799h0134
$$ -513574 158003 -42381 -282918 23003 -258188 181862 -421322 -133689 -192488 -80134
18650F6459a62074f2869E6582c6236p2638B31348d3810G3690b72738C2616J48015
$$ 66459 -162074 -62869 56582 -36236 -108874 231348 -43810 73690 -272738 32616 180631
18639A80631e4353b6121l37962G0262g3497A14455g0538A05281m6421a01090B4421
$$ 180631 -54353 -26121 -364083 70262 -73497 114455 -70538 105281 58860 -101090 24421
18627C04221d3409k46286J33296g5006j90772a10401j4722J3529j80381B37192
$$ 304221 -43409 -289695 -156399 -75006 -265778 -110401 -125123 -111594 -291975 237192
18616a54162n4231A09658a3182B5595a59917c1407j54436L4544b4496A88818a28287
$$ -154162 -208393 109658 -13182 25595 -159917 -31407 -185843 -151299 -24496 188818 -128287
18604A92687E9163e6341J1846A36045k9206B4617b15843b443B89185a62076B07076
$$ 192687 59163 -56341 -44495 136045 106839 24617 -215843 -2443 289185 -162076 207076
18592H5095J0084b35349M0813i875j33681J3150a1105j05810M7406m9477A6736
$$ 85095 95179 -235349 -194536 -9875 -143556 -130406 -11105 -116915 -69509 -118986 16736
18580a80438p3284j0382M9586h9256o6579k70721J56774B37993b7760j62333b4772
$$ -180438 -253722 -264104 -214518 -89256 -155835 -426556 -269782 237993 -27760 -190093 -24772
18568b22254C6569a83552A23644a02540d1304p5808G652a93157R1840d6713k83877
$$ -222254 36569 -183552 123644 -102540 -41304 -117112 7652 -193157 -101317 -46713 -330590
18557c30590f7190l14448A33144a55675H3551K02784q9867o357a13321k46174
$$ -330590 -67190 -381638 133144 -155675 83551 286335 196468 190111 -113321 -359495
18547c59495b1366B2730a05259r6183j18780i8117k25711C4115b59700J04714
$$ -359495 -21366 22730 -105259 -201442 -320222 -98117 -323828 34115 -259700 -154986
18537a54986G7635N6630I262a7286k30489A646i5264m1188b7261A16364f8025
$$ -154986 77635 134265 9262 -17286 -247775 1646 -95264 -136452 -27261 116364 -68025
18525B85888f9665H926a6492H7893f2220g719r69n4851H3366d61559G0270k0751
$$ 285888 -69665 8926 -16492 87893 -62220 -7719 -8688 -63539 83366 -461559 70270 49519
18513D9519K8969b46354M8184B47806Q7087I9394b30816d139k49132R1602O3488
$$ 49519 78488 -246354 -198170 247806 334893 99394 -230816 -4139 -253271 -161669 -98181
18502i8181c9835C5947P7028C0467j5172h0838n7431A08517h4621A4366b04467
$$ -98181 -39835 35947 112975 30467 15295 -80838 -138269 108517 -84621 14366 -204467
18490I3058c66481h8959G8779J048b06978D8377j2568j028b81699q8424a17287
$$ 93058 -366481 -88959 78779 79827 -206978 48377 35809 34781 -281699 -370123 -117287
18478g0787k4688G4476b97009B01970b01597c1654j2136m5054C79565i4090j81527
$$ -70787 -95475 74476 -297009 201970 -201597 -31654 -43790 -88844 379565 -94090 -275617
18467b75617B8813J09661a54736j18265B34451g9838H6370b49035A68370h2689
$$ -275617 28813 138474 -154736 -273001 234451 -79838 86370 -249035 168370 -82689
18456E98L28573j56062c15457J34532J4027o4427f5358I4100a30486A38365b26497
$$ 598 329171 173109 -315457 -180925 -166898 -231325 -65358 94100 -130486 138365 -226497
18444A99766f2069m9720r9624a9035j90827B26774a16787j78007K2365R1272O2476
$$ 199766 -62069 -111789 -211413 -19035 -209862 226774 -116787 -294794 -272429 -181157 -118681
18433a18681n7924j27608A26580l2911l2632a41251B247c50559d9723B48875b47316
$$ -118681 -176605 -304213 126580 93669 61037 -141251 2247 -350559 -49723 248875 -247316
18421C13321a53279I7283A3383b25339E7767b76895B6673L8873d5268j84561B41775
$$ 313321 -153279 97283 13383 -225339 57767 -276895 26673 65546 -45268 -229829 241775
18409a43625b1319j66973g0634C5120e2277C86389A53904E9252J94106H601f4619
$$ -143625 -21319 -188292 -70634 35120 -52277 386389 153904 59252 253358 8601 -64619
18397a65848N7911B56845D3909K79067c42788h7727j81474A95021F1494c3852
$$ -165848 -107937 256845 43909 322976 -342788 -87727 -269201 195021 61494 -33852
18386D10122A25082b09981i5383F6125a10302A62716c9234j30115B1662b53437
$$ 410122 125082 -209981 -95383 66125 -110302 162716 -39234 -169349 21662 -253437
18375h2870k81001c8350q0665C9423j7598J63767l3976a25507B029K12419N9946
$$ -82870 -363871 -38350 -119015 39423 21825 185592 151616 -125507 2029 214448 274394
18364B74394b80583B61602b32279a12181A56921b91618l3120I7420L9705a46638
$$ 274394 -280583 261602 -232279 -112181 156921 -291618 -324738 97420 137125 -146638
18353e2573A89687b39856e7253B28942i1845a6407j08955B02686b23405j53013
$$ -52573 189687 -239856 -57253 228942 -91845 -16407 -125362 202686 -223405 -376418
18343c76418a74693A77718b9040D7796a57279e8574B15624a92866I915K02746
$$ -376418 -174693 177718 -29040 47796 -157279 -58574 215624 -192866 9915 212661
18333B12661a66928B71705a1359l76981K9247J66612c5911A22385M7055D1386
$$ 212661 -166928 271705 -11359 -388340 -359093 -192481 -35911 122385 169440 41386
18322e7745J9583A71691a38128L2344E9359b30266J04807L8815j35081j8662d6550
$$ -57745 -38162 171691 -138128 -105784 59359 -230266 -125459 -86644 -221725 -240387 -46550
18310B20495a39690b452l5124D07907B7735R1569B8505b28416k12884F9961K13166
$$ 220495 -139690 -2452 -37576 407907 27735 119304 28505 -228416 -441300 69961 283127
18299B83127a93712Q5390B3607n154a54464l52901a99403K674B10280i0304A92383
$$ 283127 -193712 -108322 23607 18453 -154464 -507365 -199403 -196729 210280 -90304 192383
18287C25987m5493g7189A26489h0179l76791d0796j1751p3036A19030K39506E4716
$$ 325987 280494 -77189 126489 -80179 -456970 -40796 -52547 -125583 119030 358536 54716
18275b6217m31941J46977j36072E4946I278R7752a00385m3241A03288L64741c13603
$$ -26217 -458158 -311181 -447253 54946 9278 107030 -100385 -143626 103288 468029 -313603
18263A53858c10416a2237c046A4882K17519A5440L248f3780b2195g152j97605
$$ 153858 -310416 -12237 -3046 14882 232401 15440 18688 -63780 -22195 -7152 -204757
18252b04757k2151f2300G9607a01945G1223c86986Q3769G7828J63332I380i5740
$$ -204757 -226908 -62300 79607 -101945 71223 -386986 -303217 77828 241160 9380 -95740
18240A5570c7642j91152b1029A75034E0826b2923j31340f8607k21026A96957b43709
$$ 15570 -37642 -228794 -21029 175034 50826 -22923 -154263 -68607 -289633 196957 -243709
18228a12816N0194l15683i5352m7377j36894I3152a06327k15138C4805P7278a13406
$$ -112816 -62622 -378305 -95352 -142729 -279623 93152 -106327 -321465 34805 112083 -113406
18216D6796b55107l1668D3102a33961J5518m6820A34291m7707a30515q3475G015
$$ 46796 -255107 -286775 43102 -133961 -118443 -165263 134291 86584 -130515 -213990 7015
18204c4551J4606j5870B82472b71109D4904a5504g329J418k39433A78409a46946
$$ -34551 -19945 -35815 282472 -271109 44904 -15504 -7329 -5911 -245344 178409 -146946
18192A9764a70040g5953k37620D9191c38775H1075J27967h8432j2421A11958h1717
$$ 19764 -170040 -75953 -313573 49191 -338775 81075 209042 -88432 -100853 111958 -81717
18180G1347a99762g91C44599b01394Q4135G9795d6713I5550f9456k13779e2629
$$ 71347 -199762 -791 344599 -201394 -117259 79795 -46713 95550 -69456 -283235 -52629
18168a6187E3141P2877R1961a83184H7019a0959j06435j16178f8893h733l2636
$$ -16187 53141 126018 217979 -183184 87019 -10959 -117394 -233572 -68893 -8733 -41369
18157d1369A56963c3049B41661I2980C4002M4301e43435B4337N070c0832j33618
$$ -41369 156963 -33049 241661 92980 34002 78303 -543435 24337 29407 -30832 -164450
18146a64450H2768b37898h5928j56252i4501M1180C6946L29754B7387a71362d8210
$$ -164450 82768 -237898 -85928 -242180 -94501 -53321 36946 366700 27387 -171362 -48210
18134c8898k57684J22477a3572l59858a05624o9744B52003i8949C2521J34167
$$ -38898 -296582 -174105 -13572 -373430 -105624 -175368 252003 -98949 32521 166688
18124A66688b53990a2805l0568A2060f9125A54135b93527r8310D1344K42935C2770
$$ 166688 -253990 -12805 -43373 12060 -69125 154135 -293527 -391837 41344 284279 32770
18112D64999g2368H5433d5323m7266A30754a28137I9266D0041b39654L0445I2446
$$ 464999 -72368 85433 -45323 -92589 130754 -128137 99266 40041 -239654 -209209 92446
18100a33943a8747q269q3212C16210d18176a10701B57606A2356a06147j26650
$$ -133943 -18747 -27016 -110228 316210 -418176 -110701 257606 12356 -106147 -232797
18090b32797A37173b72735e7719B01213m8946c921A08439g1487B70971n0253C6351
$$ -232797 137173 -272735 -57719 201213 152267 -3921 108439 -71487 270971 220718 36351
18078A0492b36824K1249B00216J133a56013p5514B9307c958l68431J05970j15714
$$ 10492 -236824 -215575 200216 201349 -156013 -231527 29307 -3958 -372389 -266419 -382133
18067c82133B02936K2256f940C64848A20917n3874K642a5441G6345P3724j1003
$$ -382133 202936 225192 -6940 364848 120917 67043 69685 -15441 76345 150069 139066
18056A39066A2851g2461H7883l1365a44981c5540j10752B29669b77075B48013
$$ 139066 12851 -72461 87883 56518 -144981 -35540 -146292 229669 -277075 248013
18045a8094n5702k11722I4399b75510p9597A93885L187h1702B83i2331J6658D8803
$$ -18094 -73796 -285518 94399 -275510 -355107 193885 197072 -81702 283 -92331 -75673 48803
18032c1580l6560B34271a40868j49816A3056b84109R5243O294I4842d5973j2886
$$ -31580 -68140 234271 -140868 -290684 13056 -284109 -188866 -182572 94842 -45973 -58859
18021e8859j17515k48976B337h8030a5240j46571p3649Q9104B9064J23092a55126
$$ -58859 -176374 -425350 2337 -88030 -15240 -161811 -235460 -146356 29064 152156 -155126
18009H3985b28063A06959b90755A44245b69823E573a72533O5704b1109p2357F2236
$$ 83985 -228063 106959 -290755 144245 -269823 5573 -172533 -106829 -21109 -93466 62236
17997h1839j22404R4685C50287q7647a5350j09206n3959A29486E6504g7913j75704
$$ -81839 -204243 -109558 350287 262640 -15350 -124556 -178515 129486 56504 -77913 -253617
17986b53617A40123K49130A36974f4640A83118C656e0382C03447f952B83331D3436
$$ -253617 140123 389253 136974 -64640 183118 3656 -50382 303447 -6952 283331 43436
17974d2997A1701h378l8312r322b5448H0885F444J11653l2860l2959k189K0880
$$ -42997 11701 -8378 -46690 -56012 -25448 80885 6444 118097 85237 52278 50089 70969
17962G0969b83474g3546a8581l43247f813l34617E1700p225c6978G8324b97831
$$ 70969 -283474 -73546 -18581 -361828 -6813 -341430 51700 44475 -36978 78324 -297831
17950g8890j9311M6254j3327H5865a75191A71694e181k41399E0899J2687c07890
$$ -78890 -98201 -51947 -65274 85865 -175191 171694 -5181 -246580 50899 63586 -307890
17938I1943a15554j80456d771l39660B03968c15808c1058D1222b63210Q4959A66383
$$ 91943 -115554 -296010 -4771 -344431 203968 -315808 -31058 41222 -263210 -178251 166383
17926a3325I7205b04892P9620O1977A03540C7705a71202C23469a67698A3996e3011
$$ -13325 97205 -204892 -125272 -63295 103540 37705 -171202 323469 -167698 13996 -53011
17914a07185E7788a16577F4999J30750b13377Q7465C4362J1155d2889j32566b4317
$$ -107185 57788 -116577 64999 195749 -213377 -125912 34362 45517 -42889 -175455 -24317
17902I3579J10788I249a64659B20315a1109C6022N0381b80651J09125k5432A25098
$$ 93579 204367 9249 -164659 220315 -11109 36022 86403 -280651 -171526 -196958 125098
17890B2866b77402H8083A5666h7831j64756J14710n8856F9674a50380F1635b3635
$$ 22866 -277402 88083 15666 -87831 -252587 -137877 -196733 69674 -150380 61635 -23635
17878d2287j81706A01714J3326n823m7700a64361E5476J35167k7204M2236l5631
$$ -42287 -223993 101714 115040 109217 61517 -164361 55476 190643 163439 205675 170044
17867A70044B3470j0713K0551h2433c7617j85608A1381a0669p877k31214g5218
$$ 170044 23470 12757 33308 -82433 -37617 -223225 11381 -10669 -18546 -249760 -75218
17855a48036q8967A51063p0558b90874j0370a02864A66106a7097I70b19532D7629
$$ -148036 -237003 151063 80505 -290874 -301244 -102864 166106 -17097 970 -219532 47629
17843G2224g6350A1208R029L2689K63934b43372B83424b39556J16021c0711A39936
$$ 72224 -76350 11208 20237 52926 316860 -243372 283424 -239556 -123535 -30711 139936
17831A31944h4137A5386K10126I9771J1893i2740I7531a00823L3048K5319A48962
$$ 131944 -84137 15386 225512 99771 111664 -92740 97531 -100823 -67775 -42456 148962
17819E4454M6821K6064A1105f5344A57600F0149J29301a002j77845G9166J64210
$$ 54454 101275 127339 11105 -65344 157600 60149 189450 -1002 -178847 79166 243376
17808B43376I5587A9424H677b09619B13887a81298e1415A14043b86518h707k18145
$$ 243376 95587 19424 8677 -209619 213887 -181298 -51415 114043 -286518 -8707 -226852
17797b26852a06783l6833G5539j1195A5216n155L5668G168b56064J09911q2711
$$ -226852 -106783 -143616 75539 64344 15216 10061 45729 7168 -256064 -146153 -228864
17786b28864C1572a64422h1776j40902a03127M0213A708g60A30897Q3421F311
$$ -228864 31572 -164422 -81776 -222678 -103127 -62914 1708 -760 130897 214318 6311
17774H8235Q1862g2996r3880J7286A90281D1338M4960a36006E0383a47963j22370
$$ 88235 170097 -72996 -166876 -149590 190281 41338 86298 -136006 50383 -147963 -270333
17763b70333J34443A35796D313a620G9333a72362f8369m2266L9031j35401k0814
$$ -270333 -135890 135796 4313 -1620 79333 -172362 -68369 -110635 -71604 -207005 -227819
17752b27819i772q5221k1278j5329c4827l0998H465a30855f2106L0095r0217j19556
$$ -227819 -9772 -94993 -116271 -131600 -34827 -65825 8465 -130855 -62106 -32011 -122228 -241784
17740b41784f252q0907A43514a77859m1116F177a23849A39935c8656j42509j38951
$$ -241784 -6252 -87159 143514 -177859 -218975 6177 -123849 139935 -38656 -181165 -320116
17729c20116A11688D7571Q9741g1836A01368a76037E4834a7303k72415O9985K2797
$$ -320116 111688 47571 137312 -71836 101368 -176037 54834 -17303 -289718 -219733 -196936
17718a96936c4474A28925g5343j80504R6868B50616E2174K78045j41876h2655
$$ -196936 -34474 128925 -75343 -255847 -158979 250616 52174 330219 188343 -82655
17707D2194K70388a1884A15424J8739L0981F4402M8242q262c6014A30812J52573
$$ 42194 312582 -11884 115424 134163 165144 64402 112644 104382 -36014 130812 283385
17696B83385A24906b65373F979a467B50370a05018o3065J7115R058o1198A57164
$$ 283385 124906 -265373 6979 -1467 250370 -105018 -168083 -150968 -141910 -203108 157164
17684a89765B49671B7122f3923j86978H8342P2593a2144E1826b6721l67431E5023
$$ -189765 249671 27122 -63923 -250901 88342 160935 -12144 51826 -26721 -394152 55023
17672G8258d9013A36527d7094H554i7966B4500a3966B59116a06775k50865c2005
$$ 78258 -49013 136527 -47094 8554 -97966 24500 -13966 259116 -106775 -357640 -32005
17660f3440k758I8017A7743Q630J2382K56487A06058A9831i2378A77738G865J13641
$$ -63440 -66198 98017 17743 26373 38755 295242 106058 19831 -92378 177738 7865 121506
17648A21506b55964B37606H7543d23437A31950E5228g2274A44322E6877J07895
$$ 121506 -255964 237606 87543 -423437 131950 55228 -72274 144322 56877 164772
17638A64772a38803J4064b967A97018b16694n714M0191C3148c72169b0288f097
$$ 164772 -138803 -124739 -2967 197018 -216694 -222408 -182217 33148 -372169 -20288 -6097
17626E9315c4311A01776k1357a77931A85571K2556a54344e8524A13118b42687
$$ 59315 -34311 101776 80419 -177931 185571 208127 -154344 -58524 113118 -242687
17615A28746b17611C49578J06384b59688R5452A07398a48277C9258O6844b76130
$$ 128746 -217611 349578 455962 -259688 -164236 107398 -148277 39258 106102 -276130
17604A49721D96g3558j40406K0869a248B06348a19472B49788g9218B10680a54587
$$ 149721 496 -73558 -213964 -193095 -1248 206348 -119472 249788 -79218 210680 -154587
17592c23384c5885B26302f4120B69676p5910n1906J23922Q4261A7309g3583A63207
$$ -323384 -35885 226302 -64120 269676 193766 141860 265782 350043 17309 -73583 163207
17580I631c854B78258j32704a5408q4479A55361E1457a32160A36476J501a5959
$$ 9631 -3854 278258 145554 -15408 -99887 155361 51457 -132160 136476 137977 -15959
17568E4773J94138I6588b97963J34364J0379M6753A10568h1171A67936b01177
$$ 54773 248911 96588 -297963 -163599 -153220 -106467 110568 -81171 167936 -201177
17557g2911l1360A8508L36283b97510a12504B39959N3341C1128J12409g659q0127
$$ -72911 -104271 18508 354791 -297510 -112504 239959 293300 31128 143537 -7659 -87786
17546h7786J6491E1249j4723J14484F5493L10145I1198O1022b67695C89728C5504
$$ -87786 -71295 51249 36526 151010 65493 375638 91198 152220 -267695 389728 35504
17534B55967a30636l1841E5068a58520d8107A97455L3063B8769K41571Q5605o8134
$$ 255967 -130636 -162477 55068 -158520 -48107 197455 230518 28769 270340 355945 287811
17523B87811a62949A05021g3426B24680G6156N0428K24337j05868d533n569c480
$$ 287811 -162949 105021 -73426 224680 76156 126584 350921 245053 -4533 -10102 -3480
17511B5581c5835j06130c6748m2883k13976I3936J89270d21667g561j7185D7340
$$ 25581 -35835 -141965 -36748 -79631 -293607 93936 283206 -421667 -7561 -24746 47340
17499a96712A26542J44752j18983e29629A36547J55245J14783D6166B2032b13866
$$ -196712 126542 271294 152311 -529629 136547 291792 406575 46166 22032 -213866
17488A92967q3804K6661O0662r1577l1023R9252e5914l4762E6308a02011A16384
$$ 192967 109163 135824 196486 104909 73886 173138 -55914 -90676 56308 -102011 116384
17476B59233p5294a69253d8826I6492d4804E4920B5681c58668B7195a02566A40176
$$ 259233 183939 -169253 -48826 96492 -44804 54920 25681 -358668 27195 -102566 140176
17464B70776J20559a76683f0189A53176n9924a48828e1518H7862K73772b5557
$$ 270776 391335 -176683 -60189 153176 93252 -148828 -51518 87862 361634 -25557
17453G0707a2101A21084J29628K41184k06673j0734r3764e3255B92176p3530I3905
$$ 70707 -12101 121084 250712 491896 285223 274489 180725 -53255 292176 218646 93905
17441A22075K90001a31776B67386J71748A55468J15876n6310j9277F3092J5499
$$ 122075 412076 -131776 267386 439134 155468 271344 215034 195757 63092 78591
17431G8591N22869a30154K2310M4500m6220D05389j08108p1812L3853K11494k13789
$$ 78591 601460 -130154 -107844 -63344 -109564 405389 297281 225469 259322 470816 257027
17420B57027r4209K39972j48080a2838C69686C103M36619j60481G6857P807M0793
$$ 257027 162818 402790 254710 -12838 369686 3103 439722 279241 76857 84664 125457
17409A25457K19392I4935K63815n2192E0463R8106a05320C37485A29227a48707
$$ 125457 344849 94935 358750 306558 50463 148569 -105320 337485 129227 -148707
17398C29667K28765c781p8867m5909C4474L3127N7780K49040E4435K99066A27419
$$ 329667 558432 -3781 -82648 -128557 34474 67601 125381 374421 54435 353501 127419
17386a09729A08179J8830K3903j2192J01026G7113f9142B57670o4494a80235C62009
$$ -109729 108179 127009 150912 138720 239746 77113 -69142 257670 193176 -180235 362009
17374D35450k09241J26856E6590k4431L9313A6422P1111J25324M9402C6613b6333
$$ 435450 226209 353065 56590 32159 71472 16422 87533 212857 262259 36613 -26333
17362i6134p349p6123A23671J16881c7034B60358J04582j55951Q0106a30148B77513
$$ -96134 -103483 -179606 123671 240552 -37034 260358 364940 208989 289095 -130148 277513
17350H1051J19056o7731J43801p4856B6352J84921F7942d3650C71775a51186c1012
$$ 81051 200107 132376 276177 201321 26352 211273 67942 -43650 371775 -151186 -31012
17338C60042g9095E203M39128H9900K92991A46994J15136b02903A26926n9423
$$ 360042 -79095 5203 444331 89900 382891 146994 262130 -202903 126926 67503
17328F7503K58644a991m1360B35039G5898k5473L58488e732A35456c0227A82947
$$ 67503 326147 -1991 -43351 235039 75898 50425 408913 -5732 135456 -30227 182947
17316A52460J4341j9287j1219j1330f0573C10868M3075c2654I9980J0198K41618
$$ 152460 166801 147514 136295 124965 -60573 310868 353943 -32654 99980 110178 351796
17305C51796k3212J73364c4541A63100J27066c6408p5791B593J75990n7719d7519
$$ 351796 328584 501948 -34541 163100 290166 -36408 -112199 2593 178583 120864 -47519
17293C1491L40817A51251K8650B6951J88581r4814a05108C27471p9045a24881
$$ 31491 372308 151251 179901 26951 215532 120718 -105108 327471 248426 -124881
17282E33020A86853O5656K16174A56168J06031I0660k533K00869j37167J66516
$$ 533020 186853 252509 468683 156168 262199 90660 88127 288996 151829 318345
17272C18345F982P6425J35350A6305g8965L4796B15074E124a34631C64933i5184
$$ 318345 6982 83407 218757 16305 -78965 -44169 215074 5124 -134631 364933 -95184
17260B55547N4350C5148L8955J73951j06583J48234E9191K00751a84984H5137
$$ 255547 309897 35148 74103 248054 141471 289705 59191 259942 -184984 85137
17249c20386I4681P8782M1919p7411J02678i7471B45842j0715F8158Q6081J4454
$$ -320386 94681 173463 215382 137971 240649 -97471 245842 235127 68158 154239 168693
17238A68693g9269D35021A53714C2608a562A02774L73381j23325J50100n5979
$$ 168693 -79269 435021 153714 32608 -1562 102774 476155 352830 502930 446951
17228D46951a16357I4179L68338o4712K30017j95061f6210H3603O6942l1098l9282
$$ 446951 -116357 94179 462517 397805 627822 432761 -66210 83603 150545 119447 80165
17217H0165L02433A71966p7863K92577o496A84577J12232J2416J10980A57518
$$ 80165 382598 171966 94103 386680 380184 184577 296809 309225 420205 157518
17206A77636G4254L09713B5720a42503B70091k6042h279C7442c9155D15960k07664
$$ 177636 74254 383967 25720 -142503 270091 244049 -8279 37442 -39155 415960 208296
17195B08296B3038K28866l0893I4762J00968m2268J79511A51649G2325N8440K89186
$$ 208296 23038 251904 221011 94762 195730 153462 332973 151649 72325 130765 419951
17184D19951A58482p6575K72334j3531j65788C310K07226L3184j3877p182l1411
$$ 419951 158482 81907 354241 340710 174922 3310 210536 243720 229843 222661 191250
17173A91250C5892J79107K15418j01524k9549E5414M87493b43945F42669A68677
$$ 191250 35892 214999 430417 328893 299344 55414 542907 -243945 642669 168677
17162A87827J0218a9412B11985J68076o6235M8843J4795j9172p6196J9450J87044
$$ 187827 198045 -19412 211985 380061 313826 362669 377464 358292 282096 301546 488590
17151D88590k26596n6840o3759J16546J10331e9731D86503j03165j10404N2275
$$ 488590 261994 205154 141395 257941 368272 -59731 486503 383338 272934 325209
17141C25209p4451R1310p6046j637R1030m8883a57880B20758L20717k22661J32668
$$ 325209 250758 342068 266022 264385 355415 306532 -157880 220758 541475 318814 451482
17130D51482l9022A84376q3243B0893L05801n7001L8234o3172A16724J81888f7669
$$ 451482 412460 184376 101133 20893 326694 269693 307927 244755 116724 298612 -67669
17118e3214F17871A54821M92719k39453P4708J37677A92629J87789q4648H1080
$$ -53214 617871 154821 647540 408087 482795 620472 192629 380418 295770 81080
17107B31849J24239b3195C67110J60178j21129q9963r0737m2614J85172A49572
$$ 231849 356088 -23195 367110 527288 406159 316196 225459 182845 368017 149572
17096B61988L40172p396B43553J95342m3157J69089j73804R1464j11136m9438
$$ 261988 602160 594764 243553 438895 395738 564827 391023 482487 371351 321913
17086C21913K47145k05076j09925K24308j51506o8689A14671L00455j11559K22574
$$ 321913 569058 363982 254057 478365 326859 258170 114671 415126 303567 526141
17076E26141K58991C27376J41225k26884j2835J65560A56624L63780j44019Q3572
$$ 526141 785132 327376 468601 241717 228882 394442 156624 520404 376385 459957
17066D59957K1317j21207J46907j63839J99807J22388m2106N7408j55969J45493
$$ 459957 481274 360067 506974 343135 542942 665330 623224 680632 524663 670156
17056F70156N7063k17515M6357k26987K26496O7365j35574J26756k81618K98360
$$ 670156 727219 509704 556061 329074 555570 622935 487361 614117 332499 630859
17046F30859k58263L9800A73058J48970L86984k15727P0963k58888N68795k80838
$$ 630859 372596 412396 173058 322028 709012 493285 564248 305360 874155 593317
17036E93317r4335j97021N81772l62825o9237M41087C60205M92128l20658j70663
$$ 593317 498982 301961 883733 520908 451671 892758 360205 852333 531675 361012
17026C61012J29341R4478R9869J00407j64257L1290J4413n3001k82770M37704
$$ 361012 490353 584831 684700 785107 620850 652140 666553 613552 330782 768486
17016G68486B54377K35550L24213C71267N03143m3848m03547J63868K04833j26106
$$ 768486 254377 489927 814140 371267 874410 830562 427015 590883 795716 669610
17006F69610k12328J4798J93683M7679J14531M2575l2137l17625M17158j77081
$$ 669610 457282 472080 665763 713442 827973 870548 838411 520786 937944 760863
16996G60863j15164J42884k27891L65964j80032M3637C07207M80524J86616N3079
$$ 760863 645699 788583 560692 926656 746624 790261 307207 787731 974347 1027426
16986A027426J76499k08682m28096J1084J08133L47797r2984k82649k31015M13114
$$ 1027426 1203925 995243 567147 578231 686364 1034161 941177 658528 427513 840627
16976H40627o3630k48231Q2927L8499K75536j20585L03248k86358j35208K0314
$$ 840627 776997 528766 611693 650192 925728 805143 1108391 822033 686825 707139
16966G07139J78978J48008m0598q51P603l48676Q4802J07843j1834K04449j50891
$$ 707139 886117 1034125 993527 992676 1000279 651603 736405 844248 832414 1036863 885972
16955H85972J6044p5000L68500k27898J02113j57349l1582J16713l34012L13605
$$ 885972 902016 827016 1195516 967618 1069731 912382 880800 997513 663501 977106
16945I77106K003p483L7558J84083k3745J09243l21018j28044K44971L26120k52103
$$ 977106 979109 971626 1009184 1193267 1169522 1278765 957747 829703 1074674 1400794 1148691
16934A148691k43141J85406k3035M7097j11472n4877J93202n4674J48488K62254
$$ 1148691 905550 1090956 1067921 1115018 1003546 948669 1141871 1087197 1235685 1497939
16924A497939k90606J02931j32129P7094j37190K60250L36007m03688r4980J09284
$$ 1497939 1207333 1310264 1178135 1255229 1118039 1378289 1714296 1310608 1215628 1324912
16914A324912R4179j96072J97113K5762k27127L55837q1615K45415j14790J11264
$$ 1324912 1419091 1223019 1420132 1445894 1218767 1574604 1492989 1738404 1623614 1734878
16904A734878m266q8831O8937K00752o1668l30337J66593Q623K22110k02976k1026
$$ 1734878 1730612 1641781 1710718 1911470 1849802 1519465 1686058 1694681 1916791 1713815 1692789
16893A692789K26800o0719j02301J55058K0304n46010L47308M7954M70834p39014
$$ 1692789 1919589 1858870 1756569 1911627 1931931 1385921 1733229 1781183 2252017 1513003
16883A513003O54828J73490k23224j10445J66690r3261M5497K60260j14846L48493
$$ 1513003 2167831 2341321 2118097 2007652 2174342 2081081 2126578 2386838 2271992 2620485
16873B620485k67096m9290l99095L68173R1602j07466K07677k4561l7228N4669
$$ 2620485 2353389 2304099 1905004 2273177 2364779 2257313 2464990 2440429 2403201 2457870
16863B457870l7852K84375P5086j67971r6516K61574m150J24346K00280l91816
$$ 2457870 2420018 2704393 2779479 2611508 2514992 2776566 2772416 2896762 3097042 2705226
16853B705226j17002J35845K41303L579O1127K20608j23920Q5095k02611J64369
$$ 2705226 2588224 2724069 2965372 2968951 3030078 3250686 3126766 3211861 3009250 3173619
16843C173619l2101m4305L49120k14714L18681K17958l91126L32376k0067L36963
$$ 3173619 3141518 3097213 3446333 3231619 3550300 3768258 3377132 3709508 3689441 4026404
16833D026404k29348K32328J54091j14059K25341M0920j20403K05274M0239K0945
$$ 4026404 3797056 4029384 4183475 4069416 4294757 4335677 4215274 4420548 4460787 4481732
16823D481732L34633j06964L60109k92350L93273k53267L27053J43727Q1235J77917
$$ 4481732 4816365 4709401 5069510 4777160 5170433 4917166 5244219 5387946 5469181 5647098
16813E647098o4055N65088l25083O3411K90865l3631K75642m1438N03763n04912
$$ 5647098 5583043 6148131 5823048 5886459 6177324 6143693 6419335 6377897 6881660 6376748
16803F376748P50622R3187k68591N90886q1279J86164L52093J39578J71987K50295
$$ 6376748 7127370 7220557 6951966 7542852 7461573 7647737 7999830 8139408 8311395 8561690
16793H561690K66961L47192j30063M00116L28752L66514L8586J56960N39347J41694
$$ 8561690 8828651 9175843 9045780 9445896 9774648 10141162 10179748 10336708 10876055 11017749
16783A1017749q3527O93431M01753o951J97488Q67756L52583L58879N83912L68547
$$ 11017749 10934222 11627653 12029406 12022455 12219943 13087699 13440282 13799161 14383073 14751620
16773A4751620M03886K41618O75764M91398L87181Q17961O41645P20336M67015
$$ 14751620 15155506 15397124 16072888 16564286 16951467 17769428 18411073 19131409 19598424
16764A9598424N89515O90996J043907P63754Q28448J176858Q25538J091191J158930
$$ 19598424 20187939 20878935 21922842 22686596 23515044 24691902 25517440 26608631 27767561
16755B7767561J293561P41559J276468J743736J709521J563030J649784J676383
$$ 27767561 29061122 29802681 31079149 32822885 34532406 36095436 37745220 39421603
16747C9421603J839677K150937K167992J836069K537432K959591K810746K619965
$$ 39421603 41261280 43412217 45580209 47416278 49953710 52913301 55724047 58344012
16739E8344012L081152L720974L528215M047060M115294M247003M676392M815955
$$ 58344012 61425164 65146138 68674353 72721413 76836707 81083710 85760102 90576057
16731I0576057N275119N207051N729797O005601N991472N877014O347896O074708
$$ 90576057 95851176 101058227 106788024 112793625 118785097 124662111 131010007 137084715
16723A37084715N941773N806286N228715M701724M127900L284233K262612J489001
$$ 137084715 143026488 148832774 154061489 158763213 162891113 166175346 168437958 169926959
16715A69926959O5268l96943j672817k826478l497414m311733n502008n341891
$$ 169926959 169992227 169595284 167922467 165095989 161598575 157286842 151784834 146442943
16707A46442943n758865o042347o326418o279951o125505n994146o066471n663455
$$ 146442943 140684078 134641731 128315313 122035362 115909857 109915711 103849240 98185785
16699I8185785n319725n236242n293206m533234m173023m342071l821105l451012
$$ 98185785 92866060 87629818 82336612 77803378 73630355 69288284 65467179 62016167
16691F2016167l524451l046603k665615l054062k534216k621333k095347k319796
$$ 62016167 58491716 55445113 52779498 49725436 47191220 44569887 42474540 40154744
16683D0154744j406690j992142k046628j313734j226455j849209j385334j346393
$$ 40154744 38748054 36755912 34709284 33395550 32169095 30319886 28934552 27588159
16675B7588159r97680j178753j065909q58885j351178o83301o03689j051290p46567
$$ 27588159 26590479 25411726 24345817 23486932 22135754 21452453 20848764 19797474 19050907
16666A9050907m35047j027901n72467m78220m01966n20158n37807n28796o23910
$$ 19050907 18615860 17587959 17015492 16537272 16135306 15615148 15077341 14548545 13924635
16657A3924635j11851n56204q69749k99910k24301m40293j12935m48518j44826
$$ 13924635 13812784 13256580 12386831 12086921 11862620 11422327 11309392 10860874 10716048
16648A0716048o77616N1731n94195l4546n85036K04215j70039o26826j5707n70077
$$ 10716048 10038432 10090163 9495968 9461422 8876386 9080601 8910562 8283736 8268029 7697952
16638G697952j53476m7780j83344j26952n0690k49719q6106j66691l75714K80231
$$ 7697952 7544476 7496696 7313352 7186400 7135710 6885991 6799885 6633194 6257480 6537711
16628F537711p20181K39653k67129j45258L1085o97324M2190K49566l49660K31295
$$ 6537711 5817530 6057183 5790054 5644796 5675881 4978557 5020747 5270313 4920653 5151948
16618E151948m47271J75736j66663J14128p26192M37641k34824P3493k44002j14701
$$ 5151948 4704677 4880413 4713750 4827878 4101686 4539327 4304503 4377996 4133994 4019293
16608D019293N6373j53680J1501K46069l98206k47521m9290J08080k34355J96237
$$ 4019293 4075666 3921986 3933487 4179556 3781350 3533829 3484539 3592619 3358264 3554501
16598C554501k7870j17157l21309K86161l27889J43617k46784j50840p5220q322
$$ 3554501 3526631 3409474 3088165 3374326 3046437 3190054 2943270 2792430 2717210 2708888
16588B708888j66493L04832K0813n49819K58977k10855M13861m72276j07643K60692
$$ 2708888 2542395 2847227 2868040 2318221 2577198 2366343 2780204 2307928 2200285 2460977
16578B460977k61554N1015K17784j46064l5474l47727j4714J85873j05478J4969
$$ 2460977 2199423 2250438 2468222 2322158 2286684 1938957 1924243 2110116 2004638 2019607
16568B019607j8595j16195p1646N8204k0460M26562j04908k70198k89090L20200
$$ 2019607 2001012 1884817 1813171 1871375 1850915 2277477 2172569 1902371 1613281 1933481
16558A933481r9226j91345j47243K48071K6190r3200K80565n06586J63893l17841
$$ 1933481 1834255 1642910 1495667 1743738 1769928 1676728 1957293 1450707 1614600 1296759
16548A296759R0980J88916j91048L394j05968J26769N8190j67550j70414J7876
$$ 1296759 1387739 1576655 1385607 1389001 1283033 1409802 1467992 1300442 1130028 1147904
16538A147904o7773K32570q4159L06779N6040l48309q8884K30620j84141k5176
$$ 1147904 1080131 1312701 1228542 1535321 1591361 1243052 1154168 1384788 1200647 1175471
16528A175471l0227J26519N799l07166M05652l59436L88610l68093J8210Q640
$$ 1175471 1145244 1271763 1277562 970396 1376048 1016612 1405222 1037129 1055339 1063979
16518A063979N861j87200k3911L60699k36657J86229m18127O45743m93038Q7811
$$ 1063979 1069840 882640 858729 1219428 982771 1169000 750873 1396616 903578 991389
16508I91389p6297P7263j92033J44437m2692r3159K41788l369J2971k94897j46359
$$ 991389 915092 992355 800322 944759 902067 808908 1050696 1047327 1060298 765401 619042
16497F19042Q6624J30919l08015J41995M442k5567M0324j3039O8283P123J44668
$$ 619042 705666 836585 528570 670565 675007 649440 689764 676725 745008 752131 896799
16486H96799r1822Q2925k1688k39631r18l2272J08553O6768l12978K92931k22903
$$ 896799 804977 887902 866214 626583 625665 593393 701946 768714 455736 748667 525764
16475E25764J8509M1725M37248j20422j90572o7298L4094K8337k64157L35999
$$ 525764 544273 585998 1023246 902824 712252 644954 679048 707385 443228 779227
16465G79227q9365j28841j16610K308M09684k94857j22665o1563K9741M01470
$$ 779227 689862 561021 444411 446719 856403 561546 438881 377318 407059 808529
16455H08529l05990K54655C41366k4967K36079k31674J66646j41772L34900j79557
$$ 808529 502539 757194 341366 316399 552478 320804 487450 345678 680578 501021
16445E01021J81697p4972B54854M11291j58895j53382M03741B66714K20856j7805
$$ 501021 682718 607746 254854 666145 507250 353868 757609 266714 487570 469765
16435D69765M20830m36164D6208M58042j03691j57390J58987j86593n104L34644
$$ 469765 890595 454431 46208 504250 400559 243169 402156 215563 210459 545103
16425E45103J94342k34990K70315k77507O6033K56794B89136R0058J889J81611
$$ 545103 739445 504455 774770 497263 563296 820090 289136 379194 381083 562694
16415E62694j76595j35809K97824F4370L55543k7134Q4095l9237j21253J29204
$$ 562694 386099 250290 548114 64370 419913 392779 476874 437637 316384 445588
16405D45588a6067B66096n5348L68624A34839K07197M0098j8370m2083j48523
$$ 445588 -16067 266096 210748 579372 134839 342036 382134 363764 321681 173158
16395A73158K05050P4703p422M7565k19384J02820j84609K75500j80601r3596
$$ 173158 378208 452911 445489 493054 273670 376490 191881 467381 286780 193184
16385A93184D9419L47353A98285J86445j26641L2649J9648K71533B11596E4842
$$ 193184 49419 396772 198285 384730 258089 290738 310386 581919 211596 54842
16374H1923g3088A99161J55625o3976A14686n0324J80709F6244l982R8678K11070
$$ 81923 -73088 199161 354786 290810 114686 64362 245071 66244 62262 160940 372010
16363C72010j60966o5860P4860A04098J85078L7310A01542K33902j17814Q030
$$ 372010 211044 145184 220044 104098 289176 326486 101542 335444 217630 225660
16353B25660o283a88458A55239g4625A65388J21689h7514A43052K17870J09096
$$ 225660 219377 -188458 155239 -74625 165388 287077 -87514 143052 360922 470018
16343D70018A25266K6188l014Q614N0896K66851j48359F3543L70877r2987p3193
$$ 470018 125266 151454 148440 157054 207950 474801 326442 63543 434420 341433 268240
16332B68240c1573C96980j7370j52833n7239a02602A15039Q3639M2470C2706c75597
$$ 268240 -31573 396980 379610 226777 169538 -102602 115039 198678 241148 32706 -375597
16320D5385L28637O5433b39412F651O9337M9536C6477Q2173J74052o8409m5015
$$ 45385 374022 439455 -239412 6651 75988 125524 36477 118650 292702 224293 179278
16309A79278D0843J85270E8365O9699m8058L08492c98604A3339L32659a07125
$$ 179278 40843 226113 58365 128064 80006 388498 -398604 13339 345998 -107125
16298B3120c9720j00381B87251j30202i8550A3340i7742A10852A3150L09984A02990
$$ 23120 -39720 -140101 287251 157049 -98550 13340 -97742 110852 13150 323134 102990
16286A25431L8091Q1493i3510C67049A74453J67852D0160L79361A49947D5649
$$ 125431 163522 245015 -93510 367049 174453 342305 40160 419521 149947 45649
16275b07511P0653C46940B8006c816B19454C1365f9816B29796N2208i5060d0345
$$ -207511 -136858 346940 28006 -3816 219454 31365 -69816 229796 282004 -95060 -40345
16263a16531A24311E9977N6679a5404A17532L84142A96973P1523o8926a38965
$$ -116531 124311 59977 116656 -15404 117532 501674 196973 268496 199570 -138965
16252a44063f6675C24005K46155B50449J08784A13920J02787B6510J21640K02396
$$ -144063 -66675 324005 570160 250449 359233 113920 216707 26510 148150 350546
16242C50546m6501e2193a9757A47502P2151a46855B39905n6446J8703E616N6805
$$ 350546 304045 -52193 -19757 147502 219653 -146855 239905 183459 202162 5616 62421
16231F2421i8599D72161G2005B8698J32624a26904k4520A10051J08232p0838o450
$$ 62421 -98599 472161 72005 28698 161322 -126904 -151424 110051 218283 147445 140995
16220A40995B8549f1889L204k1330p284A22585M726K31223J24450a69530O3423
$$ 140995 28549 -61889 -58685 -80015 -87299 122585 127311 358534 482984 -169530 -106107
16209a06107D5566j8217O9015k6135d43317A14365Q5799K57871E4109J51276E6165
$$ -106107 45566 27349 96364 70229 -443317 114365 200164 458035 54109 205385 56165
16197g1883q9043A20689q878C1370b72134D07267a63654j92910h9064C1080b23402
$$ -71883 -160926 120689 111811 31370 -272134 407267 -163654 -356564 -89064 31080 -223402
16185A66367O2700c8598q2337B34041q673i7378j418A61536j2711a45702G5597
$$ 166367 229067 -38598 -120935 234041 225368 -97378 -98796 161536 148825 -145702 75597
16173b8650r955A65234b7817j4296j21102I7258J9305E2591M9702B2329a62722
$$ -28650 -38605 165234 -27817 -42113 -163215 97258 116563 52591 102293 22329 -162722
16161h5851G0107b11260h4229B65056E8304J94914m4087N9684B0781J97043a12705
$$ -85851 70107 -211260 -84229 265056 58304 253218 209131 268815 20781 217824 -112705
16149a88229K0116l2246h0017q1149A25739K05344b09728C87516i8846M2786C5588
$$ -188229 -168113 -200359 -80017 -161166 125739 331083 -209728 387516 -98846 -56060 35588
16137A35522J28495n1181J7095d8731I7684L5444a61174P9108b5143A0437K72941
$$ 135522 264017 212836 229931 -48731 97684 133128 -161174 -82066 -25143 10437 283378
16126B83378g682A82104F9192i5905B21626c7343A03232P412k6518O9966o5964
$$ 283378 -7682 182104 69192 -95905 221626 -37343 103232 110644 84126 154092 88128
16115H8128N9277c8349A59766h7811A90065a96724G0987b91950b0331C1602J97767
$$ 88128 147405 -38349 159766 -87811 190065 -196724 70987 -291950 -20331 31602 229369
16104B29369I6673a33965A6267J90500d0569A60515a83315A63639E9942d9857
$$ 229369 96673 -133965 16267 206767 -40569 160515 -183315 163639 59942 -49857
16093I6837b42325F4755b24359b415m16606B03242m5779a56349A39702o5238a90773
$$ 96837 -242325 64755 -224359 -2415 -419021 203242 157463 -156349 139702 74464 -190773
16081b2625p4176B89737f2924b7700j22705O2601j31713F9796a74844B03152a66119
$$ -22625 -96801 289737 -62924 -27700 -150405 -87804 -219517 69796 -174844 203152 -166119
16069A1930N5193a070A72343D4717b36934e6814o3618M9598B58893a85518c3889
$$ 11930 67123 -1070 172343 44717 -236934 -56814 -120432 -70834 258893 -185518 -33889
16057b83118J12808C363b26990d1612A36005J16984a31298k259G746d06205J85377
$$ -283118 -170310 3363 -226990 -41612 136005 252989 -131298 -133557 7746 -406205 -220828
16046b20828i1924B29576m7448a90112k6323E306O2923O390J4614a26284C9083
$$ -220828 -91924 229576 182128 -190112 -216435 5306 68229 74619 89233 -126284 39083
16034a08814j27318D66391a55725j13094h2549b1512k49472d5084B5373d77567
$$ -108814 -236132 466391 -155725 -268819 -82549 -21512 -270984 -45084 25373 -477567
16023B9609a52978A45703E059a39155c8955j24390D0501J60984b47188a9407m58245
$$ 29609 -152978 145703 5059 -139155 -38955 -163345 40501 201485 -247188 -19407 -477652
16012d77652d8031a3618A28458D5133a19028d0509c837C4562a0114D6355L3872
$$ -477652 -48031 -13618 128458 45133 -119028 -40509 -3837 34562 -10114 46355 80227
16001H0227f8939L487j64670A07928d08872A15633K7372a67550b5158C69488A52358
$$ 80227 -68939 -65452 -230122 107928 -408872 115633 143005 -167550 -25158 369488 152358
15989h6523j53466G0607C0238O9823J42556J69124j42808J00108J67667A19378
$$ -86523 -239989 70607 30238 100061 242617 411741 268933 369041 536708 119378
15978C71209M6918a38827B18099i5363A88554c36921I2135o730i4716j71889P1948
$$ 371209 418127 -138827 218099 -95363 188554 -336921 92135 85405 -94716 -266605 -194657
15967a94657A94878M9291F8489N4015D1285b05081D4545O3591b67174C7828f5344
$$ -194657 194878 244169 68489 122504 41285 -205081 44545 108136 -267174 37828 -65344
15955b7900n3691k02971j04019C00889a61690E0794P1991c7453j15549j03058
$$ -27900 -81591 -284562 -388581 300889 -161690 50794 122785 -37453 -153002 -256060
15945b56060b5726E9387j4631J87293b65222d7439j54635A5952b50578O5797d5678
$$ -256060 -25726 59387 44756 232049 -265222 -47439 -202074 15952 -250578 -184781 -45678
15933a17629j96660B95637m4709I7560B3716a3434A60280B3196K06857I942b41139
$$ -117629 -314289 295637 250928 97560 23716 -13434 160280 23196 230053 9942 -241139
15921b01861N2726r728A06789a43973B60950d0242A7492R6611h4158k7401M8474
$$ -201861 -149135 -158863 106789 -143973 260950 -40242 17492 114103 -84158 -111559 -63085
15910f3085J4987G3218c57118i2157K7586B74184b08812J02423B36111a51973
$$ -63085 -48098 73218 -357118 -92157 -64571 274184 -208812 -106389 236111 -151973
15899a517F7704i836C22006B7638K0801b87141C5567A3809J3134c80212g1001
$$ -1517 67704 -9836 322006 27638 48439 -287141 35567 13809 26943 -380212 -71001
15887e5211a0570l85551B34080B6334K20307b06670B572L9399N5567J67875q7106
$$ -55211 -10570 -396121 234080 26334 246641 -206670 2572 41971 97538 265413 178307
15876A78307J53696a56996d3660q9211n5818B646J29184f443j17703m4814e6047
$$ 178307 332003 -156996 -43660 -132871 -188689 2646 131830 -6443 -124146 -168960 -56047
15864g0567h902A28155c86040C723b4032b903A9606R0945C2865a85429O0464A71800
$$ -70567 -8902 128155 -386040 3723 -24032 -2903 19606 110551 32865 -185429 -124965 171800
15851A71277J98309b9767H9770Q4346c9710n42736b13165b6097G4257J25926I6541
$$ 171277 369586 -29767 89770 174116 -39710 -582446 -213165 -26097 74257 200183 96541
15839A03200e2639n2397j3685d6831j38205A67823a0860I7069g818C62481a74433
$$ 103200 -52639 -105036 -118721 -46831 -185036 167823 -10860 97069 -7818 362481 -174433
15827b24263j38994a5246D0197K60733j30924b73551I6944a7038m7586J836j80235
$$ -224263 -363257 -15246 40197 300930 170006 -273551 96944 -17038 -64624 -62788 -243023
15816b43023D46405j86934b25456B19588b66017L3386C0549a81318A56353i6841
$$ -243023 446405 259471 -225456 219588 -266017 -232631 30549 -181318 156353 -96841
15805a45246l15975E2040e3485D1592J62605O9680h4680p9457a4294k2292k3574
$$ -145246 -461221 52040 -53485 41592 204197 273877 -84680 -164137 -14294 -36586 -60160
15794f0160C597i2642J234k0890B1601g1072F0369R2899D8128M181c93906A60779
$$ -60160 3597 -92642 -91408 -112298 21601 -71072 60369 153268 48128 52309 -393906 160779
15781a02356H378a29848A46028a89951H3702J1531I51b1991k39576J05816A03656
$$ -102356 8378 -129848 146028 -189951 83702 95233 951 -21991 -261567 -155751 103656
15769H5119b6286B27513a44714B41604h9942B37215g5518j5648o211B97282C3863
$$ 85119 -26286 227513 -144714 241604 -89942 237215 -75518 -91166 -97377 297282 33863
15757a26178a7791j54762B40080h1386j26222d3403H5639b94608a8734q3154c2867
$$ -126178 -17791 -172553 240080 -81386 -207608 -43403 85639 -294608 -18734 -101888 -32867
15745B35940a22532A35596o1642k9469a89469j25712H8775D3954l892b71390O7589
$$ 235940 -122532 135596 73954 44485 -189469 -315181 88775 43954 40062 -271390 -203801
15734b03801O3231p329k03727g9546D14489b1986E669g8002l20812a3342O534
$$ -203801 -140570 -147899 -351626 -79546 414489 -21986 5669 -78002 -398814 -13342 -6808
15723f808k60222J29357D6584J66065d15922f5152A42942c3558a2578A06486N1138
$$ -6808 -267030 -137673 46584 212649 -415922 -65152 142942 -33558 -12578 106486 157624
15712A57624i0967d4280J9579E0228J05470b33023A95181J616a25608F4318g7279
$$ 157624 -90967 -44280 -24701 50228 155698 -233023 195181 196797 -125608 64318 -77279
15700B60342r3230c56376a48922d1567p8990j32906B15544a26866E3177a51988
$$ 260342 167112 -356376 -148922 -41567 -120557 -253463 215544 -126866 53177 -151988
15689f8411q1892N5933K5567A03852K74839j84157b8147A00094b36058j00230
$$ -68411 -150303 -94370 -68803 103852 378691 194534 -28147 100094 -236058 -336288
15679c36288C225e9336b947j53437q2226B37116A5823J45572K64121a90339A86224
$$ -336288 3225 -59336 -2947 -156384 -238610 237116 15823 161395 425516 -190339 186224
15667b50687j14531a62053c4379q4723k35847J76728A9122L43729f6258k0194
$$ -250687 -365218 -162053 -34379 -119102 -354949 -178221 19122 362851 -66258 -86452
15657h6452j77008j06208a34797A10747b46296J4408C6623e9029l06225d3733
$$ -86452 -263460 -369668 -134797 110747 -246296 -231888 36623 -59029 -365254 -43733
15646b98117C77607d2451n0273I9395a9315o1150E1781a75261j22854r8637F7380
$$ -298117 377607 -42451 -92724 99395 -19315 -80465 51781 -175261 -298115 -396752 67380
15634b44122m8739A45928b85767q123n999B4898J33334c16264G0168b37033C00623
$$ -244122 -292861 145928 -285767 -293890 -299889 24898 158232 -316264 70168 -237033 300623
15622A6631O8980a5528l6724B40780h2188B09923n1107p9120J63019I7469R8737
$$ 16631 85611 -15528 -52252 240780 -82188 209923 158816 79696 242715 97469 196206
15611A96206B3798b69267i6333I0298f4896k2594A37211C2117f0607l9003L9799
$$ 196206 23798 -269267 -96333 90298 -64896 -87490 137211 32117 -60607 -99610 -59811
15600e9811F667a80528B91622b30832n9502a04195b8227n290A61555a83939c6041
$$ -59811 6667 -180528 291622 -230832 -290334 -104195 -28227 -33517 161555 -183939 -36041
15588f5412j34666B1918L3120J17715p0603K56050a61008n8448j71714G5137i7681
$$ -65412 -200078 21918 55038 172753 102150 358200 -161008 -219456 -391170 75137 -97681
15576D9092b16876h8084C5499J19207b52537A16485B5464c15531m6132D1406J9048
$$ 49092 -216876 -88084 35499 154706 -252537 116485 25464 -315531 -361663 41406 60454
15565F0454b02642c5614H046J0566p546e1815p9485d6291B49257l7815e7380r9015
$$ 60454 -202642 -35614 8046 18612 11066 -51815 -131300 -46291 249257 211442 -57380 -156395
15553a56395c874H7910K606b62441O5793N9105l6134O7162D6994b9368k99981
$$ -156395 -3874 87910 90516 -262441 -196648 -137543 -173677 -106515 46994 -29368 -329349
15542c29349R5013G7535b01672j7857f5214D4077b02645h5602A15195l5725K44555
$$ -329349 -234336 77535 -201672 -219529 -65214 44077 -202645 -85602 115195 79470 324025
15531C24025j52962g7262B9666n185f0150J1626C47870b14363F1792b38320d2091
$$ 324025 171063 -77262 29666 24481 -60150 -48524 347870 -214363 61792 -238320 -42091
15519A93214a66997k6976L2507H5387L45505a33304k36369A88353o9888a037j28813
$$ 193214 -166997 -193973 -161466 85387 430892 -133304 -369673 188353 118465 -1037 -129850
15508a29850k58785J22410B94543b0726B59149g0143B36767F9544L2507a52072
$$ -129850 -388635 -266225 294543 -20726 259149 -70143 236767 69544 102051 -152072
15497a85880d9790j73661O8903A89457a22538A21506L4489a57854a2437j10984
$$ -185880 -49790 -223451 -154548 189457 -122538 121506 155995 -157854 -12437 -123421
15487a23421d5907I0221b17419e57j84059C13674I9057J03688a9917A18998n1603
$$ -123421 -45907 90221 -217419 -557 -184616 313674 99057 202745 -19917 118998 67395
15476F7395C1011d2540n406A5104g0872A29455n466d5506R754H3137g4420j73351
$$ 67395 31011 -42540 -47946 15104 -70872 129455 123989 -45506 -35752 83137 -74420 -247771
15464b47771R0771B51015n7918G4487l0510K75908C1936b10505P5810j69591B46481
$$ -247771 -157000 251015 193097 74487 43977 319885 31936 -210505 -134695 -304286 246481
15452A32374b78929R1866J7995K200j36324B63669b1721n1212j02277J562A39759
$$ 132374 -278929 -187063 -169068 -166868 -303192 263669 -21721 -72933 -175210 -173648 139759
15440b04085L9816A3056b0511A2725a9086C22983A9737N9364J13258n122a9654
$$ -204085 -164269 13056 -20511 12725 -19086 322983 19737 79101 192359 187237 -19654
15428a1358B12272I2176K4406M9061f0453p6963b4933k9170A12331F56K69220
$$ -11358 212272 92176 116582 165643 -60453 -137416 -24933 -54103 112331 656 269876
15417B69876a30719E22612a04038C07120I0714K8803f9777j78267I7874e6368
$$ 269876 -130719 522612 -104038 307120 90714 119517 -69777 -248044 97874 -56368
15406E8997a37217A25795d0269D2143J17270D3488b89024A30110a02459A00066
$$ 58997 -137217 125795 -40269 42143 159413 43488 -289024 130110 -102459 100066
15395A51638k8631c7490q0039A72230d5003A49039A529R2265l2517a5913k93874
$$ 151638 123007 -37490 -117529 172230 -45003 149039 1529 93794 61277 -15913 -309787
15384c09787A17602c09228J2575a31897C49J88076f3843A97953a57649j01821
$$ -309787 117602 -309228 -296653 -131897 349 188425 -63843 197953 -157649 -259470
15374b59470a05894M427d488k82554A2863J97364B8629L4235a94832A17637E0098
$$ -259470 -105894 -101467 -4488 -287042 12863 210227 28629 62864 -194832 117637 50098
15362a58371k1302F3182P8023m4606J9829A315a00041p6738a527k16482j85321
$$ -158371 -179673 63182 141205 96599 116428 1315 -100041 -176779 -1527 -218009 -403330
15351d03330B576L12934a20565A15624f7576C13075a99666C98967b39110C5834
$$ -403330 2576 315510 -120565 115624 -67576 313075 -199666 398967 -239110 35834
15340B3347i8413B49844h89n458A64005i3911B67914n2614b58130H8620a96469
$$ 23347 -98413 249844 -889 -6347 164005 -93911 267914 215300 -258130 88620 -196469
15328a08053n9114k28344B08610c24968J49385B39782p6863C1768O5066N0761
$$ -108053 -167167 -395511 208610 -324968 -175583 239782 162919 31768 96834 147595
15318A47595a10535l8683A14708O3170c6080F7439K6815N8073a78086F1005d98837
$$ 147595 -110535 -149218 114708 177878 -36080 67439 94254 152327 -178086 61005 -498837
15306e378A99056F9337G357J24333b85456A57123E9785f4377B89052F265c051
$$ -5378 199056 69337 7357 131690 -285456 157123 59785 -64377 289052 6265 -3051
15294E796b8108A89144J33593b99383Q2237B47222o3992E056d1892b0543B20642
$$ 5796 -28108 189144 322737 -299383 -217146 247222 183230 5056 -41892 -20543 220642
15282C57713d0377B9400D804K7417d6888m438D4979a41831I5031g3976D05999
$$ 357713 -40377 29400 4804 32221 -46888 -51326 44979 -141831 95031 -73976 405999
15270A34309K3127f8223l02520C1384O7394b50944h1056C0405f4420E1125K1234
$$ 134309 157436 -68223 -370743 31384 98778 -250944 -81056 30405 -64420 51125 72359
15259G2359h2853j0520G1584b15449A06445h7010k70601A04352b5327j10945C04801
$$ 72359 -82853 -93373 71584 -215449 106445 -87010 -357611 104352 -25327 -136272 304801
15247E97118O41796L2725M5932J8286k41322A94828K5844A4074i9999A35430F5271
$$ 597118 1238914 1271639 1317571 1335857 1094535 194828 220672 14074 -99999 135430 65271
15235a6942k41H7060L4353m7914K4865B3079J41456a03095A83135J2099o3097
$$ -16942 -17183 87060 121413 73499 98364 23079 164535 -103095 183135 195234 132137
15224A32137e606k51178N5492B9564J68028B331J72341h0906A52436a27974B44585
$$ 132137 -5606 -256784 -201292 29564 197592 2331 174672 -80906 152436 -127974 244585
15212A28783o1988a94076E0112L96627A63506j8545J11836A4990K381P2411J55853
$$ 128783 66795 -194076 50112 446739 163506 144961 256797 14990 17371 89782 245635
15201B45635E246b80663G3192a4973B82209L382b38278a08903A62164b82040E625
$$ 245635 5246 -280663 73192 -14973 282209 285591 -238278 -108903 162164 -282040 5625
15189B30975I6235b93270A84312A6665J15714a08116P661g554I3889c7343d3B52366
$$ 230975 96235 -293270 184312 16665 132379 -108116 -100455 -7554 93889 -37343 -43 252366
15176a90806E6097K01095i4555b8194j80203A8379P109J97774K9013F7710J37165
$$ -190806 56097 257192 -94555 -28194 -208397 18379 25488 223262 252275 67710 204875
15165B04875R60A9116a1994k08804A35516K14551j7137n5344b81842h7141B55634
$$ 204875 205835 19116 -11994 -220798 135516 350067 332930 277586 -281842 -87141 255634
15153d3215p6457j37062A5602h7952j75215h1172j63764E6809N7501J49431o7190
$$ -43215 -119672 -256734 15602 -87952 -263167 -81172 -244936 56809 114310 263741 196551
15142A96551J78983A23808D3284b86286A17718C6527N4606C3479R3985b26530
$$ 196551 375534 123808 43284 -286286 117718 36527 91133 33479 127464 -226530
15131D29322A49130J54330A11395o869B9750O248f300j41954A48638p0487K47880
$$ 429322 149130 303460 111395 104526 29750 35998 -6300 -148254 148638 78151 326031
15120C26031H9228O0218P6188I3014b3595l2703A29808J31105a45755D5541c1840
$$ 326031 89228 149446 225634 93014 -23595 -56298 129808 260913 -145755 45541 -31840
15108g9457c0818A57916p5651a39660B41088a31242B96385f8054H324i2939A08504
$$ -79457 -30818 157916 82265 -139660 241088 -131242 296385 -68054 8324 -92939 108504
15096C33137A14800B2502d2408C8704f6013B24862m8412a41312A42548Q2462K62969
$$ 333137 114800 22502 -42408 38704 -66013 224862 176450 -141312 142548 225010 487979
15085D87979A87537N2207G5176K64193H7014C58J9377L27778a31437d5107G6391
$$ 487979 187537 239744 75176 339369 87014 358 19735 347513 -131437 -45107 76391
15073B38975N715a62404B56100L1486j33264l603F2926P8403M04231b16032G6698
$$ 238975 244690 -162404 256100 287586 154322 150719 62926 141329 545560 -216032 76698
15061E573a38839A82304K16186a04854c9607B36378A07147J03989f2398B016J73563
$$ 5573 -138839 182304 398490 -104854 -39607 236378 107147 211136 -62398 2016 175579
15050A75579j1496K31898p026i7101C36818G1936J36274E1655K64927A3023J91549
$$ 175579 164083 395981 388955 -97101 336818 71936 208210 51655 316582 13023 204572
15039B04572G4343K14943L5387m5694r3230o3343J11798J42218j6678A59907J41777
$$ 204572 74343 289286 324673 278979 185749 122406 234204 376422 359744 159907 301684
15028C01684E2479L73440r5329b0911j53824O353M7113B29616A03769H247a08888
$$ 301684 52479 425919 330590 -20911 -174735 -168382 -121269 229616 103769 8247 -108888
15016A44589f7011A83418G8014J00636J4116o3002l4181K01828c56803C5017p440
$$ 144589 -67011 183418 78014 178650 192766 129764 95583 297411 -356803 35017 27577
15005B7577J12915J01639H2477K63166a043A59944G1173L6934b7642B09546K75593
$$ 27577 140492 242131 82477 345643 -1043 159944 71173 108107 -27642 209546 485139
14994D85139j22264A52563K6504J35055E6735K9955K42455C1572a0084B25797
$$ 485139 362875 152563 179067 314122 56735 86690 329145 31572 -10084 225797
14983A10921O3248j4704O7055O6046J52106j32868D2790K04901J16205d0484B85726
$$ 110921 174169 159465 226520 292566 444672 311804 42790 247691 363896 -40484 285726
14971B19773J24495A69826p9540R3110J31250q6898p9689J96830j44855J14674
$$ 219773 344268 169826 90286 183396 314646 227748 148059 344889 200034 314708
14961C14708I103d1925Q877B48706O5049Q0809h9918j82344E18733r8622B5119
$$ 314708 9103 -41925 -33048 248706 313755 394564 -89918 -272262 518733 420111 25119
14949B65390J09755I6237K60715E7808L01358I6469m3316r897M03089J2086A90231
$$ 265390 375145 96237 356952 57808 359166 96469 53153 43256 446345 458431 190231
14937A61374K1822a2889B94695j15897a06404G966M31526j90770J96895A99153
$$ 161374 183196 -12889 294695 178798 -106404 7966 439492 248722 445617 199153
14926A15608J58576P0480O6611l876j70546A3078K97154K5687J12828B21426L1060
$$ 115608 274184 344664 411275 407399 236853 13078 310232 335919 448747 221426 252486
14915B52486A00287N18242k55221A32595O1406d4525A68622p5344K9164P0371
$$ 252486 100287 618529 363308 132595 194001 -44525 168622 93278 122442 192813
14905A92813N2701K32348k35678p2979o9955J26526A1416L10626A15323J25529
$$ 192813 245514 477862 242184 169205 99250 225776 11416 322042 115323 240852
14895B40852R2756E4525K94833q1624J829K29312j88259K89708k97885j46223
$$ 240852 333608 54525 349358 267734 269563 498875 310616 600324 302439 156216
14885A56216o6146J64434b8963B45983J51610J89736j87796o1648A68375K48341
$$ 156216 90070 254504 -28963 245983 397593 587329 399533 337885 168375 416716
14875D16716A47888J48922d028k6132A31746k0070O3505M58093B9639L58915n7210
$$ 416716 147888 296810 -4028 -30160 131746 111676 175181 633274 29639 388554 331344
14864C31344p7832r0407M56130j99359M5198j83339I8783n331M14398A78354L2575
$$ 331344 253512 163105 619235 419876 465074 281735 98783 93452 507850 178354 210929
14853B10929C4066L10178j29849L26319k58552J05614J17241j6874j03784K55977
$$ 210929 34066 344244 214395 540714 282162 387776 505017 488143 384359 640336
14843F40336A84820L50951l4096j77249L6746m2017K3323r4041k8280o7285K91724
$$ 640336 184820 535771 501675 324426 361172 319155 342478 248437 220157 152872 444596
14832D44596B13143K07411a1153F3579J18276J20218k7340A23811J9022K01929
$$ 444596 213143 420554 -11153 63579 181855 302073 274733 123811 142833 344762
14822C44762j71503L35285k38947M96955C16350J94050j21842j64061J38571k2940
$$ 344762 173259 508544 269597 766552 316350 510400 388558 224497 363068 340128
14812C40128K73986l01954J60245A56529J64484J48581K36016C10621K43844j66416
$$ 340128 614114 312160 472405 156529 321013 469594 705610 310621 554465 388049
14802C88049j69677L5450j06257K68428J33257q1937A66286k229L25344j01467
$$ 388049 218372 253822 147565 415993 549250 467313 166286 164057 489401 387934
14792C87934j14771P0926M99656D00159A84849K096N37971k69365j01619J91924
$$ 387934 273163 344089 843745 400159 184849 186945 724916 455551 353932 545856
14782E45856L1744k06213J12203J66114k5807k26459l4151m0827l3457j8190J46515
$$ 545856 577600 371387 483590 649704 623897 397438 363287 322460 289003 270813 417328
14771D17328J18644j90280K48969m7511o1569J0516J71047j21230J51435B17181
$$ 417328 535972 345692 594661 547150 485581 496097 667144 545914 697349 217181
14760E45514k70188K42727n2422o1124Q3329J38356k39409K81961B80795M03711
$$ 545514 275326 518053 465631 404507 487836 626192 386783 668744 280795 684506
14750F84506l11443j02576J60870L41679j98023M9496k87548k8011J96917r7801
$$ 684506 373063 270487 431357 773036 575013 624509 336961 308950 505867 408066
14740D08066M40525q1991C47134N03597C67720J29440j98453L47586j98324k7070
$$ 408066 848591 766600 347134 850731 367720 497160 298707 646293 447969 420899
14730D20899K02696K69574B70117O40253m13862j2661L36679j65797m1724j14148
$$ 420899 623595 893169 270117 910370 496508 483847 820526 654729 613005 498857
14720D98857M72935D08567J86521l1178M9203j13942L98732l88774L12496J20534
$$ 498857 971792 408567 595088 563910 613113 499171 897903 509129 821625 942159
14710I42159A77154L42512J26641o0241K53114l26897N3722L13402j2288l94352
$$ 942159 177154 519666 646307 586066 839180 512283 566005 879407 867119 472767
14700D72767K80322j63316J15685B40894M29692J59491j59128J68080k37697K36261
$$ 472767 753089 589773 705458 240894 670586 830077 670949 839029 601332 837593
14690H37593l30568K36648A49571M41899L60878l88925O00940k2882l79781j15385
$$ 837593 507025 743673 149571 591470 952348 563423 1164363 1141481 761700 646315
14680F46315N7437J55452K2715K87678j97921D83324M90782l34641J00991K19569
$$ 646315 703752 859204 881919 1169597 971676 483324 974106 639465 740456 960025
14670I60025K428k10046P7020K01813K65502o30429L47930r5407k26199J53546
$$ 960025 962453 752407 829427 1031240 1296742 666313 1014243 918836 692637 846183
14660H46183M96226l60262J43283m39527J8817J07957O7653M5178J26023j6834
$$ 846183 1342409 982147 1125430 685903 704720 812677 880330 925508 1051531 1034697
14650A034697J63920k19548j47649J89449j4967q0471K64477k16286l68361O25369
$$ 1034697 1198617 979069 831420 1020869 1005902 925431 1189908 973622 605261 1230630
14640A230630o5568m09862J66051j33431K79068M5953P5641j36627K40542l96165
$$ 1230630 1165062 755200 921251 787820 1066888 1112841 1188482 1051855 1292397 896232
14630H96232J66588j98649J46349j97988M59059Q2310k56099K58628o47556O64977
$$ 896232 1062820 864171 1010520 812532 1271591 1353901 1097802 1356430 708874 1373851
14620A373851m29140M89245k28374k54805j36815L74826J49014m31843M36998
$$ 1373851 944711 1433956 1205582 950777 813962 1188788 1337802 905959 1342957
14611A342957n41920L30201p9147L15970p6582k21269Q7181J39768p9869J52165
$$ 1342957 801037 1131238 1052091 1368061 1291479 1070210 1157391 1297159 1217290 1369455
14601A369455l1076J1898j61541K47230o4980q4748M59156k02082j83037K91745
$$ 1369455 1338379 1350277 1188736 1435966 1370986 1286238 1745394 1543312 1360275 1652020
14591A652020j82938M7229p72O2484l58528J12381K54389l0725j32203J00305
$$ 1652020 1469082 1516311 1515539 1578023 1219495 1331876 1586265 1555540 1423337 1523642
14581A523642R2975k58115K16578j541k9585R7412K9473K58174j73565k82585
$$ 1523642 1616617 1358502 1575080 1573539 1543954 1641366 1670839 1929013 1755448 1472863
14571A472863K99522j17831L36780L10254k18096r5453j19167R6624r4285L29551
$$ 1472863 1772385 1654554 1991334 2301588 2083492 1988039 1868872 1965496 1871211 2200762
14561B200762p558K15438m0979r7243L67100j52216M2809J76909J74389P37897
$$ 2200762 2193204 2408642 2367663 2270420 2637520 2485304 2528113 2705022 2879411 3617308
14551C617308p5953Q93300J060459N095347R148819J5836778M232348j8906834
$$ 3617308 3541355 4434655 5495114 10590461 19739280 35576058 39808406 20901572
14543B0901572A0111796m438266k708098j088966o02324O8758L66524j76459k1510
$$ 20901572 10111796 5673530 2965432 1876466 1274142 1342900 1709424 1532965 1511455
14534A511455M51478l07590k00558K39896J97746j27315k11604m373L54552R3779
$$ 1511455 1962933 1655343 1454785 1694681 1892427 1765112 1553508 1549135 1903687 1997466
14524A997466k04030L44930j75267j37565j83479J53177N22430l41902J01878
$$ 1997466 1793436 2138366 1963099 1825534 1642055 1795232 2317662 1975760 2077638
14515B077638m4514M6828j58144K61298k01908K55739J9573J27863l56665K10187
$$ 2077638 2033124 2079952 1921808 2183106 1981198 2236937 2256510 2384373 2027708 2237895
14505B237895P5391J9940K5201j03333L79797l29422M86604l19551j2574L10105
$$ 2237895 2313286 2333226 2358427 2255094 2634891 2305469 2792073 2472522 2459948 2770053
14495B770053j15709j46787K08821K11435O4840M156O5932l98119M16773j96723
$$ 2770053 2654344 2507557 2716378 2927813 2992653 2996809 3062741 2664622 3081395 2884672
14485B884672K22263K73825l04224k84344J92924L01416J7977k15407l2214L36831
$$ 2884672 3106935 3380760 3076536 2792192 2985116 3286532 3304509 3089102 3056888 3393719
14475C393719J51058J49335r0050K7327j1722r5690Q3273j21142r3865J79213
$$ 3393719 3544777 3694112 3604062 3631389 3619667 3523977 3607250 3486108 3392243 3571456
14465C571456j5933J4327N56706r8110l16701J22940N30362l13788N4832K425
$$ 3571456 3555523 3569850 4126556 4028446 3711745 3834685 4365047 4051259 4106091 4108516
14455D108516K25638M445q5993J93124j17026j20516M26798j63516J99061j42892
$$ 4108516 4334154 4338599 4252606 4445730 4328704 4208188 4634986 4471470 4670531 4527639
14445D527639L00981P7477k16812J07477J43883L9263q914N2205K47816j89790
$$ 4527639 4828620 4906097 4689285 4796762 4940645 4979908 4970994 5023199 5271015 5081225
14435E081225n987K05021J18298N4088R0033L8872J71787L48398k19398L41834
$$ 5081225 5075238 5280259 5398557 5452645 5542678 5581550 5753337 6101735 5882337 6224171
14425F224171k1427j80229o7049L00174J85314K84700j24007m7817m710N40232
$$ 6224171 6202744 6022515 5955466 6255640 6440954 6725654 6601647 6553830 6549120 7089352
14415G089352o3959K12957k05650q6003L68453K67507J78385J70519k97260K77199
$$ 7089352 7025393 7238350 7032700 6946697 7315150 7582657 7761042 7931561 7634301 7911500
14405G911500N6723J1942N03110K5042Q5984j44660o4238L90918J9372N38817
$$ 7911500 7968223 7980165 8483275 8508317 8594301 8449641 8385403 8776321 8795693 9334510
14395I334510p5005J35325J40199K68877J09049J30994L05886K58549j19464M23642
$$ 9334510 9259505 9394830 9535029 9803906 9912955 10043949 10349835 10608384 10488920 10912562
14385A0912562n5296L92201J14745M0801O21811p4666L37004L90007K22362M0085
$$ 10912562 10857266 11249467 11364212 11405013 12026824 11952158 12289162 12679169 12901531 12941616
14375A2941616L83417J26216L28607J07637O48252K85366m2169N03522K52198
$$ 12941616 13325033 13451249 13779856 13887493 14535745 14821111 14778942 15282464 15534662
14366A5534662K59201N78548J95148M53835L28385N85880K27753L81814M15109
$$ 15534662 15793863 16372411 16567559 17021394 17349779 17935659 18163412 18545226 18960335
14357A8960335L81012O50106N83033Q8756O75431M48455M00216N80427M50661
$$ 18960335 19341347 19991453 20574486 20663242 21338673 21787128 22187344 22767771 23218432
14348B3218432P02745M90367O78429R27127P67270O09862J060088J07559J062559
$$ 23218432 23921177 24411544 25089973 26017100 26784370 27394232 28454320 28561879 29624438
14339B9624438J044466P32280P03039P83822J398531Q54411J120661J147274O33550
$$ 29624438 30668904 31401184 32104223 32888045 34286576 35140987 36261648 37408922 38042472
14330C8042472J497298J304519J131445J994025R35855J424098J541453K010578
$$ 38042472 39539770 40844289 41975734 43969759 44905614 46329712 47871165 49881743
14322D9881743J827515J884229J684303J874807K309112K397962K383021K293901
$$ 49881743 51709258 53593487 55277790 57152597 59461709 61859671 64242692 66536593
14314F6536593K732165K542451K932168L341012L336289L429039M024157L900135
$$ 66536593 69268758 71811209 74743377 78084389 81420678 84849717 88873874 92774009
14306I2774009M178112M353744M784692N203015N281964N982807O188319O175657
$$ 92774009 96952121 101305865 106090557 111293572 116575536 122558343 128746662 134922319
14298A34922319P030541P880340Q181384Q265069R241902R864021J0150334J0562719
$$ 134922319 141952860 149833200 158014584 166279653 175521555 185385576 195535910 206098629
14290B06098629J1944821J2207683J2787475J3438039J4214530J4970316J5238614
$$ 206098629 218043450 230251133 243038608 256476647 270691177 285661493 300900107
14283C00900107J6094605J6258233J6877184J6493343J5958206J5973845J5138701
$$ 300900107 316994712 333252945 350130129 366623472 382581678 398555523 413694224
14276D13694224J4022727J2541436J0557238Q157511J477658l668626k440555
$$ 413694224 427716951 440258387 450815625 458973136 460450794 456782168 454341613
14269D54341613j004344k812716l177314o738054r857263j0958646j4378863j5438165
$$ 454341613 453337269 450524553 447347239 440609185 430751922 419793276 405414413 389976248
14261C89976248j6604622j7240426j7233780j7497615j6658448j6304548j5768750
$$ 389976248 373371626 356131200 338897420 321399805 304741357 288436809 272668059
14254B72668059j4485375j3237567j3471906j2451548j1791608j1183333j0481650
$$ 272668059 258182684 244945117 231473211 219021663 207230055 196046722 185565072
14247A85565072j0099612q885665q816119p919672p718183o992567o278703o453925
$$ 185565072 175465460 166579795 157763676 149844004 142125821 135133254 128854551 122400626
14239A22400626n902655m948153n340149n004737m730199l926000m523093l226016
$$ 122400626 116497971 111549818 106209669 101204932 96474733 92548733 88025640 84799624
14231H4799624l383834l488502l255591k908253k688258l196141k080224k679185
$$ 84799624 81415790 77927288 74671697 71763444 69075186 65879045 63798821 61119636
14223F1119636k413107j725732k145408j855438j827287j762180j826528j815148
$$ 61119636 58706529 56980797 54835389 52979951 51152664 49390484 47563956 45748808
14215D5748808r65059j408232j183466j405197j008056j627087r21469j056114
$$ 45748808 44783749 43375517 42192051 40786854 39778798 38151711 37230242 36174128
14207C6174128m52681j141263j249415q61800j452971p05027m35699n55383q99083
$$ 36174128 35721447 34580184 33330769 32468969 31015998 30310971 29875272 29319889 28420806
14198B8420806j113695o36269q63012m18785o14264L1110j096602m88812p24762
$$ 28420806 27307111 26670842 25807830 25389045 24774781 24805891 23709289 23220477 22495715
14189B2495715n48061n60131l85970r71076m29543m57546l2180p77681l6306n75297
$$ 22495715 21947654 21387523 21001553 20030477 19600934 19143388 19111208 18333527 18297221 17721924
14179A7721924j72037k17268p80730k39459j59063l29668m52976k63125n1115
$$ 17721924 17549887 17332619 16551889 16312430 16153367 15823699 15370723 15107598 15056483
14170A5056483k90161j57700n34329n01437k02190k10810J81353n73703k56381
$$ 15056483 14766322 14608622 14074293 13572856 13370666 13159856 13341209 12767506 12511125
14161A2511125j47261k65435j21467k46264k87581K9331l38022p2784l33064j22643
$$ 12511125 12363864 12098429 11976962 11730698 11443117 11472448 11134426 11061642 10728578 10605935
14151A0605935l39991L8726o7498m12518m21550n5194J87973l93217K21950o55035
$$ 10605935 10265944 10304670 10237172 9824654 9403104 9347910 9535883 9142666 9364616 8709581
14141H709581K03524l51142q7819O5572p2355j97948r6861l30996p0401n7654
$$ 8709581 8913105 8561963 8474144 8539716 8467361 8269413 8172552 7841556 7771155 7713501
14131G713501m3125J00141j36629m09759j56894J40644o8286k26085K10760k05548
$$ 7713501 7670376 7770517 7633888 7224129 7067235 7207879 7139593 6913508 7124268 6918720
14121F918720n5845l40136p9342j37274R3167L1385j33716R6887o27774J76881
$$ 6918720 6862875 6522739 6443397 6306123 6399290 6430675 6296959 6393846 5766072 5942953
14111E942953l34074K1550j71652L36765j81923n48477K26125J34636j5577l86515
$$ 5942953 5608879 5630429 5458777 5795542 5613619 5065142 5291267 5425903 5410326 5023811
14101E023811J49893k6457k61323J33024k43569M6292l00879J18817q2872Q1902
$$ 5023811 5173704 5147247 4885924 5018948 4775379 4821671 4520792 4639609 4556737 4638639
14091D638639P4450o3528n73470J37679J25789J37305L1638m18241j8302N4027
$$ 4638639 4713089 4649561 4076091 4213770 4339559 4476864 4508502 4090261 4071959 4125986
14081D125986K6901j08195n1227J02990p71527N34190m1957r9311J67264k95329
$$ 4125986 4152887 4044692 3993465 4096455 3324928 3859118 3817161 3717850 3885114 3589785
14071C589785m3870j09037R9824n4333j15189p855J05322n4940k13354j24100
$$ 3589785 3545915 3436878 3536702 3482369 3367180 3359325 3464647 3409707 3196353 3072253
14061C072253O84938l28694n423L06043k26635k22144J16000l1362k92808j30959
$$ 3072253 3757191 3428497 3423074 3729117 3502482 3280338 3396338 3364976 3072168 2941209
14051B941209o6076N2616l1594m9325K55823j31555k2802k70844K9184L45479
$$ 2941209 2875133 2927749 2896155 2846830 3102653 2971098 2948296 2677452 2706636 3052115
14041C052115m25493m7320K14108o9572K8341j10408J23002N8406k85616P7664
$$ 3052115 2626622 2579302 2793410 2723838 2752179 2641771 2764773 2823179 2537563 2615227
14031B615227k14455J26463P7012j86256K90264r3685j89571k17650J39032m91819
$$ 2615227 2400772 2527235 2604247 2417991 2708255 2614570 2424999 2207349 2346381 1854562
14021A854562N01590k97968J92754k96093J19199K67352J2655l06437p6878N18593
$$ 1854562 2356152 2058184 2250938 1954845 2074044 2341396 2354051 2047614 1970736 2489329
14011B489329m01190N7977k71977L59513k41821r1977J42408k79686L45718k75619
$$ 2489329 2088139 2146116 1874139 2233652 1991831 1899854 2042262 1762576 2108294 1832675
14001A832675P1612j4236j69651j1409J94795j25780O773k99928L56854O1320
$$ 1832675 1904287 1890051 1720400 1708991 1903786 1778006 1784779 1484851 1841705 1903025
13991A903025L09166M6996R7923L090478P706549J6404531J2398724j5942626
$$ 1903025 2212191 2259187 2357110 5447588 13154137 29558668 41957392 26014766
13983B6014766j2968411n511833k408057j171838o81437k01549l56534o5703j71579
$$ 26014766 13046355 7534522 5126465 3954627 3273190 3071641 2715107 2649404 2477825
13974B477825r2644k80791L29196n72672L41339J48014P2096m63251J21395L9702
$$ 2477825 2385181 2104390 2433586 1860914 2202253 2350267 2422363 1959112 2080507 2120209
13964B120209l36060J61580k71126J71532m36363K45637J05891p7675K39064O911
$$ 2120209 1784149 1945729 1674603 1846135 1409772 1655409 1761300 1683625 1922689 1929600
13954A929600K3057k22545L8269L46983k95158j36419N6209q3219k82627N77025
$$ 1929600 1952657 1730112 1768381 2115364 1820206 1683787 1739996 1656777 1374150 1951175
13944A951175m21342j19924M434N0461J31989O4923n2387j61357K86373l14060
$$ 1951175 1529833 1409909 1414343 1464804 1596793 1661716 1609329 1447972 1734345 1420285
13934A420285L62107n12327K96502k07998R921m8004J04136n05733M21317J26748
$$ 1420285 1782392 1270065 1566567 1358569 1368490 1320486 1424622 918889 1340206 1466954
13924A466954K33134l41043j25665J28292j38856L34891K2144m41524L85703k96509
$$ 1466954 1700088 1359045 1233380 1361672 1222816 1557707 1579851 1138327 1524030 1227521
13914A227521j30233m1454Q2262K26683O2605m727k52452l11591N95236m04934
$$ 1227521 1097288 1055834 1138096 1364779 1427384 1422657 1170205 858614 1453850 1048916
13904A048916l20159L28971k4964K70573n36946K50898l20347K7046O14257l90380
$$ 1048916 728757 1057728 1032764 1303337 766391 1017289 696942 723988 1338245 947865
13894I47865K75106j95629L04901m70652L03557J34584k55537j5019J64553j60291
$$ 947865 1222971 1027342 1332243 861591 1165148 1299732 1044195 1029176 1193729 1033438
13884A033438K45168j08506j04883l9722k05015j30805k1823L06720j66114J47376
$$ 1033438 1278606 1170100 1065217 1025495 820480 689675 667852 974572 808458 955834
13874I55834L5627p2804N1533l24991L70290l5334j4086q3253j47767n80j1053
$$ 955834 991461 918657 970190 645199 1015489 980155 966069 882816 735049 734469 723416
13863G23416J44383L03903p655k7696j21832J89168l15796j8624J81996K2963
$$ 723416 867799 1171702 1164047 1136351 1014519 1203687 887891 869267 1051263 1074226
13853A074226l92885L44972l52517Q6304J66024J99225l15712J2929J60966L14629
$$ 1074226 681341 1026313 673796 760100 926124 1125349 809637 822566 983532 1298161
13843A298161k33296k89879J65572j22118o9404R9278r1161j38865K81921p507
$$ 1298161 1064865 774986 940558 818440 749036 848314 757153 618288 900209 892702
13833H92702J4100M9211k62709O9497J4755o332k14339L52517k67842K33915Q5670
$$ 892702 906802 956013 693304 762801 777556 771224 556885 909402 641560 875475 961145
13822I61145j90371R7426j54626K04581Q430P5161k44298j15835J22363J42969
$$ 961145 770774 868200 713574 918155 926585 1001746 757448 641613 763976 906945
13812I06945o2789p5528R7647k18206L3385j58175J46488R2260l12980M47794
$$ 906945 844156 768628 866275 648069 681454 523279 669767 762027 449047 896841
13802H96841l69343J30944k24365Q3468L53995j72049l6631j02416L49348o3016
$$ 896841 527498 658442 434077 517545 871540 699491 662860 560444 909792 846776
13792H46776n3483r3056Q2617j32254C00070M91211j21525J7816J13155J65629
$$ 846776 793293 700237 782854 650600 300070 791281 669756 687572 800727 966356
13782I66356j68822j11808O1007J3465Q7242C02636K34168J61220N8678j52304
$$ 966356 797534 685726 746733 760198 847440 302636 536804 698024 756702 604398
13772F04398r2626K55707k21261J20346j52921L40858m17498M26383B88076K64287
$$ 604398 511772 767479 546218 666564 513643 854501 437003 863386 288076 552363
13762E52363J15283j29108r7710q073J14109L4767Q5117l21753L8131L7536K14908
$$ 552363 667646 538538 440828 432755 546864 581631 666748 344995 383126 420662 635570
13751F35570k89088J62205r2428k0648J79939j243B29686J78690K53333B23782
$$ 635570 346482 508687 416259 395611 575550 574307 229686 408376 661709 223782
13740D59859m7324L13113j70781o2634j61171J55958j12568J76308j78601K20794
$$ 459859 412535 725648 554867 492233 331062 487020 374452 550760 372159 592953
13730E92953B37155p6058J22659j23302N06719k05481A31493L46048L9558r0446
$$ 592953 237155 161097 283756 160454 667173 461692 131493 477541 517099 426653
13720D26653L04388j20606k34535K20008n0917J13537j34039q740L4841B30747
$$ 426653 731041 610435 375900 595908 544991 658528 524489 515749 550590 230747
13709E36054B56622K68574K46112C65695k9636L48876j15974j57221J39485j20658
$$ 536054 256622 525196 771308 365695 336059 684935 568961 411740 551225 430567
13699D30567j81468J81102L04892R2852m01833j51765K46417l5604l4265r1504
$$ 430567 249099 430201 735093 827945 426112 274347 520764 485160 450895 359391
13689C59391A66736M6248M62988B18346M02953O2412C18926L80880j40216j85655
$$ 359391 166736 212984 675972 218346 621299 683711 318926 699806 559590 373935
13679C73935j43240K99962k28811L21886I8592L63776L4204J35534k05118p2890
$$ 373935 230695 530657 301846 623732 98592 462368 496572 632106 426988 354098
13669C54098Q0186N2497j13911j733J88885N7647n1479k26450J26615j19185N0830
$$ 354098 434284 486781 372870 371137 560022 617669 566190 339740 466355 347170 398000
13658C98000j9026k4772K51959G6110N93613B79557J71446K2485k04258k5345
$$ 398000 378974 354202 606161 76110 669723 279557 451003 473488 269230 243885
13648B43885K27217k11503N6956M11744q4138H4909K08926K5957L5136E0539N5529
$$ 243885 471102 259599 316555 728299 644161 84909 293835 319792 354928 50539 106068
13637A06068K89332j6830K92231B60495J97967J04474k63128A46791P8383N8456
$$ 106068 395400 378570 670801 260495 458462 562936 299808 146791 225174 283630
13627B83630M33229l01352K7751p9702g021D70817j20172H0167J6076J92992j14449
$$ 283630 716859 415507 443258 363556 -7021 470817 350645 80167 96243 289235 174786
13616A74786K92119A47929L23492j49549j14959J08683O2044L6222a14334B75839
$$ 174786 466905 147929 471421 321872 206913 315596 377640 413862 -114334 275839
13605E55869k19259J40732p7938A53699K44167p8895J56645Q8808a8870C42182
$$ 555869 336610 477342 399404 153699 397866 318971 475616 564424 -18870 342182
13594A21666L23451e0620D1991M28219o9391j98764K1920J67605j25730a6023
$$ 121666 445117 -50620 41991 470210 400819 202055 223975 391580 265850 -16023
13583D78907h3017A36434o0916J71737K93382k46886k0238H1231M99255r4939
$$ 478907 -83017 136434 75518 247255 540637 293751 273513 81231 580486 485547
13573D85547A82174p2485M62863d2074B71460j08452J34543m415j24853K1809
$$ 485547 182174 109689 572552 -42074 271460 163008 297551 293136 168283 190092
13563A90092J29852b7330B59158J5309o4264K50407p7042b99460C86905r6081
$$ 190092 319944 -27330 259158 274467 210203 460610 383568 -299460 386905 290824
13553B90824o3108L77400B34184J30847K81175I6963O7475J91859j5460l1832
$$ 290824 227716 605116 234184 365031 646206 96963 164438 356297 340837 309005
13543C09005O0545q8867m3766J03531A51611A2466K84597m3656K67923l1333A60157
$$ 309005 369550 280683 236917 340448 151611 12466 297063 253407 521330 489997 160157
13531C23530K75681a7946C01355g9088B38685O4531d5533C49629o9840M8023F4986
$$ 323530 599211 -17946 301355 -79088 238685 303216 -45533 349629 279789 327812 64986
13519B77873m6150j12429J14203r3136M01662b124B30414J57095I5077K77714
$$ 277873 231723 119294 233497 140361 542023 -2124 230414 387509 95077 372791
13509C72791Q71f0356B03386D5251K85364I8767O8619J60422J34470o6397j36216
$$ 372791 373662 -60356 203386 45251 330615 98767 167386 327808 462278 395881 259665
13498B59665J0747J28265A39869R8540M7089M4219A2724J59678J2671j0146M09069
$$ 259665 270412 398677 139869 238409 285498 329717 12724 172402 185073 174927 583996
13487E83996k43168j8337o2511k5141K7006q2563a51954C86725a14320A50483
$$ 583996 340828 322491 259980 234839 261845 179282 -151954 386725 -114320 150483
13476E32086j37448k1368Q8655J18637m4486a2304C88871R2424j37352r9879A07765
$$ 532086 394638 373270 461925 580562 536076 -12304 388871 481295 343943 244064 107765
13464C70212M4301j72346J91516G6571J10087J61840A06454J50120k3519J19119
$$ 370212 414513 242167 433683 76571 186658 348498 106454 256574 233055 352174
13454C52174j03175p8589q4538K41816K1251A56647F2734J71203j7199I4585N2762
$$ 352174 248999 170410 85872 327688 348939 156647 62734 233937 216738 94585 147347
13443A47347P9941J54581a28268F8697J39888J01240l9152J22083A13463L04189
$$ 147347 227288 381869 -128268 68697 208585 309825 270673 392756 113463 417652
13433D17652J66198a4618B06258b38194A37915J13982A01273g4840I430M8880
$$ 417652 583850 -14618 206258 -238194 137915 251897 101273 -74840 9430 58310
13423E8310A7890M45876j25350k1941j24750n5134P7362A00676J6881D1258l278
$$ 58310 17890 463766 338416 316475 191725 136591 213953 100676 117557 41258 37980
13412C7980J29916b0236A88067j5372j0304K410G1941J45520M0981N110r5125
$$ 37980 167896 -20236 188067 172695 162391 164801 71941 217461 258442 263552 168427
13401A68427C6561L3678J68601a21211A55708L18622H5101K11849I8991a72274
$$ 168427 36561 70239 238840 -121211 155708 474330 85101 296950 98991 -172274
13390a60227B7285g9946B62371A23518l6535J33314E6172K84168O2266j66272
$$ -160227 27285 -79946 262371 123518 86983 220297 56172 340340 402606 236334
13380B36334g4151a4165C6141K07939J77050e6965A13967i4150C19261p878i6104
$$ 236334 -74151 -14165 36141 244080 421130 -56965 113967 -94150 319261 311383 -96104
13368B02916J1258n2317J64994A52559K5767K0270a08119B22718A0035J54440
$$ 202916 214174 161857 326851 152559 178326 198596 -108119 222718 10035 164475
13358A64475J6372K17075e0448B17801a0417D38308A67260L28480H9703m1887
$$ 164475 180847 397922 -50448 217801 -10417 438308 167260 495740 89703 47816
13348D7816L82748j27549j12300D70i219A97369J18653j05535M9903J53921B00544
$$ 47816 430564 303015 190715 470 -9219 197369 316022 210487 260390 414311 200544
13336D44230G0065B4896J21366D2678K30182K72970e7869A04016J02860d4463
$$ 444230 70065 24896 146262 42678 272860 545830 -57869 104016 206876 -44463
13325C26759I7950M4696L01035d1643C26506A48884J57157A09479C2075J33354
$$ 326759 97950 142646 443681 -41643 326506 148884 306041 109479 32075 165429
13315A65429J9874c424A74138J27778E1799a65269A65039a342j24402e72A5945
$$ 165429 185303 -3424 174138 301916 51799 -165269 165039 -1342 -125744 -572 15945
13303B82276n9055o6916P4123F0721b63808C5016J53739m0957b0998E3327d09
$$ 282276 223221 156305 230428 60721 -263808 35016 188755 147798 -20998 53327 -409
13291A11883a31645F6623i758E3123i5264C56987j02772B5800J91023a46776A60354
$$ 111883 -131645 66623 -9758 53123 -95264 356987 254215 25800 216823 -146776 160354
13279B86464f0890F9849K44554A47984L35566j26755j63856a25274C25129A31584
$$ 286464 -60890 69849 314403 147984 483550 356795 192939 -125274 325129 131584
13268F3871L6615M0969g5681D52581j51503b516D2958K03960b8459B46234e947
$$ 63871 100486 141455 -75681 452581 301078 -2516 42958 246918 -28459 246234 -5947
13256B86972K8008A9114K44759r3712a4277B37481K72381g563C86767b7561A55874
$$ 286972 314980 19114 263873 170161 -14277 237481 509862 -7563 386767 -27561 155874
13244A21040d002B59894q7823K39272A20821c18959C14773A2636J85945H8114
$$ 121040 -4002 259894 172071 411343 120821 -318959 314773 12636 198581 88114
13233b34566b5761D43805a09415E5309f2487D52301g3062B50472I2825B9363a15568
$$ -234566 -25761 443805 -109415 55309 -62487 452301 -73062 250472 92825 29363 -115568
13221B08446R9987E4049f4200C6245J6000a41338A48764a49765A4619R6594J10263
$$ 208446 308433 54049 -64200 36245 52245 -141338 148764 -149765 14619 111213 221476
13210B21476E6424N6707D9417L35531j16009j28890a3685j59797C46419a42202
$$ 221476 56424 113131 49417 384948 268939 140049 -13685 -173482 346419 -142202
13199A10454R5123o5077n7132L2457L3281D2203K20749J1336A07004N4730A235
$$ 110454 205577 140500 83368 115825 149106 42203 262952 274288 107004 161734 1235
13187B0771R5746c0576C26128A25550B7558a30552I4313J47102k2282B1524Q9795
$$ 20771 116517 -30576 326128 125550 27558 -130552 94313 241415 219133 21524 111319
13176A11319N3698k7677m0662k961c1578F21J06030a99585B21138c2978k94036
$$ 111319 165017 137340 96678 93717 -31578 621 106651 -199585 221138 -32978 -327014
13165c27014H0534c4777B57089I8676R8854a2168I8638L6358K48037j19764A4691
$$ -327014 80534 -34777 257089 98676 197530 -12168 98638 134996 383033 263269 14691
13153A27330D5757K8097K3782R5843A9935L216J65124E1304b0977B56874p4387
$$ 127330 45757 73854 97636 193479 19935 23151 188275 51304 -20977 256874 182487
13142A82487N3094n0022B7322c8270B79720p6923a21006J4368B76061a64868b4410
$$ 182487 235581 185559 27322 -38270 279720 202797 -121006 -106638 276061 -164868 -24410
13130A00203l4309J75118A08359a6340F3943N5920a94756P8646h476A62721K49165
$$ 100203 65894 241012 108359 -16340 63943 119863 -194756 -116110 -8476 162721 411886
13119D11886b9199J3211D50149B04341E3849J29584e4001I5824J78187n7190K5802
$$ 411886 -29199 -15988 450149 204341 53849 183433 -54001 95824 274011 216821 242623
13108B42623M7313n4426H510a51463A41226m1980K57675a21411D77712g1857l8165
$$ 242623 289936 235510 8510 -151463 141226 99246 356921 -121411 477712 -71857 -110022
13097a10022B47316g4038E1763J39448a83855C99K79512d6307b0324D4440J41525
$$ -110022 247316 -74038 51763 191211 -183855 399 279911 -46307 -20324 44440 185965
13086A85965j0351c0431j85105D72117B5236Q9876r953j2222J908m1180M7784
$$ 185965 175614 -30431 -215536 472117 25236 115112 105159 92937 94845 53665 101449
13075A01449b22085A27589N6650p7260B0696a09425B4695a02860H8559N9816c54158
$$ 101449 -222085 127589 184239 106979 20696 -109425 24695 -102860 88559 148375 -354158
13063A66983C4858K87128h6706K3389A57428K78963B14329a03848C07594i9706
$$ 166983 34858 321986 -86706 -63317 157428 436391 214329 -103848 307594 -99706
13052B73842G5586j0378a26263F1947K29585I0005m2695M9291h5437B40800a94938
$$ 273842 75586 65208 -126263 61947 291532 90005 47310 96601 -85437 240800 -194938
13040B06459n7716p998i8916K798A74030L32734B01791A2667c4003A48489b22744
$$ 206459 148743 140745 -98916 -96118 174030 506764 201791 12667 -34003 148489 -222744
13028A08634C4086J00495b34288A66161A0219J89270b55552f0389B1121J30464
$$ 108634 34086 134581 -234288 166161 10219 199489 -255552 -60389 21121 151585
13018A51585i8047a6322A38620e4274B59864b0434j7577j5002a8139j51177A82324
$$ 151585 -98047 -16322 138620 -54274 259864 -20434 -38011 -53013 -18139 -169316 182324
13006A19507a418C3765a37001A45537d9293G7079a2603G023J19525k0531l6586
$$ 119507 -1418 33765 -137001 145537 -49293 77079 -12603 7023 126548 106017 69431
12995F9431J96036L8882C4122K22699a40414q4341C8824a57327b7657C01299a43391
$$ 69431 265467 304349 34122 256821 -140414 -224755 38824 -157327 -27657 301299 -143391
12983a0594B18517e0213B06210E2K53354j02346g8680j94518A78996K59054e7420
$$ -10594 218517 -50213 206210 52 253406 151060 -78680 -273198 178996 438050 -57420
12971b3063j34502G7740L42740j90203b87638K9515C80760k0541b52265A18018
$$ -23063 -157565 77740 420480 230277 -287638 -258123 380760 360219 -252265 118018
12960c04905f2053k2810o2810n1083C2240K18577p6665p4498K50972d0063A61808
$$ -304905 -62053 -84863 -147673 -198756 32240 250817 174152 99654 350626 -40063 161808
12948a5828I0855A0941K27588E0260M1915K69652c3089j2857n2561c3831H1426
$$ -15828 90855 10941 238529 50260 92175 361827 -33089 -45946 -98507 -33831 81426
12936A46023a44006A96001c42635E6912P8199J69961c25517F9596M3517N2447
$$ 146023 -144006 196001 -342635 56912 135111 305072 -325517 69596 113113 165560
12926A65560D0400b1325j6369j18000P7351A0224J83073j2367b86874B09164d7050
$$ 165560 40400 -21325 -37694 -155694 -78343 10224 193297 180930 -286874 209164 -47050
12914B37738q7053Q4351G6485k6487K8063i493A48479O4542N6996a51433P2547
$$ 237738 150685 235036 76485 49998 78061 -9493 148479 213021 270017 -151433 -78886
12903g8886J7742D1805a3021p1729B63321m1040D1012A7115J57954m4263K61377
$$ -78886 -61144 41805 -13021 -84750 263321 222281 41012 17115 175069 130806 392183
12892C92183b73733C1895Q6183L4996k7429k2414a21810H6260M5607d5435A9547
$$ 392183 -273733 31895 118078 153074 125645 103231 -121810 86260 131867 -45435 19547
12880b04695E3976N0928A8712J71494m2831a16511A43488j4625Q9600d5225C011
$$ -204695 53976 104904 18712 190206 147375 -116511 143488 128863 218463 -45225 3011
12868F8286b46341e3502F4482J94957h0108I7236h4817D23841G5407b98955A22002
$$ 68286 -246341 -53502 64482 259439 -80108 97236 -84817 423841 75407 -298955 122002
12856a81584j6122C10006e9139B32109a3621B58517a02914k4205A48987n9239
$$ -181584 -197706 310006 -59139 232109 -13621 258517 -102914 -127119 148987 89748
12846H9748C3472a01069d0384f963B18724q0058K24539j77236f5138A96926H0798
$$ 89748 33472 -101069 -40384 -6963 218724 138666 363205 185969 -65138 196926 80798
12834E178J53580a62357D44324d0909o1510m0993A26596K62405B3101b03512A11420
$$ 5178 158758 -162357 444324 -40909 -102419 -143412 126596 389001 23101 -203512 111420
12822b53745B8912d2756b0359B25193c59323A72930E0945O6545i7904d4484o2245
$$ -253745 28912 -42756 -20359 225193 -359323 172930 50945 117490 -97904 -44484 -106729
12811a06729D15915B7171J47312f9261j15937B9979g6612B81881A31232K14819
$$ -106729 415915 27171 174483 -69261 -185198 29979 -76612 281881 131232 346051
12801C46051j34595a33637k4889A07997B6500d16174B80039A9829d47094C1364
$$ 346051 211456 -133637 -158526 107997 26500 -416174 280039 19829 -447094 31364
12790a99583A7280L1552J80039G9423c9503p2660A49811a74020A97525J12894
$$ -199583 17280 48832 228871 79423 -39503 -112163 149811 -174020 197525 310419
12780C10419D4950a8008A06832D5579b72554a5032n0505j76593j14219B58084
$$ 310419 44950 -18008 106832 45579 -272554 -15032 -65537 -242130 -356349 258084
12769a07643H4538J02034e9690j43696j15248B2912M56612a26067d0649k3547
$$ -107643 84538 186572 -59690 -203386 -318634 22912 479524 -126067 -40649 -64196
12759f4196G4922b92837B35985E1144L92037b3359j97395A33984J13637a85622
$$ -64196 74922 -292837 235985 51144 443181 -23359 -220754 133984 247621 -185622
12748A977M663a01567A74026a92645A74007A1756K11365D5039g2476A12183P7409
$$ 1977 6640 -101567 174026 -192645 174007 11756 223121 45039 -72476 112183 189592
12737A89592e52219E816J14577a08328A64316d7737A38759D519a6429E18965B52626
$$ 189592 -552219 5816 120393 -108328 164316 -47737 138759 4519 -16429 518965 252626
12725a3060B0864K32387C8368h6312j03754C80320c3751o9884G7237Q2312Q2346
$$ -13060 20864 253251 38368 -86312 -190066 380320 -33751 -103635 77237 159549 241895
12714B41895r5327k5695a80974q0912B88588A40841b56910E13376A11624b20567
$$ 241895 146568 120873 -180974 -261886 288588 140841 -256910 513376 111624 -220567
12703A43832J22062j21255A6750K16671f0191D7502e7266A50451J61882b58034
$$ 143832 265894 144639 16750 233421 -60191 47502 -57266 150451 312333 -258034
12692A36531c374B18334a68343A03105K84305a5340A46281Q4521h5025j4042I8170
$$ 136531 -3374 218334 -168343 103105 387410 -15340 146281 230802 -85025 -99067 98170
12680B82025o6469H3283A079L2556M52950G8724J64514R7981b0403A87628f3960
$$ 282025 215556 83283 1079 33635 486585 78724 243238 341219 -20403 187628 -63960
12668i689q0953L1136B5957K47187b72592B16963q9222a7908E6154b37657B67347
$$ -9689 -90642 -59506 25957 273144 -272592 216963 127741 -17908 56154 -237657 267347
12656B10178f7073C3622K11584p1221A6765L31303G3047o031J90632A03541Q9757
$$ 210178 -67073 33622 245206 173985 16765 348068 73047 67016 257648 103541 193298
12645A93298J51138A23087a09895A60229K34164I3031a33560A12978b25760g0375
$$ 193298 344436 123087 -109895 160229 394393 93031 -133560 112978 -225760 -70375
12634d7247B50175k8982q7064B9281a48674C80017F6791h083C40378a83354F4100
$$ -47247 250175 221193 134129 29281 -148674 380017 66791 -8083 340378 -183354 64100
12622f5517B05174a45373M3021r7750d7307m4156p8863H3602J36110A0182J73079
$$ -65517 205174 -145373 -102352 -200102 -47307 -91463 -170326 83602 219712 10182 183261
12611A83261G3914D921J46703N0032c8052n638r4925B77e3687H2558f0074I7392
$$ 183261 73914 4921 151624 201656 -38052 -43690 -138615 277 -53687 82558 -60074 97392
12598a5892A13859K47370C7708h8462G5278C7138a50009D84527C9861H586a65900
$$ -15892 113859 361229 37708 -88462 75278 37138 -150009 484527 39861 8586 -165900
12586A99835r0026b18305h61F3973b13882F5738b89529O6055M2536D04318B3721
$$ 199835 109809 -218305 -861 63973 -213882 65738 -289529 -223474 -180938 404318 23721
12574C57556G3557a87090Q569k7156D8431c4709A3162L8709b887k02785g7635
$$ 357556 73557 -187090 -178521 -205677 48431 -34709 13162 51871 -2887 -205672 -77635
12562A77424o3656O0377i1513R519A69788B3998J5463N9194a30436O280m962n9338
$$ 177424 113768 174145 -91513 -81994 169788 23998 39461 98655 -130436 -124156 -129118 -188456
12550a88456a0695B9628g8608B82520J28777a68070e3055D2126g4859I5969a46279
$$ -188456 -10695 29628 -78608 282520 411297 -168070 -53055 42126 -74859 95969 -146279
12538H949J01610a93050A34445E8766B9169b46576F5740P6698A4779b10813B62100
$$ 8949 110559 -193050 134445 58766 29169 -246576 65740 142438 14779 -210813 262100
12526a21252m2744C4226h4114I366c6758o6117p7478k29941J86887J07448d4817
$$ -121252 -163996 34226 -84114 9366 -36758 -102875 -180353 -410294 -223407 -115959 -44817
12514a22007j51416g6453p3431o2065B07798h4430A01873b61194P3058e5944A02286
$$ -122007 -273423 -76453 -149884 -211949 207798 -84430 101873 -261194 -188136 -55944 102286
12502b39729N0228B72456G6358J76884F8212e4108n9063C4416a43514B18948l3869
$$ -239729 -189501 272456 76358 253242 68212 -54108 -113171 34416 -143514 218948 185079
12491A85079b10244B25767k9070a32118a3639k2011A19659b17261A83205J57184
$$ 185079 -210244 225767 196697 -132118 -13639 -35650 119659 -217261 183205 340389
12481C40389A00833B1237b25381l3770A26804a12465e2585m6488F8931J38823
$$ 340389 100833 21237 -225381 -259151 126804 -112465 -52585 -99073 68931 207754
12471B07754c756j58568B01161e7559j85603A58457D4148Q0947J24809i1190a2924
$$ 207754 -3756 -162324 201161 -57559 -243162 158457 44148 125095 249904 -91190 -12924
12459b71170L9781c9620l93975C78268g1692j68435e4070A76199D4894a11168
$$ -271170 -231389 -39620 -433595 378268 -71692 -240127 -54070 176199 44894 -111168
12448C08325h9621M4442m0221B20621A02442l6702M4430O4400D4749a66481j09511
$$ 308325 -89621 -45179 -85400 220621 102442 65740 110170 174570 44749 -166481 -275992
12437b75992C6383a2705A47465j7362i3241A05942E1892M8476B1032H379f141
$$ -275992 36383 -12705 147465 130103 -93241 105942 51892 100368 21032 8379 -6141
12425B03841a57041C03137b48668D2593M6171m0026J14567K14543j23726E4092
$$ 203841 -157041 303137 -248668 42593 88764 48738 163305 377848 254122 54092
12414i4877A89348J24215G9820J28080c1554A15052M7145b27550B6554c35684
$$ -94877 189348 313563 79820 207900 -31554 115052 162197 -227550 26554 -335684
12403i4845l0891N0135A901K2714e8764O309r5166O794A9502b47751A77201L4518
$$ -94845 -125736 -75601 1901 24615 -58764 -52455 -147621 -140827 19502 -247751 177201 211719
12391B11719b73864i0904B12820o7164F7264b50825C61224g3216l88825H2133
$$ 211719 -273864 -90904 212820 145656 67264 -250825 361224 -73216 -462041 82133
12380D9815a55837A80334c35625J36530C96640F9128j0330b46184R3005N3372
$$ 49815 -155837 180334 -335625 -199095 396640 69128 58798 -246184 -153179 -99807
12370i9807A42702E0514K19901c92941b1999j67356j0662J8258c4584j11169a1024
$$ -99807 142702 50514 270415 -392941 -21999 -189355 -200017 -181759 -34584 -145753 -11024
12358c5425p2494L8462a6354A29663b37529O933j63715I0628J7202A7227d0803
$$ -35425 -107919 -69457 -16354 129663 -237529 -230596 -394311 90628 107830 17227 -40803
12346g7006B77616O3549r3213E9922M25653B19755F0887e00982B85610a44483
$$ -77006 277616 341165 247952 59922 485575 219755 60887 -500982 285610 -144483
12335B80381B4347Q862J49547a88679b1000j79564O0977o3355K9728A41578b39078
$$ 280381 24347 33209 182756 -188679 -21000 -200564 -139587 -202942 -173214 141578 -239078
12323B27700G6046J86902j10727c03154A6719a85389l23898B53036m7969o5759
$$ 227700 76046 262948 152221 -303154 16719 -185389 -509287 253036 205067 139308
12313A39308R1270a85977B8205a50487C3346J33750a88915A4279c86527I5320
$$ 139308 230578 -185977 28205 -150487 33346 167096 -188915 14279 -386527 95320
12302a31949J5276N954A8051P1457b98800A83200M2780c6967o2865C358a00626
$$ -131949 -116673 -110719 18051 89508 -298800 183200 225980 -36967 -99832 3358 -100626
12290a15769B08354c52795B40565a80712d1269j09755B44727a7643C44897F9985
$$ -115769 208354 -352795 240565 -180712 -41269 -151024 244727 -17643 344897 69985
12279B4116R5253D2380J42539R4731j22007J37207F4879K42784j31782K04633
$$ 24116 119369 42380 184919 279650 157643 294850 64879 307663 175881 380514
12269C80514j20693I4261J08270h481k2348k41340E8102a92436B10608J28124
$$ 380514 259821 94261 202531 -8481 -30829 -272169 58102 -192436 210608 338732
12259C38732r5890n8507m6529K34098j78486J4608J01168G2526A4841P0348M9505
$$ 338732 242842 184335 137806 371904 193418 208026 309194 72526 14841 85189 134694
12248A34694c3163A06289a8848j38538B25380C3581L25639C57b6626A85085a28756
$$ 134694 -33163 106289 -18848 -157386 225380 33581 359220 357 -26626 185085 -128756
12236a4300B92565a88766h6069C67145A05695J78737c0901C05549D5250a28577
$$ -14300 292565 -188766 -86069 367145 105695 284432 -30901 305549 45250 -128577
12225A79050K86191j83689j23562J34199l105l8359q8177M555N9771a05616A92259
$$ 179050 465241 281552 157990 292189 289084 250725 162548 167103 226874 -105616 192259
12213g9481H2234b54089e5508k7891B11652E0772a57909C25717a87535C50085
$$ -79481 82234 -254089 -55508 -83399 211652 50772 -157909 325717 -187535 350085
12202A39722K66412A89803D1310d8434A0401L27733g2672A76204J44477j57897
$$ 139722 406134 189803 41310 -48434 10401 338134 -72672 176204 320681 162784
12192A62784G0504J90890J13576e6415q14A98854j1152a5040A93691m6997o4195
$$ 162784 70504 261394 374970 -56415 -57229 198854 187702 -15040 193691 146694 82499
12181H2499K16733F8415e8173G510L30712a05106A71202Q6003J9631h5763r3054
$$ 82499 299232 68415 -58173 7510 338222 -105106 171202 257205 276836 -85763 -178817
12170a78817b4710A09019M48708B11494R5042J51845f7422f807D52007b26512
$$ -178817 -24710 109019 557727 211494 306536 458381 -67422 -6807 452007 -226512
12159c9864B31650J70616A33543J76705r9081C4913a35094F85644A12849D766
$$ -39864 231650 402266 133543 310248 211167 34913 -135094 685644 112849 4766
12148F1995a98823G2937J31719I5758c9071E5376o587J42292a26379e0603A247
$$ 61995 -198823 72937 204656 95758 -39071 55376 48789 191081 -126379 -50603 1247
12136A13569b47836B2924J57744b12545A2805L260J41067o2347a21498o621J8963
$$ 113569 -247836 22924 180668 -212545 12805 16065 157132 94785 -121498 -128119 -109156
12125a09156N3461B66330H3189C853J13729J69351D0347a05656A87361e7142A42381
$$ -109156 -55695 266330 83189 3853 117582 286933 40347 -105656 187361 -57142 142381
12113b32691A2348K53072a61388P2627D400a02025k50672a188k00231G3552B3018
$$ -232691 12348 265420 -161388 -88761 4400 -102025 -352697 -1188 -201419 73552 23018
12101d0890j68633i3422r6278B05078p9588e7729C10783b32761N9907N5810B9388
$$ -40890 -209523 -93422 -189700 205078 125490 -57729 310783 -232761 -172854 -117044 29388
12089B6613g8750A07026k984b88108g1775A01822J64790L1826P77918J235617
$$ 26613 -78750 107026 104042 -288108 -71775 101822 266612 298438 1076356 2311973
12079B311973A099247C56457q7178a45007j65381B50413D9366K59108d6985j6736
$$ 2311973 1099247 356457 269279 -145007 -310388 250413 49366 308474 -46985 -63721
12069f3721A99558d3020j00516r4252K9622B9330L1387h2287j41956G1379l0243
$$ -63721 199558 -43020 -143536 -237788 -208166 29330 60717 -82287 -224243 71379 41136
12058D1136J01389a18878l28606A24068a33301f3764B75700a03426J0783A67689
$$ 41136 142525 -118878 -447484 124068 -133301 -63764 275700 -103426 -92643 167689
12047a94822A41281f7311l41149B81452b98035a25758F9268f6730l05593a20570
$$ -194822 141281 -67311 -408460 281452 -298035 -125758 69268 -66730 -372323 -120570
12036e244j13350K9091A59144b60692I612M9836a5184j41678H5108a79490e0400
$$ -5244 -118594 -89503 159144 -260692 9612 59448 -15184 -156862 85108 -179490 -50400
12024c108B13069f406C6023J27187J8567c18404i8839k6074k38962d5251g182
$$ -3108 213069 -6406 36023 163210 181777 -318404 -98839 -124913 -363875 -45251 -7182
12012D7893a27671J1294G34b58850D9362K61238b42963R9994j18194a04827F2061
$$ 47893 -127671 -116377 734 -258850 49362 310600 -242963 -142969 -261163 -104827 62061
12000b27387A65232q1457J79859c43835h1968j78164g5223j53930E2592g1916
$$ -227387 165232 83775 263634 -343835 -81968 -260132 -75223 -229153 52592 -71916
11989G8381A3862K7872K34020a47825r1134A44222O4148J0461O1653b65525a07467
$$ 78381 13862 41734 275754 -147825 -238959 144222 208370 218831 280484 -265525 -107467
11977A04225J63496h1562C92338E430c13396f537j07450n8685L9155p7250I7755
$$ 104225 267721 -81562 392338 5430 -313396 -6537 -113987 -172672 -133517 -210767 97755
11965b91827B7687N3993K7299J17345L8101a05526B52367H0495a1183A69561a38103
$$ -291827 27687 81680 108979 226324 264425 -105526 252367 80495 -11183 169561 -138103
11953I2311L25c27611a08299C1584a41047A40807k9113a24415g301D7369O9886
$$ 92311 92636 -327611 -108299 31584 -141047 140807 111694 -124415 -7301 47369 117255
11942A17255C1324a31113C1559K4211R5815o1939G098a11850E0703h0634K3856
$$ 117255 31324 -131113 31559 55770 151585 89646 7098 -111850 50703 -80634 -56778
11931e6778D8520J00288i9248F1013Q7816c1008C73131j75914d6551C27875j05248
$$ -56778 48520 148808 -99248 61013 148829 -31008 373131 197217 -46551 327875 222627
11920B22627B4746n589h0340A5308J93949C9142a03628o3845D0028K15280a76627
$$ 222627 24746 19157 -80340 15308 209257 39142 -103628 -167473 40028 255308 -176627
11908E2889L6643a5088j43913A25466K16530A69269m6408h2530A01835K5548a19863
$$ 52889 89532 -15088 -159001 125466 341996 169269 122861 -82530 101835 127383 -119863
11896A03253M32502b6300I6362K00953a26936L7472A6063a2658j99976A27596
$$ 103253 535755 -26300 96362 297315 -126936 -89464 16063 -12658 -212634 127596
11885b27323f2656j29785I2291J68664a13907A6797a75037B13767B5234c3244
$$ -227323 -62656 -192441 92291 260955 -113907 16797 -175037 213767 25234 -33244
11874e9077b6073D9163i517j64155B87281g2187a238A48055O0894c55099I0635
$$ -59077 -26073 49163 -9517 -173672 287281 -72187 -1238 148055 208949 -355099 90635
11862A81670C4133f9462m4068B68006c25551a6083A67182b798k96655a42484G0399
$$ 181670 34133 -69462 -113530 268006 -325551 -16083 167182 -2798 -299453 -142484 70399
11850a75688j5866D5622J02769p899b86714k02507b36984C81552A41105m6271
$$ -175688 -191554 45622 148391 140492 -286714 -489221 -236984 381552 141105 94834
11840I4834a70630B23207b7807B49647H415b41655E2453K45681b29363F8082i8999
$$ 94834 -170630 223207 -27807 249647 8415 -241655 52453 298134 -229363 68082 -98999
11828C4055g5490K7506a4906j82613G1035k2363b37579C9585a98000R8354a4446
$$ 34055 -75490 -47984 -14906 -197519 71035 48672 -237579 39585 -198000 -99646 -14446
11816a14402j60691a35239j3381A46390J49276j06914b56809C6094b24470R4890
$$ -114402 -275093 -135239 -148620 146390 295666 188752 -256809 36094 -224470 -129580
11806a29580k82710A21056d6302A5071M4120a02768n5564M5383B08539c2323A23838
$$ -129580 -412290 121056 -46302 15071 59191 -102768 -158332 -112949 208539 -32323 123838
11794D24794a31874j27116A5106J81402F1558J412a75530j48590A92290J916i9041
$$ 424794 -131874 -258990 15106 196508 61558 62970 -175530 -324120 192290 194206 -99041
11782e6672A59148c96796a3623C16632c71685B18830c70937B1273b24104K5227
$$ -56672 159148 -396796 -13623 316632 -371685 218830 -370937 21273 -224104 -198877
11772a98877B2052J25505b73235F191O3206k0903H130a05932C10699d15696d5860
$$ -198877 22052 147557 -273235 6191 69397 48494 8130 -105932 310699 -415696 -45860
11760g6027j19047h1250A2124J69730q8703c6099B36889m5595b92903J25168n232
$$ -76027 -195074 -81250 12124 181854 93151 -36099 236889 191294 -292903 -167735 -172967
11749a72967C09073m2866i4343c136C29569A17784a43439B37664a2798m867j7415
$$ -172967 309073 266207 -94343 -3136 329569 117784 -143439 237664 -12798 -17665 -35080
11738c5080j85260A6323J83302a7816n0959J5494k25262B12896k5653a93670a4247
$$ -35080 -220340 16323 199625 -17816 -68775 -53281 -278543 212896 187243 -193670 -14247
11726G7395M1888g3177l38860B22155a17928E0793f4033k73810A76298C1253a93606
$$ 77395 119283 -73177 -412037 222155 -117928 50793 -64033 -337843 176298 31253 -193606
11714c88949G3821O6120b9455D09601A45561C3102J14404a95362O7894A77701
$$ -388949 73821 139941 -29455 409601 145561 33102 147506 -195362 -127468 177701
11703A55027E4709L7628N9621L8747j6362J03990E383b68837B50610J8371A04009
$$ 155027 54709 92337 151958 190705 174343 278333 5383 -268837 250610 268981 104009
11691e3707C41752i6631A24025a97493A33106g1927j15693e6361B29095j00513
$$ -53707 341752 -96631 124025 -197493 133106 -71927 -187620 -56361 229095 128582
11681A28582k6734h3497F5867O6380a53145A92751B8264J00456k9105a21454A14591
$$ 128582 101848 -83497 65867 132247 -153145 192751 28264 128720 99615 -121454 114591
11669A77612b72350F9597i5145A47831B3988a88182L5728I1173a50866B27044
$$ 177612 -272350 69597 -95145 147831 23988 -188182 -152454 91173 -150866 227044
11658B20181h2677l7360d1611D09515a7012C40657j66336a2327H0493M242a0791
$$ 220181 -82677 -120037 -41611 409515 -17012 340657 174321 -12327 80493 84735 -10791
11646B49818r8109O7409I6366P1860c5819B36587p6457E6521h2864I5526a1116
$$ 249818 151709 219118 96366 168226 -35819 236587 160130 56521 -82864 95526 -11116
11634a63262c6454A24958e0557A36663a20679b1324A04086K4659D6688b6664h699
$$ -163262 -36454 124958 -50557 136663 -120679 -21324 104086 128745 46688 -26664 -8699
11622E8314e4914H1542Q1461b43040K2470l339I4788J92481J1555r8370a5919
$$ 58314 -54914 81542 163003 -243040 -220570 -223909 94788 287269 298824 200454 -15919
11610B30573b48331A69088a60123B24374j9493R6240A45124J69368a794A28090
$$ 230573 -248331 169088 -160123 224374 204881 301121 145124 314492 -1794 128090
11599A39961R7626K1025i2792A45509a16981L6914D23275A74694B5974h8966r9926
$$ 139961 237587 258612 -92792 145509 -116981 -80067 423275 174694 25974 -88966 -188892
11588a88892C2640a59951g9783B40176a43507N3978B63382C4695J05446a25924
$$ -188892 32640 -159951 -79783 240176 -143507 -89529 263382 34695 140141 -125924
11577A7855P9585q884a16081G7328K12550A03052L1775J71620b0178B83032A28118
$$ 17855 97440 88556 -116081 77328 289878 103052 134827 306447 -20178 283032 128118
11565c01051A1841J34927g8186A7236p544R3660q998J60891o5703o1687B3563
$$ -301051 11841 146768 -78186 17236 9692 103352 94354 255245 189542 127855 23563
11553b63314A95568F2281J5325J61034f6895A2737a15583C9701M62948A44999
$$ -263314 195568 62281 77606 238640 -66895 12737 -115583 39701 502649 144999
11542H3726a54994K2528a5273H0103b2509D69115a88777c2535C19960A16460o298
$$ 83726 -154994 -132466 -15273 80103 -22509 469115 -188777 -32535 319960 116460 110162
11531A10162J98852D5376a02124M3139A09745a49051B35394A08401O0352p5926
$$ 110162 309014 45376 -102124 -58985 109745 -149051 235394 108401 168753 92827
11521I2827Q5550H7268N2529J953o9761c8473F5221J57919D772R7930c9175k78866
$$ 92827 178377 87268 139797 141750 71989 -38473 65221 223140 4772 102702 -39175 -318041
11509c18041C20296f0120j42668A36440Q8678f0393N622a5475B14854F1910A2187
$$ -318041 320296 -60120 -202788 136440 225118 -60393 -54771 -15475 214854 61910 12187
11497A94624O498f1710A34755l1687J32670A02477P2003l6948b85452B44208b6535
$$ 194624 201122 -61710 134755 103068 235738 102477 174480 137532 -285452 244208 -26535
11485G7398Q382g1491a9916C902b13646j85b0454D23283j90073k6932k584A5506
$$ 77398 85780 -71491 -19916 3902 -213646 -213831 -20454 423283 233210 206278 203694 15506
11472H475K48124b68684B16969a2313j88074B68671b4938L294E34520A80390b06040
$$ 8475 256599 -268684 216969 -12313 -200387 268671 -24938 -21644 534520 180390 -206040
11460A91313A0747O5650b8681B34119F7823J6728b0319E690i1345P191B84724
$$ 191313 10747 76397 -28681 234119 67823 84551 -20319 5690 -91345 -84154 284724
11448C02561M0490b26459E5197K29158I2399c01048A59770a23777A9183e292k49992
$$ 302561 343051 -226459 55197 284355 92399 -301048 159770 -123777 19183 -5292 -255284
11437b55284a09578C94523H0679a39705A07384a05771E3431d14027A63575B6839
$$ -255284 -109578 394523 80679 -139705 107384 -105771 53431 -414027 163575 26839
11426a43023M4983c0448j28361D3443J27383R5444r4442F2196c7274E4929J06627
$$ -143023 -98040 -30448 -158809 43443 170826 266270 171828 62196 -37274 54929 161556
11415A61556h744C2697J53519k8079e0577K4620n1385C19576a476F8137e2377
$$ 161556 -8744 32697 186216 158137 -50577 -25957 -77342 319576 -1476 68137 -52377
11403a4047I8027K37969G3207P0316b10124e2717A48066A3437a66408e9567o5587
$$ -14047 98027 335996 73207 143523 -210124 -52717 148066 13437 -166408 -59567 -125154
11392a25154A8229K12354J44948j51153C1754K00554b14434A76016a21248h548
$$ -125154 18229 230583 375531 224378 31754 232308 -214434 176016 -121248 -8548
11381b32864g5223m17920D77106e2933B65512D3489B0032R7749a07810C9520d7490
$$ -232864 -75223 -493143 477106 -52933 265512 43489 20032 117781 -107810 39520 -47490
11369B0169M7784a86438A96092b05470r359b7729L055F68a17643a7737k9765A50528
$$ 20169 67953 -186438 196092 -205470 -214829 -27729 -24674 668 -117643 -17737 -47502 150528
11356h6435J4396k23p2768A24163m1839L32618A22055c0868j88165K5512J156
$$ -86435 -72039 -72262 -145030 124163 82324 414942 122055 -30868 -219033 -193521 -192365
11345a92365L3217H5489m91c216B2640J02024E0649b89800N3097a7271I0605a2655
$$ -192365 -159148 85489 84998 -3216 22640 124664 50649 -289800 -236703 -17271 90605 -12655
11332a1856A17055c1406A09498c89119B45c409j32213D9769b37471g4093C70559
$$ -11856 117055 -31406 109498 -389119 245 -3409 -135622 49769 -237471 -74093 370559
11320E6388M3859R5310a14814q0088A75737L9024F2809i4241F8731J05607b40110
$$ 56388 100247 195557 -114814 -194902 175737 214761 62809 -94241 68731 174338 -240110
11308d08464a42095L1695E2662o773e8909B31633B2879J59520N3957a72570H7838
$$ -408464 -142095 -110400 52662 45889 -58909 231633 22879 182399 236356 -172570 87838
11296a9744R692j10398k7964H3343a62529A52894g9590B07279r8644D6334c06980
$$ -19744 -10052 -120450 -148414 83343 -162529 152894 -79590 207279 108635 46334 -306980
11284I4262l4412B2119N3297h8477o1594F6379c31212f8545F8392C3245Q221H961
$$ 94262 59850 22119 75416 -88477 -150071 66379 -331212 -68545 68392 33245 41466 8961
11271a75919B73048b89240i5251j01368m4955o9276b9314A52026g2299A45978
$$ -175919 273048 -289240 -95251 -196619 -241574 -310850 -29314 152026 -72299 145978
11260b10558e6529m5308k99371E6296b83819a1990j21815A90240A1614D054a13823
$$ -210558 -56529 -101837 -401208 56296 -283819 -11990 -133805 190240 11614 4054 -113823
11248e0012a5489o7253c8949L738q8739m32109b02714Q2671j9388A44684N1471
$$ -50012 -15489 -82742 -38949 -35211 -123950 -556059 -202714 -120043 -139431 144684 196155
11237A96155J06736A50972c2611k22730R8676E2675j8493J9193e36B81047a02776
$$ 196155 302891 150972 -32611 -255341 -156665 52675 34182 53375 -536 281047 -102776
11225c66434A36373i318j21684m6376b8096j52034f3534j62049a3730j12805J5591
$$ -366434 136373 -9318 -131002 -177378 -28096 -180130 -63534 -225583 -13730 -126535 -110944
11214a10944j94921A8480b48048g854k96391h6393m52189a40251F561c967q4320
$$ -110944 -305865 18480 -248048 -7854 -304245 -86393 -538582 -140251 6561 -3967 -88287
11203h8287A10253k3303b38137j35709a51867D1122e0998F2706b3893o6408p5592
$$ -88287 110253 86950 -238137 -373846 -151867 41122 -50998 62706 -23893 -90301 -165893
11192a65893B15972h4250q6008r1406b3546P200A11589m7796l0113a97148l0906
$$ -165893 215972 -84250 -170258 -261664 -23546 -16346 111589 63793 33680 -197148 -228054
11181b28054a11668l77296a08692C5943a15644G3000a63916b7244A34505g8601
$$ -228054 -111668 -488964 -108692 35943 -115644 73000 -163916 -27244 134505 -78601
11170A60991l8637L64276A16186a65275A11555b55561j6036J22917e7416j08035
$$ 160991 122354 486630 116186 -165275 111555 -255561 -271597 -148680 -57416 -165451
11160a65451k06418E4843c94844a61678k9948Q7341C499a78809c1429r6358A07447
$$ -165451 -371869 54843 -394844 -161678 -191626 -104285 3499 -178809 -31429 -127787 107447
11148a24714G2488a44307B58417a01852B6006J3834b65761d3687e098A45118J70364
$$ -124714 72488 -144307 258417 -101852 26006 39840 -265761 -43687 -5098 145118 315482
11137C15482a39918k6056B31048m6724g4666C82883A73752G6564c1111D9554a15449
$$ 315482 -139918 -165974 231048 184324 -74666 382883 173752 76564 -31111 49554 -115449
11125H9851O9529c6427B76272d10603a7191k85432F8855C3078h5999C67921h733
$$ 89851 159380 -36427 276272 -410603 -17191 -302623 68855 33078 -85999 367921 -8733
11113a99874B91616e4928B02801K07253A73173N5538K3586N4888H2255a93724
$$ -199874 291616 -54928 202801 410054 173173 228711 252297 307185 82255 -193724
11102C32219A15155P4993n0242N102J03554A1852K64328o4698m7545J98011q3338
$$ 332219 115155 190148 139906 145008 248562 11852 276180 211482 163937 361948 278610
11091B78610j21460o6781D1735K60436I4785a61634e1563D49992k14744o737r5179
$$ 278610 157150 90369 41735 302171 94785 -161634 -51563 449992 235248 228511 133332
11080A33332K25164a43990B99002E9996N2978L8290L28403F7435J24270M8433
$$ 133332 358496 -143990 299002 59996 112974 151264 479667 67435 191705 240138
11070B40138I6402a9887D18122J38286j06628n9252j24992J75748p505K96872
$$ 240138 96402 -19887 418122 556408 449780 390528 265536 441284 433779 730651
11060G30651l2840k0665k56103L09871k54584J24966A65560O11901j82972N454
$$ 730651 697811 677146 421043 730914 476330 601296 165560 777461 594489 599943
11050E99943J55543q5124k16527K31627k92466L87889j1829m9182j17133J28793
$$ 599943 755486 670362 453835 685462 392996 780885 769056 719874 602741 731534
11040G31534p5929Q1924k92500P9255m7964K90295B82891J04591L02940J99273
$$ 731534 655605 737529 445029 524284 476320 766615 282891 387482 690422 889695
11030H89695k21973q093J1290k42758K12249A85106M93872j5188p5925j37699
$$ 889695 667722 659629 670919 428161 640410 185106 678978 663790 587865 450166
11020D50166j1801N3154M5539q610k6251M4084k04065L2425L46246B96900n9754
$$ 450166 438365 491519 537058 528448 502197 546281 342216 374641 720887 296900 237146
11009B37146r8594L00027j04132K31748j06492J64244M995j12672J5232J85286
$$ 237146 138552 438579 334447 566195 459703 623947 628942 516270 531502 716788
10999G16788B23071M87483k5577K8004q2947Q4716k1752K00274k55502A99310
$$ 716788 223071 710554 684977 712981 630034 714750 692998 893272 637770 199310
10988H10532M7785m5669l04392J30766p8110L31464k12096L1437K73480J05852
$$ 810532 858317 812648 508256 639022 560912 892376 680280 711717 985197 1091049
10978A091049K45493j72463M29359n1587k6348P42840l53365J65105N92960l40205
$$ 1091049 1336542 1164079 1593438 1541851 1515503 2258343 1904978 2070083 2663043 2322838
10968B322838k222k81291J02535p31005J51526l45840K91188M9069j64738J27716
$$ 2322838 2320616 2039325 2141860 1410855 1562381 1216541 1507729 1556798 1392060 1519776
10958A519776L5116q2890M28830k24561j41564j58151j62903M1065o1419n59065
$$ 1519776 1554892 1472002 1900832 1676271 1534707 1376556 1213653 1254718 1193299 634234
10948F34234K25655C55689o5759J14380A07827M03826O9559A34422Q9502r3227
$$ 634234 859889 355689 289930 404310 107827 511653 581212 134422 223924 130697
10938A30697L0130p5390m819f493j8752A50866l7859e1390C7947c56481g6103
$$ 130697 160827 85437 80618 -6493 -25245 150866 113007 -51390 37947 -356481 -76103
10926B49188b70309g1441c1491B3593J0882L3118l2725i7729D96194c8176B1499
$$ 249188 -270309 -71441 -31491 23593 34475 67593 34868 -97729 496194 -38176 21499
10914h7540q7030O6486A84846E1192K1997h1799k5413C3257J56702C1862d9430
$$ -87540 -174570 -108084 184846 51192 73189 -81799 -107212 33257 189959 31862 -49430
10902B76861A00024M0850C8580f0954H0691d36770D6916P9532h0572C14023B9374
$$ 276861 100024 140874 38580 -60954 80691 -436770 46916 126448 -80572 314023 29374
10890I0644a26306A94106E2705L2929j8939N4645c04987A3966d40713a34559A15328
$$ 90644 -126306 194106 52705 85634 66695 121340 -304987 13966 -440713 -134559 115328
10878E8302P6279d1301A57015m2875Q7009b25492m3964J10573H3455k9558Q340
$$ 58302 134581 -41301 157015 114140 201149 -225492 -269456 -158883 83455 53897 62237
10867F2237a60600o4788A33052b32715J01666e6837p3324A893K57544g315D97881
$$ 62237 -160600 -225388 133052 -232715 -131049 -56837 -130161 1893 259437 -7315 497881
10855a65192K2530c9395D3099e9421A31530O7821o4291D7599J36529H3304a78221
$$ -165192 -142662 -39395 43099 -59421 131530 199351 135060 47599 184128 83304 -178221
10843f11036G0528J11040q9393C3598e1626A60268b31450h1901b3325m8791I3963
$$ -611036 70528 181568 92175 33598 -51626 160268 -231450 -81901 -23325 -72116 93963
10831a71505C3834O3715R002B525c23009j50886c205H202a08752k4806A08219
$$ -171505 33834 97549 106551 2525 -323009 -473895 -3205 8202 -108752 -133558 108219
10819C22381i8294K1537B6440K2804J60718A5961J25802a70388P8753j53544g4991
$$ 322381 -98294 -76757 26440 49244 209962 15961 141763 -170388 -91635 -245179 -74991
10807B40326C8139d7684A3858b00467B09198m143a6269p4918M3805A38676b13825
$$ 240326 38139 -47684 13858 -200467 209198 205055 -16269 -91187 -47382 138676 -213825
10795a44253A47023a81787A03497K61947A20735a92319d6280k9489g475k16767
$$ -144253 147023 -181787 103497 365444 120735 -192319 -46280 -75769 -7475 -224242
10785b24242g5799B4877h5420B78451C9868f6862l11055d7916j09347f8459k55091
$$ -224242 -75799 24877 -85420 278451 39868 -66862 -377917 -47916 -157263 -68459 -323550
10774c23550B47429e9190a2477H2404N3860J38171b83006h4757a6804n87514a43916
$$ -323550 247429 -59190 -12477 82404 136264 274435 -283006 -84757 -16804 -604318 -143916
10762a78748F4378J06161p6603g8683m7937F270a71824a8186k76659k7692J52999
$$ -178748 64378 170539 93936 -78683 -126620 6270 -171824 -18186 -294845 -322537 -169538
10751a69538f8452B355c12965B11950c73258j49025B65429j21636b22027K991
$$ -169538 -68452 2355 -312965 211950 -373258 -522283 265429 143793 -222027 -219036
10741b19036L3877l0673j46159J47660A14663D3175Q6937c52412h2332n6045A72095
$$ -219036 -185159 -215832 -361991 -214331 114663 43175 130112 -352412 -82332 -138377 172095
10729A83617J14504A24824K555b94765B2058O3205d21560m1944A90075e699k72314
$$ 183617 298121 124824 127379 -294765 22058 85263 -421560 -463504 190075 -5699 -278013
10718b78013B13823H1353C0685a41385J6981L0135j75891f6586B55757h0898q6871
$$ -278013 213823 81353 30685 -141385 -124404 -94269 -270160 -66586 255757 -80898 -167769
10707a67769m8760B4851J18893O6433p418M0211a30237l3753e6839D1961A8837
$$ -167769 -216529 24851 143744 210177 202759 242970 -130237 -163990 -56839 41961 18837
10695B85908E7694b13772F9023M6946j1094a57135P1392A73125l5670j8192c35490
$$ 285908 57694 -213772 69023 115969 104875 -157135 -85743 173125 137455 119263 -335490
10683I3518a0453B49525c249B34453p2098H009Q2996a99834n4101K346J17305
$$ 93518 -10453 249525 -3249 234453 162355 8009 91005 -199834 -253935 -251589 -134284
10672a34284d5973A13842a49590E9634Q0052o9564a35357a8181l1371D0638j4520
$$ -134284 -45973 113842 -149590 59634 139686 70122 -135357 -18181 -49552 40638 26118
10661B6118a22733A12025f6788K2157F9950j722P3634f847l34719C6551e6144
$$ 26118 -122733 112025 -66788 -44631 69950 68228 141862 -6847 -341566 36551 -56144
10649h3672l9619j78016G5454b22051b8456j54328j5345B70885d1986A21675a1028
$$ -83672 -123291 -301307 75454 -222051 -28456 -182784 -198129 270885 -41986 121675 -11028
10637a06314k900c1815A5498J1857b10884f9976r6478j40903i3084j27165n9416
$$ -106314 -109214 -31815 15498 27355 -210884 -69976 -166454 -307357 -93084 -220249 -279665
10626b79665R7138a7251k14237e9958J7870M618I5436N8204R9586a63365A03996
$$ -279665 -182527 -17251 -231488 -59958 -42088 -37470 95436 153640 253226 -163365 103996
10614A5708d7849j08861f3123D7788a10547j18648M8665E50093b09891a6452D1727
$$ 15708 -47849 -156710 -63123 47788 -110547 -229195 -180530 550093 -209891 -16452 41727
10602d43093D4190f9752A28084a24958A940J26943J71576j3477d3090F6449b85991
$$ -443093 44190 -69752 128084 -124958 1940 128883 300459 286982 -43090 66449 -285991
10590i8637D6464K55269I5874e88l15578A50350e7082C4663a720F6608O8732a17079
$$ -98637 46464 301733 95874 -588 -316166 150350 -57082 34663 -1720 66608 135340 -117079
10577G8423e4561I2697c53357O3234G3413a22079b4410j23036j7460f1145B46914
$$ 78423 -54561 92697 -353357 -290123 73413 -122079 -24410 -147446 -164906 -61145 246914
10565C00398A01043a05807A44839a6622B68761i6819A85727L7197b10511J01244
$$ 300398 101043 -105807 144839 -16622 268761 -96819 185727 222924 -210511 -109267
10555a09267o912b9556n9847l90781A19159A453a05942j83902D6343a34521B22062
$$ -109267 -116179 -29556 -89403 -480184 119159 1453 -105942 -289844 46343 -134521 222062
10543g609G6324a90236A1870P2511A780b59247O7191Q4478j58873l3044E5037
$$ -7609 76324 -190236 11870 84381 1780 -259247 -192056 -107578 -266451 -299495 55037
10531f5993A85094p0947d2577o7189i819B63743B8895K97372h7924q6620p2205
$$ -65993 185094 114147 -42577 -109766 -9819 263743 28895 326267 -87924 -174544 -246749
10520b46749A80880o9688K09387a48969A52616c13026A93599H4320k6520A9121
$$ -246749 180880 111192 320579 -148969 152616 -313026 193599 84320 57800 19121
10509b15678J06583G7010a14514j17014A05082J4129b05223A04357a54787L2870
$$ -215678 -109095 77010 -114514 -231528 105082 119211 -205223 104357 -154787 -121917
10499a21917a4012j00240p9529o2735A66197A1508b05768r8544A184J19099a63558
$$ -121917 -14012 -114252 -193781 -256516 166197 11508 -205768 -304312 1184 120283 -163558
10487a26623O2837j06231C53625l4026A09081K73483F905K93938P6154r631K3313
$$ -126623 -63786 -170017 353625 319599 109081 382564 6905 300843 376997 367366 390679
10476C90679o0200C4382J30050d6437C07811I8969K25848I7693a07737c6730E7839
$$ 390679 330479 34382 164432 -46437 307811 98969 324817 97693 -107737 -36730 57839
10464B5860c6853k1196F2486A2097a4632F464d59324H4668K092E324b01063B29496
$$ 25860 -36853 -58049 62486 12097 -14632 6464 -459324 84668 86760 5324 -201063 229496
10451A16360h766o8327n1816a6256A18473J18967B0479i9147j59158B05763a82321
$$ 116360 -8766 -77093 -128909 -16256 118473 237440 20479 -99147 -258305 205763 -182321
10439a02252d0097J4814k7987I3437g2828C03117a43327l4592B46131a13075j53792
$$ -102252 -40097 -25283 -53270 93437 -72828 303117 -143327 -177919 246131 -113075 -266867
10428b66867k8011r054D9626a3438B32893C4913n545e1062A08588A4019J89273
$$ -266867 -294878 -303932 49626 -13438 232893 34913 29368 -51062 108588 14019 203292
10417B03292G2903L28271C8088e2996B79516I8881h2968k1414I3239J95899g017
$$ 203292 72903 401174 38088 -52996 279516 98881 -82968 -104382 93239 289138 -7017
10405G5562b120B27010E9861e774q8246C2168h2375B28228B0514J33232n7096
$$ 75562 -2120 227010 59861 -5774 -94020 32168 -82375 228228 20514 153746 96650
10394I6650a01684B17701h4138A43264a45797A60350G489L94966a4032e945A93130
$$ 96650 -101684 217701 -84138 143264 -145797 160350 7489 402455 -14032 -5945 193130
10382A2288b7380B08690N5902H6166j8526J41626F1851N3972k0557O028Q422R1701
$$ 12288 -27380 208690 264592 86166 67640 209266 61851 115823 95266 101294 109716 201417
10370B01417G9448q477L56821J33895k12624J91630k05160q4329n4921f187A80373
$$ 201417 79448 70971 427792 561687 349063 540693 335533 251204 196283 -6187 180373
10358a83712C27441r5768i0228d4623A08481R9641M1349J02904L78408B74069
$$ -183712 327441 231673 -90228 -44623 108481 208122 249471 352375 730783 274069
10347C10059j27524F951M43063j94988H9181L54879A18100K74660b27933a2209
$$ 310059 182535 6951 450014 255026 89181 444060 118100 392760 -227933 -12209
10336B30686j10519J98612J26897A36687o7547J5399J03061a49016c3072j40887
$$ 230686 120167 318779 445676 136687 69140 84539 187600 -149016 -33072 -173959
10326a73959P9086C52996h1157A17372A0887J77462J62307O4164B605K45373b3397
$$ -173959 -94873 352996 -81157 117372 10887 188349 350656 414820 2605 247978 -23397
10314A50597C4260K7896K5300e1369k3475i49j03253k9616J3931A64667a7772
$$ 150597 34260 62156 87456 -51369 -74844 -949 -104202 -133818 -119887 164667 -17772
10302f395k40415C88208c82197G1242c477k02133B3293a10226j61920H6974g6882
$$ -6395 -246810 388208 -382197 71242 -3477 -205610 23293 -110226 -272146 86974 -76882
10290a50754k97030O4904D7232a97890A4806B676a10315m243I3779c2368J4818
$$ -150754 -447784 -382880 47232 -197890 14806 2676 -110315 -114558 93779 -32368 -17550
10279a7550j35858p9669a05134j70796D1020M9085J08816N2369i5683c3277B41757
$$ -17550 -153408 -233077 -105134 -275930 41020 90105 198921 251290 -95683 -33277 241757
10267a45197A79713a4801j51805a0679A76422m7295f6020I7073J88410b1741H4708
$$ -145197 179713 -14801 -166606 -10679 176422 129127 -66020 97073 285483 -21741 84708
10255F325a04044B81448p9659Q431q2508m3066a66243m5969d5039j58848O9057
$$ 6325 -104044 281448 201789 210220 127712 84646 -166243 -212212 -45039 -203887 -134830
10244a34830A17615a29043k7258b096B91092b5064j05382F1470b38360A42994
$$ -134830 117615 -129043 -156301 -2096 291092 -25064 -130446 61470 -238360 142994
10233a90935m2718A84603l7268b94373i9945k20222J49471A5119a53066K9221
$$ -190935 -233653 184603 147335 -294373 -99945 -320167 -170696 15119 -153066 -123845
10223a23845C03525a7315m00482G3605M03380a41705j03802b038j94896k71848
$$ -123845 303525 -17315 -417797 73605 476985 -141705 -245507 -2038 -196934 -468782
10213d68782a62329f1432j90536h2535k3133r1115K680F036f7404p2550n3692
$$ -468782 -162329 -61432 -251968 -82535 -105668 -196783 -194103 6036 -67404 -139954 -193646
10202a93646N2344b196k29236F9630j0507e7071k29198B28692a03553q2923B27288
$$ -193646 -141302 -2196 -231432 69630 59123 -57071 -286269 228692 -103553 -186476 227288
10190B2732h5998B0053J73100b80129B53358h7761A13275b1970A6681f9914G878
$$ 22732 -85998 20053 193153 -280129 253358 -87761 113275 -21970 16681 -69914 7878
10178D2323a25968B23336i0924j3437c7790C66805A50169H254a37046A18279j2251
$$ 42323 -125968 223336 -90924 -104361 -37790 366805 150169 8254 -137046 118279 106028
10167A06028D0079c87749b2826A26491m7971J52695c6781A14699a33539E097h5320
$$ 106028 40079 -387749 -22826 126491 78520 231215 -36781 114699 -133539 5097 -85320
10155A54378J71448d9204j72411E5436K86136r4869b95534G374b02516J3030p9970
$$ 154378 325826 -49204 -221615 55436 341572 246703 -295534 7374 -202516 -189486 -269456
10144b69456A74776G1731B5152P5783a30625K2714N3190j59248c9521o9673b8448
$$ -269456 174776 71731 25152 100935 -130625 -107911 -54721 -213969 -39521 -109194 -28448
10132c00337m7828B40176H3435l2703a15330j03861a0623k91893G1720a44998
$$ -300337 -348165 240176 83435 50732 -115330 -219191 -10623 -302516 71720 -144998
10121G2130b35702j6581c681F3712a24551I8809J38016i4110l8070b3167I6598
$$ 72130 -235702 -252283 -3681 63712 -124551 98809 236825 -94110 -132180 -23167 96598
10109a0216A63925b57149J07508O2321k9037b4991q8460G6983a01504M0552k1738
$$ -10216 163925 -257149 -149641 -87320 -116357 -24991 -113451 76983 -101504 -60952 -82690
10098h2690k73218a21640M9776b3237I2464c68489B45356m3920p8075d0407j3290
$$ -82690 -355908 -121640 -71864 -23237 92464 -368489 245356 201436 123361 -40407 -53697
10087e3697l17110D8130f2630A04338n0419k1814e6224a0026k57769A08220a72524
$$ -53697 -370807 48130 -62630 104338 53919 32105 -56224 -10026 -267795 108220 -172524
10075b58800A2156J52392a0918p0318j10678L0747Q0483A30913a217k8569F3786
$$ -258800 12156 164548 -10918 -81236 -191914 -161167 -80684 130913 -1217 -29786 63786
10063a35877J6226H0991a14395I0902L8178A2636a56350B38533a60370r7625i6586
$$ -135877 -119651 80991 -114395 90902 129080 12636 -156350 238533 -160370 -257995 -96586
10051a80202i842A07187E2434a05699j04239c633l29071a58721j01472b4256B15024
$$ -180202 -9842 107187 52434 -105699 -209938 -3633 -332704 -158721 -260193 -24256 215024
10039b66895Q9430m2514h9708k13423J880A84843a98864m9603g6695l36993J41012
$$ -266895 -177465 -219979 -89708 -303131 -301251 184843 -198864 -248467 -76695 -413688 -272676
10028b72676a13955A6051b65673J7927G604b96960n0331g3925j62482J2281A15948
$$ -272676 -113955 16051 -265673 -247746 7604 -296960 -347291 -73925 -236407 -224126 115948
10016E2633d3497k68121a53865e1432j102k58761g4032m5228D4497J01998a45495
$$ 52633 -43497 -311618 -153865 -51432 -52534 -311295 -74032 -119260 44497 146495 -145495
10004A34439L2518g7848J5611j15205B94770f5059a8964A42263J62526a06144
$$ 134439 166957 -77848 -62237 -177442 294770 -65059 -18964 142263 304789 -106144
9993A38237a92653A4958c73257h0386m5076a228k41705j722H0200J71328j16624
$$ 138237 -192653 14958 -373257 -80386 -125462 -1228 -242933 -244655 80200 251528 134904
9982A34904e84063B99094a23230G7407e5239J3010l5180G3647K29279A18868b76867
$$ 134904 -584063 299094 -123230 77407 -55239 -42229 -77409 73647 302926 118868 -276867
9970a31188e3401k06296J07511A04009C0316J13339D2612J0697g6814m0230e5032
$$ -131188 -53401 -259697 -152186 104009 30316 143655 42612 53309 -76814 -117044 -55032
9958h0848B68002e5168f008j11790A62575a55264g6553A7636L57355a66008q5175
$$ -80848 268002 -55168 -6008 -117798 162575 -155264 -76553 17636 374991 -166008 -251183
9947b51183B35028b16879G5000a76239G6487B0969J04928A6333h0559p768r4127
$$ -251183 235028 -216879 75000 -176239 76487 20969 125897 16333 -80559 -88327 -182454
9936a82454j94381a00670A36919K78807A99571a52381A52710c61182g3192k61154
$$ -182454 -376835 -100670 136919 415726 199571 -152381 152710 -361182 -73192 -334346
9926c34346b7573j90938a01879M6840b4395j55374I9928g1908l81283J74222i4636
$$ -334346 -27573 -218511 -101879 -55039 -24395 -179769 99928 -71908 -453191 -278969 -94636
9914a68229M9511j16219N0086f2566H6911E547c34803c8094E8560A0532c50977
$$ -168229 -118718 -234937 -184851 -62566 86911 5547 -334803 -38094 58560 10532 -350977
9902A51242m1153c71150j15268b09229B4974J38257a25389Q074F2396b16152d4981
$$ 151242 110089 -371150 -486418 -209229 24974 163231 -125389 -117315 62396 -216152 -44981
9890c59223A88821g0361k17736a27947p5328A90969g6822D8662a03391j1533j23443
$$ -359223 188821 -70361 -288097 -127947 -203275 190969 -76822 48662 -103391 -114924 -238367
9879b38367K868A40606L13937A00206b68806F7138c52231J47108k10041A03637
$$ -238367 -235499 140606 454543 100206 -268806 67138 -352231 -205123 -415164 103637
9868F0236a796k83277I7855O3665f0608m0064B22541K06805f6045k45341P1779
$$ 60236 -1796 -285073 97855 161520 -60608 -100672 222541 429346 -66045 -311386 -239607
9857b39607A43935m8284d24602a74704B2316a93393O4520d5764l20162f0582A41228
$$ -239607 143935 95651 -424602 -174704 22316 -193393 -128873 -45764 -365926 -60582 141228
9845c4563j48019m64J5846F2500a27391A4972J13469M1544b20086A14531C2673
$$ -34563 -182582 -183046 -167200 62500 -127391 14972 128441 169985 -220086 114531 32673
9833A51185a6545q0122L6855K1179A99525b79270J11890j30684G9656a22202a6343
$$ 151185 -16545 -96667 -59812 -38633 199525 -279270 -167380 -298064 79656 -122202 -16343
9821a31757h857j27627r2488k8402f8555B010a53515M8823h848m5090r5602j19119
$$ -131757 -8857 -136484 -228972 -257374 -68555 2010 -153515 -104692 -8848 -53938 -149540 -268659
9809b68659B9724b27321A09332k735a06446k0572C247e6312j5971J8578j975C91238
$$ -268659 29724 -227321 109332 106597 -106446 -127018 3247 -56312 -72283 -53705 -55680 391238
9796a09176k00950J6868k05020i7283A08241d88079A8425b68743H7020M7055m5206
$$ -109176 -310126 -293258 -498278 -97283 108241 -488079 18425 -268743 87020 134075 88869
9785H8869A6977a21178N6586J2047A45975f4725A62470e7626J5416l31416J50119
$$ 88869 16977 -121178 -64592 -52545 145975 -64725 162470 -57626 -42210 -373626 -223507
9774b23507j06124a40874A52040a55041B03880a59954f3128n4377n6942B7897
$$ -223507 -329631 -140874 152040 -155041 203880 -159954 -63128 -117505 -174447 27897
9763i2677I4751c3614k40543A74688b08182L2607Q0118o5459j00703B02270e778
$$ -92677 94751 -33614 -274157 174688 -208182 -175575 -95457 -160916 -261619 202270 -5778
9751g4243B20759b27912j20396j6703g8480A24850c39634a07352J0983n6565B33600
$$ -74243 220759 -227912 -348308 -365011 -78480 124850 -339634 -107352 -96369 -152934 233600
9739a87044E6406A0185J5132f8933a9240B02326J46186b68505g7228M331A90803
$$ -187044 56406 10185 25317 -68933 -19240 202326 348512 -268505 -77228 -72897 190803
9727D8221N724c40380p8389H7984l4517i8765o2095B61227d65211b10947k1008
$$ 48221 53945 -340380 -418769 87984 53467 -98765 -160860 261227 -465211 -210947 -231955
9716b31955A11381J02455b6445n392D093J37682R5653F7230B6390a45060D885
$$ -231955 111381 213836 -26445 -31837 4093 141775 237428 67230 26390 -145060 4885
9704c4556k3392B91175c7894A23141a49591m137C31588b08680G2241f6358k04664
$$ -34556 -57948 291175 -37894 123141 -149591 -153728 331588 -208680 72241 -66358 -271022
9693b71022c0285k2451N574a5552j07742J0988D60407d17366a21458E2743K60830
$$ -271022 -30285 -52736 -47162 -15552 -123294 -112306 460407 -417366 -121458 52743 313573
9682C13573a54125k74582J79548F6697A6326a42147j56471L1187Q1390O0462j86608
$$ 313573 -154125 -428707 -249159 66697 16326 -142147 -298618 -267431 -186041 -125579 -312187
9671c12187A78307N5184F5023i4264k37421h1651j31597a0659l24017H3324a21312
$$ -312187 178307 233491 65023 -94264 -331685 -81651 -213248 -10659 -334676 83324 -121312
9659B29557n9312J6452D1436b74338C1681a16355A97836g6345r4615d2677A4596
$$ 229557 170245 186697 41436 -274338 31681 -116355 197836 -76345 -170960 -42677 14596
9647F8712c36628a47620M2854J7951k01299C6357i1054A47213C8596c9969A26626
$$ 68712 -336628 -147620 -104766 -86815 -288114 36357 -91054 147213 38596 -39969 126626
9635A42681c0313n9934H1107c61567A81762a19486A71711g6888j75806B0108O1965
$$ 142681 -30313 -90247 81107 -361567 181762 -119486 171711 -76888 -252694 20108 82073
9624H2073A1704b15732j55506n7935e553G7255b60580F7027h4875b2873l08134
$$ 82073 11704 -215732 -371238 -429173 -5553 77255 -260580 67027 -84875 -22873 -331007
9613c31007G0072a50517l0984k3518C45663c15466a31687r2266i1147I856a91745
$$ -331007 70072 -150517 -181501 -205019 345663 -315466 -131687 -223953 -91147 9856 -191745
9601h1536k10342M8792G0554i9997A81322r0410A1862a79606F8517d3803C74189
$$ -81536 -291878 -243086 70554 -99997 181322 90912 11862 -179606 68517 -43803 374189
9589b14961p8548D8929c8837j11141M7907m8951D7900a19916e9912E0568o741
$$ -214961 -293509 48929 -38837 -149978 -102071 -151022 47900 -119916 -59912 50568 43827
9578D3827b02963N858j70176a06948I5081J50157A14070L0581f6720A96334i9054
$$ 43827 -202963 -197105 -367281 -106948 95081 245238 114070 144651 -66720 196334 -99054
9566A40924K9528a16991I4016g8741k61470D0339c84973C8000b45782B77127G4421
$$ 140924 170452 -116991 94016 -78741 -340211 40339 -384973 38000 -245782 277127 74421
9554e81801A09204K67557b88599J10275m2870j64781B3178N31c558B48529a38124
$$ -581801 109204 376761 -288599 -178324 -221194 -385975 23178 23709 -3558 248529 -138124
9542A29953I95J948b19161N7201d0271A23773c01172h3027I8096J59097b5040
$$ 129953 995 2943 -219161 -161960 -40271 123773 -301172 -83027 98096 257193 -25040
9530g7586j13839B59257b6020j36460D0655a42663d0670D5262f5275A33975b13525
$$ -77586 -191425 259257 -26020 -162480 40655 -142663 -40670 45262 -65275 133975 -213525
9518B7882b22382E7724a19880A27098b50981b3343C5291J51665b968D2378a90201
$$ 27882 -222382 57724 -119880 127098 -250981 -23343 35291 186956 -2968 42378 -190201
9506a69764L774L6821L7443k10125a26842j1329p7180O313G5249a61763A21293
$$ -169764 -165990 -129169 -91726 -301851 -126842 -138171 -215351 -209038 75249 -161763 121293
9494a78275B6488a46097A15035a7251A06720e09728a84010B7584J35957G3321
$$ -178275 26488 -146097 115035 -17251 106720 -509728 -184010 27584 163541 73321
9483f1919k94470D05283f0045p4484l5674K0229D23399H4914a07621m1971C50145
$$ -61919 -356389 405283 -60045 -134529 -170203 -149974 423399 84914 -107621 -149592 350145
9471a33159B02943A21b33980g6482D1054L1952l2346d2503A6941e6212G6648a40336
$$ -133159 202943 121 -233980 -76482 41054 73006 40660 -42503 16941 -56212 76648 -140336
9458a15708B7727K22535C0347f3438a3069j32975a427I3383c10537D3045a76966
$$ -115708 27727 250262 30347 -63438 -13069 -146044 -1427 93383 -310537 43045 -176966
9446b05384n2801k66P8999j54022G9650f1587B09320e10230K01328I6771i4375
$$ -205384 -258185 -258451 -179452 -333474 79650 -61587 209320 -510230 -308902 96771 -94375
9434b003k27904g7066L0164F9204j6209J47728a09539A5769d6332A60802b67340
$$ -2003 -229907 -77066 -46902 69204 52995 200723 -109539 15769 -46332 160802 -267340
9422h8225k15967A29615f9833D6617K72433B1811J75662b48776G3031K05649A342
$$ -88225 -304192 129615 -69833 46617 319050 21811 197473 -248776 73031 278680 1342
9410d3750B4457e8735j09019A86811r0162c85552F3735a10438B05635a85705g5703
$$ -43750 24457 -58735 -167754 186811 96649 -385552 63735 -110438 205635 -185705 -75703
9398B33034G5179e1690C18873e6963J5579m3412k99911I0682e09782a2865k7450
$$ 233034 75179 -51690 318873 -56963 -41384 -84796 -384707 90682 -509782 -12865 -40315
9387d0315A80785d2792I1313b77902f1493J8979A40656J25087c09037a5521n7112
$$ -40315 180785 -42792 91313 -277902 -61493 -42514 140656 265743 -309037 -15521 -72633
9376g2633C6742e1186l43770A16647C7174p556a55445B07500l3580i0642r1111
$$ -72633 36742 -51186 -394956 116647 37174 29618 -155445 207500 173920 -90642 -181753
9365a81753G4775b71693G6443a55589C370b74672A08328c48138B25188f3039j2366
$$ -181753 74775 -271693 76443 -155589 3370 -274672 108328 -348138 225188 -63039 -75405
9354g5405B405c23126k718H4666b01580L6200P2442B7960b3031E0148e7351J6543
$$ -75405 2405 -323126 -325844 84666 -201580 -165380 -92938 27960 -23031 50148 -57351 -40808
9342d0808l7494j64142j9716A09055a45212K0848J5856o018d0306j44155B01670
$$ -40808 -78302 -242444 -262160 109055 -145212 -124364 -108508 -114526 -40306 -184461 201670
9330D5973J0863a72064A101f1095F5330c54372J64912E8249k5596g4413B4233
$$ 45973 56836 -172064 1101 -61095 65330 -354372 -189460 58249 32653 -74413 24233
9318B02427G9536H657a87127n5102I6064c52757J40066e2283G2970g1076A20742
$$ 202427 79536 8657 -187127 -242229 96064 -352757 -212691 -52283 72970 -71076 120742
9306b79122e2649r0378O1472A715e37660b3154n9070l33997J30270B03221A4344
$$ -279122 -52649 -143027 -81555 1715 -537660 -23154 -82224 -416221 -285951 203221 14344
9294G187O7499a592j50246f6297m9272j54510P5594b5259A56938f738o8673F4049
$$ 7187 74686 -1592 -151838 -66297 -115569 -270079 -194485 -25259 156938 -6738 -75411 64049
9281b01916J8732C06816b65167E638J64080B1076a10196b1792C302K1184a55892
$$ -201916 -183184 306816 -265167 5638 169718 21076 -110196 -21792 3302 24486 -155892
9269b41127L8046o8579A20815B577a15812j30200e5395j12573j40223i5792k45101
$$ -241127 -203081 -271660 120815 2577 -115812 -246012 -55395 -167968 -308191 -95792 -340893
9258c40893a08161j6670q8283b8824A887d4824l13257f541E3443a06044o6010
$$ -340893 -108161 -124831 -213114 -28824 1887 -44824 -358081 -6541 53443 -106044 -172054
9247a72054B6707a63013d2737A38675d62100C80111E1911c4750C5036a70957H4728
$$ -172054 26707 -163013 -42737 138675 -462100 380111 51911 -34750 35036 -170957 84728
9235A18716O9477b36594C38554A5582K97995i4607k36032a57861N6372A62561
$$ 118716 188193 -236594 338554 15582 313577 -94607 -330639 -157861 -101489 162561
9224f0379I1674J61131a11704D7469a64459b8554B077c65082A10812m540b57426
$$ -60379 91674 252805 -111704 47469 -164459 -28554 2077 -365082 110812 106272 -257426
9212F8456K2081a06562b8472D01998a95968h5174j5341l1295o3700A35985a42723
$$ 68456 90537 -106562 -28472 401998 -195968 -85174 -100515 -131810 -195510 135985 -142723
9200F2217b09017e844k36677L7621i1737C41142a99153O5966j01186I2659k1400
$$ 62217 -209017 -5844 -242521 -204900 -91737 341142 -199153 -133187 -234373 92659 71259
9189G1259e5363C30118A51559a2171A5957a16244A79390b06308j26442h1258B55010
$$ 71259 -55363 330118 151559 -12171 15957 -116244 179390 -206308 -332750 -81258 255010
9177a52385B51203K1648G7648b28498I7650k9390b63927J10756k8767M693d5498
$$ -152385 251203 272851 77648 -228498 97650 68260 -263927 -153171 -181938 -177245 -45498
9165A7787j112P1880b43089H0646J10525E3691b94227o249A6856K78166I4837
$$ 17787 16675 88555 -243089 80646 191171 53691 -294227 -300476 16856 295022 94837
9153d8179m05065b20057A51988F1897C0688b80701e4262Q539l78730a94585a4872
$$ -48179 -453244 -220057 151988 61897 30688 -280701 -54262 -45723 -424453 -194585 -14872
9141b7471B70112a21444b999j35360G6492d3037j16139A08580B8800a67646J2439
$$ -27471 270112 -121444 -2999 -138359 76492 -43037 -159176 108580 28800 -167646 -155207
9130a55207E3234b07471R5864c8841B06238a40378j91129a25451k9590F2422a59900
$$ -155207 53234 -207471 -111607 -38841 206238 -140378 -331507 -125451 -155041 62422 -159900
9118b19027j2917C0647b03582M2813D0166a17562l2771F2330j5840a44975a8124
$$ -219027 -231944 30647 -203582 -160769 40166 -117562 -150333 62330 46490 -144975 -18124
9106b19503A48470e7423J3489j09861l4928F0904b916j76815I98b49150J15166
$$ -219503 148470 -57423 -43934 -153795 -188723 60904 -2916 -179731 998 -249150 -133984
9095a33984k15328P5937l9623O4044G3882c10936J25936j32236a42284A24857
$$ -133984 -349312 -273375 -312998 -248954 73882 -310936 -185000 -317236 -142284 124857
9084b30668b8370k28665e4650A8101f9244B265e0134A87071b20515B8755b3148
$$ -230668 -28370 -257035 -54650 18101 -69244 2265 -50134 187071 -220515 28755 -23148
9072b86859A83548A2217a67496P7371J8732j48146e9402A61118B771b30592L3497
$$ -286859 183548 12217 -167496 -90125 -71393 -219539 -59402 161118 2771 -230592 -197095
9061a97095O6222l9952J4880c7008B8195c51489B3766L4534b49547C21337a62303
$$ -197095 -130873 -170825 -155945 -37008 28195 -351489 23766 58300 -249547 321337 -162303
9049a07773J6514n9635H2731b25672j09231b8431J110j82238c6335o340K0710
$$ -107773 -91259 -150894 82731 -225672 -334903 -28431 -27321 -209559 -36335 -42675 -21965
9038b1965j66245f0092j6284i322j37754A19175i129k39850Q7999f0243l6133
$$ -21965 -188210 -60092 -76376 -9322 -147076 119175 -9129 -248979 -160980 -60243 -96376
9027i6376K2153A0142e4345j28642E7897h6978A79483E8700O1361c29618e9310
$$ -96376 -74223 10142 -54345 -182987 57897 -86978 179483 58700 120061 -329618 -59310
9015b20273A34847k8721D8499a24156A9742n404M0099a34518A29956c7688A28758
$$ -220273 134847 106126 48499 -124156 19742 14338 54437 -134518 129956 -37688 128758
9003c79403B95617b05048c3040B25865i4127o6844p5161A61391n314N8084a25035
$$ -379403 295617 -205048 -33040 225865 -94127 -160971 -236132 161391 156077 214161 -125035
8991i0996B18313a15896A28146j4166b26523p1301i0383A250a99510d9510H3089
$$ -90996 218313 -115896 128146 113980 -226523 -297824 -90383 1250 -199510 -49510 83089
8979a76276g0094K708F684f2893j559A44727d2713k19951C33128c1227j10614
$$ -176276 -70094 -67386 6684 -62893 -64452 144727 -42713 -262664 333128 -31227 -141841
8968a41841A33874a88853e4630B1908a5043r8884F1789h9572L8861k1423m0153
$$ -141841 133874 -188853 -54630 21908 -15043 -113927 61789 -89572 -50711 -72134 -112287
8957a12287A79173J09978a33098j40975h0307n1292j4752j20012c3970C0662K4749
$$ -112287 179173 289151 -133098 -274073 -80307 -131599 -146351 -266363 -33970 30662 55411
8946E5411a03287l2520l41477f2441k3016A0369d3302A36361j0383a42844e7356
$$ 55411 -103287 -135807 -477284 -62441 -85457 10369 -43302 136361 125978 -142844 -57356
8934c59G3706M6695C4097g8602o2892A3206a10138L8312B22715r2953K80404R62886
$$ -359 73706 120401 34097 -78602 -141494 13206 -110138 -71826 222715 129762 410166 1373052
8922A373052K373300L487907C075187A096695m31892A41831m5762a33957M2162
$$ 1373052 3746352 7234259 3075187 1096695 664803 141831 96069 -133957 -91795
8913i1795d5772l31985A58687d609A8104L41018a52111c9936k90884e9531l6616
$$ -91795 -45772 -377757 158687 -4609 18104 359122 -152111 -39936 -330820 -59531 -96147
8902i6147a7198a290B01837g70k12349q3654B84225j13098d56387a7017j45204
$$ -96147 -17198 -1290 201837 -770 -213119 -296773 284225 171127 -456387 -17017 -162221
8891a62221G0398B6151a44052A21694K1997a34687L9645b3810j69872E5336J58947
$$ -162221 70398 26151 -144052 121694 143691 -134687 -95042 -23810 -193682 55336 214283
8880B14283a03884A43493o9065c15337g9984C39533b36604A01080a50718K1104
$$ 214283 -103884 143493 74428 -315337 -79984 339533 -236604 101080 -150718 -129614
8870a29614H0856c15879d3845J0881j47113A32185b8300B10702i1195l5647q614
$$ -129614 80856 -315879 -43845 -32964 -180077 132185 -28300 210702 -91195 -126842 -135456
8859a35456D4581a23291k33078C75884b73368A02148J24831b2033q6301m2433
$$ -135456 44581 -123291 -356369 375884 -273368 102148 226979 -22033 -108334 -150767
8849a50767N5417k1896j37978B1693L31523E2325b05795n8119A07127a4296A24584
$$ -150767 -95350 -117246 -255224 21693 353216 52325 -205795 -263914 107127 -14296 124584
$$ [...]
##END NTUPLES=NMR SPECTRUM
##END=
