##TITLE=AC1641_CTIAH13374_8569537_Be0Vl6GaTi
##JCAMPDX= 6.0         $$ Bruker NMR JCAMP-DX V2.0
##DATA TYPE= NMR SPECTRUM
##DATA CLASS= NTUPLES
##ORIGIN= BRUKER
##OWNER= Administrator
$$ 1.72 TOPSPIN		Version 2.1
$$ 2014-04-10 15:19:07.958 -0700  Administrator@X
$$ Compression mode = diff/dup
##.OBSERVE FREQUENCY= 400.02188249412
##.OBSERVE NUCLEUS= ^1H
##.ACQUISITION MODE= SIMULTANEOUS (DQD)
##.ACQUISITION SCHEME= undefined
##.AVERAGES= 64
##.DIGITISER RES= 22
##SPECTROMETER/DATA SYSTEM= spect
##.PULSE SEQUENCE= noesygpps1d.comp
##.SOLVENT NAME= COFFEE_meoh
##.SHIFT REFERENCE= INTERNAL, COFFEE_meoh, 1, 14.96116
##AUDIT TRAIL= $$ (NUMBER, WHEN, WHO, WHERE, PROCESS, VERSION, WHAT)
$$ ##TITLE= Audit trail, TOPSPIN		Version 2.1
$$ ##JCAMPDX= 5.01
$$ ##ORIGIN= Bruker BioSpin GmbH
$$ ##OWNER= Administrator
$$ $$ E:\/data/COFFEE/nmr/AC1641_CTIAH13374_8569537_Be0Vl6GaTi/12/pdata/1/auditp.txt
$$ ##AUDIT TRAIL=  $$ (NUMBER, WHEN, WHO, WHERE, PROCESS, VERSION, WHAT)
(   1,<2014-04-10 15:19:04.215 -0700>,<Administrator>,<X>,<go>,<TOPSPIN 2.1>,
      <created by zg
	started at 2014-04-10 15:07:33.438 -0700,
	POWCHK enabled, PULCHK disabled,
       configuration hash MD5:
       C8 4E 4E 5D D3 5C D8 9E 9F 52 82 E0 59 8A DE 15
       data hash MD5: 64K
       2C EB 52 43 57 46 F7 22 6E 4D AC C6 97 AC 10 98>)
(   2,<2014-04-10 15:19:06.522 -0700>,<Administrator>,<X>,<proc1d>,<TOPSPIN 2.1>,
      <Start of raw data processing
       efp LB = 0.3 FT_mod = 6 PKNL = 1 PHC0 = 0 PHC1 = 0 SI = 128K 
       data hash MD5: 128K
       17 7C 88 D3 1E 33 61 A7 7D 20 04 88 8A 93 42 D3>)
(   3,<2014-04-10 15:19:07.185 -0700>,<Administrator>,<X>,<proc1d>,<TOPSPIN 2.1>,
      <pk PHC0 = -83.90808 PHC1 = 0 
       data hash MD5: 128K
       88 A5 8B A2 55 D4 74 B9 19 4B EE 4E E6 F9 E3 78>)
(   4,<2014-04-10 15:19:07.505 -0700>,<Administrator>,<X>,<proc1d>,<TOPSPIN 2.1>,
      <abs ABSG = 1 
       data hash MD5: 128K
       15 4F 37 E5 6C 33 82 93 AE 89 17 8C 56 C1 AF B1>)
(   5,<2014-04-10 15:19:07.582 -0700>,<Administrator>,<X>,<proc1d>,<TOPSPIN 2.1>,
      <abs ABSG = 2 
       data hash MD5: 128K
       63 2A 92 96 D0 57 7F 1A CD 07 E3 CB BC 04 93 07>)
(   6,<2014-04-10 15:19:07.638 -0700>,<Administrator>,<X>,<proc1d>,<TOPSPIN 2.1>,
      <abs ABSG = 3 
       data hash MD5: 128K
       1C A7 8E C5 90 32 07 09 A5 63 8D 0B CB F0 FB 12>)
(   7,<2014-04-10 15:19:07.704 -0700>,<Administrator>,<X>,<proc1d>,<TOPSPIN 2.1>,
      <abs ABSG = 4 
       data hash MD5: 128K
       57 93 32 11 AD 22 97 E9 24 D6 15 9F 8C 84 A7 5C>)
(   8,<2014-04-10 15:19:07.792 -0700>,<Administrator>,<X>,<proc1d>,<TOPSPIN 2.1>,
      <abs ABSG = 5 
       data hash MD5: 128K
       D9 0A 61 96 40 E9 05 EB CB 0D 84 13 07 FB A9 A5>)
$$ ##END=
$$ 
$$ $$ hash MD5
$$ $$ 35 DD 73 7C 02 3D 11 00 BC 23 04 E3 79 35 C1 0F
##$RELAX= 
##$RELAX= 
##$RELAX= 
##$RELAX= 
##$RELAX= 
##$RELAX= 
##$RELAX= 
##$RELAX= 
$$ Bruker specific parameters
$$ --------------------------
##$DU= <E:\>
##$EXPNO= 12
$$ [...]
##$TP07= 0
##$TPNAME0= <>
##$TPNAME1= <>
##$TPNAME2= <>
##$TPNAME3= <>
##$TPNAME4= <>
##$TPNAME5= <>
##$TPNAME6= <>
##$TPNAME7= <>
##$TPOAL= (0..7)
0.5 0.5 0.5 0.5 0.5 0.5 0.5 0.5
##$TPOFFS= (0..7)
0 0 0 0 0 0 0 0
##$TUNHIN= 0
##$TUNHOUT= 0
##$TUNXOUT= 0
##$USERA1= <user>
##$USERA2= <user>
##$USERA3= <user>
##$USERA4= <user>
##$USERA5= <user>
##$V9= 5
##$VALIST= <valist>
##$VCLIST= <CCCCCCCCCCCCCCC>
##$VD= 0
##$VDLIST= <DDDDDDDDDDDDDDD>
##$VPLIST= <PPPPPPPPPPPPPPP>
##$VTLIST= <TTTTTTTTTTTTTTT>
##$WBST= 1024
##$WBSW= 4
##$XGAIN= (0..3)
0 0 0 0
##$XL= 0
##$YL= 0
##$YMAX_a= 5790778
##$YMIN_a= -12595725
##$ZGOPTNS= <>
##$ZL1= 120
##$ZL2= 120
##$ZL3= 120
##$ZL4= 120
##$ABSF1= 14.96116
##$ABSF2= -5.597022
##$ABSG= 5
##$ABSL= 3
##$ALPHA= 0
##$AQORDER= 0
##$ASSFAC= 0
##$ASSFACI= 0
##$ASSFACX= 0
##$ASSWID= 0
##$AUNMP= <proc_prof1d_extract.lims>
##$AXLEFT= 0
##$AXNAME= <>
##$AXNUC= <1H>
##$AXRIGHT= 0
##$AXTYPE= 0
##$AXUNIT= <>
##$AZFE= 0.1
##$AZFW= 0.1
##$BCFW= 0
##$BC_mod= 0
##$BYTORDP= 0
##$COROFFS= 0
##$CY= 15
##$DATMOD= 1
##$DC= 0
##$DFILT= <>
##$DTYPP= 0
##$F1P= 0
##$F2P= 0
##$FCOR= 0.5
##$FTSIZE= 131072
##$FT_mod= 6
##$GAMMA= 0
##$GB= 0
##$INTBC= 1
##$INTSCL= 1
##$ISEN= 128
##$LB= 0.3
##$LEV0= 0
##$LPBIN= 0
##$MAXI= 10000
##$MC2= 0
##$MEAN= 0
##$ME_mod= 0
##$MI= 0
##$NCOEF= 0
##$NC_proc= -2
##$NLEV= 6
##$NOISF1= 0
##$NOISF2= 0
##$NSP= 0
##$NTH_PI= 0
##$NZP= 0
##$OFFSET= 14.96116
##$PC= 1
##$PHC0= -83.90808
##$PHC1= 0
##$PH_mod= 1
##$PKNL= yes
##$PPARMOD= 0
##$PPDIAG= 0
##$PPIPTYP= 0
##$PPMPNUM= 2147483647
##$PPRESOL= 1
##$PSCAL= 4
##$PSIGN= 0
##$PYNMP= <proc.py>
##$REVERSE= no
##$SF= 400.020009572522
##$SI= 131072
##$SIGF1= 0
##$SIGF2= 0
##$SINO= 400
##$SIOLD= 131072
##$SPECTYP= <>
##$SREGLST= <1H.CDCl3>
##$SSB= 0
##$STSI= 131072
##$STSR= 0
##$SW_p= 8223.68421052631
##$SYMM= 0
##$S_DEV= 0
##$TDeff= 65536
##$TDoff= 0
##$TI= <>
##$TILT= no
##$TM1= 0
##$TM2= 0
##$TOPLEV= 0
##$USERP1= <user>
##$USERP2= <user>
##$USERP3= <user>
##$USERP4= <user>
##$USERP5= <user>
##$WDW= 1
##$XDIM= 131072
##$YMAX_p= 365073159
##$YMIN_p= -13053
##$CURPLOT= <Network HP LaserJet P1505>
##$CURPRIN= <$Network HP LaserJet P1505>
##$DFORMAT= <normdp>
##$LAYOUT= <+/1D_H.xwp>
##$LFORMAT= <normlp>
##$PFORMAT= <normpl>
##$SURQMSG= 1
$$ End of Bruker specific parameters
$$ ---------------------------------
##NTUPLES= NMR SPECTRUM
##VAR_NAME=  FREQUENCY,     SPECTRUM/REAL,   SPECTRUM/IMAG
##SYMBOL=    X,             R,               I
##VAR_TYPE=  INDEPENDENT,   DEPENDENT,       DEPENDENT
##VAR_FORM=  AFFN,          ASDF,            ASDF
##VAR_DIM=   131072,        131072,          131072
##UNITS=     HZ,            ARBITRARY UNITS, ARBITRARY UNITS
##FACTOR=    0.0627417313425164, 1,          1
##FIRST=     8223.62146879497, -1300,        -56178
##LAST=      0,             619,             -57384
##MIN=       0,             -13053,          0
##MAX=       8223.62146879497, 365073159,    0
$$ Real data points
##PAGE= N=1
##DATA TABLE= (X++(R..R)), XYDATA
$$ [...]
$$ plain form
63865 674596 685938 698738 712060 724978 737381 749315 759909 767828 772857 776217 779046 781160
63853 781160 781685 780386 777826 774541 770540 765478 758910 750408 739754 727062 712611 696635 679346
63840 679346 661043 642081 622845 603741 584965 566296 547438 528598 510346 492889 475934
63829 475934 459375 443604 428987 415548 403412 392881 383708 374995 366356 358581 352477 347603 342940
63816 342940 338389 334703 332169 330262 328527 326909 325209 323041 320516 318267 316621 315330 314222 313442
63802 313442 312848 311822 309958 307457 304593 301311 297608 293833 290305 287024 283983 281356 279152 277079
63788 277079 274987 273053 271306 269463 267599 266485 266736 267841 268519 267968 266457 264786 263522 262711 262071
63773 262071 261339 260538 259942 259825 260322 261428 262817 263695 263220 261312 258882 257057 256295 256255 256292 255976 255318 254680
$$ packed form
63865F74596J1342J2800J3322J2918J2403J1934J0594P919N029L360K829K114
63853G81160N25j299k560l285m001n062o568q502j0654j2692j4451j5976j7289
63840F79346j8303j8962j9236j9104j8776j8669j8858j8840j8252j7457j6955
63829D75934j6559j5771j4617j3439j2136j0531r173q713q639p775o104m874m663
63816C42940m551l686k534j907j735j618j700k168k525k249j646j291j108p80
63802C13442n94j026j864k501k864l282l703l775l528l281l041k627k204k073
63788B77079k092j934j747j843j864j114K51J105O78n51j511j671j264q11o40
63773B62071p32q01n96j17M97J106J389Q78m75j908k430j825p62m0L7l16o58o38
$$ plain form
63755 254680 254366 254279 254134 253927 253928 254218 254561 254890 255553 256994 259394 262675 266544 270385 273508 275778 277787
63738 277787 280228 283240 286446 289336 291511 292849 293711 294785 296485 298705 301273 304394 308330 312841
63724 312841 317252 321093 324513 327996 331741 335301 337871 339055 339300 339454 339951 340639 341237 341647 341782 341506
63708 341506 340841 340068 339538 339538 340227 341370 342315 342657 342877 343820 345582 347516 349357 351620 354657 357987 360944
63691 360944 363398 365434 366870 367625 368100 368624 368859 368308 367160 366069 365306 364633 363849 362954 361839 360276
63675 360276 358220 355872 353544 351682 350762 350855 351532 352489 353910 355766 357190 357207 355936 354362 352953 351124
63659 351124 348187 344265 340105 336428 333624 331672 330095 328210 325633 322498 319275 316538 314733 313783
63645 313783 313007 311859 310706 310479 311492 313074 314477 315800 317772 320925 325133 329720 333872 337225 340262
$$ packed form
63755B54680l14q7j45k07JK90L43L29O63J441K400L281L869L841L123K270K009
63738B77787K441L012L206K890K175J338Q62J074J700K220K568L121L936M511
63724C12841M411L841L420L483L745L560K570J184K45J54M97O88N98M10J35k76
63708C41506o65p73n30%O89J143R45L42K20R43J762J934J841K263L037L330K957
63691C60944K454K036J436P55M75N24K35n51j148j091p63o73p84q95j115j563
63675C60276k056k348k328j862r20R3O77R57J421J856J424J7j271j574j409j829
63659C51124k937l922m160l677k804j952j577j885k577l135l223k737j805r50
63645C13783p76j148j153k27J013J582J403J323J972L153M208M587M152L353L037
$$ plain form
63630 340262 344035 349348 356184 363861 371569 378862 385959 393686 402812 413321 424563 436233 448953
63617 448953 463674 480691 499484 519487 540784 564001 589583 617181 645634 673466 699415
63606 699415 722639 742697 759386 772496 781667 786673 787898 786338 782984 778386 772938 767208 761592
63593 761592 755744 748712 739667 728303 714697 699116 681957 663544 644005 623606 603204 584029
63581 584029 566950 552177 539690 529609 521996 516549 512759 510344 509410 510131 512243 514934 517467 520000
63567 520000 523432 528198 533477 538006 541509 544937 549398 555359 562866 572010 582928 595694 610468
63554 610468 627617 647586 670736 697186 726561 757899 790034 821966 852542 880065 902796
63543 902796 919957 931702 938072 938705 933930 925548 915876 906182 896449 886422 876331 866516 856703
$$ packed form
63630C40262L773N313O836P677P708P293P097P727R126J0509J1242J1670J2720
63617D48953J4721J7017J8793K0003K1297K3217K5582K7598K8453K7832K5949
63606F99415K3224K0058J6689J3110R171N006J225j560l354m598n448n730n616
63593G61592n848p032r045j1364j3606j5581j7159j8413j9539k0399k0402j9175
63581E84029j7079j4773j2487j0081p613n447l790k415r34P21K112K691K533K533
63567E20000L432M766N279M529L503L428M461N961P507R144J0918J2766J4774
63554F10468J7149J9969K3150K6450K9375L1338L2135L1932L0576K7523K2731
63543I02796J7161J1745O370O33m775q382r672r694r733j0027j0091r815r813
$$ plain form
63530 856703 845909 833021 817509 799598 779794 758307 735083 710316 684638 658850 633774
63519 633774 610340 589320 570638 553239 536016 518826 502487 487970 475777 465885 457947 451485
63507 451485 445975 440870 435694 430366 425350 421191 417900 415136 412911 411610 411157 410709 409487 407463 404956
63492 404956 402066 398987 396396 394878 394169 393574 392958 392761 393173 393959 395022 396492 398194 399724 401250 403620
63476 403620 407274 411461 414917 417031 418033 418309 417933 416712 414415 411069 407253 403955 401855 400788 400103
63461 400103 399429 398814 398297 397794 397545 398296 400655 404277 407965 410774 412977 415814 420307 426474 433688 441478
63445 441478 449694 458148 466660 475555 485686 497718 511685 527459 545265 565331 587211 609899
63433 609899 632503 654384 674729 692565 707444 719844 730712 740910 751217 762462 775316
$$ packed form
63530H56703j0794j2888j5512j7911j9804k1487k3224k4767k5678k5788k5076
63519F33774k3434k1020j8682j7399j7223j7190j6339j4517j2193r892p938o462
63507D51485n510n105n176n328n016m159l291k764k225j301m53m48j222k024k507
63492D04956k890l079k591j518p09n95o16j97M12P86J063J470J702J530J526K370
63476D03620L654M187L456K114J002K76l76j221k297l346l816l298k100j067o85
63461D00103o74o15n17n03k49P51K359L622L688K809K203K837M493O167P214P790
63445D41478Q216Q454Q512Q895J0131J2032J3967J5774J7806K0066K1880K2688
63433F09899K2604K1881K0345J7836J4879J2400J0868J0198J0307J1245J2854
$$ plain form
63422 775316 790178 807477 827746 850964 876009 901195 925295 947737 967960 985136 998566
63411 998566 1007942 1013136 1014162 1011478 1005891 998008 988188 977134 965881 954765 942873 929003 912813
63398 912813 894498 873781 850138 823879 796202 768076 739777 711671 684661 659493 636262
63387 636262 615034 596429 581044 568719 558867 551199 545626 541864 539822 540108 543362 549161 556296
63374 556296 564191 573287 583893 595453 607306 619482 632145 644837 657022 669167 682554 697985
63362 697985 715259 733987 754369 776885 801620 828164 855839 883568 909642 932115 949694
63351 949694 962186 970044 973698 973510 970221 965005 958787 951624 943008 932801 921560 909860 897504
63338 897504 883545 866904 846930 823754 798462 772716 747734 723655 700222 677954 658118
$$ packed form
63422G75316J4862J7299K0269K3218K5045K5186K4100K2442K0223J7176J3430
63411I98566R376N194J026k684n587p883r820j1054j1253j1116j1892j3870j6190
63398I12813j8315k0717k3643k6259k7677k8126k8299k8106k7010k5168k3231
63387F36262k1228j8605j5385j2325r852p668n573l762k042K86L254N799P135
63374E56296P895R096J0606J1560J1853J2176J2663J2692J2185J2145J3387J5431
63362F97985J7274J8728K0382K2516K4735K6544K7675K7729K6074K2473J7579
63351I49694J2492P858L654j88l289n216o218p163q616j0207j1241j1700j2356
63338H97504j3959j6641j9974k3176k5292k5746k4982k4079k3433k2268j9836
$$ plain form
63327 658118 641523 627883 616530 607245 600110 594935 591253 588461 585525 580865 573187 562463 549710
63314 549710 535960 521811 507871 494976 483770 474404 466745 460654 456116 453456 453302 455779 459669
63301 459669 463025 464914 466080 467595 469335 470182 469307 466656 462419 456590 449168 440470 431190 422257 414464
63286 414464 408032 402615 397817 393519 389610 385833 382168 379040 376733 374864 372882 370857 369348 368584
63272 368584 368251 367973 367567 366918 366121 365754 366599 368960 372487 376585 380647 384067 386555 388436 390282 392311
63256 392311 394605 397725 402401 408509 415053 421351 427677 434490 441706 449089 456814 465165 474109 483612
63242 483612 494018 505677 518531 532505 547945 565204 584122 604396 626188 649789 674918
63231 674918 700977 727830 755700 784342 813032 841455 869954 898642 926859 953887 979788
$$ packed form
63327F58118j6595j3640j1353r285p135n175l682k792k936m660p678j0724j2753
63314E49710j3750j4149j3940j2895j1206r366p659o091m538k660j54K477L890
63301D59669L356J889J166J515J740Q47q75k651m237n829p422q698r280q933p793
63286D14464o432n417m798m298l909l777l665l128k307j869j982k025j509p64
63272C68584l33k78m06o49p97l67Q45K361L527M098M062L420K488J881J846K029
63256C92311K294L120M676O108O544O298O326O813P216P383P725Q351Q944R503
63242D83612J0406J1659J2854J3974J5440J7259J8918K0274K1792K3601K5129
63231F74918K6059K6853K7870K8642K8690K8423K8499K8688K8217K7028K5901
$$ plain form
63220 979788 1005131 1030225 1055076 1079919 1105230 1131094 1156873 1181696 1205058 1226679 1245881
63209 1245881 1261393 1272003 1277276 1277436 1272575 1262298 1246282 1224997 1199690 1171824 1142632 1112993
63197 1112993 1083365 1053876 1024741 996618 970367 946441 924738 905122 887891 873603 862513
63186 862513 854295 848373 844584 843442 845527 850529 857245 864804 873629 884705 898003 912171 925854
63173 925854 938763 951217 963265 974799 986129 997637 1008853 1018497 1025662 1030459 1033189 1033328 1029830
63160 1029830 1022296 1011384 998049 982783 965622 946460 925151 901698 876758 851787 828238
63149 828238 806570 786231 766560 747436 729114 711910 696226 682598 671448 662878 656762 652808
63137 652808 650399 648691 647249 646491 647220 649728 653553 658097 663264 669431 677014 686105 696438 707558
$$ packed form
63220I79788K5343K5094K4851K4843K5311K5864K5779K4823K3362K1621J9202
63209A245881J5512J0610N273J60m861j0277j6016k1285k5307k7866k9192k9639
63197A112993k9628k9489k9135k8123k6251k3926k1703j9616j7231j4288j1090
63186H62513q218n922l789j142K085N002O716P559Q825J1076J3298J4168J3683
63173I25854J2909J2454J2048J1534J1330J1508J1216R644P165M797K730J39l498
63160A029830p534j0912j3335j5266j7161j9162k1309k3453k4940k4971k3549
63149H28238k1668k0339j9671j9124j8322j7204j5684j3628j1150q570o116l954
63137F52808k409j708j442p58P29K508L825M544N167O167P583R091J0333J1120
$$ plain form
63123 707558 718979 730110 740069 747806 752647 754684 754536 752788 749775 745758 740994 735611 729630 723196
63109 723196 716675 710445 704695 699395 694342 689220 683863 678568 674008 670702 668611 667324 666492 665932 665403
63094 665403 664590 663458 662451 662094 662381 662770 662926 663271 664514 666698 669045 670885 672422 674342 676879 679653
63078 679653 682410 685553 689768 695311 701833 708781 715841 723082 730876 739648 749532 760216 771278 782802
63064 782802 795570 810503 827958 847738 869740 894270 921572 951413 983533 1018393 1056989
63053 1056989 1099868 1146728 1197143 1251231 1309224 1370672 1434498 1499701 1565593 1631434 1696331
63042 1696331 1759640 1821183 1880957 1938963 1995465 2051070 2106212 2160648 2213653 2264606 2313125
63031 2313125 2358653 2400208 2436671 2467207 2491153 2507472 2514435 2510108 2493363 2464421 2424349 2374081
$$ packed form
63123G07558J1421J1131R959P737M841K037j48j748l013m017m764n383n981o434
63109G23196o521o230n750n300n053n122n357n295m560l306k091j287q32n60n29
63094F65403q13j132j007l57K87L89J56L45J243K184K347J840J537J920K537K774
63078F79653K757L143M215N543O522O948P060P241P794Q772R884J0684J1062J1524
63064G82802J2768J4933J7455J9780K2002K4530K7302K9841L2120L4860L8596
63053A056989M2879M6860N0415N4088N7993O1448O3826O5203O5892O5841O4897
63042A696331O3309O1543N9774N8006N6502N5605N5142N4436N3005N0953M8519
63031B313125M5528M1555L6463L0536K3946J6319O963m327j6745k8942m0072n0268
$$ plain form
63019 2374081 2314151 2245451 2170001 2090698 2010272 1930601 1852922 1778351 1707994 1642786 1583545
63008 1583545 1531171 1486446 1449578 1420080 1397259 1380659 1369976 1364878 1365144 1370702 1381128 1395274
62996 1395274 1411848 1430393 1451240 1474474 1499394 1525171 1551435 1577890 1603876 1628898 1653229
62985 1653229 1677255 1700267 1720498 1736466 1747741 1754322 1755816 1751564 1741149 1724481 1701625 1672895
62973 1672895 1638910 1600314 1557623 1511608 1463487 1414352 1364610 1314463 1264855 1217350 1172912
62962 1172912 1131190 1091195 1052375 1014916 979435 946664 917072 890393 865622 841874 819084
62951 819084 797605 777364 757927 739256 721763 705573 690401 676411 664471 654977 646892 638648
62939 638648 629838 621448 614530 609209 605007 601516 598515 595862 593528 591487 589457 587070 584444 582297
$$ packed form
63019B374081n9930o8700p5450p9303q0426p9671p7679p4571p0357o5208n9241
63008A583545n2374m4725l6868k9498k2821j6600j0683n098K66N558J0426J4146
62996A395274J6574J8545K0847K3234K4920K5777K6264K6455K5986K5022K4331
62985A653229K4026K3012K0231J5968J1275O581J494m252j0415j6668k2856k8730
62973A672895l3985l8596m2691m6015m8121m9135m9742n0147m9608m7505m4438
62962A172912m1722l9995l8820l7459l5481l2771k9592k6679k4771k3748k2790
62951H19084k1479k0241j9437j8671j7493j6190j5172j3990j1940r494q085q244
62939F38648q810q390o918n321m202l491l001k653k334k041k030k387k626k147
$$ plain form
62925 582297 581264 581213 581255 580240 577388 572901 568034 564130 561342 558609 554990 550635 546298 542455 539179
62910 539179 536393 533761 530722 527094 523457 520510 518252 516187 514023 511770 509428 507123 505329 504313
62896 504313 503551 502288 500646 499530 499388 499725 499959 500145 500594 501302 502106 503032 504139 505296 506345 507244 507806
62879 507806 507610 506431 504582 502590 500708 498994 497664 497009 496975 497025 496468 494899 492402 489501 486872 484977
62863 484977 483896 483403 483215 483298 483990 485634 487907 489768 490428 490247 490310 491159 492351 493215 493578 493696 493903 494433
62845 494433 495168 495463 494636 492755 490499 488208 485741 483420 482285 482828 484122 484879 484919 484847 484779 484395 484058
62828 484058 484792 486893 489461 491638 493615 496000 498827 501747 504699 507807 510927 513935 517245 521441
62814 521441 526410 531418 536139 541090 546813 553027 558912 564026 568634 573266 578282 583859 590155 597313
$$ packed form
62925E82297j033n1M2j015k852m487m867l904k788k733l619m355m337l843l276
62910E39179k786k632l039l628l637k947k258k065k164k253k342k305j794j016
62896E04313p62j263j642j116j42L37K34J86M49P08Q04R26J107J157J049Q99N62
62879E07806j96j179j849j992j882j714j330o55l4N0n57j569k497k901k629j895
62863D84977j081m93j88Q3O92J644K273J861O60j81O3Q49J192Q64L63J18K07N30
62845D94433P35K95q27j881k256k291k467k321j135N43J294P57M0p2o8l84l37
62828D84058P34K101K568K177J977K385K827K920K952L108L120L008L310M196
62814E21441M969N008M721M951N723O214N885N114M608M632N016N577O296P158
$$ plain form
62800 597313 605384 614267 623738 633563 643753 654751 667290 681998 699105 718597 740614 765683
62788 765683 794486 827389 864299 905134 950422 1001177 1057995 1120498 1187966 1260369 1338362
62777 1338362 1422182 1510995 1603558 1699127 1797285 1896957 1995958 2091433 2180499 2260614 2329779
62766 2329779 2386568 2429769 2457979 2469803 2464497 2442239 2403851 2350657 2284745 2208904 2125838
62755 2125838 2037426 1944906 1849610 1753276 1657685 1564277 1474194 1388413 1307601 1231858 1160848
62744 1160848 1094472 1033414 978761 930843 888575 850224 814808 782476 753565 727770 704466
62733 704466 683492 665108 649274 635363 622739 611336 601508 593445 586942 581708 577698 574993 573445
62720 573445 572625 572274 572687 574450 577816 582506 588168 594883 603118 613349 625830 640568 657380 676058
$$ packed form
62800E97313Q071Q883R471R825J0190J0998J2539J4708J7107J9492K2017K5069
62788G65683K8803L2903L6910M0835M5288N0755N6818O2503O7468P2403P7993
62777A338362Q3820Q8813R2563R5569R8158R9672R9001R5475Q9066Q0115O9165
62766B329779N6789M3201K8210J1824n306k2258l8388n3194o5912p5841q3066
62755B125838q8412r2520r5296r6334r5591r3408r0083q5781q0812p5743p1010
62744A160848o6376o1058n4653m7918m2268l8351l5416l2332k8911k5795k3304
62733G04466k0974j8384j5834j3911j2624j1403r828q063o503n234m010k705j548
62720E73445q20l51M13J763L366M690N662O715Q235J0231J2481J4738J6812J8678
$$ plain form
62706 676058 696681 719738 745747 774731 806212 839784 875634 914467 956954 1003261 1052916
62695 1052916 1105093 1159115 1214847 1272475 1331659 1390782 1447251 1498729 1544014 1582596 1613544
62684 1613544 1635244 1646298 1646383 1636006 1615703 1585861 1547299 1501644 1450921 1396825 1340472 1282778
62672 1282778 1224895 1168096 1113190 1060228 1009024 959917 913720 870860 830987 793660 759140
62661 759140 728073 700545 675904 653519 633336 615536 599907 585789 572518 559768 547520
62650 547520 535854 524929 515171 507262 501543 497411 493667 489677 485927 483242 481771 481058 480733 480655 480607
62635 480607 480407 480271 480549 481094 481281 480611 478907 476048 472128 467936 464711 463203 463300 464579 466704 469261
62619 469261 471810 474379 477436 481163 485160 489074 493059 497384 502065 507122 512746 518981 525699 533213
$$ packed form
62706F76058K0623K3057K6009K8984L1481L3572L5850L8833M2487M6307M9655
62695A052916N2177N4022N5732N7628N9184N9123N6469N1478M5285L8582L0948
62684A613544K1700J1054Q5j0377k0303k9842l8562m5655n0723n4096n6353n7694
62672A282778n7883n6799n4906n2962n1204m9107m6197m2860l9873l7327l4520
62661G59140l1067k7528k4641k2385k0183j7800j5629j4118j3271j2750j2248
62650E47520j1666j0925r758p909n719m132l744l990l750k685j471p13l25p8m8
62635D80607k00j36K78N45J87o70j704k859l920m192l225j508R7J279K125K557
62619D69261K549K569L057L727L997L914L985M325M681N057N624O235O718P514
$$ plain form
62605 533213 542405 553877 567399 582536 599366 618214 639212 662631 689214 719559 753467 790382
62593 790382 830117 872627 917459 964060 1012210 1061398 1110030 1156071 1198380 1236668 1270185
62582 1270185 1297308 1316493 1326962 1328420 1320943 1305407 1283293 1255660 1222807 1185186 1144055 1100896
62570 1100896 1056778 1012653 969692 928727 889737 852471 817367 785368 757004 732118 710268
62559 710268 690934 673397 657016 641702 627818 615590 605012 596264 589636 584835 580764 576391
62547 576391 571647 567192 563507 560548 558126 556179 554605 553187 551845 550661 549510 547950 545794 543588
62533 543588 542196 541985 542731 544189 546319 548982 551900 555211 559689 566129 574655 584871 596511 609724
62519 609724 624860 642169 661629 682916 705707 730143 756901 786644 819569 855508 894075
$$ packed form
62605E33213R192J1472J3522J5137J6830J8848K0998K3419K6583L0345L3908L6915
62593G90382L9735M2510M4832M6601M8150M9188M8632M6041M2309L8288L3517
62582A270185K7123J9185J0469J458p477j5536k2114k7633l2853l7621m1131m3159
62570A100896m4118m4125m2961m0965l8990l7266l5104l1999k8364k4886k1850
62559G10268j9334j7537j6381j5314j3884j2228j0578q748o628m801m071m373
62547E76391m744m455l685k959k422j947j574j418j342j184j151j560k156k206
62533E43588j392k11P46J458K130K663K918L311M478O440Q526J0216J1640J3213
62519F09724J5136J7309J9460K1287K2791K4436K6758K9743L2925L5939L8567
$$ plain form
62508 894075 934475 975522 1016270 1056425 1095673 1132826 1166203 1194936 1219447 1240573 1258758
62497 1258758 1274370 1288400 1302373 1317533 1334410 1353174 1374256 1398473 1426619 1459054 1495721
62486 1495721 1536390 1580624 1627553 1675924 1724294 1770829 1812867 1847326 1872035 1886539 1891286
62475 1891286 1886253 1870603 1843371 1804182 1753637 1693596 1626838 1555816 1481754 1405400 1328457
62464 1328457 1253492 1182396 1115654 1053336 996108 944850 899851 860852 827529 799425 775746
62453 775746 755781 739400 726685 717191 710017 704674 701467 700871 702776 706484 711279 716868 723386 731108
62439 731108 740077 749809 759330 767636 774263 779435 783541 786462 787510 786091 782325 776892 770380 762932
62425 762932 754436 744862 734361 723211 711718 700118 688529 677056 665947 655568 646198 637756
$$ packed form
62508H94075M0400M1047M0748M0155L9248L7153L3377K8733K4511K1126J8185
62497A258758J5612J4030J3973J5160J6877J8764K1082K4217K8146L2435L6667
62486A495721M0669M4234M6929M8371M8370M6535M2038L4459K4709J4504M747
62475A891286n033j5650k7232l9189n0545o0041o6758p1022p4062p6354p6943
62464A328457p4965p1096o6742o2318n7228n1258m4999l8999l3323k8104k3679
62453G75746j9965j6381j2715r494p174n343l207n96J905L708M795N589O518P722
62439G31108Q969R732R521Q306O627N172M106K921J048j419l766n433o512p448
62425G62932q496r574j0501j1150j1493j1600j1589j1473j1109j0379r370q442
$$ plain form
62413 637756 629672 621181 612026 602963 595283 589664 585608 582065 578337 574299 570213 566681 564460 563852
62399 563852 564415 565566 567193 569283 571317 572731 573837 575504 577897 580230 582011 583914 587026 591701
62385 591701 597471 603760 610270 616921 623783 630986 638553 646455 654933 664437 675121 686601 698402
62372 698402 710415 722862 736158 750986 768133 787901 809945 833951 860238 889383 921518
62361 921518 956408 994055 1034773 1078585 1124875 1172722 1221332 1269962 1317488 1362199 1402141
62350 1402141 1435799 1462552 1482482 1495847 1502859 1503870 1499375 1489630 1474489 1453897 1428549 1399872
62338 1399872 1369314 1337688 1305233 1272246 1239516 1208000 1178087 1149464 1121888 1095775 1071712
62327 1071712 1049584 1028602 1008084 987728 967237 946340 925316 904876 885166 865406 844956
$$ packed form
62413F37756q084q491r155r063p680n619m056l543l728m038m086l532k221o08
62399E63852N63J151J627K090K034J414J106J667K393K333J781J903L112M675
62385E91701N770O289O510O651O862P203P567P902Q478R504J0684J1480J1801
62372F98402J2013J2447J3296J4828J7147J9768K2044K4006K6287K9145L2135
62361I21518L4890L7647M0718M3812M6290M7847M8610M8630M7526M4711L9942
62350A402141L3658K6753J9930J3365P012J011m495r745j5141k0592k5348k8677
62338A399872l0558l1626l2455l2987l2730l1516k9913k8623k7576k6113k4063
62327A071712k2128k0982k0518k0356k0491k0897k1024k0440j9710j9760k0450
$$ plain form
62316 844956 824357 804873 787203 771134 756273 742676 730758 720936 713338 707526 702524 697435
62304 697435 692195 687604 684566 683355 683537 684387 685438 686772 688809 691712 695059 698208 700980 703854 707556
62289 707556 712533 718739 725711 732796 739469 745608 751569 757936 765100 772979 781208 789660 798621 808340
62275 808340 818564 828843 839240 850370 862607 875498 888151 900083 911564 923360 936403
62264 936403 951678 970149 992525 1018981 1049157 1082615 1119416 1160063 1204758 1252846 1303071
62253 1303071 1354113 1404613 1452899 1497224 1536291 1569340 1595831 1615430 1628191 1634257 1633277 1624494
62241 1624494 1607475 1582535 1550496 1512493 1470055 1424898 1378390 1331378 1284492 1238351 1193581
62230 1193581 1151052 1111953 1077056 1045904 1017344 990995 967588 947744 931005 916323 902971
$$ packed form
62316H44956k0599j9484j7670j6069j4861j3597j1918r822p598n812n002n089
62304F97435n240m591l038j211J82Q50J051J334K037K903L347L149K772K874L702
62289G07556M977O206O972P085O673O139N961O367P164P879Q229Q452Q961R719
62275H08340J0224J0279J0397J1130J2237J2891J2653J1932J1481J1796J3043
62264I36403J5275J8471K2376K6456L0176L3458L6801M0647M4695M8088N0225
62253A303071N1042N0500M8286M4325L9067L3049K6491J9599J2761O066r80q783
62241A624494j7019k4940l2039l8003m2438m5157m6508m7012m6886m6141m4770
62230A193581m2529l9099l4897l1152k8560k6349k3407j9844j6739j4682j3352
$$ plain form
62219 902971 890718 879681 870213 862543 856284 850783 845969 842199 839193 836080 832821 830676 830680 832469
62205 832469 835225 838979 844149 850461 857216 864099 870878 876818 881319 884740 887669 889739 890170 889251 888178
62190 888178 887515 886850 886000 885465 885505 885717 885887 886468 887810 889518 890971 892000 892755 893358 893989 894979 896599
62173 896599 899079 902937 908940 917655 929442 944884 964630 988597 1015745 1044936 1075620 1107397
62161 1107397 1139117 1168730 1194030 1213664 1227580 1236533 1241043 1241021 1236434 1227771 1215352 1198652 1177138
62148 1177138 1151609 1123822 1094743 1064038 1031523 998382 966495 937028 910013 884913 861348
62137 861348 839638 820795 805606 793566 783089 772882 762655 752460 742014 731018 719693
62126 719693 708658 698569 689994 683176 677738 673033 669002 666241 665092 665217 666284 668473 671971 676565
$$ packed form
62219I02971j2253j1037r468p670o259n501m814l770l006l113l259k145MJ789
62205H32469K756L754N170O312O755O883O779N940M501L421K929K070M31r19j073
62190H88178o63o65q50n35M0K12J70N81J342J708J453J029P55O03O31R90J620
62173H96599K480L858O003Q715J1787J5442J9746K3967K7148K9191L0684L1777
62161A107397L1720K9613K5300J9634J3916Q953M510k2m587q663j2419j6700k1514
62148A177138k5529k7787k9079l0705l2515l3141l1887k9467k7015k5100k3565
62137H61348k1710j8843j5189j2040j0477j0207j0227j0195j0446j0996j1325
62126G19693j1035j0089q575o818n438m705m031k761j149J25J067K189L498M594
$$ plain form
62112 676565 682115 688782 696254 703280 708624 712141 714334 715231 714476 712384 710149 708856 708724 709303 709931
62097 709931 709865 708442 705398 701021 695973 691030 686870 683821 681810 680677 680477 681361 683271 685946 689145
62082 689145 692773 696875 701653 707384 714276 722483 732207 743561 756296 770018 784758 800931 818544
62069 818544 836923 855600 875119 896435 919722 944213 969135 994204 1019015 1042374 1062584
62058 1062584 1078399 1089559 1096482 1099553 1098793 1094086 1085466 1073085 1057129 1037936 1015979 991387
62046 991387 963720 932734 899318 865162 831465 798508 766510 736146 707900 681542 656758
62035 656758 633800 612987 594030 576483 560589 547033 535931 526612 518398 511120 504851 499477
62023 499477 494636 489883 485000 480265 476227 472976 469936 466698 463754 461859 460872 459827 458148 456296
$$ packed form
62112F76565N550O667P472P026N344L517K193Q97p55k092k235j293j32N79O28
62097G09931o6j423l044m377n048m943m160l049k011j133k00Q84J910K675L199
62082F89145L628M102M778N731O892Q207R724J1354J2735J3722J4740J6173J7613
62069H18544J8379J8677J9519K1316K3287K4491K4922K5069K4811K3359K0210
62058A062584J5815J1160O923L071p60m707q620j2381j5956j9193k1957k4592
62046I91387k7667l0986l3416l4156l3697l2957l1998l0364k8246k6358k4784
62035F56758k2958k0813j8957j7547j5894j3556j1102r319q214p278o269n374
62023D99477m841m753m883m735m038l251l040l238k944j895r87j045j679j852
$$ plain form
62009 456296 455152 455207 456427 458477 460901 463420 466207 469628 473585 477403 480575 483367 486462 490112 493820
61994 493820 496827 498686 499275 498405 495766 491482 486429 481591 477060 472117 466277 459796 453034 446055 439170
61979 439170 433202 428516 424339 419853 415587 412755 411336 409855 407260 404072 401303 399062 396825 394475
61965 394475 392309 390382 388489 386713 385397 384558 383833 383133 382949 383786 385465 387208 388414 389244 390370 392246
61949 392246 394754 397659 401179 405791 411478 417530 423306 429022 435549 443507 452738 462641 472828 483371
61935 483371 494510 506288 518482 530680 542238 552278 560057 565521 569272 571831 573141 572991 571652
61922 571652 569745 567597 565116 562340 559731 557838 556870 556738 557360 558919 561895 566773 573494 581332 589570
61907 589570 598182 607494 617246 626536 634782 642282 649580 656644 662955 668139 672226 675527 678520 681663
$$ packed form
62009D56296j144N5J220K050K424K519K787L421L957L818L172K792L095L650L708
61994D93820L007J859N89q70k639m284n053m838m531m943n840o481o762o979o885
61979D39170n968m686m177m486m266k832j419j481k595l188k769k241k237k350
61965C94475k166j927j893j776j316q39p25p00j84Q37J679J743J206Q30J126J876
61949C92246K508K905L520M612N687O052N776N716O527P958R231R903J0187J0543
61935D83371J1139J1778J2194J2198J1558J0040P779N464L751K559J310j50j339
61922E71652j907k148k481k776k609j893r68j32O22J559K976M878O721P838Q238
61907E89570Q612R312R752R290Q246P500P298P064O311N184M087L301K993L143
$$ plain form
61893 681663 685061 688451 691719 695267 699578 704573 709550 713598 715834 715551 712534 707180 699976 690954
61879 690954 679993 667555 654672 642136 630047 618221 606717 595812 585843 577263 570600 566058
61867 566058 563298 561805 561311 561704 562786 564462 567099 571276 577100 583997 591270 598778 607022 616715 628225
61852 628225 641196 654678 667869 680853 694384 708837 723598 737686 750646 762500 772985
61841 772985 781405 787339 791110 793350 794412 794407 793539 792019 789798 786830 783666 781455 781191 783073 786685
61826 786685 791556 797355 803759 810452 817327 824440 831675 838623 844838 850054 854058 856591 857658 857759
61812 857759 857346 855985 852437 845805 836360 825029 812337 798229 782662 765930 748390 730350 712343
61799 712343 695135 679256 664762 651661 640230 630668 622599 615308 608403 602049 596584 592232 589157
$$ packed form
61893F81663L398L390L268L548M311M995M977M048K236k83l017n354p204r022
61879F90954j0961j2438j2883j2536j2089j1826j1504j0905r969q580o663m542
61867E66058k760j493m94L93J082J676K637M177N824O897P273P508Q244R693J1510
61852F28225J2971J3482J3191J2984J3531J4453J4761J4088J2960J1854J0485
61841G72985Q420N934L771K240J062nq68j520k221k968l164k211k64J882L612
61826G86685M871N799O404O693O875P113P235O948O215N216M004K533J067J01
61812H57759m13j361l548o632r445j1331j2692j4108j5567j6732j7540j8040j8007
61799G12343j7208j5879j4494j3101j1431r562q069p291o905o354n465m352l075
$$ plain form
61786 589157 587432 586751 586359 585607 584605 584072 584404 585067 585196 584766 584773 586016 588011 589541 590266 591345 594361
61769 594361 599916 607452 616146 625656 636146 647867 660772 674455 688481 702758 717398 732081
61757 732081 745704 756877 764763 769345 770990 769891 765870 758509 747504 733097 716282 698484 680902
61744 680902 664069 647992 632624 618109 604574 591857 579695 568244 558140 549850 543063 537009
61732 537009 531246 525904 521202 517133 513714 511215 509885 509523 509481 509121 508287 507406 507018 507085 506927 506082 505054
61715 505054 504808 505619 506812 507602 507719 507190 506071 504623 503265 502040 500537 498564 496490 494578 492406
61700 492406 489375 485512 481378 477387 473591 469918 466289 462600 458863 455240 451766 448245 444558 440789
61686 440789 436917 432824 428800 425457 422823 420147 417179 415025 414929 416558 418353 419355 419763 419874 419471
$$ packed form
61786E89157j725o81l92p52j002n33L32O63J29m30PJ243J995J530P25J079L016
61769E94361N555P536Q694R510J0490J1721J2905J3683J4026J4277J4640J4683
61757G32081J3623J1173P886M582J645j099m021p361j1005j4407j6815j7798j7582
61744F80902j6833j6077j5368j4515j3535j2717j2162j1451j0104q290o787o054
61732E37009n763n342m702m069l419k499j330l62m2l60q34q81l88O7j58q45j028
61715E05054k46Q11J193P90J17n29j119j448j358j225j503j973k074j912k172
61700D92406l031l863m134l991l796l673l629l689l737l623l474l521l687l769
61686D40789l872m093m024l343k634k676k968k154r6J629J795J002M08J11m03
$$ plain form
61671 419471 418461 417255 416216 415401 415188 416480 419852 424925 430940 437597 444999 453093 461462 469467 476376
61656 476376 481636 485222 487533 488832 489013 488024 486158 483840 481404 479248 477872 477524 478063 479386 481767
61641 481767 485554 490754 497058 504039 511178 517924 523978 529322 533760 536624 537201 535412 531830 527014
61627 527014 521003 513582 504937 495910 487430 479802 472770 466259 460678 456247 452474 448692 444847 441326
61613 441326 438233 435372 432696 430134 427145 423200 418793 415188 412952 411394 409671 407696 405585 402972
61599 402972 399554 395861 392793 390590 388777 386925 384941 382815 380595 378589 377145 376237 375568 375004 374602
61584 374602 374298 373972 373771 374008 374681 375336 375520 375203 374763 374689 375281 376410 377604 378415 378753 378752 378509 378141 378030
61565 378030 378735 380566 383363 386749 390496 394572 398882 403069 406664 409422 411419 412810 413680 414238 414887
$$ packed form
61671D19471j010j206j039q15k13J292L372N073O015O657P402Q094Q369Q005O909
61656D76376N260L586K311J299J81r89j866k318k436k156j376l48N39J323K381
61641D81767L787N200O304O981P139O746O054N344M438K864N77j789l582m816
61627E27014o011p421q645r027q480p628p032o511n581m431l773l782l845l521
61613D41326l093k861k676k562k989l945m407l605k236j558j723j975k111k613
61599D02972l418l693l068k203j813j852j984k126k220k006j444r08o69n64m02
61584C74602l04l26k01K37O73O55J84l17m40p4N92J129J194Q11L38jk43l68j11
61565C78030P05J831K797L386L747M076M310M187L595K758J997J391Q70N58O49
$$ plain form
61550 414887 415827 416739 417205 417326 417578 418056 418381 418384 418424 418851 419563 420361 421367 422741 424245 425411 426156 427012
61532 427012 428793 431987 436261 440509 443668 445518 446484 446699 445767 443560 440717 438006 435591 433278 431096
61517 431096 429219 427599 426171 425305 425554 426934 428786 430393 431552 432515 433531 434567 435490 436516 438246
61502 438246 440985 444229 447297 450389 454405 459649 465398 471055 476995 483774 491066 498002 504150 509544
61488 509544 514149 518034 521857 526412 531626 536525 540221 542498 543564 543791 543696 543644 543405 542359 540303 537769
61472 537769 535537 534040 533215 532671 532061 531455 531246 531442 531312 530037 527522 524256 520704 517263 514514 512844
61456 512844 511896 510964 509899 509110 508735 508443 508080 507963 508422 509524 511322 513834 516750 519685 522839 526800
61440 526800 531484 535884 539192 541676 544034 546322 547960 548584 548471 548170 547969 547730 547161 546289 545487 544923
$$ packed form
61550D14887R40R12M66J21K52M78L25LM0M27P12P98J006J374J504J166P45Q56
61532D27012J781L194M274M248L159J850R66K15r32k207k843k711k415k313k182
61517D31096j877j620j428q66K49J380J852J607J159R63J016J036R23J026J730
61502D38246K739L244L068L092M016N244N749N657N940O779P292O936O148N394
61488E09544M605L885L823M555N214M899L696K277J066K27r5n2k39j046k056k534
61472E37769k232j497q25n44o10o06k09J96j30j275k515l266l552l441k749j670
61456E12844r48r32j065p89l75k92l63j17M59J102J798K512K916K935L154L961
61440E26800M684M400L308K484K358K288J638O24j13l01k01k39n69q72q02n64
$$ plain form
61424 544923 544278 543472 543370 545035 548278 551746 554605 557296 560283 562956 564455 564879 564808 564061 561912 558403
61408 558403 554549 551110 547883 544422 540806 537294 533713 529699 525354 521244 517731 514609 511539 508583
61394 508583 506087 504093 502188 500102 498225 497175 496927 496715 495883 494566 493506 493507 495133 498516 503173 508302
61378 508302 513482 518857 524503 530029 535084 539936 545132 550838 556811 562717 568034 571959 574022 574747
61364 574747 575137 575618 575994 576323 577078 578347 579610 580664 582208 585005 588871 592985 596882 600639 604298
61349 604298 607649 610573 613113 615176 616541 617201 617378 617064 615883 613601 610511 607133 603729 600300 596892
61334 596892 593614 590400 587004 583356 579771 576718 574415 572732 571507 570909 571417 573365 576591 580614 585090
61319 585090 589939 595051 600152 605201 610769 617809 626998 638372 651481 665694 680391 695123 709784
$$ packed form
61424E44923o45q06j02J665L243L468K859K691K987K673J499M24p1p47k149l509
61408E58403l854l439l227l461l616l512l581m014m345m110l513l122l070k956
61394E08583k496j994j905k086j877j050k48k12q32j317j060JJ626L383M657N129
61378E08302N180N375N646N526N055M852N196N706N973N906N317L925K063P25
61364E74747L90M81L76L29P55J269J263J054J544K797L866M114L897L757L659
61349F04298L351K924K540K063J365O60J77l14j181k282l090l378l404l429l408
61334E96892l278l214l396l648l585l053k303j683j225n98N08J948L226M023M476
61319E85090M849N112N101N049N568P040R189J1374J3109J4213J4697J4732J4661
$$ plain form
61306 709784 724509 739298 753693 766845 777879 786228 791688 794218 793761 790430 784795 777669 769381
61293 769381 759538 747842 735029 722514 711065 700223 689137 677612 666163 655478 646184 638796
61281 638796 633389 629387 626064 623322 621695 621616 622942 625211 628018 630994 633726 636036 638261 640958 644215
61266 644215 647538 650640 654244 659679 667496 676772 686009 694440 702078 708740 713724 716574 717623 717553 716881
61251 716881 716106 715864 716465 717564 718671 719749 721011 722529 724479 727414 731604 736194 739680 741308 741522
61236 741522 741047 740112 738782 737601 737470 739049 742404 747125 752674 758761 765428 772705 780315 787946 795695
61221 795695 803961 812929 822413 832086 841519 850122 857495 863875 869772 875123 879311 882201 884712 887997
61207 887997 892292 896870 901081 905236 910555 918226 928463 940496 953621 968044 984398 1002594 1021623
$$ packed form
61306G09784J4725J4789J4395J3152J1034Q349N460K530m57l331n635p126q288
61293G69381r843j1696j2813j2515j1449j0842j1086j1525j1449j0685r294p388
61281F38796n407m002l323k742j627p9J326K269K807K976K732K310K225K697L257
61266F44215L323L102L604N435P817R276R237Q431P638O662M984K850J049p0o72
61251G16881p75k42O01J099J107J078J262J518J950K935M190M590L486J628K14
61236G41522m75r35j330j181j31J579L355M721N549O087O667P277P610P631P749
61221G95695Q266Q968R484R673R433Q603P373O380N897N351M188K890K511L285
61207H87997M295M578M211M155N319P671J0237J2033J3125J4423J6354J8196J9029
$$ plain form
61194 1021623 1040449 1058529 1075381 1090245 1102523 1112199 1119526 1124612 1127560 1128735 1128625 1127604 1125925
61181 1125925 1123679 1120667 1116699 1112123 1107597 1103193 1098235 1092382 1086359 1081186 1077140 1074040 1072147 1072068
61167 1072068 1073839 1076692 1079821 1083094 1087085 1092734 1100757 1110976 1122317 1133869 1145838 1159090 1173940
61154 1173940 1189924 1206617 1223994 1241856 1259447 1275815 1290165 1301675 1309448 1312955 1312291 1307873
61142 1307873 1300158 1289795 1277672 1264542 1250823 1236916 1223334 1210301 1197560 1184985 1173067
61131 1173067 1162412 1152945 1144135 1135919 1128912 1123597 1119852 1117469 1116692 1117864 1120834 1125148 1130694 1137686
61117 1137686 1146024 1155103 1164390 1173809 1183370 1192754 1201567 1209699 1217083 1223310 1227908 1230865 1232449 1232490
61103 1232490 1230273 1225076 1216424 1203867 1187138 1166785 1144114 1120157 1095126 1069192 1043260 1018347
$$ packed form
61194A021623J8826J8080J6852J4864J2278R676P327N086K948J175j10j021j679
61181A125925k246l012l968m576m526m404m958n853o023n173m046l100j893p9
61167A072068J771K853L129L273L991N649Q023J0219J1341J1552J1969J3252J4850
61154A173940J5984J6693J7377J7862J7591J6368J4350J1510P773L507o64m418
61142A307873p715j0363j2123j3130j3719j3907j3582j3033j2741j2575j1918
61131A173067j0655r467q810q216p007n315l745k383p77J172K970M314N546O992
61117A137686Q338R079R287R419R561R384Q813Q132P384O227M598K957J584M1
61103A232490k217n197q652j2557j6729k0353k2671k3957k5031k5934k5932k4913
$$ plain form
61091 1018347 994479 970848 947034 923553 901206 880326 860758 842176 824307 807143 790980
61080 790980 776073 762301 749490 737916 728056 719853 712716 706301 700755 696007 691429 686589 681934
61067 681934 678211 675497 673287 671387 670199 670127 671180 673268 676508 681022 686625 692945 699755 707160 715491
61052 715491 725077 735961 747832 760324 773421 787382 802288 817867 833831 850136 866712 883164
61040 883164 899122 914827 930990 947968 965332 982504 999558 1017096 1035418 1054188 1073000
61029 1073000 1091909 1111205 1131041 1151704 1174060 1199145 1227145 1257238 1288763 1322189 1358473
61018 1358473 1397753 1439321 1483012 1530124 1582763 1642723 1711254 1789485 1878499 1979200 2092716
61007 2092716 2221250 2368786 2541531 2748189 2999455 3306414 3679244 4128085 4665669
$$ packed form
61091A018347k3868k3631k3814k3481k2347k0880j9568j8582j7869j7164j6163
61080G90980j4907j3772j2811j1574r860q203p137o415n546m748m578m840m655
61067F81934l723k714k210j900j188p2J053K088L240M514N603O320O810P405Q331
61052G15491R586J0884J1871J2492J3097J3961J4906J5579J5964J6305J6576J6452
61040H83164J5958J5705J6163J6978J7364J7172J7054J7538J8322J8770J8812
61029A073000J8909J9296J9836K0663K2356K5085K8000L0093L1525L3426L6284
61018A358473L9280M1568M3691M7112N2639N9960O8531P8231Q9014J00701J13516
61007B092716J28534J47536J72745K06658K51266L06959L72830M48841N37584
$$ plain form
60998 4665669 5309197 6079698 6999170 8086687 9354770 10806707 12432496 14198245 16029951
60989 16029951 17807014 19385224 20647275 21548462 22123438 22454695 22635265 22749065 22858924
60980 22858924 22983502 23072528 23012543 22675418 21979641 20921163 19560415 17988669 16302053
60971 16302053 14590217 12930165 11379054 9969896 8714771 7612996 6658004 5840232
60963 5840232 5147742 4566711 4082149 3678732 3341950 3059312 2820731 2618014 2444343
60954 2444343 2294223 2163385 2048348 1946139 1854561 1772347 1698677 1632563 1572792 1518156
60944 1518156 1467382 1419016 1371800 1325228 1279523 1235035 1191864 1150040 1109817 1071691 1036201
60933 1036201 1003694 974127 947089 922157 899214 878275 859034 840856 823342 806691 791339
$$ packed form
60998D665669O43528P70501R19472J087517J268083J451937J625789J765749J831706
60989A6029951J777063J578210J262051R01187N74976L31257J80570J13800J09859
60980B2858924J24578Q9026n9985l37125o95777j058478j360748j571746j686616
60971A6302053j711836j660052j551111j409158j255125j101775r54992q17772
60963E840232o92490n81031m84562m03417l36782k82638k38581k02717j73671
60954B444343j50120j30838j15037j02209r1578q2214p3670o6114n9771n4636
60944A518156n0774m8366m7216m6572m5705m4488m3171m1824m0223l8126l5490
60933A036201l2507k9567k7038k4932k2943k0939j9241j8178j7514j6651j5352
$$ plain form
60922 791339 777335 764235 751595 739419 728133 718267 710173 703838 698793 694330 690060 686319 683853
60909 683853 682988 683256 683901 684526 685108 685621 685956 686078 685875 684869 682416 678306 672930 666839 660392 653813
60893 653813 647248 640665 634069 627924 622997 619509 616772 614008 611245 609088 607761 606742 605256 602828
60879 602828 599414 595361 591282 587694 584586 581411 577586 573018 568223 563989 560853 558820 557551 556692
60865 556692 555875 554613 552671 550602 549499 549901 551231 552501 553304 553778 553957 553605 552633 551253 549690 547953
60849 547953 545903 543461 540885 538926 538310 538789 539005 537718 534928 531423 527515 522855 517282 511165 504844
60834 504844 498409 492192 486834 482522 478648 474566 470417 466847 464192 462270 460754 459459 458332 457420
60820 457420 456818 456552 456568 456906 457624 458514 459141 459322 459297 459237 458891 458027 456978 456339 456239 456251 455964 455242 453945
$$ packed form
60922G91339j4004j3100j2640j2176j1286r866q094o335n045m463m270l741k466
60909F83853q65K68O45O25N82N13L35J22k03j006k453m110n376o091o447o579
60893F53813o565o583o596o145m927l488k737k764k763k157j327j019j486k428
60879F02828l414m053m079l588l108l175l825m568m795m234l136k033j269q59
60865E56692q17j262j942k069j103M02J330J270Q03M74J79l52r72j380j563j737
60849E47953k050k442k576j959o16M79K16j287k790l505l908m660n573o117o321
60834E04844o435o217n358m312l874m082m149l570k655j922j516j295j127r12
60820D57420o02k66J6L38P18Q90O27J81k5o0l46q64j049o39j00J2k87p22j297
$$ plain form
60801 453945 451872 449255 446973 445859 445772 445598 444284 441831 439251 437533 436628 435491 433174 429813 426373
60786 426373 423447 420657 417397 413859 410886 408900 407471 406046 404643 403533 402624 401579 400394 399416 398919
60771 398919 399012 399835 401356 402999 404043 404499 405123 406398 408048 409828 412172 415517 419363 422663 425043
60756 425043 427079 429378 431870 434094 435793 437046 438056 438980 439912 441056 442932 446172 450816 455915 460158
60741 460158 462870 464136 464123 462751 460162 457093 454475 452816 452074 451975 452231 452541 452571 452064 450998 449646 448388
60724 448388 447390 446550 445756 444989 444043 442395 439668 436169 432683 429727 427189 424665 421930 419089 416481
60709 416481 414432 412938 411601 409976 407972 405816 403850 402513 402280 403162 404318 404575 403462 401564 399880
60694 399880 399047 399132 399806 400614 401304 401984 402814 403694 404497 405542 407434 410375 413911 417385 420323 422498 424087
$$ packed form
60801D53945k073k617k282j114q7j74j314k453k580j718r05j137k317l361l440
60786D26373k926k790l260l538k973j986j429j425j403j110r09j045j185r78m97
60771C98919R3Q23J521J643J044M56O24J275J650J780K344L345L846L300K380
60756D25043K036K299K492K224J699J253J010R24R32J144J876L240M644N099M243
60741D60158K712J266j3j372k589l069k618j659p42r9K56L10L0n07j066j352j258
60724D48388r98q40p94p67r46j648k727l499l486k956k538k524k735k841k608
60709D16481k049j494j337j625k004k156j966j337k33Q82J156K57j113j898j684
60694C99880q33Q5O74Q08O90O80Q30Q80Q03J045J892K941L536L474K938K175J589
$$ plain form
60677 424087 425918 429075 433880 439495 444727 449062 452739 456072 458951 460911 461519 460793 459339 457971 457097
60662 457097 456626 456409 456441 456517 456084 454771 452898 451153 449899 449066 448630 448805 449656 450808 451746 452365 453084 454348
60644 454348 456034 457336 457312 455633 452867 450000 447624 445594 443457 441128 438998 437427 436426 435989 436355
60629 436355 437540 438811 439224 438780 438466 438963 439817 440234 440192 440325 441087 442536 444636 447221 449837 452085 454006
60612 454006 455723 457002 457695 458317 459424 460589 460753 459600 457893 456365 455039 453760 452663 451814 451036
60597 451036 450409 450320 450686 450752 450156 449634 450093 451428 452860 454133 455669 457627 459508 460864 461944 463383
60581 463383 465470 467960 470524 473175 476112 479223 481967 483918 485308 486892 489389 493196 498374 504569
60567 504569 511115 517650 524533 532241 540430 548100 554655 560354 565748 571166 576689 582019 586349 588950
$$ packed form
60677D24087J831L157M805N615N232M335L677L333K879J960O08p26j454j368q74
60662D57097m71k17L2P6m33j313j873j745j254q33m36J75Q51J152R38O19P19J264
60644D54348J686J302k4j679k766k867k376k030k137k329k130j571j001m37L66
60629D36355J185J271M13m44l14M97Q54M17m2J33P62J449K100K585K616K248J921
60612D54006J717J279O93O22J107J165J64j153j707j528j326j279j097q49p78
60597D51036o27q9L66O6n96n22M59J335J432J273J536J958J881J356J080J439
60581D63383K087K490K564K651K937L111K744J951J390J584K497L807N178O195
60567E04569O546O535O883P708Q189P670O555N699N394N418N523N330M330K601
$$ plain form
60553 588950 589875 589482 587442 583243 577834 573634 572320 573374 575283 577284 579271 581066 582901 586083 591954
60538 591954 600281 609582 618919 628626 639446 651862 666309 683202 702420 723235 744875 766794
60526 766794 788354 808677 826834 841842 852619 858439 859427 856237 849304 838847 825485 810311
60514 810311 794320 778225 762772 748665 736074 724758 714763 706643 700903 697757 697534 700826 707930
60501 707930 718484 731916 747935 766419 787241 810550 836966 867027 900411 935876 971920
60490 971920 1007338 1041182 1072465 1100161 1123587 1142784 1158527 1171966 1184274 1196425 1208999
60479 1208999 1222065 1235430 1248891 1261924 1273067 1280082 1281023 1274889 1261103 1239042 1208698 1171462
60467 1171462 1129498 1084331 1036621 987304 938217 891318 847694 807598 771078 738198 708828
$$ packed form
60553E88950R25l93k040m199n409m200j314J054J909K001J987J795J835L182N871
60538E91954Q327R301R337R707J0820J2416J4447J6893J9218K0815K1640K1919
60526G66794K1560K0323J8157J5008J0777N820R88l190o933j0457j3362j5174
60514H10311j5991j6095j5453j4107j2591j1316r995q120n740l146k23L292P104
60501G07930J0554J3432J6019J8484K0822K3309K6416L0061L3384L5465L6044
60490I71920L5418L3844L1283K7696K3426J9197J5743J3439J2308J2151J2574
60479A208999J3066J3365J3461J3033J1143P015R41o134j3786k2061l0344l7236
60467A171462m1964m5167m7710m9317m9087m6899m3624m0096l6520l2880k9370
$$ plain form
60456 708828 682585 659048 637963 619286 603093 589360 577771 567766 558846 550908 544312 539510
60444 539510 536393 534040 531461 528657 526593 525933 526144 526116 525371 524231 523071 521865 520476 518951 517480
60429 517480 516292 515549 515122 514528 513350 511717 510246 509619 510300 512402 515559 519071 522413 525469 528196
60414 528196 530406 532144 533851 535792 537664 539229 540944 543306 545849 547557 548267 548982 550576 552736 554429
60399 554429 555144 555493 556761 559808 564229 568728 572509 576014 580045 584670 589576 594985 601292 607924 613633
60384 613633 618051 622054 626257 630034 632602 634427 636794 640208 643851 646595 648209 649480 651388 654227
60370 654227 657514 660629 663316 665559 667344 668866 670636 672980 675755 678952 683164 688799 695300 701978
60356 701978 709303 718292 728798 739655 750650 762896 776724 790407 801867 810698 817574 822458
$$ packed form
60456G08828k6243k3537k1085j8677j6193j3733j1589j0005q920p938o596m802
60444E39510l117k353k579k804k064o60K11k8p45j140j160j206j389j525j471
60429E17480j188p43m27n94j178j633j471o27O81K102L157L512L342L056K727
60414E28196K210J738J707J941J872J565J715K362K543J708P10P15J594K160J693
60399E54429P15L49J268L047M421M499L781L505M031M625M906N409O307O632N709
60384F13633M418M003M203L777K568J825K367L414L643K744J614J271J908K839
60370F54227L287L115K687K243J785J522J770K344K775L197M212N635O501O678
60356G01978P325Q989J0506J0857J0995J2246J3828J3683J1460Q831O876M884
$$ plain form
60344 822458 824547 823562 820048 814510 807113 798123 787965 776931 765453 754510 745051 736997 729461
60331 729461 722022 715196 709550 704934 700812 696932 693350 690023 686667 683025 679260 676082 674370 674570
60317 674570 676530 679979 684897 691305 699027 707961 718346 730331 743406 756515 768620 778864 786427
60304 786427 790842 792593 793079 793725 795124 796896 798181 798359 797497 796074 794117 790756 784848 775982 764731
60289 764731 752066 738806 725519 712594 700289 688838 678477 669221 660749 652709 645102 638122
60277 638122 631679 625335 618722 611848 604971 598390 592428 587448 583669 580893 578497 575861 573027 570805
60263 570805 569986 570408 571093 571356 571427 571867 572781 573933 575288 577016 579117 581420 583879 586496 588961 590707
60247 590707 591370 591030 589992 588556 586925 585205 583509 582150 581518 581609 581892 581925 581956 582597 584070 586131 588623
$$ packed form
60344H22458K089r85l514n538p397q990j0158j1034j1478j0943r459q054p536
60331G29461p439o826n646m616m122l880l582l327l356l642l765l178j712K00
60317F74570J960L449M918O408P722Q934J0385J1985J3075J3109J2105J0244P563
60304G86427M415J751M86O46J399J772J285J78q62j423j957l361n908q866j1251
60289G64731j2665j3260j3287j2925j2305j1451j0361r256q472q040p607o980
60277F38122o443o344o613o874o877o581n962m980l779k776k396k636k834k222
60263E70805q19M22O85K63P1M40R14J152J355J728K101K303K459K617K465J746
60247E90707O63l40j038j436j631j720j696j359o32R1K83L3L1O41J473K061K492
$$ plain form
60230 588623 591693 595452 599838 604870 610706 617355 624665 632692 641756 651982 663022 674419 686035
60217 686035 698000 710387 723087 735819 748217 760068 771623 783455 795857 808460 820596
60206 820596 831825 842019 851109 859084 866161 872635 878460 883216 886546 888426 888883 887708 884724 880304
60192 880304 875264 870142 864788 858775 851985 844612 836810 828671 820545 813020 806459 800780 795771 791405
60178 791405 787721 784655 782204 780610 780071 780263 780367 779663 778028 775896 773815 772049 770420 768449 765660
60163 765660 761847 757138 751858 746356 740930 735849 731410 727912 725613 724713 725313 727245 729952 732787 735537
60148 735537 738466 741749 745106 748247 751404 755029 759108 763219 767262 771643 776629 781991 787473 793122
60134 793122 798856 804072 808219 811623 815284 819796 824754 829344 833315 837256 841935 847422 852917 857486
$$ packed form
60230E88623L070L759M386N032N836O649P310Q027R064J0226J1040J1397J1616
60217F86035J1965J2387J2700J2732J2398J1851J1555J1832J2402J2603J2136
60206H20596J1229J0194R090P975P077O474N825M756L330J880M57j175k984m420
60192H80304n040n122n354o013o790p373p802q139q126p525o561n679n009m366
60178G91405l684l066k451j594n39J92J04p04j635k132k081j766j629j971k789
60163G65660l813m709n280n502n426n081m439l498k299r00O00J932K707K835K750
60148G35537K929L283L357L141L157L625M079M111M043M381M986N362N482N649
60134G93122N734N216M147L404L661M512M958M590L971L941M679N487N495M569
$$ plain form
60120 857486 860931 863834 866815 869984 873136 876174 879134 882005 884775 887513 890197 892489 893970 894648
60106 894648 895021 895520 895978 895822 894786 893328 892196 891687 891482 891187 890719 890072 889031 887443 885577 883774
60090 883774 881807 878930 874565 868684 861603 853804 845996 838880 832564 826403 819578 811763 803232 794545
60076 794545 786150 778073 769965 761593 753210 745237 737719 730471 723609 717538 712424 708091 704372 701132
60062 701132 697986 694608 691377 689113 688000 687333 686531 685880 686020 687228 689465 692648 696545 700808 705360
60047 705360 710374 715744 721086 726398 732060 737917 743097 747054 750065 752278 753106 752175 750077 747416 743865
60032 743865 739121 734067 729826 726020 721182 714708 707282 699445 690989 681971 673213 665282 657749 649947
60018 649947 641883 634018 626665 620030 614471 610339 607687 606225 605300 604018 601871 599287 597150 595802
$$ packed form
60120H57486L445K903K981L169L152L038K960K871K770K738K684K292J481O78
60106H94648L73M99M58j56j036j458j132n09k05k95m68o47j041j588j866j803
60090H83774j967k877m365n881p081p799p808p116o316o161o825p815q531q687
60076G94545q395q077q108q372q383p973p518p248o862o071n114m333l719l240
60062G01132l146l378l231k264j113o67q02o51J40J208K237L183L897M263M552
60047G05360N014N370N342N312N662N857N180L957L011K213Q28r31k098k661l551
60032G43865m744n054m241l806m838o474p426p837q456r018q758p931p533p802
60018F49947q064p865p353o635n559m132k652j462r25j282k147k584k137j348
$$ plain form
60004 595802 595014 594872 595883 597981 600177 601641 602696 604300 606945 610372 613989 617176 619544 621420 623843
59989 623843 627646 632611 637841 642799 647561 652109 655835 657987 658422 657677 656296 654205 650913 646308 641079
59974 641079 636232 632271 628967 625758 622208 618236 614215 610847 608730 608006 608513 610124 612753 616176 620162
59959 620162 624620 629351 633758 637154 639302 640455 641044 641611 642749 644499 645958 646126 645204 644448 644611 645108
59943 645108 644893 643610 641572 639246 637214 636232 636706 638312 640596 643791 648574 655012 662223 669112 675123
59928 675123 680137 683972 686319 687079 686515 685043 683048 680955 679281 678426 678513 679611 681994 685931 691268
59913 691268 697549 704541 712265 720423 728243 735069 740696 744883 747106 747260 746149 744700 742940 740315
59899 740315 736793 733030 729599 726689 724461 723007 721940 720695 719374 718746 719309 720874 723185 726336 730360
$$ packed form
60004E95802p88j42J011K098K196J464J055J604K645L427L617L187K368J876K423
59989F23843L803M965N230M958M762M548L726K152M35p45j381k091l292m605n229
59974F41079m847l961l304l209l550l972m021l368k117p24N07J611K629L423L986
59959F20162M458M731M407L396K148J153N89N67J138J750J459J68r22p56J63M97
59943F45108k15j283k038k326k032r82M74J606K284L195M783O438P211O889O011
59928F75123N014L835K347P60n64j472j995k093j674q55Q7J098K383L937N337
59913F91268O281O992P724Q158P820O826N627M187K223J54j111j449j760k625
59899G40315l522l763l431k910k228j454j067j245j321o28N63J565K311L151M024
$$ plain form
59884 730360 734913 739658 744569 749675 754811 759847 764779 769490 773802 777917 782364 787284 792085 795967
59870 795967 798441 799281 798420 796166 793159 789894 786548 783298 780358 777598 774641 771555 768862 766618 764088
59855 764088 760805 757422 754921 753322 751836 750067 748451 747604 747898 749723 753584 759581 767072 775196 783692
59840 783692 792949 803165 813655 823270 831544 839132 846887 854884 862814 870990 880118 889890 898587 904498
59826 904498 907358 907977 906913 904031 899122 892449 884744 877057 870533 865972 863392 862110 861156 859649 856994
59811 856994 853020 847935 842123 836047 830243 825061 820362 815754 811229 807241 803954 800775 796868 791983
59797 791983 786658 781794 778066 775415 772990 769914 766256 762883 760264 757869 755032 751866 748885 746150
59783 746150 743345 740499 738027 736119 734564 733230 732440 732751 734526 737605 741247 744535 747097 749368 751982
$$ packed form
59884G30360M553M745M911N106N136N036M932M711M312M115M447M920M801L882
59870G95967K474Q40q61k254l007l265l346l250k940k760k957l086k693k244k530
59855G64088l283l383k501j599j486j769j616q47K94J825L861N997P491Q124Q496
59840G83692R257J0216J0490R615Q274P588P755P997P930Q176R128R772Q697N911
59826I04498K860O19j064k882m909o673p705p687o524m561k580j282r54j507k655
59811H56994l974n085n812o076n804n182m699m608m525l988l287l179l907m885
59797G91983n325m864l728k651k425l076l658l373k619k395k837l166k981k735
59783G46150k805k846k472j908j555j334p90L11J775L079L642L288K562K271K614
$$ plain form
59768 751982 755070 758375 761815 765636 770080 775206 780969 787285 794025 801135 808685 816618 824602 832351
59754 832351 839980 847820 855931 863937 871265 877388 882019 885311 887825 890086 892139 893668 894488 894788 894985
59739 894985 895445 896248 897109 897598 897553 897252 897111 897358 898051 899246 900968 903078 905248 907052 908148 908547 908650
59722 908650 908831 909047 909108 909226 909905 911215 912667 913921 915268 917166 919726 922862 926621 931090 936322 942595
59706 942595 950421 959925 970499 981350 992123 1002729 1012971 1022843 1032893 1043669 1054863 1065497
59694 1065497 1074977 1083542 1091666 1099403 1106470 1112586 1117554 1121198 1123486 1124694 1125329 1125851 1126418 1126790 1126363
59679 1126363 1124345 1120139 1113827 1106323 1098729 1091363 1083711 1075556 1067791 1061646 1057417 1054548 1052760 1052306
59665 1052306 1053140 1054727 1057041 1060993 1067351 1075694 1084869 1094105 1103326 1112797 1122828 1133421 1143778
$$ packed form
59768G51982L088L305L440L821M444N126N763O316O740P110P550P933P984P749
59754H32351P629P840Q111Q006P328O123M631L292K514K261K053J529Q20L00J97
59739H94985M60Q03Q61M89m5l01j41K47O93J195J722K110K170J804J096L99J03
59722I08650J81K16O1J18O79J310J452J254J347J898K560L136L759M469N232O273
59706I42595P826R504J0574J0851J0773J0606J0242R872J0050J0776J1194J0634
59694A065497R480Q565Q124P737P067O116M968L644K288J208O35N22N67L72m27
59679A126363k018m206o312p504p594p366p652q155p765o145m229k869j788m54
59665A052306Q34J587K314L952O358Q343R175R236R221R471J0031J0593J0357
$$ plain form
59652 1143778 1152458 1158393 1161432 1161682 1158724 1151912 1141041 1126404 1108551 1088379 1067008 1045154 1023011
59639 1023011 1001101 980639 962481 946156 930586 915330 900542 886161 871967 858156 845055
59628 845055 832420 819741 807048 794616 782047 768607 754583 741450 730399 721305 713337 705973
59616 705973 699128 692832 687241 682624 679089 676511 674839 674216 674696 676075 678064 680353 682505 684110 685156
59601 685156 685989 686851 687716 688616 689826 691573 693711 695780 697353 698368 699171 700098 700856 700591 698758 695737
59585 695737 692344 689001 685692 682499 679741 677641 676154 674983 673576 671354 668285 665035 662205 659660
59571 659660 656980 654267 652019 650354 648839 647060 645039 643223 642265 642514 643396 643700 642889 641747 641276 641544
59555 641544 642278 643961 647208 651378 654981 657574 660214 663882 668430 673394 678926 685414 692888 701343
$$ packed form
59652A143778Q680N935L039K50k958o812j0871j4637j7853k0172k1371k1854k2143
59639A023011k1910k0462j8158j6325j5570j5256j4788j4381j4194j3811j3101
59628H45055j2635j2679j2693j2432j2569j3440j4024j3133j1051r094p968p364
59616G05973o845o296n591m617l535k578j672o23M80J379J989K289K152J605J046
59601F85156Q33Q62Q65R00J210J747K138K069J573J015Q03R27P58k65j833l021
59585F95737l393l343l309l193k758k100j487j171j407k222l069l250k830k545
59571F59660k680k713k248j665j515j779k021j816r58K49Q82L04q11j142m71K68
59555F41544P34J683L247M170L603K593K640L668M548M964N532O488P474Q455
$$ plain form
59541 701343 711194 722944 736643 751910 768148 784514 799993 813669 824777 832607 836882 838227
59529 838227 837752 836159 833666 830733 828048 825710 823059 819576 815396 810756 805602 799949 794029 787829
59515 787829 781050 773689 766009 757701 747913 736558 724907 714331 705066 696767 689633 684179 680318
59502 680318 677523 675703 675189 675933 677416 679428 682350 686464 691399 696479 701428 706502 712041 718014 724071
59487 724071 729937 735600 740962 745579 749089 751823 754532 757431 759946 761563 762529 763498 764800 766307 767739
59472 767739 768917 769913 771137 773018 775491 778065 780566 783518 787520 792474 797666 802532 807221 812522
59458 812522 819220 827331 835986 844248 851977 859656 867553 875536 883539 891564 899123 905272 909419 911719
59444 911719 912628 912629 912359 912241 911759 909865 906529 903210 901340 900927 901121 901522 902315 903639 905538 908167 911373
$$ packed form
59541G01343R851J1750J3699J5267J6238J6366J5479J3676J1108P830M275J345
59529H38227m75j593k493k933k685k338k651l483m180m640n154n653n920o200
59515G87829o779p361p680q308r788j1355j1651j0576r265q299p134n454l861
59502F80318k795j820n14P44J483K012K922M114M935N080M949N074N539N973O057
59487G24071N866N663N362M617L510K734K709K899K515J617R66R69J302J507J432
59472G67739J178R96J224J881K473K574K501K952M002M954N192M866M689N301
59458H12522O698Q111Q655Q262P729P679P897P983Q003Q025P559O149M147K300
59444I11719R09Jk70j18m82j894l336l319j870m13J94M01P93J324J899K629L206
$$ plain form
59427 911373 914432 916895 919515 923664 929983 938069 947248 956997 966838 976617 986907 998501 1011436
59414 1011436 1025066 1039036 1053378 1067342 1078709 1084839 1084343 1077769 1067106 1054920 1043449 1033920
59402 1033920 1026532 1021232 1018394 1018442 1020721 1023035 1022679 1018114 1009619 998420 985518 971514 957151 943388
59388 943388 930978 920450 912501 907745 905820 905339 905223 905713 907634 910994 914859 918393 921466 924288
59374 924288 926942 929360 931324 932425 932299 931001 928945 926504 923949 921728 920383 920049 920265 920508 920774
59359 920774 921543 923364 926595 931468 938129 946552 956455 967423 979138 991508 1004649 1018830 1034364
59346 1034364 1051290 1068948 1086000 1101185 1114102 1125084 1134321 1141321 1145265 1145680 1142637 1136545 1127931
59333 1127931 1117391 1105568 1093026 1080008 1066314 1051595 1035933 1019933 1004123 988550 973227
$$ packed form
59427I11373L059K463K620M149O319Q086R179R749R841R779J0290J1594J2935
59414A011436J3630J3970J4342J3964J1367O130m96o574j0663j2186j1471r529
59402A033920p388n300k838M8K279K314l56m565q495j1199j2902j4004j4363j3763
59388I43388j2410j0528p949m756j925m81j16M90J921L360L865L534L073K822
59374I24288K654K418J964J101j26j298k056k441k555k221j345l34K16K43K66
59359I20774P69J821L231M873O661Q423R903J0968J1715J2370J3141J4181J5534
59346A034364J6926J7658J7052J5185J2917J0982R237P000L944M15l043o092q614
59333A127931j0540j1823j2542j3018j3694j4719j5662j6000j5810j5573j5323
$$ plain form
59322 973227 958663 945496 933735 922872 912667 903286 894741 886803 879542 873308 867933 862493 856225
59309 856225 849302 842482 836351 831194 827215 824528 823142 823171 824828 828101 832747 838772 846542 856279 867897
59294 867897 881525 897635 916124 935541 953618 968446 979065 985451 988413 989229 988933 988000 986856
59281 986856 986290 986999 989109 992575 997718 1004804 1013262 1021928 1030120 1038069 1046278 1054805 1063228 1070941 1077418
59266 1077418 1082409 1086063 1088764 1090778 1092016 1092019 1090139 1085911 1079362 1070932 1061078 1050087 1038215 1025735
59252 1025735 1012816 999605 986448 973731 961538 949883 939298 930698 924442 919966 916556 914091
59240 914091 912733 912350 912602 913249 913936 913976 912731 910109 906366 901622 895858 889222 882028 874515 866776 858784
59224 858784 850393 841472 832089 822314 811874 800453 788461 777001 766779 757442 748259 739132 730611
$$ packed form
59322I73227j4564j3167j1761j0863j0205r381q545p938p261o234n375n440o268
59309H56225o923o820o131n157l979k687j386K9J657L273M646O025P770R737J1618
59294H67897J3628J6110J8489J9417J8077J4828J0619O386K962Q16k96r33j144
59281I86856n66P09K110L466N143P086Q458Q666Q192P949Q209Q527Q423P713O477
59266A077418M991L654K701K014J238Lj880m228o549q430r854j0991j1872j2480
59252A025735j2919j3211j3157j2717j2193j1655j0585q600o256m476l410k465
59240I14091j358l83K52O47O87M0j245k622l743m744n764o636p194p513p739p992
59224H58784q391q921r383r775j0440j1421j1992j1460j0222r337r183r127q521
$$ plain form
59211 730611 723211 717004 711645 706643 701910 698113 696031 695370 694818 693548 692143 691684 692499 694293 697026
59196 697026 700995 706259 712444 718955 725111 730450 735234 740345 746314 752774 759041 764722 769458 772757
59182 772757 774690 776220 778109 779866 780376 779266 777060 774307 771216 767954 764637 761190 757703 754734
59168 754734 752789 751700 750994 750563 750482 750509 750383 750348 750709 751036 750454 748614 745884 742759 739573 736551 733498
59151 733498 729678 724672 719226 714532 710736 706785 701698 695435 688517 681458 674625 668116 661670 655111
59137 655111 648998 644381 641819 640906 640734 640633 640537 640976 642604 645581 649591 654557 660844 668474 676720 685040
59121 685040 693946 704297 716091 728599 741343 754224 766969 779242 791197 803179 814894 825434
59109 825434 834065 840531 844867 847503 849261 850552 850760 849134 846033 842511 838879 834555 829325 823828
$$ packed form
59211G30611p400o207n359n002m733l797k082o61n52j270j405m59Q15J794K733
59196F97026L969N264O185O511O156N339M784N111N969O460O267N681M736L299
59182G72757J933J530J889J757N10j110k206k753l091l262l317l447l487k969
59168G54734j945j089p06m31q1K7j26l5L61L27n82j840k730l125l186l022l053
59151G33498l820n006n446m694l796l951n087o263o918p059o833o509o446o559
59137F55111o113m617k562r13j72j01r6M39J628K977M010M966O287P630Q246Q320
59121F85040Q906J0351J1794J2508J2744J2881J2745J2273J1955J1982J1715J0540
59109H25434Q631O466M336K636J758J291K08j626l101l522l632m324n230n497
$$ plain form
59095 823828 818641 813642 808502 803242 798152 793638 790227 788249 787427 787111 786722 785667 783201 779079 774141
59080 774141 769502 765297 760874 756046 751377 747307 743771 740700 738171 736023 733928 731857 729958 728113
59066 728113 726122 724068 721901 719057 715273 711413 708501 706187 703279 699539 695853 692708 689809 687257
59052 687257 685773 685427 685311 684906 684702 685040 685388 685319 685246 685588 685976 685836 685133 684043 682585 681049 680121 680137
59034 680137 680745 681659 683125 685304 687955 691121 695472 701455 708698 716715 725604 735548 746156 756742
59020 756742 766804 775826 783112 788278 791509 792945 792246 789130 784017 777867 771680 766278 762102 759012
59006 759012 756601 754822 753848 753493 753491 754394 757301 762373 768338 773777 778217 781763 784428 786314 787798 789075
58990 789075 789981 790590 791483 793137 795546 798605 802279 806312 810558 815765 823153 832911 843937 855451
$$ packed form
59095H23828n187m999n140n260n090m514l411j978q22l16l89j055k466m122m938
59080G74141m639m205m423m828m669m070l536l071k529k148k095k071j899j845
59066G28113j991k054k167k844l784l860k912k314k908l740l686l145k899k552
59052F87257j484l46j16m05k04L38L48o9p3L42L88j40p03j090j458j536r28J6
59034F80137O08R14J466K179K651L166M351N983P243Q017Q889R944J0608J0586
59020G56742J0062R022P286N166L231J436o99l116n113o150o187n402m176l090
59006G59012k411j779r74l55kR03K907N072N965N439M440L546K665J886J484J277
58990G89075R06O09Q93J654K409L059L674M033M246N207P388R758J1026J1514
$$ plain form
58976 855451 867989 882317 898215 914856 931616 947882 962816 976050 988078 999364 1009526
58965 1009526 1017925 1024514 1029556 1032990 1034633 1034578 1032921 1029466 1024043 1016678 1007215 995363 981343 965866
58951 965866 949256 931434 913029 895491 879555 864578 850110 837197 827221 820115 814586 809576
58939 809576 804771 800278 796681 794947 795437 797270 799268 801055 802681 803816 804193 804314 804718 804848 803607
58924 803607 800973 798274 796759 796439 796361 795689 794518 793808 794329 795677 796761 797331 798426 801172 805883 812531
58908 812531 821130 831217 841876 852900 865096 878830 893185 907330 921782 937300 953370 968932
58896 968932 984071 999831 1016677 1034180 1051979 1070161 1088919 1108530 1129298 1150771 1171463
58885 1171463 1190180 1207218 1223361 1238217 1250544 1259895 1266845 1271835 1274909 1276533 1277547 1278047 1277100
$$ packed form
58976H55451J2538J4328J5898J6641J6760J6266J4934J3234J2028J1286J0162
58965A009526Q399O589N042L434J643n5j657l455n423p365r463j1852j4020j5477
58951I65866j6610j7822j8405j7538j5936j4977j4468j2913r976p106n529n010
58939H09576m805m493l597j734M90J833J998J787J626J135L77J21M04J30j241
58924H03607k634k699j515l20p8o72j171p10N21J348J084N70J095K746M711O648
58908H12531Q599J0087J0659J1024J2196J3734J4355J4145J4452J5518J6070J5562
58896I68932J5139J5760J6846J7503J7799J8182J8758J9611K0768K1473K0692
58885A171463J8717J7038J6143J4856J2327R351O950M990L074J624J014N00r47
$$ plain form
58872 1277100 1273835 1268332 1261373 1253782 1245963 1237673 1228279 1217486 1205560 1192638 1178419 1162913 1146830
58859 1146830 1130619 1113848 1096261 1078728 1062235 1046513 1030706 1014903 999874 985650 971472
58848 971472 956959 942223 926979 910671 893534 876580 860459 845123 830596 817231 805144
58837 805144 794127 784152 775338 767523 760548 754846 750995 748797 747505 746883 747327 749039 751752 755199
58823 755199 759236 763604 768112 772821 777537 781523 784409 786953 790145 793929 797592 800868 803641 805076
58809 805076 804303 801813 798962 796187 792855 788748 784400 779886 774546 768301 762208 757244 753323 749806
58795 749806 746322 742892 739868 737883 737285 737707 738802 741150 745627 752134 760033 769631 781986 797103
58781 797103 813548 830088 846601 863079 878929 893859 908376 922594 935111 943730 946978 944624
$$ packed form
58872A277100l265n503o959p591p819q290r394j0793j1926j2922j4219j5506j6083
58859A146830j6211j6771j7587j7533j6493j5722j5807j5803j5029j4224j4178
58848I71472j4513j4736j5244j6308j7137j6954j6121j5336j4527j3365j2087
58837H05144j1017r975q814p815o975n702l851k198j292o22M44J712K713L447
58823G55199M037M368M508M709M716L986K886K544L192L784L663L276K773J435
58809H05076p73k490k851k775l332m107m348m514n340o245o093m964l921l517
58795G49806l484l430l024j985n98M22J095K348M477O507P899R598J2355J5117
58781G97103J6445J6540J6513J6478J5850J4930J4517J4218J2517Q619L248k354
$$ plain form
58769 944624 937269 925858 911291 894201 875243 855437 835771 816698 798591 782419 769068 758133
58757 758133 748362 739337 731751 725907 721050 716534 712676 709919 707951 706265 705103 705314 707577 711946
58743 711946 717794 724037 729882 735477 741522 748299 755506 762845 770141 776975 782973 788442 794061 799957
58729 799957 805719 811204 816526 821389 825327 828573 831862 835408 839042 843270 849138 856858 865601 874710
58715 874710 884020 892743 899327 902979 904384 904360 902633 898443 891467 881588 868525 852374 834015 814477
58701 814477 794313 773862 753526 733446 713537 694203 676416 660749 646827 634047 622278
58690 622278 611632 602132 593890 587057 581345 576136 571299 567373 564784 563374 562798 562826 563230 563969 565492
58675 565492 568139 571243 573662 575356 577662 581910 588535 597556 608959 622296 636724 651725 667102
$$ packed form
58769I44624p355j1411j4567j7090j8958j9806j9666j9073j8107j6172j3351j0935
58757G58133r771r025p586n844m857m516l858k757j968j686j162K11K263M369
58743G11946N848O243N845N595O045O777P207P339P296O834N998N469N619N896
58729G99957N762N485N322M863L938L246L289L546L634M228N868P720Q743R109
58715H74710R310Q723O584L652J405k4j727m190o976r879j3063j6151j8359j9538
58701H14477k0164k0451k0336k0080j9909j9334j7787j5667j3922j2780j1769
58690F22278j0646r500q242o833n712n209m837l926k589j410n76K8M04P39J523
58675E65492K647L104K419J694K306M248O625R021J1403J3337J4428J5001J5377
$$ plain form
58662 667102 682186 695779 706904 714744 717945 715169 706644 694167 679399 663177 646484 630722
58650 630722 616508 603439 591486 581467 573665 567224 561555 557073 553885 551010 547880 545485 545003
58637 545003 546136 547742 549153 549938 549347 547234 544798 543204 541945 539740 536590 533768 532037 531010 530138
58622 530138 529305 528457 527627 527470 528999 532478 537085 541854 546543 551384 556322 560908 564924 568794 573023
58607 573023 577290 580669 583045 585649 589547 594082 597733 600204 602569 605476 608345 610462 611792 612579
58593 612579 613215 614755 618511 624732 632574 641584 652193 664486 677625 690907 704357 717793 730369
58580 730369 741652 752230 762686 772825 782379 791568 800533 809132 817844 827979 840547 855782
58568 855782 874091 896307 922450 951304 981851 1014028 1047439 1080402 1111044 1138446 1162030
$$ packed form
58662F67102J5084J3593J1125P840L201k776q525j2477j4768j6222j6693j5762
58650F30722j4214j3069j1953j0019p802o441n669m482l188k875l130k395m82
58637E45003J133J606J411P85n91k113k436j594j259k205l150k822j731j027q72
58622E30138q33q48q30j57J529L479M607M769M689M841M938M586M016L870M229
58607E73023M267L379K376K604L898M535L651K471K365K907K869K117J330P87
58593F12579O36J540L756O221P842R010J0609J2293J3139J3282J3450J3436J2576
58580G30369J1283J0578J0456J0139R554R189Q965Q599Q712J0135J2568J5235
58568H55782J8309K2216K6143K8854L0547L2177L3411L2963L0642K7402K3584
$$ plain form
58557 1162030 1180817 1194008 1201536 1203538 1200341 1193471 1185448 1177805 1170302 1162616 1155430 1149063 1142364
58544 1142364 1133981 1123500 1110343 1092984 1070691 1044991 1017985 990041 960484 929743 899385
58533 899385 870585 843788 819412 797711 778328 760880 745532 732259 720284 709013 698809
58522 698809 690087 682532 675936 670682 666473 661824 656081 650789 647630 646031 644268 642074 640439 639581
58508 639581 638795 637906 637346 637107 636970 637383 638793 640449 641163 640988 640953 641568 642796 645058 648952 654192 659994
58491 659994 666220 673151 680655 688729 698380 710649 725120 740659 757223 775701 796267 818152
58479 818152 840746 863627 885647 905098 920734 931777 937400 937270 932261 923646 912074 898320
58467 898320 884246 871631 860534 850224 841320 835596 833932 835883 841052 849437 860533 873453 887970
$$ packed form
58557A162030J8787J3191P528K002l197o870q023p643p503p686p186o367o699
58544A142364q383j0481j3157j7359k2293k5700k7006k7944k9557l0741l0358
58533H99385k8800k6797k4376k1701j9383j7448j5348j3273j1975j1271j0204
58522F98809q722p555o596n254m209m649n743n292l159j599j763k194j635q58
58508F39581p86q89n60k39j37M13J410J656P14j75l5O15J228K262L894N240N802
58491F59994O226O931P504Q074R651J2269J4471J5539J6564J8478K0566K1885
58479H18152K2594K2881K2020J9451J5636J1043N623j30n009q615j1572j3754
58467H98320j4074j2615j1097j0310q904n724j664J951N169Q385J1096J2920J4517
$$ plain form
58454 887970 904203 921150 936614 948607 956034 958238 954991 946907 934998 919945 902466 883924
58442 883924 865590 847782 830606 815000 801928 791093 781708 774187 769853 769211 771549 775906 781438
58429 781438 787310 793332 800347 808930 818045 825947 831870 835907 837916 837667 835406 831155 824229 814612
58415 814612 803979 793946 784110 773233 761532 750273 739888 730186 721668 714852 708907 702770 697082
58402 697082 693212 690881 688660 686426 685375 685888 687261 689355 692578 696325 699248 701142 702971 705182
58388 705182 707544 710434 714535 719437 724117 728655 733867 739605 745116 750749 757483 765017 772170 778917
58374 778917 786187 793907 801236 808624 817594 828409 839842 851255 863135 875589 888114 900842
58362 900842 914177 927195 938131 946451 952787 957035 958361 956926 953753 949062 942542 935013 927882
$$ packed form
58454H87970J6233J6947J5464J1993P427K204l247q084j1909j5053j7479j8542
58442H83924j8334j7808j7176j5606j3072j0835r385p521m334o42K338M357N532
58429G81438N872O022P015Q583R115P902N923M037K009k49k261m251o926r617
58415H14612j0633j0033r836j0877j1701j1259j0385r702q518o816n945o137n688
58402F97082l870k331k221k234j051N13J373K094L223L747K923J894J829K211
58388G05182K362K890M101M902M680M538N212N738N511N633O734P534P153O747
58374G78917P270P720P329P388Q970J0815J1433J1413J1880J2454J2525J2728
58362I00842J3335J3018J0936Q320O336M248J326j435l173m691o520p529p131
$$ plain form
58349 927882 921291 914841 909814 908381 910775 915422 921739 930470 941341 952913 964963 978847 995247
58336 995247 1013633 1033922 1056401 1079853 1101972 1121791 1139714 1155333 1167564 1176923 1185260 1193112
58324 1193112 1199638 1205126 1211080 1217730 1223870 1229273 1234851 1240420 1244825 1248332 1252473 1257568 1262892 1269062
58310 1269062 1277354 1286762 1294694 1300655 1306325 1312102 1316789 1320751 1326041 1333095 1340587 1348781 1359612 1373082
58296 1373082 1387060 1401021 1416348 1432439 1446346 1457046 1466428 1475274 1482146 1487275 1493711 1503342
58284 1503342 1515269 1529050 1545628 1563798 1579645 1590973 1598681 1602616 1600245 1591326 1580262 1572033
58272 1572033 1569147 1573747 1588533 1613570 1645725 1683074 1726465 1775474 1826849 1878721 1932470 1988721
58260 1988721 2045452 2101723 2159197 2218108 2275784 2330985 2385658 2440832 2495145 2549018 2605662
$$ packed form
58349I27882o591o450n027j433K394M647O317Q731J0871J1572J2050J3884J6400
58336I95247J8386K0289K2479K3452K2119J9819J7923J5619J2231R359Q337P852
58324A193112O526N488N954O650O140N403N578N569M405L507M141N095N324O170
58310A269062Q292R408P932N961N670N777M687L962N290P054P492Q194J0831J3470
58296A373082J3978J3961J5327J6091J3907J0700R382Q846O872N129O436R631
58284A503342J1927J3781J6578J8170J5847J1328P708L935k371q919j1064q229
58272A572033k886M600J4786K5037L2155L7349M3391M9009N1375N1872N3749N6251
58260A988721N6731N6271N7474N8911N7676N5201N4673N5174N4313N3873N6644
$$ plain form
58249 2605662 2666124 2728181 2791846 2860756 2936051 3014385 3094296 3178926 3269838 3364069 3460440
58238 3460440 3562910 3674204 3791767 3913604 4042597 4181481 4329153 4485476 4653966
58229 4653966 4836156 5029283 5233138 5452882 5691401 5945700 6214828 6504256 6818207
58220 6818207 7155256 7516204 7908453 8337624 8803081 9307122 9860057 10470703 11141385
58211 11141385 11878857 12700782 13624952 14662702 15830708 17159325 18683219 20438027
58203 20438027 22477536 24885129 27765113 31243415 35487643 40701656 47077820 54772893
58195 54772893 63958197 74886925 87897136 103360519 121627129 142959819 167447343
58188 167447343 194938978 224974418 256551365 287729180 315492936 336373246 347675530
$$ packed form
58249B605662O0462O2057O3665O8910P5295P8334P9911Q4630R0912R4231R6371
58238C460440J02470J11294J17563J21837J28993J38884J47672J56323J68490
58229D653966J82190J93127K03855K19744K38519K54299K69128K89428L13951
58220F818207L37049L60948L92249M29171M65457N04041N52935O10646O70682
58211A1141385P37472Q21925R24170J037750J168006J328617J523894J754808
58203B0438027K039509K407593K879984L478302M244228N214013O376164P695073
58195E4772893R185304J0928728J3010211J5463383J8266610K1332690K4487524
58188A67447343K7491635L0035440L1576947L1177815K7763756K0880310J1302284
$$ plain form
58181 347675530 348470660 339648643 323206241 301485294 276771738 251102381 226043795
58174 226043795 202507432 180787439 160814065 142434264 125567296 110216993 96405115
58167 96405115 84108547 73252800 63745423 55493271 48388590 42302687 37106232 32685497
58159 32685497 28934362 25746457 23026329 20699224 18702617 16977654 15475914 14164920
58151 14164920 13018507 12008286 11109966 10309522 9595838 8953670 8369781 7839236 7359375
58142 7359375 6923232 6524307 6161760 5834985 5538146 5265427 5016644 4792449 4588539
58133 4588539 4399461 4223658 4060055 3904167 3752450 3606564 3468817 3337210 3209276
58124 3209276 3086900 2972823 2865845 2763783 2667820 2579742 2497977 2420489 2348650 2284310
$$ packed form
58181C47675530P95130q822017j6442402k1720947k4713556k5669357k5058586
58174B26043795k3536363k1719993j9973374j8379801j6866968j5350303j3811878
58167I6405115j2296568j0855747r507377q252152p104681o085903n196455m420735
58159C2685497l751135l187905k720128k327105j996607j724963j501740j310994
58151A4164920j146413j010221q98320q00444p13684o42168n83889n30545m79861
58142G359375m36143l98925l62547l26775k96839k72719k48783k24195k03910
58133D588539j89078j75803j63603j55888j51717j45886j37747j31607j27934
58124C209276j22376j14077j06978j02062r5963q8078q1765p7488p1839o4340
$$ plain form
58114 2284310 2225902 2171293 2121706 2078853 2040730 2004028 1968423 1934859 1901889 1867452 1832468
58103 1832468 1799307 1768373 1739128 1712580 1689598 1668312 1645817 1620682 1591482 1555196 1510209
58092 1510209 1459339 1407281 1356676 1308891 1266322 1230786 1201106 1174879 1151188 1129389 1107167
58081 1107167 1082434 1055670 1028024 998836 967456 935786 906393 879530 854378 831672 812511
58070 812511 795949 780193 764960 750504 735767 719918 704362 690872 678854 666646 654190
58059 654190 642175 629872 616262 602152 588785 575375 560376 544308 529082 515375 502786
58048 502786 491732 483055 476481 471377 468214 467404 467610 467155 466272 466099 466428 466400 466535 468042 470832 474087
58032 474087 478010 483051 488149 491674 493510 494555 494962 494691 494908 496802 499597 501558 502398 502929 503093 502185
$$ packed form
58114B284310n8408n4609m9587m2853l8123l6702l5605l3564l2970l4437l4984
58103A832468l3161l0934k9245k6548k2982k1286k2495k5135k9200l6286m4987
58092A510209n0870n2058n0605m7785m2569l5536k9680k6227k3691k1799k2222
58081A107167k4733k6764k7646k9188l1380l1670k9393k6863k5152k2706j9161
58070H12511j6562j5756j5233j4456j4737j5849j5556j3490j2018j2208j2456
58059F54190j2015j2303j3610j4110j3367j3410j4999j6068j5226j3707j2589
58048E02786j1054q677o574n104l163q10K06m55q83j73L29k8J35J507K790L255
58032D74087L923N041N098L525J836J045M07k71K17J894K795J961Q40N31J64r08
$$ plain form
58016 502185 500459 498537 495738 490867 484338 477821 472071 466625 461198 455804 449941 443211 436372 430441
58002 430441 425275 420368 416307 413912 412597 411093 409168 407198 404855 401855 399228 398080 397780 397077 396308
57987 396308 396671 397999 399258 400673 403338 407030 410371 412926 415300 417451 418803 419881 421973 425172
57973 425172 428469 431685 435613 440315 444919 449071 452976 456061 457227 456408 454328 450881 445421 438600
57959 438600 432122 426536 420859 414569 408355 402690 397197 391771 387000 383163 380005 377606 376255 375463
57945 375463 374412 373469 373980 376500 380407 385225 391015 397540 404448 412248 421703 432227 442277 451296
57931 451296 459747 467234 472234 473986 473117 470124 464714 456987 447866 437946 427199 416066 405539 395902
57917 395902 386775 378621 372671 369007 366266 363791 362513 362978 363976 364047 363182 362096 360809 358847 356113
$$ packed form
58016E02185j726j922k799m871o529o517n750n446n427n394n863o730o839n931
58002D30441n166m907m061k395j315j504j925j970k343l000k627j148l00p03p69
57987C96308L63J328J259J415K665L692L341K555K374K151J352J078K092L199
57973D25172L297L216L928M702M604M152L905L085J166q19k080l447n460o821
57959D38600o478n586n677o290o214n665n493n426m771l837l158k399j351p92
57945C75463j051r43N11K520L907M818N790O525O908P800R455J0524J0050R019
57931D51296Q451P487N000J752q69k993n410p727r121r920j0747j1133j0527r637
57917C95902r127q154n950l664k741k475j278M65R98P1q65j086j287j962k734
$$ plain form
57902 356113 352829 349223 345746 342891 340396 337396 333715 330228 327638 325739 324211 323283 323207 323881 325244
57887 325244 327278 329393 330712 331138 331229 330928 329509 326977 324335 322153 320012 317697 315713 314235 312858
57872 312858 311871 312404 314644 317280 319606 322879 328466 335709 342851 349294 355801 363106 371474 381084 391747
57857 391747 402497 412334 421192 429539 437398 444443 450614 455834 459424 460566 459260 456276 452316 447672
57843 447672 442483 436891 431044 425155 419365 413507 407489 401959 397876 395211 392863 390281 388319 387879
57829 387879 388476 388967 389078 389357 390001 390665 391201 391724 391959 391281 389605 387688 386340 385622 385025 384335 384175 385560
57811 385560 388841 393183 397291 400401 402317 402858 401970 400216 398314 396154 393044 389009 384990 381544 378294
57796 378294 375039 372494 371343 371289 371614 372007 372273 371960 370995 370128 369997 370251 370311 370467 371393 372948 374367 375422
$$ packed form
57902C56113l284l606l477k855k495l000l681l487k590j899j528r28p6O74J363
57887C25244K034K115J319M26R1l01j419k532k642k182k141k315j984j478j377
57872C12858r87N33K240K636K326L273N587P243P142O443O507P305Q368R610J0663
57857C91747J0750R837Q858Q347P859P045O171N220L590J142j306k984l960m644
57843D47672n189n592n847n889n790n858o018n530m083k665k348k582j962m40
57829C87879N97M91J11K79O44O64N36N23K35o78j676j917j348p18n97o90j60J385
57811C85560L281M342M108L110J916N41q88j754j902k160l110m035m019l446l250
57796C78294l255k545j151n4L25L93K66l13r65q67j31K54O0J56R26J555J419J055
$$ plain form
57778 375422 376511 377655 378157 377360 375226 372134 368647 365459 362969 360743 357766 353400 347900 341988 336230
57763 336230 330844 325818 321040 316384 311811 307434 303602 300775 299087 298057 296992 295708 294535 293660
57749 293660 292875 292117 291762 292142 293138 294511 296288 298558 301137 303759 306426 309292 312365 315462 318331
57734 318331 320745 322641 324228 325825 327631 329816 332573 335724 338529 340455 342023 344242 347295 350503
57720 350503 353498 356574 359780 362623 364912 366916 368265 367704 364704 360547 356981 354308 351604 348342
57706 348342 344909 341749 338844 336039 333278 330442 327384 324240 321498 319746 319325 319970 320721 320675 319960 319539
57690 319539 319832 320177 319970 319680 320186 321635 323585 325916 328981 333150 338800 346504 356738 369580 385194
57675 385194 404359 428009 456495 489874 528686 573798 625510 683235 745895 811813 877748
$$ packed form
57778C75422J089J144N02p97k134l092l487l188k490k226k977m366n500n912n758
57763C36230n386n026m778m656m573m377l832k827j688j030j065j284j173q75
57749B93660p85p58l55L80R96J373J777K270K579K622K667K866L073L097K869
57734C18331K414J896J587J597J806K185K757L151K805J926J568K219L053L208
57720C50503K995L076L206K843K289K004J349n61l000m157l566k673k704l262
57706C48342l433l160k905k805k761k836l058l144k742j752m21O45P51m6p15m21
57690C19539K93L45k07k90N06J449J950K331L065M169N650P704J0234J2842J5614
57675C85194J9165K3650K8486L3379L8812M5112N1712N7725O2660O5918O5935
$$ plain form
57664 877748 938236 986404 1016067 1023910 1010325 978380 932102 875700 813764 750942 690815 635425
57652 635425 586006 543497 507964 478312 453239 432143 414632 399767 386515 374613 364252
57641 364252 355126 346478 338012 330179 323536 318185 313813 310018 306647 303938 302073 300578 298598 295961
57627 295961 293349 291205 289129 286736 284344 282253 280065 277469 275034 273389 272154 270532 268490 266434
57613 266434 264176 261238 257928 255097 252957 251038 249124 247328 245427 243114 240882 239656 239550 239860 240252
57598 240252 240968 241847 242194 241815 241251 240825 240369 240146 240906 242632 244181 244768 244996 245810 247142 248222 248620
57581 248620 248283 247058 244877 242149 239371 236556 233440 229888 225742 220670 214745 208861 203975 200078
57567 200078 196450 192809 189607 187201 185267 183285 181178 179230 177592 176206 175114 174470 174151 173608 172441
$$ packed form
57664H77748O0488M8168K9663P843j3585l1945m6278n6402o1936o2822o0127n5390
57652F35425m9419m2509l5533k9652k5073k1096j7511j4865j3252j1902j0361
57641C64252r126q648q466p833o643n351m372l795l371k709j865j495j980k637
57627B95961k612k144k076k393k392k091k188k596k435j645j235j622k042k056
57613B66434k258k938l310k831k140j919j914j796j901k313k232j226j06L10L92
57598B40252P16Q79L47l79n64m26m56k23P60J726J549N87K28Q14J332J080L98
57581B48620l37j225k181k728k778k815l116l552m146n072n925n884m886l897
57567B00078l628l641l202k406j934j982k107j948j638j386j092o44l19n43j167
$$ plain form
57552 172441 171083 170551 171482 173695 176793 180707 185350 190111 194206 197416 200067 202422 204475 206218 207682
57537 207682 208769 209367 209555 209361 208541 206975 205131 203643 202550 201456 200316 199534 199263 199175 198972 198690 198445
57520 198445 198278 198264 198398 198459 198379 198547 199206 199752 199353 198209 197511 198079 199674 201612 203298 204164 203955 203285
57502 203285 203130 203505 203375 202116 200239 198420 196670 194922 193572 192804 192069 190883 189574 188670 188104 187606
57486 187606 187293 187167 186608 185118 183147 181407 179809 177932 176215 175630 176247 177018 177085 176567 175938 175338 174682
57469 174682 173917 172944 171719 170590 170118 170445 171216 172150 173272 174476 175377 175822 176121 176521 176773 176565 176152
57452 176152 176170 176867 177767 178134 177659 176688 175869 175582 175715 175957 176222 176681 177405 178108 178371 178154 178038 178781 180577
57433 180577 182863 184991 186875 188690 190176 190753 190367 189611 188731 187061 183924 179807 176107 173798 172754
$$ packed form
57552A72441j358n32R31K213L098L914M643M761M095L210K651K355K053J743J464
57537B07682J087N98J88j94q20j566j844j488j093j094j140p82k71q8k03k82k45
57520A98445j67j4J34O1q0J68O59N46l99j144o98N68J595J938J686Q66k09o70
57502B03285j55L75j30j259j877j819j750j748j350p68p35j186j309r04n66m98
57486A87606l13j26n59j490j971j740j598j877j717n85O17P71O7n18o29o00o56
57469A74682p65r73j225j129m72L27P71R34J122J204R01M45K99M00K52k08m13
57452A76152J8O97R00L67m75r71q19k87J33K42K65M59P24P03K63k17j16P43J796
57433A80577K286K128J884J815J486N77l86p56q80j670l137m117l700k309j044
$$ plain form
57418 172754 172254 171719 170959 170171 169878 170536 171965 173376 174139 174451 175053 176289 177584 177949 176983 175248 173640
57401 173640 172547 171737 170889 169915 168837 167681 166618 165998 166141 167248 169438 172575 176106 179441 182593
57386 182593 186038 189850 193356 195948 197878 199943 202601 205596 208243 209893 210342 210038 209767 209988 210653
57371 210653 211596 212693 213530 213434 212169 210296 208599 207462 206903 206719 206350 205183 203386 201960 201560 201770
57355 201770 201994 202494 203893 206134 208662 211227 213773 215915 217323 218338 219395 220111 219866 218964 218128 217065
57339 217065 214811 211587 208941 207681 206960 205995 205441 206164 207714 209134 210542 212689 215456 218066 220546
57324 220546 223727 227664 231237 233706 235753 238386 241464 243950 245303 246024 246912 248181 249284 249383 248025
57309 248025 245549 242890 240831 239501 238587 237881 237433 237283 237270 237170 236915 236644 236562 236790 237261 237748 238014 237955
$$ packed form
57418A72754n00n35p60p88k93O58J429J411P63L12O02J236J295L65r66j735j608
57401A73640j093q10q48r74j078j156j063o20J43J107K190L137L531L335L152
57386A82593L445L812L506K592J930K065K658K995K647J650M49l04k71K21O65
57371B10653R43J097Q37r6j265j873j697j137n59j84l69j167j797j426m00K10
57355B01770K24N00J399K241K528K565K546K142J408J015J057P16k45r02q36j063
57339B17065k254l224k646j260p21r65n54P23J550J420J408K147K767K610K480
57324B20546L181L937L573K469K047K633L078K486J353P21Q88J269J103R9j358
57309B48025k476k659k059j330r14p06m48j50j3j00k55k71q2K28M71M87K66n9
$$ plain form
57291 237955 237588 236950 236130 235423 235358 236407 238637 241650 244912 248186 251702 255916 260982 266477 271866 277291
57275 277291 283592 291246 299505 307063 313563 319972 327375 335772 344214 351677 357597 362033 365676 369352
57261 369352 373171 376431 378656 380251 381620 382167 380918 377895 374031 369774 364659 358436 351699 344996
57247 344996 338009 330199 321823 313726 306427 299968 294472 290254 287316 285164 283339 281964 281646 282944
57233 282944 286020 290739 296953 304543 313243 322732 333065 344753 358114 372776 388298 405120 424348
57220 424348 446467 470748 496055 521832 548171 575435 604093 634552 666651 699471 731872
57209 731872 763208 793548 823453 853458 883398 912259 939215 964890 990964 1018369 1046506
57198 1046506 1074494 1102345 1130384 1158296 1185708 1213224 1241967 1272251 1303541 1335607 1368864
$$ packed form
57291B37955l67o38q20p07o5J049K230L013L262L274L516M214N066N495N389N425
57275B77291O301P654Q259P558O500O409P403Q397Q442P463N920M436L643L676
57261C69352L819L260K225J595J369N47j249l023l864m257n115o223o737o703
57247C44996o987p810q376q097p299o459n496m218k938k152j825j375l18J298
57233B82944L076M719O214P590Q700R489J0333J1688J3361J4662J5522J6822J9228
57220D24348K2119K4281K5307K5777K6339K7264K8658L0459L2099L2820L2401
57209G31872L1336L0340K9905L0005K9940K8861K6956K5675K6074K7405K8137
57198A046506K7988K7851K8039K7912K7412K7516K8743L0284L1290L2066L3257
$$ plain form
57187 1368864 1403558 1439417 1476440 1515488 1557788 1604084 1654319 1707823 1763752 1821523 1880629
57176 1880629 1939784 1996702 2049498 2098261 2144611 2189824 2234075 2277374 2320190 2362781 2404714
57165 2404714 2445494 2485230 2524285 2562899 2601554 2641230 2682821 2726578 2772435 2820481 2870707
57154 2870707 2922697 2975979 3030385 3085659 3141082 3195921 3250062 3303804 3357245 3410239 3462782
57143 3462782 3515035 3567064 3618845 3670450 3722050 3773928 3826626 3880786 3936651 3994038 4052977
57132 4052977 4113893 4176918 4241540 4307403 4374994 4445012 4517477 4592116 4669317 4749982 4834653
57121 4834653 4923585 5017732 5119051 5229620 5350847 5483603 5628754 5787471 5961163 6151166
57111 6151166 6358564 6584681 6831835 7103099 7401263 7729114 8091700 8497891 8958848
$$ packed form
57187A368864L4694L5859L7023L9048M2300M6296N0235N3504N5929N7771N9106
57176A880629N9155N6918N2796M8763M6350M5213M4251M3299M2816M2591M1933
57165B404714M0780L9736L9055L8614L8655L9676M1591M3757M5857M8046N0226
57154B870707N1990N3282N4406N5274N5423N4839N4141N3742N3441N2994N2543
57143C462782N2253N2029N1781N1605N1600N1878N2698N4160N5865N7387N8939
57132D052977O0916O3025O4622O5863O7591P0018P2465P4639P7201Q0665Q4671
57121D834653Q8932R4147J01319J10569J21227J32756J45151J58717J73692J90003
57111F151166K07398K26117K47154K71264K98164L27851L62586M06191M60957
$$ plain form
57102 8958848 9485245 10087009 10776454 11572696 12505486 13617424 14963406 16607157 18616458
57093 18616458 21058136 23992936 27472233 31538781 36227260 41556393 47515019 54057814
57085 54057814 61118680 68627978 76517901 84720849 93167909 101767141 110339586 118548788
57077 118548788 125907826 131897254 136116516 138358132 138583074 136869018 133386839 128382663
57069 128382663 122127233 114855332 106753123 98004640 88845334 79569790 70491034 61885606
57061 61885606 53955220 46815269 40505335 35010026 30278780 26240295 22813670 19917450
57053 19917450 17474820 15415052 13674351 12197338 10937215 9854120 8914097 8089612
57045 8089612 7359634 6708382 6124373 5600237 5131568 4714561 4344699 4017382 3728616
$$ packed form
57102H958848N26397O01764O89445P96242R32790J111938J345982J643751K009301
57093A8616458K441678K934800L479297M066548M688479N329133N958626O542795
57085E4057814P060866P509298P889923Q202948Q447060Q599232Q572445Q209202
57077A18548788P359038N989428M219262K241616K24942j714056l482179n004176
57069A28382663o255430p271901q102209q748483r159306r275544r078756q605428
57061F1885606p930386p139951o309934n495309m731246m038485l426625k896220
57053A9917450k442630k059768j740701j477013j260123j083095r40023q24485
57045H089612p29978o51252n84009n24136m68669m17007l69862l27317k88766
$$ plain form
57036 3728616 3474637 3251660 3056433 2886439 2739270 2612502 2504307 2413432 2338305 2276966
57026 2276966 2228226 2192232 2169515 2160130 2164066 2181718 2212945 2255105 2301408 2340903 2361137 2353072
57014 2353072 2314859 2251069 2168525 2073263 1970624 1866024 1764301 1668861 1582018 1505549 1440520
57003 1440520 1387153 1345287 1314311 1292398 1276739 1265210 1257211 1252440 1249685 1247489 1245157 1242171
56991 1242171 1237234 1228981 1217422 1203845 1189483 1174919 1160574 1146914 1133987 1121097 1106876 1089412
56979 1089412 1066757 1037914 1003324 964186 921703 877318 833063 790818 751343 714628 681014
56968 681014 651340 626060 604875 587289 573123 562477 555554 552536 553355 557650 565148 575757 588793
56955 588793 602149 612553 616683 612110 597836 574516 543989 508190 468681 427319 386682 349099
$$ packed form
57036C728616k53979k22977j95227j69994j47169j26768j08195r0875p5127o1339
57026B276966m8740l5994k2717r385L936J7652L1227M2160M6303L9495K0234q065
57014B353072l8213o3790q2544r5262j02639j04600j01723r5440q6843p6469o5029
57003A440520n3367m1866l0976k1913j5659j1529p999m771k755k196k332k986
56991A242171m937q253j1559j3577j4362j4564j4345j3660j2927j2890j4221j7464
56979A089412k2655k8843l4590l9138m2483m4385m4255m2245l9475l6715l3614
56968F81014k9674k5280k1185j7586j4166j0646o923l018Q19M295P498J0609J3036
56955E88793J3356J0404M130m573j4274k3320l0527l5799l9509m1362m0637l7583
$$ plain form
56943 349099 315598 286366 261799 242375 227982 218479 214818 218565 230149 248466 272413 301860
56931 301860 336658 375379 415484 454081 487971 513651 528370 531555 525042 511968 495520 478237
56919 478237 461756 446834 433659 422268 412735 405128 399400 395339 392638 391027 390293 390102 389876 388966
56905 388966 387007 384118 380779 377422 373911 369489 363608 356854 350674 345950 342287 339030 336625 336537 340055
56890 340055 347592 358928 373581 391021 410896 432967 456389 479087 498227 511400 517308 515730
56878 515730 507391 493779 476602 457378 437779 420036 406403 398108 395157 397181 404136 416388
56866 416388 434551 459281 490872 529171 574157 626329 685825 750977 817788 880604 933118
56855 933118 969672 987005 985338 967512 937181 898074 854297 809947 768034 730400 698774 675105
$$ packed form
56943C49099l3501k9232k4567j9424j4393r503l661L747J1584J8317K3947K9447
56931C01860L4798L8721M0105L8597L3890K5680J4719L185o513j3074j6448j7283
56919D78237j6481j4922j3175j1391r533p607n728m061k701j611p34j91k26r10
56905C88966j959k889l339l357l511m422n881o754o180m724l663l257k405q8L518
56890C40055P537J1336J4653J7440J9875K2071K3422K2698J9140J3173N908j578
56878E15730q339j3612j7177j9224j9599j7743j3633q295k951K024O955J2252
56866D16388J8163K4730L1591L8299M4986N2172N9496O5152O6811O2816N2514
56855I33118L6554J7333j667j7826l0331l9107m3777m4350m1913l7634l1626k3669
$$ plain form
56843 675105 660658 655601 659945 674387 700013 737784 788619 853226 931316 1021132 1119636 1222060
56831 1222060 1320641 1404691 1463496 1490175 1483486 1446969 1386936 1310589 1224689 1135088 1046961
56820 1046961 964787 891745 829394 778275 738682 710788 694607 690402 698908 720720 755512 802172
56808 802172 859425 925638 997460 1068578 1130159 1173319 1192302 1186056 1157233 1110041 1049171 979898
56796 979898 907730 837182 771064 711051 658396 613892 577783 550196 531331 520893 517856 521360
56784 521360 531671 549719 575644 607884 643394 678357 708845 731272 742689 741075 725870 698403
56772 698403 661561 618805 573397 528050 484621 443965 406425 372524 342751 316845 293990
56761 293990 273891 256995 243445 232431 222943 214594 207402 201364 196588 193256 191026 188976 186553
$$ packed form
56843F75105j4447n057M344J4442K5626L7771N0835O4607P8090Q9816R8504J02424
56831A222060R8581Q4050N8805K6679o689l6517o0033p6347q5900q9601q8127
56820A046961q2174p3042o2351n1119l9593k7894j6181m205Q506K1812L4792M6660
56808H02172N7253O6213P1822P1118O1581M3160J8983o246k8823m7192o0870o9273
56796I79898p2168p0548o6118o0013n2655m4504l6109k7587j8865j0438l037L504
56784E21360J0311J8048K5925L2240L5510L4963L0488K2427J1417j614j5205k7467
56772F98403l6842m2756m5408m5347m3429m0656l7540l3901k9773k5906k2855
56761B93990k0099j6896j3550j1014r488q349p192o038m776l332k230k050k423
$$ plain form
56748 186553 184068 181916 179932 177989 176491 175626 174659 172759 170126 167611 165574 163859 162545 161947 162018
56733 162018 162404 163006 163937 165088 166310 167847 170012 172595 175067 177197 178974 180293 181337 182931 185682
56718 185682 188962 191542 193151 194576 196197 197362 197460 196847 196287 196079 196092 196273 196713 197468 198535 199797 200902
56701 200902 201422 201254 200653 199884 199105 198528 198304 198160 197531 196260 194884 194103 194051 194184 193817 192792 191711 191444
56683 191444 192372 194214 196541 199050 201276 202654 203271 204037 205504 206904 206977 205533 203432 201281 198993
56668 198993 196682 195082 194724 195248 195945 196609 197569 199147 201385 204089 206909 209469 211577 213370 215249
56653 215249 217579 220233 222477 223661 224103 224825 226178 227340 227624 227608 228240 229319 229828 229518 229079 228786 228032
56636 228032 226483 224734 223373 222166 220698 219249 218374 217913 216989 214879 211579 207650 203808 200547 197904
$$ packed form
56748A86553k485k152j984j943j498q65r67j900k633k515k037j715j314n98P1
56733A62018L86O02R31J151J222J537K165K583K472K130J777J319J044J594K751
56718A85682L280K580J609J425J621J165R8o13n60k08J3J81M40P55J067J262J105
56701B00902N20j68o01p69p79n77k24j44o29j271j376p81n2J33l67j025j081k67
56683A91444R28J842K327K509K226J378O17P66J467J400P3j444k101k151k288
56668A98993k311j600l58N24O97O64R60J578K238K704K820K560K108J793J879
56653B15249K330K654K244J184M42P22J353J162K84j6O32J079N09l10m39k93p54
56636B28032j549j749j361j207j468j449q75m61r24k110l300l929l842l261k643
$$ plain form
56621 197904 195549 193198 190848 188628 186578 184598 182502 180117 177481 174964 173067 172116 172170 173014 174093
56606 174093 174757 174805 174589 174360 173909 173181 172773 173211 174071 174533 174671 175389 177001 178663 179421 179286 178987 179100
56588 179100 179696 180500 181148 181445 181545 181820 182642 184384 187295 191018 194549 197210 199478 202248 205457 208102
56572 208102 209600 210418 211318 212634 214503 217157 220682 224956 230114 236683 245017 254920 266015 278110
56558 278110 290920 303618 314888 323399 328377 329926 328817 325841 321444 316014 310130 304219 298398
56545 298398 292958 288457 284830 280988 276118 270945 266831 264022 261758 259763 258377 257287 255430 252449
56531 252449 249214 246581 244597 243203 242691 242999 243391 243351 243061 242638 241740 240391 239398 239285 239397 238617 236543
56514 236543 233583 230475 228056 226823 226210 224907 222376 219522 217406 215908 214268 212329 210447 208548
$$ packed form
56621A97904k355k351k350k220k050j980k096k385k636k517j897r51N4Q44J079
56606A74093O64M8k16k29m51p28m08M38Q60M62J38P18J612J662P58j35k99J13
56588A79100N96Q04O48K97J00K75Q22J742K911L723L531K661K268K770L209K645
56572B08102J498Q18R00J316J869K654L525M274N158O569Q334R903J1095J2095
56558B78110J2810J2698J1270Q511M978J549j109k976m397n430n884n911n821
56545B98398n440m501l627l842m870n173m114k809k264j995j386j090j857k981
56531B52449l235k633j984j394n12L08L92m0k90m23q98j349r93j13J12p80k074
56514B36543k960l108k419j233o13j303k531k854k116j498j640j939j882j899
$$ plain form
56500 208548 206085 202967 199990 198239 198225 199541 201234 202623 203737 204814 205652 205945 206067 206780 208163 209527
56484 209527 210373 210680 210242 208786 207005 206412 207582 209317 210051 209425 208090 206753 205995 206213 207070 207675 207833
56467 207833 208486 210324 212695 214562 215798 216731 217103 216511 215418 214774 214821 215119 215530 216391 217750 219190 220483
56450 220483 221886 223655 225582 227134 227919 228094 228256 228727 229030 228469 227106 225564 223991 222042 219924 218486
56434 218486 217991 217794 217597 218005 219355 220985 222300 223552 224828 225305 224497 223404 223310 224088 224729 225038 225684
56417 225684 226933 228324 229367 229747 229146 227684 226257 225718 225990 226562 227386 228581 229789 230660 231506 232679
56401 232679 233794 234501 235437 237378 239837 241625 242533 243358 244475 245486 246230 247088 248196 249227 249997 250537
56385 250537 250620 250023 249228 249026 249396 249529 249022 248389 248382 249399 251468 254166 256606 258131 258987 259782 260515 260755
$$ packed form
56500B08548k463l118k977j751j4J316J693J389J114J077Q38K93J22P13J383J364
56484B09527Q46L07m38j456j781n93J170J735P34o26j335j337p58K18Q57O05J58
56467B07833O53J838K371J867J236R33L72n92j093o44M7K98M11Q61J359J440J293
56450B20483J403J769J927J552P85J75J62M71L03n61j363j542j573j949k118j438
56434B18486m95j97j97M08J350J630J315J252J276M77q08j093r4P78O41L09O46
56417B25684J249J391J043L80o01j462j427n39K72N72Q24J195J208Q71Q46J173
56401B32679J115P07R36J941K459J788R08Q25J117J011P44Q58J108J031P70N40
56385B50537Q3n97p95k02L70J33n07o33pJ017K069K698K440J525Q56P95P33K40
$$ plain form
56367 260755 260547 260325 260122 259666 259203 259420 260500 261983 263616 265638 268118 270662 272932 274947 276756 278219
56351 278219 279222 279783 279868 279369 278202 276369 274192 272626 272817 275033 278420 282070 285709 289111 291724
56336 291724 293519 295429 298180 301379 304525 308084 312575 317270 320955 323517 325695 327752 329531 331409
56322 331409 333942 336756 338895 340096 340727 340744 339898 338776 338465 339243 340598 342324 344488 346484 347457 347734
56306 347734 348663 350861 353724 356767 360364 364831 369799 374860 380136 385930 392427 399838 408227 417157
56292 417157 426043 434776 443504 452093 460500 469361 479405 490516 502106 513990 526075 537744 548596
56279 548596 559368 570977 583046 594621 605992 618439 632478 647781 664652 683995 705743
56268 705743 728868 753250 780226 810992 845697 884404 927709 976104 1029826 1089720 1157236
$$ packed form
56367B60755k08k22k03m56m63K17J080J483J633K022K480K544K270K015J809J463
56351B78219J003N61Q5m99j167j833k177j566J91K216L387L650L639L402K613
56336B91724J795J910K751L199L146L559M491M695L685K562K178K057J779J878
56322C31409K533K814K139J201O31J7q46j122l11P78J355J726K164J996R73K77
56306C47734R29K198K863L043L597M467M968N061N276N794O497P411Q389Q930
56292D17157Q886Q733Q728Q589Q407Q861J0044J1111J1590J1884J2085J1669J0852
56279E48596J0772J1609J2069J1575J1371J2447J4039J5303J6871J9343K1748
56268G05743K3125K4382K6976L0766L4705L8707M3305M8395N3722N9894O7516
$$ plain form
56257 1157236 1233279 1318029 1412065 1516745 1633219 1761895 1902774 2055240 2217523 2387545
56247 2387545 2564359 2747473 2934641 3121531 3303825 3478426 3642305 3791420 3921315
56238 3921315 4028045 4108305 4159778 4181694 4174394 4138348 4074602 3986036 3876964 3751253 3611750
56227 3611750 3461370 3303426 3140815 2976090 2812344 2652703 2498838 2351200 2210624
56218 2210624 2078213 1953715 1835825 1724449 1621052 1526364 1439325 1358771 1284606 1216646
56208 1216646 1153838 1095447 1041817 993254 949195 909005 872518 839341 808817 781097 757066
56197 757066 736731 718891 702815 688991 677726 668243 659779 652422 646326 641115 636566 632926 630163
56184 630163 627756 625363 622831 619782 616431 614511 615699 619137 622211 623834 625150 626968 628604 629716
$$ packed form
56257A157236P6043Q4750R4036J04680J16474J28676J40879J52466J62283J70022
56247B387545J76814J83114J87168J86890J82294J74601J63879J49115J29895
56238C921315J06730Q0260N1473K1916p300l6046o3746q8566j09072j25711j39503
56227C611750j50380j57944j62611j64725j63746j59641j53865j47638j40576
56218B210624j32411j24498j17890j11376j03397r4688q7039q0554p4165o7960
56208A216646o2808n8391n3630m8563m4059m0190l6487l3177l0524k7720k4031
56197G57066k0335j7840j6076j3824j1265r483q464p357o096n211m549l640k763
56184F30163k407k393k532l049l351j920J188L438L074J623J316J818J636J112
$$ plain form
56170 629716 631142 633221 635121 636616 638747 642045 645779 649602 654139 659349 664205 668858 675253 684749
56156 684749 696805 710790 727317 746937 769339 794707 824103 857813 895316 937801 988670
56145 988670 1050469 1123200 1206456 1300906 1406455 1521047 1642630 1770141 1900995 2029714
56135 2029714 2150892 2261946 2361777 2449043 2523688 2588282 2645569 2695743 2737527 2770230 2793113
56124 2793113 2804402 2803005 2790076 2767369 2735270 2693708 2643188 2583119 2510660 2423218 2321145
56113 2321145 2206800 2082639 1951963 1819999 1692164 1571985 1461765 1363690 1278725 1205854
56103 1205854 1143855 1092452 1050545 1015273 984587 959100 939798 925725 915625 909940 909096 911438
56091 911438 914911 919326 925049 931033 936189 941354 947971 956082 965290 976178 988961 1002229 1014721
$$ packed form
56170F29716J426K079J900J495K131L298L734L823M537N210M856M653O395R496
56156F84749J2056J3985J6527J9620K2402K5368K9396L3710L7503M2485N0869
56145I88670O1799P2731Q3256R4450J05549J14592J21583J27511J30854J28719
56135B029714J21178J11054R9831Q7266P4645O4594N7287N0174M1784L2703K2883
56124B793113J1289j397j2929k2707l2099m1562n0520o0069p2459q7442j02073
56113B321145j14345j24161j30676j31964j27835j20179j10220r8075q4965p2871
56103A205854o1999n1403m1907l5272l0686k5487j9302j4073j0100n685q44K342
56091I11438L473M415N723N984N156N165O617Q111R208J0888J2783J3268J2492
$$ plain form
56078 1014721 1026872 1039059 1050131 1059376 1068082 1077361 1086327 1094210 1102140 1110880 1118992 1125372 1131429
56065 1131429 1138482 1145186 1149958 1153781 1158170 1162504 1165962 1170022 1176375 1184295 1192536 1201682 1212012 1221289
56051 1221289 1227463 1231492 1234975 1237496 1239184 1243188 1252253 1265104 1279312 1295081 1312649 1328615 1338950
56038 1338950 1343580 1344187 1339746 1328562 1313028 1298307 1287723 1282897 1286330 1299755 1321529 1349282
56026 1349282 1383286 1423751 1467388 1510849 1555441 1604261 1657004 1711816 1769697 1832279 1897466
56015 1897466 1962130 2027009 2094282 2162722 2230183 2298465 2370525 2445275 2520388 2597656 2679943
56004 2679943 2765501 2851304 2939503 3034318 3134917 3237882 3344387 3458240 3579011 3704063
55994 3704063 3835364 3977290 4129605 4289581 4459017 4642029 4838211 5045221 5265672
$$ packed form
56078A014721J2151J2187J1072R245Q706R279Q966P883P930Q740Q112O380O057
56065A131429P053O704M772L823M389M334L458M060O353P920Q241R146J0330R277
56051A221289O174M029L483K521J688M004R065J2851J4208J5769J7568J5966J0335
56038A338950M630O07m441j1184j5534j4721j0584m826L433J3425K1774K7753
56026A349282L4004M0465M3637M3461M4592M8820N2743N4812N7881O2582O5187
56015A897466O4664O4879O7273O8440O7461O8282P2060P4750P5113P7268Q2287
56004B679943Q5558Q5803Q8199R4815J00599J02965J06505J13853J20771J25052
55994C704063J31301J41926J52315J59976J69436J83012J96182K07010K20451
$$ plain form
55985 5265672 5503840 5758376 6026392 6311851 6621368 6954961 7310266 7692719 8111577
55976 8111577 8569017 9063713 9602122 10195251 10847860 11563228 12355826 13247091 14252339
55967 14252339 15385530 16673931 18155058 19865359 21850306 24184996 26973420 30339398
55959 30339398 34440683 39481024 45675390 53204230 62236398 73007950 85858039 101184329
55951 101184329 119372356 140728087 165396599 193292599 224054666 256882518 290137301
55944 290137301 320997232 345775859 361075944 365073159 357983416 341534892 318108661
55937 318108661 290183500 260101263 229872369 200973186 174292705 150259084 129007637
55930 129007637 110495467 94575831 81045471 69654396 60107910 52103788 45382208
$$ packed form
55985E265672K38168K54536K68016K85459L09517L33593L55305L82453M18858
55976H111577M57440M94696N38409N93129O52609P15368P92598Q91265J005248
55967A4252339J133191J288401J481127J710301J984947K334690K788424L365978
55959C0339398M101285N040341O194366P528840R032168J0771552J2850089J5326290
55951A01184329J8188027K1355731K4668512K7896000L0762067L2827852L3254783
55944B90137301L0859931K4778627J5300085L997215p089743j6448524k3426231
55937C18108661k7925161l0082237l0228894k8899183k6680481k4033621k1251447
55930A29007637j8512170j5919636j3530360j1391075r546486q004122o721580
$$ plain form
55923 45382208 39735209 34983470 30969180 27567380 24680538 22218684 20098347 18257403
55915 18257403 16653647 15248213 14003315 12893863 11906263 11024878 10230971 9513652 8869470
55906 8869470 8291022 7766532 7290021 6861229 6475487 6123307 5799771 5505093 5236151
55897 5236151 4986343 4753585 4539942 4343528 4158870 3984859 3824297 3675826 3534266
55888 3534266 3398815 3273220 3157703 3048271 2944204 2848848 2762515 2681592 2605408 2537337
55878 2537337 2478310 2425381 2377220 2334907 2296607 2257438 2215433 2172244 2127596 2078872 2026824
55867 2026824 1975944 1928030 1880587 1832540 1786535 1744562 1706050 1671120 1640934 1613766 1585078
55856 1585078 1552474 1516569 1476599 1429799 1376093 1319207 1262260 1206160 1152842 1105642 1065252
$$ packed form
55923D5382208n646999m751739m014290l401800k886842k461854k120337j840944
55915A8257403j603756j405434j244898j109452r87600q81385p93907p17319o44182
55906H869470n78448n24490m76511m28792l85742l52180l23536k94678k68942
55897E236151k49808k32758k13643j96414j84658j74011j60562j48471j41560
55888C534266j35451j25595j15517j09432j04067r5356q6333q0923p6184o8071
55878B537337n9027n2929m8161m2313l8300l9169m2005m3189m4648m8724n2048
55867B026824n0880m7914m7443m8047m6005m1973l8512l4930l0186k7168k8688
55856A585078l2604l5905l9970m6800n3706n6886n6947n6100n3318m7200m0390
$$ plain form
55845 1065252 1029057 995302 964346 935332 905646 874655 844374 815657 787312 759632 735081
55834 735081 714551 696410 680019 666726 656593 647562 638693 630891 623754 615130 604659 594394
55822 594394 585032 574851 563202 551722 541093 529920 517907 507018 498331 490826 484424 481156
55810 481156 482046 485611 490742 498336 508929 521300 534593 549187 564311 577351 586811 593716 599014
55797 599014 601914 601833 599686 596108 590534 583025 574979 567229 559474 552270 547381 545455 545450 546891 550241
55782 550241 554428 556556 555108 551257 546352 540550 534686 530841 529779 530044 530573 531991 534246 535281 533291
55767 533291 528327 520694 509810 495696 479601 462211 443221 423553 405800 391435 379581 369394
55755 369394 361447 355737 350632 345080 339925 335889 332304 328892 326614 325529 323973 321219 318861 318071
$$ packed form
55845A065252l6195l3755l0956k9014k9686l0991l0281k8717k8345k7680k4551
55834G35081k0530j8141j6391j3293j0133r031q869p802p137q624j0471j0265
55822E94394r362j0181j1649j1480j0629j1173j2013j0889q687p505o402l268
55810D81156Q90L565N131P594J0593J2371J3293J4594J5124J3040R460O905N298
55797E99014K900q1k147l578n574p509q046p750p755p204m889j926nJ441L350
55782E50241M187K128j448l851m905n802n864l845j062K65N29J418K255J035j990
55767E33291m964p633j0884j4114j6095j7390j8990j9668j7753j4365j1854j0187
55755C69394p947n710n105n552n155m036l585l412k278j085j556k754k358p90
$$ plain form
55741 318071 317491 315392 312090 308676 305114 301226 297896 295733 293990 292276 291787 293318 295512 296622 296662
55726 296662 296331 295204 292570 288972 285396 281932 278491 275742 274102 272816 271255 270027 269692 269584 269151
55711 269151 269318 271163 274173 277023 279211 280825 281572 281083 279455 276643 272243 266643 261369 257465 254549
55696 254549 252040 250062 248428 246218 243320 241051 240241 240063 239757 240069 241783 244204 246412 248812 252090
55681 252090 255752 259115 262740 267440 272675 277214 280642 283172 284715 285272 285466 285647 285250 283981 282767
55666 282767 282481 282592 282119 281140 280380 280076 280188 280987 282512 284177 285681 287457 289479 290599 289872 287627
55650 287627 284493 280392 275323 269962 264593 258539 251543 244585 238412 232466 226213 220283 215161 210140
55636 210140 204834 200484 198318 197726 197484 197686 198943 200659 201774 202418 203284 204050 203947 203294 202938 202660 201542
$$ packed form
55741C18071n80k099l302l414l562l888l330k163j743j714m89J531K194J110M0
55726B96662l31j127k634l598l576l464l441k749j640j286j561j228l35j08m33
55711B69151J67J845L010K850K188J614P47m89j628k812m400n600n274l904k916
55696B54549k509j978j634k210k898k269q10j78l06L12J714K421K208K400L278
55681B52090L662L363L625M700N235M539L428K530J543N57J94J81l97j269j214
55666B82767k86J11m73r79p60l04J12P99J525J665J504J776K022J120p27k245
55650B87627l134m101n069n361n369o054o996o958o173n946o253n930n122n021
55636B10140n306m350k166n92k42K02J257J716J115O44Q66P66j03o53l56k78j118
$$ plain form
55619 201542 199467 196989 194241 191241 188785 187704 187591 187441 187136 187181 187506 187664 187723 187826 187410 185986 184185
55602 184185 182845 181617 179620 176897 174046 171013 167597 164578 162932 162209 161043 158977 156606 154262
55588 154262 151858 149759 148550 148004 147357 146473 145871 145896 146729 148675 151381 153327 153409 152654 153105 155318 158202
55571 158202 160981 163883 167015 169972 172708 175591 178427 180443 181337 181496 181190 180405 179402 178542 177567 175880
55555 175880 173490 170970 168652 166675 165556 165779 166961 168212 169167 169880 170070 169384 168234 167472 167431 168071
55539 168071 169669 172311 174941 176066 175414 173951 172314 170209 167371 164207 161319 159097 157734 156956 155869
55524 155869 153840 151440 149836 149368 149425 149399 148925 147403 144387 140545 137380 135719 135063 134390 133120 131345
55508 131345 129694 128945 129257 129904 130075 129619 128662 127141 125340 124286 124693 125845 126352 125716 124382 122681
$$ packed form
55619B01542k075k478k748l000k456j081j13j50l05M5L25J58N9J03m16j424j801
55602A84185j340j228j997k723k851l033l416l019j646p23j166k066k371k344
55588A54262k404k099j209n46o47q84o02K5Q33J946K706J946Q2p55M51K213K884
55571A58202K779K902L132K957K736K883K836K016Q94J59l06p85j003q60r75j687
55555A75880k390k520k318j977j119K23J182J251R55P13J90o86j150p62m1O40
55539A68071J598K642K630J125o52j463j637k105k838l164k888k222j363p78j087
55524A55869k029k400j604m68N7k6m74j522l016l842l165j661o56o73j270j775
55508A31345j651p49L12O47J71m56r57j521j801j054M07J152N07o36j334j701
$$ plain form
55492 122681 120610 118495 116980 116365 116488 117111 117947 118718 119618 121209 123332 124862 125191 125163 125689 126279 125957
55475 125957 124885 123890 122990 121679 120152 119009 118129 116982 115678 114610 113582 112498 112252 113534 115246
55460 115246 115694 114991 114670 115182 115535 115349 115494 116390 117283 117657 118045 118985 120297 121671 122924 123495 122830 121444
55442 121444 120498 120149 119476 118147 116918 116275 115854 115493 115628 116233 116631 116803 117676 119490 120937 120650 118771
55425 118771 116517 114883 114235 114448 114987 115356 115727 116591 117779 118542 118667 118669 118857 119025 119109 119211 118989 118016 116803
55406 116803 116348 116557 116326 115385 114820 115324 116144 116307 115908 115604 115741 116495 118002 119822 121044 121356 121309 121246
55388 121246 120845 120034 119430 119394 119525 119510 119624 119990 120215 120154 120136 120051 119188 117550 116306 116281 116845 116979 116601 116091
55368 116091 115309 114001 112654 112080 112420 113194 113988 114545 114525 113743 112480 111267 110503 110388 110837 111348 111403 111063
$$ packed form
55492A22681k071k115j515o15J23O23Q36P71R00J591K123J530L29k8N26N90l22
55475A25957j072r95r00j311j527j143q80j147j304j068j028j084k46J282J712
55460A15246M48p03l21N12L53j86J45Q96Q93L74L88R40J312J374J253N71o65j386
55442A21444r46l49o73j329j229o43m21l61J35O05L98J72Q73J814J447k87j879
55425A18771k254j634o48K13N39L69L71Q64J188P63J25KJ88J68Q4J02k22r73j213
55406A16803m55K09k31r41n65N04Q20J63l99l04J37P54J507J820J222L12m7o3
55388A21246m01q11o04l6J31j5J14L66K25o1j8q5q63j638j244k5N64J34l78n10
55368A16091p82j308j347n74L40P74P94N57k0p82j263j213p64j15M49N11N5l40
$$ plain form
55350 111063 110706 110257 109404 108533 108516 109433 110383 110804 111093 111657 112300 112899 113769 114880 115576 115576 115432 115528 115417 114653
55330 114653 113517 112397 111296 110409 110351 111169 111951 112045 111894 111986 111786 110638 109090 108370 108815 109604 109851 109401
55312 109401 108750 108568 109072 109643 109469 108723 108505 109413 110831 111923 112516 112583 111728 109899 107977 106954 106957 107590
55294 107590 108632 109858 110755 111075 111246 111679 112088 111984 111425 110763 110111 109513 109261 109593 110415 111573 112982
55277 112982 114319 115158 115618 116196 116744 116407 114905 113047 111657 110815 110493 110873 111521 111399 110408 109898 110784
55260 110784 112119 112498 111973 111542 111514 111552 111694 112192 112778 113081 113369 113917 114189 113638 112803 112518 112525 112054 111365 111386
55240 111386 111957 111786 110281 108304 106907 106229 105921 105822 105907 106102 106418 106847 107161 107206 107267 107652 108055 107888 107151
55221 107151 106410 106053 106091 106584 107681 109201 110547 111056 110257 108193 105791 104427 104590 105369 105781 106049 106861
$$ packed form
55350A11063l57m49q53q71j7R17R50M21K89N64O43N99Q70J111O96%j44R6j11p64
55330A14653j136j120j101q87n8Q18P82R4j51R2k00j148j548p20M45P89K47m50
55312A09401o51j82N04N71j74p46k18R08J418J092N93O7q55j829j922j023LO33
55294A07590J042J226Q97L20J71M33M09j04n59o62o52n98k52L32Q22J158J409
55277A12982J337Q39M60N78N48l37j502j858j390q42l22L80O48j22r91n10Q86
55260A10784J335L79n25m31k8L8J42M98N86L03K88N48K72n51q35k85Pm71o89K1
55240A11386N71j71j505j977j397o78l08r9Q5J95L16M29L14M5O1L85M03j67p37
55221A07151p41l57L8M93J097J520J346N09p99k064k402j364J63P79M12K68Q12
$$ plain form
55204 106861 107919 108211 107512 106641 106271 106347 106742 107632 108989 110218 110581 109733 107938 106063 105191 105761 107187
55187 107187 108636 109980 111605 113622 115720 117527 118660 118734 117832 116688 115896 115305 114635 114166 114140 113977 112995
55170 112995 111639 111084 111756 112981 113981 114503 114583 114445 114595 115362 116369 117012 117287 117599 118101 118892 120457
55153 120457 122944 125297 126214 125943 126025 127165 128418 128751 128377 128065 128001 127969 128021 128293 128480 128029 126756 125028
55135 125028 123451 122505 122262 122331 122259 121959 121644 121437 121306 121273 121408 121694 122093 122518 122612 121943 120730 119881 119865 120016
55115 120016 119502 118457 117529 116854 116306 116266 117031 117820 117577 116666 116580 117866 119512 120622 121536 122809 124151
55098 124151 125096 125890 126946 127961 128367 128368 128842 130265 132167 133639 134159 133942 133619 133578 133678 133696 133793 134201 134664
55079 134664 134708 134405 134417 135237 136775 138626 140296 141240 141220 140689 140393 140529 140663 140407 139776 138923 138001 137274 136939
$$ packed form
55204A06861J058K92o99q71l70P6L95Q90J357J229L63q48j795j875q72N70J426
55187A07187J449J344J625K017K098J807J133P4r02j144p92n91o70m69k6j63r82
55170A12995j356n55O72J225J000N22Q0j38J50P67J007O43K75L12N02P91J565
55153A20457K487K353R17k71Q2J140J253L33l74l12o4l2N2K72J87m51j273j728
55135A25028j577r46k43O9p2l00l15k07j31l3J35K86L99M25R4o69j213q49j6J51
55115A20016n14j045r28o75n48m0P65P89k43r11q6J286J646J110R14J273J342
55098A24151R45P94J056J015M06JM74J423J902J472N20k17l23m1J00J8R7M08M63
55079A34664M4l03J2Q20J538J851J670R44k0n31k96J36J34k56o31q53r22p27l35
$$ plain form
55060 136939 136886 136975 137340 137939 138095 137196 135698 134673 134380 134104 133366 132488 131792 131044 130022 128939 128008 127143
55042 127143 126339 125862 125849 126226 127087 128555 130077 130623 129929 128966 128775 129300 129764 129745 129486 129429 129810 130540 131264
55023 131264 131664 131755 131727 131567 131194 130807 130602 130253 129271 127868 126807 126405 126336 126490 127244 128649 130104 131150
55005 131150 131964 132748 133291 133450 133441 133254 132464 131118 130230 130783 132610 134773 136638 138064 138925 139105 138835 138475
54987 138475 138024 137170 135794 134125 132527 131329 130774 130881 131479 132409 133546 134570 135057 135023 135121 136023 137721
54970 137721 139529 140695 141038 141163 142003 143868 145992 147314 147614 147536 147603 147767 147859 147900 147835 147524 147145 147070 147218
54951 147218 147028 146280 145470 145141 145327 145836 146588 147437 148144 148719 149372 149979 150097 149717 149486 149958 151117 152887
54933 152887 155506 159078 163283 167881 173051 178931 185274 191882 198879 206209 213371 219973 225984 231014
$$ packed form
55060A36939n3Q9L65N99J56q99j498j025k93k76p38q78o96p48j022j083r31q65
55042A27143q04m77j3L77Q61J468J522N46o94r63j91N25M64j9k59n7L81P30P24
55023A31264M00R1k8j60l73l87k05l49r82j403j061m02o9J54P54J405J455J046
55005A31150Q14P84N43J59rj87p90j346q88N53J827K163J865J426Q61J80k70l60
54987A38475m51q54j376j669j598j198n55J07N98R30J137J024M87l4R8R02J698
54970A37721J808J166L43J25Q40J865K124J322L00p8O7J64R2M1o5l11l79p5J48
54951A47218j90p48q10l29J86N09P52Q49P07N75O53O07J18l80k31M72J159J770
54933A52887K619L572M205M598N170N880O343O608O997P330P162O602O011N030
$$ plain form
54919 231014 233985 234111 231822 228176 223724 218403 212147 205037 197201 189145 181886 176199 171915 168405
54905 168405 165476 163291 161665 160142 158627 157346 156228 154921 153517 152794 153512 155675 158592 161469 163926
54890 163926 166133 168563 171641 175678 180962 187566 195054 202723 210270 217846 225352 232148 237699 242055
54876 242055 245284 246836 245975 242630 237401 230880 223359 215138 206724 198641 191204 184456 178270 172610
54862 172610 167693 163682 160310 157141 154236 152061 150623 149202 147235 144993 143037 141443 140001 138789
54848 138789 138073 137828 137786 137801 137820 137659 137165 136448 135676 134737 133451 132018 131059 131129 132260 133857 135122 135789
54830 135789 136400 137539 138931 139726 139657 139295 139117 138965 138622 138241 137912 137451 136928 136803 137168 137451 137316 137226 137668
54811 137668 138384 138890 139164 139269 138950 138281 138134 139215 141039 142607 143639 144415 144901 144966 145110 145967 147246
$$ packed form
54919B31014K971J26k289l646m452n321o256p110p836q056p259n687m284l510
54905A68405k929k185j626j523j515j281j118j307j404p23P18K163K917K877K457
54890A63926K207K430L078M037N284O604P488P669P547P576P506O796N551M356
54876B42055L229J552q61l345n229o521p521q221q414q083p437o748o186n660
54862A72610m917m011l372l169k905k175j438j421j967k242j956j594j442j212
54848A38789p16k45m2J5J9j61m94p17p72r39j286j433r59P0J131J597J265O67
54830A35789O11J139J392P95o9l62j78j52l43l81l29m61n23j25L65K83j35r0M42
54811A37668P16N06K74J05l19o69j47J081J824J568J032P76M86O5J44Q57J279
$$ plain form
54794 147246 148140 148651 149517 150808 151634 151531 151253 151804 153296 155134 156788 158047 158937 159783 161079 163070
54778 163070 165616 168567 172052 176367 181805 188514 196216 204093 211310 217645 223356 228501 232772 235936
54764 235936 238003 238908 238396 236270 232519 227221 220660 213481 206392 199642 193052 186556 180476 175284 171301
54749 171301 168572 166780 165416 164193 163169 162321 161323 160047 158953 158548 158798 159512 161009 163704 167266
54734 167266 170878 174312 178077 182517 187434 192706 198580 205098 211769 218025 223529 227793 230059 229987 228128
54719 228128 225338 221922 217679 212518 206619 200150 193281 186509 180627 176097 172610 169473 166372 163562
54705 163562 161312 159501 157970 156955 156720 156948 157026 156913 157114 157682 157855 156967 155222 153201 151156 149196
54689 149196 147702 146985 146826 146763 146560 145988 144598 142269 139676 137744 136837 136845 137617 138819 139808 140324 140910 142026
$$ packed form
54794A47246Q94N11Q66J291Q26j03k78N51J492J838J654J259Q90Q46J296J991
54778A63070K546K951L485M315N438O709P702P877P217O335N711N145M271L164
54764B35936K067R05n12k126l751n298o561p179p089o750o590o496o080n192l983
54749A71301k729j792j364j223j024q48r98j276j094m05K50P14J497K695L562
54734A67266L612L434L765M440M917N272N874O518O671O256N504M264K266p2j859
54719B28128k790l416m243n161n899o469o869o772n882m530l487l137l101k810
54705A63562k250j811j531j015k35K28P8j13K01N68J73q88j745k021k045j960
54689A49196j494p17j59o3k03n72j390k329k593j932r07QP72J202R89N16N86J116
$$ plain form
54671 142026 143141 143457 143142 142930 142769 141907 140307 139008 138829 139472 140120 140314 140052 139650 139649 140361 141366 141857
54653 141857 141541 140796 140061 139603 139705 140400 141083 141031 140296 139456 138662 137716 136984 137268 138593 140006 140820 141257
54635 141257 141651 141846 141691 141379 140959 140223 139387 139127 139540 139795 139286 138501 138277 138771 139594 140410 140925 140822 140248
54616 140248 139885 140128 140650 141120 141799 142950 144208 145117 145828 146732 147731 148400 148549 148212 147441 146498 145873 145676
54598 145676 145422 144789 144095 143583 142829 141484 140133 139619 139832 139926 139593 139433 140100 141643 143633 145441 146477
54581 146477 146623 146356 146146 145895 145336 144664 144227 143880 143308 142846 143323 145052 147466 149703 151105 151295 150405
54564 150405 149229 148569 148334 147850 147069 146843 147765 149337 150602 151177 151373 151665 152365 153491 154631 155168 154948
54547 154948 154525 154521 154913 155288 155633 156418 157853 159399 160220 160030 159328 158821 158712 158574 157885 156591 155116 153807
$$ packed form
54671A42026J115L16l15k12j61q62j600j299j79O43O48J94k62m02jP12J005M91
54653A41857l16p45p35m58J02O95O83n2p35q40p94r46p32K84J325J413Q14M37
54635A41257L94J95j55l12m20p36q36k60M13K55n09p85k24M94Q23Q16N15j03n74
54616A40248l63K43N22M70O79J151J258R09P11R04R99O69J49l37p71r43o25j97
54598A45676k54o33o94n12p54j345j351n14K13R4l33j60O67J543J990J808J036
54581A46477J46k67k10k51n59o72m37l47n72m62M77J729K414K237J402J90q90
54564A50405j176o60k35m84p81k26R22J572J265N75J96K92P00J126J140N37k20
54547A54948m23mL92L75L45P85J435J546Q21j90p02n07j09j38o89j294j475j309
$$ plain form
54529 153807 152481 150678 148359 146206 145004 144815 144984 145038 145284 146340 148296 150571 152391 153205 152905 152067
54513 152067 151781 152655 153969 154365 153474 152384 152305 153324 154751 156154 157534 158795 159624 159864 159658 159229 158732
54496 158732 158275 157886 157530 157259 157206 157304 157233 156781 156083 155402 154937 154958 155796 157383 159075 160206 160653 160661 160470 160457
54476 160457 161262 163257 165979 168561 170633 172445 174196 175757 177109 178586 180488 182658 184546 185521 185167
54461 185167 183598 181589 180131 179651 179702 179487 178637 177491 176627 176131 175399 173853 171825 170372 170076 170363 170284
54444 170284 169621 168828 168166 167469 166684 166069 165729 165391 164830 164195 163741 163469 163219 162941 162759 162893 163483 164298 164625
54425 164625 163806 162084 160701 160848 162604 164945 166642 167017 166090 164377 162642 161557 161365 161867 162772 163972
54409 163972 165372 166601 167189 167145 167129 167803 169094 170359 171215 171875 172619 173276 173508 173401 173467 174116 175301 176709
$$ packed form
54529A53807j326j803k319k153j202j89J69N4K46J056J956K275J820Q14l00q38
54513A52067k86Q74J314L96q91j090p9J019J427J403J380J261Q29K40k06m29m97
54496A58732m57l89l56k71n3R8p1m52o98o81m65K1Q38J587J692J131M47Qj91j3
54476A60457Q05J995K722K582K072J812J751J561J352J477J902K170J888R75l54
54461A85167j569k009j458m80N1k15q50j146q64m96p32j546k028j453k96K87p9
54444A70284o63p93o62o97p85o15l40l38n61o35m54k72k50k78j82J34N90Q15L27
54425A64625q19j722j383J47J756K341J697L75r27j713j735j085j92N02R05J200
54409A63972J400J229N88m4j6O74J291J265Q56O60P44O57K32j07O6O49J185J408
$$ plain form
54391 176709 178080 179293 180282 180968 181307 181376 181349 181352 181439 181767 182646 184243 186335 188613 191099 193894 196549 198227
54373 198227 198727 198926 199846 201481 202914 203434 203224 202970 203074 203364 203497 203579 204207 205672 207303 208074 207910 207784
54355 207784 208273 208584 207567 205213 202527 200162 197966 195822 194105 193047 192167 190783 188845 186985 185848
54340 185848 185471 185240 184415 182921 181619 181515 182601 183674 183460 181748 179409 177542 176687 176710 177187 177911 179007
54323 179007 180497 181875 182389 181822 180752 179900 179463 179206 178941 178620 178080 177142 176000 175170 174845 174563 173789
54306 173789 172682 171923 171840 172141 172594 173466 174919 176350 176912 176568 176126 176257 176943 177890 178845 179391 179101 178262
54288 178262 177893 178582 179687 180210 180048 179831 179842 179806 179602 179453 179355 179010 178471 178294 178795 179606 180283 180903 181675
54269 181675 182318 182330 181799 181511 182146 183553 184934 185690 186039 186760 188308 190263 191832 192818 193737 194910 195798
$$ packed form
54391A76709J371J213R89O86L39O9k7LQ7L28Q79J597K092K278K486K795K655J678
54373A98227N00J99R20J635J433N20k10k54J04K90J33Q2O28J465J631P71j64j26
54355B07784M89L11j017k354k686k365k196k144j717j058q80j384j938j860j137
54340A85848l77k31q25j494j302j04J086J073k14j712k339j867q55K3M77P24J096
54323A79007J490J378N14n67j070q52m37k57k65l21n40r38j142q30l25k82p74
54306A73789j107p59q3L01M53Q72J453J431N62l44m42J31O86R47R55N46k90q39
54288A78262l69O89J105N23j62k17J1l6k04j49r8l45n39j77N01Q11O77O20P72
54269A81675O43J2n31k88O35J407J381P56L49P21J548J955J569R86R19J173Q88
$$ plain form
54252 195798 195618 194359 192823 191687 190973 190463 190212 190322 190497 190244 189491 188670 188142 187839 187555 187299 187157 187045
54234 187045 186870 186775 186983 187444 187884 188133 188159 187850 187032 185720 184119 182417 180817 179668 179263 179484 179976 180625
54216 180625 181489 182263 182312 181420 180096 178934 178031 177263 176721 176586 176770 176995 177008 176549 175492 174299 173977 175157
54198 175157 177363 179471 180664 180731 179842 178564 177798 178089 179010 179659 179774 179973 180913 182598 184591 186502 188142
54181 188142 189456 190513 191540 192861 194717 196961 198913 199801 199535 198834 198441 198407 198306 197789 196668 194818
54165 194818 192377 189840 187614 185721 184195 183368 183371 183749 184084 184646 185802 187159 188039 188580 189509 190894 192023
54148 192023 192596 193131 193915 194434 194266 193808 193569 193291 192449 191201 190226 189797 189612 189482 189697 190623 192256 194259
54130 194259 196277 198122 199759 201207 202522 203964 206003 208895 212171 214782 215913 215625 214683 213852 213227
$$ packed form
54252A95798j80j259j536j136p14n10k51J10J75k53p53q21n28l03k84k56j42j12
54234A87045j75r5K08M61M40K49K6l09q18j312j601j702j600j149m05K21M92O49
54216A80625Q64P74M9q92j324j162r03p68n42j35J84K25J3m59j057j193l22J180
54198A75157K206K108J193O7q89j278p66K91R21O49J15J99R40J685J993J911J640
54181A88142J314J057J027J321J856K244J952Q88k66p01l93l4j01n17j121j850
54165A94818k441k537k226j893j526q27LL78L35N62J156J357Q80N41R29J385J129
54148A92023N73N35P84N19j68m58k39k78q42j248r75m29j85j30K15R26J633K003
54130A94259K018J845J637J448J315J442K039K892L276K611J131k88r42q31o25
$$ plain form
54115 213227 212172 210012 206997 204355 203091 202901 202669 201828 200671 199484 198144 196756 195952 196108 196753 197185
54099 197185 197297 197343 197207 196447 194972 193284 192031 191567 191838 192424 192775 192632 192256 192121 192499 193431 194880 196719
54081 196719 198692 200630 202658 205036 207810 210694 213251 215192 216652 218191 220324 222937 225302 226724
54067 226724 227042 226545 225734 225175 225175 225342 224817 223232 221223 219712 218917 218375 217725 217083 216815 217301 218851 221392
54049 221392 224158 226137 227063 227736 229167 231657 234886 238683 243228 248458 253713 258314 262379 266692 271779
54034 271779 277412 283099 288732 294472 300249 305723 310746 315571 320539 325669 330556 334627 337609 339797
54020 339797 341760 343689 345293 346360 347024 347217 346385 344290 341728 339752 338313 336326 333038 328644 323590
54005 323590 318049 312296 306896 302162 297958 294282 291499 289703 288423 287339 286784 287097 287985 289014 290300
$$ packed form
54115B13227j055k160l015k642j264j90k32q41j157j187j340j388q04J56O45M32
54099A97185J12M6j36p60j475j688j253m64K71N86L51j43l76j35L78R32J449J839
54081A96719J973J938K028K378K774K884K557J941J460J539K133K613K365J422
54067B26724L18m97q11n59%J67n25j585k009j511p95n42o50o42k68M86J550K541
54049B21392K766J979R26O73J431K490L229L797M545N230N255M601M065M313N087
54034B71779N633N687N633N740N777N474N023M825M968N130M887M071K982K188
54020C39797J963J929J604J067O64J93q32k095k562j976j439j987l288m394n054
54005C23590n541n753n400m734m204l676k783j796j280j084n55L13Q88J029J286
$$ plain form
53990 290300 292151 294331 296183 297267 297405 296355 293925 290296 285831 280745 275317 270115 265555 261477
53976 261477 257650 254388 252059 250174 247769 244747 242148 240889 240725 240690 240155 239220 238471 238577 239860 241944
53960 241944 243961 245264 245879 246271 246915 248068 249641 251176 252191 252721 253406 254942 257574 261082 264977
53945 264977 268696 271885 274718 277836 281830 286823 292461 298102 303041 306882 309872 312703 315834 319091
53931 319091 322001 324256 325744 326378 326300 326246 327364 330364 334825 339548 343717 347613 352057 357263 362677
53916 362677 368003 373912 381234 389701 398104 405696 412872 420292 427892 435149 441886 448221 453887 458188
53902 458188 460716 461736 461688 460672 458641 455862 452895 450116 447385 444100 439561 433461 426241 418903 412254
53887 412254 406284 400331 393735 386260 378056 369571 361486 354431 348561 343504 338726 333844 328691 323443
$$ packed form
53990B90300J851K180J852J084J38j050k430l629m465n086n428n202m560m078
53976B61477l827l262k329j885k405l022k599j259j64l5n35r35p49J06J283K084
53960B41944K017J303O15L92O44J153J573J535J015N30O85J536K632L508L895
53945B64977L719L189K833L118L994M993N638N641M939L841K990K831L131L257
53931C19091K910K255J488O34p8n4J118L000M461M723M169L896M444N206N414
53916C62677N326N909P322Q467Q403P592P176P420P600P257O737O335N666M301
53902D58188K528J020m8j016k031k779k967k779k731l285m539o100p220p338o649
53887D12254n970n953o596p475q204q485q085p055n870n057m778m882n153n248
$$ plain form
53873 323443 318675 314842 311506 307520 302369 296989 292851 290396 288796 287041 284734 281961 278974 276144
53859 276144 273700 271360 268648 265726 263444 262306 261814 261140 260101 259065 258184 257220 256038 254894 254168
53844 254168 254045 254434 254951 254997 254080 252171 249754 247564 246272 246127 246705 247193 247206 247193 247807 248930 249699 249531
53826 249531 248823 248473 248910 249746 250299 250288 250056 250266 251397 253406 255766 257843 259318 260349 261345 262639 264362
53809 264362 266539 269078 271661 273923 275956 278499 282336 287524 293385 299257 305025 310911 317021 323256
53795 323256 329510 335794 342137 348357 353941 358237 360890 362072 362286 362088 362060 362648 363627 363893 362341 359041
53779 359041 355217 351977 349339 346559 343038 338691 333724 328322 322605 316785 311347 306896 303637 301166
53765 301166 298925 296740 294630 292355 289594 286459 283413 280756 278554 276877 275579 273998 271654 269118
$$ packed form
53873C23443m768l833l336l986n151n380m138k455j600j755k307k773k987k830
53859B76144k444k340k712k922k282j138m92o74j039j036q81r64j182j144p26
53844B54168j23L89N17M6r17j909k417k190j292j45N78M88J3j3O14J123P69j68
53826B49531p08l50M37Q36N53j1k32K10J131K009K360K077J475J031R96J294J723
53809B64362K177K539K583K262K033K543L837N188N861N872N768N886O110O235
53795C23256O254O284O343O220N584M296K653J182K14j98k8N88R79K66j552l300
53779C59041l824l240k638k780l521m347m967n402n717n820n438m451l259k471
53765C01166k241k185k110k275k761l135l046k657k202j677j298j581k344k536
$$ plain form
53751 269118 267460 266691 265644 263627 261358 259834 259021 258195 256970 255448 253882 252700 252339 252593 252668 252404
53735 252404 252728 254182 255662 255642 254267 253208 253546 254796 255975 256745 257291 257906 258974 260743 262842 264521
53719 264521 265612 266822 268804 271333 273677 275468 276904 278270 279587 280739 281819 283207 285150 287279
53705 287279 288841 289542 289961 291013 293342 297344 303189 310226 316862 321783 325181 328158 331077 333250 334193
53690 334193 334343 334232 333658 332131 329791 327464 325943 325453 325645 325939 325984 325885 325898 325951 325622 324631 323154 321651
53672 321651 320533 319964 319853 320048 320573 321562 322906 324206 325192 325867 326147 325786 324949 324343 324353 324530 324479 324751
53654 324751 326141 328408 330491 331793 332495 332806 332801 332929 333770 335126 336157 336617 337236 338704 341001 343880
53638 343880 347230 350644 353380 355156 356384 357296 357507 356814 355779 355069 354791 354914 355664 356968 358091 358501
$$ packed form
53751B69118j658p69j047k017k269j524q13q26j225j522j566j182l61K54P5k64
53735B52404L24J454J480k0j375j059L38J250J179P70N46O15J068J769K099J679
53719B64521J091J210J982K529K344J791J436J366J317J152J080J388J943K129
53705B87279J562P01M19J052K329M002N845P037O636M921L398K977K919K173R43
53690C34193J50j11n74j527k340k327j521m90J92K94M5r9J3N3l29r91j477j503
53672C21651j118n69j11J95N25R89J344J300R86O75K80l61q37o06J0J77n1K72
53654C24751J390K267K083J302P02L11nJ28Q41J356J031M60O19J468K297K879
53638C43880L350L414K736J776J228R12K11o93j035p10k78J23P50J304J123M10
$$ plain form
53622 358501 358616 359073 359726 360126 360552 361699 363535 365358 367015 369299 372851 377261 381521 385008 387774
53607 387774 390162 392394 394472 396362 398281 400647 403588 406669 409308 411385 413201 414998 416817 418731
53593 418731 420758 422511 423292 422765 421333 419705 418310 417288 416830 417147 418038 418790 418725 417784 416419 414961
53577 414961 413329 411343 409100 406910 405036 403604 402561 401609 400398 398988 397853 397151 396299 394622 392245
53562 392245 389896 388027 386645 385880 386133 387515 389606 391913 394216 396404 398366 400074 401407 401923 401322
53547 401322 400217 399850 400798 402494 404197 405918 408045 410554 413085 415450 417694 419952 422620 426308 431158
53532 431158 436430 441251 445638 450435 456384 463623 471916 480855 489875 498534 507003 516001 526134 537399
53518 537399 549441 562099 575509 589701 604364 619261 634774 651686 670243 689823 709862
$$ packed form
53622C58501J15M57O53M00M26J147J836J823J657K284L552M410M260L487K766
53607C87774K388K232K078J890J919K366K941L081K639K077J816J797J819J914
53593D18731K027J753P81n27j432j628j395j022m58L17Q91P52o5r41j365j458
53577D14961j632j986k243k190j874j432j043r52j211j410j135p02q52j677k377
53562C92245k349j869j382p65K53J382K091K307K303K188J962J708J333N16o01
53547D01322j105l67R48J696J703J721K127K509K531K365K244K258K668L688M850
53532D31158N272M821M387M797N949P239Q293Q939R020Q659Q469Q998J0133J1265
53518E37399J2042J2658J3410J4192J4663J4897J5513J6912J8557J9580K0039
$$ plain form
53507 709862 730700 752965 776293 799388 821347 842288 862562 882099 900817 919046 937126
53496 937126 955002 972598 990179 1007982 1025892 1043853 1062171 1080980 1099824 1118161 1135995
53485 1135995 1153530 1170640 1187199 1203631 1220532 1237894 1255211 1272207 1288945 1305372 1321313
53474 1321313 1336853 1352129 1366677 1379426 1389506 1396774 1401545 1404154 1404855 1403848 1401224 1396985 1391118
53461 1391118 1383555 1374213 1363268 1351305 1338999 1326683 1314354 1301893 1289014 1275152 1259801 1243024
53449 1243024 1225456 1207745 1190128 1172537 1155004 1137875 1121557 1106024 1090791 1075666 1061337
53438 1061337 1048760 1038042 1028538 1020118 1013564 1009383 1006952 1005363 1004509 1004677 1005642 1006987 1009043 1012617
53424 1012617 1017856 1024093 1030833 1038240 1046614 1056011 1066471 1078068 1090663 1104105 1118732 1135132
$$ packed form
53507G09862K0838K2265K3328K3095K1959K0941K0274J9537J8718J8229J8080
53496I37126J7876J7596J7581J7803J7910J7961J8318J8809J8844J8337J7834
53485A135995J7535J7110J6559J6432J6901J7362J7317J6996J6738J6427J5941
53474A321313J5540J5276J4548J2749J0080P268M771K609P01j007k624m239n867
53461A391118p563r342j0945j1963j2306j2316j2329j2461j2879j3862j5351j6777
53449A243024j7568j7711j7617j7591j7533j7129j6318j5533j5233j5125j4329
53438A061337j2577j0718r504q420o554m181k431j589q54J68R65J345K056L574
53424A012617N239O237O740P407Q374R397J0460J1597J2595J3442J4627J6400
$$ plain form
53412 1135132 1153259 1172316 1191683 1211514 1232200 1253724 1275821 1298494 1322088 1347137 1374264
53401 1374264 1403862 1435628 1468725 1502773 1538469 1576872 1618160 1661461 1705914 1751505 1798652
53390 1798652 1847239 1896496 1945828 1995340 2045304 2095373 2144756 2192960 2239897 2285352 2328979
53379 2328979 2370950 2411969 2452193 2490578 2525634 2556583 2583446 2606413 2625509 2640575 2651205
53368 2651205 2656975 2658025 2655050 2648313 2637065 2620391 2598224 2571080 2539313 2503364 2464340 2423488
53356 2423488 2381141 2336912 2290870 2243867 2196845 2150435 2105184 2061469 2019217 1978290 1939077
53345 1939077 1901993 1866499 1831392 1796110 1761041 1726538 1692524 1659181 1627206 1597117 1569016
53334 1569016 1543185 1520073 1499362 1479858 1460736 1442275 1425114 1409535 1395784 1384104 1373863
$$ packed form
53412A135132J8127J9057J9367J9831K0686K1524K2097K2673K3594K5049K7127
53401A374264K9598L1766L3097L4048L5696L8403M1288M3301M4453M5591M7147
53390A798652M8587M9257M9332M9512M9964N0069M9383M8204M6937M5455M3627
53379B328979M1971M1019M0224L8385L5056L0949K6863K2967J9096J5066J0630
53368B651205N770J050k975o737j1248j6674k2167k7144l1767l5949l9024m0852
53356B423488m2347m4229m6042m7003m7022m6410m5251m3715m2252m0927l9213
53345A939077l7084l5494l5107l5282l5069l4503l4014l3343l1975l0089k8101
53334A569016k5831k3112k0711j9504j9122j8461j7161j5579j3751j1680j0241
$$ plain form
53323 1373863 1363458 1351822 1339395 1326906 1313923 1299570 1284111 1268795 1254384 1240788 1227963
53312 1227963 1216196 1205471 1195493 1186491 1179218 1173855 1169573 1165562 1161979 1159567 1158763 1159520 1161689 1165147
53298 1165147 1169733 1175412 1182456 1191207 1201661 1213493 1226562 1241260 1258181 1277428 1298392 1320278
53286 1320278 1342688 1365510 1388399 1410786 1432370 1453175 1472954 1490932 1506437 1519491 1530491
53275 1530491 1539556 1546450 1550895 1552645 1551498 1547636 1541736 1534240 1524664 1512184 1496880 1479873 1462130
53262 1462130 1443640 1423949 1402999 1381084 1358314 1334545 1309764 1284317 1258787 1233749 1209434
53251 1209434 1185463 1161116 1136152 1111226 1087247 1064403 1042183 1020272 999029 978897 959713
53240 959713 940858 921903 902841 883862 865290 847709 831757 817605 804822 792846 781424
$$ packed form
53323A373863j0405j1636j2427j2489j2983j4353j5459j5316j4411j3596j2825
53312A227963j1767j0725r978r002p273n363m282m011l583k412q04P57K169L458
53298A165147M586N679P044Q751J0454J1832J3069J4698J6921J9247K0964K1886
53286A320278K2410K2822K2889K2387K1584K0805J9779J7978J5505J3054J1000
53275A530491R065O894M445J750j147l862n900p496r576j2480j5304j7007j7743
53262A462130j8490j9691k0950k1915k2770k3769k4781k5447k5530k5038k4315
53251A209434k3971k4347k4964k4926k3979k2844k2220k1911k1243k0132j9184
53240I59713j8855j8955j9062j8979j8572j7581j5952j4152j2783j1976j1422
$$ plain form
53229 781424 770563 760350 750999 742812 735747 729129 722083 714258 705911 697361 688585 679334 669362 658463
53215 658463 646510 633644 620280 606819 593359 579776 566066 552566 539832 528311 518100
53204 518100 508969 500555 492468 484312 475838 467157 458629 450450 442451 434335 425944 417225 408205 399094
53190 399094 390216 381695 373424 365477 358230 351808 345730 339463 333107 327248 322335 318506 315737 313663
53176 313663 311478 308572 305248 302390 300481 299331 298597 298037 297390 296675 296534 297564 299149 299688 298348 295991
53160 295991 294042 292936 292142 291231 290325 289604 288908 287928 286603 285299 284552 284494 284552 284011 282866 281774 281117
53143 281117 280570 279726 278714 277881 277270 276755 276419 276461 276903 277642 278628 279757 280808 281695 282625 283823 285332
53126 285332 287209 289655 292643 295672 298217 300319 302530 305342 308800 312510 315913 318697 321052 323366
$$ packed form
53229G81424j0861j0213r351q187p065o618p046p825q347q550q776r251r972j0899
53215F58463j1953j2866j3364j3461j3460j3583j3710j3500j2734j1521j0211
53204E18100r131q414q087q156q474q681q528q179p999q116q391q719r020r111
53190C99094q878q521q271p947p247o422o078o267o356n859m913l829k769k074
53176C13663k185k906l324k858j909j150p34n60o47p15j41J030J585N39j340k357
53160B95991j949j106p94r11r06p21o96r80j325j304p47n8N8n41j145j092o57
53143B81117n47q44j012q33o11n15l36M2M42P39R86J129J051Q87R30J198J509
53126B85332J877K446K988L029K545K102K211K812L458L710L403K784K355K314
$$ plain form
53112 323366 325645 327466 328487 328636 327805 325866 323178 320569 318469 316397 313600 309899 305667 301394 297546
53097 297546 294450 291951 289509 286975 284903 283686 282864 281757 280417 279295 278311 276950 275130 273306 271781
53082 271781 270526 269649 269361 269393 269038 268055 267038 266679 267003 267534 267866 267818 267336 266511 265572 264721 264005 263421 262951
53063 262951 262506 261938 261215 260426 259655 258958 258458 258289 258398 258560 258666 258918 259708 261258 263310 265175 266250
53046 266250 266552 266596 266721 266837 266934 267433 268707 270453 271945 272762 273015 272955 272729 272439 272161 271901 271684 271599 271588
53027 271588 271366 270726 269743 268570 267328 266437 266573 267903 269658 271014 272070 273394 274846 275648 275532 275059
53011 275059 274712 274427 274237 274657 275970 277626 278829 279413 279847 280665 282208 284537 287132 288970 289422 289089
52995 289089 289371 291155 294144 297420 300349 302824 304896 306406 307036 306623 305383 303847 302633 302213 302730
$$ packed form
53112C23366K279J821J021J49q31j939k688k609k100k072k797l701m232m273l848
53097B97546l096k499k442k534k072j217q22j107j340j122r84j361j820j824j525
53082B71781j255q77k88L2l55r83j017l59L24N31L32m8m82q25r39q51p16n84m70
53063B62951m45n68p23p89p71o97n00j69J09J62J06K52P90J550K052J865J075
53046B66250L02M4J25J16R7M99J274J746J492Q17K53o0k26k90k78k60k17q5j1
53027B71588k22o40r83j173j242q91J36J330J755J356J056J324J452Q02j16m73
53011B75059l47k85j90M20J313J656J203N84M34Q18J543K329K595J838M52l33
52995B89089K82J784K989L276K929K475K072J510O30m13j240j536j214m20N17
$$ plain form
52980 302730 303882 305048 305688 305646 305079 304234 303420 302977 303045 303388 303715 304131 305098 306879 309214 311457 312955
52963 312955 313438 313238 313074 313403 314042 314531 314695 314550 313918 312581 310725 308778 306812 304633 302499 301156
52947 301156 300877 300996 300767 300319 300232 300480 300371 299529 298379 297510 296929 296218 295186 294063 293102 292301 291598 291135
52929 291135 291128 291594 292335 293145 293816 294051 293664 292943 292537 292780 293358 293807 294055 294254 294277 293791 292771 291641 290861
52910 290861 290516 290257 289514 287953 285929 284363 283929 284469 285387 286399 287542 288689 289523 289974 290297 290679 291083
52893 291083 291429 291616 291409 290674 289715 289046 288803 288790 289015 289767 291126 292882 294957 297421 300044 302404 304642
52876 304642 307540 311514 315953 319905 322994 325294 326713 327013 326239 324697 322618 320224 317931 316083 314481
52861 314481 312536 309936 306997 304408 302777 302250 302241 301606 299431 295846 291924 288728 286527 284860 283183
$$ packed form
52980C02730J152J166O40m2n67q45q14m43O8L43L27M16R67J781K335K243J498
52963C12955M83k00j64L29O39M89J64j45o32j337j856j947j966k179k134j343
52947C01156k79J19k29m48q7K48j09q42j150q69n81p11j032j123r61q01p03m63
52929B91135pM66P41Q10O71K35l87p21m06K43N78M49K48J99K3m86j020j130p80
52910B90861l45k59p43j561k024j566m34N40R18J012J143J147Q34M51L23L82M04
52893B91083L46J87k07p35r59o69k43j3K25P52J359J756K075K464K623K360K238
52876C04642K898L974M439L952L089K300J419L00p74j542k079k394k293j848j602
52861C14481j945k600k939k589j631n27ro35k175l585l922l196k201j667j677
$$ plain form
52846 283183 281349 279565 278028 276696 275399 274029 272508 270725 268789 267253 266732 267183 267880 268192 268137 268038
52830 268038 268048 268284 269057 270515 272184 273295 273558 273292 272853 272336 271896 271939 272721 273932 274972 275583 276023 276629
52812 276629 277426 278253 279078 279932 280547 280376 279156 277300 275426 273650 271598 269091 266476 264207 262468 261336
52796 261336 260964 261311 261973 262657 263666 265497 267917 269876 270527 270100 269534 269406 269459 269128 268221 266971 265684
52779 265684 264583 263864 263628 263686 263743 263801 264101 264579 264741 264358 263949 264183 265042 266019 266983 268233 269730 270925
52761 270925 271599 272284 273488 274830 275428 274945 273857 272817 272105 271702 271556 271642 271962 272621 273880 275997 278923
52744 278923 282158 284996 287056 288539 289854 291125 292282 293477 294974 296622 297821 298274 298444 299025 300182
52729 300182 301624 303221 305153 307377 309206 309636 308159 305300 302335 300399 299777 299999 300435 300646 300344 299373
$$ packed form
52846B83183j834j784j537j332j297j370j521j783j936j536n21M51O97L12n5r9
52830B68038J0K36P73J458J669J111K63k66m39n17m40M3P82J211J040O11M40O06
52812B76629P97Q27Q25Q54O15j71j220j856j874j776k052k507k615k269j739j132
52796B61336l72L47O62O84J009J831K420J959O51m27n66j28N3l31r07j250j287
52779B65684j101p19k36N8N7N8L00M78J62l83m09K34Q59R77R64J250J497J195
52761B70925O74O85J204J342N98m83j088j040p12m03j46Q6L20O59J259K117K926
52744B78923L235K838K060J483J315J271J157J195J497J648J199M53J70N81J157
52729C00182J442J597J932K224J829M30j477k859k965j936o22K22M36K11l02r71
$$ plain form
52713 299373 297835 295998 294102 292442 291556 291822 292796 293395 292991 292032 291345 291188 291268 291306 291179 290770 290162 289887
52695 289887 290509 291871 293078 293325 292562 291332 290173 289235 288373 287561 287129 287433 288235 288696 288183 286944 285694
52678 285694 284753 283883 282880 281944 281420 281481 282131 283281 284704 286084 287220 288060 288528 288500 288030 287454 287123 287143
52660 287143 287525 288456 290196 292698 295559 298488 301599 304989 308194 310455 311559 311999 312085 311406 309605 307360
52644 307360 305919 305688 305837 305431 304442 303473 302975 303014 303450 304060 304675 305382 306378 307520 308400 309028 310013 311742
52626 311742 313744 315207 315805 315629 314647 312750 310248 307811 305972 304957 304869 305622 306715 307466 307534 307036 306211
52609 306211 305262 304462 304085 304177 304528 304897 305144 305291 305594 306423 307836 309392 310553 311137 311204 310803 310093 309434
52591 309434 308979 308453 307763 307488 308156 309259 309731 309402 309192 309717 310507 310961 311326 312101 313000 313265 312790 312239
$$ packed form
52713B99373j538j837j896j660q86K66R74N99m04r59o87j57Q0L8j27m09o08k75
52695B89887O22J362J207K47p63j230j159r38q62q12m32L04Q02M61n13j239j250
52678B85694r41q70j003r36n24O1O50J150J423J380J136Q40M68k8m70n76l31K0
52660B87143L82R31J740K502K861K929L111L390L205K261J104M40Q6o79j801k245
52644C07360j441k31J49m06r89r69m98L9M36O10O15P07R96J142Q80O28R85J729
52626C11742K002J463N98j76r82j897k502k437j839j015q8P53J093P51O8m98q25
52609C06211r49q00l77R2L51L69K47J47L03Q29J413J556J161N84O7m01p10o59
52591C09434m55n26o90k75O68J103M72l29k10N25P90M54L65P75Q99K65m75n51
$$ plain form
52573 312239 312044 311899 311365 310500 309646 308919 308231 307673 307586 308204 309326 310336 310587 309851 308468 307004 305711
52556 305711 304414 302904 301323 299981 298951 298087 297414 297199 297547 298159 298636 298768 298326 296942 294716 292763
52540 292763 292541 294377 297080 299203 300360 301119 302039 303217 304520 305758 306670 307091 307255 307669 308669 310190
52524 310190 311914 313473 314614 315379 316169 317420 319213 321283 323406 325698 328489 331994 336056 340172 343786
52509 343786 346614 348646 349910 350404 350212 349448 348012 345633 342253 338150 333621 328824 324041 319836 316680
52494 316680 314556 313090 311913 310786 309614 308489 307567 306824 306158 305726 305836 306437 307196 308214 310055 312731
52478 312731 315245 316680 317304 318022 319120 320236 321279 322676 324762 327603 331277 335710 340277 344211 347420
52463 347420 350315 352828 354343 354647 354236 353434 351887 349279 346019 342760 339610 336163 332105 327514 322797
$$ packed form
52573C12239j95j45n34q65q54p27o88n58q7O18J122J010K51p36j383j464j293
52556C05711j297j510j581j342j030q64o73k15L48O12M77J32m42j384k226j953
52540B92763k22J836K703K123J157P59R20J178J303J238R12M21J64M14J000J521
52524C10190J724J559J141P65P90J251J793K070K123K292K791L505M062M116L614
52509C43786K828K032J264M94j92p64j436k379l380m103m529m797m783m205l156
52494C16680k124j466j177j127j172j125r22p43o66m32J10O01P59J018J841K676
52478C12731K514J435O24P18J098J116J043J397K086K841L674M433M567L934L209
52463C47420K895K513J515L04m11q02j547k608l260l259l150l447m058m591m717
$$ plain form
52448 322797 318534 315123 312431 310008 307745 305983 304889 304168 303597 303404 303779 304349 304602 304639 305113 306434
52432 306434 308218 309546 309698 308799 307823 307725 308499 309295 309548 309630 310231 311509 313166 315005 316889 318348 318881
52415 318881 318736 318938 320261 322431 324643 326682 329239 333093 338320 344440 351099 358259 365776 373115 379567
52400 379567 384474 387182 387218 384818 380963 376507 371436 365349 358469 351724 345958 341492 338372 336444 335131
52385 335131 333737 332237 331379 331818 333517 336134 339469 343184 346588 349252 351675 354840 359101 363866 368328
52370 368328 372154 375344 377827 379540 380805 382214 383939 385331 385486 384199 382134 380049 378249 376871
52356 376871 376201 376335 376834 377184 377386 377641 377682 377005 375725 374679 374589 375512 377110 378981 380788 382584 385044
52339 385044 388872 393793 398643 402646 406195 410222 415236 421197 427872 435035 442579 450637 459376 468657
$$ packed form
52448C22797m263l411k692k423k263j762j094p21n71j93L75N70K53L7M74J321
52432C06434J784J328J52q99r76r8P74P96K53Q2O01J278J657J839J884J459N33
52415C18881j45K02J323K170K212K039K557L854N227O120O659P160P517P339O452
52400C79567M907K708L6k400l855m456n071o087o880o745n766m466l120j928j313
52385C35131j394j500q58M39J699K617L335L715L404K664K423L165M261M765M462
52370C68328L826L190K483J713J265J409J725J392J55j287k065k085j800j378
52356C76871o70J34M99L50K02K55M1o77j280j046r0R23J598J871J807J796K460
52339C85044L828M921M850M003L549M027N014N961O675P163P544Q058Q739R281
$$ plain form
52325 468657 478293 488573 499965 512171 524069 534815 544495 553536 562173 570870 580571 591928 604651
52312 604651 618093 632139 647086 663089 680266 699011 719560 741393 763581 785675 807915
52301 807915 830719 854265 878341 902250 925072 946304 965979 983891 999217 1011446 1021321 1030144
52289 1030144 1038258 1044861 1049287 1051831 1053195 1053640 1053005 1051301 1048987 1046608 1044185 1041133 1037028 1032356
52275 1032356 1028042 1024209 1020031 1015112 1010343 1006803 1004390 1002216 999948 998007 996760 996392 997438 1000567
52261 1000567 1005780 1012485 1020389 1029720 1040647 1053270 1068160 1085932 1105968 1126311 1145261 1162536
52249 1162536 1178597 1193542 1207136 1219349 1230197 1239385 1246685 1252474 1257348 1261309 1263695 1263929 1262032
52236 1262032 1258486 1253804 1248190 1241454 1233315 1223883 1213650 1202958 1191706 1179726 1167124 1153997
$$ packed form
52325D68657R636J0280J1392J2206J1898J0746R680R041Q637Q697R701J1357J2723
52312F04651J3442J4046J4947J6003J7177J8745K0549K1833K2188K2094K2240
52301H07915K2804K3546K4076K3909K2822K1232J9675J7912J5326J2229R875Q823
52289A030144Q114O603M426K544J364M45o35j704k314k379k423l052m105m672
52275A032356m314l833m178m919m769l540k413k174k268j941j247l68J046L129
52261A000567N213O705P904R331J0927J2623J4890J7772K0036K0343J8950J7275
52249A162536J6061J4945J3594J2213J0848R188P300N789M874L961K386K34j897
52236A262032l546m682n614o736q139r432j0233j0692j1252j1980j2602j3127
$$ plain form
52224 1153997 1140140 1125413 1110263 1095504 1081628 1068638 1056476 1045225 1034765 1024566 1014099
52213 1014099 1003484 993599 985525 979775 975976 973264 971041 969383 968730 969309 970915 973165 975889 979317
52199 979317 983971 990244 997924 1006147 1014019 1021227 1027880 1033771 1038184 1040623 1041410 1041205 1040036 1037324 1032927
52184 1032927 1027642 1022408 1017316 1011765 1005331 998102 990434 982867 976133 970691 966195 961917 957717 954141
52170 954141 951541 949683 948404 948007 948684 950072 951766 953793 956131 958274 959879 961450 963699 966339 968186
52155 968186 968437 967373 965839 964494 963586 963033 962670 962629 963340 964848 966397 967197 967422 967848 968602 968935 968400
52138 968400 967585 967430 968268 969839 971914 974595 978229 983187 989603 997264 1005958 1015828 1027065 1039375
52124 1039375 1052236 1065712 1080445 1096710 1113988 1131713 1149895 1168673 1187717 1206530 1225119
$$ packed form
52224A153997j3857j4727j5150j4759j3876j2990j2162j1251j0460j0199j0467
52213A014099j0615r885q074n750l799k712k223j658o53N79J606K250K724L428
52199I79317M654O273P680Q223P872P208O653N891M413K439P87k05j169k712m397
52184A032927n285n234n092n551o434p229p668p567o734n442m496m278m200l576
52170I54141k600j858j279l97O77J388J694K027K338K143J605J571K249K640J847
52155I68186K51j064j534j345r08n53l63m1P11J508J549Q00K25M26P54L33n35
52138I68400q15j55Q38J571K075K681L634M958O416P661Q694R870J1237J2310
52124A039375J2861J3476J4733J6265J7278J7725J8182J8778J9044J8813J8589
$$ plain form
52113 1225119 1243912 1263201 1282950 1302972 1322986 1342691 1362077 1381508 1401159 1420549 1438983
52102 1438983 1456347 1473059 1489281 1504570 1518329 1530174 1539719 1546386 1549856 1550588 1549521 1547163 1543195
$$ packed form
52113A225119J8793J9289J9749K0022K0014J9705J9386J9431J9651J9390J8434
52102A438983J7364J6712J6222J5289J3759J1845R545O667L470P32j067k358l968
$$ [...]
##END NTUPLES=NMR SPECTRUM
##END=
