##TITLE=AC1644_HPIAH13377_8569693_X9gTcgy1c5
##JCAMPDX= 6.0         $$ Bruker NMR JCAMP-DX V2.0
##DATA TYPE= NMR SPECTRUM
##DATA CLASS= NTUPLES
##ORIGIN= BRUKER
##OWNER= Administrator
$$ 1.72 TOPSPIN		Version 2.1
$$ 2014-04-10 16:10:55.415 -0700  Administrator@X
$$ Compression mode = diff/dup
##.OBSERVE FREQUENCY= 400.02188249412
##.OBSERVE NUCLEUS= ^1H
##.ACQUISITION MODE= SIMULTANEOUS (DQD)
##.ACQUISITION SCHEME= undefined
##.AVERAGES= 8
##.DIGITISER RES= 22
##SPECTROMETER/DATA SYSTEM= spect
##.PULSE SEQUENCE= zg30
##.SOLVENT NAME= COFFEE_meoh
##.SHIFT REFERENCE= INTERNAL, COFFEE_meoh, 1, 14.98509
##AUDIT TRAIL= $$ (NUMBER, WHEN, WHO, WHERE, PROCESS, VERSION, WHAT)
$$ ##TITLE= Audit trail, TOPSPIN		Version 2.1
$$ ##JCAMPDX= 5.01
$$ ##ORIGIN= Bruker BioSpin GmbH
$$ ##OWNER= Administrator
$$ $$ E:\/data/COFFEE/nmr/AC1644_HPIAH13377_8569693_X9gTcgy1c5/10/pdata/1/auditp.txt
$$ ##AUDIT TRAIL=  $$ (NUMBER, WHEN, WHO, WHERE, PROCESS, VERSION, WHAT)
(   1,<2014-04-10 16:10:48.337 -0700>,<Administrator>,<X>,<go>,<TOPSPIN 2.1>,
      <created by zg
	started at 2014-04-10 16:09:42.922 -0700,
	POWCHK enabled, PULCHK disabled,
       configuration hash MD5:
       C8 4E 4E 5D D3 5C D8 9E 9F 52 82 E0 59 8A DE 15
       data hash MD5: 64K
       03 9A 8A 2F AD 28 E2 54 95 FD 7D 26 2A C3 AC 0C>)
(   2,<2014-04-10 16:10:51.399 -0700>,<Administrator>,<X>,<proc1d>,<TOPSPIN 2.1>,
      <Start of raw data processing
       efp LB = 0 FT_mod = 6 PKNL = 1 PHC0 = 0 PHC1 = 0 SI = 32K 
       data hash MD5: 32K
       A6 C1 97 54 80 F5 E3 DE 9E 83 71 0D 9A FE 82 A8>)
(   3,<2014-04-10 16:10:51.727 -0700>,<Administrator>,<X>,<proc1d>,<TOPSPIN 2.1>,
      <pk PHC0 = 94.2627 PHC1 = 0 
       data hash MD5: 32K
       69 02 B0 79 0D 72 80 CF E3 27 4E F1 47 BE 21 08>)
(   4,<2014-04-10 16:10:51.884 -0700>,<Administrator>,<X>,<proc1d>,<TOPSPIN 2.1>,
      <abs ABSG = 1 
       data hash MD5: 32K
       FB 10 9C 48 7E 54 24 DA 26 E1 00 39 AD 5A 07 08>)
(   5,<2014-04-10 16:10:51.962 -0700>,<Administrator>,<X>,<proc1d>,<TOPSPIN 2.1>,
      <abs ABSG = 2 
       data hash MD5: 32K
       69 FA FD F3 3D 00 90 5E F5 61 68 89 5D E7 B9 48>)
(   6,<2014-04-10 16:10:52.040 -0700>,<Administrator>,<X>,<proc1d>,<TOPSPIN 2.1>,
      <abs ABSG = 3 
       data hash MD5: 32K
       81 75 D7 A2 F8 D4 AF 6A 96 EC 4E 8F ED 30 59 AD>)
(   7,<2014-04-10 16:10:52.165 -0700>,<Administrator>,<X>,<proc1d>,<TOPSPIN 2.1>,
      <abs ABSG = 4 
       data hash MD5: 32K
       F4 C9 88 B5 B0 8B 9D 5E 98 39 04 D0 07 64 9C F0>)
(   8,<2014-04-10 16:10:52.243 -0700>,<Administrator>,<X>,<proc1d>,<TOPSPIN 2.1>,
      <abs ABSG = 5 
       data hash MD5: 32K
       15 F0 13 74 66 BA 6B D3 BB 8E B8 C7 06 09 FA 4D>)
$$ ##END=
$$ 
$$ $$ hash MD5
$$ $$ A7 C6 50 73 CD 8C E9 88 11 9D 8E 90 EE 7B DE 63
##$RELAX= 
##$RELAX= 
##$RELAX= 
##$RELAX= 
##$RELAX= 
##$RELAX= 
##$RELAX= 
$$ Bruker specific parameters
$$ --------------------------
##$DU= <E:\>
##$EXPNO= 10
##$NAME= <AC1644_HPIAH13377_8569693_X9gTcgy1c5>
$$ [...]
##$TP= (0..7)
150 150 150 150 150 150 150 150
##$TP07= 0
##$TPNAME0= <>
##$TPNAME1= <>
##$TPNAME2= <>
##$TPNAME3= <>
##$TPNAME4= <>
##$TPNAME5= <>
##$TPNAME6= <>
##$TPNAME7= <>
##$TPOAL= (0..7)
0.5 0.5 0.5 0.5 0.5 0.5 0.5 0.5
##$TPOFFS= (0..7)
0 0 0 0 0 0 0 0
##$TUNHIN= 0
##$TUNHOUT= 0
##$TUNXOUT= 0
##$USERA1= <user>
##$USERA2= <user>
##$USERA3= <user>
##$USERA4= <user>
##$USERA5= <user>
##$V9= 5
##$VALIST= <valist>
##$VCLIST= <CCCCCCCCCCCCCCC>
##$VD= 0
##$VDLIST= <DDDDDDDDDDDDDDD>
##$VPLIST= <PPPPPPPPPPPPPPP>
##$VTLIST= <TTTTTTTTTTTTTTT>
##$WBST= 1024
##$WBSW= 4
##$XGAIN= (0..3)
0 0 0 0
##$XL= 0
##$YL= 0
##$YMAX_a= 596276
##$YMIN_a= -505892
##$ZGOPTNS= <>
##$ZL1= 120
##$ZL2= 120
##$ZL3= 120
##$ZL4= 120
##$ABSF1= 14.98509
##$ABSF2= -5.573092
##$ABSG= 5
##$ABSL= 3
##$ALPHA= 0
##$AQORDER= 0
##$ASSFAC= 0
##$ASSFACI= 0
##$ASSFACX= 0
##$ASSWID= 0
##$AUNMP= <proc_prof1d_extract_pilot.lims>
##$AXLEFT= 0
##$AXNAME= <>
##$AXNUC= <1H>
##$AXRIGHT= 0
##$AXTYPE= 0
##$AXUNIT= <>
##$AZFE= 0.1
##$AZFW= 0.1
##$BCFW= 0
##$BC_mod= 0
##$BYTORDP= 0
##$COROFFS= 0
##$CY= 15
##$DATMOD= 1
##$DC= 0
##$DFILT= <>
##$DTYPP= 0
##$F1P= 0
##$F2P= 0
##$FCOR= 0.5
##$FTSIZE= 32768
##$FT_mod= 6
##$GAMMA= 0
##$GB= 0
##$INTBC= 1
##$INTSCL= 1
##$ISEN= 128
##$LB= 0
##$LEV0= 0
##$LPBIN= 0
##$MAXI= 10000
##$MC2= 0
##$MEAN= 0
##$ME_mod= 0
##$MI= 0
##$NCOEF= 0
##$NC_proc= -8
##$NLEV= 6
##$NOISF1= 0
##$NOISF2= 0
##$NSP= 0
##$NTH_PI= 0
##$NZP= 0
##$OFFSET= 14.98509
##$PC= 1
##$PHC0= 94.2627
##$PHC1= 0
##$PH_mod= 1
##$PKNL= yes
##$PPARMOD= 0
##$PPDIAG= 0
##$PPIPTYP= 0
##$PPMPNUM= 2147483647
##$PPRESOL= 1
##$PSCAL= 4
##$PSIGN= 0
##$PYNMP= <proc.py>
##$REVERSE= no
##$SF= 400.02
##$SI= 32768
##$SIGF1= 0
##$SIGF2= 0
##$SINO= 400
##$SIOLD= 32768
##$SPECTYP= <>
##$SREGLST= <1H.CDCl3>
##$SSB= 0
##$STSI= 32768
##$STSR= 0
##$SW_p= 8223.68421052631
##$SYMM= 0
##$S_DEV= 0
##$TDeff= 65536
##$TDoff= 0
##$TI= <>
##$TILT= no
##$TM1= 0
##$TM2= 0
##$TOPLEV= 0
##$USERP1= <user>
##$USERP2= <user>
##$USERP3= <user>
##$USERP4= <user>
##$USERP5= <user>
##$WDW= 1
##$XDIM= 32768
##$YMAX_p= 463041725
##$YMIN_p= -671310
##$CURPLOT= <Network HP LaserJet P1505>
##$CURPRIN= <$Network HP LaserJet P1505>
##$DFORMAT= <normdp>
##$LAYOUT= <+/1D_H.xwp>
##$LFORMAT= <normlp>
##$PFORMAT= <normpl>
##$SURQMSG= 1
$$ End of Bruker specific parameters
$$ ---------------------------------
##NTUPLES= NMR SPECTRUM
##VAR_NAME=  FREQUENCY,     SPECTRUM/REAL,   SPECTRUM/IMAG
##SYMBOL=    X,             R,               I
##VAR_TYPE=  INDEPENDENT,   DEPENDENT,       DEPENDENT
##VAR_FORM=  AFFN,          ASDF,            ASDF
##VAR_DIM=   32768,         32768,           32768
##UNITS=     HZ,            ARBITRARY UNITS, ARBITRARY UNITS
##FACTOR=    0.250966925370066, 1,           1
##FIRST=     8223.43324360094, -149342,      -126912
##LAST=      0,             163254,          -81904
##MIN=       0,             -671310,         0
##MAX=       8223.43324360094, 463041725,    0
$$ Real data points
##PAGE= N=1
##DATA TABLE= (X++(R..R)), XYDATA
$$ [...]
$$ plain form
19559 -47873 -108858 -328057 39971 -217057 -132886 -136076 126688 34165 -155222 -239058 155056
19547 28142 91640 263891 414152 168691 -299358 -87199 -202427 -97679 -162152 105550
19536 -140199 -4486 -22240 -173053 -103841 141662 2431 312159 -150196 -131650 -75668 26129
19524 -156836 -317263 -294676 -244591 17974 84330 48825 -122432 -13697 -132086 -174897 -247229
19513 -247229 84785 350511 -118379 223919 -213304 -194966 -46417 113787 -49583 -114083
19503 -114083 88150 48406 37581 -217211 -318299 129772 89140 105506 -160263 133 759
19492 759 -315456 193261 131718 -100134 8044 61633 -217290 -339145 9840 40867 174255
19481 174255 225371 152159 194317 -232664 -403465 92862 9270 -106307 -15327 131865 -204132
$$ packed form
19559d7873o0985k19199C9971b17057Q4171l190A26688C4165a55222q3836A55056
19547B8142O3498J72251J50261A68691b99358h7199j15228i7679o4473A05550
19536a40199d486j7754j50813O9212A41662B431L09728a50196J8546N5982B6129
19524a56836j60427K2587N0085A7974O6356l5505a22432a3697j18389m2811p2332
19513b47229H4785K65726a18379B23919b13304J8338d6417A13787d9583o4500
19503a14083H8150l9744j0825b17211j01088A29772m0632J6366a60263A33O26
19492G59c15456A93261o1543a00134H044N3589b17290j21855I840L1027J33388
19481A74255N1116p3212M2158b32664j70801I2862I270a06307a5327A31865b04132
$$ plain form
19469 90255 45393 -146015 -25312 -81920 -60383 -115802 40394 -440582 -232638 19913 147045
19458 147045 -234865 -16438 -54957 -73802 -100613 -20974 -141000 -287164 155673 -50712 -134768
19447 -134768 -123454 224802 113110 -320663 -55974 -134544 45502 -345479 18089 -157514
19436 -187488 -218912 -243791 -222613 195401 -79907 -422545 101275 -109210 -136093 -145157 138428
19424 -57647 -63772 -8484 -138 288168 -11886 -314441 -5275 -66433 9891 -193060 72604 -36490
19411 -177105 21892 22443 15147 -310412 -111377 -228364 73029 -16095 172482 -19982 245145
19399 -28982 337672 -135493 -88186 34695 -70057 38005 -86538 -57563 48514 -316843 -3457
19387 -75861 -224355 -211563 -260440 69822 155590 157994 -60407 20875 -247560 -168411 -115053
$$ packed form
19469I0255m4862a46015b5312n6608K1537n5419D0394d40582K07944A9913J27132
19458A47045b34865a6438l8519j8845k6811b0974j20026j46164A55673e0712q4056
19447a34768J1314B24802j11692c20663e5974p8570D5502c45479A8089a57514
19436a87488l1424k4879K1178A95401g9907l42638A01275a09210k6883r064A38428
19424e7647o125h484a38B88168a1886l02555e275o1158I891a93060G2604c6490
19411a77105B1892N51p296c10412a11377j16987G3029a6095A72482a9982B45145
19399b8982C37672a35493M7307C4695g0057C8005h6538K8975D8514c16843c457
19387g5861j48494J2792m8877F9822Q5768K404f0407B0875b47560P9149N3358
$$ plain form
19376 -115053 -308097 -204286 251746 -57627 20819 227526 207001 -280995 134468 269138
19366 269138 101896 -289042 -140724 23332 119202 -156272 102335 -66094 137818 41958
19355 -182500 -2754 -308866 76636 62550 65639 -195934 -367179 111431 -160225 -210786 55230
19343 -325877 85773 -176809 -200754 46278 9718 113584 101942 -35754 -369732 179564 -204441
19331 -75214 -99589 -129315 -248889 -37986 143707 -63360 -369950 71985 52777 239594 53366
19319 -110003 42136 -128359 -129962 -284579 20133 33105 -181225 51070 -152302 -34558 -392673
19308 -392673 -192919 59360 -256154 -243324 -105664 -430528 -119430 -214051 39594 -287107
19297 45599 -171824 155224 -231486 -34665 175865 47571 124167 -266418 231528 -111051
$$ packed form
19376a15053j93044J03811B51746e7627B0819K06707k0525b80995A34468J34670
19366B69138A01896b89042a40724B3332R5870a56272A02335f6094A37818D1958
19355a82500b754l06112G6636j4086L089a95934j71245A11431a60225n0561E5230
19343c25877H5773a76809k3945D6278I718J03866j1642c5754l33978A79564b04441
19331g5214k4375k9726j19574c7986A43707f3360l06590G1985j9208J86817E3366
19319a10003D2136a28359j603j54617B0133J2972a81225E1070a52302c4558l58115
19308c92673a92919E9360b56154J2830a05664l24864a19430r4621C9594b87107
19297D5599a71824A55224b31486c4665A75865D7571P6596b66418B31528a11051
$$ plain form
19286 -388051 150495 2553 52806 50285 -179158 83747 3382 34150 -57351 45346 -220561
19274 163950 -191272 -296997 -248249 -82840 79270 -92390 -71105 -109438 997 -74177 -66284 284556
19261 120384 -501104 25342 -441876 -56853 -153482 -179889 -4089 -262769 -129585 -185061 40779
19249 -174239 198644 -33680 -258600 -232907 -115887 -28481 41724 -149734 -32250 15510 -41302
19237 -44834 -144756 -100068 -40214 -121507 -26725 -10711 197945 -52568 1846 -50980 -26215 -30350
19225 -30350 -172249 -200831 -48554 98443 -93748 85414 73809 -91618 139643 -391033 -68396
19213 55290 -111205 -175533 32745 102823 -251595 148296 54235 -183991 -282332 166754 -225272
19201 17192 168064 146914 -311678 -110696 221955 149745 -128586 -178352 -174499 175604 11654
$$ packed form
19286c88051A50495B553N0253k521a79158H3747C382L0768e7351D5346b20561
19274A63950a91272j05725M8748h2840G9270i2390K1285l8333I97g4177P893B84556
19261A20384e01104B5342d41876e6853r6629k6407d089k58680a29585n5476D0779
19249a74239A98644c3680k24920K5693a15887b8481D1724a49734c2250A5510d1302
19237d4834r9922M4688d0214q1293b6725a0711A97945e2568A846e0980K4765m135
19225c0350j41899k8582d8554I8443i3748H5414j1605i1618A39643c91033f8396
19213E5290a11205o4328C2745P0078b51595A48296E4235a83991r8341A66754b25272
19201A7192J50872k1150c11678a10696B21955p2210a28586m9766L853A75604A1654
$$ plain form
19189 19622 -240337 38477 74060 -16509 -241874 25110 -18761 -49279 193136 67634 -185907
19177 -153619 -2192 -220293 19012 -73145 -183488 -133297 -276329 -21762 -55682 42410 367844
19166 367844 4405 50423 70430 -85864 -80519 -1053 -4053 88428 35507 -283064 -335037 -282648
19154 -282648 72903 34428 -191148 194501 -2761 -274178 -66416 -144685 -8705 -406956 -31054
19142 -73724 -224429 258700 74547 -476779 -227751 -280086 7346 -101413 -274245 290489
19131 54312 47546 -96825 66770 -91307 -376838 196849 -198242 13251 -394729 92762 -118328
19119 -253009 -100175 141818 131029 29191 -32020 130496 49944 -379143 -19072 163975
19108 314362 -119414 -70653 180175 -67958 -38356 -304642 12206 -58057 -165258 -15363 -220979
$$ packed form
19189A9622b40337C8477L5583a6509k25365B5110a8761l0518A93136F7634a85907
19177a53619b192k18101A9012g3145j10343N0191j43032b1762l3920D2410L25434
19166C67844D405M6018K0007h5864N345a053l000H8428C5507b83064n1973N2389
19154b82648G2903C4428a91148A94501b761k71417f6416p8269h705l98251c1054
19142g3724j50705B58700G4547d76779b27751n2335G346a01413j72832B90489
19131E4312o766i6825F6770i1307k85531A96849a98242A3251c94729I2762a18328
19119b53009a00175A41818j0789B9191c2020A30496D9944c79143a9072A63975
19108C14362a19414M8761A80175f7958K9602k66286A2206e8057j07201a5363k05616
$$ plain form
19097 -220979 61795 -186164 309866 -57430 -155702 -8113 41183 -211966 -58946 152749 92051
19086 92051 -151242 42193 -114762 -2676 -398911 133286 100934 -271270 -45835 217430 49471
19074 60104 130385 -309627 43642 178571 106873 -275720 -203481 -163690 -71877 31472 -68778
19062 -103789 -225001 13592 597 -104209 -149391 -61922 -97007 110486 112745 -16082 247334
19050 209515 16138 -72066 -297435 -96149 -63197 -4163 -78328 -145010 -105617 -150325 -97639
19039 -97639 -63873 173875 -340201 160008 79130 -99333 -31603 190200 -67111 55459 50105
19028 50105 -143788 231086 -99737 -100248 -164171 -49808 59085 100564 81326 -37262 36003 125229
19016 125229 10014 53051 4153 -305436 -235613 -195703 -252473 -11047 196796 -24450 -55464
$$ packed form
19097b20979F1795a86164C09866e7430r8272h113D1183b11966e8946A52749o0698
19086I2051a51242D2193a14762b676l96235A33286l2352b71270d5835B17430D9471
19074F0104P0281c09627D3642J34929p1698b75720P2239L9791g1877C1472f8778
19062a03789j21212A3592E97a04209m5182f1922l5085A10486K259a6082B47334
19050B09515A6138g2066k25369i6149L2952d163p4165o6682L9393m4708N2686
19039i7639L3766A73875c40201A60008G9130i9333c1603A90200f7111E5459n354
19028E0105a43788B31086i9737n11o3923d9808E9085M1479j9238c7262C6003Q9226
19016A25229A0014M3037D153c05436O9823L9910n6770a1047A96796b4450l1014
$$ plain form
19005 -55464 -27844 99789 -234907 135566 -68776 -399323 44727 220082 235703 66983 -183779
18993 43540 -167785 -71614 -362329 101403 -209754 40265 96156 -261091 86043 4510 3197
18982 3197 126083 -16059 19039 130861 -168155 -139439 -33345 -187485 -156667 -95833 -15789
18970 -166407 -333296 -58455 -121682 203662 80106 -78469 -97278 -6724 6537 356671 169802
18958 159436 -312831 -1102 252208 74853 -240542 -169316 -372918 3130 -358510 -71711 -27443
18946 -217711 -160782 14807 109100 18051 -189109 233803 -248517 205409 -124316 -111979
18936 -111979 -100256 112002 74598 -284767 -162450 -48150 46901 187115 45676 90472 -10817
18924 22625 -29011 -253900 320011 -286852 -7587 -97603 -186311 -54306 122662 65160 -105384
$$ packed form
19005e5464K7620I9789b34907A35566f8776l30547D4727J75355J5621F6983a83779
18993D3540a67785g1614k90715A01403b09754D0265N5891b61091H6043D510j313
18982C197J22886a6059A9039J11822a68155K8716c3345j54140L0818O0834a5789
18970a66407j66889e8455o3227B03662H0106g8469j8809f724F537L50134A69802
18958A59436c12831a102B52208G4853b40542P1226k03602C130c58510g1711b7443
18946b17711N6929A4807R4293A8051a89109B33803b48517B05409a24316J2337
18936a11979J1723A12002l7404b84767J22317d8150D6901J40214D5676M4796a0817
18924B2625b9011k24889C20011b86852g587r0016q8708e4306A22662n7502a05384
$$ plain form
18912 -151124 62758 -53987 -113971 -58997 7514 32368 288040 -1773 84290 68651 -16141 -33476
18900 -33476 42384 43339 -193979 -111271 53205 -102970 178516 43314 161742 47328 451011
18889 451011 -351540 147201 -100354 -166483 -24267 -125435 -43549 -235886 -68232 132642
18878 -62286 -131890 -136578 281664 195732 -223476 69858 31384 -383936 97714 -167358 -78373
18866 -59504 -155975 42631 -145905 239202 441778 -51325 -60073 -153245 -220818 -187898 6549
18854 44510 -2843 -142086 71897 -258189 26642 -100008 -146715 -4880 -60290 -85442 245257
18842 -86284 -63439 183459 -191329 -523023 -175346 -173609 34069 -32650 -36929 -5374 -84557
18831 -84557 -174147 25509 -147413 44067 -77130 -42274 -321711 -201469 85346 -35169 79691
$$ packed form
18912a51124F2758e3987n9984N4974G514K4854K55672a773H4290j5639a6141j7335
18900c3476D2384R55a93979Q2708E3205a02970A78516D3314J18428D7328M03683
18889D51011c51540A47201a00354o6129b4267j01168d3549j92337f8232A32642
18878f2286o9604m688B81664q5932b23476F9858C1384c83936I7714a67358g8373
18866e9504r6471D2631a45905B39202K02576e1325q748r3172o7573L2920F549
18854D4510b843j39243G1897b58189B6642a00008m6707d880n5410k5152B45257
18842h6284K2845A83459a91329l31694a75346J737C4069c2650m279e374p9183
18831h4557q9590B5509a47413D4067g7130L4856k79437J20242H5346c5169G9691
$$ plain form
18819 147526 -92738 224545 -127224 -205242 -100951 147035 -73044 -78072 -247872 -234254 -213606
18808 -213606 124417 -204781 -160484 -213374 -346717 -158645 3147 227132 88204 129758 -50545
18796 89535 -205226 11545 -315052 67064 175373 -1901 -2218 -189187 -403031 69230 -163032
18784 -68530 144535 -50385 -321454 -223708 24055 -233368 -39 -15340 310690 -239803 -340356
18773 -340356 -151069 -276857 -171974 44447 124430 27686 21304 -100383 -176455 57635 17238
18761 87059 -125325 -25593 -196257 -114308 -10851 219844 -63181 -243282 -42680 1025 -260072
18749 -35160 -162816 109571 -64802 98440 70240 -128865 -314643 -193385 -173902 -44003 -201661
18738 -201661 -26402 -131015 211272 -335657 -159669 -377261 155963 -22206 -121322 31745
$$ packed form
18819A47526i2738B24545a27224p8018a00951A47035g3044n028j69800J3618K0648
18808b13606A24417b04781M4297n2890j33343a58645C147K23985H8204M1554e0545
18796H9535b05226A1545c15052F7064J08309a901l17j86969k13844F9230a63032
18784f8530A44535e0385k71069R7746B4055b33368c9j5301C10690b39803j00553
18773c40356a51069j25788J04883D4447P9983B7686o382a00383p6072E7635A7238
18761H7059a25325b5593j70664Q1949a0851B19844f3181j80101d2680A025b60072
18749c5160j27656A09571f4802I8440k8200a28865j85778J21258J9483d4003j57658
18738b01661b6402j04613B11272c35657a59669k17592A55963b2206r9116C1745
$$ plain form
18727 -174450 -4953 -175781 124164 -23731 -312900 74811 -96862 -19794 -69469 26964 370610
18716 370610 -52180 94517 -164109 -245065 52003 -318199 -71051 -132060 27778 -137425 -279189
18705 -279189 -128083 -62753 -33060 7003 -63353 -194145 -250297 68362 -210393 -120899 212709
18693 -230209 95072 -81309 -185607 99267 -268856 -20883 39179 181931 90821 225594 409982
18682 409982 312029 -9530 -129291 -137918 76595 274884 206310 -297738 147171 39330 -3924
18670 56657 -275560 -66813 -138373 -130831 -304505 131013 15278 26497 -82743 -342671 -217818
18659 -217818 -50523 -18945 -31603 -183558 77975 -126791 -459 -133959 108689 163426 -8496
18647 75986 -80800 -340458 -200409 -318857 -130545 -249516 96151 185795 -17752 237623
$$ packed form
18727a74450d953j70828A24164b3731k89169G4811i6862a9794m9675B6964L43646
18716C70610e2180I4517a64109q0956E2003c18199g1051o1009B7778a37425j41764
18705b79189a28083f2753K9693G003f3353j30792n6152F8362b10393Q9494B12709
18693b30209I5072h1309j04298I9267b68856b0883C9179J42752I0821J34773J84388
18682D09982r7953i530j19761q627G6595J98289o8574b97738A47171C9330c924
18670E6657b75560f6813p1560P542j73674A31013A5278J1219h2743k59928J24853
18659b17818e0523a8945j2658j51955G7975a26791d59j33500A08689N4737h496
18647G5986h0800k59658J40049j18448a30545j18971I6151Q9644a7752B37623
$$ plain form
18636 -193929 -230858 -270289 -6303 -86304 -12609 -540426 -205365 18155 -242823 236809 -446718
18624 -322110 1639 -55396 -178818 65573 48278 -94168 -178004 96025 -259776 -227125 -45140
18612 -41948 -280100 -326790 -17379 47592 -232713 -30805 -107370 -142432 31351 -96627 -144075
18601 -144075 -94287 44738 87628 91379 -337813 -117855 -226785 -64317 -116294 -107095 11131
18589 -102154 29706 -12628 109116 -32737 109738 -146855 171256 271931 -208047 -150241
18579 -150241 -59943 -246804 -211624 -168036 -67319 16609 -50203 293176 92698 -170813 36385
18567 -274168 55816 186503 -12497 -227950 -108509 258875 -81636 -166491 146362 120112
18557 120112 -45977 1134 -101078 23161 -129528 -188744 115917 -97902 9765 27424 58396
$$ packed form
18636a93929l6929l9431f303q0001a2609n27817b05365A8155b42823B36809d46718
18624c22110A639e5396j23422F5573j7295i4168q3836I6025b59776L2651d5140
18612d1948k38152m6690a7379D7592b32713c0805p6565l5062C1351i6627m7448
18601a44075M9788D4738M2890L751c37813a17855j08930f4317n1977R199A1131
18589a02154B9706a2628A09116c2737A09738a46855A71256J00675b08047N7806
18579a50241e9943j86861L5180M3588f7319A6609e0203B93176I2698a70813C6385
18567b74168E5816J30687a2497k15453a08509B58875h1636q4855A46362k6250
18557A20112d5977A134a01078B3161a29528n9216A15917i7902I765J7659L0972
$$ plain form
18546 58396 -102865 -193782 164383 -203718 -109592 -147791 51320 3225 -182918 -200997 23958
18534 -44099 -129232 -3448 -38203 -102184 126401 -10483 156363 -238900 291318 30064 -57756
18522 -250464 158283 -6748 2466 -40695 -77680 -134581 -37640 -224363 -122501 -213383 -33327
18510 -91912 -289614 -406737 -112869 -261788 -181259 57972 -38106 166288 117104 -2936 20655
18498 246766 -111998 254773 101697 72068 -241389 -43401 -219190 60525 -73519 -33559
18487 -322567 -3417 96605 -330849 30181 1309 140346 114050 -176806 -14785 412888 -53006
18475 70353 63127 -233181 -205738 -164639 -218388 -4502 -183231 -86465 -82065 -114566 26017 304648
18463 304648 152083 -117185 -109647 -112350 130149 -257422 -65649 25290 -12641 -96455 -153861
$$ packed form
18546E8396a02865r0917A64383b03718R4126l8199E1320C225a82918j8079B3958
18534d4099q5133c448l4755o3981A26401a0483A56363b38900B91318C0064e7756
18522b50464A58283f748B466d0695l6985n6901c7640j86723J01862r0882c3327
18510i1912j97702j17123a12869j48919Q0529E7972c8106A66288m9184b936B0655
18498B46766a11998B54773A01697k9629b41389d3401j75789F0525g3519c3559
18487c22567c417I6605c30849C0181A309J39037k6296a76806a4785D12888e3006
18475G0353p226b33181K7443M1099n3749d502j78729h6465M400l2501B6017K78631
18463C04648A52083a17185P538k703A30149b57422f5649B5290a2641q3814n7406
$$ plain form
18452 -153861 -127616 -101350 -157203 49164 -14607 -132734 -93378 164348 -87178 -5760 -352874
18441 -352874 169601 -191586 -296567 -208369 -64230 -132369 249027 -153269 287422 -162388
18430 -10510 -91382 115367 -225574 -85198 -464514 12250 107598 17810 -127530 260946 -193023
18418 -331843 -119052 -249901 47142 -283481 277 82534 55196 -83515 121380 2067 144512
18407 144512 365080 -5889 -190211 -3211 43569 102106 117124 86576 74223 -293449 -51708
18395 49723 326710 295438 18000 -205317 -246317 -115443 -194252 360476 147138 -19996 -140121
18384 -140121 -172332 111647 -73678 67304 -93821 21132 71841 -189300 -108586 -176963 -18312
18372 -267491 -351939 -253478 159313 -162554 114998 -143402 -44092 -222875 19016 280666
$$ packed form
18452a53861K6245K6266n5853D9164a4607j18127L9356A64348h7178e760l47114
18441c52874A69601a91586j04981Q8198f4230o8139B49027a53269B87422a62388
18430a0510q0872A15367b25574h5198l79316A2250R5348A7810a27530B60946a93023
18418c31843a19052j30849D7142b83481B77Q2257k7338h3515A21380B067J42445
18407A44512K20568e889j84322c211D3569N8537J5018l0548j2353b93449e1708
18395D9723K76987l1272A8000b05317m1000a15443p8809C60476A47138a9996j20125
18384a40121l2211A11647g3678F7304i3821B1132N0709a89300Q0714o8377a8312
18372b67491q4448R8461A59313a62554A14998a43402d4092j78783A9016K61650
$$ plain form
18362 280666 227389 1999 -210266 230209 7275 104204 -91621 -52565 123110 -290538 -299748
18351 -299748 181045 -22447 -142520 -55114 -114801 -221714 -95450 24934 -94331 -46330 36578
18339 9308 95929 -222738 -207771 -105021 -59719 -202876 64618 -247150 -25421 86447 -522485
18327 161213 -24879 -227292 91683 56124 -325030 -129954 210785 31509 -60402 -246752
18317 -246752 92711 63929 552085 9992 110046 -62058 28718 236737 -208065 27012 -157310
18305 168375 -66126 -345775 -162909 -63453 -91517 99826 248536 95989 70721 70326 -212615
18293 29821 210621 145502 -132452 40417 -94219 63438 -100951 109636 64916 4275 239184
18282 239184 104751 123843 167981 -101845 3439 -142641 -216722 -169347 38649 221062 -109030
$$ packed form
18362B80666n3277A999b10266B30209G275R6929i1621L9056A23110b90538r210
18351b99748A81045b2447j20073e5114n9687j06913i5450B4934i4331d6330C6578
18339I308Q6621b22738J4967J02750M5302j43157F4618b47150b5421H6447e22485
18327A61213b4879k02413I1683l5559c25030a29954B10785C1509f0402j86350
18317b46752I2711k8782M88156I992J00054f2058B8718K08019b08065B7012a57310
18305A68375f6126k79649a62909f3453k8064I9826J48710I5989k5268l95b12615
18293B9821J80800o5119a32452D0417i4219F3438a00951A09636m4720D275K34909
18282B39184A04751J9092M4138a01845C439a42641p4081M7375C8649J82413a09030
$$ plain form
18270 -141632 187569 -267903 -67744 218221 -19833 -151124 -108622 -290395 31914 -35720
18259 136538 -23873 82764 -88557 76105 -191828 -76953 135543 167159 -152405 -278253 -110924
18247 86291 -218831 80783 -142749 267810 -27604 89518 -136346 -371848 33061 120560 -1877
18235 168658 -93841 -173814 179045 -158836 -40365 -292084 8942 -89316 73277 110190 39756
18223 -283301 -52213 -414929 -187743 -162923 -58033 -254853 140309 -54735 175765 -346281
18212 -89889 76906 340131 -350998 -97895 234926 -141414 139788 -132008 -21838 -195481
18202 -195481 -384669 -110333 179353 170642 242017 220857 -226268 -194480 -239290 100783 76405
18191 76405 28567 -35641 122282 -113242 -236886 -56793 -24820 214258 -258166 321863
$$ packed form
18270a41632A87569b67903f7744B18221a9833j31291M2502j81773C1914c5720
18259A36538b3873H2764h8557G6105a91828g6953A35543L1616a52405j25848a10924
18247H6291b18831H0783a42749B67810b7604H9518a36346k35502C3061Q7499a877
18235A68658i3841p9973A79045a58836d0365k51719H942h9316G3277L6913C9756
18223b83301e2213l62716a87743K4820e8033j96820A40309e4735A75765c46281
18212h9889G6906K63225c50998i7895B34926a41414A39788a32008b1838j73643
18202a95481j89188a10333A79353q711P1375k1160b26268L1788m4810A00783k4378
18191G6405B8567c5641A22282a13242j23644e6793b4820B14258b58166C21863
$$ plain form
18180 25642 -365751 182418 -221670 73760 -265398 -47347 -51443 231953 -17396 -123514 -93446
18169 -93446 -273086 -283185 132645 342836 -143001 220910 37037 117689 27018 -101161
18158 -186789 370949 147704 -230673 -92152 -20547 -38947 159249 -176071 48718 -346235
18147 96131 222559 107305 -86924 33065 -466417 291621 -27802 -47883 268354 -89531 -192364
18136 -192364 -173334 23600 -134164 407596 -70078 -279517 23614 -45676 -416363 72471 61429
18125 61429 -168485 -17670 27099 -57374 -8398 -216389 -107166 -413720 183338 116339 -14604
18113 -41214 19561 -141320 -79729 144911 -292707 1296 -76972 -115881 25295 74885 -11007
18101 -59689 -62946 104476 -93658 -231965 -11331 -124721 371256 41111 178926 127401 5532
$$ packed form
18180B5642c65751A82418b21670G3760b65398d7347m096B31953a7396j06118L0068
18169i3446j79640j0099A32645K10191a43001B20910C7037Q0652B7018a01161
18158a86789C70949A47704b30673i2152b0547j8400A59249a76071D8718c46235
18147I6131J26428A07305h6924C3065d66417B91621b7802k0081B68354h9531j02833
18136a92364J9030B3600a34164D07596g0078k09439B3614d5676l70687G2471j1042
18125F1429a68485a7670B7099e7374h398k07991a07166l06554A83338o6999a4604
18113d1214A9561a41320O1591A44911b92707A296g6972l8909B5295M9590a1007
18101e9689l257A04476i3658j38307a1331j13390C71256D1111J37815n1525E532
$$ plain form
18089 -342955 46580 -162488 21776 -25982 -144254 -174929 -129035 83421 -128884 -59058 -152022
18078 -152022 24168 -319177 -22970 -108610 102936 3282 -337931 293200 -55937 176397 -69461
18066 -72734 225671 -86290 38742 -253063 230080 -312881 -125088 -160010 -167949 -54525 6989
18054 -326146 47140 -6741 -30191 29414 -183378 -196518 1489 -224242 -160388 -18256 -196209
18043 -196209 22744 69013 -193914 38571 -120806 24924 -150356 -70779 174298 -141192
18032 -9457 39749 -40548 42043 -198787 156562 -224879 50125 60749 -333012 -71873 -305694
18021 -305694 100456 -149767 -216772 -81396 -153961 -69657 -421754 -239586 -295311 -232384 -141987
18010 -141987 168261 50103 -95939 -10453 41790 -39278 111622 -182288 117939 76155 -116821
$$ packed form
18089c42955D6580a62488B1776b5982j18272l0675M5894H3421a28884e9058r2964
18078a52022B4168c19177b2970q5640A02936C282c37931B93200e5937A76397f9461
18066g2734B25671h6290C8742b53063B30080c12881a25088l4922p939e4525F989
18054c26146D7140f741k3450B9414a83378j3140A489b24242O3854a8256j77953
18043a96209B2744M6269a93914C8571a20806B4924a50356g0779A74298a41192
18032i457C9749d0548D2043a98787A56562b24879E0125J0624c33012g1873k33821
18021c05694A00456a49767o7005h1396p2565f9657l52097J82168n5725O2927R0397
18010a41987A68261E0103i5939a0453D1790c9278A11622a82288A17939m1784a16821
$$ plain form
17998 209522 -12247 297294 -133228 -28589 295356 -31137 -31067 105513 -18310 13529 195066
17987 195066 213955 -340413 -180878 119183 -241596 113368 -356763 -122341 -155622 -159499
17977 -159499 3082 247434 42367 100616 165698 37690 433721 -321867 -98718 -64514 -91012
17966 -91012 132283 91717 -21711 287640 197012 -29934 -376101 -51107 30882 -82933 -90210
17955 -90210 -92111 -10434 51019 15506 114945 355335 43043 -30656 -21461 -143110 36686 -161480
17942 257657 -70634 138922 -92098 -166607 -226546 -138552 115022 -24502 -4156 11246 -139945
17930 -140769 -67957 78477 233366 96251 -218047 125526 -64442 -145036 -50187 19805 77305
17919 77305 -66616 80775 -34513 -267021 -132329 -102975 -261467 -9776 112796 140523 -181670
$$ packed form
17998B09522a2247B97294a33228b8589B95356c1137P0A05513a8310A3529J81537
17987A95066J8889c40413J59535A19183b41596A13368c56763a22341l3281l877
17977a59499C082K44352D2367N8249O5082C7690L96031c21867i8718L4204k6498
17966i1012A32283m0566b1711B87640r0628b9934l46167e1107C0882h2933p277
17955i0210j901a0434E1019A5506R9439K40390D3043c0656R195j21649C6686a61480
17942B57657g0634A38922i2098p4509n9939Q7994A15022b4502d156A1246a39945
17930a40769f7957G8477J54889I6251b18047A25526f4442q0594e0187A9805N7500
17919G7305f6616H0775c4513k32508a32329K9354j58492i776A12796K7727a81670
$$ plain form
17907 -18951 13949 189328 -207230 70164 -28402 -362195 -177563 -388449 -71676 -286260
17897 -286260 -220138 143098 65483 52497 -52795 -20383 197166 432857 -346790 -60982 -50860
17886 -50860 131205 -37069 -299308 41503 -162680 -11947 244459 192763 -381960 287546
17875 -72902 -219800 203790 389718 54290 -81224 -92889 -52726 -251051 -47822 145750 -151447
17863 128717 43746 -232887 -114581 -152938 37187 -76433 -206339 133810 39465 89803 59049
17852 59049 165508 -162694 86150 289977 -176485 -77472 85838 178213 17333 -162388 154933
17840 -27510 96108 226109 93868 168020 364837 -192422 -74087 -155208 -134747 -21350 -230409
17829 -230409 88876 233827 6012 95666 -655363 264660 -35406 129174 -26072 -154842 -12776
$$ packed form
17907a8951A3949J75379b07230G0164b8402l33793a77563k10886g1676k14584
17897b86260O6122A43098F5483j2986e2795b0383A97166K35691c46790f0982J0122
17886e0860A31205c7069k62239D1503a62680a1947B44459n1696c81960B87546
17875g2902j46898B03790J85928E4290h1224j1665M0163j98325d7822A45750a51447
17863A28717D3746b32887a14581l8357C7187g6433j29906A33810C9465N0338l0754
17852E9049J06459a62694H6150K03827a76485g7472H5838R2375A7333a62388A54933
17840b7510I6108J30001I3868P4152J96817a92422g4087q1121K0461b1350k09059
17829b30409H8876J44951F012Q9654f55363B64660c5406A29174b6072j28770a2776
$$ plain form
17817 18440 190107 -246517 32388 -84892 284184 364428 -8951 -88739 28048 123645 65194
17806 65194 -94313 70176 -142230 226169 213507 39531 -28278 -87820 -445217 94269 197866
17795 197866 -328514 -13687 139547 -96198 143881 -296829 81805 -443641 124909 73003
17785 73003 -28942 136767 171762 -105784 -78656 157259 -162012 -78726 74204 -12548 7598
17773 -88759 -106259 67472 -30497 -277519 60688 -124168 157160 60382 8090 289634 -35691
17761 -46666 -41523 71671 373998 -238516 -58956 86299 -278604 86672 151697 -7505 -218033
17750 -218033 -196075 -140833 -354584 87723 187998 -233044 169939 236852 89493 171159 169755
17739 169755 -123976 -106774 -261726 -63690 199315 -91241 18376 -218674 94765 -27770 -110303
$$ packed form
17817A8440J71667b46517C2388h4892B84184Q0244h951p9788B8048R5597n8451
17806F5194i4313G0176a42230B26169j2662C9531b8278n9542l57397I4269J03597
17795A97866c28514a3687A39547i6198A43881b96829H1805d43641A24909n1906
17785G3003b8942A36767L4995a05784K7128A57259a62012g8726G4204a2548G598
17773h8759j7500F7472c0497k47022F0688a24168A57160F0382H090K81544c5691
17761d6666N143G1671L02327b38516e8956H6299b78604H6672O5025g505k10528
17750b18033K1958N5242k13751H7723J00275b33044A69939O6913H9493Q1666j404
17739A69755a23976J7202j54952f3690A99315i1241A8376b18674I4765b7770q2533
$$ plain form
17728 -110303 44896 94507 -338589 -22341 124601 153536 -127259 19964 341972 145247
17717 60840 -78041 389331 188830 -23599 -14341 -18514 83040 409231 -124176 -272892 -110866
17705 -46605 281305 372396 136952 77260 -506271 69346 380425 23616 31049 -67213 323105
17693 113316 400651 -87757 -148621 -139273 -302716 -293483 41854 153056 215257 236446 17749
17681 17436 -40487 99148 22763 21676 52937 -179775 166956 246177 66536 80741 -181787
17669 -3104 -155203 92285 -61994 -161745 10138 -180168 238648 -443806 -253465 -192991 51453
17657 -77008 -306084 -102362 183829 -85240 132808 -303320 -137214 -97770 5294 -11209 144443
17645 91021 -184549 -32651 -127915 134014 268235 -12799 1775 384364 -27499 163904 181536
$$ packed form
17728a10303D4896M9611c38589b2341A24601K8935a27259A9964L22008A45247
17717F0840g8041C89331A88830b3599R258m173H3040L26191a24176j48716a10866
17705d6605B81305R1091A36952n9692e06271F9346L11079B3616P433f7213C23105
17693A13316K87335h7757o0864R348j63443R233D1854J11202O2201K1189A7749
17681A7436d0487I9148B2763j087L1261a79775A66956P9221F6536J4205a81787
17669c104j52099I2285f1994r9751A0138a80168B38648d43806J90341O0474E1453
17657g7008k29076a02362A83829h5240A32808c03320a37214L9444E294a1209A44443
17645I1021a84549c2651r5264A34014J34221a2799A775L82589b7499A63904J7632
$$ plain form
17634 181536 51496 -208163 -223080 192569 -76110 278333 -106053 -235510 100104 31615
17623 154182 230052 308910 -85425 -108224 143067 59344 126553 134688 142770 -31332 286195
17611 -23744 -66873 383703 19186 173111 122199 -137067 258490 -10935 -169327 149272
17600 316288 272644 15474 -65437 15786 -74223 -385764 206785 51169 19747 -195973 197361
17588 25979 -221484 -28499 -87127 130902 552350 -1474 121863 339311 13707 -605796 -23097
17576 84494 -27777 74152 -131924 68482 24108 48722 88558 325681 163299 72086 -129814
17564 -74357 -133151 156484 1013 4186 128887 69119 283707 214419 85432 48861 67049
17553 67049 253654 -330628 -87804 346620 135854 -149047 132002 -165970 -32429 -165174
$$ packed form
17634A81536E1496b08163j4917A92569g6110B78333a06053j29457A00104C1615
17623A54182P5870P8858h5425k2799A43067E9344O7209Q135Q082c1332B86195
17611b3744m3129C83703A9186J53925n0912a37067B58490a0935j58392A49272
17600C16288m3644A5474f5437A5786g4223l11541B06785E1169A9747a95973A97361
17588B5979b21484b8499n8628A30902M21448a474A21863K17448A3707f05796b3097
17576H4494b7777G4152a31924F8482B4108K4614L9836K37123j62382G2086a29814
17564g4357n8794A56484A013L173J24701n9768K14588o9288H5432l6571J8188
17553F7049J86605c30628h7804C46620A35854a49047A32002a65970c2429j32745
$$ plain form
17543 -165174 -23939 207253 394559 -131895 358235 128082 209313 344673 25368 63377
17533 63377 2975 358216 -21968 52631 -39897 -83282 426774 -146389 203320 -242462 236315
17521 13499 -93684 299682 259592 241503 268787 171721 -103433 45705 -63176 110669 94997
17510 94997 61706 121564 405461 -208896 -96931 -62611 -15726 -150354 -195794 -3039 -62593
17499 -62593 114920 396649 141567 220872 45344 174425 -119903 -18922 110553 -165876
17488 113926 288397 38998 -127347 562834 -105624 136151 139623 -72131 45591 -160548
17477 65835 306339 -58577 67775 52609 34701 54219 -261050 148023 495346 24358 33408
17466 33408 -28370 532209 118073 428944 -41155 60800 282136 -97257 139935 272432
$$ packed form
17543a65174b3939B07253J87306a31895C58235A28082Q1231J35360B5368L8009
17533F3377B975L55241b1968E2631c9897m3385D26774a46389B03320b42462B36315
17521A3499i3684B99682m0090j8089K7284r7066a03433D5705f3176A10669j5672
17510I4997l3291N9858K83897b08896i6931L4320a5726j34628m5440c039n9554
17499f2593A14920K81729A41567P9305D5344J29081a19903a8922A10553a65876
17488A13926J74471C8998a27347E62834a05624A36151L472g2131D5591a60548
17477F5835K40504e8577F7775j5166j7908J9518b61050A48023L47323B4358R050
17466C3408b8370E32209A18073L10871d1155F0800K21336i7257A39935J32497
$$ plain form
17456 272432 96773 223691 245835 264999 286573 190403 -131839 111552 500603 284205
17446 284205 703419 219362 -42260 155859 304791 8373 -90119 79256 12118 173735 380360
17435 380360 712067 53755 195207 69033 261969 197788 501796 119256 46430 245782
17425 245782 540643 572871 262430 193236 210149 221429 297867 377903 300761 258966 173876
17414 173876 422425 68584 370065 438786 447139 67164 353803 -83719 -247450 295619 81260
17402 168684 183605 -221086 181930 338509 174054 286614 -26774 333893 246998 -99055
17391 407456 90240 51773 44673 105562 184805 98103 117354 62818 215024 47028 -13191
17379 370816 325954 -43259 100169 -62730 288500 77412 18271 244505 47963 234695 79002
$$ packed form
17456B72432I6773J26918K2144J9164K1574r6170a31839A11552L89051k16398
17446B84205M19214B19362d2260A55859J48932H373i0119G9256A2118J61617K06625
17435C80360L31707E3755J41452F9033J92936o4181L04008A19256D6430J99352
17425B45782K94861L2228B62430o9194J6913J1280P6438Q0036p7142m1795q5090
17414A73876K48549F8584L01481O8721Q353F7164K86639h3719j63731B95619H1260
17402A68684J4921b21086A81930J56579j64455J12560b6774C33893q6895i9055
17391D07456I0240l8467p100O0889P9243q6702J9251n4536J52206D7028a3191
17379C70816m4862d3259A00169f2730B88500G7412A8271K26234D7963J86732G9002
$$ plain form
17367 550690 368289 136494 242536 86884 -159368 132360 35211 161856 351401 131897
17356 114790 -94982 285962 144042 -16011 255888 3169 -39791 194796 350729 411065 433219
17345 433219 262717 -24993 94392 35023 -190008 69091 -12571 346174 90956 25139 114823
17334 114823 177160 153933 54380 251078 128785 297792 309866 163589 130716 237733
17324 237733 438558 485592 361497 305635 -241736 320540 -104577 -28065 90842 62044
17314 62044 247332 317760 276445 227996 53929 271568 193535 195208 186456 182309 213297 167241
17302 167241 155541 -152430 246365 93524 39929 -6569 476093 16387 143489 846645 -243035
17290 285112 425467 -143285 161017 275329 211363 -190720 22604 156016 380239 -106516
$$ packed form
17367E50690j82401A36494J06042H6884a59368A32360C5211J26645J89545A31897
17356A14790i4982B85962j41920a6011B55888C169c9791A94796J55933O0336K2154
17345D33219j70502b4993I4392C5023a90008F9091a2571C46174I0956B5139Q9684
17334A14823O2337k3227E4380J96698j22293J69007J2074j46277l2873J07017
17324B37733K00825M7034j24095n5862b41736C20540a04577b8065I0842k8798
17314F2044J85288P0428m1315m8449E3929K17639p8033J673q752m147L0988m6056
17302A67241j1700a52430B46365I3524C9929f569D76093A6387J27102P03156b43035
17290B85112J40355a43285A61017J14312o3966a90720B2604J33412K24223a06516
$$ plain form
17279 7889 211674 396696 41289 15261 63953 355872 347190 179163 -191804 82821 419435
17268 419435 255822 158948 -25937 206194 260748 174281 320372 202981 306927 163584
17258 163584 -80974 178141 115416 247715 90123 356549 341174 133519 87953 46451 307332
17247 307332 265023 70950 18575 309220 173829 469233 293369 154674 -118310 -26818
17236 354844 331195 202844 -12696 173800 160601 124710 212498 212926 -103300 45437 295594
17225 295594 355032 359617 90754 511028 260449 124718 207262 92523 371244 158872 -136830
17213 111751 361956 406916 44283 154801 64993 476658 201222 112108 288809 362172
17203 362172 177641 264399 345191 308049 494785 199591 259892 118077 362729 80736
$$ packed form
17279G889K03785J85022D1289A5261M8692K91919q682j68027a91804H2821L36614
17268D19435j63613r6874b5937B06194N4554q6467J46091j17391J03946j43343
17258A63584h0974A78141o2725J32299I0123K66426j5375A33519m5566m1502K60881
17247C07332m2309G0950A8575K90645j35391K95404j75864j38695a18310b6818
17236C54844k3649j28351a2696A73800j3199l5891Q7788M28a03300D5437K50157
17225B95594N9438M585I0754M20274k50579A24718Q2544I2523K78721A58872a36830
17213A11751K50205M4960D4283J10518F4993M11665B01222q9114J76701P3363
17203C62172A77641Q6758Q0792l7142J86736A99591O0301A18077K44652H0736
$$ plain form
17192 216554 226659 122148 302740 387796 218629 -72900 395434 147034 105819 345054
17182 345054 424941 124622 -24172 398233 331572 300439 189055 -4380 281647 550232 93282
17170 -81949 516826 318315 366489 384325 398088 70076 729123 279850 286784 -76092 152133
17158 135482 261353 -174217 571113 343989 246781 474694 287609 405591 482542 272132
17148 272132 492671 218895 262409 334685 220729 458692 27079 60806 341796 150504
17137 201004 198709 289538 400004 172415 542608 -64993 176693 692650 353683 368283
17127 368283 49357 415145 140578 437960 143462 315524 495232 408269 310051 232849
17117 232849 659779 387054 369839 266350 452101 234960 257710 353805 374543 292495
$$ packed form
17192B16554J0105j04511J80592Q5056j69167g2900C95434A47034m1215K39235
17182C45054P9887A24622b4172C98233o6661l1133j11384d380B81647K68585I3282
17170h1949E16826j98511M8174J7836J3763G0076O59047B79850O934g6092A52133
17158A35482J25871a74217E71113k27124r7208K27913j87085J17982P6951k10410
17148B72132K20539B18895M3514P2276j13956K37963B7079L3727K80990A50504
17137B01004k295R0829J10466A72415L70193f4993A76693N15957l38967J4600
17127C68283D9357L65788A40578K97382A43462J72062J79708q6963r8218p7202
17117B32849M26930k72725j7215j03489J85751k17141K2750R6095K0738q2048
$$ plain form
17107 292495 468847 105513 567709 341926 355743 459556 495249 371182 417337 233331
17097 233331 451879 563395 429595 338119 206071 365682 611810 460992 254576 411144
17087 411144 252927 92358 479590 459028 523776 500603 666515 411902 16682 394925
17077 394925 413005 499839 686782 572546 682084 468964 335648 234077 269999 104498
17066 233827 514358 727166 409367 560262 502724 752756 173192 444969 256334 551482
17056 551482 377220 250030 580910 456347 317569 535868 479894 259185 580907 281277
17045 528267 617528 740509 586630 444073 571527 712871 993645 876520 620968 319926
17035 319926 578720 495964 704430 475630 476708 937109 831190 556041 833812 594287
$$ packed form
17107B92495J76352A05513M62196k25783J3817J03813L5693j24067M6155j84006
17097B33331K18548J11516j33800r1476j32048J59611K46128j50818k06416J56568
17087D11144j58217I2358L87232k0562O4748k3173J65912k54613A6682L78243
17077C94925J8080Q6834J86943j14236J09538k13120j33316j01571L5922A04498
17066B33827K80531K12808l17799J50895n7538K50032A73192K71777j88635K95148
17056E51482j74262j27190L30880j24563j38778K18299n5974k20709L21722B81277
17045E28267Q9261J22981j53879j42557J27454J41344K80774j17125k55552l01042
17035C19926K58794q2756K08466k28800J078M60401j05919k75149K77771k39525
$$ plain form
17025 594287 479051 369290 680181 700599 711583 526365 729311 774460 116766 471495
17015 471495 624452 457459 657141 608761 413084 592981 615076 737061 427361 739117
17005 739117 804745 806865 578133 662185 849498 611954 787910 341029 530541 897336
16995 897336 617663 715427 724732 648169 691332 703686 1008367 839237 1012948 526167 803392
16984 803392 948205 621805 1008949 987351 791342 1184635 792601 971135 512631 844016
16974 844016 1135454 583487 941585 1044176 1018717 1106828 720605 874708 1244170 1008730
16964 1008730 1175035 824714 1163965 1185013 1009244 1095397 705108 1116008 1207467 911364
16954 911364 923700 1014644 1381764 728480 1074517 1015500 953338 938214 1335534 975646
$$ packed form
17025E94287j15236j09761L10891K0418J0984j85218K02946M5149A16766L54729
17015D71495J52957j66993J99682m8380j95677J79897K2095J21985l09700L11756
17005G39117O5628K120k28732Q4052J87313k37544J75956C41029J89512L66795
16995H97336k79673R7764R305p6563M3163J2354L04681j69130J73711m86781K77225
16984H03392J44813l26400L87144k1598j96009L93293l92034J78534m58504L31385
16974H44016K91438n51967L58098J02591k5459Q8111l86223J54103L69462k35440
16964A008730J66305l50321L39251K1048j75769Q6153l90289M10900R1459k96103
16954I11364J2336R0944L67120o53284L46037n9017o2162j5124L97320l59888
$$ plain form
16944 975646 857441 939395 1198435 1379198 940172 1156404 1271244 1160827 1250692 1121070
16934 1121070 1229853 1181886 1131997 1346178 1351376 1161954 1332547 1212693 1055763 1342640
16924 1342640 1206207 1025974 1349127 1431107 1443370 1628958 1459503 1484232 1580092 1465885
16914 1465885 1404930 1032572 1397960 1322189 1446136 1499299 1396948 1627936 1696766 1468726
16904 1468726 1459353 1768593 1693370 1660569 1632579 1637874 1537472 1923293 1879307 1733849 1686277
16893 1686277 1874770 1807833 2100408 1830174 1955558 1936963 1786207 1884996 1975994 1917824
16883 1917824 2059045 2189095 2230518 1967786 1784003 2175948 2112294 2159624 2308563 2338564
16873 2338564 2234007 2293916 2710410 2429389 2339703 2553994 2815224 2506544 2580928 2634481
$$ packed form
16944I75646j18205Q1954K59040J80763m39026K16232J14840j10417Q9865j29622
16934A121070J08783m7967m9889K14181N198j89422J70593j19854j56930K86877
16924A342640j36433j80233L23153Q1980J2263J85588j69455K4729R5860j14207
16914A465885o0955l72358L65388p5771J23947N3163j02351K30988O8830k28040
16904A468726r373L09240p5223l2801k7990N295j00402L85821m3986j45458m7572
16893A686277J88493o6937K92575k70234J25384j8595j50756R8789R0998n8170
16883A917824J41221J30050M1423k62732j83783L91945o3654M7330J48939L0001
16873B338564j04557N9909M16494k81021q9686K14291K61230l08680P4384N3553
$$ plain form
16863 2634481 2626728 2639670 2578713 2549521 2863655 2824976 2954408 3083433 2371384 2585495
16853 2585495 2857920 3078588 3078357 3157385 3253214 3003577 3089111 3320889 3345597 3493951 3513544
16842 3513544 3219585 3751849 3740152 3815539 3688838 4237999 3859090 3609644 3703902 4123285
16832 4123285 4058490 4224761 4251059 4166217 4333379 4441216 4583482 4655188 4621583 4737318
16822 4737318 4961371 4874449 4888468 5281546 5099666 5354382 5449953 5642918 5723401 5763674
16812 5763674 6124266 5940064 6092287 6515124 6367061 6242393 6517661 6719219 7148295
16803 7148295 7098691 7337851 7437711 8006515 7992879 7849305 8074931 8172873 8768309 8703824
16793 8703824 9022093 9082584 9667804 9725065 9756335 10116505 10158338 10716755 11010992 11277015
$$ packed form
16863B634481p753J2942o0957k9192L14134l8679J29432J29025p12049K14111
16853B585495K72425K20668k31P9028R5829k49637Q5534K31778K4708J48354J9593
16842C513544k93959N32264j1697P5387j26701N49161l78909k49446R4258M19383
16832D123285o4795J66271K6298q4842J67162J07837J42266P1706l3605J15735
16822D737318K24053q6922J4019L93078j81880K54716R5571J92965Q0483M0273
16812E763674L60592j84202J52223M22837j48063j24668K75268K01558M29076
16803G148295m9604K39160R9860N68804j3636j43574K25626R7942N95436o4485
16793H703824L18269O0491N85220N7261L1270L60170M1833N58417K94237K66023
$$ plain form
16783 11277015 11976806 11970635 12419662 12544030 12976563 13342341 13828951 14026186 14772938 15538887
16773 15538887 15628725 16272500 16698462 17504155 17747389 18596703 19156749 19776631 20805640
16764 20805640 21164155 21887749 22767980 23583614 25020942 25996179 26989775 28044988 29069673
16755 29069673 30241967 31694099 32963352 34592428 35999671 38206139 39799027 41427990
16747 41427990 43721320 45663367 48314278 50848905 53641770 56686321 59923643 62940780
16739 62940780 66494691 70382578 74624677 78620897 83360806 88289632 93453398 99057937
16731 99057937 104657664 110323169 116955998 123118660 129756057 136402148 142983792 149162648
16723 149162648 155424484 161186841 166125571 170285523 173435004 175765811 176822370 176971466
$$ packed form
16783A1277015O99791o171M49027J24368M32533L65778M86610J97235P46752P65949
16773A5538887Q9838O43775M25962Q05693K43234Q49314N60046O19882J029009
16764B0805640L58515P23594Q80231Q15634J437328R75237R93596J055213J024685
16755B9069673J172294J452132J269253J629076J407243K206468J592888J628963
16747D1427990K293330J942047K650911K534627K792865L044551L237322L017137
16739F2940780L553911L887887M242099L996220M739909M928826N163766N604539
16731I9057937N599727N665505O632829O162662O637397O646091O581644O178856
16723A49162648O261836N762357M938730M159952L149481K330807J056559J49096
$$ plain form
16715 176971466 175886026 173452579 170263078 166117346 161203999 155483886 149550061 143020934
16707 143020934 136465409 129660076 123079113 116579540 110355127 104293380 98263484 92480474
16699 92480474 87477813 82405531 77722484 73426541 69100728 65103264 61484349 57862114
16691 57862114 54671256 52094133 49122150 46806147 44271040 42206230 40003199 37913243
16683 37913243 36255285 34646240 32822789 31265092 30064735 28732502 27233771 26550035
16675 26550035 25211220 24204643 23309871 21940649 21186406 20224594 19793626 19555296 18337468
16666 18337468 17788135 16775640 16383899 15790349 15375900 14849094 14134058 13854096 13748997
16657 13748997 12931532 12336620 12479702 11695580 11153811 11044519 10929113 10223532 10030484
$$ packed form
16715A76971466j085440k433447l189501m145732m913347n720113n933825o529127
16707A43020934o555525o805333o580963o499573o224413o061747o029896n783010
16699I2480474n002661n072282m683047m295943m325813l997464l618915l622235
16691E7862114l190858k577123k971983k316003k535107k064810k203031k089956
16683C7913243j657958j609045j823451j557697j200357j332233j498731o83736
16675B6550035j338815j006577q94772j369222p54243r61812m30968k38330j217828
16666A8337468n49333j012495l91741n93550m14449n26806p15036k79962j05099
16657A3748997q17465n94912J43082p84122n41769j09292j15406p05581j93048
$$ plain form
16648 10030484 10138874 9547827 9156128 8928094 8444209 8570006 8429892 8332810 7665357
16639 7665357 7641945 7429790 7330750 6946293 6788381 6922552 6488868 6377315 6140262 5977298
16629 5977298 5790020 5548873 5742607 5512344 5362198 5046455 5502104 5053658 5129018 5240001
16619 5240001 4630735 4668808 4415892 5028241 4487975 4216323 4159803 4438061 4077477 3893528
16609 3893528 3975371 3780101 3882869 3859419 3955245 3598300 3299970 3618990 3529622 3479581
16599 3479581 3251805 3145130 3146457 3074881 3070746 2966880 2903089 3059984 2611439 2633528 2681614
16588 2681614 2653599 2788872 2630451 2460023 2724279 2301311 2311698 2214971 2260161 2482766
16578 2482766 2380288 2476812 2259117 2032641 2047140 2236025 2579816 1925933 2536026 2115553
$$ packed form
16648A0030484J08390n91047l91699k28034m83885J25797j40114r7082o67453
16639G665357k3412k12155r9040l84457j57912J34171m33684j11553k37053j62964
16629E977298j87278k41147J93734k30263j50146l15743M55649m48446P5360J10983
16619E240001o09266L8073k52916O12349n40266k71652n6520K78258l60584j83949
16609C893528Q1843j95270J02768k3450R5826l56945k98330L19020q9368n0041
16599C479581k27776j06675J327p1576m135j03866o3791J56895m48545K2089M8086
16588B681614k8015J35273j58421j70428K64256m22968J0387r6727M5190K22605
16578B482766j02478R6524k17695k26476J4499J88885L43791o53883O10093m20473
$$ plain form
16568 2115553 2130086 1923711 1959829 2028789 1889007 2157084 1699859 1917966 1864491 1639599
16558 1639599 1652040 1798073 1724176 1722627 1682162 1484358 1260346 1572038 1597324 1640307 1253076
16547 1253076 1400899 1599950 1488735 1221608 1490065 1663999 1211376 1427033 1237774
16538 1237774 1499217 1229320 1218243 1416998 1277633 1457836 1177440 1058538 922760 907676
16528 907676 1245504 1189373 1218374 1341315 1085393 1212640 1026379 1071692 1165628 1214998
16518 1214998 887523 804534 728856 1056566 686084 946219 771379 729497 875850 700180
16508 700180 1039882 1017084 903710 768384 569252 1112818 1042263 1042350 868294 1043035 615911
16497 615911 745086 757987 838975 584078 763364 709114 518470 1160367 473896 609549
$$ packed form
16568B115553J4533k06375L6118O8960j39782K68077m57225K18107n3475k24892
16558A639599J2441J46033p3897j549m0465j97804k24012L11692K5286M2983l87231
16547A253076J47823J99051j11215k67127K68457J73934m52623K15657j89259
16538A237774K61443k69897j1077J98755j39365J80203k80396j18902j35778j5084
16528I07676L37828n6131K9001J22941k55922J27247j86261M5313R3936M9370
16518A214998l27475q2989p5678L27710l70482K60135j74840m1882J46353j75670
16508G00180L39702k2798j13374j35326j99132N43566p0555Q7j74056J74741m27124
16497F15911J29175J2901Q0988k54897J79286n4250j90644O41897D73896J35653
$$ plain form
16487 609549 780118 723583 797535 444256 774069 734927 812479 499690 536778 535972 613326
16476 613326 432844 752306 694189 752499 488570 568982 786540 503088 275308 678303
16466 678303 494406 633556 550289 521769 498704 657978 441310 507372 366569 447394
16456 447394 638316 248953 591202 535239 321466 616529 601274 549796 732865 623800
16446 623800 440433 322113 594050 503999 321284 366146 493414 374668 398606 449555
16436 449555 691650 291135 467501 533143 245985 547696 358344 493867 150320 428392
16426 428392 612765 313164 262963 525006 353253 466936 286018 506581 568342 128161
16415 256419 87325 195548 99454 375343 116141 224420 73930 218912 202981 345509
$$ packed form
16487F09549J70569n6535P3952l53279L29813l9142P7552l12789L7088q06P7354
16476F13326j80482L19462n8117N8310k63929Q0412K17558k83452k27780M02995
16466F78303j83897J39150q3267k8520k3065J59274k16668O6062j40803Q0825
16456D47394J90922B48953L42249n5963k13773K95063j5255n1478J83069j09065
16446F23800j83367j18320K71937r0051j82715M4862J27268j18746K3938N0949
16436D49555K42095B91135J76366O5642B45985L01711j89352J35523A50320K78072
16426D28392J84373k99601n0201K62043j71753J13683j80918K20563O1761A28161
16415B56419H7325J08223r6094K75889A16141J08279G3930J44982j5931J42528
$$ plain form
16405 345509 352807 523973 350082 292384 379212 657187 347655 600439 375146 464014
16395 464014 481894 366435 100524 290692 27238 407862 80480 571526 411837 234237
16385 234237 319554 76010 526859 289620 525189 511946 158417 483679 497999 482949
16375 482949 88582 -17143 301647 722127 156182 268045 43454 -79612 356311 120351
16364 442666 286361 136631 461167 270608 107361 463912 118070 213686 427145 -61393
16353 305619 604928 219139 391976 328372 198820 392070 179707 -164969 18633 135094
16343 135094 33629 146669 550 125405 29807 87411 -60 443294 -105299 351881 3513 -93307
16330 -360312 -239431 224591 205939 82453 499634 254051 -56833 321856 440737 -353650
$$ packed form
16405C45509P298J71166j73891n7698Q6828K77975l09532K52784k25293Q8868
16395D64014J7880j15459A00524J90168B7238L80624H0480M91046j59689j77600
16385B34237Q5317G6010M50849k37239K35569j3243A58417L25262J4320j5050
16375D82949H8582a7143C01647M20480A56182J11863D3454g9612C56311A20351
16364D42666j56305A36631L24536j90559A07361L56551A18070R5616K13459f1393
16353C05619K99309B19139J72837o3604j29552J93250A79707a64969A8633J16461
16343A35094C3629J13040E50J24855B9807N7604f0D43294a05299C51881C513i3307
16330c60312J20881B24591j8652H2453M17181k45583e6833C21856J18881c53650
$$ plain form
16319 234023 100916 86693 156489 -6420 238486 29589 -272430 54164 -32079 20401 26334
16308 26334 -341 15690 55727 183946 178388 607037 -23758 103546 48970 199945 348639
16297 348639 153554 -52766 46394 -34599 -32984 246523 -25434 -12890 216023 13595 156328
16286 156328 175321 349229 117972 249401 267185 209118 12880 73293 -109429 63212 131801
16275 131801 84607 -50407 132096 -20390 -132283 -213453 -595 27407 -113914 94862 52998
16264 52998 78899 97973 296390 -96731 279705 -46907 85480 213121 278750 238258 121197
16253 121197 236291 75423 -24362 -104181 281025 132966 126329 -29388 -44883 -120526 72721
16241 55397 157745 -267520 338035 -172178 -279739 -202604 130209 154668 144950 -96908 63695
$$ packed form
16319B34023A00916j4223O9796f420B38486B9589b72430E4164c2079B0401N933
16308B6334c41A5690M0037J28219n558M28649b3758A03546D8970J50975J48694
16297C48639A53554e2766D6394c4599J615B46523b5434J2544B16023A3595J42733
16286A56328J8993J73908A17972J31429J7784n8067A2880O0413a09429F3212O8589
16275A31801m7194e0407A32096b0390j11893q1170e95B7407a13914I4862m1864
16264E2998K5901J9074J98417i6731B79705d6907H5480J27641O5629m0492j17061
16253A21197J15094G5423b4362p9819B81025A32966o637b9388j5495p5643G2721
16241E5397J02348b67520C38035a72178j07561P7135A30209K4459r718i6908F3695
$$ plain form
16229 144983 37570 43273 -162183 92092 -133390 -16659 -166114 -9997 200773 222642 91240
16217 247657 -269547 159651 420520 183343 -47329 -243084 -246187 189116 196564 281334 186757
16206 186757 75205 319098 -94094 -140729 -149173 3979 88378 -196358 270127 -419758 -10985
16194 214577 -2388 256025 -351251 197338 108810 173085 -190409 159608 -23527 -107728 -125385
16183 -125385 -309399 -23948 266120 -165332 -219179 -161026 140164 218874 -272627 226681
16172 -4188 -129088 -24013 138983 319960 59975 24542 -115994 229684 473899 -115918
16161 127350 -274482 119406 277522 140525 -164315 -79946 -118647 21283 -334983 -111693
16150 -72600 152168 33648 -73959 287026 132015 -39132 -118984 147848 278710 150112
$$ packed form
16229A44983C7570N703a62183I2092a33390a6659j49455i997B00773K1869I1240
16217B47657b69547A59651K60869A83343d7329j95755l103A89116P448Q4770r4577
16206A86757G5205K43893i4094m6635q444C979Q4399a96358B70127d19758a0985
16194B14577b388B56025c51251A97338q8528O4275a90409A59608b3527q4201j7657
16183a25385j84014b3948B66120a65332n3847N8153A40164P8710b72627B26681
16172d188j24900b4013A38983J80977E9975B4542a15994B29684K44215a15918
16161A27350b74482A19406J58116j36997a64315g9946l8701B1283c34983a11693
16150g2600A52168C3648g3959B87026A32015c9132p9852A47848J30862j28598
$$ plain form
16140 150112 113204 -10042 -54129 -90417 179703 -11951 136009 334530 -8413 125520 -170120
16128 114917 70503 13613 -22538 88473 118012 63405 -59076 -93838 -284662 232698 187623
16117 187623 34165 107179 -154012 -223643 -55911 181590 87018 -315208 -89741 -321018 -242087
16106 -242087 183060 -48849 38763 -181844 -13390 17835 -15762 -87203 -110305 -19179 -4892
16094 183260 631 95667 138216 137059 -96706 74007 148385 126593 62653 106587 -233415 -62151
16081 49944 77003 171364 -1573 30271 -41698 112668 -83180 -38268 -115496 161794 165560 -15961
16068 126434 -15459 -337446 -63962 -323617 199302 80535 143772 -8239 284793 154108 -57150
16056 59374 79594 -34062 92362 58955 -62635 -132204 -59240 -337420 -117596 -32161 61726
$$ packed form
16140A50112l6908a0042m4087l6288A79703a1951A36009J98521h413A25520a70120
16128A14917m4414A3613b2538H8473K9539n4607e9076l4762j90824B32698m5075
16117A87623C4165P3014a54012o9631e5911A81590H7018c15208h9741k31277P8931
16106b42087A83060d8849C8763a81844a3390A7835a5762p1441k3102a9179d892
16094A83260F31R5036M2549j157i6706G4007P4378k1792F2653M3934b33415f2151
16081D9944K7059R4361a573C0271d1698A12668h3180c8268p7228A61794L766a5961
16068A26434a5459l21987f3962k59655A99302H0535O3237h239B84793j30685e7150
16056E9374K0220c4062I2362l3407f2635o9569e9240k78180a17596c2161F1726
$$ plain form
16044 222913 -202067 330089 -107543 -12943 182180 -80262 20254 -241973 130022 127702
16034 127702 130268 55432 -296488 229075 -123238 236073 -170093 -81855 -191126 167237
16023 148055 -288512 -344650 98024 75178 13852 -49463 8501 -148737 343339 -42316 53043
16011 -50813 25230 20613 -64353 -139690 31907 31252 -72685 -260807 -430804 -186931 -46727 204744
15998 -94090 268379 -72112 91891 -267696 -133471 -2310 323619 -100368 -8022 154717 95925
15987 95925 -140266 137039 258472 120353 179886 174819 349299 207809 102281 184902
15977 184902 380655 23497 158368 -114398 -49989 171720 53473 -252342 -199577 295401
15966 11687 78554 22548 276085 281016 160090 -92268 -210180 238959 186380 215251 169817
$$ packed form
16044B22913b02067C30089a07543a2943A82180h0262B0254b41973A30022k320
16034A27702K566E5432b96488B29075a23238B36073a70093h1855j09271A67237
16023A48055b88512n6138I8024k2846A3852d9463H501a48737C43339d2316E3043
16011e0813B5230m617f4353p5337C1907o55g2685j88122j69997a86931d6727B04744
15998i4090B68379g2112I1891b67696a33471b310C23619a00368h022A54717n8792
15987I5925a40266A37039J21433A20353N9533n067J74480j41490A02281Q2621
15977A84902J95753B3497J34871a14398d9989A71720E3473b52342N2765B95401
15966A1687O6867B2548K53537M931j20926i2268j17912B38959n2579K8871m5434
$$ plain form
15955 169817 19754 -129855 8639 3817 -125918 -37261 64702 -169975 -53103 -385794 45547
15943 100131 -110790 138489 -95033 -220375 -102453 -199631 -158048 -190999 188928 32438
15932 81871 151280 -28610 -30277 22033 -235149 -305560 -119446 -122343 -198837 141797 -84229
15920 192601 300227 -71759 168134 -88055 126476 -366424 -300681 -270766 -268442 -236557 76754
15908 -281639 -298739 -220698 89696 137344 164962 -125511 290499 -29027 -198362 89404 241355
15897 241355 -215213 21138 -407673 -65010 276127 -123247 180873 23240 235126 -375668
15886 20517 334038 71146 97278 107889 -67672 -5719 -178587 21967 -278156 84373 144583
15875 144583 206055 -52481 -117651 -287597 4726 -379513 -163634 -78450 -337215 243172 55303
$$ packed form
15955A69817A9754a29855H639C817a25918c7261F4702a69975e3103l32691D5547
15943A00131a10790A38489i5033j25342a02453r7178M1583l2951A88928C2438
15932H1871O9409b8610j667B2033b35149p0411a19446k897p6494A41797h4229
15920A92601J07626g1759A68134h8055A26476c66424O5743K9915K324L1885G6754
15908b81639j7100P8041H9696M7648K7618a25511B90499b9027j69335H9404J51951
15897B41355b15213B1138d07673f5010B76127a23247A80873B3240K11886c75668
15886B0517L13521G1146K6132J0611f7672e719j72868B1967b78156H4373O0210
15875A44583O1472e2481o5170j69946D726c79513a63634g8450k58765B43172E5303
$$ plain form
15863 140482 -197809 -225467 -194535 -147708 214279 111334 137769 -4883 -267123 -161511 1708
15851 51089 -318239 240366 -244400 -344801 -142351 -284226 4523 -96685 -67911 -144352 -154622
15840 -154622 -42309 -18702 13876 28110 225527 47755 -193913 83499 -46387 165984 -221497
15828 36727 -240327 -64621 50568 5380 -41371 82755 275057 182153 -123380 -22099 -59338
15817 -59338 -87958 -18404 -128220 134125 92032 -233457 -90103 -150542 8189 -173264 146322
15805 -112142 270 -92558 13565 333997 110389 179495 -182530 109482 304712 -3666 113959
15793 -174910 111201 102572 -151097 -316376 -221750 -13909 -311627 68421 -219019 -68328 190743
15781 137701 1843 241792 -265614 -176343 16613 18560 -368975 215804 23827 -158487 261367
$$ packed form
15863A40482a97809k7658L0932M6827B14279j02945K6435d883k62240J05612A708
15851E1089c18239B40366b44400j00401a42351j41875D523i6685K8774p6441j0270
15840a54622d2309a8702A3876J4234J97417D7755a93913H3499d6387A65984b21497
15828C6727b40327f4621E0568E380d1371H2755J92302r2904a23380b2099l7239
15817e9338k8620a8404j09816A34125m2093b33457i0103o0439H189a73264A46322
15805a12142B70i2558A3565L20432A10389O9106a82530A09482J95230c666A13959
15793a74910A11201q629a51097j65279R4626a3909k97718F8421b19019f8328A90743
15781A37701A843K39949b65614Q9271A6613J947c68975B15804B3827a58487B61367
$$ plain form
15769 160274 95280 87168 24132 -21375 -271321 137841 -160826 40206 227891 420038 207679
15757 -285206 174750 -484703 297230 235386 383468 107131 238622 -279558 30639 47057
15747 47057 45825 141043 108802 272180 100058 -342030 -164896 -310548 -1867 -128009 -111486
15736 -111486 -15649 87339 -120335 -96329 -62120 -121564 -61822 194363 -70733 -170500 -302873
15725 -302873 -26722 93034 9661 -77907 34314 -178144 257452 -49643 -144615 -184080 -5658
15713 -38148 -21393 132369 178434 87877 -119737 -20470 -79032 -105928 -84405 67256 -30682
15701 -133985 68862 141199 42065 177047 142236 -67489 14267 -1437 86655 169632 -293122
15689 -226878 -19540 230520 227195 149224 -24908 -251833 -388828 432888 -199373 58001 119686
$$ packed form
15769A60274o4994q112B4132b1375k49946A37841a60826D0206J87685J92147B07679
15757b85206A74750d84703B97230o1844J48082A07131J31491b79558C0639J6418
15747D7057j232R5218l2241J63378A00058c42030a64896j45652a867j26142J6523
15736a11486a5649H7339a20335K4006L4209n9444N9742A94363g0733r9767j32373
15725c02873b6722I3034I661g7907C4314a78144B57452d9643r4972l9465e658
15713c8148J6755A32369M6065H7877a19737b0470n8562k6896K1523F7256c0682
15701a33985F8862P2337D2065J34982l4811f7489A4267a437H6655Q2977b93122
15689b26878a9540B30520l325p7971b4908k26925j36995D32888a99373E8001O1685
$$ plain form
15678 119686 -185564 101391 -182235 -29210 228440 228731 -84797 -22417 -176952 113830 -37191
15666 -170431 -182332 -76602 -374117 46635 37683 165809 55269 110139 88851 246137 -141280
15654 -134263 -22478 -78347 101289 338250 100267 -8842 -76509 16555 402976 -38815 -87631
15643 -87631 183110 -67219 16622 -205690 -10889 -157678 11222 77678 30209 -127219 -361701
15632 -361701 70951 7096 -67991 145079 -160065 -211303 79685 -187449 -45889 100407 1902
15620 219168 -160158 158801 191268 -38921 47688 -263005 356325 -227318 413627 -234015
15609 161537 -23212 38910 -25964 -142534 -44345 -61608 110946 -36396 131989 -106897 80905
15597 -97706 -308229 -26015 -97890 43318 -18881 -92357 -157200 37385 37926 10003 172137 -286438
$$ packed form
15678A19686a85564A01391a82235b9210B28440K91h4797b2417j54535A13830c7191
15666a70431j1901g6602k97515D6635q952J28126E5269N4870k1288J57286a41280
15654a34263b2478n5869A01289K36961A00267h842o7667A6555L86421c8815m8816
15643h7631A83110f7219A6622b05690a0889j46789A1222O6456C0209a27219k34482
15632c61701G0951G096f7991A45079a60065n1238G9685a87449d5889A00407A902
15620B19168a60158A58801L2467c8921D7688b63005C56325b27318D13627b34015
15609A61537b3212C8910b5964j16570d4345j7263A10946c6396A31989a06897H0905
15597i7706k10523b6015p1875D3318a8881p3476o4843C7385N41A0003J62134b86438
$$ plain form
15584 318565 131146 -164192 -389807 -90530 206891 54918 80740 165055 48159 210107
15574 210107 -471627 38083 -200264 -130789 222873 -300307 209985 -46006 54975 178505
15564 178505 39447 -264886 195107 -99720 -181262 33945 91534 62290 1188 37017 -45053
15552 -84022 -120721 -98896 166 15573 -96221 133658 -318985 17134 10901 -210020 -145310 -80399
15540 -80399 -42727 118193 -129139 487104 39961 151221 -150616 -183123 -94875 -119609 -28293
15528 -273105 -31640 -67686 125930 -137547 -97928 -107678 -126718 112605 -1648 20704 -92393
15516 -132307 -109138 -263527 238355 -77310 26935 238119 -77301 45370 97782 -133158 189400
15504 -169432 156951 153888 13273 -61835 -166861 258539 -426380 -24534 46526 -99666 -149794
$$ packed form
15584C18565A31146a64192k25615i0530B06891E4918K5822Q4315D8159J61948
15574B10107d71627C8083b00264O9475B22873c00307B09985d6006E4975J23530
15564A78505C9447b64886A95107i9720q1542C3945N7589k9244A188L5829d5053
15552h4022l6699K1825A66J5407i6221A33658c18985A7134o233b10020O4710O4911
15540h0399L7672A18193a29139D87104C9961J11260a50616l2507Q8248k4734b8293
15528b73105c1640l6046A25930a37547L9619r750j9040A12605a648B0704i2393
15516a32307K3169j54389B38355g7310B6935K11184g7301D5370N2412a33158A89400
15504a69432A56951l063A3273f1835j05026B58539d26380b4534D6526i9666n0128
$$ plain form
15493 -149794 109993 -57157 40103 -138637 21561 -122007 -237761 -76144 8163 -284964 12231
15481 -4904 66894 -135309 102207 205032 220693 235270 43483 -185841 -77901 -73460 -134561
15470 -134561 58702 -119744 -206621 152549 44224 203974 -33223 -218592 -122804 71864 289893
15459 289893 -234126 -96803 -470830 -175186 45107 103968 123722 -38971 52039 40278 173733
15448 173733 35760 -177209 242692 19938 52291 -56201 -156276 208228 -413126 -14820
15437 -97907 -173648 -314112 143779 -106634 -152362 112849 -37083 -48913 107132 -112259
15426 34623 -124498 -160502 -251843 103826 76265 73776 -47654 -369807 -370859 27514 56374
15415 56374 61792 -337205 34297 209654 -120961 -147536 -61613 -78220 81980 -105504 17914
$$ packed form
15493a49794A09993e7157D0103a38637B1561a22007j15754g6144H163b84964A2231
15481d904F6894a35309A02207J02825J5661J4577D3483a85841g7901M441o1101
15470a34561E8702a19744q6877A52549D4224J59750c3223j85369R5788G1864K18029
15459B89893b34126i6803l74027a75186D5107N8861J9754c8971E2039j1761J33455
15448A73733C5760a77209B42692A9938L2353e6201j00075B08228d13126a4820
15437i7907p5741j40464A43779a06634m5728A12849c7083j1830A07132a12259
15426C4623a24498l6004r1341A03826k7561k489d7654l22153j052B7514K8860
15415E6374N418c37205C4297J75357a20961k6575f1613j6607H1980a05504A7914
$$ plain form
15403 677 20803 42325 -198180 -156267 -314020 -20363 -227898 -234901 -17974 29543 173211
15392 173211 -26321 -347208 -42989 -222652 -131421 34965 64083 -67398 -93922 228054 -49615
15380 105909 329661 124061 94767 -202342 -51582 -280543 -55620 -355060 -119431 136173
15369 -125308 111058 -55911 -182460 137049 52649 154053 -153961 -67368 -158816 152895
15358 120526 86080 -15934 -286164 -406092 82451 29468 130842 93496 -101519 84807 161377
15347 161377 216828 -105454 68883 33680 -389023 -64440 -119749 14669 56811 -100179 392717
15335 89504 -138721 -25091 50482 49346 -20496 -89098 245844 105117 -42961 -111209 -113640
15324 -113640 78933 54605 -314001 -263085 -40590 72729 -324970 65006 118351 -64324 -70709
$$ packed form
15403F77K0126K1522a98180M1913j57753b0363k07535p003a7974B9543J43668
15392A73211b6321l20887d2989j79663R1231C4965K9118f7398k6524B28054d9615
15380A05909K23752A24061k9294b02342e1582k28961e5620k99440a19431A36173
15369a25308A11058e5911j26549A37049E2649J01404a53961f7368r1448A52895
15358A20526l4446a5934k70230j19928H2451B9468J01374l7346a01519H4807P6570
15347A61377N5451a05454F8883C3680c89023f4440n5309A4669M2142a00179C92717
15335H9504a38721b5091E0482j136b0496o8602B45844A05117d2961o8248k431
15324a13640G8933k4328c14001N0916d0590G2729c24970F5006N3345f4324o385
$$ plain form
15313 -70709 92635 28417 354709 273505 -133416 385 266477 87839 48818 50998 341144
15302 341144 246535 -21843 207378 65027 173275 -23559 24401 57755 -49442 275049 194592
15291 194592 -302713 225099 24129 292320 85451 -90745 261109 -31025 -133595 210129
15280 -139730 -152708 61569 -56639 174176 184332 131361 93333 183864 113693 -116556 216669
15268 129264 42001 88705 183275 -142248 57985 402159 -35517 446404 39 -333745 361914
15256 237457 -44279 98203 -223968 -194010 293917 24732 373353 292018 129021 509767
15246 509767 1554377 1740323 1391729 1901330 1471882 455333 158431 135289 15203 -97386
15235 162004 52914 4229 -155785 -321254 -149274 212017 -67220 200092 -219116 -134371
$$ packed form
15313g0709I2635B8417L26292q1204a33416C85K66092H7839l9021K180K90146
15302C41144r4609b1843B07378F5027J08248b3559B4401L3354d9442B75049q0457
15291A94592c02713B25099B4129K68191H5451i0745B61109c1025j02570B10129
15280a39730j2978F1569e6639A74176J0156n2971l8028R0531p0171a16556B16669
15268A29264D2001M6704R4570a42248E7985L44174c5517D46404C9c33745C61914
15256B37457d4279I8203b23968K9958B93917B4732L48621q1335A29021L80746
15246E09767J044610J85946l48594N09601m29448D55333A58431k3142A5203i7386
15235A62004E2914D229a55785j65469a49274B12017f7220B00092b19116Q4745
$$ plain form
15225 -134371 -449563 13447 319563 220354 -103736 21055 123898 407750 148526 71450
15214 153905 -710 -22194 -336154 1874 225576 -176677 204665 465220 92231 193208 18990
15202 61372 -203950 51764 48052 234845 179934 -30288 -111823 -48462 852 1788 79760 -384644
15189 -82970 283826 38742 -104174 113394 120586 213397 -224959 263769 -24849 164146 -182723
15177 68634 112268 115649 157480 21378 150085 81525 173890 38652 -83181 3997 201012 125111
15165 125111 196699 -68888 -22291 -7497 192827 316052 357439 79090 216460 18011 124194
15154 124194 -4925 -168254 95059 -47072 45014 232632 -32863 14388 -103877 22929 72404
15143 72404 132985 255001 25341 20728 -63904 67807 -33971 123185 197915 45966 -116061
$$ packed form
15225a34371l15192A3447L06116r9209a03736B1055J02843K83852A48526G1450
15214A53905g10k1484l13960A874K23702a76677B04665K60555I2231J00977A8990
15202F1372b03950E1764l712J86793n4911c0288q1535d8462H52R36P7972c84644
15189h2970B83826C8742a04174A13394P192R2811b24959B63769b4849A64146a82723
15177F8634M3634L381M1831B1378J28707o8560R2365C8652h3181C997J97015p5901
15165A25111P1588f8888b2291g497A92827J23225M1387G9090J37370A8011J06183
15154A24194d925j63329I5059d7072D5014J87618c2863A4388a03877B2929M9475
15143G2404O0581J22016B5341m613f3904F7807c3971A23185P4730D5966a16061
$$ plain form
15131 146613 228977 83140 182689 -99195 302746 1934 32999 20832 148203 234010 244386
15120 244386 -47200 52024 254795 -35709 -26286 69273 124364 -129603 229964 387734 429414
15109 429414 192297 244783 -81579 299529 346872 288318 46580 -83866 3426 164372 -73512
15097 124264 44915 148658 53951 -28564 390020 56518 175311 210130 4730 72770 416521
15086 416521 153185 -59402 388011 97896 294336 294230 2466 -38677 73304 -92010 -81692
15075 -81692 194287 356013 -20939 146484 85303 -125380 40597 348438 -266704 218700
15064 132974 106070 300719 -296485 19157 -97082 225007 -49873 77388 7341 59390 93996
15053 93996 32483 186289 245314 78628 397357 -195742 -92924 233723 392758 167358
$$ packed form
15131A46613Q2364H3140R9549i9195C02746A934L1065j2167J27371Q5807J0376
15120B44386d7200E2024K02771c5709R423F9273N5091a29603B29964J57770M1680
15109D29414A92297N2486h1579B99529M7343n8554D6580h3866C426J60946g3512
15097A24264D4915J03743E3951b8564C90020E6518J18793L4819D730O8040L43751
15086D16521A53185e9402C88011I7896J96440j06B466c8677G3304i2010J0318
15075h1692A94287J61726b0939A46484o1181a25380D0597L07841b66704B18700
15064A32974k6904J94649b96485A9157i7082B25007d9873G7388G341N2049L4606
15053I3996C2483J53806N9025G8628L18729a95742i2924B33723J59035A67358
$$ plain form
15042 235360 49703 144341 283692 -241594 142267 187355 105611 462038 187600 159987
15032 159987 231804 -297396 198523 -158820 167950 255444 68433 227386 162446 200799
15022 200799 234605 -21812 307600 18821 47322 215015 259700 266008 200908 493369 -45880
15010 43835 34103 69437 224039 475278 408755 68324 426963 120354 -186802 359104 54020
14998 -114457 266761 -53015 98682 82006 234845 427104 52049 370534 119383 -46106
14987 268128 410804 254159 250189 495607 114465 139323 178811 193286 -154834 358873
14976 -114807 406215 461788 176544 -67639 127172 400206 67149 264724 294422 218546
14966 218546 63236 463181 148537 89157 138024 222937 122060 411974 23381 299991
$$ packed form
15042B35360D9703R4638J39351b41594A42267M5088q1744L56427A87600k7613
15032A59987P1817b97396A98523a58820A67950Q7494F8433J58953o4940L8353
15022B00799L3806b1812C07600A8821K8501J67693M4685O308o5100K92461d5880
15010D3835r732L5334J54602K51239o6523F8324L58639A20354a86802C59104E4020
14998a14457B66761e3015I8682j6676J52839J92259E2049L18485A19383d6106
14987B68128J42676j56645l970K45418A14465K4858L9488J4475a54834C58873
14976a14807D06215N5573A76544f7639A27172K73034F7149J97575K9698p5876
14966B18546F3236L99945A48537n9380M8867Q4913j00877K89914B3381K76610
$$ plain form
14956 299991 84928 655936 231171 404640 105001 296135 354486 493401 230649 292558
14946 292558 -117998 318476 180908 189147 360369 372205 319860 431722 172400 64906
14935 3640 301397 394633 213480 -72360 560560 207419 303915 476782 160226 224810 444506
14924 444506 356253 185433 345587 145848 276956 479867 280186 -29360 419815 299328
14914 299328 221162 202895 386670 169224 183144 473325 234861 528153 -98923 305631
14903 107503 495867 7900 -38724 251411 363772 437353 113874 106221 403319 330543 261538
14892 261538 323503 119280 341525 98169 -26600 -139452 -68351 79060 259721 -33393 250102
14880 15504 -15511 201418 314561 395733 335516 225283 110685 471358 285457 339651
$$ packed form
14956B99991H4928N71008B31171J73469A05001J91134N8351J38915B30649O1909
14946B92558a17998C18476j37568Q239J71222J1836n2345J11862A72400F4906
14935C640K97757R3236j81153g2360E60560B07419R6496J72867A60226O4584K19696
14924D44506q8253j70820J60154A45848J31108K02911j99681b9360D19815j20487
14914B99328p8166j8267J83775A69224J3920K90181B34861K93292i8923C05631
14903A07503L88364G900c8724B51411J12361P3581A13874p653K97098p2776o9005
14892B61538O1965A19280K22245I8169b6600j12852f8351G9060J80661c3393B50102
14880A5504a5511B01418J13143Q1172o0217j10233A10685L60673j85901N4194
$$ plain form
14870 339651 163017 685097 -98829 102291 290749 377575 175989 76839 534103 395532
14860 395532 406245 370998 83126 325834 636722 367437 635136 482638 312265 284129
14850 284129 594896 155845 493537 402345 81833 605402 646334 633280 320673 238543
14840 238543 393430 249959 390661 456019 497391 348540 77695 619380 466090 403651
14830 403651 516023 412196 447657 415862 384198 380291 451608 455651 80197 207810 47744
14818 396501 354236 414238 712482 683619 426625 492076 511271 743529 410577 556133
14808 556133 723493 440085 478950 363008 367483 281788 367721 387137 124870 253186 468836
14797 468836 379831 321395 399406 400090 510139 648223 428142 348110 443277 217653 406876
$$ packed form
14870C39651A63017N22080i8829A02291J88458Q6826A75989G6839M57264j38571
14860C95532J0713l5247H3126K42708L10888k69285K67699j52498j70373k8136
14850B84129L10767A55845L37692r1192H1833N23569M0932j3054l12607q2130
14840B38543J54887j43471J40702O5358M1372j48851G7695N41685j53290o2439
14830D03651J12372j03827L5461l1795l1664l907P1317M043H0197J27613D7744
14818C96501m2265O0002K98244k8863k56994O5451J9195K32258l32952J45556
14808E56133J67360k83408L8865j15942M475q5695Q5933J9416A24870J28316K15650
14797D68836q9005n8436P8011O84J10049J38084k20081q0032R5167B17653J89223
$$ plain form
14786 406876 653116 247571 892762 194947 384458 509595 292766 244675 508657 412938
14776 412938 437277 475661 629282 448973 420584 402562 568920 489400 590314 710932
14766 710932 521254 743342 464171 565369 213681 779320 605547 622868 600609 649744
14756 649744 581070 789497 796418 755782 600456 636198 828219 523887 650834 730215 342038
14744 520638 508360 391034 465014 556084 868596 566193 672434 608902 486755 263682
14734 263682 648302 851619 990728 633216 633385 692797 627499 508226 344422 472958
14724 472958 812869 643164 793597 594028 908141 472905 799336 493187 755920 712197
14714 712197 1086669 856815 610414 914713 766301 615902 680392 698239 366853 747949
$$ packed form
14786D06876K46240B47571O45191A94947J89511J25137k16829m8091K63982r5719
14776D12938K4339L8384J53621j80309k8389j8022J66358p9520J00914J20618
14766G10932j89678K22088k79171J01198B13681N65639j73773J7321k2259M9135
14756F49744o8674K08427O921m0636j55326L5742J92021l04332J26947P9381C42038
14744E20638j2278j17326P3980R1070L12512l02403J06241o3532j22147k23073
14734B63682L84620K03317J39109l57512J69N9412o5298j19273j63804J28536
14724D72958L39911j69705J50433j99569L14113m35236L26431l06149K62733m3723
14714G12197L74472k29854k46401L04299j48412j50399O4490J7847l31386L81096
$$ plain form
14704 747949 689836 424060 861683 470798 623174 829766 624098 753659 755082 714171
14694 714171 793535 657590 357210 806836 971236 869920 728797 993481 733605 1166356
14684 1166356 939922 918140 787062 1007804 892014 888322 623866 748011 930703 835941
14674 835941 815989 879147 922075 879437 587604 1119778 909273 733891 1006126 615962
14664 615962 796157 987345 995350 1078160 469619 889017 498876 917034 1045166 1094086
14654 1094086 902664 1008572 1345153 871639 1098482 1066627 1039532 757257 869079 1111159
14644 1111159 1035597 1277801 1140721 917720 1210236 1157463 1005737 976015 855012 1107513
14634 1107513 1072260 1169013 1082467 823116 1007985 859214 1076119 1295602 1320067 1047275
$$ packed form
14704G47949n8113k65776M37623l90885J52376K06592k05668J29561J423m0911
14694G14171P9364j35945l00380M49626J64400j01316j41123K64684k59876M32751
14684A166356k26434k1782j31078K20742j15790l692k64456J24145J82692r4762
14674H35941j9952O3158M2928m2638k91833N32174k10505j75382K72235l90164
14664F15962J80195J91188Q005Q2810D69619M19398l90141M18158J28132M8920
14654A094086j91422J05908L36581m73514K26843l1855k7095k82275J11822K42080
14644A111159p5562K42204j37080k23001K92516n2773j51726k9722j21003K52501
14634A107513l5253R6753q6546k59351J84869j48771K16905K19483K4465k72792
$$ plain form
14624 1047275 985546 1234325 742000 1014122 1294267 1323769 971718 1312981 1295312 1262031
14614 1262031 1337064 1335282 977045 1242701 1245080 1246218 1362077 1548862 1317302 1576477 1375285
14603 1375285 1140087 1401410 1315749 1494829 1532883 1661537 1357696 1733892 1475722 1358723
14593 1358723 1549491 1600897 1667722 1654533 1527825 1458709 1526603 1594386 1659306 1481412 1720432
14582 1720432 1529189 1468637 1614100 1514554 1913432 1643746 1701876 1763535 1765538 1854656 1711922
14571 1711922 1860123 2428598 1728028 1597541 2106360 1732912 2147819 2076434 2143602 2412322
14561 2412322 2138150 2195229 2430544 2526204 2509999 2587040 2333366 2783928 2963608 3292727
14551 3292727 3671569 4417973 5755844 9165305 18903149 39982162 41180053 21329041
$$ packed form
14624A047275o1729K48779m92325K72122K80145K9502l52051L41263j7669l3281
14614A262031P5033j782l58237K65656K379J138J15859J86785k31560K59175k01192
14603A375285k35198K61323q5661J79080L8054J28654l03841L76196k58170j16999
14593A358723J90768N1406O6825j3189j26708o9116O7894O7783O4920j77894K39020
14582A720432j91243o0552J45463r9546L98878k69686N8130O1659K003Q9118j42734
14571A711922J48201N68475p00570j30487N08819l73448M14907p1385O7168K68720
14561B412322k74172N7079K35315R5660j6205P7041k53674M50562J79680L29119
14551C292727L78842P46404J337871L409461R737844K1079013J197891j9851012
$$ plain form
14543 21329041 7974304 6329756 5469352 3358139 2360637 1936100 1532897 1759135 1823532
14534 1823532 2075347 1490634 1855797 1863622 2028080 1921756 1945807 1932421 1796758 1993733
14524 1993733 1942393 1742724 1860293 1942154 1913275 2515155 2196373 2187787 2256266 2330524 2234038
14513 2234038 2477391 2368771 2404715 2440230 2364448 2401772 2454980 2679165 2480583 2328612
14503 2328612 2357418 2387207 2594810 2671272 2872569 2838662 2609932 2755208 2666925 2685644
14493 2685644 2909484 3226577 2981636 2948073 2973001 3031052 2965496 3174848 3092211 3028007
14483 3028007 3352021 3139035 3095939 3359580 3332941 3617255 3382452 3551440 3372309 3351761
14473 3351761 3605647 3588545 3509681 3728146 3897942 3772237 3823264 4058546 3829097 3822841
$$ packed form
14543B1329041G974304j644548q60404k111213r97502m24537m03203K26238O4397
14534A823532K51815n84713L65163P825J64458j06324K4051j3386j35663J96975
14524A993733n1340j99669J17569Q1861k8879O01880l18782q586O8479P4258r6486
14513B234038K43353j08620L5944L5515p5782L7324N3208K24185j98582j51971
14503B328612K8806K9789K07603P6462K01297l3907k28730J45276q8283J8719
14493B685644K23840L17093k44941l3563K4928N8051o5556K09352q2637o4204
14483C028007L24014k12986m3096K63641k6639K84314k34803J68988j79131k0548
14473C351761K53886j7102p8864K18465J69796j25705N1027K35282k29449o256
$$ plain form
14463 3822841 4223143 4009607 3968801 4189444 4189887 4285712 4089181 4298812 4367854 4395152 4590208
14452 4590208 4472110 4569985 4677562 4787377 4957697 4655565 4818074 4742055 4788288 4865386
14442 4865386 5100098 5055711 5317889 5057142 5101204 5179814 5439978 5494659 5523299 5469917
14432 5469917 5828187 5846015 5767271 5915989 6197156 6151031 6072689 6155004 6331347 6227904
14422 6227904 6620364 6302008 6458670 6675237 6977964 7075245 7175512 7221570 7412836 7488208
14412 7488208 7463095 7710694 7801165 7739684 8135129 8027665 8424041 8300795 8630381 8633186
14402 8633186 8588335 9236391 9197989 9073473 8548748 9389825 9239768 9787060 9811402 10159140
14392 10159140 10160440 10126903 10506549 10319798 11080067 11066459 11284907 11339786 11394704 11775107
$$ packed form
14463C822841M00302k13536m0806K20643M43R5825j96531K09631O9042K7298J95056
14452D590208j18098R7875J07577J09815J70320l02132J62509p6019M6233P7098
14442D865386K34712m4387K62178k60747M4062P8610K60164N4681K8640n3382
14432E469917L58270J7828p8744J48718K81167m6125p8342Q2315J76343j03443
14422F227904L92460l18356J56662K16567L02727R7281J00267M6058J91266P5372
14412G488208k5113K47599R0471o1481L95445j07464L96376j23246L29586K805
14402H633186m4851O48056l8402j24516n24725Q41077j50057N47292K4342L47738
14392A0159140J300l3537L79646j86751P60269j3608K18448N4879N4918L80403
$$ plain form
14382 11775107 12415736 12265383 12748251 13099006 12956762 13075175 13150652 14073172 13779933
14373 13779933 14411286 14744345 14651768 15065741 15609030 15648082 16183190 16377248 16420148 16984886
14363 16984886 17772272 17762612 18251152 18668941 19120635 19587527 19890127 20614913 20993352 21511403
14353 21511403 21889000 22556933 22836852 23316226 24285693 24776505 25387743 26054601 26624228
14344 26624228 27254269 27802738 28559295 29639619 30569735 31173523 32056004 32910394 33902087
14335 33902087 34814807 35821188 37011243 38255468 39492428 40571755 41829240 43337147
14327 43337147 44567539 46125969 47820257 49044391 50699321 52593914 54447181 56574854
14319 56574854 58646920 60814204 63202015 65377895 68300076 70624612 73673454 76564754
$$ packed form
14382A1775107O40629j50353M82868L50755j42244J18413P5477R22520k93239
14373A3779933O31353L33059r2577M13973N43289L9052N35108J94058M2900N64738
14363A6984886P87386r660M88540M17789M51694M66892L02600P24786L78439N18051
14353B1511403L77597O67933K79919M79374R69467M90812O11238O66858N69627
14344B6624228O30041N48469P56557J080324R30116O03788Q82481Q54390R91693
14335C3902087R12720J006381J190055J244225J236960J079327J257485J507907
14327D3337147J230392J558430J694288J224134J654930J894593J853267K127673
14319E6574854K072066K167284K387811K175880K922181K324536L048842K891300
$$ plain form
14311 76564754 79747486 82874302 86527228 90438086 94352298 98612581 103428601 108036562
14303 108036562 113371166 118524213 124608379 130362801 136997629 144454352 151847332 159704762
14295 159704762 168445463 177433511 186783291 197048124 208357800 219777040 232147804
14288 232147804 244910167 258528015 272887452 287450262 303408990 319078962 335313843
14281 335313843 352025199 368554796 384599509 400198620 415394436 429296815 441969583
14274 441969583 452340596 460136256 463041725 461778819 457139563 453212319 453911437 449083022
14266 449083022 441034031 431633138 419516585 406162023 391850260 376166329 359835767
14259 359835767 343178413 326659978 310469216 294641520 279445067 264412302 250590117
$$ packed form
14311G6564754L182732L126816L652926L910858L914212M260283M816020M607961
14303A08036562N334604N153047O084166N754422O634828P456723P392980P857430
14295A59704762Q740701Q988048R349780J0264833J1309676J1419240J2370764
14288B32147804J2762363J3617848J4359437J4562810J5958728J5669972J6234881
14281C35313843J6711356J6529597J6044713J5599111J5195816J3902379J2672768
14274D41969583J0371013P795660K905469j262906m639256l927244O99118m828415
14266D49083022q048991r400893j2116553j3354562j4311763j5683931j6330562
14259C59835767j6657354j6518435j6190762j5827696j5196453j5032765j3822185
$$ plain form
14252 250590117 238340794 226106347 213735222 202796176 192117948 181692738 172484144
14245 172484144 163859224 155695695 147824837 140404511 133659673 127086046 121344814 116049856
14237 116049856 111032073 105779266 101001516 96446291 92530449 88456059 85251623 81622090
14229 81622090 78465656 75339051 72207149 69331573 66670883 64170843 61773324 59465125
14221 59465125 57421499 55801543 53821725 51984335 49874462 48604912 46707725 45747614
14213 45747614 44296922 42646922 41477036 40039858 38730906 38114799 36988577 36005555
14205 36005555 34996087 33727464 33025294 31879698 31300686 30182799 29478367 28736638 27924458
14196 27924458 27240538 26480762 25884481 25317187 24866714 24071262 23359155 22917324 22290580
$$ packed form
14252B50590117j2249323j2234447j2371125j0939046j0678228j0425210r208594
14245A72484144q624920q163529p870858p420326o744838o573627n741232n294958
14237A16049856n017783n252807m777750m555225l915842m074390l204436l629533
14229H1622090l156434l126605l131902k875576k660690k500040k397519k308199
14221E9465125k043626j619956j979818j837390k109873j269550j897187r60111
14213D5747614j450692j650000j169886j437178j308952o16107j126222r83022
14205C6005555j009468j268623p02170j145596n79012j117887p04432p41729q12180
14196B7924458o83920p59776n96281n67294m50473p95452p12107m41831o26744
$$ plain form
14187 22290580 21646317 21060075 20782008 20309087 20010075 19353683 18899619 18714921 17992620
14178 17992620 17964591 17572603 17606239 16833067 16806196 15804267 15775004 15689242 15435767 14779541
14168 14779541 14570435 14617766 13754134 13915517 13798710 13410638 13169344 13259070 12751916 12473590
14158 12473590 12253177 12161053 11808974 11670930 11727364 11447628 10748079 10459939 10715371 10376064
14148 10376064 10410311 10305036 10117756 9845825 9641034 9271742 9377740 9223058 9091730
14139 9091730 8979502 9031687 8918781 8523091 8083634 8319671 7920285 8445145 7726326 7667236
14129 7667236 7871671 7793989 7771561 7703780 7374033 7223480 7079045 6974717 6935330 6641702
14119 6641702 6540679 6733721 6563143 6368012 6665923 6202719 6070246 6086817 5815152 6016569
$$ packed form
14187B2290580o44263n86242k78067m72921k99012o56392m54064j84698p22301
14178A7992620k8029l91988L3636p73172k6871j001929k9263q5762k53475o56226
14168A4779541k09106M7331q63632J61383j16807l88072k41294Q9726n07154k78326
14158A2473590k20413r2124l52079j38044N6434k79736o99549k88140K55432l39307
14148A0376064L4247j05275j87280k71931k04791l69292J05998j54682j31328
14139I091730j12228N2185j12906l95690m39457K36037l99386N24860p18819n9090
14129G667236K04435p7682k2428o7781l29747j50553j44435j04328l9387k93628
14119F641702j01023J93042j70578j95131K97911m63204j32473J6571k71665K01417
$$ plain form
14109 6016569 6039034 6022024 5800898 5867698 6149972 5311448 5421286 5730399 5621148 5262022
14099 5262022 5245124 5208424 4984832 5133405 5034246 5110210 4657879 4836226 4804015 4447384
14089 4447384 4333998 4634781 4522834 4857932 4538892 4544128 4179217 4584529 4490373 4452893
14079 4452893 4006270 4043221 4241835 3973730 3945278 3937553 3800956 3813528 3517176 3969545
14069 3969545 3957467 3696323 3573805 3584516 4058790 3678201 3729525 3597925 3547804 3787957
14059 3787957 3505575 3513745 3873169 3762817 3646839 2994098 3594411 2823171 3528614 3230863
14049 3230863 2896623 3126991 3312097 3344741 2977347 2888140 2757158 2701753 2712050 2484640
14039 2484640 2936662 2802407 2741483 2763605 2825508 2713308 2715375 2702054 2947509 2843393
$$ packed form
14109F016569K2465j7010k21126O6800K82274q38524J09838L09113j09251l59126
14099E262022j6898l6700k23592J48573r9159P5964m52331J78347l2211l56631
14089D447384j13386L00783j11947L35098l19040N236l64911M05312r4156l7480
14079D452893m46623L6951J98614k68105k8452p725j36597J2572k96352M52369
14069C969545j2078k61144j22518J0711M74274l80589N1324j31600n0121K40153
14059C787957k82382Q170L59424j10352j15978o52741O00313p71240P05443k97751
14049C230863l34240K30368J85106L2644l67394q9207j30982n5405J0297k27410
14039B484640M52022j34255o0924K2122O1903j12200K067j3321K45455j04116
$$ plain form
14029 2843393 2920452 2656341 2430352 2709815 2394938 2311305 2486573 2240064 2371911 2292150
14019 2292150 2390935 2101922 2582862 2434854 1964474 2255822 1816271 2231741 2390387 1865692
14009 1865692 1809568 2155398 1918597 1971644 1901243 2298126 1763885 2035568 2019472 2008241
13999 2008241 1881151 1889782 2084884 1718373 1873138 1925443 1248520 2054281 1721265 1562476
13989 1562476 2253780 3830243 11454480 33261770 43256721 27304363 13205507 7531900
13981 7531900 5600595 4503501 3363498 3462244 3130558 2782303 2276973 2469178 2421185
13972 2421185 2433092 2401616 2052055 2399556 2170854 2126827 2171609 1848871 1995644 2042079
13962 2042079 1763304 1797604 1820061 1884444 1528584 1718386 1938388 2040643 1713686 1577867
$$ packed form
14029B843393P7059k64111k25989K79463l14877q3633J75268k46509J31847p9761
14019B292150R8785k89013M80940j48008m70380K91348m39551M15470J58646n24695
14009A865692n6124L45830k36801N3047p0401L96883n34241K71683j6096j1231
13999B008241j27090Q631J95102l66511J54765N2305o76923Q05761l33016j58789
13989A562476O91304J576463P624237K1807290R994951j5952358A3205507n673607
13981G531900j931305j097094j140003R8746l31686l48255n05330J92205m7993
13972B421185J1907l1476l49561L47501k28702m4027M4782l22738J46773M6435
13962B042079k78775L4300K2457O4383l55860J89802K20002J02255l26957j35819
$$ plain form
13952 1577867 1877858 1480101 1677827 1805344 1702283 1446126 1687504 1549343 1706923
13943 1706923 1685984 1617358 1339984 1637626 1544818 1612014 1519084 1495289 1509183 1650233 1660697
13932 1660697 1389239 1420733 1399218 1424606 1425053 1370011 1332449 1200828 1244814 1272709 1456137
13921 1456137 1477034 1456957 1742369 1482932 1514176 1420296 1445131 1104147 1197184 1199900 1277313
13910 1277313 1422170 1460925 1070236 1295636 1070049 1581211 1174625 1338011 1157943 1283563
13900 1283563 1284292 1028115 1071335 1260089 1155147 1040342 1210823 1076032 1070056 1170267
13890 1170267 1166134 1070429 839477 1076197 1246613 817832 750207 1338692 943477 1102972
13880 1102972 1023683 939426 1390419 975940 1180912 876951 1118632 1231651 1060140 1041870
$$ packed form
13952A577867K99991l97757J97726J27517j03061k56157K41378j38161J57580
13943A706923k0939o8626k77374K97642r2808O7196r2930k3795J3894J41050J0464
13932A660697k71458L1494k1515K5388M47n5042l7562j31621M3986K7895J83428
13921A456137K0897k0077K85412k59437L1244r3880K4835l40984R3037K716P7413
13910A277313J44857L8755l90689K25400k25587N11162m06586J63386j80068J25620
13900A283563P29k56177M3220J88754j04942j14805J70481j34791n976J00211
13890A170267m133r5705k30952K36720J70416m28781o7625N88485l95215J59495
13880A102972p9289q4257M50993m14479K04972l03961K41681J13019j71511j8270
$$ plain form
13870 1041870 880887 963405 943109 889289 1083614 880306 694195 1145379 1029791 873568
13860 873568 686954 745049 665923 851321 940589 1166960 700722 768682 789369 829710 602928
13849 602928 961906 708074 651414 842986 785254 1126931 1164870 1179134 795422 711019
13839 711019 776600 750490 753453 847404 968740 723277 1264205 905095 1195949 802182
13829 802182 741017 700067 550470 811354 631871 706180 691288 542168 944689 634608
13819 634608 924409 571418 836702 1273066 1018091 350457 442849 552526 922648 785556
13809 785556 1057913 799139 727509 951605 716269 610766 552437 749962 927048 783122
13799 783122 429912 675463 600118 805321 730435 893912 694416 744526 624462 650394
$$ packed form
13870A041870j60983Q2518k0296n3820J94325k03308j86111M51184j15588j56223
13860H73568j86614N8095p9126J85398Q9268K26371m66238O7960K0687M0341k26782
13849F02928L58978k53832n6660J91572n7732L41677L7939J4264l83712q4403
13839G11019O5581k6110K963R3951J21336k45463N40928l59110K90854l93767
13829H02182o1165m0950j49597K60884j79483P4309j4892j49120M02521l10081
13819F34608K89801l52991K65284M36364k54975C50457R2392J09677L70122j37092
13809G85556K72357k58774p1630K24096k35336j05503n8329J97525J77086j43926
13799G83122l53210K45551p5345K05203p4886J63477j99496N0110j20064K5932
$$ plain form
13789 650394 671533 468644 649525 808733 748678 583957 765870 822056 823355 665822
13779 665822 861500 307486 462607 694453 828080 575147 521376 561620 425258 396448
13769 396448 816463 590249 416631 710840 576855 647162 808365 401291 429397 592565
13759 592565 418712 618523 858155 497031 799932 375827 482675 408166 541573 594477
13749 594477 601198 187027 634169 335988 587858 110787 583265 457909 453193 923442
13739 923442 475391 478216 549584 533731 440429 426535 453253 468398 837033 526991 489793
13728 489793 598547 209885 191830 806850 397487 722028 463775 248974 472284 675167
13718 675167 288694 503781 650809 501438 415918 118549 235920 423982 324498 251570
$$ packed form
13789F50394K1139k02889J80881J59208o0055j64721J81913N6186J299j57533
13779F65822J95678C07486J55121K31846J33627k52933n3771M0244j36362k8810
13769C96448M20015k26214j73618K94209j33985P0307J61203D01291K8106J63168
13759E92565j73853J99811K39632l61124L02901C75827J06848p4509J33407N2904
13749E94477O721A87027M47142k98181K51870A10787M72478j25356m716M70249
13739I23442m48051K825P1368j5853r3302j3894K6718J5145L68635l10042l7198
13728D89793J08754B09885j8055O15020C97487L24541k58253k14801K23310K02883
13718F75167B88694K15087J47028j49371q5520A18549J17371J88062r9484p2928
$$ plain form
13708 251570 342538 547219 365395 397565 699915 510355 389321 162742 264811 444990
13698 444990 587998 584387 412160 444575 304677 238568 265463 226261 636347 27758 545177
13687 545177 443091 267944 330981 772210 266800 531583 286458 271310 377130 440631
13677 440631 442988 483253 485161 402505 515310 452463 595663 79334 320320 523850 257109
13665 417319 358130 348876 738220 273829 474527 460847 8176 677814 397113 296268 653153
13654 653153 223080 219062 420948 469046 534587 95636 433393 756940 535462 354054
13644 354054 116224 517819 100609 375605 479840 294383 183884 460950 280316 355851
13634 355851 150502 143011 491483 111391 406624 546949 297254 548025 144714 394078
$$ packed form
13708B51570R0968K04681j81824L2170L02350j89560j21034A62742J02069J80179
13698D44990J43008l611j72227L2415j39898o6109K6895l9202M10086B7758N17419
13687E45177j02086j75147O3037M41229B66800K64783k45125j5148J05820O3501
13677D40631K357M0265J908q2656J12805o2847J43200G9334K40986K03530B57109
13665D17319n9189r254L89344B73829K00698j3680H176O69638k80701j00845L56885
13654F53153B23080m018K01886M8098O5541I5636L37757L23547k21478j81408
13644C54054A16224M01595A00609K74996J04235j85457j10499K77066j80634P5535
13634C55851A50502p491L48472A11391K95233J40325k49695K50771A44714K49364
$$ plain form
13624 394078 76508 508497 101343 164548 188040 425276 437721 370231 286121 355193 660483
13613 660483 355716 521173 167262 362425 166329 333039 131700 225653 509670 527774
13603 527774 431678 537463 163849 172904 155017 185975 -26001 211542 408920 309124 402174
13592 402174 -82436 177489 477595 146088 434278 279453 611007 552984 381345 322427
13582 322427 327209 -180917 471350 311287 275151 238884 329028 286349 94598 112356 -267644
13570 215880 369706 166525 305195 625805 268867 163344 217076 36107 515847 435548
13560 435548 353826 190356 224082 172007 506016 -147322 192405 -178331 179052 20809
13549 27238 858107 216583 457258 384071 483534 221849 123181 66535 290146 401954
$$ packed form
13624C94078G6508M31989A01343O3205K3492K37236J2445o7490q4110O9072L05290
13613F60483l04767J65457A67262J95163A66329J66710A31700R3953K84017J8104
13603E27774r6096J05785A63849R055j7887L0958b6001B11542J97378r9796R3050
13592D02174h2436A77489L00106A46088K88190j54825L31554n8023j71639n8918
13582C22427M782a80917D71350j60063l6136l6267R0144m2679I4598J7758b67644
13570B15880J53826A66525J38670L20610B68867j05523N3732C6107M79740q0299
13560D35548q1722j63470L3726n2075L34009a47322A92405a78331A79052B0809
13549B7238Q30869B16583K40675p3187R9463B21849r8668n6646K23611J11808
$$ plain form
13539 401954 299428 659982 264122 133860 257740 45212 349260 397402 92172 278901
13529 278901 267718 152842 513768 68287 103322 137110 469794 294092 414496 234977
13519 234977 111089 410811 158681 238644 279747 215463 118279 -63404 209489 64270 74650
13508 74650 587947 473318 302730 286984 150892 215602 203846 209554 527814 548316 353298
13497 353298 -116084 315774 193410 358703 991 330761 116587 349029 206581 79613
13486 20329 339071 524352 144836 51307 189705 -241542 117769 -97952 94930 390800
13476 390800 266615 55829 -14541 93878 266130 243516 198699 -1786 301079 278746 122940
13464 101020 110534 253415 -34300 199495 206931 -17757 435119 54918 196608 115611 54213
$$ packed form
13539D01954j02526L60554B64122j30262J23880D5212L04048M8142I2172J86729
13529B78901j1183j14876L60926F8287L5035L3788L32684j75702J20404j79519
13519B34977A11089K99722A58681P9963M1103o4284r7184f3404B09489F4270J0380
13508G4650N13297j14629j70588j5746j36092O4710j1756N708L18260K0502j95018
13497C53298a16084C15774j22364J65293I91L29770A16587K32442j42448G9613
13486B0329L18742J85281A44836E1307J38398b41542A17769i7952I4930K95870
13476C90800j24185E5829a4541I3878J72252k2614m4817a786C01079k2333A22940
13464A01020R514J42881c4300A99495P436a7757D35119E4918J41690q0997E4213
$$ plain form
13452 -77172 145247 245600 274912 482224 349502 -101231 276370 107885 -43998 443172
13441 15003 252524 196059 473370 -36460 261346 119547 445696 367890 -249486 355123
13430 322663 -143428 25816 186814 223606 346542 512847 30818 325180 274614 206947
13420 206947 341425 283615 273490 239904 291090 247918 400101 325025 153534 146383 273534
13409 273534 363832 86949 80455 168747 393066 192502 171840 253060 137239 307613 98940
13397 235494 172226 -28707 -13450 203274 -127036 306913 110865 74 147214 170564 -288297
13385 76022 308110 214881 100725 482219 333755 1152 167446 189793 -32476 139011 343592
13374 343592 298195 98353 370446 -76451 48156 380163 134243 185391 -18930 230543 225206
$$ packed form
13452g7172A45247J00353K9312K07312j32722a01231B76370A07885d3998D43172
13441A5003K37521n6465K77311c6460B61346A19547L26149p7806b49486C55123
13430C22663a43428B5816J60998L6792J22936J66305C0818K94362n0566o7667
13420B06947J34478n7810j0125l3586N1186m3172J52183p5076A53534p151J27151
13409B73534R0298H6949o494Q8292K24319A92502k0662Q1220j15821J70374I8940
13397B35494o3268b8707a3450B03274a27036C06913A10865G4J47140K3350b88297
13385G6022K32088r3229A00725L81494j48464A152J66294K2347c2476A39011K04581
13374C43592m5397I8353K72093g6451D8156L32007A34243N1148a8930B30543n337
$$ plain form
13363 225206 -130762 137400 188321 44256 -26325 375042 497734 293017 -95523 308110
13352 554154 165331 318128 171330 210068 249528 204006 182627 74707 71258 261564 519310
13341 519310 237871 193888 366402 300361 -132933 357203 146720 235483 476513 -86877
13330 257981 -130163 55479 -110717 -18074 135126 -88836 200866 -24047 269801 243775
13320 243775 -82949 -237356 -131208 92407 174297 206450 338555 -46442 -41860 204992 -42981
13308 308667 76490 151711 336396 1603 180466 204411 -30101 -14271 -92389 244286 -38824
13296 131251 22002 94035 331968 234979 346164 -33316 340818 162825 489370 96991
13285 516605 40431 87214 -60637 117443 276257 61866 347761 483207 595461 -3302 57544
$$ packed form
13363B25206a30762A37400N0921D4256b6325C75042J22692k04717i5523C08110
13352E54154A65331J52797j46798L8738L9460m5522k1379G4707l449J90306K57746
13341E19310B37871m3983J72514o6041a32933C57203A46720Q8763K41030h6877
13330B57981a30163E5479a10717a8074A35126h8836B00866b4047B69801k6026
13320B43775h2949j54407J06148I2407Q1890L2153J32105d6442M582B04992d2981
13308C08667G6490P5221J84685A603J78863K3945c0101a4271p8118B44286c8824
13296A31251B2002P2033K37933r6989J11185c3316C40818A62825L26545I6991
13285E16605D0431M6783f0637A17443J58814F1866K85895J35446J12254c302E7544
$$ plain form
13273 109821 139232 9269 -16919 153974 -75928 33586 107580 145436 206990 145459 75169
13262 75169 60411 -138996 396720 139299 153918 134835 211844 105238 -1563 -154603 296559
13250 131450 -176654 504927 12912 8396 -166572 -224803 319871 -169148 330651 152773
13239 228795 160457 223308 174916 -263936 123531 129938 -136237 139458 -905 70140 70883 255665
13227 255665 -10323 256612 193478 458764 313715 176171 352361 -280448 70155 62120
13217 62120 -1300 326273 10943 -91955 -9537 -184492 397258 166736 234488 -6319 -80004
13206 -80004 103569 15442 17059 91402 351623 -101416 217759 -92328 -1105 85787 77083
13195 77083 191871 -22858 -68583 279614 -33314 298701 58391 172828 101678 76246 247051
$$ packed form
13273A09821K9411I269a6919A53974g5928C3586P3994L7856O1554o1531p0290
13262G5169j4758a38996C96720A39299J4619j9083P7009A05238a563j53040B96559
13250A31450a76654E04927A2912m516a66572n8231C19871a69148C30651A52773
13239B28795o8338O2851m8392b63936A23531O407a36237A39458i05G0140P43J84782
13227B55665a0323B56612o3134K65286j45049j37544J76190b80448G0155q035
13217F2120a300C26273A0943i1955i537j74955C97258A66736O7752f319p3685
13206h0004A03569A5442J617P4343K60221a01416B17759i2328a105H5787q704
13195G7083J14788b2858m5725B79614c3314B98701E8391J14437p1150k5432J70805
$$ plain form
13184 247051 315204 23560 211544 49074 31215 88804 122355 -103681 -255328 52120 48876
13173 48876 -16861 136608 118565 146162 13978 145639 -81628 -133697 107494 35670 194946
13162 194946 -6291 114427 -21691 552868 234211 143892 73032 51209 -80393 108735 633
13150 62576 548412 -62186 110675 -9700 -18295 393632 352872 1147 -68693 -112790 -132194 8567
13137 -114630 -100904 30707 393091 12290 226703 75914 -326944 16803 -207163 24105 -162085
13125 139517 -76035 307332 -142272 -52828 61010 -150789 59629 39357 29234 24734 -43047
13113 43376 526084 -257732 172696 118169 61278 -35477 -62776 323118 87194 221333 117838
13102 117838 -118393 232270 99368 -98012 139432 357488 85049 263512 -12865 -89440
$$ packed form
13184B47051O8153B3560J87984D9074j7859N7589L3551a03681j51647E2120l244
13173D8876a6861A36608j8043K7597A3978J31661h1628n2069A07494C5670J59276
13162A94946f291A14427b1691E52868B34211r0319p0860k1823h0393A08735F33
13150F2576M85836f2186A10675i700q595C93632m0760A147f8693m4097j9404H567
13137a14630J3726C0707L62384A2290K14413G5914c26944A6803b07163B4105a62085
13125A39517g6035C07332a42272e2828F1010a50789E9629k0272j0123m500d3047
13113D3376M82708b57732A72696n4527n6891c5477k7299C23118H7194J34139j03495
13102A17838a18393B32270I9368i8012A39432K18056H5049J78463a2865p6575
$$ plain form
13092 -89440 110833 -66032 -174650 207681 224338 195702 143298 195401 -215031 -39257 -51871
13081 -51871 623636 183485 312438 -309060 -179329 181642 156192 -17249 -393476 151028
13070 77623 208353 90829 171686 131158 -116920 36410 10876 223474 267501 31956 24885
13059 24885 272509 128826 342461 -161024 159510 20469 -122044 223061 37767 9513
13048 323359 261953 80534 -81158 -153185 196219 288289 277586 244599 -150021 330308 -75433
13036 -133861 -152556 -10924 378141 -104385 137610 98665 216131 -97444 -107440 27895 -86400
13024 -143907 164832 -213898 -27625 86302 -36424 339734 472698 -12528 100668 74115
13014 74115 145367 416133 161381 84039 -90915 144486 68616 379437 -64314 116310 1153
$$ packed form
13092h9440A10833f6032j08618B07681J6657k8636n2404N2103b15031c9257j2614
13081e1871F23636A83485J28953c09060J29731A81642k5450a7249l76227A51028
13070G7623J30730I0829Q0857m0528a16920C6410A0876K12598M4027C1956p071
13059B4885K47624A28826K13635a61024A59510B0469a22044B23061C7767I513
13048C23359o1406H0534h1158p2027A96219R2070j0703l2987a50021C30308g5433
13036a33861j8695a0924C78141a04385A37610l8945J17466i7444r996B7895h6400
13024a43907A64832b13898b7625H6302c6424C39734J32964a2528A00668k6553
13014G4115P1252K70766A61381p7342i0915A44486F8616L10821f4314A16310A153
$$ plain form
13002 201340 8250 113040 73327 -183464 42470 127298 187375 -66171 338403 423382 39666
12990 81667 -18593 94522 -3292 -128395 337359 -22240 196334 246749 101098 301957 -32436
12978 -56517 45002 34928 -86289 -194659 90790 85845 201132 301983 325491 103813 175733
12967 175733 53564 -229969 89811 -64474 -167857 117540 64484 53468 63441 -139968 112786
12955 147187 85942 122818 132355 -57300 276579 31561 216382 -130025 174015 -313916 -10064
12943 97395 113795 167158 135821 -17863 -164369 -42538 399456 226931 -38827 67970 36799
12932 36799 3904 113265 -102342 -86779 261150 -77313 185285 -182997 -39788 45539 68715
12921 68715 -255614 -138914 120348 368527 -65664 59966 -21996 -43739 8253 56540 -400779
$$ packed form
13002B01340H250J04790l9713a83464D2470Q4828O0077f6171C38403Q4979C9666
12990H1667a8593I4522c292j25103C37359b2240A96334N0415A01098K00859c2436
12978e6517D5002j0074h6289j08370I0790m945J15287J00851K3508A03813P1920
12967A75733E3564b29969H9811f4474j03383A17540n3056j1016R973a39968A12786
12955A47187o1245L6876R537e7300B76579C1561J84821a30025A74015c13916a0064
12943I7395J6400N3363l1337a7863j46506d2538C99456j72525c8827F7970l1171
12932C6799C904J09361a02342J5563B61150g7313A85285a82997c9788D5539K3176
12921F8715b55614J16700A20348K48179f5664E9966b1996k1743H253M8287d00779
$$ plain form
12909 -165858 -243763 147090 -195436 239582 76714 256001 -96644 210132 -277613 73077
12898 226186 13763 -8435 54411 -171211 -188942 -26091 -169006 85668 -187546 -200195 104805
12886 63946 419918 199635 85804 -454965 -159877 194959 -33803 43078 350250 -32455
12875 -6835 -209641 -99867 -117678 -41515 -64789 -228833 183814 -116932 35413 24806 -183490
12863 85254 -1487 120678 92976 -28123 85107 325109 -38608 56345 -123142 92211 9530
12851 -251472 142312 -66367 -68744 9691 -167688 70646 -37961 427927 396337 71282 -217 284387
12838 -151556 32810 209351 -124600 214831 -158539 26053 73043 -172934 -165774 -111389 81172
12826 -50395 -110406 222450 -25831 239338 -118698 61705 -188330 -39525 204120 40323 168970
$$ packed form
12909a65858p7905A47090a95436B39582G6714J79287i6644B10132b77613G3077
12898B26186A3763h435E4411a71211j7731b6091j42915H5668a87546j2649A04805
12886F3946L55972A99635H5804d54965a59877A94959c3803D3078L07172c2455
12875f835k02806i9867j7811d1515k3274j64044A83814a16932C5413j0607a83490
12863H5254a487A20678k7702b8123H5107K40002c8608E6345a23142I2211I530
12851b51472A42312f6367k377I691a67688G0646c7961D27927l1590G1282b17B84387
12838a51556C2810J76541a24600B14831a58539B6053M6990a72934P160N4385H1172
12826e0395o0011B22450b5831B39338a18698F1705a88330c9525B04120D0323J28647
$$ plain form
12815 168970 79034 -38490 -105447 -53311 124806 -205159 -9159 -101401 247518 -236527 -88237
12803 -139804 43308 -12188 -104407 -119633 84687 -67200 -30503 -159214 29231 -166071 78105
12791 68286 -25319 42447 23779 102708 33141 -139080 169660 -51874 -37546 -68802 -334120
12780 -334120 -32472 7759 64459 -155658 281003 329944 50174 -23220 -132398 109326 -192188
12768 -39132 150637 -11745 166944 -128805 99349 19748 -3676 -89145 -27895 216362 286147
12757 286147 236039 -47588 -79335 308435 -331228 -136632 112555 -173385 877 38837 31449
12746 31449 -222020 203340 33008 134703 -79370 -61287 123794 -20689 397852 230683
12736 230683 154019 239822 323792 -30071 225911 288536 11173 359921 2940 154069 128872
$$ packed form
12815A68970G9034c8490o6957N2136A24806b05159i159r2242B47518b36527h8237
12803a39804D3308a2188r2219j5226H4687f7200c0503j28711B9231a66071G8105
12791F8286b5319D2447j8668P8929C3141a39080A69660e1874J4328l1256k65318
12780c34120c2472G759N6700a55658B81003M8941E0174b3220j09178A09326a92188
12768c9132A50637a1745A66944a28805I9349A9748c676q5469b7895B16362O9785
12757B86147n0108d7588l1747C08435c31228a36632A12555a73385H77L7960p388
12746C1449b22020B03340C3008J01695g9370J8083A23794b0689C97852j67169
12736B30683p6664Q5803Q3970c0071B25911O2625A1173L48748B940J51129k5197
$$ plain form
12725 128872 147008 88164 -238012 -242077 70704 -34893 -124018 -81360 105699 163072 -200603
12713 -193046 30379 282600 133971 170034 25413 233586 150553 -36159 351355 156127
12702 66302 334835 335360 137605 74260 67389 9151 106095 69418 4196 -277147 99654 28092
12689 -125145 203300 163507 80599 342440 93710 -229082 139064 82654 118474 158316 -59511
12677 234269 417071 -91590 201739 128587 129655 -110072 224735 -252988 80704 -83534 209800
12665 -12958 61824 121860 60155 102130 354586 -13079 -7407 -61778 381418 131667 5679
12653 82866 -83627 300680 315409 139073 138771 -29134 493862 28184 66444 14939 -82197
12641 35004 -216336 168711 336109 276474 26896 -68889 115839 102309 22238 -101481 162544
$$ packed form
12725A28872J8136n8844b38012m065G0704c4893q9125M2658A05699N7373b00603
12713a93046C0379K52221A33971L6063B5413K08173q3033c6159C51355A56127
12702F6302K68533N25A37605o3345o871I151R6944l6677D196b77147I9654B8092
12689a25145B03300l9793H0599K61841I3710b29082A39064n6410L5820L9842e9511
12677B34269J82802i1590B01739p3152J068a10072B24735b52988H0704h3534B09800
12665a2958F1824O0036F0155M1975K52456a3079N672n4371C81418A31667E679
12653H2866h3627C00680J4729A39073l02b9134D93862B8184L8260A4939h2197
12641C5004b16336A68711J67398n9635B6896f8889A15839j3530B2238a01481A62544
$$ plain form
12629 545354 64493 158519 181357 99490 57376 48067 132478 95223 378153 251307 131580
12618 131580 -321049 -93613 149875 -251962 -76840 -11708 -48357 -204759 326385 -186605
12607 -281767 268926 47993 -40272 46398 -81569 252508 340604 455641 170270 28188 -74051
12595 351444 182492 282791 223244 132391 36489 -162761 -288341 102130 56470 105046
12585 105046 -18506 88535 -142036 91718 149170 10910 -149235 319484 -94700 9947 79135
12574 79135 -114738 266038 145088 -164925 88097 206485 135704 -82996 4516 278577 202787
12563 202787 -269591 525853 -26206 -264364 -403608 46641 10439 -41278 21007 76624 242714
12552 242714 266163 130454 -67689 58350 128757 210456 164164 11914 20516 377017 -70954
$$ packed form
12629E45354F4493R4026K2838q1867m2114r309Q4411l7255K82930j26846j19727
12618A31580c21049i3613A49875b51962g6840a1708l6649j56402C26385a86605
12607b81767B68926D7993d0272D6398h1569B52508Q8096J15037A70270B8188g4051
12595C51444j68952J00299n9547r0853C6489a62761j25580A02130m5660M8576
12585A05046a8506H8535a42036I1718N7452A0910a49235C19484i4700I947O9188
12574G9135a14738B66038j20950a64925H8097J18388p0781h2996D516K74061p5790
12563B02787b69591E25853b6206k38158j39244D6641A0439d1278B1007N5617J66090
12552B42714K3449A30454f7689E8350P0407Q1699m6292A1914Q602L56501g0954
$$ plain form
12540 -273573 71845 2311 213996 -268199 -243883 160018 -7173 18166 -129095 -255891 129018
12528 -249450 400503 24668 189122 -245813 82964 28677 191648 161885 -24019 -124521
12518 -124521 -147170 -132670 -2181 209453 31344 42808 -24113 -31525 -14709 -139623 -12727
12506 -37473 219292 155517 154658 -35416 -161165 333634 129061 164028 33254 -38135 371208
12494 186512 154191 32535 -40074 -147688 329679 -176964 173253 247550 44213 -281051
12483 -111867 27613 -334591 79638 178982 139053 236836 57685 -264998 226169 37170 349635
12472 349635 -86142 266515 -50972 -110016 -106586 -110173 -360346 -186995 -80761 -53626 -206183
12461 -206183 -117017 151835 54689 -56428 363349 112434 95666 -25076 139718 163253 -80897
$$ packed form
12540b73573G1845B311K11685b68199K4316A60018g173A8166a29095j26796A29018
12528b49450D00503B4668J64454b45813H2964B8677J62971k9763b4019j00502
12518a24521k2649J4500b181B09453C1344J1464b4113p412a4709j24914a2727
12506c7473B19292o3775q59c5416j25749C33634A29061L4967C3254c8135C71208
12494A86512l2321C2535d0074j07614C29679a76964A73253P4297D4213b81051
12483a11867B7613c34591G9638R9344l9929R7783E7685b64998B26169C7170L12465
12472C49635h6142B66515e0972n9044L430l587k50173J73351h0761K7135j52557
12461b06183Q9166A51835E4689e6428C63349A12434j6768b5076A39718K3535h0897
$$ plain form
12449 -75808 163544 222641 -209632 27491 139133 -243276 176860 115055 -287296 -61370
12438 -78967 241230 -357614 60921 -114237 -281442 -131375 508695 70075 76143 35268 -119556
12426 29505 226614 -208371 177959 -62453 -113813 47660 -101079 87052 215193 161034 -119364
12414 73909 -46275 283115 -145549 147430 -170812 -6096 -101114 71335 34217 76790 -75368
12402 -145569 78186 -311101 163179 -18259 239367 -195588 -241455 -1194 195380 60209 174474
12391 174474 270767 67130 -45031 -177016 -217877 -79951 89329 3744 57741 187435 -56996
12379 -34181 5999 -51002 -62844 -92928 157553 26460 51674 106326 281129 32984 44438
12368 44438 -72159 44190 140028 -142958 117169 -112872 177199 29984 211897 -44328 -159761
$$ packed form
12449g5808A63544N9097b09632B7491J11642b43276A76860o1805b87296f1370
12438g8967B41230c57614F0921a14237j67205a31375E08695G0075O068C5268a19556
12426B9505J97109b08371A77959f2453n1360D7660a01079H7052J28141n4159a19364
12414G3909d6275B83115a45549A47430a70812f096r5018G1335C4217M2573g5368
12402a45569G8186c11101A63179a8259B39367a95588m5867a194A95380F0209J14265
12391A74474R6293F7130d5031j31985m0861g9951H9329C744N3997J29694e6996
12379c4181E999e1002j1842l0084A57553B6460K5214N4652J74803C2984J1454
12368D4438g2159D4190R5838a42958A17169a12872A77199B9984J81913d4328j15433
$$ plain form
12357 -159761 -116285 15087 -133069 372708 -31437 20701 97001 -55022 -98110 125106 -188375
12345 313973 272728 -3981 78713 85231 24118 69678 -233691 251330 259772 205878 258832 58035
12332 -198687 -189043 -180389 162213 -131949 -153440 13639 -222469 74998 -17062 -122203 154166
12320 -296308 247489 -190117 30564 295598 83418 -47031 -68918 114495 197174 47249 205269
12309 205269 18421 6740 11150 79413 43975 69979 42203 -298187 -10377 162235 -97967
12297 -160877 90580 60158 96206 225634 -50721 -108729 -78645 90464 56107 39369 8175
12285 87086 130458 -155862 116509 301915 66998 233852 208604 225316 -87470 -108270 48186
12273 341320 84610 468462 300403 56379 125048 51116 243702 -1752 123881 -128359 188198
$$ packed form
12357a59761M3476A5087a33069C72708c1437B0701P6300e5022m3088A25106a88375
12345C13973m1245c981G8713O518B4118M5560b33691B51330Q442n3894N2954E8035
12332a98687R644Q654A62213a31949k1491A3639b22469G4998a7062j05141A54166
12320b96308B47489a90117C0564K65034H3418d7031k1887A14495Q2679D7249J58020
12309B05269A8421F740M410O8263l5438K6004k7776b98187a0377A62235i7967
12297a60877I0580l0422L6048J29428e0721n8008L0084I0464l4357j6738H175
12285H7086M3372a55862A16509J85406F6998J66854k5248J6712h7470k0800D8186
12273C41320H4610L83852j68059E6379O8669E1116J92586a752A23881a28359A88198
$$ plain form
12261 213539 87760 42466 -95561 86599 -319867 117947 28894 65147 70229 208424 438662
12250 438662 144758 58447 16295 8074 88922 -185261 -51390 26785 -902 19654 -38628 -313611
12238 -313611 213052 -107274 -55997 190568 152984 272848 26442 21931 139440 290391
12228 290391 130657 242832 -3709 -36646 51895 199592 85326 571111 268412 244970 146827
12217 146827 -41096 285592 11206 185657 180026 45039 18846 229321 95351 501854 68738
12205 37041 84163 146538 87646 238631 405087 95631 419850 69360 39290 61618 305110
12194 305110 -207861 195347 16623 129047 488494 16308 148994 57310 292320 105613
12183 125452 -105924 60327 146726 45735 -96059 -44416 87901 110025 234678 510922 33844
$$ packed form
12261B13539H7760D2466i5561H6599c19867A17947B8894L6253N082J38195K30238
12250D38662A44758E8447A6295H074Q0848a85261e1390B6785i02A9654c8628k74983
12238c13611B13052a07274N1277A90568l7584J19864B6442m511J17509J50951
12228B90391A30657J12175c709l2937E1895J47697H5326M85785B68412k3442r8143
12217A46827d1096B85592A1206J74451n631D5039A8846K10475I5351M06503F8738
12205C7041M7122O2375n8892J50985J66456I5631L24219F9360l0070K2328K43492
12194C05110b07861A95347A6623J12424L59447A6308J32686E7310K35010A05613
12183A25452a05924F0327Q6399D5735i6059d4416H7901K2124J24653K76244C3844
$$ plain form
12171 -92559 203172 -167046 24971 -21555 313767 233007 -116155 209635 34052 112914 282880
12160 282880 4970 148203 340387 -46291 449279 -49247 30103 208077 -27126 57578 214995
12149 214995 357622 -7874 81959 -135373 -238506 122946 362915 138818 171783 58638
12138 137136 -45161 -323386 127030 32973 -70160 104632 -52012 55112 231805 -165716
12127 -200600 -153709 -157925 -96414 382267 -290833 41042 -19900 -68295 -199541 30101 68936
12116 68936 -30676 -104248 168636 -44396 -114180 14548 70619 -105003 218731 -133004 -60570
12104 21983 154741 109761 -88432 259752 14407 162771 141044 -24115 293222 1514 -204879
12092 10098 33304 -190680 102731 -99577 261594 240435 -73007 165736 -447572 130104
$$ packed form
12171i2559B03172a67046B4971b1555C13767q0760a16155B09635C4052P8862J69966
12160B82880D970J43233J92184d6291D49279d9247C0103J77974b7126E7578J57417
12149B14995J42627g874H1959a35373j03133A22946K39969A38818L2965E8638
12138A37136d5161k78225A27030C2973g0160A04632e2012E5112J76693a65716
12127b00600M6891m216O1511C82267b90833D1042a9900m8395j31246C0101L8835
12116F8936c0676p3572A68636d4396o9784A4548N6071a05003B18731a33004f0570
12104B1983J32758m4980h8432B59752A4407J48364k1727b4115B93222A514b04879
12092A0098K3206a90680A02731i9577B61594k1159g3007A65736d47572A30104
$$ plain form
12081 -283449 -183899 -38629 -25692 107556 59948 135200 695489 2022695 1577679 710789
12070 292028 113707 239207 276636 280378 168370 341749 -152560 43560 154585 147319 152428
12059 152428 -62670 -73709 483685 -52822 31032 -131651 85513 258951 17765 -202593 -24824
12047 33159 10180 -66031 -391490 250458 62742 -83824 -224737 -92923 273003 133662 71129
12036 71129 139154 65844 -293851 87607 81736 411924 -415316 -204221 160872 -28491 127167
12024 -183509 -101724 6963 86071 52189 5468 -322 49029 -174281 -96150 -107349 -246791 105838
12011 32227 -288521 -308843 213051 -144454 -148768 -35899 -7459 84423 210665 -238581 -187264
12000 -187264 217858 307279 -84901 -228873 -3175 -281879 275965 -5706 -33405 -217566 -367257
$$ packed form
12081b83449R9550c8629J2937A07556m7608P5252N60289J327206m45016G10789
12070B92028A13707J25500L7429L742j12008J73379a52560D3560J11025p266N109
12059A52428f2670j1039D83685e2822C1032a31651H5513J73438A7765b02593b4824
12047C3159A0180f6031l25459B50458F2742h3824j40913i2923B73003A33662o2533
12036G1129O8025F5844b93851H7607n871L30188d15316b04221A60872b8491A27167
12024a83509Q1785F963P9108l3882E468c22D9029a74281P8131j1199j39442A05838
12011C2227b88521k0322B13051a44454m314c5899g459H4423J26242b38581N1317
12000a87264B17858Q9421h4901j43972c175k78704B75965e706k7699j84161j49691
$$ plain form
11989 -367257 -149598 -112794 -16723 118438 320065 -211954 -26060 -581032 109275 141960
11979 141960 -155812 -255915 12754 47279 -130400 9120 -158946 10483 247132 -170450
11968 -124277 -188887 104552 -5620 -73450 454282 -93370 70622 -225652 -123813 216768 77744
11956 98788 -74300 -277979 -67401 103558 -148490 -17785 -64287 -19470 117999 35485 -51743
11944 -311808 32433 40280 -126006 189641 208342 -107307 -199401 -69485 151061 -179244 -198541
11933 -198541 -281075 328121 -206164 -109972 -122911 -118911 -320971 310006 67428 -3494 12994
11921 139841 -124028 19409 69833 -67525 137445 91771 435382 147588 27214 16366 102551
11910 102551 139125 -490709 26422 -173391 80274 108612 136556 168522 -258957 -139203 38537
$$ packed form
11989c67257a49598L6804a6723A18438K01627b11954b6060n54972A09275L2685
11979A41960a55812j00103A2754L4525a30400I120a58946A0483K36649a70450
11968a24277o4610A04552e620o7830D54282i3370G0622b25652J01839B16768G7744
11956I8788g4300k03679f7401A03558a48490a7785m6502a9470A17999C5485e1743
11944c11808C2433P847a26006A89641J8701a07307r2094f9485A51061a79244j9297
11933a98541q2534C28121b06164R6192j2939M000k02060C10006F7428c494A2994
11921A39841a24028A9409N0424f7525A37445m5674L43611A47588B7214j0848Q6185
11910A02551L6574d90709B6422a73391H0274K8338K7944L1966b58957J19754C8537
$$ plain form
11898 -17024 84472 -5798 150590 98843 -179069 144819 -40176 184881 167638 3521 -92325
11886 49697 241533 154117 -129880 115023 -245045 -150715 -77395 325069 -236505 -102833
11875 -129487 -8465 270431 -22053 54400 -122692 -150049 -107154 -143145 134571 -138788 -119723
11864 -119723 282057 -134024 -227170 21348 -223176 -84011 -74132 302114 21779 -292741 58697
11852 183576 -121414 -121701 -124819 -83233 98421 -217753 5082 60738 39592 -219520 47775 -104906
11839 -237949 10630 178467 55127 -9897 -59127 294452 -153879 -164466 -488230 153708 -121736
11827 286493 -66441 -151914 -133926 28367 -42447 -173344 -83625 -9154 -61736 -335037 15610
11815 214255 225263 362434 90905 -153078 97251 -122642 -194460 -233958 82219 -55659 -338089
$$ packed form
11898a7024H4472e798A50590n1747a79069A44819d0176A84881j7243C521i2325
11886D9697J91836q7416a29880A15023b45045R4330P3320C25069b36505a02833
11875a29487h465B70431b2053E4400a22692k7357M2895l5991A34571a38788J9065
11864a19723B82057a34024r3146B1348b23176h4011R879C02114B1779b92741E8697
11852A83576a21414k87l118M1586I8421b17753E082N5656k1146b19520D7775a04906
11839b37949A0630J67837E5127i897m9230B94452a53879j0587l23764A53708a21736
11827B86493f6441q5473J7988B8367d2447j30897h3625i154n2582k73301A5610
11815B14255J1008J37171I0905a53078I7251a22642p1818l9498H2219e5659k82430
$$ plain form
11804 -338089 -349141 -168192 -177164 -145536 141560 272902 -29099 -301013 103760 -215873
11793 282184 307192 -2708 124057 162921 198730 63330 305220 206471 -93561 25606 -162174
11781 96247 -24525 237117 -267913 3660 327883 114781 -97631 -109863 252344 -13514 -314334
11770 -314334 -116388 -174390 -119806 235846 101611 -28447 15638 -12775 -127497 210467
11759 33679 160678 -182778 172628 9028 192488 19093 129687 140808 200438 -15995 -37348
11748 -37348 -140661 -118850 -21196 -67025 -47682 -71645 -53035 337723 -161446 22491 -238395
11736 432304 -226958 -78791 -263009 34331 215530 -208676 474025 100744 283671 -385741
11725 11741 33704 -17643 59155 336443 124562 168865 43595 204444 487427 1973 174093
$$ packed form
11804c38089j1052a68192q972L1628A41560J31342b9099k71914A03760b15873
11793B82184K5008b708A24057L8864L5809F3330K41890r8749i3561B5606a62174
11781I6247b4525B37117b67913C660L24223A14781i7631j2232B52344a3514l00820
11770c14334a16388n8002N4584B35846A01611b8447A5638a2775j14722B10467
11759C3679J26999a82778A72628I028J83460A9093J10594J1121N9630a5995k1353
11748c7348j03313K1811b1196m5829J9343k3963J8610C37723a61446B2491b38395
11736D32304b26958g8791j84218C4331J81199b08676D74025A00744J82927c85741
11725A1741K1963a7643E9155K77288A24562M4303D3595J60849K82983A973J72120
$$ plain form
11714 174093 162356 44226 -2684 77875 77972 63183 62041 303504 15860 -224493 -120972 -132436
11702 -132436 -107986 -60043 235210 133887 100116 -78066 28423 -246281 393338 259548
11692 259548 229881 10147 121751 -27294 -39153 491886 69222 355406 -2509 -7807 177977
11680 434651 304954 -110729 320383 -105215 -28647 60487 -149031 -170873 10922 100093
11670 100093 -63666 -344469 59842 -69392 185872 71943 -68999 53667 109280 180009 227697
11659 227697 -160592 -59742 -122464 287954 -447079 -100348 77612 75863 182286 230389 -362539
11647 140619 126276 359441 -164607 -149633 -90717 68993 189025 43916 -18217 -234509 -160382
11636 -160382 -172813 11739 -146373 -59520 53065 27678 42362 199215 -12483 -16682 111920
$$ packed form
11714A74093j1737D4226b684G7875R7j4789j142K41463A5860b24493J03521j1464
11702a32436K4450M7943B35210j01323l3771g8066B8423b46281C93338j33790
11692B59548k9667A0147J11604b7294j1859D91886F9222K86184b509n298A77977
11680D34651j29697a10729C20383a05215b8647F0487a49031k1842A0922Q9171
11670A00093f3666k80803E9842f9392A85872G1943f8999E3667N5613P0729M7688
11659B27697a60592e9742o2722B87954d47079a00348G7612j749J06423M8103c62539
11647A40619j4343K33165a64607J4974N8916F8993J20032D3916a8217k16292P4127
11636a60382j2431A1739a46373e9520E3065k5387J4684J56853a2483m199A11920
$$ plain form
11624 -127996 92745 128065 -17804 -328426 84736 179138 -43423 13238 -263142 321812 -18808
11612 289121 -72900 -69239 -170318 3553 363423 -301656 337151 -243067 115758 46080 185585
11601 185585 77313 48688 51431 172011 -127848 24494 -15046 -162312 132968 -105164 -34407
11589 81875 195851 315114 22444 -5115 -49220 17843 14744 228418 131897 -217838 118228
11577 131161 -138473 -178392 -288912 16432 -97027 -166376 23992 5915 -238226 362487 152502
11565 115666 76937 122959 73610 -25253 -332439 126601 -2492 14225 -43410 64980 -70595
11553 190565 348627 -43889 -91374 261269 228538 176460 145669 132447 -18274 59497 168396
11542 168396 435963 -71705 710 -162550 54334 -87912 253914 350193 -32576 -129828 16343
$$ packed form
11624a27996I2745L5320a7804l10622H4736R4402d3423A3238b63142C21812a8808
11612B89121g2900L661j01079C553L59870c01656C37151b43067A15758D6080J39505
11601A85585G7313k8625K743J20580a27848B4494a5046j47266A32968a05164c4407
11589H1875J13976J19263B2444e115m4105A7843l099K13674r6521b17838A18228
11577A31161a38473l9919j10520A6432i7027o9349B3992E915b38226C62487A52502
11565A15666l8729M6022m9349b5253l07186A26601b492A4225d3410F4980g0595
11553A90565J58062d3889m7485B61269l2731n2078l0791j3222a8274E9497J08899
11542A68396K67567g1705G10a62550E4334h7912B53914R6279c2576r7252A6343
$$ plain form
11530 246830 -233144 73763 373050 55851 35651 -9096 22489 128725 281553 -60803 296343
11518 -144684 490225 134728 -4499 142562 -82778 -139079 26471 177965 180848 243419 109916
11506 38684 120066 244306 -38987 131227 36800 188639 35689 -38846 265525 -107536 476939
11494 299933 172676 -69010 299923 47847 202107 167594 47764 122741 261811 289798 4686
11482 -262688 -22411 153069 -45246 64134 -11602 -52063 263373 95685 148621 24835 -122609
11470 457533 224982 324979 303428 109119 162295 55068 829 137933 186452 17437 -10972
11458 -184354 -124296 28967 144724 73282 429352 133546 -90121 -44277 59822 60570 447960
11447 447960 252686 51845 95841 304476 42764 -157594 -190953 60444 185493 -32705 39005
$$ packed form
11530B46830b33144G3763K99287E5851k0200i096B2489J06236J52828f0803B96343
11518a44684D90225A34728d499A42562h2778n6301B6471J51494K883O2571A09916
11506C8684Q1382J24240c8987A31227C6800J51839C5689c8846B65525a07536D76939
11494B99933j27257f9010B99923D7847J54260l4513D7764P4977J39070K7987D686
11482b62688b2411A53069d5246F4134a1602m0461B63373I5685N2936B4835a22609
11470D57533B24982R9997k1551A09119N3176E5068H29J37104M8519A7437a0972
11458a84354O0058B8967J15757p1442L56070A33546i0121d4277E9822P48L87390
11447D47960j95274E1845M3996K08635D2764a57594l3359F0444J25049c2705C9005
$$ plain form
11435 85442 50693 -141313 310259 -52299 -138388 -30082 175472 193636 144955 -288648 97488
11423 20713 232489 246127 325507 56997 -170189 -90508 102816 93412 -110045 352419 -355464
11411 -169398 -140769 135540 -137714 -115833 -13356 95072 110596 -20008 98033 106905 32478
11399 213628 76724 -89939 274067 -37622 -307804 251532 -57540 197699 133100 -341503
11388 -72659 -121384 98147 90732 -50256 -136719 -37660 223301 54808 62201 281975 355492 -128049
11375 144790 384910 125538 281927 142852 -76764 460275 -147950 -417632 242026 -12035
11364 246242 -15930 182336 -400374 28937 76952 -29914 -94413 30925 262648 -87112 160825
11352 236873 37738 106868 -25092 146859 -32564 229907 163635 84786 -70827 -46473 283354
$$ packed form
11435H5442l4749a41313C10259e2299q6089c0082A75472J8164m8681b88648I7488
11423B0713K11776J3638P9380E6997a70189P9681A02816r404a10045C52419c55464
11411a69398K8629A35540a37714K1881a3356I5072J5524b0008I8033Q872C2478
11399B13628G6724h9939B74067c7622k70182B51532e7540A97699o4599c41503
11388g2659m8725I8147p415e0256q6463c7660B23301E4808P393K19774P3517a28049
11375A44790K40120A25538J56389j39075g6764D60275a47950k69682B42026a2035
11364B46242a5930A82336d00374B8937M8015b9914o4499C0925K31723h7112A60825
11352B36873C7738O9130b5092A46859c2564B29907o6272p8849g0827K4354B83354
$$ plain form
11340 154254 161639 236075 20254 162430 134959 -97369 -58669 -324141 -25703 -149536 66569
11328 -114148 -144305 -354886 209922 -341137 70331 -68895 49250 -200873 -903 158197 -116842
11316 36155 -69342 297874 -12747 -203786 -114865 227625 1550 91408 -49875 72244 308267
11305 308267 -131654 -183562 -287074 -39169 -8106 4671 181441 -97140 -391827 -147463 4854
11293 57378 27322 87181 217354 -225936 -346035 -129611 40637 194182 -142432 -10674
11282 -166695 -110258 50133 144477 -27254 6573 448891 46708 205737 69434 -88530 -57138
11271 -57138 -182198 16021 185496 -29511 49049 -234361 -33870 171054 -275156 285028
11260 217735 51499 79944 81253 43208 -37219 -11732 37986 -64115 165431 -68759 -208403
$$ packed form
11340A54254P385P4436B0254J42176k7471i7369L8700k65472b5703j23833F6569
11328a14148l0157k10581B09922c41137G0331f8895D9250b00873i03A58197a16842
11316C6155f9342B97874a2747j91039Q8921B27625A550Q9858d9875G2244K36023
11305C08267a31654n1908j03512c9169h106D671J76770i7140k94687a47463D854
11293E7378B7322N9859J30173b25936j20099a29611D0637J53545a42432a0674
11282a66695N6437E0133R4344b7254F573M42318D6708J59029F9434h8530L1392
11271e7138j25060A6021J69475b9511D9049b34361c3870A71054b75156B85028
11260B17735E1499K8445J309l8045c7219a1732C7986f4115A65431f8759j39644
$$ plain form
11249 -208403 112770 -126332 -139929 -158575 62686 139677 56849 201401 258558 -25738 -182457
11238 -182457 -36701 67086 120966 216021 -256751 -73259 -169174 -92240 72103 48197 -268415
11226 -324873 13100 213005 -61429 -151397 529132 -319916 -101322 -238428 -159438 -375781
11216 -375781 -380335 -214486 148902 114056 77277 -24302 -286760 30310 -158519 13508 -273031
11204 -183732 113232 -96507 -171844 106139 -134087 81922 11381 98072 -107274 -246746
11194 -246746 -115842 -27719 37790 -78748 -200616 -96639 25405 -160975 108737 -174471
11183 119343 -1572 -53663 -212752 -142841 -147785 320234 44774 -40895 -164378 -163208 -74785
11171 -280998 -235590 39012 -349745 279918 -95006 -287610 -27632 -136889 56743 178219
$$ packed form
11249b08403A12770a26332j3597j8646F2686P6991E6849J44552N7157b5738j56719
11238a82457c6701F7086N3880R5055b56751g3259r5915P6934G2103k3906b68415
11226c24873A3100J99905f1429q9968E29132c19916a01322j37106P8990k16343
11216c75781m554J65849A48902l4846l6779b4302k62458C0310a58519A3508b73031
11204a83732A13232i6507p5337A06139a34087H1922A1381Q6691a07274j39472
11194b46746a15842b7719C7790g8748j21868i6639B5405a60975A08737a74471
11183A19343a572n2091j59089O9911m944C20234D4774d0895j23483J170g4785
11171b80998M5408C9012c49745B79918i5006j92604b7632j09257E6743J21476
$$ plain form
11161 178219 136235 -1432 -153640 33525 390 -107695 -21759 135562 -534 -56320 49817 98165
11149 98165 185377 167110 190677 272371 -323139 -202644 57979 -92592 180415 -24435 13179
11137 -113698 -216251 -66987 218864 -137552 266780 -21594 21556 173617 -245249 -40155
11126 116690 212346 70764 129022 97992 -11140 -246737 -149682 98894 331866 183540 -128938
11114 174032 -163949 25151 -98697 -53305 -180588 128032 161929 108814 253968 -63654 58705
11102 98688 75187 391850 237889 162346 128216 165806 381069 43958 43080 242622 99070
11090 64328 287138 85044 333892 -42114 -16539 62656 405194 234632 133864 -12067 239812
11078 145012 408344 160409 313123 155227 312089 17370 106791 266050 85633 202015
$$ packed form
11161A78219m1984a432j52208C3525C90a07695b1759A35562e34n5786D9817M8348
11149I8165Q7212j8267K3567Q1694c23139J20495E7979i2592A80415b4435A3179
11137a13698j02553f6987B18864a37552B66780b1594B1556J52061b45249d0155
11126A16690R5656G0764N8258l1030a1140k35597R7055I8894K32972j48326a28938
11114A74032a63949B5151i8697M5392j27283A28032L3897n3115J45154f3654E8705
11102I8688k3501L16663j53961p5543l4130L7590K15263D3958q78J99542I9070
11090F4328K22810H5044K48848d2114a6539F2656L42538j70562j00768a2067B39812
11078A45012K63332A60409J52714A55227J56862A7370Q9421J59259H5633J16382
$$ plain form
11068 202015 189095 20335 84715 329379 330246 325331 410349 550026 349626 204376 681114
11057 681114 659691 381813 472208 537337 643955 467572 560547 643101 621646 439264 308371
11046 308371 749121 631134 636024 936354 665465 858396 456963 761376 300702 808928
11036 808928 786327 564294 485762 611858 588437 924751 753177 755402 542061 578120 834271
11025 834271 638599 424089 352397 754760 623518 839049 820556 414986 424170 420126 699660
11014 699660 618387 608342 625723 644643 913613 300549 701346 588830 225158 578318
11004 578318 345190 860307 423094 548179 698187 761150 627657 612947 614385 616016 760386
10993 760386 837957 888685 347620 535202 593419 735678 940492 936135 600931 904457
$$ packed form
11068B02015j2920B0335O4380K44664Q67m915Q5018J39677k00400j45250M76738
11057F81114k1423k77878R0395O5129J06618j76383R2975Q2554k1455j82382j30893
11046C08371M40750j17987M890L00330k70889J92931m01433L04413C00702N08226
11036H08928k2601k22033p8532J26096k3421L36314j71574K225k13341L6059K56151
11025H34271j95672k14510p1692M02363j31242K15531j8493m05570R184m044K79534
11014F99660q1273j0045J7381J8920K68970C00549M00797j12516B25158L53160
11004E78318k33128N15117D23094J25085J50008O2963j33493j4710J438J631J44370
10993G60386P7571N0728C47620J87582N8217J42259K04814m357l35204L03526
$$ plain form
10983 904457 684548 764429 962904 792225 829464 1175890 1635595 1601209 1650990 1919813
10973 1919813 1944728 2242945 2348334 2588022 2849705 2680285 2591283 2238995 1873672 1987700
10963 1987700 1715355 1539742 1439503 1500988 1253362 1735822 1653962 1529999 1872469 1837695
10953 1837695 1949244 1573805 1126623 969599 942872 689194 675407 470031 601942 566647
10943 566647 572050 252589 325352 242261 411828 -139141 433016 -227738 -158225 -38786 247847
10931 240666 425456 86730 -381778 239141 163611 104307 343160 -133667 227929 131780
10921 131780 85076 33178 -411655 386230 270927 -40086 -80377 -101988 246237 -85773 141369
10909 64944 157165 31630 26052 -50757 165064 123135 41909 88935 -8508 51529 114859 225790
$$ packed form
10983I04457k19909P9881J98475j70679L7239L46426M59705l4386M9781K68823
10973A919813K4915K98217J05389K39688K61683j69420q9002l52288l65323J14028
10963A987700k72345j75613j00239O1485k47626M82460q1860j23963L42470l4774
10953A837695J11549l75439m47182j57024k6727k53678j3787k05376J31911l5295
10943E66647N403B52589P2763q3091J69567a39141D33016b27738O9513c8786B47847
10931B40666J84790H6730c81778B39141p5530n9304K38853a33667B27929r6149
10921A31780m6704C3178d11655C86230j15303d0086m0291k1611B46237h5773A41369
10909F4944R2221C1630n578e0757A65064m1929D1909M7026h508E1529O3330J10931
$$ plain form
10897 225790 -14839 189312 206369 -125250 -239333 81146 -353830 -237343 34230 123866
10887 123866 -88905 -228440 -151747 -279913 184612 173964 105220 6992 -107776 -237905 64864
10875 150000 91554 -95795 114182 -139049 -220007 -334376 -198124 -81102 108905 -74062
10864 -226655 -272416 -210256 69097 -66101 -331038 180520 -120009 -81552 -152776 52800 355147
10853 355147 -126443 104223 184719 227291 -393563 -74095 5464 -5450 379609 -28089 -103124
10842 -103124 22108 117697 -79322 115390 193757 166173 -273131 158732 229381 137945 165922
10831 165922 -89347 384008 221073 269160 109481 72705 -134732 -24413 -367364 261963
10820 -68267 -5561 -226349 -167431 -313808 116029 330400 -374385 17052 -48204 282075 -102867
$$ packed form
10897B25790a4839A89312J7057a25250j14083H1146c53830J16487C4230Q9636
10887A23866h8905j39535P6693j28166A84612j0648o8744F992a07776j30129F4864
10875A50000n8446i5795A14182a39049q0958j14369J36252h1102A08905g4062
10864b26655m5761O2160F9097f6101k64937A80520a20009L8457p1224E2800L02347
10853C55147a26443A04223Q0496M2572c93563g4095E464e450C79609b8089p5035
10842a03124B2108R5589g9322A15390P8367k7584b73131A58732P0649r1436K7977
10831A65922h9347C84008j62935M8087A09481l6776a34732b4413l42951B61963
10820f8267e561k20788N8918j46377A16029K14371c74385A7052d8204B82075a02867
$$ plain form
10808 -181202 -289665 87823 -88586 35992 -4211 29552 -229367 -224483 135160 372211 31680
10796 200254 -54601 302129 -91635 70260 236401 19606 959 -333755 -104843 -281781 -400549
10785 -400549 39404 -202287 -34909 76713 172589 -111066 -99454 -13964 -178953 -284001 -56067
10773 -222453 -243623 307850 -71532 52006 -44808 -61186 241 146134 117673 -270096 27568
10761 -115931 349980 -33212 -213408 53614 -417579 -254149 148057 -143909 -90702 -276834
10751 -276834 135139 -328752 133318 25134 -55602 -90798 512905 282410 -203895 -244835
10741 -244835 -221239 132453 -57739 -232467 -248999 -218367 67728 180967 -201238 -219633 -39381
10729 -92200 -34386 -78818 89816 -50626 79422 -220215 13886 127870 7196 -22907 -20166 -40524
$$ packed form
10808a81202j08463H7823h8586C5992d211B9552b29367M884A35160K37051C1680
10796B00254e4601C02129i1635G0260J66141A9606I59c33755a04843j76938j18768
10785d00549C9404b02287c4909G6713R5876a11066J1612a3964j64989j05048e6067
10773b22453k1170C07850g1532E2006d4808j6378B41J45893k8461b70096B7568
10761a15931C49980c3212j80196E3614d17579J63430A48057a43909N3207j86132
10751b76834A35139c28752A33318B5134e5602l5196E12905k30495b03895m0940
10741b44835K3596A32453e7739j74728j6532L0632F7728J13239b01238j8395c9381
10729i2200c4386m4432H9816e0626G9422b20215A3886J13984G196b2907K741k0358
$$ plain form
10717 -40524 -25104 -83996 -173432 108322 135034 -56350 -29468 -20691 -424206 -188267 119109
10705 338427 -219643 32236 209873 -107985 -1447 -352054 -10516 6184 -132408 -141132 -152149
10694 -152149 273565 38848 -166949 -210458 -82542 -90602 247799 108150 -235657 -160678 45692
10682 -220933 -80234 -32974 -205619 -149682 183569 -48440 -109747 59903 88932 8822 -30218
10670 160200 -163703 298143 -55429 -358359 149194 -198050 -249861 -452166 111547 -59002
10659 -184261 62404 -204268 -339502 -22124 30935 116251 -139384 189838 37168 -103040
10648 -53983 -64661 -417160 -31710 119370 212082 -94287 -86605 -80945 27303 60345 -138686
10636 -63853 -16981 -300120 -193346 -46334 373851 -159309 48739 -228789 8788 234817 -239
$$ packed form
10717d0524J5420n8892q9436A08322K6712e6350K6882Q777m03515a88267A19109
10705C38427b19643C2236J77637a07985a447l50607a0516F184a32408q724j1017
10694a52149B73565C8848a66949m3509h2542q060B47799A08150b35657P4979D5692
10682b20933h0234c2974j72645N5937A83569d8440o1307E9903K9029H822c0218
10670A60200a63703B98143e5429l02930A49194a98050n1811k02305A11547e9002
10659a84261F2404b04268j35234b2124C0935Q5316a39384A89838C7168a03040
10648e3983j0678l52499c1710A19370R2712i4287P682N660B7303L3042a38686
10636f3853a6981k83139J06774d6334C73851a59309D8739b28789H788K26029b39
$$ plain form
10624 192920 6276 112266 33313 64432 -2000 -84580 6668 -196096 10269 -199798 -199132 -132929
10612 -132929 -144934 -149913 162505 115620 -110976 -400760 150766 169798 -4634 -164488 42960
10600 -98487 14298 406275 -260839 12341 -221240 79040 -107023 173763 81505 173595 -133532
10588 41986 -136763 375694 32473 -158017 -36251 128045 -475347 228981 -20932 52716
10577 -179535 -4044 -182623 108147 33282 43627 -333295 -193102 -66537 -358542 208978
10566 -257688 -33280 -64118 20542 2397 -23883 -148285 129734 -258175 -146008 -202341 -220964
10555 -220964 179646 52662 -266654 69877 -206118 -91221 230274 -210850 184502 68174
10544 -69220 398308 -42678 84999 -187679 -35735 130985 -247773 139598 -285427 272286
$$ packed form
10624A92920F276J05990C3313L1119b000q2580F668a96096A0269a99798O66O6203
10612a32929j2005m979A62505m6885a10976k89784A50766J9032d634j59854D2960
10600i8487A4298L91977b60839A2341b21240G9040a07023A73763H1505R2090a33532
10588D1986a36763C75694C2473a58017c6251A28045d75347B28981b0932E2716
10577a79535d044j78579A08147C3282J0345c33295J40193f6537k92005B08978
10566b57688c3280l0838B0542B397b3883j24402A29734b58175J12167n6333j8623
10555b20964A79646E2662b66654F9877b06118i1221B30274b10850A84502F8174
10544f9220C98308d2678H4999a87679c5735A30985b47773A39598b85427B72286
$$ plain form
10533 115938 28840 71157 96990 125510 -226911 -172337 172673 97178 -36637 -65340 -131679
10522 -131679 107602 170036 -41993 9420 -352901 -249424 159312 -38044 275158 276350 101217
10510 -156323 -128152 -179854 94305 -101833 -150559 251488 -144066 139019 43509 -102473
10499 -108265 102782 -257598 -48292 269134 197372 -236081 48944 86947 -17281 108481
10488 -33714 -175477 -16057 80646 -175083 -16158 -48986 26350 169621 249572 455535 551034
10477 551034 298125 378335 296955 28678 60179 254426 13412 83659 42867 89121 -291027
10465 12692 -150715 8626 90862 -301361 -142334 294071 250056 21681 -302352 153851 120045
10454 120045 28075 -175403 7355 35620 -147455 5878 -149472 -1592 -175446 -11137 -158626
$$ packed form
10533A15938B8840M2317K5833K8520b26911N4574A72673p5495c6637k8703o6339
10522a31679A07602O2434d1993I420c52901J03477A59312c8044B75158J192A01217
10510a56323K8171n1702I4305a01833m8726B51488a44066A39019D3509a02473
10499a08265A02782b57598d8292B69134p1762b36081D8944L8003a7281A08481
10488c3714j41763a6057H0646a75083a6158l2828B6350J43271P9951K05963R5499
10477E51034k52909Q0210q1380B8678L1501J94247A3412P0247m0792M6254b91027
10465A2692a50715H626Q2236c01361a42334B94071m4015B1681c02352A53851l3806
10454A20045B8075a75403G355K8265a47455E878a49472a592j73854a1137j47489
$$ plain form
10443 -158626 -20181 374977 -256526 50509 -84240 -70638 -174554 99085 -4132 -195095 91592
10431 60195 -196067 -8828 177133 100275 189514 137135 -355813 -421275 -43620 -65431 106209
10419 -35954 -27650 -154073 -189297 65120 -203264 2274 99422 135712 3672 -208336 -127633 55907
10406 -228678 56925 -128234 -40579 -330096 -342555 -247143 674 -3454 -77114 -63521 -98427 473625
10393 -18231 -14339 -115620 154993 -134755 -106284 -113127 -70008 -9343 227818 -115582 -173376
10382 -173376 105377 58500 22288 61819 471026 277008 270899 213776 445868 142580 165490
10371 165490 -80124 315944 290906 157168 635450 517951 386032 584444 177127 58363
10360 41010 277212 394707 238737 200300 90027 315644 103582 258509 216776 326033
$$ packed form
10443a58626b0181C74977b56526E0509h4240J3602j03916I9085d132j90963I1592
10431F0195a96067h828A77133p6858Q9239n2379c55813o5462d3620k1811A06209
10419c5954Q304j26423l5224F5120b03264B274R7148L6290C672b08336Q0703E5907
10406b28678E6925a28234d0579k89517j2459R5412F74c454p3660J3593l4906D73625
10393a8231L892j01281A54993a34755K8471o843M3119i343B27818a15582n7794
10382a73376A05377m6877B2288L9531M09207j94018o109n7123K32092A42580K2910
10371A65490h0124C15944k5038j33738M78282j17499j31919J98412A77127E8363
10360D1010K36202J17495j55970l8437I0027K25617A03582J54927m1733J09257
$$ plain form
10350 326033 480680 491489 2278 326303 295859 464651 332246 502558 635855 121918
10339 557754 -37320 370620 271276 -28882 156165 105346 -42547 163012 525376 -214891
10328 -131131 -228205 -303785 43711 126048 368876 356943 238214 -5414 74356 233999 172889
10317 172889 382891 339301 106109 287409 84967 251479 -204675 137174 -32111 -151550
10307 -151550 17136 26431 -53269 -83155 111961 -31356 5366 -89724 -111618 -60053 -152306 -23560
10294 -156929 267478 2251 -356119 78795 -46304 320319 250818 -97318 93009 23658 85351
10283 85351 -382337 60113 435597 -20083 -256740 -176694 -203477 -208373 -17199 56203 -58733
10271 17714 -159807 -83735 -40584 -81999 -78486 491129 263467 -134895 16342 -174353 106246
$$ packed form
10350C26033J54647J0809B278L24025l0444J68792j32405J70312J33297A21918
10339E57754c7320C70620r9344b8882A56165n0819d2547A63012L62364b14891
10328a31131r7074p5580D3711Q2337K42828j1933j18729e414G4356J59643o1110
10317A72889K10002m3590A06109J81300H4967J66512b04675A37174c2111j19439
10307a51550A7136R295e3269k9886A11961c1356E366h9724k1894N1565r2253b3560
10294a56929B67478B251c56119G8795d6304C20319o9501i7318I3009B3658O1693
10283H5351c82337F0113L75484b0083k36657Q0046k6783m896a7199E6203e8733
10271A7714a59807P6072d0584m1415L513D91129k27662a34895A6342a74353A06246
$$ plain form
10259 68980 -64150 334768 40281 144048 291803 374604 400851 217014 -54568 223044 149421
10248 149421 -131394 230468 93871 -95496 -205910 480512 -198780 -61412 75452 -66852
10237 -367825 336075 -184730 -115721 -224216 -296736 -137062 -199538 17649 -154101 -15512
10226 -7282 -343520 -280152 -146274 80051 -153583 262959 177449 294338 105712 -21726 -319862
10215 -319862 -69135 124826 -186055 -63283 128532 -372669 -25461 -327370 49463 -42982
10204 -232099 85269 -174257 -57368 15771 203632 94076 583 -73610 109569 -76928 -103097
10193 -103097 48802 -212626 -181704 -30433 -203306 -209191 -121238 -66020 59706 -152546 -114744
10182 -114744 -256083 145140 -203089 66445 -329643 -145149 -112275 -56661 -238002 94962
$$ packed form
10259F8980f4150C34768D0281J03767J47755Q2801K6247j83837e4568B23044p3623
10248A49421a31394B30468I3871i5496j10414D80512a98780f1412G5452f6852
10237c67825C36075a84730O9009j08495p2520a37062o2476A7649a54101a5512
10226g282l36238O3368J33878H0051a53583B62959q5510J16889A05712b1726k98136
10215c19862f9135A24826a86055f3283A28532c72669b5461l01909D9463d2982
10204b32099H5269a74257e7368A5771J87861I4076E83g3610A09569g6928k6169
10193a03097D8802b12626L0922c0433j72873n885Q7953N5218E9706a52546L7802
10182a14744j41339A45140b03089F6445c29643a45149L2874N5614j81341I4962
$$ plain form
10171 54236 179567 -256932 88189 -76451 324961 11643 189817 41187 -146388 -6249 -156136
10160 -156136 -380066 -330763 -82583 -207506 -124473 262294 138640 -150146 118588 -19101
10149 80484 69668 -334152 -26118 362784 111618 -36690 2541 -202481 -144240 -24267 -78093
10138 -78093 90721 -25783 78397 32125 -470545 101493 -284358 -186363 114576 -131829 -140593
10127 -140593 -178540 -40180 218653 107014 155385 -262533 -212420 30590 -110626 378 55030
10116 55030 -413942 -189185 -260945 -140257 -211823 -170172 -431057 -228844 69333 -89084 134121
10104 -391400 -156646 156960 3752 -220862 -251795 -145932 -211876 -27699 -179650 61529 -75091
10092 121552 -116390 170528 134878 119132 -115245 75806 144228 70750 180501 67069 124143
$$ packed form
10171E4236J25331b56932H8189g6451C24961A1643J78174D1187a46388f249j49887
10160a56136k23930M9303h2583j24923Q3033B62294j23654a50146A18588a9101
10149H0484j0816c34152b6118C62784A11618c6690B541b02481N8241b4267n3826
10138g8093I0721b5783G8397C2125d70545A01493b84358R7995A14576a31829q764
10127a40593l7947d0180B18653A07014M8371b62533N0113C0590a10626C78N4652
10116E5030d13942a89185p1760J20688p1566M1651k60885K02213F9333h9084A34121
10104c91400a56646A56960C752b20862l0933J05863o5944b7699j51951F1529g5091
10092A21552a16390A70528l5650j5746a15245G5806O8422G0750J09751F7069N7074
$$ plain form
10081 124143 30005 -78666 -69916 -61258 -55085 -86538 -78338 -89867 325009 38298 25733 -138546
10068 124614 136468 131811 91097 -76159 154120 -105909 196334 277520 -6876 -55558 -285929
10057 -285929 -64956 -383913 117145 -249222 -86943 -418248 -8995 6292 -66720 138538 -256181
10045 -6923 -157328 175 -47020 -261816 -46387 -323371 -5604 -86670 25442 19154 -15776 -230219
10033 -230219 32342 164198 10456 119501 61830 -304774 -2932 -318839 -116940 50309 30413
10022 30413 -17930 -133493 -144559 -118529 -78130 -244748 13358 -351194 93806 132555 150719
10011 150719 -84591 -227327 253398 -256907 -224520 -23193 -114116 -247167 121116 -68532
10000 -67072 102535 -39581 106004 40191 196294 35270 -167402 208936 45105 61139 2806
$$ packed form
10081A24143C0005g8666Q750Q658O173l1453Q200j1529C25009C8298j2565a38546
10068A24614J1854m657m0714g6159A54120a05909A96334Q1186f876m8682k30371
10057b85929f4956l18957A17145b49222h6943l31305h995F292f6720A38538b56181
10045f923j50405A75d7020k14796d6387k76984e604q1066B5442o288a5776k14443
10033b30219C2342J31856A0456J09045n7671c04774b932l15907a16940E0309j9896
10022C0413a7930j15563j1066K6030M0399j66618A3358c51194I3806L8749J8164
10011A50719h4591j42736B53398b56907L2387b3193r0923j33051A21116f8532
10000f7072A02535c9581A06004D0191J56103C5270a67402B08936D5105J6034B806
$$ plain form
9988 347209 59927 89249 109145 -286310 270466 -175304 -331726 -171426 -289780 179364
9977 -119378 109912 -187115 -181254 -384994 163691 261917 77733 -25984 -172157 -330245 -24703
9965 258380 -63932 122884 186956 -112813 -152409 -167516 -503 -112128 -91241 37860 -154521
9953 -63349 -58728 -12654 -73611 70005 180791 59580 80120 -283870 -245785 -10629 -76862 173680
9940 83768 -46211 -132314 -57353 -92966 -306691 -92972 -28100 196638 -240347 -17352 131002
9928 -63969 -93085 -249217 -315117 13016 -120263 -53353 40034 -84582 162536 71155 -182348
9916 -171262 119676 -306274 -368033 102017 -41613 230415 -157586 -58507 39564 187642
9906 187642 79474 36318 -301005 41605 -185670 -75231 -84777 -20671 -278610 -58712 -170332
$$ packed form
9988C47209E9927K9322J9896b86310B70466a75304j56422J60300j18354A79364
9977a19378A09912a87115N861k03740A63691R8226G7733b5984j46173j58088b4703
9965B58380f3932A22884O4072a12813l9596j5107e03j11625K0887C7860a54521
9953f3349M621a2654o0957G0005J10786E9580K0540b83870L8085a0629o6233A73680
9940H3768d6211q6103e7353l5613k13725i2972b8100A96638b40347a7352A31002
9928f3969k9116j56132o5900A3016a20263e3353D0034h4582A62536G1155a82348
9916a71262A19676c06274o1759A02017d1613B30415a57586e8507C9564J48078
9906A87642G9474C6318c01005D1605a85670g5231r546b0671k57939e8712j11620
$$ plain form
9895 -170332 -419208 -117458 63399 -777 -400273 61286 111441 -230855 277403 -253318 -80266
9883 -42370 56224 394529 176281 -155090 -118075 199298 67810 -86335 -78741 -334171 -173620
9872 -173620 -127602 28148 -50497 -312827 83417 261149 -269110 -265888 29138 69062 -53403
9860 72846 -273563 -37253 -34529 -13676 114481 227684 221626 199431 256004 -311043 36633
9848 53116 -197848 145756 38325 -148933 -69821 -1831 -63805 -175897 -170163 195741 -20183
9836 -95472 -27272 -270418 -23030 -66435 -394975 -42935 -261824 90980 -163677 -27958 10182
9824 -195631 -81673 -222533 -203571 356130 12860 42989 -148919 32194 -71299 25241 -197901
9812 20605 -382098 -147071 -230221 16529 -332351 -170019 -191007 -31025 47587 -175473 -59175
$$ packed form
9895a70332k48876a17458F3399g77l99496F1286N0155b30855B77403b53318h0266
9883d2370E6224L38305A76281a55090L7015A99298F7810h6335P594k55430J60551
9872a73620M6018B8148e0497k62330H3417J77732b69110L222B9138L9924e3403
9860G2846b73563c7253K724a3676A14481J13203o058k2195N6573c11043C6633
9848E3116a97848A45756C8325a48933f9821a831o1974j12092N734A95741b0183
9836i5472b7272k43146b3030m3405l28540d2935k18889I0980a63677b7958A0182
9824a95631h1673j40860J8962C56130A2860L0129a48919C2194g1299B5241a97901
9812B0605c82098a47071q3150A6529c32351J62332k0988c1025D7587a75473e9175
$$ plain form
9800 183086 -198419 -91094 -12568 226872 165532 -256886 -261167 24017 -139243 -205320 21251
9788 -104789 -200272 226487 -113884 -77939 -142157 130171 34151 -180669 -84571 -13232 -21201
9777 -21201 -148820 -222123 -207850 160682 -202829 47894 -30452 -370007 90795 -298631 8873
9765 -76286 -142288 -72523 17075 65255 78813 -349318 -120544 -121141 121864 102946 -401267
9753 42942 -92772 -287620 -4073 -415345 108676 -208262 32167 -168604 -161668 -262200 -2011
9741 123420 -61750 222997 -8765 105803 99936 -118522 101012 -60281 -218126 122222 260971
9730 260971 -33343 -1787 -236078 202703 -68965 212100 -263289 12675 463665 163839 -46776
9718 -269528 39672 192231 -97039 4066 73067 -62081 -173618 -113973 -105201 239325 -48817
$$ packed form
9800A83086a98419i1094a2568B26872o1340b56886m281B4017a39243o6077B1251
9788a04789r5483B26487a13884L5945o4218A30171C4151a80669h4571a3232p969
9777b1201j27619p3303J4273A60682b02829D7894c0452l39555I0795b98631H873
9765g6286o6002O9765A7075M8180J3558c49318a20544n97A21864j8918d01267
9753D2942i2772j94848d073m11272A08676b08262C2167a68604O936j00532b011
9741A23420f1750B22997h765A05803n867a18522A01012f0281j57845A22222J38749
9730B60971c3343a787k34291B02703f8965B12100b63289A2675M50990A63839d6776
9718b69528C9672J52559i7039D066O9001f2081j11537N9645Q772B39325d8817
$$ plain form
9706 -171347 49826 -28206 122698 -193741 84401 -129253 -230794 109186 -270850 128843
9695 40998 19611 178954 116183 -119648 20860 -114799 -138937 -42795 -154745 298579 67068
9683 -271446 -102375 147332 -150747 -60016 -68826 246722 404210 241637 -7452 -192502 141225
9671 -211798 110807 154567 -84569 23252 391537 -212730 -227713 -150954 -219042 -204751 -298069
9660 -298069 -190810 -18718 191422 19667 -82860 -264034 -104663 161268 -63672 -297617
9650 -297617 76242 262946 -249379 -102568 -56488 164576 -127732 -115263 -254124 -126106
9639 -46703 143226 89374 -41744 -206421 -202123 139524 -110468 -79589 -142067 103837 21044
9627 -346320 -193275 -214063 46341 -372099 78567 -224642 -22581 -297529 -41880 -134560 4797
$$ packed form
9706a71347D9826b8206A22698a93741H4401a29253j01541A09186b70850A28843
9695D0998A9611J59343o2771a19648B0860a14799k4138d2795j11950B98579F7068
9683b71446a02375A47332a50747f0016q810B46722J57488j62573g452j85050A41225
9671b11798A10807M3760h4569B3252L68285b12730j4983P6759o8088J4291r3318
9660b98069J07259a8718A91422A9667h2860j81174a04663A61268f3672k33945
9650b97617G6242J86704b49379a02568M6080A64576a27732J2469j38861a26106
9639d6703A43226n3852d1744j64677M298A39524a10468L0879o2478A03837B1044
9627c46320J53045k0788D6341c72099G8567b24642b2581k74948d1880r2680D797
$$ plain form
9615 -146879 -135159 211167 -77560 -170231 -187068 72703 100516 99818 224241 18158 27585 -58553
9602 -70327 -278236 -91042 -346063 188844 147197 -287135 -419969 -107911 -111736 200037 -332964
9590 163354 -25726 -133873 -10069 -216837 9886 -92441 -64993 -171038 72284 -80474 -247713
9579 -247713 70131 42936 -58642 185094 -115624 378005 -406748 -184235 276255 233065
9569 233065 178636 193726 -291541 84441 23853 -243355 -366675 231873 -129859 30053 -125888
9557 -80554 -228181 48996 436237 7864 58189 -352009 -141500 381615 -50432 -259937 -35032
9545 116768 -731 -80299 107046 30424 -229973 102270 12790 99453 -176087 60091 249657
9534 249657 17194 -189890 11678 102313 -458679 -152588 -312147 -180128 -163419 81712 -100042
$$ packed form
9615a46879J1720B11167g7560r2671j6837G2703K7813o98J24423A8158R427e8553
9602g0327k07909i1042k55021A88844m1647b87135j32834a07911l825B00037c32964
9590A63354b5726j08147a0069k06768I886i2441K7448j06045G2284h0474j67239
9579b47713G0131k7195e8642A85094a15624C78005d06748a84235B76255m3190
9569B33065n4429J5090b91541H4441B3853b43355j23320B31873a29859C0053a25888
9557h0554j47627D8996L87241G864N0325c52009a41500C81615e0432k09505c5032
9545A16768g31p9568A07046C0424b29973A02270A2790Q6663a76087F0091J89566
9534B49657A7194a89890A1678R0635d58679a52588j59559J32019J6709H1712a00042
$$ plain form
9522 -52555 50567 171155 14252 164991 -41392 -321723 49400 -297884 -298396 -219500 -225842 41026
9509 -42777 -56732 119389 142711 -124517 -331534 -543 111448 -15199 -228874 -318608 -205887
9498 -205887 -151374 -207023 -288343 49492 -368434 -299556 -104274 -156973 101469 -200830 318619
9486 -381018 -149152 -19775 -219301 201066 -168332 -49713 -288766 -96379 168466 -32558
9475 5703 42501 -15054 -32764 -171983 -125303 111641 -155111 -84117 264756 53254 -103675
9463 -71721 -205097 111043 70494 236422 116860 -229150 96605 53510 152858 -72156 -264249
9452 -264249 -402234 206065 -14244 -229524 -106819 -261711 -267169 -80804 69206 -143627 23559
9440 1047 9050 140952 -345985 -7728 94818 -187522 317025 21147 115806 -102631 72318
$$ packed form
9522e2555E0567J20588A4252J50739d1392k80331D9400b97884n12P8896o342D1026
9509d2777j3955A19389K3322a24517k07017e43A11448a5199k13675q9734J12721
9498b05887N4513n5649q1320D9492c68434O8878a04274n2699A01469b00830C18619
9486c81018a49152a9775j99526B01066a68332d9713k39053i6379A68466c2558
9475E703L6798a5054j7710j39219M6680A11641a55111P0994B64756E3254a03675
9463g1721j33376A11043m0549J65928A16860b29150I6605m3095R9348g2156j92093
9452b64249j37985B06065a4244k15280a06819j54892n458h0804F9206a43627B3559
9440A047Q003J31902c45985g728I4818a87522C17025B1147R4659a02631G2318
$$ plain form
9428 95388 -164297 -107423 -12848 46534 -268614 -132179 -190892 118761 -382808 -42709 -195779
9417 -195779 -57735 -37019 -161131 188977 -48145 -69245 -190635 73370 34067 -92405 -52698
9406 -52698 360544 51693 111843 -125875 -287640 -155393 -86312 -137895 14290 -335061 26262
9394 -146729 -223752 -65729 -200235 51510 -68975 37850 46111 -367588 -58285 -131940 90280
9382 -77291 125776 72488 209991 -60054 138335 -182003 -338878 100330 -68053 60331 -60175
9370 128462 -249305 93646 228403 -148668 -295501 -246090 3963 -64054 -204191 -118024 -22878
9358 -109653 65214 5882 250622 -9982 103869 66643 12674 -262247 -3441 72247 -52709 157109
9345 104408 -172801 -67254 151776 -328362 -124634 109649 -269955 -254522 -25047 -80446
$$ packed form
9428I5388a64297N6874a2848D6534b68614a32179n8713A18761c82808d2709j53070
9417a95779e7735K0716j24112A88977d8145k1100j21390G3370C4067i2405L9707
9406e2698C60544E1693O0150a25875j61765J32247O9081n1583A4290c35061B6262
9394a46729p7023f5729j34506E1510f8975C7850Q261c67588e8285p3655I0280
9382g7291A25776n3288J37503f0054A38335a82003j56875A00330f8053F0331f0175
9370A28462b49305I3646J34757a48668j46833M9411C963f4054j40137Q6167b2878
9358a09653F5214E882K44740i982A03869l7226A2674b62247c441G2247e2709A57109
9345A04408a72801f7254A51776c28362a24634A09649b69955J5433b5047n5399
$$ plain form
9335 -80446 -242281 45576 51540 147899 65918 160721 71205 -309703 -373974 107520 34098
9323 -188760 59521 -24998 -232234 592 -158994 20662 217053 -532256 -89584 95749 -274061
9311 -17955 -66605 126762 -14727 43697 53507 -157980 -134562 44110 -53836 -1025 -141996 225951
9298 -30827 -231364 -183612 -195662 27664 -15064 238140 -343696 -4721 15575 -152558 -428266
9287 -428266 -12526 405443 -43968 250264 58635 -30831 472 -203973 -42194 -157199 335440
9275 29831 151909 8419 -116678 -170314 -13093 166147 391222 -85726 -38478 192460 79793
9263 193348 -171630 -136814 -101996 163455 -79220 -94947 -155148 -284113 -209980 150704 279849
9252 279849 131542 -23314 -210679 -347895 139857 -88640 -30039 -40309 148325 -4687 -184377
$$ packed form
9335h0446j61835D5576N964R6359F5918R4803G1205c09703o4271A07520C4098
9323a88760E9521b4998k07236E92a58994B0662J96391e32256h9584I5749b74061
9311a7955m8650A26762a4727D3697R810a57980K3418D4110e3836a025j40971B25951
9298c0827k00537M7752j2050B7664a5064B38140c43696d721A5575a52558k75708
9287d28266a2526D05443d3968B50264E8635c0831D72b03973d2194j15005C35440
9275B9831J22078H419a16678n3636a3093A66147K25075h5726c8478A92460G9793
9263A93348a71630L4816L4818A63455g9220j5727o0201j28965P4133A50704J29145
9252B79849A31542b3314j87365j37216A39857h8640c0039j0270A48325d687j79690
$$ plain form
9241 -184377 -99920 -187033 -167077 71284 -210885 -182299 -180943 70447 -79852 95165 -314159
9229 -11606 144289 -2819 308976 156772 5159 -17563 219021 -86852 -260364 -52073 -176619
9218 -176619 -210549 -152420 -101055 -35560 -299783 -671310 64754 239096 73215 103296 -99936
9206 -168715 -340935 -303513 -244650 55588 17648 -223383 -372669 -64225 -209468 255559 -128812
9194 -129376 -340878 -71738 -534543 -36638 -58540 -163348 125603 -66420 285548 -70896 -128810
9183 -128810 -200358 -2036 -269988 -87423 -206477 259369 -27832 -156462 123376 179275 29577
9171 -62122 -39630 63644 12772 11520 25454 19985 -228457 -160933 208007 283201 -144385 -142653
9159 -142653 210806 6621 -71176 56935 -265542 -158744 80793 -103019 -93193 68190 -323476
$$ packed form
9241a84377Q4457q7113J9956G1284b10885K8586J356G0447g9852I5165c14159
9229a1606A44289b819C08976j52204E159a7563B19021h6852j73512e2073j24546
9218a76619l3930N8129N1365c5560k64223l71527F4754J74342G3215L0081i9936
9206a68715j72220L7422N8863E5588A7648b23383j49286f4225j45243B55559a28812
9194a29376k11502g1738m62805c6638k1902j04808A25603f6420B85548g0896n7914
9183a28810p1548b036k67952h7423j19054B59369b7832j28630A23376N5899B9577
9171f2122K2492F3644A2772j252J3934n469b28457O7524B08007P5194a44385J732
9159a42653B10806F621g1176E6935b65542J06798H0793a03019R826F8190c23476
$$ plain form
9147 160606 -176890 -177458 -56174 137516 186699 -100787 -79096 5191 -172400 -294433 -114179
9135 29132 -126393 296378 -610299 204527 -366231 -76972 -37833 -213224 -377673 14492
9124 229294 -51034 -447893 194124 -25634 -146701 -272509 -252889 -89357 -189978 32302 31277
9113 31277 -133790 85136 164436 92402 61813 123142 158406 12048 -234499 -248518 -106729
9101 -149505 -107994 -2816 -36557 -161564 -270577 -397561 -113092 103191 81626 -174433 10125
9089 -175975 197084 -360214 -166931 78781 36143 -235439 -290147 64206 109729 -32832 40372
9077 -554590 -119446 39335 -372394 -120154 -81841 35169 45019 -314012 -618123 -232047 -73213
9065 -140462 31027 -172676 -178267 -66568 114384 -77868 145898 29814 -335787 -326412 -278052
$$ packed form
9147A60606a76890n68e6174A37516M9183a00787K1691E191a72400j22033a14179
9135B9132a26393B96378f10299B04527c66231g6972c7833j75391j64449A4492
9124B29294e1034l96859A94124b5634j21067j25808J9620h9357j00621C2302j025
9113C1277a33790H5136P9300p2034l0589O1329L5264A2048b34499j4019a06729
9101a49505M1511b816l3741j25007j09013j26984a13092A03191k1565a74433A0125
9089a75975A97084c60214a66931G8781C6143b35439n4708F4206M5523c2832D0372
9077e54590a19446C9335c72394a20154L8313C5169R850c14012l04111b32047g3213
9065a40462C1027a72676n591f6568A14384g7868A45898B9814c35787R375M8360
$$ plain form
9054 -278052 -184612 37486 -32890 214159 208572 141178 72274 107033 77737 107749 14339 -85438
9041 -146195 121926 -97174 -140719 48011 -217349 176462 -185783 -6866 77744 -135193 264274
9029 -50722 46614 -149244 -12777 -401420 -303660 -13897 -149499 132824 -8579 -95777 -261974
9018 -261974 -30366 108910 44144 -251239 -166883 234784 41010 198495 -135424 -424326
9008 -424326 107650 -189935 -21700 -3873 -258782 -62459 -42743 -29712 -235574 -168590 85359
8996 130623 -13914 -265182 -609239 58830 -141097 -168994 -103045 249852 -328044 108253
8985 -67628 -336375 -85650 -15305 143762 -282662 -87656 88509 -86845 -327749 -194534 -379584
8974 -379584 159878 6826 -82063 -147447 -238462 -437866 105713 -46644 -326763 -58929 42222
$$ packed form
9054b78052R3440C7486c2890B14159n587o7394o8904L4759k9296L0012A4339h5438
9041a46195A21926i7174m3545D8011b17349A76462a85783f866G7744a35193B64274
9029e0722D6614a49244a2777l88643R7760a3897j35602A32824h579q7198j66197
9018b61974c0366A08910D4144b51239Q4356B34784D1010J57485a35424k88902
9008d24326A07650a89935b1700c873k54909f2459J9716J3031k05862O6984H5359
8996A30623a3914k51268l44057E8830a41097k7897O5949B49852c28044A08253
8985f7628k68747h5650a5305A43762b82662h7656H8509h6845k40904J33215j85050
8974c79584A59878F826h2063o5384r1015j99404A05713d6644k80119e8929D2222
$$ plain form
8962 20547 174214 19949 2410 -111215 -19797 -229048 -163826 -127733 482626 -151673 -93440
8951 -93440 248453 114637 241393 -191583 40008 280356 -577467 -111879 -16195 -21382 -21945
8940 -21945 54354 21986 -98553 -148626 174558 -100097 -17372 359285 -70735 -107038 -166332
8929 -166332 43689 -28614 13046 15205 -162041 306052 535806 3159262 6806151 3801897
8919 3801897 1515575 366727 24315 -258410 191384 24950 96756 -218107 199099 -48028
8908 -259596 456952 209005 100449 174906 178903 -67857 132171 -153792 -232812 -147715 -77321
8897 -77321 9377 -143484 -67198 -57543 -272691 -230864 217976 28930 -260899 55563 407115
8886 407115 -39116 105440 -135092 -228352 321046 244762 -62981 -160012 -301975 -535417 116051
$$ packed form
8962B0547J53667A9949B410a11215a9797k09251O5222L6093D82626a51673N8233
8951i3440B48453A14637J26756a91583D0008K40348e77467a11879a6195n187n63
8940b1945E4354B1986i8553n0073A74558a00097a7372C59285g0735l6303n9294
8929a66332D3689b8614A3046K159a62041C06052K29754K623456L646889l004254
8919C801897A515575C66727B4315b58410A91384B4950P1806b18107A99099d8028
8908b59596D56952B09005A00449P4457L997f7857A32171a53792p9020Q5097P0394
8897g7321I377a43484f7198R655k15148M1827B17976B8930b60899E5563L51552
8886D07115c9116A05440a35092r3260C21046p6284f2981r7031j41963k33442A16051
$$ plain form
8874 -132466 17967 -121053 -62914 152131 29055 -16292 -231113 -348226 239999 -121576
8863 58889 -22466 33181 -62043 -189436 -89328 -152911 24063 -18705 223318 22124 -145918
8851 -68247 -125367 71328 -353813 -282275 -7839 150291 -300971 -79487 237008 -147909 81926
8839 33282 57714 82630 37561 -389436 -165868 -39964 133556 19958 211540 -477775 90977
8827 -149430 -187660 -95289 -77346 193849 61518 -285603 41122 129080 -3115 -61155 -83346
$$ packed form
8874a32466A7967a21053N8139A52131B9055a6292k14821j17113B39999a21576
8863E8889b2466C3181f2043j27393h9328o3583B4063a8705B23318B2124a45918
8851f8247n7120G1328c53813P1538g839A50291c00971g9487B37008a47909H1926
8839C3282K4432K4916C7561c89436a65868c9964A33556A9958J91582d77775I0977
8827a49430l8230R2371J7943A93849F1518b85603D1122Q7958c115n8040k2191
$$ [...]
##END NTUPLES=NMR SPECTRUM
##END=
