##TITLE=AC1644_HPIAH13377_8569693_X9gTcgy1c5
##JCAMPDX= 6.0         $$ Bruker NMR JCAMP-DX V2.0
##DATA TYPE= NMR SPECTRUM
##DATA CLASS= NTUPLES
##ORIGIN= BRUKER
##OWNER= Administrator
$$ 1.72 TOPSPIN		Version 2.1
$$ 2014-04-10 16:23:55.996 -0700  Administrator@X
$$ Compression mode = diff/dup
##.OBSERVE FREQUENCY= 400.02188249412
##.OBSERVE NUCLEUS= ^1H
##.ACQUISITION MODE= SIMULTANEOUS (DQD)
##.ACQUISITION SCHEME= undefined
##.AVERAGES= 64
##.DIGITISER RES= 22
##SPECTROMETER/DATA SYSTEM= spect
##.PULSE SEQUENCE= noesygpps1d.comp
##.SOLVENT NAME= COFFEE_meoh
##.SHIFT REFERENCE= INTERNAL, COFFEE_meoh, 1, 14.96123
##AUDIT TRAIL= $$ (NUMBER, WHEN, WHO, WHERE, PROCESS, VERSION, WHAT)
$$ ##TITLE= Audit trail, TOPSPIN		Version 2.1
$$ ##JCAMPDX= 5.01
$$ ##ORIGIN= Bruker BioSpin GmbH
$$ ##OWNER= Administrator
$$ $$ E:\/data/COFFEE/nmr/AC1644_HPIAH13377_8569693_X9gTcgy1c5/12/pdata/1/auditp.txt
$$ ##AUDIT TRAIL=  $$ (NUMBER, WHEN, WHO, WHERE, PROCESS, VERSION, WHAT)
(   1,<2014-04-10 16:23:49.934 -0700>,<Administrator>,<X>,<go>,<TOPSPIN 2.1>,
      <created by zg
	started at 2014-04-10 16:12:20.071 -0700,
	POWCHK enabled, PULCHK disabled,
       configuration hash MD5:
       C8 4E 4E 5D D3 5C D8 9E 9F 52 82 E0 59 8A DE 15
       data hash MD5: 64K
       23 2E 25 F7 2C CC 0A 71 11 01 83 73 70 72 9D DE>)
(   2,<2014-04-10 16:23:53.325 -0700>,<Administrator>,<X>,<proc1d>,<TOPSPIN 2.1>,
      <Start of raw data processing
       efp LB = 0.3 FT_mod = 6 PKNL = 1 PHC0 = 0 PHC1 = 0 SI = 128K 
       data hash MD5: 128K
       CB 89 34 05 E4 B8 4C 32 2A 94 EB 97 C2 E5 D3 11>)
(   3,<2014-04-10 16:23:54.528 -0700>,<Administrator>,<X>,<proc1d>,<TOPSPIN 2.1>,
      <pk PHC0 = -83.49609 PHC1 = 0 
       data hash MD5: 128K
       D2 5C 56 74 79 33 82 6B CE 43 46 7B 24 3F A9 68>)
(   4,<2014-04-10 16:23:55.278 -0700>,<Administrator>,<X>,<proc1d>,<TOPSPIN 2.1>,
      <abs ABSG = 1 
       data hash MD5: 128K
       0A AB 39 31 CC 9D 3E 03 76 3A 26 70 99 20 CA B5>)
(   5,<2014-04-10 16:23:55.403 -0700>,<Administrator>,<X>,<proc1d>,<TOPSPIN 2.1>,
      <abs ABSG = 2 
       data hash MD5: 128K
       E3 97 C4 94 CC AA 24 13 21 C2 96 A7 3D CA 03 7D>)
(   6,<2014-04-10 16:23:55.496 -0700>,<Administrator>,<X>,<proc1d>,<TOPSPIN 2.1>,
      <abs ABSG = 3 
       data hash MD5: 128K
       DB 52 D2 9B E0 F2 AA 2A F3 09 FD 8C 25 FF 18 62>)
(   7,<2014-04-10 16:23:55.606 -0700>,<Administrator>,<X>,<proc1d>,<TOPSPIN 2.1>,
      <abs ABSG = 4 
       data hash MD5: 128K
       A0 74 58 E6 64 C3 93 2F 20 3B 42 24 A1 5D 70 57>)
(   8,<2014-04-10 16:23:55.731 -0700>,<Administrator>,<X>,<proc1d>,<TOPSPIN 2.1>,
      <abs ABSG = 5 
       data hash MD5: 128K
       7D 6F 7D 3A 87 CB 95 37 99 81 53 95 FD 96 31 30>)
$$ ##END=
$$ 
$$ $$ hash MD5
$$ $$ 86 E2 B6 71 92 81 E1 86 58 F1 9C 62 15 11 C7 4B
##$RELAX= 
##$RELAX= 
##$RELAX= 
##$RELAX= 
##$RELAX= 
##$RELAX= 
##$RELAX= 
##$RELAX= 
$$ Bruker specific parameters
$$ --------------------------
##$DU= <E:\>
##$EXPNO= 12
$$ [...]
##$TP07= 0
##$TPNAME0= <>
##$TPNAME1= <>
##$TPNAME2= <>
##$TPNAME3= <>
##$TPNAME4= <>
##$TPNAME5= <>
##$TPNAME6= <>
##$TPNAME7= <>
##$TPOAL= (0..7)
0.5 0.5 0.5 0.5 0.5 0.5 0.5 0.5
##$TPOFFS= (0..7)
0 0 0 0 0 0 0 0
##$TUNHIN= 0
##$TUNHOUT= 0
##$TUNXOUT= 0
##$USERA1= <user>
##$USERA2= <user>
##$USERA3= <user>
##$USERA4= <user>
##$USERA5= <user>
##$V9= 5
##$VALIST= <valist>
##$VCLIST= <CCCCCCCCCCCCCCC>
##$VD= 0
##$VDLIST= <DDDDDDDDDDDDDDD>
##$VPLIST= <PPPPPPPPPPPPPPP>
##$VTLIST= <TTTTTTTTTTTTTTT>
##$WBST= 1024
##$WBSW= 4
##$XGAIN= (0..3)
0 0 0 0
##$XL= 0
##$YL= 0
##$YMAX_a= 5645706
##$YMIN_a= -12884401
##$ZGOPTNS= <>
##$ZL1= 120
##$ZL2= 120
##$ZL3= 120
##$ZL4= 120
##$ABSF1= 14.96123
##$ABSF2= -5.596951
##$ABSG= 5
##$ABSL= 3
##$ALPHA= 0
##$AQORDER= 0
##$ASSFAC= 0
##$ASSFACI= 0
##$ASSFACX= 0
##$ASSWID= 0
##$AUNMP= <proc_prof1d_extract.lims>
##$AXLEFT= 0
##$AXNAME= <>
##$AXNUC= <1H>
##$AXRIGHT= 0
##$AXTYPE= 0
##$AXUNIT= <>
##$AZFE= 0.1
##$AZFW= 0.1
##$BCFW= 0
##$BC_mod= 0
##$BYTORDP= 0
##$COROFFS= 0
##$CY= 15
##$DATMOD= 1
##$DC= 0
##$DFILT= <>
##$DTYPP= 0
##$F1P= 0
##$F2P= 0
##$FCOR= 0.5
##$FTSIZE= 131072
##$FT_mod= 6
##$GAMMA= 0
##$GB= 0
##$INTBC= 1
##$INTSCL= 1
##$ISEN= 128
##$LB= 0.3
##$LEV0= 0
##$LPBIN= 0
##$MAXI= 10000
##$MC2= 0
##$MEAN= 0
##$ME_mod= 0
##$MI= 0
##$NCOEF= 0
##$NC_proc= -2
##$NLEV= 6
##$NOISF1= 0
##$NOISF2= 0
##$NSP= 0
##$NTH_PI= 0
##$NZP= 0
##$OFFSET= 14.96123
##$PC= 1
##$PHC0= -83.49609
##$PHC1= 0
##$PH_mod= 1
##$PKNL= yes
##$PPARMOD= 0
##$PPDIAG= 0
##$PPIPTYP= 0
##$PPMPNUM= 2147483647
##$PPRESOL= 1
##$PSCAL= 4
##$PSIGN= 0
##$PYNMP= <proc.py>
##$REVERSE= no
##$SF= 400.020009543112
##$SI= 131072
##$SIGF1= 0
##$SIGF2= 0
##$SINO= 400
##$SIOLD= 131072
##$SPECTYP= <>
##$SREGLST= <1H.CDCl3>
##$SSB= 0
##$STSI= 131072
##$STSR= 0
##$SW_p= 8223.68421052631
##$SYMM= 0
##$S_DEV= 0
##$TDeff= 65536
##$TDoff= 0
##$TI= <>
##$TILT= no
##$TM1= 0
##$TM2= 0
##$TOPLEV= 0
##$USERP1= <user>
##$USERP2= <user>
##$USERP3= <user>
##$USERP4= <user>
##$USERP5= <user>
##$WDW= 1
##$XDIM= 131072
##$YMAX_p= 343953257
##$YMIN_p= -248519
##$CURPLOT= <Network HP LaserJet P1505>
##$CURPRIN= <$Network HP LaserJet P1505>
##$DFORMAT= <normdp>
##$LAYOUT= <+/1D_H.xwp>
##$LFORMAT= <normlp>
##$PFORMAT= <normpl>
##$SURQMSG= 1
$$ End of Bruker specific parameters
$$ ---------------------------------
##NTUPLES= NMR SPECTRUM
##VAR_NAME=  FREQUENCY,     SPECTRUM/REAL,   SPECTRUM/IMAG
##SYMBOL=    X,             R,               I
##VAR_TYPE=  INDEPENDENT,   DEPENDENT,       DEPENDENT
##VAR_FORM=  AFFN,          ASDF,            ASDF
##VAR_DIM=   131072,        131072,          131072
##UNITS=     HZ,            ARBITRARY UNITS, ARBITRARY UNITS
##FACTOR=    0.0627417313425164, 1,          1
##FIRST=     8223.62146879497, -1885,        -57354
##LAST=      0,             -770,            -57741
##MIN=       0,             -248519,         0
##MAX=       8223.62146879497, 343953257,    0
$$ Real data points
##PAGE= N=1
##DATA TABLE= (X++(R..R)), XYDATA
$$ [...]
61581C74274j332k35M90L15n78j554k001j668q27j59j26l67j36P08J514J720J463
61564C71501J141Q36M86K85M94J021J487J689J751J837J896J723J251O96M28N48
61548C89070P57P17M95M48O92R40R02O68N32O57R80J389J876K430K882K896K295
61531D10626J398Q30Q44R96O89j33j052j785k339k635k427j748j127j101j586
61516C99450j984j850j290o96k45J91O79R98Q75L45l17q98j260j213o71J5K69
61499C92398l6m02k97L37J250K140K637K438J748J159Q60M49j87l85K95J106R85
61482D06495J21k50M25J334J527J082P13P64J033J210J077N75n5l26k5M68N79
61465D16747J75l90p51q58q40o83k51L50O60L40k33k57N14J435J822J711J499
$$ y = [374274, 372942, 372707, 373197, 373512, 372934, 371380, 369379, 367711, 366884, 366725, 366599, 366232, 366096, 366804, 368318, 370038, 371501, 372642, 373478, 373964, 374249, 374743, 375764, 377251, 378940, 380691, 382528, 384424, 386147, 387398, 388094, 388522, 389070, 389827, 390544, 391039, 391487, 392179, 393119, 394021, 394689, 395221, 395878, 396858, 398247, 400123, 402553, 405435, 408331, 410626, 412024, 412854, 413698, 414694, 415383, 415250, 414198, 412413, 410074, 407439, 405012, 403264, 402137, 401036, 399450, 397466, 395616, 394326, 393630, 393385, 393576, 394255, 395253, 396128, 396473, 396156, 395258, 393998, 392785, 392114, 392129, 392398, 392362, 391960, 391663, 392000, 393250, 395390, 398027, 400465, 402213, 403372, 404232, 404681, 404494, 404109, 404404, 405510, 406495, 406616, 406366, 406791, 408125, 409652, 410734, 411447, 412211, 413244, 414454, 415531, 416106, 416051, 415725, 415700, 416168, 416747, 416922, 416532, 415781, 414923, 414083, 413400, 413149, 413499, 414159, 414499, 414266, 414009, 414523, 415958, 417780, 419491, 420990]
61448D20990J224P78N00Q57J613J999J788J541J683J928J949K034K589L312L512
61433D48297L113K773K863K762J629k82j549j099N68J950K198J719J276J106J010
61418D68334P84K05q02j736j711n92N62P10P1m02m53o27j185j659j525q06L9L66
61400D59573k95j652k604k368j456j012j332j712j582j020l13L12N31J99k04q1
61384D44984M08P22R77J696K617K864K417K243K713L021K692K429K784L068K539
61369D78174J784J841K567K957K677K236J946J714J756K524L774M621M729M766
61355E18066N411O461P318P900Q582R445J0043R972R401Q744Q017O825N102L457
61341F24744K465J945J365P17M09L98J52m83j040j258j440j840k281k691l322
$$ y = [420990, 422214, 422992, 423492, 424349, 425962, 427961, 429749, 431290, 432973, 434901, 436850, 438884, 441473, 444785, 448297, 451410, 454183, 457046, 459808, 461437, 461155, 459606, 458507, 459075, 461025, 463223, 464942, 466218, 467324, 468334, 469118, 469323, 468521, 466785, 465074, 464482, 465044, 465754, 465825, 465423, 464970, 464343, 463158, 461499, 459974, 459168, 459207, 459573, 459278, 457626, 455022, 452654, 451198, 450186, 448854, 447142, 445560, 444540, 444227, 444539, 445070, 445269, 445065, 444984, 445392, 446114, 447091, 448787, 451404, 454268, 456685, 458928, 461641, 464662, 467354, 469783, 472567, 475635, 478174, 479958, 481799, 484366, 487323, 490000, 492236, 494182, 495896, 497652, 500176, 503950, 508571, 513300, 518066, 523477, 529938, 537256, 545156, 553738, 563183, 573226, 583198, 592599, 601343, 609360, 616185, 621287, 624744, 627209, 629154, 630519, 631236, 631645, 632043, 632195, 631712, 630672, 629414, 627974, 626134, 623853, 621162, 617840]
61326F17840m094m298l505k239j243n22L93J543K506L066L438L932M736N864P136
61311F34553Q426J0001J2215J4825J7059J8510J9385J9699J8997J7263J5262J3454
61299H19649J1251Q045M321J027j711m429p273r798j1639j2699j2959j2655j2317
61286G58813j2079j1403r984q436p451o845o175n615n280m374k243J64J337J437
61272F81866K072L849N584O203O041N826N645N587O249P776R204R593R240R069
61258G73804R317R464Q961P561N265K565L18j135k309l688m935n526n675n926
61244G88061o153n759m740l845l578l600l317k622j864j295q05p2J100K593M082
61229G58186N314O248O943P453P851Q189Q427Q492Q410Q265Q032P645P201O923
$$ y = [617840, 613746, 609448, 605943, 603704, 602461, 601939, 602332, 603875, 606381, 609447, 612885, 616817, 621553, 627417, 634553, 642979, 652980, 665195, 680020, 697079, 715589, 734974, 754673, 773670, 790933, 806195, 819649, 830900, 838945, 843266, 844293, 842582, 838153, 830880, 821082, 809443, 796744, 783785, 771130, 758813, 746734, 735331, 725347, 716911, 709460, 702615, 696440, 690825, 685545, 681171, 678928, 679092, 680429, 681866, 683938, 687787, 693371, 699574, 705615, 711441, 717086, 722673, 728922, 736698, 745902, 755495, 764735, 773804, 783121, 792585, 801546, 809107, 814372, 816937, 817255, 816120, 813811, 810123, 805188, 799662, 793987, 788061, 781908, 776149, 771409, 767564, 763986, 760386, 757069, 754447, 752583, 751288, 750483, 750411, 751511, 754104, 758186, 763500, 769748, 776691, 784144, 791995, 800184, 808611, 817103, 825513, 833778, 841810, 849455, 856656, 863579]
61215H63579O931P151P387P311O648N617M977N176N681N665N235N252N996O839
61201I49445P531Q926J1814J5630J8993K1188K2504K3318K3576K3133K2072K0466
61189A168596J8182J5151J1692Q394N609L114L76k764n802q152r847j1319j2684
61176A180546j3766j4800j6401j8590k0464k1286k1350k1339k1377k1307k1405
61165I68461k1986k2470k1819j9939j7916j6574j5501j3869j1635r358p271n175
61153G84948l097j373qJ450L046L976L492K001O73l8q34k386m241n373n439m988
61137G71809m607m383m102l469k103K08L141O078Q772J1423J4095J6515J8550
61124H31927K0470K2498K4540K6482K8394L0232L1738L2846L3745L4346L4211
$$ y = [863579, 870510, 877661, 885048, 892359, 899007, 904624, 909601, 914777, 920458, 926123, 931358, 936610, 942606, 949445, 956976, 965902, 977716, 993346, 1012339, 1033527, 1056031, 1079349, 1102925, 1126058, 1148130, 1168596, 1186778, 1201929, 1213621, 1222015, 1227624, 1230738, 1231114, 1228350, 1222548, 1214396, 1204549, 1193230, 1180546, 1166780, 1151980, 1135579, 1116989, 1096525, 1075239, 1053889, 1032550, 1011173, 989866, 968461, 946475, 924005, 902186, 882247, 864331, 847757, 832256, 818387, 806752, 797394, 790123, 784948, 781851, 780478, 780470, 781920, 784966, 788942, 792434, 794435, 795108, 795070, 794236, 791850, 787609, 782236, 776797, 771809, 767202, 762819, 758717, 755248, 753145, 753353, 756494, 762572, 771344, 782767, 796862, 813377, 831927, 852397, 874895, 899435, 925917, 954311, 984543, 1016281, 1049127, 1082872, 1117218, 1151429]
61113A151429L3289L2216L1443L0528K8813K6388K3797K1079J7821J3997J0047
61102A420847O078J659l503r067j4409j9118k3101k6542k9753l2761l5019l5993
61090A199318l5938l5723l5703l5346l4099l2185l0197k8247k5974k3225k0392
61079H62289j7997j6206j4756j3287j1731j0263q979p691o205m675l409k390j248
61066G43452K11J662K599K920L122L956N709P759R066R380R750J1353J4033J6544
61052H41516J8192J9539K1242K3051K4376K5314K6374K7590K8600K9472L0629
61041A115895L1901L2391L1586L0102K8886K8129K7369K6412K5507K4704K3652
61030A426534K2290K1212K0917K1002K0714K0188K0467K2136K4541K6751K8720
$$ y = [1151429, 1184718, 1216934, 1248377, 1278905, 1307718, 1334106, 1357903, 1378982, 1396803, 1410800, 1420847, 1426925, 1428584, 1425081, 1416014, 1401605, 1382487, 1359386, 1332844, 1303091, 1270330, 1235311, 1199318, 1163380, 1127657, 1091954, 1056608, 1022509, 990324, 960127, 931880, 905906, 882681, 862289, 844292, 828086, 813330, 800043, 788312, 778049, 769070, 761379, 755174, 750499, 747090, 744700, 743452, 743663, 745325, 747924, 750844, 753966, 757922, 763631, 771390, 780456, 789836, 799586, 810939, 824972, 841516, 859708, 879247, 900489, 923540, 947916, 973230, 999604, 1027194, 1055794, 1085266, 1115895, 1147796, 1180187, 1211773, 1241875, 1270761, 1298890, 1326259, 1352671, 1378178, 1402882, 1426534, 1448824, 1470036, 1490953, 1511955, 1532669, 1552857, 1573324, 1595460, 1620001, 1646752, 1675472]
61019A675472L0954L3498L5991L8554M1754M5758N0355N5836O2891P1379Q0271
61008B222713Q9307R9638J12074J25824J40182J56805J79007K09217K48392K97566
60998C880725L58564M33588N25891O40644P82463R50851J139768J342233J551851
60989A1606578J755629J925723K022804K012416J882901J654095J373785J102470
60981B5336401Q88615P45260O45547N43391M02031K06067m5911l48092o80380
60972B7692929j001782j265528j449895j572199j667217j751336j809691j815520
60964A5359761j756057j639196j482885j305140j122296r48979p95252o64685
60956E645271n56447m68298l97326l39946k93050k54851k24033j98900j77954
$$ y = [1675472, 1706426, 1739924, 1775915, 1814469, 1856223, 1901981, 1952336, 2008172, 2071063, 2142442, 2222713, 2312020, 2411658, 2523732, 2649556, 2789738, 2946543, 3125550, 3334767, 3583159, 3880725, 4239289, 4672877, 5198768, 5839412, 6621875, 7572726, 8712494, 10054727, 11606578, 13362207, 15287930, 17310734, 19323150, 21206051, 22860146, 24233931, 25336401, 26225016, 26970276, 27615823, 28159214, 28561245, 28767312, 28721401, 28373309, 27692929, 26691147, 25425619, 23975724, 22403525, 20736308, 18984972, 17175281, 15359761, 13603704, 11964508, 10481623, 9176483, 8054187, 7105208, 6309956, 5645271, 5088824, 4620526, 4223200, 3883254, 3590204, 3335353, 3111320, 2912420, 2734466]
60947B734466j60416j45474j31835j18740j06819r7066q9538q3578p8736p4684
60937A647580p0783o6541o2215n8330n4961n1925m9214m6597m3409l9459l5596
60926A068550l2565k9809k6339k2355j8986j6615j4619j2670j1150j0167r142
60915H64133p770o470n610m935m147l365k666j770o26J74K0j016k332l383l925
60900H16312m073m325n128o234o919p070p426q433r398r369q503p863p953q193
60886G15425p894p183o629o386o175n916n885o155o387o422o694p548q410q290
60872F19451p121n952n623n879o096o119n924n142l749k587k313k156q65J328
60858E61253K777K660K002K050K715L228L522M082M871N288N031M414L836L417
$$ y = [2734466, 2574050, 2428576, 2296741, 2178001, 2071182, 1974116, 1884578, 1801000, 1722264, 1647580, 1576797, 1510256, 1448041, 1389711, 1334750, 1282825, 1233611, 1187014, 1143605, 1104146, 1068550, 1035985, 1006176, 979837, 957482, 938496, 921881, 907262, 894592, 883442, 873275, 864133, 856363, 849893, 844283, 839348, 835201, 831836, 829170, 827400, 826774, 826948, 826968, 825952, 823620, 820237, 816312, 812239, 807914, 802786, 796552, 789633, 782563, 775137, 766704, 757306, 747937, 739434, 731571, 723618, 715425, 707531, 700348, 693719, 687333, 681158, 675242, 669357, 663202, 656815, 650393, 643699, 636151, 627741, 619451, 612330, 606378, 600755, 594876, 588780, 582661, 576737, 571595, 567846, 565259, 562946, 560790, 559925, 561253, 564030, 566690, 568692, 570742, 573457, 576685, 580207, 584289, 589160, 594448, 599479, 603893, 607729, 611146]
60844F11146L144K931K570J891J010J65o44j643k860m028m875n364n472m955l646
60829E89370k024j189j878l506m605m337l235k337j994j886j857k060k440k584
60815E53438k297j896j883k434l279l919m054l902l941m271m579m828n364o079
60801E00712o111n077l982m034m944n320m532l191k010j201r92j625k606k950
60787D52137k400j658j223q35k95R4J71K15L29K96K24N04R83J118J102J682K616
60770D55060K705J797J377K322L473L537L132L561M506M613L684K762K285J732
60756D96546R58N61P08P20Q6r03j667j865j423p09n27j288k325k742k676k930
60740D80524l653m280m606m906n072m696l995l716l942l955l498l230l612m207
$$ y = [611146, 614290, 617221, 619791, 621682, 622692, 622857, 622213, 620570, 617710, 613682, 608807, 603443, 597971, 593016, 589370, 587346, 586157, 584279, 580773, 576168, 571831, 568596, 566259, 564265, 562379, 560522, 558462, 556022, 553438, 551141, 549245, 547362, 544928, 541649, 537730, 533676, 529774, 525833, 521562, 516983, 512155, 506791, 500712, 494601, 489524, 485542, 481508, 476564, 471244, 466712, 463521, 461511, 460310, 459318, 457693, 455087, 452137, 449737, 448079, 446856, 446021, 445726, 445820, 445991, 446206, 446535, 446831, 447055, 447559, 448542, 449660, 450762, 452444, 455060, 457765, 459562, 460939, 463261, 466734, 470271, 473403, 476964, 481470, 486083, 489767, 492529, 494814, 496546, 497504, 498065, 498773, 499493, 499579, 498676, 497009, 495144, 493721, 493012, 492485, 491197, 488872, 486130, 483454, 480524, 476871, 472591, 467985, 463079, 458007, 453311, 449316, 445600, 441658, 437703, 434205, 430975, 427363, 423156]
60726D23156m401m108l396k173o74L81N92L86M13Q21J341J682J643J248Q78Q87
60710D18676J028Q05L60L63R25J368J314J261J684K276K536K570K735K950K860
60695D43711K431J959J699J788K340L283M276M964N175M868M163L462L113K943
60681D90175K549K018J835K003J929J399R01P73O36J71k59k84k87r00k061l143
60665D97455l711l690l144k384j993k242k693k823k701k622k473k000j384r20
60651D62675m29M00J310J758J745J673J502P90l94j399j897k192k476k450k005
60636D58611j638j696j796j451r10p31q20n53J91P27M94j74m98k28K04M21O00
60619D50753J074J641J634P34n00j106p15J07M41r4j077j752j745j329j079j229
$$ y = [423156, 418755, 414647, 411251, 409078, 408404, 408785, 409377, 409763, 410176, 410997, 412338, 414020, 415663, 416911, 417789, 418676, 419704, 420509, 420869, 421232, 422157, 423525, 424839, 426100, 427784, 430060, 432596, 435166, 437901, 440851, 443711, 446142, 448101, 449800, 451588, 453928, 457211, 461487, 466451, 471626, 476494, 480657, 484119, 487232, 490175, 492724, 494742, 496577, 498580, 500509, 501908, 502809, 503582, 504218, 504389, 504130, 503846, 503559, 502659, 500598, 497455, 493744, 490054, 486910, 484526, 482533, 480291, 477598, 474775, 472074, 469452, 466979, 464979, 463595, 462675, 462246, 462646, 463956, 465714, 467459, 469132, 470634, 471424, 471030, 469631, 467734, 465542, 463066, 460616, 458611, 456973, 455277, 453481, 452030, 451120, 450389, 449569, 449016, 449207, 449934, 450428, 450254, 449756, 449528, 449732, 450153, 450753, 451827, 453468, 455102, 455836, 455336, 454230, 453515, 453622, 454063, 453969, 452892, 451140, 449395, 448066, 446987, 445758]
60603D45758j489j489j269j100r25l44P37J741K028J696J503J911K556K777K426
60588D56517J927J766K096K775L434L614L112K273J674J455J284R57O74O13N89
60573D84760M94O61J397K408L154L654M475N924P745R610J1429J3068J4131J4392
60559E77302J4125J3693J2975J1463Q994O181M004K894K255J014j227l725n448
60546F44500o184o484o625o195m828k877r97P54K911N751Q704J0852J1975J2942
60532F64199J4879J7855K0598K1673K0944J9511J8320J7135J5096J1956Q409N231
60520H55806K424o08m093p355r440j0215j0575j1323j2169j2093j0661q597o963
60507G54138o103n494m407k524k9K673N247P580R813J2349J5704K0117K5250L0499
$$ y = [445758, 444269, 442780, 441511, 440411, 439486, 439142, 439879, 441620, 443648, 445344, 446847, 448758, 451314, 454091, 456517, 458444, 460210, 462306, 465081, 468515, 472129, 475241, 477514, 479188, 480643, 481927, 482884, 483558, 484171, 484760, 485254, 485915, 487312, 489720, 492874, 496528, 501003, 506927, 514672, 524282, 535711, 548779, 562910, 577302, 591427, 605120, 618095, 629558, 638552, 644733, 648737, 651631, 653886, 654900, 653673, 649948, 644500, 638316, 631832, 625207, 619012, 614184, 611307, 610310, 611064, 613975, 619726, 628430, 639282, 651257, 664199, 679078, 696933, 717531, 739204, 760148, 779659, 797979, 815114, 830210, 842166, 850575, 855806, 858230, 857622, 853529, 846174, 836734, 826519, 815944, 804621, 792452, 780359, 769698, 761101, 754138, 748035, 742541, 738134, 735610, 735581, 738254, 743501, 751081, 760894, 773243, 788947, 809064, 834314, 864813]
60493H64813L5607M0663M5479M9499N2519N4922N6749N7032N4848N0677M5872
60482A408680M0886L4824K6819J7105O540m162j4394k3526l1333l8148m4267m9542
60470A329482n3738n6825n8638n8804n7331n4842n1849m8261m3948l9339l4969
60459G70938l0904k7120k3948k1579j9476j7018j4463j2581j1459j0453r226q101
60447E64610p267o360n144l998l345l014k589k098j944k218k456k175j516j150
60433E19336j492k107k167j527j018j351k062k066j124j09K82M43J114K185K818
60418E11155K607K036J699J523J099N23L81Q69J338J050J94k70J94J112J781K158
60402E29449K547K736K139Q27j66P1J281K348K527K032J596J699K297L002L451
$$ y = [864813, 900420, 941083, 986562, 1036061, 1088580, 1143502, 1200251, 1257283, 1312131, 1362808, 1408680, 1449566, 1484390, 1511209, 1528314, 1534854, 1530692, 1516298, 1492772, 1461439, 1423291, 1379024, 1329482, 1275744, 1218919, 1160281, 1101477, 1044146, 989304, 937455, 889194, 845246, 805907, 770938, 740034, 712914, 688966, 667387, 647911, 630893, 616430, 603849, 592390, 581937, 572711, 564610, 557343, 550983, 545839, 541841, 538496, 535482, 532893, 530795, 528851, 526633, 524177, 522002, 520486, 519336, 517844, 515737, 513570, 512043, 511025, 509674, 507612, 505546, 504422, 504313, 504595, 505038, 506152, 508337, 511155, 513762, 515798, 517497, 519020, 520119, 520642, 521023, 521892, 523230, 524280, 524474, 524204, 524398, 525510, 527291, 529449, 531996, 534732, 536871, 537698, 537532, 537603, 538884, 541232, 543759, 545791, 547387, 549086, 551383, 554385, 557836]
60387E57836L601L719L974M071L550K452J538J553K394L338L994M636N430N802
60373F07888N085L579K379K097K248K135J858J982K503K764K427J953J913K192
60359F43003K225J805J355J475K460M205O240P935Q963R634J0505J1577J2229
60346G23611J2121J1732J1640J1518J0414P966M856J935o24l132n709q112j0037
60333G68179j1345j2073j2381j2431j2272j1931j1494j0850r520p288m921l631
60321F48042l604l767l305k665k542k593k002q50J12Q31K082M176O414Q134R619
60306F58082J1574J4148J6839J9088K0754K2061K3167K3635K2590J9701J5750
60295H67389J1844Q261M537M26l815p900j1576j4406j6208j7611j9291k0770k0864
$$ y = [557836, 561437, 565156, 569130, 573201, 576751, 579203, 580741, 582294, 584688, 588026, 592020, 596656, 602086, 607888, 612973, 616552, 618931, 621028, 623276, 625411, 627269, 629251, 631754, 634518, 636945, 638898, 640811, 643003, 645228, 647033, 648388, 649863, 652323, 656528, 662768, 670703, 679666, 689300, 699805, 711382, 723611, 735732, 747464, 759104, 770622, 781036, 789002, 793858, 795793, 795169, 792037, 786328, 778216, 768179, 756834, 744761, 732380, 719949, 707677, 695746, 684252, 673402, 663882, 656594, 651673, 648042, 644438, 640671, 637366, 634701, 632159, 629566, 627564, 626714, 626826, 627657, 629739, 633915, 640329, 648463, 658082, 669656, 683804, 700643, 719731, 740485, 762546, 785713, 809348, 831938, 851639, 867389, 879233, 887494, 892031, 892457, 888642, 880742, 869166, 854760, 838552, 820941, 801650, 780880, 760016]
60282G60016j9475j7806j6611j5274j3151j0856r392q826q517q079p439o431n073
60269F13086l881l289l068k882k928l383l692l185k096j228p72l00K63M46J48
60254E83239l9L71J102J515J320P26J11k83m82o66q98j015q73o10n23q02j380
60237E80813j881j779r43M3N03O04J112K180L160L743M443N494O213O177O143
60222F16025O934Q033Q367Q038Q092Q753R177R023R144J0271J1873J2818J2646
60209G39194J1817J1046J0710J0584J0108R074Q012P501P250O382M629K655J110
60196H40072k9j078k178l423m950o533p544p683p479p694q340q625p888o386n081
60181G55161m697n088n592n870o033o035n496m361l231k567k051j236m51l57q05
$$ y = [760016, 740541, 722735, 706124, 690850, 677699, 666843, 657451, 648625, 640108, 632029, 624590, 618159, 613086, 609205, 605916, 602848, 599966, 597038, 593655, 589963, 586778, 584682, 583454, 582682, 582382, 582645, 583091, 583239, 583200, 583571, 584673, 586188, 587508, 588234, 588345, 588062, 587580, 586914, 586016, 585001, 584128, 583518, 582995, 582193, 580813, 578932, 577153, 576210, 576253, 576756, 577360, 578472, 580652, 583812, 587555, 591998, 597492, 603705, 609882, 616025, 622959, 630992, 639359, 647397, 655489, 664242, 673419, 682442, 691586, 701857, 713730, 726548, 739194, 751011, 762057, 772767, 783351, 793459, 802533, 810545, 818046, 825296, 831678, 836307, 838962, 840072, 840043, 838965, 836787, 833364, 828414, 821881, 814337, 806654, 799175, 791481, 783141, 774516, 766628, 760242, 755161, 750464, 745376, 739784, 733914, 727881, 721846, 716350, 711989, 708758, 706191, 704140, 702904, 702453, 702096, 701291]
60166G01291r61m51K59O53P05N15J12k71k37K32P15R37J020J127J277J574K134
60149G10631K729L008L186L888N178O239O337N650M885M515M642N183N886O408
60135G78365O708P081P668Q173Q260P939P428O850O234N561M741L827L261L497
60121H65593M294M812M623M129L754L212K059O28k28k76l15j295l255n259o393
60106H76083o678o878p418p795p346o327n628n528n318m405l211k582k657k801
60092H01511k437j562m84N98J621K478K905K610J561K32n78l69N57J191N34j559
60076H08809m142n965o638o951p796r064r910r976r801r938j0118r635q301o722
60062F93852n668n372n455n433n061m230k772o98J440K830L212L111L178L619
$$ y = [701291, 700330, 699879, 700138, 700791, 701496, 702011, 702123, 701852, 701615, 701847, 702562, 703499, 704519, 705646, 706923, 708497, 710631, 713360, 716368, 719554, 723442, 728620, 734859, 741196, 746846, 751731, 756246, 760888, 766071, 771957, 778365, 785073, 792154, 799822, 807995, 816255, 824194, 831622, 838472, 844706, 850267, 855008, 858835, 862096, 865593, 869887, 874699, 879322, 883451, 887205, 890417, 892476, 893104, 892876, 892600, 892285, 890990, 887735, 882476, 876083, 869405, 862527, 855109, 847314, 839968, 833641, 828013, 822485, 817167, 812762, 809551, 806969, 804312, 801511, 799074, 797512, 797028, 797626, 799247, 801725, 804630, 807240, 808801, 809033, 808455, 808086, 808643, 809834, 810368, 808809, 804667, 798702, 792064, 785113, 777317, 768253, 758343, 748367, 738566, 728628, 718510, 708875, 700574, 693852, 688184, 682812, 677357, 671924, 666863, 662633, 659861, 659163, 660603, 663433, 666645, 669756, 672934, 676553]
60048F76553M342N169N731N689N431N923P347Q462P994O276M684L720K588N86
60034G50495j924m077n415o058o459p076p927q527q576q435q458q282p535o817
60020F54929p015p815q020p375o908p210p494o874n658m741m396m290m156l898
60006E69079l401k691j946j128QJ335K293K680K932L369L706L666L504L595L906
59991E90907M259M610M816M607M067L691L592L165J857j02k033l449m244m657
59977F11086n234o304p291p217o021m714m031l740l461l304l164k333n28J396
59963E55140K447K649K586K459K272K380L055L895M339M389M252L772K829J837
59949E98301J179O05j45o38m54j23n25j641k647l045k986k726k455k468k845l077
$$ y = [676553, 680895, 686064, 691795, 697484, 702915, 708838, 716185, 724647, 732641, 738917, 743601, 747321, 749909, 750495, 748571, 744494, 739079, 733021, 726562, 719486, 711559, 703032, 694456, 686021, 677563, 669281, 661746, 654929, 647914, 640099, 632079, 624704, 617796, 610586, 603092, 596218, 590560, 585819, 581423, 577133, 572977, 569079, 565678, 562987, 561041, 559913, 559921, 561256, 563549, 566229, 569161, 572530, 576236, 579902, 583406, 587001, 590907, 595166, 599776, 604592, 609199, 613266, 616957, 620549, 623714, 625571, 625469, 623436, 619987, 615743, 611086, 605852, 599548, 592257, 585040, 579019, 574305, 570274, 566534, 563073, 559769, 556605, 554272, 553744, 555140, 557587, 560236, 562822, 565281, 567553, 569933, 572988, 576883, 581222, 585611, 589863, 593635, 596464, 598301, 599480, 600085, 599940, 599302, 598848, 598725, 598200, 596559, 593912, 590867, 587881, 585155, 582700, 580232, 577387, 574310]
59933E74310k594j519l67O37J560K405L271M452N865O817O992P075P695Q325Q149
59918F33073P442P111P245P259P106P200P289O600N136L685K551J354J61l15K1
59903G02918K41l02j105j383j109p93p27p43l68Q44K599L684L198J860J228J729
59887G11771K436K822L440M519N228M971M452M578N081N107M599M195M130L993
59873G71322L416K375R89m60j494j838j830k086k890m060n243o094o430o371o135
59858G33171n637m680l577l022l097l053k415j722j683j989j663l19J478K962
59844G04754L836M264M608N134N823O527P339Q438R463R596Q636P492P106P234
59830H00250O936N955M895M149L411K313Q79q31k967n385p422q518q902r300j0008
$$ y = [574310, 571716, 570197, 569830, 570467, 572027, 574432, 577703, 582155, 588020, 594837, 601829, 608904, 616599, 624924, 633073, 640515, 647626, 654871, 662130, 669236, 676436, 683725, 690325, 695461, 699146, 701697, 703051, 703212, 702897, 702918, 703159, 702857, 701752, 700369, 699260, 698467, 697740, 696997, 696629, 697473, 700072, 703756, 706954, 708814, 710042, 711771, 714207, 717029, 720469, 724988, 730216, 735187, 739639, 744217, 749298, 754405, 759004, 763199, 767329, 771322, 774738, 777113, 778102, 777642, 776148, 774310, 772480, 770394, 767504, 763444, 758201, 752107, 745677, 739306, 733171, 727534, 722854, 719277, 716255, 713158, 710105, 707690, 705968, 704285, 702296, 700633, 700314, 701792, 704754, 708590, 712854, 717462, 722596, 728419, 734946, 742285, 750723, 760186, 769782, 778418, 785910, 793016, 800250, 807186, 813141, 818036, 822185, 825596, 827909, 828788, 827957, 824990, 819605, 812183, 803665, 794763, 785463, 775455]
59815G75455j0612j0540r739q691p885p335o648n586m444l737l570l536l268k903
59801F86961k820k994k974k505k019k217l235m432n071n005m618m257l966l709
59787F37139l610l772m020l940l313k417j810j785k064k137j760j045j79O87J387
59772F07361J849K276K912L564L781L545L413L788M479N198O045P090P903Q116
59758F71320Q110Q539R292R583R090Q387Q021P743O980N777M827M716N305N839
59744G73529N588M405K709J026l59j278j561j321j130j527k337k812k495j678
59730G70759r78p14p39p42n97m02k53j0M94J061J258R85O02L79K19J27L83R37
59712G72769J147O90K37N64J344J586J085N80N58P90J109J761K702L296L128K609
$$ y = [775455, 764843, 754303, 744564, 735873, 727988, 720653, 714005, 708419, 703975, 700238, 696668, 693132, 689864, 686961, 684141, 681147, 678173, 675668, 673649, 671432, 668197, 663765, 658694, 653689, 649071, 644814, 640848, 637139, 633529, 629757, 625737, 621797, 618484, 616067, 614257, 612472, 610408, 608271, 606511, 605466, 605287, 605974, 607361, 609210, 611486, 614398, 617962, 621743, 625288, 628701, 632489, 636968, 642166, 648211, 655301, 663204, 671320, 679430, 687969, 697261, 706844, 715934, 724321, 732342, 740085, 747065, 752842, 757669, 762385, 767690, 773529, 779117, 783522, 786231, 787257, 786898, 785620, 784059, 782738, 781608, 780081, 777744, 774932, 772437, 770759, 769781, 769067, 768328, 767586, 766989, 766587, 766334, 766324, 766818, 767879, 769137, 770122, 770724, 771103, 771322, 771449, 771832, 772769, 773916, 774606, 774843, 775407, 776751, 778337, 779422, 780002, 780560, 781350, 782459, 784220, 786922, 790218, 793346, 795955]
59696G95955K368K469K565K421J952J125J64m02k70J99L48j03q70j465j592j385
59680H03479j372k053l431n003o242o902o985o759o713p154p730p703o804n552
59666G23076m601m058l571k832j831q09j3N96J381K608M036N117N589N580N248
59651G35516M634L821K983K141J123k46j969l813n299o048o274o646p373p853
59637G04697p565o830o126n219l724k172j564k064k983l852m599m844m195l251
59623F45709l101l615l474k335j618k397l696l875k822j680r73k46P67J705K277
59608F20626K514K334J648R07Q70J659K535K759K236J278K46m50m44J97Q81R74
59592F40770L57n76j341j716j771j645j389j099j015j265j548j304m26M82O28
$$ y = [795955, 798323, 800792, 803357, 805778, 807730, 808855, 809019, 808617, 808347, 808546, 808894, 808791, 807921, 806456, 804864, 803479, 802107, 800054, 796623, 791620, 785378, 778476, 771491, 764732, 758019, 750865, 743135, 735432, 728628, 723076, 718475, 714417, 710846, 708014, 706183, 705374, 705361, 705957, 707338, 709946, 713982, 719099, 724688, 730268, 735516, 740150, 743971, 746954, 749095, 750218, 749972, 748003, 744190, 738891, 732843, 726569, 719923, 712550, 704697, 697132, 690302, 684176, 678957, 675233, 673061, 671497, 669433, 666450, 662598, 657999, 653155, 648960, 645709, 642608, 638993, 635519, 633184, 631566, 629169, 625473, 621598, 618776, 617096, 616123, 615877, 616644, 618349, 620626, 623140, 625474, 627122, 628029, 628899, 630558, 633093, 635852, 638088, 639366, 639612, 639162, 638718, 638915, 639796, 640770, 641127, 640551, 639210, 637494, 635723, 634078, 632689, 631590, 630575, 629310, 627762, 626458, 626032, 626514, 627142]
59577F27142k09j514k506k747k386j854j361q51m35m79r75j249p55J04M78K07
59561F10610j43j83K1M58J176J715J319l4j460k127j925j084P4R12Q13J21M2J242
59543F11547L084M699O128P973J0459J3258J5812J7461J7668J6510J4563J2188
59531G51350R459O857N173M394L563K195R93N29J85p63j822k087j818k160l576
59516G72472n486p310q917j0185j0955j1433j1905j2115j1543j0300r109q366
59504F54848p789o986n929m851m046l655l396k660j317l9N51P37J091J435J236
59489F19230P07O67J304J941K170K400L040L807M228M291M280M286M276M416M930
59474F65973N701O269O296N936N627N497N157M367L645L679M197M138L213K509
$$ y = [627142, 626933, 625419, 622913, 620166, 617780, 615926, 614565, 613714, 613279, 612800, 611825, 610576, 609821, 609925, 610403, 610610, 610467, 610284, 610305, 610763, 611939, 613654, 614973, 614939, 613479, 611352, 609427, 608343, 608417, 609329, 610142, 610263, 610305, 611547, 614631, 619330, 625458, 633431, 643890, 657148, 672960, 690421, 708089, 724599, 739162, 751350, 760809, 767666, 772839, 777233, 780796, 782991, 783984, 784513, 784698, 783935, 782113, 780026, 778208, 776048, 772472, 766986, 759676, 750759, 740574, 729619, 718186, 706281, 694166, 682623, 672323, 663214, 654848, 647059, 640073, 634144, 629293, 625247, 621592, 618196, 615536, 614219, 614180, 614731, 615468, 616559, 617994, 619230, 619937, 620604, 621908, 623849, 626019, 628419, 631459, 635266, 639494, 643785, 648065, 652351, 656627, 661043, 665973, 671674, 677943, 684239, 690175, 695802, 701299, 706456, 710823, 714468, 718147, 722344, 726482, 729695, 732204]
59460G32204L022M322N338N923O712P835Q708R027R026Q782Q023O790N488M112
59446H25312K184l29k660m181n148o080o876p061o730o652p323q238q323p106
59432G50789n213l610k507j355K31K030L813N815Q233J0681J2686J4348J6079
59419H12020J7842J9197J9904K0077J9843J9318J8754J8271J7405J5354J1721
59408A009706O862J649k890n943p379p735p520o696n090l001j075J19J09j478
59394I69638m335p258r079r784j0297j1250j2419j3155j2960j1806j0264r097
59382H47934q384p435n925m572m069l904l141j954j389j685j909j369m23L35R01
59367H03011J540K254K973L780M718N685O734Q086R725J1326J2648J3757J4849
$$ y = [732204, 735226, 739548, 744886, 750809, 757521, 765356, 774064, 783091, 792117, 800899, 808922, 815712, 821200, 825312, 827496, 827167, 824507, 820326, 815178, 809098, 802222, 795161, 788431, 781779, 774456, 766218, 757895, 750789, 745576, 741966, 739459, 738104, 738335, 740365, 744178, 749993, 758226, 768907, 781593, 795941, 812020, 829862, 849059, 868963, 889040, 908883, 928201, 946955, 965226, 982631, 997985, 1009706, 1016568, 1018217, 1015327, 1009384, 1002005, 994270, 986750, 980054, 974964, 971963, 970888, 971007, 971116, 969638, 965303, 958045, 948966, 939182, 928885, 917635, 905216, 892061, 879101, 867295, 857031, 847934, 839550, 832115, 826190, 821618, 817549, 813645, 810504, 808550, 807161, 805476, 803567, 802198, 801775, 802110, 803011, 804551, 806805, 809778, 813558, 818276, 823961, 830695, 838781, 848506, 859832, 872480, 886237, 901086]
59354I01086J6141J7828J9721K1154K1692K1820K2323K3102K3185K1960J9782
59343A129794J7299J4735J1956Q827N382J951j043l727o958j1227j5654j8816
59331A132519k0451k1534k2764k3898k4628k5099k5277k4641k3016k0990j9111
59320H81110j7281j5347j3688j2662j2023j1361j0741j0405j0181r625q631p485
59308G41680o501n857n587n539n444n099m389l188j609k59K32O1J80J292L294
59293G03267N736Q326J0812J2929J4738J6507J8012J8395J7071J4427J1387Q587
59281H60194O230M344K842J596P34P16J853L928O397Q710J0418J1290J1554J1725
59267I42531J1977J1888J0971R171O703L736M88k590n045o796q134r418j0762
$$ y = [901086, 917227, 935055, 954776, 975930, 997622, 1019442, 1041765, 1064867, 1088052, 1110012, 1129794, 1147093, 1161828, 1173784, 1182611, 1187993, 1189944, 1188901, 1185174, 1178216, 1166989, 1151335, 1132519, 1112068, 1090534, 1067770, 1043872, 1019244, 994145, 968868, 944227, 921211, 900221, 881110, 863829, 848482, 834794, 822132, 810109, 798748, 788007, 777602, 767421, 757796, 749165, 741680, 735179, 729322, 723735, 718196, 712752, 707653, 703264, 700076, 698467, 698208, 698440, 698501, 698681, 699973, 703267, 709003, 717329, 728141, 741070, 755808, 772315, 790327, 808722, 825793, 840220, 851607, 860194, 866424, 870768, 873610, 875206, 875940, 876656, 878509, 882437, 888834, 897544, 907962, 919252, 930806, 942531, 954508, 966396, 977367, 986538, 993241, 996977, 997465, 994875, 989830, 983034, 974900, 965482, 954720]
59254I54720j1965j2691j2775j2328j1457j0087q201o072l973j869L07K254L651
59241H69514M715N966P458Q610Q858Q172O984N831M895L731J729q92k985l922
59227I28664m613o368r069j1443j2893j3966j4968j5290j4562j3516j3049j2996
59215G85931j2457j0997r027p228n963n146m481l868l501l458l353k754j752o71
59201G11275N33K046L511M288M314M090L830L341K742K581L098L925M664N153
59187G59391N219M814M399M486M738M325L253K459K443K703K785K966L443L689
59173H11113L276K674K704L548M729N676N972N520M719M170L895L316K029J74
59159H63515k016m422o729q587j0169j1867j3416j4090j3895j3575j3329j2527
$$ y = [954720, 942755, 930064, 917289, 904961, 893504, 883417, 875216, 869144, 865171, 863302, 863609, 865863, 869514, 874229, 880195, 887653, 896263, 905121, 913293, 920277, 926108, 931003, 934734, 936463, 935571, 932586, 928664, 924051, 917683, 908614, 897171, 884278, 870312, 855344, 840054, 825492, 811976, 798927, 785931, 773474, 762477, 753450, 746222, 740259, 735113, 730632, 726764, 723263, 719805, 716452, 713698, 711946, 711275, 711808, 713854, 717365, 721653, 725967, 730057, 733887, 737228, 739970, 742551, 745649, 749574, 754238, 759391, 764610, 769424, 773823, 778309, 783047, 787372, 790625, 793084, 795527, 798230, 801015, 803981, 807424, 811113, 814389, 817063, 819767, 823315, 828044, 833720, 839692, 845212, 849931, 854101, 857996, 861312, 863341, 863515, 861499, 857077, 850348, 841761, 831592, 819725, 806309, 792219, 778324, 764749, 751420, 738893]
59147G38893j1114j0144j0291j0789j0576r708q824p910o531m794l363k623k436
59134F39790k438k211j529p07l06k34K61J469K788L768M798O259P734Q718R463
59119F77623J0465J1663J2739J3769J4923J5923J6372J6298J5930J5295J4402
59108H35402J3349J1957R874P309N051L401J801j07j917l382m954o752p884p623
59094H55525o509n446m482l373k546k475k683k526k407l145m538n719o504p311
59080G95861p973p899p310p116p499p652p190o723o772o901o479n691n254n425
59066F99977n656n171l839k410j791k028k343k252k138k420k712k372j519q46
59052F62480o84p65p48n12q4L45M82K78pk53o48j130j229q31n45q80j478j641
$$ y = [738893, 727779, 717635, 707344, 696555, 685979, 676271, 667447, 659537, 653006, 648212, 644849, 642226, 639790, 637352, 635141, 633612, 632905, 632599, 632365, 632626, 634095, 636883, 640651, 645449, 651708, 659442, 668160, 677623, 688088, 699751, 712490, 726259, 741182, 757105, 773477, 789775, 805705, 821000, 835402, 848751, 860708, 870582, 877891, 882942, 886343, 888144, 888037, 886120, 882738, 877784, 871032, 863148, 855525, 849016, 843570, 839088, 835715, 833169, 830694, 828011, 825485, 823078, 819933, 815395, 809676, 803172, 795861, 787888, 779989, 772679, 765563, 758064, 750412, 743222, 736499, 729727, 722826, 716347, 710656, 705402, 699977, 694321, 689150, 685311, 682901, 681110, 679082, 676739, 674487, 672349, 669929, 667217, 664845, 663326, 662480, 661796, 661031, 660283, 659771, 659687, 660032, 660514, 660792, 660785, 660532, 659884, 658754, 657525, 656694, 656149, 655269, 653791, 652150]
59034F52150j128m5J556L416M926N831O618P752R017J0085J1086J2028J2296J1487
59020G47075J0180R081Q002O440M632L070J512m86k373l070k544j887j791j742
59006G76099r75M43J782K518K932L845N695P841R184R454R305R099Q510P529O757
58991H60018O246N174L340J821J265P17o73j886j438K42J449J688J957K869M006
58976H86795N106O514Q320J0117J1730J3283J4658J5665J6505J7329J7690J7339
58964A041051J6954J7069J6805J4969J1842Q635N560J927k205o028r472j3134
58952A103973j6764j9432k1110k2550k3570k3140k1435k0043j9620j8921j6845
58941H80543j4033j1621r693p808o027m520k979j265k9M9q68k047k937l333l309
$$ y = [652150, 651022, 650977, 652533, 655949, 660875, 666706, 673324, 681076, 690093, 700178, 711264, 723292, 735588, 747075, 757255, 766336, 774338, 780778, 785410, 788480, 789992, 789506, 787133, 784063, 781519, 779632, 777841, 776099, 775124, 775567, 777349, 779867, 782799, 786644, 792339, 800180, 809364, 818818, 828123, 837222, 845732, 853261, 860018, 866264, 871438, 874778, 876599, 877864, 878581, 877908, 876022, 874584, 874826, 876275, 877963, 879920, 882789, 886795, 891901, 898415, 906735, 916852, 928582, 941865, 956523, 972188, 988693, 1006022, 1023712, 1041051, 1058005, 1075074, 1091879, 1106848, 1118690, 1127325, 1132885, 1134812, 1132607, 1126579, 1117107, 1103973, 1087209, 1067777, 1046667, 1024117, 1000547, 977407, 955972, 935929, 916309, 897388, 880543, 866510, 854889, 845196, 837388, 831361, 826841, 823862, 822597, 822568, 822617, 821749, 819702, 816765, 813432, 810123]
58926H10123l219l329l384l051k646k629k624j921q28m05p92r97n31QK34O83J782
58909G86474L213M680O281P769Q640R348J1182J4296J7133J8541J9312K0652K2308
58896I49829K3315K3795K4661K6079K7393K8387K9416L0417L0697K9882K8338
58885A252209K6477K4139K0951J6974J2743Q609M294p51o454j1886j6084j8835
58873A312386k0472k1308k1664k1998k2354k2061k0670j8857j7669j7165j6603
58862A091565j5699j4777j3923j2936j1995j1491j1293j1061j1022j1541j2135
58851I53692j2085j1708j1871j2430j2510j2221j2559j3564j4090j3644j2996
58840H14014j2612j1963j0816r718q766p256n195l733l433l376k721j819j090
$$ y = [810123, 806904, 803575, 800191, 797140, 794494, 791865, 789241, 787320, 786492, 786087, 785295, 784298, 783767, 783775, 784009, 784692, 786474, 789687, 794367, 800648, 808417, 817057, 826405, 837587, 851883, 869016, 887557, 906869, 927521, 949829, 973144, 996939, 1021600, 1047679, 1075072, 1103459, 1132875, 1163292, 1193989, 1223871, 1252209, 1278686, 1302825, 1323776, 1340750, 1353493, 1362102, 1366396, 1365645, 1359191, 1347305, 1331221, 1312386, 1291914, 1270606, 1248942, 1226944, 1204590, 1182529, 1161859, 1143002, 1125333, 1108168, 1091565, 1075866, 1061089, 1047166, 1034230, 1022235, 1010744, 999451, 988390, 977368, 965827, 953692, 941607, 929899, 918028, 905598, 893088, 880867, 868308, 854744, 840654, 827010, 814014, 801402, 789439, 778623, 768905, 760139, 752883, 747688, 743955, 740522, 737146, 734425, 732606, 731516]
58827G31516j33J192K044J989J955K860M226N122N537N830N798N274M816M797
58813G82823M566L481J970O95n45k058l252l486l297l701m776n869o669p148p057
58798G45677o474o298p107q031p819o611n507m783l705j993k77R53J887K753L420
58783F96085L853M349N085N884O458O652O388N748M935L959K509M31j922m025
58769G46389n678o924p819q422q750q538p499n993m887m529m334l652k546j326
58755F65492k2J310K174K224J875J908K509L197L612M048N103O843Q441R022Q879
58740G26615R232J0461J1369J0897R756R280R404R164Q721R150J0283J0551R180
58727H54063P087N282L920L224L740N027N657N167M690M971N198M567L595K982
$$ y = [731516, 731383, 732575, 734619, 736608, 738563, 741423, 745649, 750771, 756308, 762138, 767936, 773210, 778026, 782823, 787389, 790870, 792840, 793535, 792990, 790932, 787680, 784194, 780897, 777196, 772420, 766551, 759882, 752734, 745677, 739203, 732905, 725798, 717767, 709948, 703337, 697830, 693047, 689342, 687349, 687072, 688025, 689912, 692665, 696085, 699938, 704287, 709372, 715256, 721714, 728366, 734754, 740502, 745437, 749396, 751905, 752336, 750414, 746389, 740711, 733787, 725968, 717546, 708796, 700258, 692759, 686766, 681879, 677350, 673016, 669364, 666818, 665492, 665470, 666780, 668954, 671178, 673053, 674961, 677470, 680667, 684279, 688327, 693430, 700273, 708714, 717736, 726615, 735847, 746308, 757677, 768574, 778330, 787610, 797014, 806178, 814899, 824049, 834332, 844883, 854063, 861150, 866432, 870352, 873576, 877316, 882343, 888000, 893167, 897857, 902828, 908026, 912593, 916188, 919170]
58713I19170K410J393J82j023k672m851o772q083r539j1605j3582j4950j6290
58700H33788j7930j9000j8888j8454j8585j8735j8010j6651j5258j3685j1817
58689F46775j0373r751r148q032p282p525p626o422m787m257m490m001k685j692
58675E58704j217k82J422L079M190N172O496Q312J0671J3184J4768J4698J3590
58662F52787J2417J1106R045O337L428J74l517o752q617r560j0483j1083j0475
58649F34807r012p935p491o844n678m513l474k141o06M82J006J486K066K352K201
58634E96706J834J249L24o11j040r52o64l49k32o89j482j490m6K082L824N154
58618F03618O496P605Q082Q224Q278P720O423N638O351P371O653M094J548L44
$$ y = [919170, 921580, 922973, 923155, 922132, 919460, 914609, 907837, 899754, 890215, 878610, 865028, 850078, 833788, 815858, 796858, 777970, 759516, 740931, 722196, 704186, 687535, 672277, 658592, 646775, 636402, 626651, 617503, 609471, 602189, 594664, 587038, 580616, 575829, 571572, 567082, 563081, 560396, 558704, 557487, 557205, 558627, 561706, 565896, 571068, 577564, 585876, 596547, 609731, 624499, 639197, 652787, 665204, 676310, 685355, 691692, 695120, 695294, 691777, 685025, 676408, 666848, 656365, 645282, 634807, 625795, 617860, 610369, 603525, 597847, 593334, 589860, 587719, 587113, 587595, 588601, 590087, 592153, 594505, 596706, 598540, 599789, 600113, 599502, 598462, 597510, 596846, 596497, 596265, 595576, 594094, 592604, 592558, 594640, 598464, 603618, 610114, 617719, 625801, 634025, 642303, 650023, 656446, 662084, 668435, 675806, 682459, 686553, 688101, 688445]
58604F88445K06L08P4r10k534l848m078l665l421l219k469j257J57K228N224Q085
58588F79326R593J0184J1215J2901J4379J5305J5911J5855J4545J2408J0518R213
58576H31353Q209P685P956Q529Q853R607J1858J5279J8615K1520K4599K7933L0924
58563A032920L3300L4978L5233L3320K9649K5210K0256J4707R180M416K06l750
58551A269625o701p930q266q959r810j0016j0117j1300j3418j5518j7733k0788
58539A129069k4136k6513k7863k8870k9102k7616k4992k2671k0738j8300j5691
58528H62577j3962j2586j0006o483m032l392l204k478j772j657j893k476l702
58515G94934m926m915l639k266j372p18n13j126j823j674j391k318l917m425l743
$$ y = [688445, 688651, 688959, 689033, 688123, 685589, 681741, 677663, 673998, 670577, 667358, 664889, 663632, 663789, 666017, 671241, 679326, 688919, 699103, 710318, 723219, 737598, 752903, 768814, 784669, 799214, 811622, 822140, 831353, 839562, 847247, 855203, 863732, 872585, 882192, 894050, 909329, 927944, 949464, 974063, 1001996, 1032920, 1066220, 1101198, 1136431, 1169751, 1199400, 1224610, 1244866, 1259573, 1268753, 1273169, 1273375, 1269625, 1262924, 1254994, 1246728, 1237769, 1227959, 1217943, 1207826, 1196526, 1183108, 1167590, 1149857, 1129069, 1104933, 1078420, 1050557, 1021687, 992585, 964969, 939977, 917306, 896568, 878268, 862577, 848615, 836029, 826023, 819540, 815508, 812116, 808912, 806434, 804662, 803005, 801112, 798636, 794934, 790008, 785093, 781454, 779188, 777816, 777098, 776585, 775459, 773636, 771962, 770571, 768253, 764336, 759911, 756168]
58500G56168l371l594l185j937j060q43k24J024J892K275L247M882O086O841Q468
58485G76669J1202J3714J5404J7054J8862K0014K0468K0899K0689J8414J4586
58474I67975J1282Q636M464j804p692j1186j3100j4641j5158j3824j1512r351
58462H94089o988l627N08M707Q509J1341J2754J3417J4301J4781J3314J0087O809
58449I94002L820j52n026q838j0807j2319j4074j4870j4202j3435j3262j2375
58437H78462j0023p488n776l952j191J627L679N637P987R773J0241J0064R876
58424I08916R290Q249P488O804M832J447j656l626n587q207j0347j1226j1759
58411H94618j2621j3048j2599j2147j1992j1129r379q178q147p956o649n002l636
$$ y = [756168, 752797, 749203, 746018, 744081, 743021, 742178, 741954, 742978, 744870, 747145, 750392, 755274, 761360, 768201, 776669, 787871, 801585, 816989, 834043, 852905, 872919, 893387, 914286, 934975, 953389, 967975, 979257, 987893, 992357, 990553, 982861, 971675, 958575, 943934, 928776, 914952, 903440, 894089, 887101, 883474, 883982, 888689, 897198, 908539, 921293, 934710, 949011, 963792, 977106, 987193, 994002, 997822, 997670, 992644, 983806, 972999, 960680, 946606, 931736, 917534, 904099, 890837, 878462, 868439, 860951, 855175, 851223, 850032, 851659, 855338, 860975, 868962, 878735, 888976, 899040, 908916, 918206, 926455, 933943, 940747, 945579, 947026, 945370, 941744, 936157, 927950, 917603, 906377, 894618, 881997, 868949, 856350, 844203, 832211, 821082, 811703, 803525, 795378, 787422, 780773, 775771, 772135]
58398G72135j869M77K230K799K940K939K133R12P39J532J537M74L4O17N51n45
58382G89635p52O82J997K243K761M061M553L893M239O469Q469Q959R731J1989
58368H58929J3863J3943J4072J6046J8414J9156J8901J8943J8563J6722J4211
58357A041763J1834Q852N149K454J414J55k300m009l555k515k313j619O58K876
58343A058844L704M749P455J0276J1575J2553J4587J6341J6407J6123J6991J7807
58331A207412J7016J5407J3886J1241O768K461O9j399k947l371k130j249j790
58318A261374j721R7J349N59K17K435N131N953O409Q458J0493J0480R916J0747
58304A331897J1583J0666R589J0280J1387J1319J1624J3726J5558J5191J4448
$$ y = [772135, 770266, 770743, 772973, 775772, 778712, 781651, 783784, 784696, 785435, 786967, 788504, 788978, 789012, 789629, 790180, 789635, 788883, 789565, 791562, 793805, 796566, 800627, 805180, 809073, 813312, 819781, 828250, 837209, 846940, 858929, 872792, 886735, 900807, 916853, 935267, 954423, 973324, 992267, 1010830, 1027552, 1041763, 1053597, 1062449, 1067598, 1070052, 1071466, 1071621, 1069321, 1065312, 1061757, 1059242, 1056929, 1055310, 1055968, 1058844, 1062548, 1067297, 1074752, 1085028, 1096603, 1109156, 1123743, 1140084, 1156491, 1172614, 1189605, 1207412, 1224428, 1239835, 1253721, 1264962, 1271730, 1274191, 1274260, 1272861, 1269914, 1266543, 1264413, 1263164, 1261374, 1259653, 1259750, 1261099, 1261658, 1261875, 1264310, 1269441, 1275394, 1281803, 1290261, 1300754, 1311234, 1321150, 1331897, 1343480, 1354146, 1363735, 1374015, 1385402, 1396721, 1408345, 1422071, 1437629, 1452820, 1467268]
58293A467268J5247J5976J5215J5175J7367J8954J7701J6522J8396K0900K0745
58282A659466J9796K1309K3914K4595K4138K4374K3628K0165J6679J6125J6778
58271A890967J6475J7709K2969K9243L2961L6369M2906N0340N4670N6787N9077
58260B310473N9659N6546N3175N3036N3168M9872M6272M6922M9582N0020N0368
58249B879093N4595O0220O2950O5161P1087P8012Q1135Q2955Q8682R6491J01607
58238C721988J05858J13574J22280J27318J31500J40196J51098J58968J66075
58229D938855J77496J90856K01410K12467K29606K49790K67503K86109L11289
58220G065381L39350L64671L92013M28286M69306N08930N53407O11408O78213
$$ y = [1467268, 1482515, 1498491, 1513706, 1528881, 1546248, 1565202, 1582903, 1599425, 1617821, 1638721, 1659466, 1679262, 1700571, 1724485, 1749080, 1773218, 1797592, 1821220, 1841385, 1858064, 1874189, 1890967, 1907442, 1925151, 1948120, 1977363, 2010324, 2046693, 2089599, 2139939, 2194609, 2251396, 2310473, 2370132, 2426678, 2479853, 2532889, 2586057, 2635929, 2682201, 2729123, 2778705, 2828725, 2879093, 2933688, 2993908, 3056858, 3122019, 3193106, 3271118, 3352253, 3435208, 3523890, 3620381, 3721988, 3827846, 3941420, 4063700, 4191018, 4322518, 4462714, 4613812, 4772780, 4938855, 5116351, 5307207, 5508617, 5721084, 5950690, 6200480, 6467983, 6754092, 7065381, 7404731, 7769402, 8161415, 8589701, 9059007, 9567937, 10121344, 10732752, 11410965]
58211A1410965P46509Q24088R23004J040630J171047J325481J520820J759214
58203B0721758K043030K400008K869903L478371M248800N224067O450713P965871
58195E5402521R830980J2134545J4894180J7979569K1201837K4437983K7531110
58188A83412725L0032358L1161807L0134662K6557027K0602307J3006359M944346
58181C39851591k355156q214244j2804595j6722657k0230010k2978330k4429953
58174B32116646k4376622k3020556k0747562j7977444j5146383j2644349j0694422
58167A07509308r312197q373360p702836p150581o656373o248962n953516n713224
58159E0398259n429825n057631m618660m144437l649858l157835k703708k305999
$$ y = [11410965, 12157474, 12981562, 13904566, 14945196, 16116243, 17441724, 18962544, 20721758, 22764788, 25164796, 28034699, 31513070, 35761870, 40985937, 47436650, 55402521, 65233501, 77368046, 92262226, 110241795, 131443632, 155881615, 183412725, 213445083, 244606890, 274741552, 301298579, 321900886, 334907245, 339851591, 337496435, 329282191, 316477596, 299754939, 279524929, 256546599, 232116646, 207740024, 184719468, 163971906, 145994462, 130848079, 118203730, 107509308, 98197111, 89823751, 82120915, 74970334, 68313961, 62064999, 56111483, 50398259, 44968434, 39910803, 35292143, 31147706, 27497848, 24340013, 21636305, 19330306]
58151A9330306j960284j664250j423496j231847j070852r32066q19809p31210
58143I496492o53564n82718n25448m81944m42654m03816l70457l42925l15072
58134E377894k86507k62826k43333k21669j98718j81770j70998j59379j46075
58125C506619j37272j33446j28076j19719j13659j10763j05916r8381r2952q9905
58115B376530q4221p5775p0116o8041o4273n7593n2828n1421m9199m4948m2347
58104A715768m1995l9958l5738l3535l4156l3571l0951l0421l3259l5747l6276
58093A330161l7452l9635l9362l5792l2295l0223k7296k3243k0769j9906j7703
58082A006485j4509j4277j7487k0015k0170k0665k2412k2638k0665j9563k0336
$$ y = [19330306, 17370022, 15705772, 14282276, 13050429, 11979577, 11047511, 10227702, 9496492, 8842928, 8260210, 7734762, 7252818, 6810164, 6406348, 6035891, 5692966, 5377894, 5091387, 4828561, 4585228, 4363559, 4164841, 3983071, 3812073, 3652694, 3506619, 3369347, 3235901, 3107825, 2988106, 2874447, 2763684, 2657768, 2559387, 2466435, 2376530, 2292309, 2216534, 2146418, 2078377, 2014104, 1956511, 1903683, 1852262, 1803063, 1758115, 1715768, 1673773, 1633815, 1598077, 1564542, 1530386, 1496815, 1465864, 1435443, 1402184, 1366437, 1330161, 1292709, 1253074, 1213712, 1177920, 1145625, 1115402, 1088106, 1064863, 1044094, 1024188, 1006485, 991976, 977699, 960212, 940197, 920027, 899362, 876950, 854312, 833647, 814084, 793748]
58071G93748k0109j7769j5981j5949j5410j3422j2112j2134j1300r193q328r350
58059F32691r754q717q532r928j0581r558q828r137q715p194o536p002o561n166
58045E16482n200o743o972n256m256m948n133m054l830m951m999l372k820m573
58031D49375o260o352o478p612q067p030o256o531o247n014m832o087o339m753
58017C61517l777m613m973l387j902k246k843j992p93n94m74M88J211R24Q61J804
58001C39211K491K128J935K579K729J680R26J513K405K812L556M742M758L025
57987C76490J255O13J37q47j376j161j547k923l784l578l740m696m756l268k049
57972C44770k215k455j866j628k287k247p14N48J61p25q22p55j063p33N93J349
$$ y = [793748, 773639, 755870, 739889, 723940, 708530, 695108, 682996, 670862, 659562, 650369, 642041, 632691, 622937, 614220, 605688, 595760, 585179, 575621, 566793, 557656, 548941, 541747, 535211, 528209, 521648, 516482, 511282, 504539, 497567, 492311, 488055, 483107, 477974, 473920, 470090, 465139, 460140, 456768, 453948, 449375, 443115, 436763, 430285, 422673, 414606, 407576, 401320, 394789, 388542, 383528, 378696, 372609, 366270, 361517, 357740, 353127, 348154, 344767, 342865, 340619, 337776, 335784, 334991, 334397, 333923, 334411, 335622, 336546, 337407, 339211, 341702, 343830, 345765, 348344, 351073, 352753, 353679, 355192, 357597, 360409, 363965, 368707, 373465, 376490, 377745, 378358, 378495, 377648, 376272, 375111, 373564, 370641, 366857, 363279, 359539, 354843, 350087, 346819, 344770, 342555, 340100, 338234, 336606, 334319, 332072, 331358, 331906, 332067, 331342, 330520, 329765, 328702, 327969, 328562, 329911]
57956C29911O04m16p51j223k180k345j443j249k463l174k098n80K80J682M384
57941C18939O692P408Q121J0392J3004J4241J4588J4968J4571J2680J0495Q996
57929D55095P112M140J698J035N48j631m667o986r033j1466j2782j1526r185q053
57915C94299p763o680n175m702m815m008k514j631j078L40K118K667K045J715
57901C64818J955J675N93l39n32k14M16J202J549J212R73J456K003J767J077N91
57885C80202J44m74p06m06n83j780k996l449m019n488o809o811o180o035n777
57870C28833m326k330j147n27P38K578L965M823N889P135P878Q103Q250Q284Q074
57855C86220Q108Q689R107Q682P790O827N261K854O75m45j343k993m693n288n193
$$ y = [329911, 330515, 330099, 329348, 328125, 325945, 323600, 322157, 320908, 318445, 315271, 313173, 312593, 312873, 314555, 318939, 325631, 333039, 341160, 351552, 364556, 378797, 393385, 408353, 422924, 435604, 446099, 455095, 462207, 466347, 468045, 469080, 469628, 467997, 463330, 456344, 447311, 435845, 423063, 411537, 402352, 394299, 386536, 379856, 374681, 369979, 365164, 361156, 358642, 357011, 355933, 356273, 358391, 361058, 363103, 364818, 366773, 368448, 369041, 368702, 368170, 367956, 368372, 369574, 371123, 372335, 373308, 374764, 376767, 378534, 379611, 380202, 380346, 379872, 379166, 378760, 378177, 376397, 373401, 369952, 365933, 360445, 353636, 346825, 340645, 334610, 328833, 324507, 322177, 321030, 320503, 321241, 323819, 327784, 332607, 338496, 345631, 353509, 361612, 369862, 378146, 386220, 394328, 403017, 412124, 420806, 428596, 435423, 440684, 443538, 444213, 443768, 442425, 439432, 434739, 429451, 424258]
57840D24258n630o705p631q160q431q166p274o363n660m461k692j687k113k625
57826C46660j974r89q53r41k93J96p85k430k964k454k382l075l565l490l270k936
57810C14455k404k277k803k834j543k43o36k125k888k814l153l973m212l952m307
57795B74291n161n121l790k255j162l3J445K959M389N777O620O594O639P839R606
57780C08637J0456J0275J0204J0540J0471R732Q893Q108O989N643M386K671j88
57767D06817l430n573o562p607r035r964j0128j0325j0787j0703r719q606q074
57754B96304p936p699p009n511l207j005R5K54M30R59J424J625J690J511J078
57739B73003R74J625K428K581K309K263K334K180K180K651K873K242J603J942
$$ y = [424258, 418628, 411923, 404292, 396132, 387701, 379535, 372261, 365898, 360238, 355777, 353085, 351398, 349285, 346660, 344686, 343697, 342844, 341903, 341610, 341806, 341021, 338591, 335627, 333173, 330791, 327716, 324151, 320661, 317391, 314455, 312051, 309774, 306971, 304137, 302594, 302351, 301715, 299590, 296702, 293888, 290735, 286762, 282550, 278598, 274291, 269130, 264009, 260219, 257964, 256802, 256769, 258214, 261173, 265562, 271339, 277959, 284553, 291192, 299031, 308637, 319093, 329368, 339572, 350112, 360583, 370315, 379208, 387316, 394305, 399948, 404334, 407005, 406817, 403387, 397814, 391252, 383645, 374610, 364646, 354518, 344193, 333406, 322703, 312984, 304378, 296304, 288368, 280669, 273660, 268149, 264942, 263937, 264032, 264286, 264716, 265675, 267099, 268724, 270414, 271925, 273003, 273977, 275602, 278030, 280611, 282920, 285183, 287517, 289697, 291877, 294528, 297401, 299643, 301246, 303188]
57725C03188K520K050J022Q94J487J249j32j393j887k203k514k260j692j965l283
57710B95081m535n016n092n023m620m257m612n192m648k921j571j552k077k161
57696B41804j907j714j430r22n66o45j027j673k636l502l683l309k910k313q91
57681B12676J208L184M920P033R679J2579J6201K1599K8895L7050M5267N3525
57669D53816O1630O8859P4588P8103P7741P1507N8952M1742K2333K917j4713k9619
57657I67856m2162n3016o1774o7365o9447o8295o3873n6496m8047m0828l5207
57646C61346k9939k4670k0406j7505j5038j2494j0448r167p995o655n696n231
57634A96102m528l309k179j400n20M13N79k33j149j538j651j611j068j89J61k93
$$ y = [303188, 305708, 307758, 308780, 309674, 311161, 312410, 312278, 310885, 308998, 306795, 304281, 302021, 300329, 298364, 295081, 290546, 285530, 280438, 275415, 270795, 266538, 261926, 256734, 252086, 249165, 247594, 246042, 243965, 241804, 239897, 238183, 236753, 235831, 235265, 234620, 233593, 231920, 229284, 225782, 222099, 218790, 215880, 213567, 212676, 213884, 217068, 221988, 229021, 238700, 251279, 267480, 289079, 317974, 355024, 400291, 453816, 515446, 584305, 658893, 736996, 814737, 886244, 945196, 986938, 1009271, 1012188, 997475, 967856, 925694, 872678, 810904, 743539, 674092, 605797, 541924, 485428, 437381, 396553, 361346, 331407, 306737, 286331, 268826, 253788, 241294, 230846, 221679, 213684, 207029, 201333, 196102, 191574, 188265, 186086, 184686, 184166, 184579, 185158, 184925, 183776, 182238, 180587, 178976, 177908, 177719, 177880, 177587]
57618A77587q64j146j485j943j985j596j600k413l444m018l958l126j467K90J087
57603A49919Q48L58q3p40j326j196o76p42j349j591j497j932k628k240p75j07
57587A34243j296l165m212m441m424m159l707l661m024l889k950k164k194k441
57573H7516k343k290k559k557j962j472j592j868j945k201k633k432j394m91l02
57558E9475j54L45L68n48j317q88J34N87M83N17P41Q68J116J736K315K476K584
57541G0838K939L044K429J518Q58K29p44j740k219k208j986j651j357j318j281
57526F7351p88k02l87j198j504j006o61q40o64J78N93Ol70O35K281L085K768J956
57508G1233R64Pl25P7L54k9m46k90j0o9l8L23K55o66j514j519j360j853k465k477
$$ y = [177587, 176723, 175577, 174092, 172149, 170164, 168568, 166968, 164555, 161111, 157093, 153135, 150009, 148542, 148832, 149919, 150767, 151125, 151042, 150302, 148976, 147780, 147104, 146362, 145013, 143422, 141925, 139993, 137365, 135125, 134350, 134243, 132947, 129782, 125570, 121129, 116705, 112546, 108839, 105178, 101154, 97265, 94315, 92151, 89957, 87516, 85173, 82883, 80324, 77767, 75805, 74333, 72741, 70873, 68928, 66727, 64094, 61662, 60268, 59777, 59475, 59321, 59666, 60034, 59486, 58169, 57281, 57415, 58002, 58485, 59002, 59743, 60611, 61727, 63463, 65778, 68254, 70838, 73777, 76821, 79250, 80768, 81626, 81855, 81111, 79371, 77152, 74944, 72958, 71307, 69950, 68632, 67351, 66563, 66361, 65974, 64776, 63272, 62266, 61605, 60765, 60101, 60279, 60872, 60878, 60508, 61143, 63424, 66509, 69277, 71233, 72197, 72204, 71879, 71956, 72310, 72281, 71835, 71545, 71535, 71466, 71428, 71751, 72006, 71340, 69826, 68307, 66947, 65094, 62629, 60152]
57488F0152k492l294m135l758k402j375j163j274j387j454j182n72l70r29j302
57473C3063n73O10J020O48L37K25j39p04j057j240j437j403j093j091j518j470
57457B4178o13j54r28j650p86Q28J113r8j082r91o58p42q80q42r71j206j035n36
57439A2947l40m28j43M99O68J9p94j104q35j96M63N14l52j493j934j538q92l90
57421D671j03j02k12R2P91R19o6j219j435j035q50n51N67J772J643L47m95k08
57403D526K56Q3m28q99j472E3a834r82k1L44Q0o21j476j799j001N77J988a960
57384A113K862K159J530J478J633J415J114J234J313O64j20j1M36l08k151l211
57368A1150k610j651j621k053A186f41k195k933l332l298l165k819j915o68K45
$$ y = [60152, 57660, 54366, 50231, 46473, 44071, 42696, 41533, 40259, 38872, 37418, 36236, 35664, 35294, 34365, 33063, 32490, 33100, 34120, 34768, 35105, 35330, 35191, 34487, 33430, 32190, 30753, 29350, 28257, 27166, 25648, 24178, 23565, 23411, 22483, 20833, 20047, 20875, 21988, 21890, 20808, 19817, 19159, 18417, 17537, 16695, 15724, 14518, 13483, 12947, 12607, 12179, 12036, 12535, 13203, 13222, 12428, 11324, 10489, 10293, 10756, 11270, 10918, 9425, 7491, 5953, 5061, 4671, 4568, 4466, 4254, 4346, 5137, 6056, 5990, 4771, 3336, 2301, 1451, 900, 1467, 3239, 4882, 5229, 4734, 4526, 4782, 4865, 4437, 3538, 2066, 53, -1834, -2816, -2837, -2493, -2413, -3034, -4510, -6309, -7310, -6733, -4745, -1960, 1113, 3975, 6134, 7664, 9142, 10775, 12190, 13304, 14538, 15851, 16515, 16395, 16384, 16820, 16512, 14361, 11150, 8540, 6889, 5268, 3215, 1186, -641, -2836, -5769, -9101, -12399, -15564, -18383, -20298, -20966, -20721]
57353b0721N09M51N55R03J071O25j83n11K6P25P07Q1m21o37r95j566j946k064
57335b3391k258k467k192j351n79m23p59j091j083p63n30q12j404j494p07K25
57319d1079L42m02j338j938j932j205k06J65k02k10P71J672J237j9o83n77n48
57302d6152o29q3R26J417J260J274J527J155J17m46k6M36J16m33l05M71J212J430
57284c6733R51p4r61j004m76m58j415k598l053k674j986j545j674k346l244m209
57268f3499n374o470o538n134l285k331k234k090j811k021k558k556j903j313
57254a09117r51l17M20L94m52j140j206j245j609j801j577j437j617j657j403
57239a24715j420j930k332k238k065k159k163j759j274j180j558k281l069l328
$$ y = [-20721, -20212, -19761, -19206, -18303, -17232, -16607, -16790, -17301, -17275, -16550, -15843, -15762, -16183, -16820, -17815, -19381, -21327, -23391, -25649, -28116, -30308, -31659, -32238, -32661, -33420, -34511, -35594, -36357, -36887, -37699, -39103, -40597, -41304, -41079, -40737, -41139, -42477, -44415, -46347, -47552, -47758, -47593, -47795, -48005, -47234, -45562, -44325, -44344, -45027, -45604, -46152, -46781, -46864, -45938, -44521, -43261, -41987, -40460, -39305, -39188, -39634, -39660, -39224, -39108, -39541, -39846, -39375, -38163, -36733, -35782, -35856, -36817, -37821, -38297, -38755, -40170, -42768, -45821, -48495, -50481, -52026, -53700, -56046, -59290, -63499, -68873, -75343, -81881, -87015, -90300, -92631, -94865, -96955, -98766, -100787, -103345, -105901, -107804, -109117, -110068, -110385, -109965, -109571, -110023, -111163, -112369, -113614, -115223, -117024, -118601, -120038, -121655, -123312, -124715, -126135, -128065, -130397, -132635, -134700, -136859, -139022, -140781, -142055, -143235, -144793, -147074, -150143, -153471]
57225a53471k725j921j881k496k906l052l648m518m470l196j970j745j814j151
57211a90964k4N77L48l45j214k025k312j861j117o40m41k43j1J96N68J383K593
57194a95532L769M339L997L093K514K865L900M979N738N992N523M471L493K938
57180a37921K354J363L91j38o90j864l413m824o147p365p925p867q442j0318j2045
57165b04851j1853j0095q314o758m622k026L27K854O390J0155J2462J3264J3961
57152a89106J4912J5233J4983J5267J6039J5987J4920J4261J4825J5969J7205
57141a9505g13A9731K1189K0985K0828K1071K1231K1451K2368K3552K3870K3352
57129B39628K2869K2162K0274J7756J6274J6081J6068J6114J7033J8417J9084
$$ y = [-153471, -156196, -158117, -159998, -162494, -165400, -168452, -172100, -176618, -181088, -184284, -186254, -187999, -189813, -190964, -190988, -190411, -190063, -190408, -191622, -193647, -195959, -197820, -198937, -199577, -200018, -200261, -200272, -200076, -199508, -198125, -195532, -191763, -187424, -183427, -180334, -177820, -174955, -171055, -166076, -160338, -154346, -148823, -144352, -140859, -137921, -135567, -134204, -133813, -133951, -134641, -136505, -139918, -144742, -150889, -158254, -166179, -174046, -182488, -192806, -204851, -216704, -226799, -235113, -241871, -246493, -248519, -248192, -245338, -238948, -228793, -216331, -203067, -189106, -174194, -158961, -143978, -128711, -112672, -96685, -81765, -67504, -52679, -36710, -19505, -713, 19731, 40920, 61905, 82733, 103804, 125035, 146486, 168854, 192406, 216276, 239628, 262497, 284659, 304933, 322689, 338963, 355044, 371112, 387226, 404259, 422676, 441760]
57118D41760J9590K1634K5034K7990L0410L4037L9278M4959N1313O0020P1001
57107H67026Q2492R4809J10821J32244J58758J91251K32779K86148L54069M41886
57097B952283N56359P01363Q77999J088092J333019J609936J914040K242596K589046
57088A5864733K933453L247350L510014L715345L868625L990723M119474M274335
57080D5524052M398336M353054M003347L316689K374850J300626J94021q68384
57072F4596591j811273k568008l108085l446326l626191l696311l692588l629351
57064C9018458l505061l319347l083937k817582k536812k255285j986489j740789
57056A7773156j521812j329324j163455j023264r04521q02929p17393o46994n87212
$$ y = [441760, 461350, 482984, 508018, 536008, 566418, 600455, 639733, 684692, 736005, 796025, 867026, 949518, 1044327, 1155148, 1287392, 1446150, 1637401, 1870180, 2156328, 2510397, 2952283, 3508642, 4210005, 5088004, 6176096, 7509115, 9119051, 11033091, 13275687, 15864733, 18798186, 22045536, 25555550, 29270895, 33139520, 37130243, 41249717, 45524052, 49922388, 54275442, 58278789, 61595478, 63970328, 65270954, 65464975, 64596591, 62785318, 60217310, 57109225, 53662899, 50036708, 46340397, 42647809, 39018458, 35513397, 32194050, 29110113, 26292531, 23755719, 21500434, 19513945, 17773156, 16251344, 14922020, 13758565, 12735301, 11830780, 11027851, 10310458, 9663464, 9076252]
57047I076252n32672m81699m34997l91769l50583l12468k79616k51728k26458
57038E814262k02976j82716j67050j56116j49275j45031j40973j35141j26934
57029D408050j16170j02693q7805p4394o4267n6721n0726m6673m4743m3272m0327
57018C680259l5426k8688k0142j1278n273l999o474j1599k0291l3062m7717o1723
57006C394587p5057q8179r8874j04042j03625j00144r4979q7618p8204o8321n9105
56995B436439n0469m2349l5177k9092k3922j9848j7108j5297j3910j3088j2933
56984B163246j2855j2576j3057j5198j8268k0801k2469k3993k5798k7833l0138
56973A940260l2503l4147l4620l4395l3791l2249k9648k7214k5910k4843k2630
$$ y = [9076252, 8543580, 8061881, 7626884, 7235115, 6884532, 6572064, 6292448, 6040720, 5814262, 5611286, 5428570, 5261520, 5105404, 4956129, 4811098, 4670125, 4534984, 4408050, 4291880, 4189187, 4101382, 4026988, 3962721, 3906000, 3855274, 3808601, 3763858, 3720586, 3680259, 3644833, 3616145, 3596003, 3584725, 3579452, 3575453, 3568979, 3557380, 3537089, 3504027, 3456310, 3394587, 3319530, 3231351, 3132477, 3028435, 2924810, 2824666, 2729687, 2642069, 2563865, 2495544, 2436439, 2385970, 2343621, 2308444, 2279352, 2255430, 2235582, 2218474, 2203177, 2189267, 2176179, 2163246, 2150391, 2137815, 2124758, 2109560, 2091292, 2070491, 2048022, 2024029, 1998231, 1970398, 1940260, 1907757, 1873610, 1838990, 1804595, 1770804, 1738555, 1708907, 1681693, 1655783, 1630940, 1608310]
56962A608310j9482j6543j3965j1198q581p144p172q251j0363j3687j7608k1186
56950A453130k4286k7248k9813l1419l2184l2527l2142l0421k7535k4174k0489
56939A140892j6270j1806p670l852O7M151Q114J1691J4400J5440J4454J1809P734
56926A189154J932n236j2215j7795k2382k6845l0946l3881l5528l6029l5010l2349
56914I02870k9069k6266k3785k0986j8183j6134j4744j3427j2216j1373j0515
56903G06172r180p775o868o136n077m036l416k577q26J214K570L670N656Q484
56889F81875J1147J3370J5578J7486J8251J7806J6626J4398J0464N484J183j753
56877H21915m163o723q994j0315j0533r667p783n334k656Q52O060J2590J8988
$$ y = [1608310, 1588828, 1572285, 1558320, 1547122, 1538541, 1531397, 1524225, 1515974, 1505611, 1491924, 1474316, 1453130, 1428844, 1401596, 1371783, 1340364, 1308180, 1275653, 1243511, 1213090, 1185555, 1161381, 1140892, 1124622, 1112816, 1105146, 1101294, 1101361, 1105512, 1113626, 1125317, 1139717, 1155157, 1169611, 1181420, 1189154, 1191086, 1185850, 1173635, 1155840, 1133458, 1106613, 1075667, 1041786, 1006258, 970229, 935219, 902870, 873801, 847535, 823750, 802764, 784581, 768447, 753703, 740276, 728060, 716687, 706172, 696992, 689217, 682349, 676213, 671136, 667100, 663684, 661107, 660281, 661495, 664065, 667735, 673391, 681875, 693022, 706392, 721970, 739456, 757707, 775513, 792139, 806537, 817001, 822485, 823668, 821915, 817752, 811029, 802035, 791720, 781187, 771520, 763737, 758403, 755747, 756599, 762659, 775249, 794237]
56864G94237K4461K9472L4567L9465M3326M5019M3218L7260K8192J8190Q794K85
56852A146486p554j4946k2203k9131l4348l6150l4261k9900k4103j6836p876K397
56840H91575J3333K4522L5726M6803N7635O7560P4921P7742P4835O6008N1876
56829A482536L4291J6315M04j3550k7320m1490n4360o3756o8810o9713o6681n9971
56817A067895n0430l9351k7780j6082m171P796J9105K8986L7398M4566M9659N0644
56805A168235M6066L6421K3549R313m692j7198k7935l7644m6593n3708n7713n8379
56793I79722n5959n0468m2547l4038k6356j9022j1053k969M021J0097J6231K1972
56781G89631K5577K6240K4542K0735J4338N764l204j1079j7750k3571k8510l2427
$$ y = [794237, 818698, 848170, 882737, 922202, 965528, 1010547, 1053765, 1091025, 1119217, 1137407, 1146201, 1146486, 1138932, 1123986, 1101783, 1072652, 1038304, 1002154, 967893, 937993, 913890, 897054, 889178, 891575, 904908, 929430, 965156, 1011959, 1069594, 1137154, 1212075, 1289817, 1364652, 1430660, 1482536, 1516827, 1533142, 1533546, 1519996, 1492676, 1451186, 1396826, 1333070, 1264260, 1194547, 1127866, 1067895, 1017465, 978114, 950334, 934252, 930081, 937877, 956982, 985968, 1023366, 1067932, 1117591, 1168235, 1214301, 1250722, 1274271, 1283584, 1278892, 1261694, 1233759, 1196115, 1149522, 1095814, 1038101, 979722, 923763, 873295, 830748, 796710, 770354, 751332, 740279, 737310, 741331, 751428, 767659, 789631, 815208, 841448, 865990, 886725, 901063, 906827, 903623, 892544, 874794, 851223, 822713, 790286]
56769G90286l5257l6603l6011l3817l0925k7814k4555k1617j9488j7628j5041
56758D91530j1993r926r431r420q661p111n477m287l760l780l815l505l259l573
56744D03532l919l295j847q12p96j120j069p61o22p98j309j998k321j957j487
56729C79421j595j777r45P87K077K166J573Q89J67l20N9J228K216K389K033J517
56713C91885Q26R9k89l91o02p65l02O93J410J471J161N61m26j244j095l29j37
56696C92526o87r04l73k9m81j019r58p09q46j143j298j577k006j878p82N95J459
56679C79890J864K110J880Q40m99j195r20j44M23M02J17L72J390K200J831Q21
56663C91382M66Q20P32l5l28L98J086P82O8n9L29N92O49P73R37J053J309J698
$$ y = [790286, 755029, 718426, 682415, 648598, 617673, 589859, 565304, 543687, 524199, 506571, 491530, 479537, 469611, 460180, 450760, 442099, 434988, 429511, 425224, 421464, 417684, 413869, 410364, 407105, 403532, 399613, 396318, 394471, 393659, 392863, 391743, 390674, 389913, 389291, 388493, 387184, 385186, 382865, 380908, 379421, 377826, 376049, 375104, 375891, 377968, 380134, 381707, 382596, 382763, 382443, 382502, 383730, 385946, 388335, 390368, 391885, 392711, 392810, 392521, 392130, 391528, 390763, 390461, 391154, 392564, 394035, 395196, 395757, 395331, 394087, 392992, 392663, 392526, 391839, 390935, 390562, 390533, 390052, 389033, 388075, 387366, 386520, 385377, 384079, 382502, 380496, 378618, 377836, 378431, 379890, 381754, 383864, 385744, 386584, 386085, 384890, 383970, 383826, 384249, 384651, 384768, 385140, 386530, 388730, 390561, 391382, 391848, 392668, 393400, 393365, 393037, 393435, 394521, 395303, 395371, 395312, 395641, 396233, 396882, 397655, 398592, 399645, 400954, 402652]
56645D02652J747J152J39r70j935k265j590n91m90j441k418k857l203l526l108
56630C81296j965j381k070l010l050k476k059j660r44m93r77j865k110j592r17
56615C54727l69K8m6p09j275j093o00p19j487k101k038j391m37M97R73Q55N38
56598C45353L41O8l80m78K03J170J554J196O78M85O18Q21Q20M87Ok72j95J75Q15
56579C53465J551J815J242M17K31O09P52O15R60J914K650K842L243M370N729O794
56563C89199P729Q664R370J0124J1655J3607J4290J2784J0253Q341P255O333N443
56550E15047M807M147L051J655K30j239k560l179l209l674n031o355o773o772
56536D90145p164p664p544o938o480o219n843n378m911m211l406l283m114m894
$$ y = [402652, 404399, 405551, 405690, 404720, 402785, 400520, 398930, 398339, 397849, 396408, 393990, 391133, 387930, 384404, 381296, 379331, 377950, 375880, 372870, 369820, 367344, 365285, 363625, 362681, 362188, 361211, 359346, 357236, 355644, 354727, 354358, 354386, 354340, 353631, 352356, 351263, 350663, 349944, 348457, 346356, 344318, 342927, 342490, 342987, 343960, 344815, 345353, 345694, 345762, 345382, 344904, 345107, 346277, 347831, 349027, 349705, 350190, 350808, 351629, 352449, 352936, 352942, 352670, 352475, 352650, 353465, 355016, 356831, 358073, 358490, 358721, 359330, 360082, 360697, 361657, 363571, 366221, 369063, 372306, 376676, 382405, 389199, 396928, 405592, 414962, 425086, 436741, 450348, 464638, 477422, 487675, 496016, 503271, 509604, 515047, 519854, 524001, 527052, 528707, 528937, 527698, 525138, 521959, 518750, 515076, 510045, 503690, 496917, 490145, 482981, 475317, 467773, 460835, 454355, 448136, 442293, 436915, 432004, 427793, 424387, 421104, 416990, 412096]
56522D12096m591l497k546k012j744j894k459k769k407k001k301l053l598l822
56508C73402l717k945j715j167j728k071j013L70J23j618k732k008m87K60k0m77
56492C52457l61K62O19N9j043j553j062m10l28l98J5N79P15P17J156J717J675
56475C54816J090N96L01j43o43o81j23N69Q68O04Q5k6N51J074O45l30o39k59m16
56456C57939j324j622o99J49kj03Q73J909J610N69K81P63J012R14R17O32m05j312
56438C62101r64k6q1j159j833j402m70L68R33R14K86j05K91O00j12j063r17j5
56420C57346L81L62R62J895J804O63p1K59Q45J033R55N00n55j339n92J234K223
56403C67905J628O37K32k9o30j012o27J40P17J085J325J279J075J159J580J924
$$ y = [412096, 407505, 404008, 401462, 399450, 397706, 395812, 393353, 390584, 388177, 386176, 383875, 380822, 377224, 373402, 369685, 366740, 365025, 363858, 362130, 360059, 359046, 359416, 359539, 357921, 355189, 353181, 352694, 352954, 352934, 352457, 352096, 352358, 352977, 353036, 351993, 350440, 349378, 348968, 348640, 348242, 348257, 348836, 349551, 350268, 351424, 353141, 354816, 355906, 356502, 356803, 356660, 356017, 355336, 355213, 355782, 356650, 357254, 357339, 357313, 357864, 358938, 359583, 359253, 358614, 358355, 357939, 356615, 354993, 354294, 354443, 354441, 354338, 355211, 357120, 358730, 359299, 359580, 360343, 361355, 362269, 363186, 363818, 363413, 362101, 361137, 361111, 361030, 359871, 358038, 356636, 356166, 356534, 357467, 358381, 358667, 358562, 358853, 359453, 359341, 358278, 357361, 357346, 357727, 358089, 359051, 360946, 362750, 363413, 363342, 363601, 364446, 365479, 366434, 366934, 366379, 365040, 364448, 365682, 367905, 369533, 370170, 370402, 370373, 369743, 368731, 368104, 368244, 368961, 370046, 371371, 372650, 373725, 374884, 376464, 378388]
56387C78388K071K232K291J869J047L38Ql2J49L34J27l95n56k15j12l48K38K016
56369C89450L261K442O89J07O43O96L9j78J96K23n2L48J229J400Q96R58J678J758
56351D05783Q91L24O62J005P34M44O26R29J119J308J190M81J28J335L404M374
56335D24737L865L359L603L787L585L859M740N042M283L517L480L586L383L315
56321D78141L400K820J468M09J93J67j06k45k55o73j118m01J385K610K483K066
56305D92344K315K834L165L683M496M995N075N327N628N209M498M948O549P475
56291E58541O918O271O645P241P251P434Q503R604R780R547R762J0216J0473J0927
56277F79113J1960J3090J3868J4644J5682J6601J7247J8031J8967J9657K0570
$$ y = [378388, 380459, 382691, 384982, 386851, 387898, 388236, 388244, 388212, 388361, 388695, 388822, 388427, 387871, 387656, 387544, 387196, 387434, 389450, 392711, 395153, 395842, 395949, 396592, 397288, 397327, 397149, 397345, 397568, 397516, 397864, 399093, 400493, 401389, 402347, 404025, 405783, 406674, 406998, 407660, 408665, 409399, 409843, 410469, 411398, 412517, 413825, 415015, 415496, 415624, 416959, 420363, 424737, 428602, 431961, 435564, 439351, 442936, 446795, 451535, 456577, 460860, 464377, 467857, 471443, 474826, 478141, 481541, 484361, 485829, 486238, 486431, 486598, 486492, 486247, 485992, 485319, 484201, 483800, 485185, 487795, 490278, 492344, 494659, 497493, 500658, 504341, 508837, 513832, 518907, 524234, 529862, 535071, 539569, 544517, 551066, 558541, 565459, 571730, 578375, 585616, 592867, 600301, 608804, 618408, 628188, 637735, 647497, 657713, 668186, 679113, 691073, 704163, 718031, 732675, 748357, 764958, 782205, 800236, 819203, 838860, 859430]
56266H59430K2836K6395K9897L2886L6413M1009M5974N1198N7723O5723P3917
56255A343401Q1880R1004J02141J14262J26367J38835J51662J63345J72848J80918
56245B666663J88078J93043J94446J92500J87573J78736J65166J47538J26694
56236D240437J02374P4678M5314J6029j2896m1314o7892r1507j12473j31035j45969
56225C875746j56270j62873j67221j69254j68261j64628j59359j52820j45171
56216B429889j37164j29339j21366j13061j05070r7762r0628q3505p7081p1500
56206A403413o5905o0054n4812n0379m5793m0945l7070l4358l1227k7089k3614
56195I32167k1856k0393j7895j5434j4318j3662j2086j0195r283r044q445p585
$$ y = [859430, 882266, 908661, 938558, 971444, 1007857, 1048866, 1094840, 1146038, 1203761, 1269484, 1343401, 1425281, 1516285, 1618426, 1732688, 1859055, 1997890, 2149552, 2312897, 2485745, 2666663, 2854741, 3047784, 3242230, 3434730, 3622303, 3801039, 3966205, 4113743, 4240437, 4342811, 4417489, 4462803, 4478832, 4465936, 4424622, 4356730, 4265223, 4152750, 4021715, 3875746, 3719476, 3556603, 3389382, 3220128, 3051867, 2887239, 2727880, 2575060, 2429889, 2292725, 2163386, 2042020, 1928959, 1823889, 1726127, 1635499, 1551994, 1474913, 1403413, 1337508, 1277454, 1222642, 1172263, 1126470, 1085525, 1048455, 1014097, 982870, 955781, 932167, 910311, 889918, 872023, 856589, 842271, 828609, 816523, 806328, 797045, 788001, 779556, 771971]
56183G71971o927o003m516l379l196l103k511k340l015l055j416N42J269J477
56169G35798K454L650L955L898M452N155N312N673O922Q025Q086Q344J0189J2667
56155H24580J4147J5169J7294K0298K2799K4785K7370L0877L5040M0275M7033
56144A119667N4826O3390P3738Q6439J00089J12939J24783J35760J44697J50190
56134B166518J51948J49815J43295J33496J23437J14669J05475R4092Q1502O9157
56124C333404N6334M2193K8247J6297N691n054j5892k6826l9656n5514p2582q8724
56112C177918j04229j19452j32059j39701j43324j44929j43974j39118j31458
56103A979674j22834j12818j00601q7900p6740o6221n4884m4356l6995l1741k6054
$$ y = [771971, 765044, 759041, 754525, 751146, 747950, 744847, 742336, 739996, 736981, 733926, 732510, 733052, 734321, 735798, 738252, 741902, 745857, 749755, 754207, 759362, 764674, 770347, 777269, 785294, 793380, 801724, 811913, 824580, 838727, 853896, 871190, 891488, 914287, 939072, 966442, 997319, 1032359, 1072634, 1119667, 1174493, 1237883, 1311621, 1398060, 1498149, 1611088, 1735871, 1871631, 2016328, 2166518, 2318466, 2468281, 2611576, 2745072, 2868509, 2983178, 3088653, 3182745, 3264247, 3333404, 3389738, 3431931, 3460178, 3476475, 3482166, 3477112, 3461220, 3434394, 3394738, 3339224, 3266642, 3177918, 3073689, 2954237, 2822178, 2682477, 2539153, 2394224, 2250250, 2111132, 1979674, 1856840, 1744022, 1643421, 1555521, 1478781, 1412560, 1357676, 1313320, 1276325, 1244584, 1218530]
56092A218530k0310j6524j4202j1362q321o582n281k561O32J955J800K342L553
56079A143669L866L780M996O945P851Q232R761J1692J2087J1572J2197J3520J3490
56066A263658J2201J1232J0397Q654P009O915P193O128N053O046P784P739O813
56053A366822P489R164R619R556J1032J2963J2908J1888J2716J4890J5887J6052
56041A510986J7451J9356J9727J9556K0737K1462J9011J5330J4309J5293J5036
56030A708254J4309J6426K0822K4336K7460L2784L8736M1496M2048M4516M8561
56019B059748N0335N0013N1297N4215N5473N5357N7286O1095O3652O5322O8842
56008B692635P2890P4092P4142P7367Q2557Q5227Q6476R1082R8202J02974J06100
$$ y = [1218530, 1198220, 1181696, 1167494, 1156132, 1147811, 1141229, 1135948, 1133387, 1134019, 1135974, 1137774, 1140116, 1143669, 1147535, 1151315, 1156311, 1163256, 1171107, 1179339, 1189100, 1200792, 1212879, 1224451, 1236648, 1250168, 1263658, 1275859, 1287091, 1297488, 1306142, 1313151, 1320066, 1327259, 1333387, 1338440, 1344486, 1352270, 1360009, 1366822, 1374311, 1383475, 1393094, 1402650, 1413682, 1426645, 1439553, 1451441, 1464157, 1479047, 1494934, 1510986, 1528437, 1547793, 1567520, 1587076, 1607813, 1629275, 1648286, 1663616, 1677925, 1693218, 1708254, 1722563, 1738989, 1759811, 1784147, 1811607, 1844391, 1883127, 1924623, 1966671, 2011187, 2059748, 2110083, 2160096, 2211393, 2265608, 2321081, 2376438, 2433724, 2494819, 2558471, 2623793, 2692635, 2765525, 2839617, 2913759, 2991126, 3073683, 3158910, 3245386, 3336468, 3434670, 3537644, 3643744]
55997C643744J12462J21255J27240J30929J37675J47401J55390J62403J73419
55988D911918J87217J98226K07872K22644K41821K59132K75536K97580L24142
55979G126088L48515L72753M05490M46087M86245N27006N78107O40769P08100
55970A1639160P82487Q74695R85928J110070J253781J434272J657978J924583
55962B1662954K253131K681387L240305L953675M859480O004146P425415R177026
55954F1257519J1349515J3996322J7031626K0268308K3559204K6786430K9632947
55947B03881871L1435380L1373207K8843960K3727853J6488577Q156178M6231
55940C43953257o851334j2377990j7029375k1208719k4719047k6998902k7701236
$$ y = [3643744, 3756206, 3877461, 4004701, 4135630, 4273305, 4420706, 4576096, 4738499, 4911918, 5099135, 5297361, 5505233, 5727877, 5969698, 6228830, 6504366, 6801946, 7126088, 7474603, 7847356, 8252846, 8698933, 9185178, 9712184, 10290291, 10931060, 11639160, 12421647, 13296342, 14282270, 15392340, 16646121, 18080393, 19738371, 21662954, 23916085, 26597472, 29837777, 33791452, 38650932, 44655078, 52080493, 61257519, 72607034, 86603356, 103634982, 123903290, 147462494, 174248924, 203881871, 235317251, 266690458, 295534418, 319262271, 335750848, 343907026, 343953257, 337101923, 324723933, 307694558, 286485839, 261766792, 234767890, 207066654]
55933B07066654k6933844k5062743k2478541j9548247j6614387j3926089j1592936
55926G0909867r631439q024338o727839n674527m806955m094816l512261l024770
55918B5412922k608967k261368j976258j734411j521592j338538j184460j048303
55910A1739025r23907q17204p30872o56454n87962n29186m81535m38083l95408
55901F178414l58867l30727l04784k77731k54539k37728k22052k04433j88954
55892C798599j77616j65918j51893j40102j32535j24642j14203j05393j00206
55883B586091r4520q6393p9859p6625p2170o3987n5991n0921m5781l8718l3208
55872A887918l1516l0729k9003k9185l2533l5232l4866l4322l5793l6760l5412
$$ y = [207066654, 180132810, 155070067, 132591526, 113043279, 96428892, 82502803, 70909867, 61278428, 53254090, 46526251, 40851724, 36044769, 31949953, 28437692, 25412922, 22803955, 20542587, 18566329, 16831918, 15310326, 13971788, 12787328, 11739025, 10815118, 9997914, 9267042, 8610588, 8022626, 7493440, 7011905, 6573822, 6178414, 5819547, 5488820, 5184036, 4906305, 4651766, 4414038, 4191986, 3987553, 3798599, 3620983, 3455065, 3303172, 3163070, 3030535, 2905893, 2791690, 2686297, 2586091, 2491571, 2405178, 2325319, 2248694, 2176524, 2112537, 2056546, 2005625, 1959844, 1921126, 1887918, 1856402, 1825673, 1796670, 1767485, 1734952, 1699720, 1664854, 1630532, 1594739, 1557979, 1522567]
55861A522567l4358l5459l6452l6012l6854m0431m3722m4523m4926m6370m6300
55850A077160m3060l9382l7584l5799l2123k8326k6227k4446k1766j9835j9673
55839G48939j9261j7295j5583j5263j4440j2052j0181j0089r760p935o700p446
55827F02934q083o913n666n942o217n168m498n628o819o305n304n233m988l513
55813E22657k167j940j212J199L582M379M952O744Q384Q170O983O327N722M268
55799E78048K499P06k236o352r408j0204j0542j2012j3403j3279j2489j1944j0587
55786D68797p824n526n211n557m919l991l803l381j783l15m00j148j150o98k54
55771D22837J058L353M554L247R65n05j924m424o733p214o831p491q857r355r005
$$ y = [1522567, 1488209, 1452750, 1416298, 1380286, 1343432, 1303001, 1259279, 1214756, 1169830, 1123460, 1077160, 1034100, 994718, 957134, 921335, 889212, 860886, 834659, 810213, 788447, 768612, 748939, 729678, 712383, 696800, 681537, 667097, 655045, 644864, 634775, 625015, 617080, 610380, 602934, 594851, 587938, 582272, 576330, 570113, 564945, 560447, 554819, 548000, 541695, 536391, 531158, 526170, 522657, 520490, 518550, 517338, 518537, 522119, 526498, 531450, 538194, 546578, 554748, 561731, 568058, 573780, 578048, 580547, 581253, 579017, 572665, 563257, 553053, 542511, 530499, 517096, 503817, 491328, 479384, 468797, 460973, 455447, 450236, 444679, 439760, 435769, 431966, 428585, 426802, 426487, 426087, 424939, 423789, 423091, 422837, 423895, 427248, 431802, 435049, 436014, 435509, 433585, 429161, 422428, 415214, 408383, 400892, 392035, 382680, 373675]
55756C73675q889q946q421p560o924o052m440k822k039j859k085l316n299o343
55742B98680n746n002n144m902l165j197n09m06K90Q52K28p25p31m30j048k112
55726B68933k497k572l218l928l778l174k903k610j890j538j978j828M5K352L179
55711B42595K735K456K575K498K477K935L126K327J421J475J785J012o30j940
55697B66847k559k701k164j171j016k303l572l277j896o25O14K163L082K654K168
55682B56244L110M689N135M481L978L731K985K004J624J582J124N90O94R49N34
55667B93454j08j69m0l46l78O33J713J571R04J226K272K636K217J881J386j07
55651C08745k016k960l151m015n712p013p451p669p840p494o824o441o058n022
$$ y = [373675, 364786, 355840, 347419, 339859, 332935, 326883, 322443, 319621, 317582, 315723, 313638, 310322, 305023, 298680, 292934, 287932, 282788, 277886, 274721, 273524, 273015, 272609, 272899, 273751, 273979, 273254, 272523, 272093, 271045, 268933, 266436, 263864, 260646, 256718, 252940, 249766, 246863, 244253, 242363, 240825, 238847, 237019, 237064, 239416, 242595, 245330, 247786, 250361, 252859, 255336, 258271, 261397, 263724, 265145, 266620, 268405, 269417, 268787, 266847, 264288, 261587, 259423, 258252, 257236, 254933, 251361, 248084, 246188, 245563, 246177, 248340, 251422, 254076, 256244, 259354, 264043, 269178, 273659, 277637, 281368, 284353, 286357, 287981, 289563, 290687, 291277, 291971, 292920, 293454, 293346, 293177, 293137, 292791, 292413, 293046, 294759, 296330, 297234, 298460, 300732, 303368, 305585, 307466, 308852, 308745, 306729, 303769, 300618, 296603, 290891, 283878, 276427, 268758, 260918, 253424, 246600, 240159, 234101, 229079]
55637B29079l850l581l917l709k970k691k902k716k088j790j723j102k47m28j685
55622A93680k469j778l55N37M06n05j577k055j769j377j319j067l09M2p84j922
55606A77379k093j543j232r53k9Q46M29p98j126j99P21R20Q54O91pj003j429j229
55588A70199j227j643j854j593j115l35Q47J638J243M20O15J718K314K067K127
55573A75421L037L959M215M153M193M316M681N481O127N808M885M446M405L520
55559B38647J426p34k039k767l365l626l361k914k697k848l363l845l424j825
55545B03265j40M10J26Q2L51K73M4M25J154J177L91l82r51j746k445k257j613
55528A98164j860l127m126m172l853l551k962k309k389l008k956j981j239j444
$$ y = [229079, 225229, 221648, 217731, 214022, 211052, 208361, 205459, 202743, 200655, 198865, 197142, 196040, 195793, 195365, 193680, 191211, 189433, 189078, 189615, 190021, 189516, 187939, 185884, 184115, 182738, 181419, 180352, 180043, 180085, 179301, 177379, 175286, 173743, 172511, 171558, 171529, 172375, 172804, 172006, 170880, 170681, 171402, 172322, 173176, 173867, 173860, 172857, 171428, 170199, 168972, 167329, 165475, 163882, 162767, 162432, 163279, 164917, 166160, 166580, 167195, 168913, 171227, 173294, 175421, 178458, 182417, 186632, 190785, 194978, 199294, 203975, 209456, 215583, 221391, 226276, 230722, 235127, 238647, 240073, 239339, 237300, 234533, 231168, 227542, 224181, 221267, 218570, 215722, 212359, 208514, 205090, 203265, 203125, 203535, 203661, 203743, 204094, 204367, 204411, 204836, 205990, 207167, 207558, 207176, 206225, 204479, 202034, 199777, 198164, 196304, 193177, 189051, 184879, 181026, 177475, 174513, 172204, 169815, 166807, 163851, 161870, 160631, 159187]
55514A59187j942k101k150k165j690r28q91j696k039j100K06N93J8p47j188j101
55498A40266m08M79Q14M68N9k8j4j4J91N26O20N37O14O48K01m14n14k86m35o91
55478A42619j57R35J310P00K19M00M12k64q79q22n77o38o50l33j78n13q28o36
55460A40120k08K6Ok22n45m84J46M25n35j774j426M52J724J243K55Q1K74rm18
55441A39131m16m36q53r40q1R66J135N96J77L7j34k81k19q5R9O82J552J865J260
55422A44055M92K47K08l5r4L24N63J8p54q26k58J78K01J14J64L47N65N43J07k76
55402A45883J38J112J448O45l28m58j8J33k09p24j209j508j298n80J48N24N78
55385A44277K36n95j261p89N70J365R36L35N98J273J344O97j12o76p20j32M71
$$ y = [159187, 157245, 155144, 152994, 150829, 149139, 148211, 147320, 145624, 143585, 142485, 142691, 143284, 143302, 142555, 141367, 140266, 139858, 140337, 141151, 141619, 141678, 141650, 141636, 141622, 141813, 142339, 142959, 143496, 144110, 144758, 144959, 144545, 144031, 143745, 143310, 142619, 142462, 143397, 144707, 145407, 145626, 146026, 146438, 146174, 145295, 144473, 143896, 143258, 142608, 142275, 142097, 141584, 140756, 140120, 139912, 139938, 139944, 139722, 139177, 138693, 138839, 139264, 138729, 136955, 135529, 135981, 137705, 138948, 139203, 139284, 139558, 139549, 139131, 138715, 138279, 137426, 136486, 136405, 137371, 138506, 139102, 139279, 139316, 139182, 138901, 138682, 138597, 138696, 139378, 140930, 142795, 144055, 144547, 144794, 145002, 144967, 144873, 145197, 145760, 145778, 145024, 144198, 143940, 144118, 144319, 144433, 144597, 144944, 145509, 146052, 146159, 145883, 146021, 147133, 148581, 149226, 148898, 148440, 148422, 148555, 148346, 147622, 146413, 144905, 143607, 143027, 143175, 143699, 144277, 144513, 143918, 142657, 141868, 142438, 143803, 144739, 145074, 145672, 146945, 148289, 148986, 148874, 148198, 147478, 147346, 147817]
55368A47817J75p13p60L66J156N00n84o41M7K66j38m55n78q99j262j191q42p18
55350A41546p88p47p18r03r92o72k41o6M8K82L29J02J71P84J245J017O09N37L70
55331A41913k98p95m69Q0Qk90J0N77N22lj02L20O22O89R44J265J114N27Pl49o77
55310A45615o21J77J104J188M71j82m28n74o21k81J70R4l59l06N86J602J861J152
55292A50648j17j209j487r72l57j05M1L09L79J29J22N58O11k63j170j047l83l89
55274A45298r99j128m73K67P53J212J452J037L68L49R38J207Q58M98M24K92O3
55257A52416P9J56k20o69k18R92J531O64o39j139p73j95J86J82l23j005j201p81
55239A49043l03n1L10Q41R16K22n45o01j21J57o3m53o55n75l83l28m27k57N17
$$ y = [147817, 147992, 147279, 146519, 146885, 148041, 148541, 147957, 147316, 147363, 147629, 147491, 147036, 146458, 145559, 144297, 143106, 142264, 141546, 140758, 140011, 139293, 138390, 137398, 136726, 136485, 136419, 136467, 136749, 137078, 137180, 137351, 138135, 139380, 140397, 141006, 141543, 141913, 141615, 140820, 140351, 140431, 140439, 140149, 140159, 140736, 141258, 141255, 141153, 141473, 142095, 142784, 143728, 144993, 146107, 146634, 146641, 146292, 145615, 144994, 145171, 146275, 147463, 147934, 147752, 147324, 146750, 146129, 145848, 146018, 146112, 145753, 145447, 146033, 147635, 149496, 150648, 150531, 149322, 147835, 146863, 146506, 146401, 146442, 146751, 147130, 147259, 147381, 147939, 148550, 148287, 147117, 146070, 145687, 145298, 144299, 143171, 142698, 142965, 143718, 144930, 146382, 147419, 147787, 148136, 149074, 150281, 151139, 151637, 152061, 152353, 152416, 152495, 152651, 152431, 151762, 151544, 152536, 154067, 154731, 154092, 152953, 152180, 151985, 152171, 152353, 152030, 151025, 149824, 149043, 148740, 148689, 148999, 149840, 150756, 150978, 150433, 149832, 149711, 149868, 149805, 149352, 148697, 148122, 147739, 147411, 146984, 146727, 147244]
55220A47244J409J423K78j146j805j502p46j1N15P88P97O04L39J94L19N65N89
55203A49854L33J84L39L87l0m87k67N84J268J165L07q59j672j522n03L72K65l92
55185A49326n43RN40P03Q77J216J265Q23M19N22Q23P06O7n93o72R6J355K269K175
55166A61383J197J6q24j168j042o37k74l9K95O85N31m05j252r80J29P63K50q03
55148A57825j460j292k70J253K362K117O14j021j863j910j554r69k61K75L75L7
55132A54258n06q76p08p6L90K39k08l42j94k44n73q13q46q65q66o07q4M95J132
55113A48706J874K372K207J550R47N91L93N73J416K539L103K761J861Q18j05n62
55097A71044l77P5L10L96N82O03J54l17k16J73J30k03j32K48K00k36l02K2q0p00
$$ y = [147244, 148653, 150076, 150354, 149208, 147403, 145901, 145155, 145144, 145659, 146447, 147244, 147848, 148187, 148381, 148700, 149265, 149854, 150187, 150371, 150710, 151097, 151067, 150580, 150313, 150897, 152165, 153330, 153637, 152778, 151106, 149584, 149081, 149453, 149718, 149326, 148783, 148792, 149332, 150035, 150912, 152128, 153393, 154216, 154635, 155157, 155980, 156686, 156753, 156160, 155488, 155584, 156939, 159208, 161383, 162580, 162596, 161772, 160604, 159562, 158925, 158651, 158612, 158907, 159592, 160123, 159718, 158466, 157486, 157615, 158378, 158628, 157825, 156365, 155073, 154803, 156056, 158418, 160535, 161149, 160128, 158265, 156355, 154801, 153832, 153571, 153846, 154221, 154258, 153752, 152876, 152168, 152092, 152482, 152721, 152513, 152171, 151977, 151733, 151160, 150347, 149501, 148636, 147770, 147163, 147079, 147574, 148706, 150580, 152952, 155159, 156709, 157656, 158247, 158640, 159213, 160629, 163168, 166271, 169032, 170893, 171711, 171606, 171044, 170667, 170742, 171052, 171448, 172030, 172633, 172787, 172470, 172254, 172427, 172557, 172354, 172222, 172470, 172670, 172434, 172132, 172154, 172074, 171374]
55077A71374r04l85n0l80n18K73J299J496R65N61N31M61J22l19o67p97p01o97
55059A71664j173j813j699n54O23O81l28j338j459o59M06R30O21Kk01L5J78R1
55041A66007J42L47J81n37j218j285p99r8N91R79Q09L23M1n2m37j057j241p89
55023A61907l32k97l75k96k74k85J37R19J168M54l96m97p9K09M12Q80J370J416
55005A66041J138R44P36J81o09j196j365j045j27J039J480O46o38r89p2J203J881
54988A69248J728J007J35l77j50O65J436J541Q83ml57L0M50Q9q51j332q45R0Q81
54969A74267J583K297K562J961R03K62M56J209J932K064J405L97k33l12k84l91
54953A90078l78j54j12m35p16o54m92m29k33J42K08k65o74l74L99R73J170J333
$$ y = [171374, 170470, 170085, 170035, 169655, 169137, 169410, 170709, 172205, 173170, 173731, 174262, 174723, 174845, 174526, 173859, 173062, 172361, 171664, 170491, 168678, 166979, 166425, 167048, 167729, 167401, 166063, 164604, 163945, 164351, 165281, 165902, 165904, 165703, 165738, 165916, 166007, 166149, 166496, 166677, 166140, 164922, 163637, 162838, 162740, 163331, 164310, 165119, 165442, 165483, 165431, 164994, 163937, 162696, 161907, 161575, 161278, 160903, 160607, 160333, 160048, 160185, 161104, 162272, 162726, 162330, 161833, 161754, 161963, 162375, 163255, 164625, 166041, 167179, 168123, 168859, 169040, 168431, 167235, 165870, 164825, 164698, 165737, 167217, 167863, 167225, 166236, 166164, 167367, 169248, 170976, 171983, 172118, 171741, 171591, 172256, 173692, 175233, 176116, 176112, 175755, 175785, 176235, 176324, 175473, 174141, 173296, 173386, 174267, 175850, 178147, 180709, 182670, 183573, 183835, 184291, 185500, 187432, 189496, 190901, 191298, 191065, 190753, 190469, 190078, 189700, 189546, 189434, 188999, 188283, 187629, 187137, 186708, 186475, 186617, 186825, 186560, 185886, 185512, 185911, 186884, 188054, 189387]
54935A89387J760K553L672M783N395N493N632O150O742P052P171P294P390P423
54921B67897P288O449M463J987L25m01j523l765o059p152p303p511p886p894p437
54906B31478o694n487l840k623k575l151l190k356j163q3N41L33m68q08j64N61
54890B00311M99M60J788M220O250P242P761Q100P974P592P563P688P120N809M560
54875B84937L492J829n74k784m246n409o564p230p268p437q078q267p098n147
54861B20156l834l804m519n020m600l159j443n18o35r92q81n89p30j265j674j776
54845A84717j749j617j251p82n88q14j245j619j869j985j887j518r72m52l7M12
54829A66744R41J298J218R45R65J194R82J18o82p42l37j37j86j34k1j70m33l54
$$ y = [189387, 191147, 193700, 197372, 202155, 207550, 213043, 218675, 224825, 231567, 238619, 245790, 253084, 260474, 267897, 275185, 281634, 286097, 288084, 288409, 288008, 286485, 282720, 276661, 269509, 262206, 254695, 246809, 238915, 231478, 224784, 219297, 215457, 212834, 210259, 207108, 203918, 201562, 200399, 200316, 200857, 201190, 200722, 199914, 199750, 200311, 200810, 201270, 203058, 207278, 213528, 220770, 228531, 236631, 244605, 252197, 259760, 267448, 274568, 280377, 284937, 288429, 290258, 289684, 286900, 282654, 277245, 270681, 263451, 256183, 248746, 240668, 232401, 225303, 220156, 216322, 212518, 207999, 202979, 198379, 195220, 193777, 193259, 192624, 191632, 190751, 190162, 189432, 188167, 186493, 184717, 182968, 181351, 180100, 179318, 178730, 177916, 176671, 175052, 173183, 171198, 169311, 167793, 166821, 166369, 166332, 166744, 167685, 168983, 170201, 171146, 172111, 173305, 174287, 174405, 173723, 172981, 172644, 172507, 172321, 172187, 172166, 171996, 171563, 171209]
54811A71209M5L09K83J94J08q2k40j00K61O01R88J475J602R76J58J03P43J095
54793A79728P90N89J098J876K145J768J154P52R25J749K673K910K314J559J302
54778B03332J749K913M601O059O468O077O082P112Q468R196R065Q187O530M394
54764B90233K610J519L71j584l839n254n589n574n734n899n887n868n913n730
54750B37862n123m310l616l121k738k444k205j872j336p92o16q95j207r67r6R64
54734B07488J950L154M831O461P134O660N904N833O543P316P404O602N208L650
54720B86138K085L75j569l519n132o241o854p074p146p316p460p097o111n071
54706B18008m477m040l195k083j381j388j774k119k152j649p04M4Q6j84m3M07
$$ y = [171209, 171254, 171563, 171846, 172040, 172148, 172066, 171826, 171726, 171987, 172588, 173576, 175051, 176653, 177629, 177787, 177890, 178633, 179728, 180518, 181107, 182205, 184081, 186226, 187994, 189148, 189900, 190825, 192574, 195247, 198157, 200471, 202030, 203332, 205081, 207994, 212595, 218654, 225122, 231199, 237281, 244393, 252861, 262057, 271122, 279309, 285839, 290233, 292843, 294362, 294733, 293149, 289310, 284056, 278467, 272893, 267159, 261260, 255373, 249505, 243592, 237862, 232739, 228429, 224813, 221692, 218954, 216510, 214305, 212433, 211097, 210305, 209689, 208794, 207587, 206620, 206524, 207488, 209438, 212592, 217423, 223884, 231018, 237678, 243582, 249415, 255958, 263274, 270678, 277280, 282488, 286138, 288223, 288598, 287029, 283510, 278378, 272137, 265283, 258209, 251063, 243747, 236287, 229190, 223079, 218008, 213531, 209491, 206296, 204213, 202832, 201444, 199670, 197551, 195399, 193750, 193046, 193090, 193176, 192992, 192949, 193356]
54690A93356L94k63r69j400j811k139j845r56l79o45j112r95m66j51j15n7k0k12
54672A80215m30l65k19m72j096j562j534j126n43J51Q23J194J079O22K01J24L04
54655A77366L10r2n48n23n1L05K60J13J94M24O25Q41J119J318J369J368J278Q50
54637A86526J17m55n27l21j81p2J88M56L57k06r11j315j215q02n35o17p10l53
54619A79424K86N29J10m37m92r7K16J02k99n41l16J27J80l33p16k86N95J009Q27
54600A79888P18Q66O77J8k86K69R93J102Q99J029J183N69n92j158o64O5P3n56
54582A85093j021q42l11k1k10n67o33l19N0J57o8n51j070j200o43K80Q31P35M17
54563A80107K77K49K26L91P45Q65O00M97R71J516J331N37Q0M38J044J009Q7j117
$$ y = [193356, 193750, 193487, 192518, 191118, 189307, 187168, 185323, 184367, 183988, 183343, 182231, 181236, 180770, 180619, 180504, 180447, 180427, 180215, 179785, 179420, 179201, 178729, 177633, 176071, 174537, 173411, 172868, 173019, 173842, 175036, 176115, 176737, 176938, 177062, 177366, 177676, 177584, 177036, 176513, 176462, 176767, 177027, 177140, 177334, 177758, 178383, 179224, 180343, 181661, 183030, 184398, 185676, 186526, 186643, 186188, 185661, 185340, 185159, 185087, 185275, 185731, 186088, 185882, 184971, 183656, 182441, 181639, 181104, 180487, 179777, 179424, 179710, 180239, 180349, 179912, 179420, 179323, 179539, 179641, 179342, 178801, 178485, 178612, 178792, 178459, 177743, 177457, 178052, 179061, 179888, 180606, 181472, 182149, 182167, 181881, 182150, 183143, 184245, 185144, 186173, 187356, 187925, 187333, 186175, 185511, 185576, 185649, 185093, 184072, 183230, 182919, 182898, 182688, 182121, 181488, 181169, 181219, 181376, 181308, 180757, 179687, 178487, 177844, 178124, 178955, 179690, 180107, 180384, 180633, 180859, 181250, 181995, 182860, 183460, 183957, 184928, 186444, 187775, 188312, 188392, 188830, 189874, 190883, 190970, 189853]
54545A89853j632q78Q04K370L009K783K231J656J022L50k32o45q58p81m11O7N01
54528A99209Q76J049O39m54j699k369k222j507n30M31R73P61o3q86j139p02N2
54511A92419N17L32l13q50q83m55R9L81J02o05j069p05K22R05J012Q92P57M03
54493A93161j32l61j90k19p30j043n04M27P61L00l00n21l93j01K75O73J104J604
54475A93811J941J687R57N77J024J674J655J053O15N69N42M34N38Q50Q77L17n50
54458B08571j221j405j191j034j375k013k114j261j05M93N23M84M01j8n98q84
54442A97253r43j160j379j126n84m48q10j017p81m55j21O43J812K580K502K106
54426A98072J970J855J385Q29N90M07j43o95m52O05J536J544P55j64p33q90p56
$$ y = [189853, 188221, 187343, 188147, 190517, 193526, 196309, 198540, 200196, 201218, 201568, 201336, 200691, 199833, 199052, 198641, 198708, 199209, 200085, 201134, 201773, 201319, 199620, 197251, 195029, 193522, 192992, 193423, 194396, 195157, 195094, 194208, 193069, 192367, 192419, 192936, 193268, 192955, 192105, 191222, 190767, 190866, 191247, 191349, 190744, 189675, 188970, 189192, 190097, 191109, 192001, 192758, 193161, 193029, 192668, 192478, 192259, 191529, 190486, 189982, 190409, 191170, 191470, 191170, 190649, 190256, 190155, 190430, 191103, 192207, 193811, 195752, 197439, 198396, 198973, 199997, 201671, 203326, 204379, 204994, 205563, 206105, 206539, 207077, 207927, 208804, 209121, 208571, 207350, 205945, 204754, 203720, 202345, 200332, 198218, 196957, 196852, 197345, 197868, 198352, 198753, 198735, 198137, 197253, 196310, 195150, 193771, 192645, 192061, 191613, 190803, 189786, 189005, 188550, 188429, 189072, 190884, 193464, 195966, 198072, 200042, 201897, 203282, 204111, 204701, 205108, 204965, 204270, 203818, 204423, 205959, 207503, 208258, 208094, 207361, 206471, 205715]
54409B05715m77j18L65J055J880K467K295J200k60j123q97MQ68J455J889K087
54393B18405J833J335J090J129R32L02k44k45qj90q87j592j799j372m76M59Q93
54376B19565O42J20j43j34j93l69l15J69R11J730K636L483L899L775L557L692
54360B43025L983L945L531L073K570J724P03J64K12M9q43j807j957j650j996l178
54344B51548m154m124l432k782k368k126k116k213j964j196l06L05O61P77M25
54329B26935k78p06o25o37j204j784j649r74m31j28K33N20L47j12k90r3J34K41
54311B19499K08k95j405k336k150j126m25m10l51Q1K70r4l41J9M25K73rK65Q81
54292B12979J139R72P69M82j47p17m96L55Q06M12o2K00Q96J159P35N2n72j134
$$ y = [205715, 205238, 205120, 205485, 206540, 208420, 210887, 213182, 214382, 214122, 212999, 212102, 212106, 212974, 214429, 216318, 218405, 220238, 221573, 222663, 223792, 224724, 225026, 224782, 224537, 224529, 224339, 223452, 221860, 220061, 218689, 218213, 218672, 219565, 220207, 220327, 220184, 220050, 219857, 219488, 219173, 219342, 220253, 221983, 224619, 228102, 232001, 235776, 239333, 243025, 247008, 250953, 254484, 257557, 260127, 261851, 262554, 262718, 262930, 262979, 262136, 260329, 258372, 256722, 254726, 251548, 247394, 243270, 239838, 237056, 234688, 232562, 230446, 228233, 226269, 225073, 224767, 225072, 225733, 226510, 226935, 226657, 225951, 225326, 224689, 223485, 221701, 220052, 219078, 218647, 218519, 218752, 219272, 219619, 219507, 219217, 219124, 219258, 219499, 219707, 219412, 218007, 215671, 213521, 212395, 211970, 211560, 211209, 211290, 211560, 211466, 211125, 211144, 211569, 211842, 211833, 212098, 212979, 214118, 215090, 215859, 216341, 216194, 215477, 214981, 215336, 216142, 216554, 216492, 216692, 217588, 218747, 219482, 219534, 218962, 217828]
54274B17828j527j484j063o41l34J44Q31J311J383J443J749J861J418R44J109
54259B24972J493J137J94j21N82J231J006N70Q06J256Q30m48j446j403n94K78
54243B30343O60L06n20j130j233j344j825k055j349k51Q0m33p39l04K70L98L35
54226B21209N56J035J484J719J597J029K16n18j109j518j344l40Q07J084N26J75
54210B26608N43R87Q39K77k50p39j223j388j021m38J0L66P01P72M17j04m79o96
54192B25182p74n73j42P7k61r14j291j009j81O45Q63M17j04k02k4K13Q45K091
54174B24858L107K786J357J18l71o58r54o53L02R22O20Q6k6j18n53o42K18J189
54156B31588J003k51j410j847j792j411o48J63N30N32O20P75N78J5n02q16j101
$$ y = [217828, 216301, 214817, 213754, 213113, 212779, 212923, 213754, 215065, 216448, 217891, 219640, 221501, 222919, 223863, 224972, 226465, 227602, 227796, 227675, 228257, 229488, 230494, 231064, 231870, 233126, 233956, 233508, 232062, 230659, 230065, 230343, 231003, 231309, 230789, 229659, 228426, 227082, 225257, 223202, 221853, 221602, 221682, 221249, 220510, 220206, 220476, 220874, 221209, 221765, 222800, 224284, 226003, 227600, 228629, 228845, 228327, 227218, 225700, 224356, 224016, 224823, 225907, 226433, 226608, 227151, 228138, 228977, 229254, 229004, 228265, 227042, 225654, 224633, 224195, 224205, 224571, 225272, 226044, 226461, 226357, 225878, 225182, 224408, 223835, 223693, 223770, 223509, 222595, 221304, 220295, 220114, 220759, 221622, 222039, 221935, 221733, 221709, 221922, 222767, 224858, 227965, 230751, 232108, 232226, 231855, 231197, 230243, 229590, 229892, 230814, 231434, 231520, 231494, 231376, 230823, 230181, 230399, 231588, 232591, 232340, 230930, 229083, 227291, 225880, 225232, 225395, 225925, 226457, 227077, 227852, 228430, 228445, 227943, 227127, 226026]
54139B26026j327j237q09k21M38R44P89j09q61o25J34L09j35j64N72J133Q44M08
54121B26109P96J739K096J421M07o4K47J074K024K657K542J623M48k62l04n9J43
54104B42637M44J010J457J224M66R1P87K346M073N444O247O539O663O957P189
54089B93574O662N122L194J647N72m43j707l233m858o186o779o624o069n116l420
54074B66336j283M4k53j392j899j317l04N22J033J078N27j32jJ143K522L302L389
54057B73315L188L021L055L339L699L726L118J995Q02k8m24p05j143j499j317
54042B94142p04k99k67O6J139K301K699K536K585K812K582K123K677M664O677
54027C25733P008N772M651M789N579N772N139M538M459M259L179J653Q23Q79P55
$$ y = [226026, 224699, 223462, 222653, 222432, 222870, 223814, 224603, 224494, 223633, 223008, 223142, 223451, 223316, 223152, 223724, 224857, 225701, 226109, 226905, 228644, 230740, 232161, 232568, 232504, 232751, 233825, 235849, 238506, 241048, 242671, 243119, 242857, 242553, 242494, 242637, 243081, 244091, 245548, 246772, 247238, 247329, 248116, 250462, 254535, 259979, 266226, 272765, 279428, 286385, 293574, 300236, 305358, 308552, 310199, 310771, 310328, 308621, 305388, 300530, 294344, 287565, 280941, 274872, 269756, 266336, 265053, 265097, 264844, 263452, 261553, 260236, 259932, 260454, 261487, 262565, 263092, 262960, 262959, 264102, 266624, 269926, 273315, 276503, 279524, 282579, 285918, 289617, 293343, 296461, 298456, 299258, 299230, 298806, 298101, 296958, 295459, 294142, 293438, 293139, 292872, 292938, 294077, 296378, 299077, 301613, 304198, 307010, 309592, 311715, 314392, 319056, 325733, 332741, 338513, 343164, 347953, 353532, 359304, 364443, 368981, 373440, 377699, 380878, 382531, 383354, 384233, 384988]
54012C84988k82j584k218k393k957l924m476m262l844l757l876l926l918l817
53998C39754l337k434j657j597k209k933l315l366l354l460l562l343k648j700
53984C00839r65p46j032j557k009k227k274k215j917j252m57J6J8k59o89j253
53968B82021j622j339m96L05Q10J269J595J242K68l06J36R19J234J361J881K432
53952B91710K354K051K506L766N045O082P276Q556R331R653J0280J1407J2281
53939C82298J2249J1322R574O940L928J542P2j238k948m603n496n618n373m979
53925C97670m503l994l264k035n54N73J283K211L624M948N655N958O207O311O240
53910D26330O457P221Q025Q249Q061P994Q030P643O560M966L190J560M32j19m73
$$ y = [384988, 384706, 383122, 380904, 378511, 375554, 371630, 367154, 362892, 359048, 355291, 351415, 347489, 343571, 339754, 336417, 333983, 332326, 330729, 328520, 325587, 322272, 318906, 315552, 312092, 308530, 305187, 302539, 300839, 299874, 299128, 298096, 296539, 294530, 292303, 290029, 287814, 285897, 284645, 284188, 284204, 284222, 283963, 283274, 282021, 280399, 279060, 278564, 278869, 279679, 280948, 282543, 283785, 284053, 283747, 283883, 284802, 286036, 287397, 289278, 291710, 294064, 296115, 298621, 302387, 307432, 313514, 320790, 329346, 338677, 348330, 358610, 370017, 382298, 394547, 405869, 415443, 422383, 426311, 427853, 427925, 426687, 423739, 419136, 413640, 408022, 402649, 397670, 393167, 389173, 385909, 383874, 383320, 383893, 385176, 387387, 391011, 395959, 401614, 407572, 413779, 420090, 426330, 432787, 440008, 448033, 456282, 464343, 472337, 480367, 488010, 494570, 499536, 502726, 504286, 504718, 504599, 504126]
53895E04126j021j726k367l017l916n002n855o120n856n540n640o142o540o526
53881D38858o518p076p962q393q134p676p287o621n547m606m249m227m112l955
53867C52495l979m108m191m242m137l623k930k796l417l991l801l167k719k355
53853C03039j701j117j227j775j879j411j211j802k611k762k072j075m10l95q19
53838B80772j038n63K80O57K87j43J50R86J416Q89j05o70n39j86K9K82P06Q42
53820B84052L10l36j01J034J981J939J277P40M82L68N61J158J726J849J855K375
53804C01270L350M134M440M573M762M828M588M244M186M627N414O026N916N118
53790C67476M364M337M854N089M449L022J370J66j00M89J180J148J66j329k717
$$ y = [504126, 503105, 501379, 499012, 495995, 492079, 487077, 481222, 475102, 469246, 463706, 458066, 451924, 445384, 438858, 432340, 425264, 417302, 408909, 400775, 393099, 385812, 379191, 373644, 369038, 364789, 360562, 356450, 352495, 348516, 344408, 340217, 335975, 331838, 328215, 325285, 322489, 319072, 315081, 311280, 308113, 305394, 303039, 301338, 300221, 298994, 297219, 295340, 293929, 292718, 290916, 288305, 285543, 283471, 282396, 281986, 281591, 280772, 279734, 279171, 279451, 280108, 280395, 280252, 280402, 281388, 282804, 283693, 283588, 282918, 282379, 282193, 282222, 282504, 283210, 284052, 284362, 284026, 283925, 284959, 286940, 288879, 290156, 290896, 291378, 291746, 292307, 293465, 295191, 297040, 298895, 301270, 304620, 308754, 313194, 317767, 322529, 327357, 331945, 336189, 340375, 345002, 350416, 356442, 362358, 367476, 371840, 376177, 381031, 386120, 390569, 393591, 394961, 395127, 395027, 395516, 396696, 397844, 398010, 396681, 393964]
53775C93964l514l573l255l303m136n364o161o064n215m109l347l326l850m200
53761C34547l948l481l381l595l636l385l177l146l068k796k452k109j680j161
53747B93532p29m99m63n71p51q53p97o86o21o06p00r62j059m24P92J474Q64l31
53729B86610q39n09j77j46J37Q27J197Q00K77M51J273K182K911L391L333K626
53713C04344J836J597J677J310M27p5M67J505J924J441R15J258K384L527M356
53698C28893N238O293O746N766L731J982J323J283J059O19M38O14O78K66m87j178
53682C63264j463j195n03J73L76R4k08j57K2k80j275k364k657j897p52q0m6q4
53664C50968L33J060J505J321P39K44O6R4J64K51L05J70k34p11r79r16m78L75
$$ y = [393964, 390450, 386877, 383622, 380319, 376183, 370819, 364658, 358594, 353379, 349270, 345923, 342597, 338747, 334547, 330599, 327118, 323737, 320142, 316506, 313121, 309944, 306798, 303730, 300934, 298482, 296373, 294693, 293532, 292803, 292304, 291841, 291270, 290519, 289666, 288869, 288183, 287562, 286956, 286256, 285294, 284235, 283811, 284603, 286077, 286941, 286610, 285771, 285262, 285085, 284939, 285076, 285903, 287100, 287900, 288177, 288628, 289901, 292083, 294994, 298385, 301718, 304344, 306180, 307777, 309454, 310764, 311191, 311116, 311583, 313088, 315012, 316453, 317368, 318626, 321010, 324537, 328893, 334131, 340424, 347170, 352936, 356667, 358649, 359972, 361255, 362314, 362933, 363371, 363985, 364663, 364929, 364442, 363264, 361801, 360606, 360103, 360276, 360652, 360746, 360538, 360381, 360403, 360123, 358848, 356484, 353827, 351930, 351178, 351098, 351052, 350968, 351301, 352361, 353866, 355187, 355926, 356170, 356236, 356330, 356494, 356745, 357050, 357220, 356986, 356275, 355296, 354380, 353902, 354277]
53646C54277J362J815J343M91J69M54O11L14R1L15O25P56J138J946K343J628N88
53629C70266O46J839K795K703K211K153K403K410K110J775J535J509J899K642
53615C98896L334L849M475N156N247M499L715L813M624N321N671O138O883P394
53601D69015P221O471N506M499L503K569J708R30L46M2j14k97m78n85p90j251
53585D98295j655j534j087j080j779k435k247j440r24j124j666k082k288k329
53571D74625k122j773j758k358l068k999j978q70n90j004j186o46R5L10R3J71
53555D54942Q44J570J664J054J54o61j139r66QJ364K308K442K026J484R23L37
53539D68354k5J67R36J964K846L272L184L011L470M760O120O614O284O125O852
$$ y = [354277, 355639, 357454, 358797, 359288, 359457, 359911, 360522, 360836, 360927, 361242, 361867, 362623, 363761, 365707, 368050, 369678, 370266, 370912, 372751, 375546, 378249, 380460, 382613, 385016, 387426, 389536, 391311, 392846, 394355, 396254, 398896, 402230, 406079, 410554, 415710, 420957, 425456, 429171, 432984, 437608, 442929, 448600, 454738, 461621, 469015, 476236, 482707, 488213, 492712, 496215, 498784, 500492, 501422, 501768, 501810, 501696, 501399, 500921, 500336, 499546, 498295, 496640, 495106, 494019, 492939, 491160, 488725, 486478, 485038, 484114, 482990, 481324, 479242, 476954, 474625, 472503, 470730, 468972, 466614, 463546, 460547, 458569, 457699, 457109, 456105, 454919, 454273, 454368, 454678, 454771, 454942, 455786, 457356, 459020, 460074, 460228, 459567, 458428, 457462, 457470, 458834, 461142, 463584, 465610, 467094, 468017, 468354, 468329, 468496, 469432, 471396, 474242, 477514, 480698, 483709, 487179, 491939, 498059, 504673, 510957, 517082, 523934]
53524E23934Q173R316R831R742R384R324J0076J1501J2818J3493J3894J4684J5906
53511F72076J7052J7869J8587J9316J9785J9781J9640J9947K0940K2287K3438
53500H90718K4054K4174K3910K3174K1855K0294J9224J9013J9149J8815J7964
53489A122344J7429J7943J9267K0461K0801K0290J9428J8666J8152J7824J7594
53478A330199J7384J7161J7013J7089J7276J7066J5950J4020J1895J0004Q292
53467A493349O637N179L919K379N2k879n661p778r310j0531j1490j2133j2592
53454A439141j3177j4070j5136j6050j6695j7301j8095j8841j8999j8459j7779
53443A254539j7573j7827j8074j8010j7653j7002j5880j4174j2094j0104q592
$$ y = [523934, 532107, 541423, 551254, 560996, 570380, 579704, 589780, 601281, 614099, 627592, 641486, 656170, 672076, 689128, 706997, 725584, 744900, 764685, 784466, 804106, 824053, 844993, 867280, 890718, 914772, 938946, 962856, 986030, 1007885, 1028179, 1047403, 1066416, 1085565, 1104380, 1122344, 1139773, 1157716, 1176983, 1197444, 1218245, 1238535, 1257963, 1276629, 1294781, 1312605, 1330199, 1347583, 1364744, 1381757, 1398846, 1416122, 1433188, 1449138, 1463158, 1475053, 1485057, 1493349, 1499986, 1505165, 1509084, 1511463, 1511515, 1508636, 1502975, 1495197, 1485887, 1475356, 1463866, 1451733, 1439141, 1425964, 1411894, 1396758, 1380708, 1364013, 1346712, 1328617, 1309776, 1290777, 1272318, 1254539, 1236966, 1219139, 1201065, 1183055, 1165402, 1148400, 1132520, 1118346, 1106252, 1096148, 1087556]
53432A087556p506o352m769l070j947j551j260n12O01J800L262N207P210Q448
53418A087117Q719Q732R380J0973J3103J4991J6101J6627J7356J8802K0743K2682
53406A265326K4451K6004K7112K7799K8690L0251L1992L3170L4091L5764L8335
53395A602985M0851M2811M4846M7427M9793N0981N1257N1688N2649N3620N4239
53384B143147N4679N4872N4168N2249M9888M8217M7379M6315M4078M0880L7685
53373B673557L4884L1914K8157K3803J9468J5288J0849N919P54m355r501j4919
53361B815818k0583k6153l1175l5382l8875m1985m4804m6978m8189m8653m8849
53350B384192m8913m8711m8351m8052m7565m6319m4291m2229m0787l9944l9398
$$ y = [1087556, 1080050, 1073698, 1068929, 1065859, 1063912, 1062361, 1061101, 1060589, 1061190, 1062990, 1066252, 1071459, 1078669, 1087117, 1095836, 1104568, 1113948, 1124921, 1138024, 1153015, 1169116, 1185743, 1203099, 1221901, 1242644, 1265326, 1289777, 1315781, 1342893, 1370692, 1399382, 1429633, 1461625, 1494795, 1528886, 1564650, 1602985, 1643836, 1686647, 1731493, 1778920, 1828713, 1879694, 1930951, 1982639, 2035288, 2088908, 2143147, 2197826, 2252698, 2306866, 2359115, 2409003, 2457220, 2504599, 2550914, 2594992, 2635872, 2673557, 2708441, 2740355, 2768512, 2792315, 2811783, 2827071, 2837920, 2843839, 2844593, 2840238, 2830737, 2815818, 2795235, 2769082, 2737907, 2702525, 2663650, 2621665, 2576861, 2529883, 2481694, 2433041, 2384192, 2335279, 2286568, 2238217, 2190165, 2142600, 2096281, 2051990, 2009761, 1968974, 1929030, 1889632]
53339A889632l9010l8569l7639l6075l4314l2717l1011k8787k6249k3905k1754
53328A539602j9432j7082j5427j4777j4566j4092j3395j3044j3282j3803j4247
53317A376455j4523j4600j4303j3552j2614j1906j1486j0974r926q269o344m655
53305A243303l482k687j911j073l86K80J658M183P081R127J0286J1664J3709J5490
53291A307242J6314J7005J8603K0614K1757K1979K2357K3207K3716K3544K3380
53280A539718K3508K2997K1105J8439J5996J3770J1222Q505O249M416K279n07
53268A687697l502o170q530j0941j3576j6180j8283j9689k0801k2169k3741k4877
53256A499238k5310k5565k6223k7155k7859k8135k8081k7775k7422k7409k7781
$$ y = [1889632, 1850622, 1812053, 1774414, 1738339, 1704025, 1671308, 1640297, 1611510, 1585261, 1561356, 1539602, 1520170, 1503088, 1487661, 1472884, 1458318, 1444226, 1430831, 1417787, 1404505, 1390702, 1376455, 1361932, 1347332, 1333029, 1319477, 1306863, 1294957, 1283471, 1272497, 1262571, 1254302, 1247958, 1243303, 1239821, 1237134, 1235223, 1234150, 1233764, 1234044, 1235702, 1239885, 1246966, 1256093, 1266379, 1278043, 1291752, 1307242, 1323556, 1340561, 1359164, 1379778, 1401535, 1423514, 1445871, 1469078, 1492794, 1516338, 1539718, 1563226, 1586223, 1607328, 1625767, 1641763, 1655533, 1666755, 1675260, 1681509, 1685925, 1688204, 1687697, 1684195, 1678025, 1669495, 1658554, 1644978, 1628798, 1610515, 1590826, 1570025, 1547856, 1524115, 1499238, 1473928, 1448363, 1422140, 1394985, 1367126, 1338991, 1310910, 1283135, 1255713, 1228304, 1200523]
53245A200523k7932k7271k5980k4609k3324k2103k1351k1518k2138k2060k0842
53234I41395j9270j8269j7800j7192j6184j5109j4283j3583j2717j1646j0638
53223G74704r945r575r336r146r135r396r768j0042j0305j0844j1653j2237j2169
53210F41153j1770j1907j2930j4002j3873j2301j0348r119q687q526q440q512
53198E10738q452p845o961o585o899p195o939o481o396o665o939p132p306p300
53184D11643o925o286n556m764m111m105m901n692n414l991k480j896k201k505
53170C50816k054r89j52j79q48j418j565j569j676j764j746j776j804j447p20
53155C31109l63q99j745j786p58M75R26L97n63j292j536j514j465j222n41K27
$$ y = [1200523, 1172591, 1145320, 1119340, 1094731, 1071407, 1049304, 1027953, 1006435, 984297, 962237, 941395, 922125, 903856, 886056, 868864, 852680, 837571, 823288, 809705, 796988, 785342, 774704, 764759, 755184, 745848, 736702, 727567, 718171, 708403, 698361, 688056, 677212, 665559, 653322, 641153, 629383, 617476, 604546, 590544, 576671, 564370, 554022, 544903, 536216, 527690, 519250, 510738, 502286, 494441, 487480, 480895, 473996, 466801, 459862, 453381, 446985, 440320, 433381, 426249, 418943, 411643, 404718, 398432, 392876, 388112, 384001, 379896, 374995, 369303, 363889, 359898, 357418, 355522, 353321, 350816, 348762, 347773, 347621, 347442, 346594, 345176, 343611, 342042, 340366, 338602, 336856, 335080, 333276, 331829, 331109, 330746, 329847, 328102, 326316, 325558, 326033, 326959, 327356, 326793, 325501, 323965, 322451, 320986, 319764, 319223, 319450]
53139C19450L30l71j099j202q98o84m85j0O07J019J230J384J359J099R57J184
53123C23870J432J421J606K444L323L182K038R52N53M62K20m5j08o6m6n6k71q26
53105C40085j257r28j33j0j010k144k303j593q82n04j70J40k7q88j995k643k504
53088C21234j752q28j16K05J06l78j072j591j546q72J26J024J510J469J010L97
53072C18926k05p51j083q79j31O38R06O83K60l15j040j620j753j613j484j217
53056C09322o16j04j72l50K60J425J733N09j156j798j226k13P92J798K563K627
53040C15394K030J361J023Q43M42k14p07m82N45J647J833R09l11j017j234j356
53024C20706j326q17P0Q72J414J869K183K019J312M38l08r70j479j422n83N28
$$ y = [319450, 319780, 319409, 318310, 317108, 316210, 315526, 315041, 315031, 315638, 316657, 317887, 319271, 320630, 321729, 322686, 323870, 325302, 326723, 328329, 330773, 334096, 337278, 339316, 340268, 340821, 341283, 341503, 341458, 341350, 341284, 341238, 341182, 340911, 340085, 338828, 337900, 337767, 337757, 336747, 334603, 332300, 330707, 329825, 329321, 329151, 329291, 329264, 328376, 326381, 323738, 321234, 319482, 318654, 318538, 318743, 318849, 318471, 317399, 315808, 314262, 313390, 313516, 314540, 316050, 317519, 318529, 318926, 318721, 317970, 316887, 316008, 315877, 316515, 317421, 318104, 318364, 318049, 317009, 315389, 313636, 312023, 310539, 309322, 308706, 308602, 308430, 308080, 308340, 309765, 311498, 312007, 310851, 309053, 307827, 307614, 308406, 310204, 312767, 315394, 317424, 318785, 319808, 320651, 321093, 320879, 320172, 319690, 320235, 321882, 323715, 324624, 324313, 323296, 322062, 320706, 319380, 318563, 318633, 319505, 320919, 322788, 324971, 326990, 328302, 328740, 328432, 327462, 325983, 324561, 323978, 324506]
53008C24506J134J055Q00Q05R93J092J088J052Q44K88l63n89k22L50P46J047J462
52991C36088J812J716J179O61N65Q19J041R35N55L00O05J460K275K417J898J361
52975C55687J328J619J590Q91j20p23n93j13J68J98L45P44J103J211J183J137
52959C65655R86P24M89J59o06j646k175j824j269j349j919k278k248k150j966
52944C48583j399o04j16o1j03j16k71n30o65p44r19q96l82Q0l05j198j382n76
52926C38396R5j50o14l83K43M07O9j41m1qk53o39j018j192p94K00J046R49Q3o73
52906C35582q82q74r29q26l37K76N70M69K61J96K20J14j88n10o21n00l14k07j82
52887C31318j80j61j41k37m99o53k61O13J207R51K31j13J46O53J257K012K515
$$ y = [324506, 325640, 326695, 327495, 328300, 329293, 330385, 331473, 332525, 333369, 333657, 333294, 332705, 332483, 332833, 333579, 334626, 336088, 337900, 339616, 340795, 341456, 342021, 342840, 343881, 344816, 345371, 345671, 346276, 347736, 350011, 352428, 354326, 355687, 357015, 358634, 360224, 361115, 360995, 360272, 359679, 359566, 359734, 359932, 360277, 361021, 362124, 363335, 364518, 365655, 366641, 367365, 367854, 368013, 367407, 365761, 363586, 361762, 360493, 359144, 357225, 354947, 352699, 350549, 348583, 347184, 346580, 346464, 346403, 346300, 346184, 345913, 345383, 344718, 343974, 343055, 342159, 341777, 341857, 341552, 340354, 338972, 338396, 338491, 338341, 337727, 337344, 337587, 337994, 338063, 337922, 337881, 337873, 337620, 336981, 335963, 334771, 333977, 334177, 335223, 336172, 336255, 335582, 334700, 333826, 332897, 332071, 331734, 332010, 332580, 333049, 333310, 333506, 333726, 333840, 333652, 333142, 332521, 332021, 331707, 331500, 331318, 331138, 330977, 330836, 330599, 330100, 329447, 329186, 329799, 331006, 331957, 332188, 332075, 332221, 332874, 334131, 336143, 338658]
52870C38658K214J486J495K609L812M062L541L025K670K093J175J62p67j531j992
52855C62712k134k173k209k162k202k777l843m641m611m049l426k741k000j707
52841C22037k103k431j867p85k45n05q77r50r90j104r53n27l99p83r36j11J255
52824C07726J883J186qm39J23P53O81K50K66P47J006Q23Q19J413K159K410K121
52807C23919J568Q42M8n01p22r79j458j751j575j359j590k051k243k167k051j739
52791C06191j042l67k14l74k89J01N30J058J751K025J258j4m82K80J368J781J418
52774C14979P04j1m40l40K12Q25J143J050O10J88K97Q62J016K46p14q76m73m56
52756C18822q40p34L3O02N52N42J035J515J434J010O40L52L23J029K259K815J969
$$ y = [338658, 340872, 342358, 343853, 346462, 350274, 354336, 357877, 360902, 363572, 365665, 366840, 367002, 366235, 364704, 362712, 360578, 358405, 356196, 354034, 351832, 349055, 345212, 340571, 335960, 331911, 328485, 325744, 323744, 322037, 319934, 317503, 315636, 314851, 314606, 314101, 313224, 312274, 311284, 310180, 309227, 308700, 308301, 307518, 306582, 306471, 307726, 309609, 310795, 310787, 310348, 310471, 311224, 311905, 312155, 312421, 313168, 314174, 314997, 315816, 317229, 319388, 321798, 323919, 325487, 326329, 326377, 325876, 325154, 324175, 322717, 320966, 319391, 318032, 316442, 314391, 312148, 309981, 307930, 306191, 305149, 304782, 304568, 304194, 303905, 304006, 304536, 305594, 307345, 309370, 310628, 310614, 310132, 310412, 311780, 313561, 314979, 315683, 315672, 315232, 314892, 315104, 315929, 317072, 318122, 318732, 318920, 319217, 320079, 321095, 321341, 320627, 319751, 319278, 318822, 317982, 317248, 317281, 317883, 318435, 318977, 320012, 321527, 322961, 323971, 324611, 324963, 325286, 326315, 328574, 331389, 333358]
52739C33358N49j69o3J22J43M55J234K011K232J807J085O64R25J520J599Q81Q0
52722C48433o2K39K33l79j359k405l139l027j963o97j01k07m84p52j131j335q53
52705C31011J25Q07Q72Q14R72R51M12j89j70L38N62J09o02r91r85q15m61L22J446
52686C34528K235K026R35j88n84k73J02nn35r35p79k97j70o33j031o10L61P75
52668C34922R8r69j460j283j007r19p77l55K54Q79J404J690J654J450J343J404
52652C38328J468J422J388J612K207K900L044K146N33q25j363j479j742j929j475
52637C46235o23k93o99q96j52Q97J132N68L02Q93J626J618R79M28J99n3m97q66
52619C50798r23p63n47m00n66j164j718j470n03J29k59r64r06j73K56Q5P1O75
$$ y = [333358, 333907, 333738, 333675, 333797, 333940, 334395, 335629, 337640, 339872, 341679, 342764, 343428, 344353, 345873, 347472, 348353, 348433, 348371, 348610, 348843, 348464, 347105, 344700, 341561, 338534, 336571, 335874, 335773, 335566, 335082, 334330, 333199, 331864, 331011, 331136, 331943, 332815, 333629, 334601, 335552, 335964, 335775, 335605, 335943, 336505, 336614, 336012, 335021, 334036, 333221, 332760, 333082, 334528, 336763, 338789, 339724, 339536, 338952, 338679, 338781, 338776, 338241, 337306, 336527, 336230, 336060, 335427, 334396, 333786, 334147, 334922, 335020, 334051, 332591, 331308, 330301, 329382, 328605, 328250, 328504, 329383, 330787, 332477, 334131, 335581, 336924, 338328, 339796, 341218, 342606, 344218, 346425, 349325, 352369, 354515, 355048, 354223, 352860, 351381, 349639, 347710, 346235, 345612, 345319, 344620, 343724, 343572, 344469, 345601, 346169, 346471, 347364, 348990, 350608, 351587, 352015, 352214, 352161, 351664, 350798, 349875, 349112, 348565, 348165, 347599, 346435, 344717, 343247, 342744, 342873, 342614, 341650, 340744, 340571, 340827, 340912, 340983, 341658]
52601C41658J264J074K97l29o17r73j571j973j637n44P14J429J396J142J360K055
52585C44745K474K029J018K60J67M15M68J18l92o81n57j22L80P41P99M43j29l89
52567C51787r1K81R2m50n31k7J59o00j699k208k147k153k241j860j024n28p46
52550C36014j013o20J74O07M70J34j99o36j063j062n76j06rO3N91J331J542R97
52532C36639L53K85O98J004R55Q76J135J726K342K683K670K433K190K101K274
52517C60364K804L609M280M362L947L642L778L982L743L131K492J802P35o62j927
52502D00082k806l478m170m898n581n984n617m151k098o40n16j368k270k593k276
52487C51636j600r27m97l11k80m07o00m84K38J250J926K109K167K287K236J916
$$ y = [341658, 342922, 343996, 344293, 343964, 343347, 342374, 340803, 338830, 337193, 336649, 337363, 338792, 340188, 341330, 342690, 344745, 347219, 349248, 350266, 350526, 350693, 351108, 351576, 351694, 351302, 350621, 350064, 349942, 350322, 351063, 351862, 352305, 352176, 351787, 351696, 351977, 352069, 351619, 351088, 351061, 351220, 350620, 348921, 346713, 344566, 342413, 340172, 338312, 337288, 336760, 336014, 335001, 334381, 334555, 335162, 335632, 335766, 335567, 334931, 333868, 332806, 332230, 332124, 332115, 332178, 332769, 334100, 335642, 336639, 336992, 337277, 337975, 338979, 339934, 340810, 341945, 343671, 346013, 348696, 351366, 353799, 355989, 358090, 360364, 363168, 366777, 371057, 375419, 379366, 383008, 386786, 390768, 394511, 397642, 400134, 401936, 402671, 402009, 400082, 397276, 393798, 389628, 384730, 379149, 373165, 367548, 363397, 361299, 360659, 360143, 358775, 356505, 353912, 351636, 350036, 349109, 348612, 348301, 348021, 347614, 347014, 346530, 346768, 348018, 349944, 352053, 354220, 356507, 358743, 360659]
52471C60659J623J582J749K190L099M203M749M398L679L203K903K426J746Q56
52457C99065n86k640m430m884m103l358l599m474m962m635l942l458l098k289
52443C48607q75L72N66j58p03l87K64L29l33j093j425j298r20n27l79m96n31r3
52425C40920O75J185J063N71L08N26Q13N25l58j083r68k50L46O44J079J810K493
52408C50299L023L784M901N965O849Q056R744J1068J1103R902Q085N930L530J271
52394D43510o20k555m778o459o574n492m669m803n181m930m005k771j400p5Q87
52379C90085J447J898K301K367K058J894K336L248M148M611M346L324J999J012
52365D27074M55j06q10j209j100j003j417j928j701o68K86L45l59r97r21k22M60
$$ y = [360659, 362282, 363864, 365613, 367803, 370902, 375105, 379854, 384252, 387931, 391134, 394037, 396463, 398209, 399065, 398479, 395839, 391409, 386525, 382422, 379064, 375465, 370991, 366029, 361394, 357452, 353994, 350896, 348607, 347732, 348104, 348670, 348512, 347809, 347422, 347686, 348015, 347682, 346589, 345164, 343866, 342946, 342419, 342040, 341544, 341013, 340920, 341595, 342780, 343843, 344414, 344722, 345248, 346061, 346586, 346228, 345145, 344177, 343927, 344273, 344917, 345996, 347806, 350299, 353322, 357106, 362007, 367972, 374821, 382877, 392621, 403689, 414792, 424694, 432779, 438709, 442239, 443510, 442890, 440335, 435557, 429098, 422524, 417032, 412363, 407560, 402379, 397449, 393444, 390673, 389273, 389198, 390085, 391532, 393430, 395731, 398098, 400156, 402050, 404386, 407634, 411782, 416393, 420739, 424063, 426062, 427074, 427529, 427423, 426613, 425404, 424304, 423301, 421884, 419956, 418255, 417587, 417873, 418218, 417859, 416862, 415941, 415719, 416179]
52348D16179N99K29k04l28r6L41Q71J455K080K682L109L263L313L624M261M785
52332D46163M701M111L685M074N391P155Q547Q963Q572Q149Q174Q316Q018P339
52318E41358O817O783P191P910Q749R338R542R820J0686J1878J2703J3115J3846
52305F69736J5363J7256J8855J9995K0946K1899K2702K2865K1895K0035J8453
52294H90000J8146J8593J8247J6444J4181J2651J1837J1028J0110R572R422Q945
52282A049176P609N779M363L864L900L602K523J072Rm40o44r07j099j022p30l98
52266A076657j67k56p97j427j469o79N29J774L167M788O178O854P074P627Q916
52251A118769J0581J1939J2526J2285J1528J0676R982R472R139Q936Q658Q141
$$ y = [416179, 416778, 417007, 416803, 416475, 416379, 416720, 417591, 419046, 421126, 423808, 426917, 430180, 433493, 437117, 441378, 446163, 450864, 454975, 458660, 462734, 468125, 475280, 483827, 492790, 501362, 509511, 517685, 526001, 534019, 541358, 548175, 554958, 562149, 570059, 578808, 588146, 597688, 607508, 618194, 630072, 642775, 655890, 669736, 685099, 702355, 721210, 741205, 762151, 784050, 806752, 829617, 851512, 871547, 890000, 908146, 926739, 944986, 961430, 975611, 988262, 1000099, 1011127, 1021237, 1030809, 1040231, 1049176, 1056785, 1062564, 1066927, 1070791, 1074691, 1078293, 1080816, 1081888, 1081897, 1081457, 1080813, 1079906, 1078807, 1077785, 1077055, 1076657, 1076490, 1076234, 1075437, 1074010, 1072541, 1071862, 1072391, 1074165, 1077332, 1082120, 1088298, 1095152, 1102226, 1109853, 1118769, 1129350, 1141289, 1153815, 1166100, 1177628, 1188304, 1198286, 1207758, 1216897, 1225833, 1234491, 1242632]
52239A242632P661P667P966P711O541N161M333L681K232q2k279l624m374n014
52225A280212n517n684n806o420p531q587r145r276r289r344r488r760j0059j0062
52211A164244r506q553p664p113o751o254n330l772j728K8O18K18K39J802M296
52196A114774O083O445O148O058O038N518M493L476K732K062J174m1j452k722
52182A160786l598m209m866n537n916o017o278o764o865o098m807l639k784k193
52168A091215k109k650l080k360m52J480K409K388K052J683J147L76m98j363k152
52153A088086k643k492j580k19J068J944K439K765L061L332L510L376K613J293
52139A106553K06K34J198J838J332M18M72J751L297M434N539P080Q652R583J0034
$$ y = [1242632, 1250293, 1257960, 1265926, 1273637, 1280178, 1285339, 1289672, 1293353, 1295585, 1295503, 1293224, 1289600, 1285226, 1280212, 1274695, 1269011, 1263205, 1256785, 1249254, 1240667, 1231522, 1222246, 1212957, 1203613, 1194125, 1184365, 1174306, 1164244, 1154738, 1146185, 1138521, 1131408, 1124657, 1118403, 1113073, 1109301, 1107573, 1107601, 1108219, 1108437, 1108676, 1110478, 1114774, 1120857, 1127302, 1133450, 1139508, 1145546, 1151064, 1155557, 1159033, 1161765, 1163827, 1165001, 1164960, 1163508, 1160786, 1157188, 1152979, 1148113, 1142576, 1136660, 1130643, 1124365, 1117601, 1110736, 1104638, 1099831, 1096192, 1093408, 1091215, 1089106, 1086456, 1083376, 1081016, 1080564, 1082044, 1084453, 1086841, 1088893, 1090576, 1091723, 1092099, 1091601, 1090238, 1088086, 1085443, 1082951, 1081371, 1081152, 1082220, 1084164, 1086603, 1089368, 1092429, 1095761, 1099271, 1102647, 1105260, 1106553, 1106759, 1106993, 1108191, 1110029, 1111361, 1111779, 1112251, 1114002, 1117299, 1121733, 1127272, 1134352, 1143004, 1152587, 1162621]
52124A162621J0814J2220J3659J4435J4428J3885J3008J2007J1179J0638J0174
52113A299068R615R105Q843Q849R293J0637J2945J5286J6594J7064J7913J9642
52101A454854K1260K1669K1002K0099J9214J8019J6439J4692J2721J0357P942
52090A638268O106M944M013L070K198J261k9j469k534l227m105n332o473p352
52076A629339q353r592j0603j1186j1776j2510j2777j2205j1349j0695r712p806
52064A500775n570m059l089j414J436M477O575P659Q326Q868R151R042Q593P965
52050A558735P296O601N813N026M546M447M323L865L491L893M963N691N328M250
52036A628268L441L307L250K372M77j669l204m209n535p525r358j0094r991j0148
$$ y = [1162621, 1173435, 1185655, 1199314, 1213749, 1228177, 1242062, 1255070, 1267077, 1278256, 1288894, 1299068, 1308683, 1317788, 1326631, 1335480, 1344773, 1355410, 1368355, 1383641, 1400235, 1417299, 1435212, 1454854, 1476114, 1497783, 1518785, 1538884, 1558098, 1576117, 1592556, 1607248, 1619969, 1630326, 1638268, 1644374, 1649318, 1653331, 1656401, 1658599, 1659860, 1659831, 1658362, 1655828, 1652601, 1648496, 1643164, 1636691, 1629339, 1620986, 1611394, 1600791, 1589605, 1577829, 1565319, 1552542, 1540337, 1528988, 1518293, 1508581, 1500775, 1495205, 1491146, 1488057, 1486643, 1488079, 1492556, 1499131, 1506790, 1515116, 1523984, 1533135, 1542177, 1550770, 1558735, 1566031, 1572632, 1578445, 1583471, 1588017, 1592464, 1596787, 1600652, 1604143, 1608036, 1612999, 1618690, 1624018, 1628268, 1631709, 1635016, 1638266, 1640638, 1641115, 1639446, 1636242, 1632033, 1626498, 1618973, 1609615, 1599521, 1589530, 1579382]
52022A579382j1064j2186j2848j2999j2845j2414j1763j1210j0926j0661j0143
52011A450323r576r486j0206j1633j3318j4649j5220j5250j5408j6018j6638j6660
51999A286261j6078j5394j4939j4667j4586j4907j5692j6678j7596j8446j9281
51988A107997k0003k0570k1185k1922k2427k2358k2038k2129k2598k2629k1727
51977H68411k0374j9157j7732j5288j1774q023m823k394p22K91J004J793K481
51964G73693K521J820Q01m06k087m077n549o085o326p002p858q171p831p211o227
51949G10005m375j664J147L434N378P542J0014J2113J3032J2746J2220J2447J3266
51936H07305J3521J2426J0341Q047N860L749J751j94k278m239n212m793l782l214
$$ y = [1579382, 1568318, 1556132, 1543284, 1530285, 1517440, 1505026, 1493263, 1482053, 1471127, 1460466, 1450323, 1440747, 1431261, 1421055, 1409422, 1396104, 1381455, 1366235, 1350985, 1335577, 1319559, 1302921, 1286261, 1270183, 1254789, 1239850, 1225183, 1210597, 1195690, 1179998, 1163320, 1145724, 1127278, 1107997, 1087994, 1067424, 1046239, 1024317, 1001890, 979532, 957494, 935365, 912767, 890138, 868411, 848037, 828880, 811148, 795860, 784086, 776063, 771240, 768846, 768124, 768415, 769419, 771212, 773693, 776214, 778034, 778835, 778429, 776342, 772265, 766716, 760631, 754305, 747303, 739445, 731274, 723443, 716232, 710005, 705630, 703966, 705113, 708547, 713925, 721467, 731481, 743594, 756626, 769372, 781592, 794039, 807305, 820826, 833252, 843593, 851640, 857500, 861249, 863000, 862806, 860528, 856289, 851077, 846284, 842502, 839288]
51922H39288l020k359j057J42N57R0j163l057n084o537p186p374p447p469p493
51907G80831p573p530p113o403n768n512n928p316r493j1550j2745j3393j4171
51894F66336j4857j4609j3414j2199j1494j0872r873q603p103m997k192P89L564
51881E60476O288Q918J0775J1485J1688J2213J2910J2894J1705R652P192M559
51869F80755J939l96k196l396m126m530m520l832k562j427j027j013n87K14M57
51854F53753l52j625k639l398m191n003n841p035q663j0107j0700j0485r854q886
51840E64974p501n927m448k999j471j42P11J267J727J740R08l42j040q76m86m82
51824E45613o98n83J9O87Q71M57m8OO64J224J011J50o88j120j374j851k631l364
$$ y = [839288, 836268, 833909, 832852, 832994, 833551, 833641, 832478, 829421, 824337, 817800, 810614, 803240, 795793, 788324, 780831, 773258, 765728, 758615, 752212, 746444, 740932, 735004, 727688, 718195, 706645, 693900, 680507, 666336, 651479, 636870, 623456, 611257, 599763, 588891, 579018, 570415, 563312, 558315, 556123, 556912, 560476, 566764, 575682, 586457, 597942, 609630, 621843, 634753, 647647, 659352, 669004, 676196, 680755, 682694, 682298, 680102, 676706, 672580, 668050, 663530, 659698, 657136, 655709, 654682, 653669, 653082, 653296, 653753, 653401, 651776, 649137, 645739, 641548, 636545, 630704, 623669, 615006, 604899, 594199, 583714, 573860, 564974, 557473, 551546, 547098, 544099, 542628, 542486, 543197, 544464, 546191, 547931, 548839, 548497, 547457, 546581, 546095, 545613, 544915, 544332, 544351, 545038, 545909, 546366, 546318, 546324, 546988, 548212, 549223, 549373, 548685, 547565, 546191, 544340, 541709, 538345]
51806E38345l541k976k072j406j020m77L09Q13P72P71J391K233K398J845J470
51791E38855J857K482K389J222n40k061k704k401j720j319j296j120l19J009K390
51776E36724L554M609N748O942Q068R176J0446J1669J2036J0785Q072M955K403
51763F35187N52j004k591m234n789o993p642p830p896q027q172q279q322p954
51749E51006o737m896l335k601k245j609p10J12R79K183L404L934L651L150K925
51734E49211K910K879K782K596K241J759J241O30q2m54O2J358K599L080K798K093
51718E77703J162J26p02j004q20n31n03p90j129j269j285j533k094k444j959p49
51702E62179L35N34j28j012j455j171l20O05J123J170J110J185J073J91j452k965
$$ y = [538345, 534804, 531828, 529756, 528350, 527330, 526853, 527162, 527975, 528747, 529518, 530909, 533142, 535540, 537385, 538855, 540712, 543194, 545583, 546805, 546265, 544204, 541500, 539099, 537379, 536060, 534764, 533644, 533325, 534334, 536724, 540278, 544887, 550635, 557577, 565645, 574821, 585267, 596936, 608972, 619757, 627829, 632784, 635187, 635739, 634735, 632144, 627910, 622121, 615128, 607486, 599656, 591760, 583733, 575561, 567282, 558960, 551006, 544269, 539373, 536038, 533437, 531192, 529583, 528873, 528985, 529964, 532147, 535551, 539485, 543136, 546286, 549211, 552121, 555000, 557782, 560378, 562619, 564378, 565619, 566249, 566167, 565713, 565775, 567133, 569732, 572812, 575610, 577703, 578865, 578991, 578289, 577285, 576465, 575934, 575431, 574641, 573512, 572243, 570958, 569425, 567331, 564887, 562928, 562179, 562514, 563048, 562920, 561908, 560453, 559282, 558962, 559567, 560690, 561860, 562970, 564155, 565228, 565419, 563967, 561002]
51686E61002l377k718k005k107k859l509l729l768l836l810l566l181k719k139
51672E17679j491r45n52k59j6M98K009M810P892R698R893R603R671R636Q770P284
51656E94180N845M687L764L129K520J296m74j648j516r45j089j749k164k638l964
51641E99234n712o661o741o925p330p076o215o018o828p236o192m467l137j936
51627E16760l37R78J130P11R70J779J842P45n23j113j226j282j185r06r53j740
51611E15650k891l608l510k906k407k396k703k670j785k96R37J253Q38N45J221
51596D95272L053N513P813R511J0531J0780J0030Q313O097L880J862K02p38q40
51582E71279o25p34r96m91J304L849O174P973R771J2043J4494J6469J7855J9208
$$ y = [561002, 557625, 554907, 552902, 550795, 547936, 544427, 540698, 536930, 533094, 529284, 525718, 522537, 519818, 517679, 516188, 515243, 514691, 514432, 514416, 514914, 516923, 521733, 529625, 539323, 549216, 558819, 568490, 578126, 586896, 594180, 600025, 604712, 608476, 611605, 614125, 615421, 614947, 613299, 611783, 610838, 609749, 608000, 605836, 603198, 599234, 593522, 586861, 580120, 573195, 565865, 558789, 552574, 546556, 539728, 532492, 526300, 521833, 518696, 516760, 516423, 517401, 518531, 519242, 520212, 521991, 523833, 524578, 524055, 522942, 521716, 520434, 519249, 518343, 517390, 515650, 512759, 509151, 505641, 502735, 500328, 497932, 495229, 492559, 490774, 490478, 491415, 492668, 493506, 494051, 495272, 498325, 503838, 511651, 521162, 531693, 542473, 552503, 560816, 566913, 570793, 572655, 572857, 572119, 571279, 570654, 569920, 568924, 568433, 569737, 573586, 579760, 587733, 597504, 609547, 624041, 640510, 658365, 677573]
51568F77573K0915K2671K4127K5610K7707L0356L3032L5690L8682M1684M3564
51557A021611M3737M2849M1494L8992L4208K7152J8893J0141Q35q873j8165k6307
51545A226567l3197l8874m3078m5687m7108m7709m7140m4824m0989l6787l3140
51534G68034k9885k6273k2104j7975j4475j1595r083o985n386l917k132l02P10
51521F18632N06l90j300k111k954l693m171m558m969n064m518l775l685m505n615
51506E67830o268o191n497m437l410k864l018l698m377m375l267j440K4L92M6
51491E19450j67j13l02q17j069q35p76j467k443k735k138j408j285j724k193k316
51475D97662k081j623j074o29n39q78j307j352r79p32j047j596j661j074l89r6
$$ y = [677573, 698488, 721159, 745286, 770896, 798603, 828959, 861991, 897681, 936363, 978047, 1021611, 1065348, 1108197, 1149691, 1188683, 1222891, 1250043, 1268936, 1279077, 1279912, 1271039, 1252874, 1226567, 1193370, 1154496, 1111418, 1065731, 1018623, 970914, 923774, 878950, 837961, 801174, 768034, 738149, 711876, 689772, 671797, 657322, 645727, 636644, 629659, 624273, 620356, 618224, 617922, 618632, 619138, 618748, 617448, 615337, 612383, 608690, 604519, 599961, 594992, 589928, 585410, 581635, 577950, 573445, 567830, 561562, 555371, 549874, 545437, 542027, 539163, 536145, 532447, 528070, 523695, 520428, 518988, 519012, 519404, 519450, 519283, 519170, 518868, 518051, 516982, 516147, 515371, 513904, 511461, 508726, 506588, 505180, 503895, 502171, 499978, 497662, 495581, 493958, 492884, 492255, 491716, 490838, 489531, 488179, 487200, 486468, 485421, 483825, 482164, 481090, 480701, 480605]
51459D80605j13k26n85j351k138k256j511l34P68J632K252K673L193M278N963
51444D92850P604Q555Q912R125R105Q305O783N500N163N285M940M083L441L188
51430E82839K571R95j102k804l696l933l768l442l366l862m732n371n302m477
51416E40550l193j916j082q11q38q33p53p30q08q90q61n98m9N93R83J085J297
51399E31146J928K790L574M288N001N445N434N547O727R183J2108J4626J6705
51386F24502J8978K2061K6137L0949L6018M1050M6216N1752N7304O1948O4910
51375A081825O5970O5126O2190N6952M9426L9800K8410J5911L245q871k0297l1103
51363A408584m1037m9519n6066o0497o2814o3131o1705n8896n4995n0245m5035
$$ y = [480605, 480492, 480266, 479681, 478330, 476192, 473936, 472425, 472091, 472859, 474491, 476743, 479416, 482609, 486887, 492850, 500454, 509009, 517921, 527046, 536151, 544456, 551239, 556739, 561902, 567187, 572127, 576210, 579651, 582839, 585410, 586405, 585303, 582499, 578803, 574870, 571102, 567660, 564294, 560432, 555700, 550329, 545027, 540550, 537357, 535441, 534359, 533548, 532710, 531877, 531124, 530394, 529586, 528696, 527835, 527237, 527188, 527781, 528764, 529849, 531146, 533074, 535864, 539438, 543726, 548727, 554172, 559606, 565153, 571880, 581063, 593171, 607797, 624502, 643480, 665541, 691678, 722627, 758645, 799695, 845911, 897663, 954967, 1016915, 1081825, 1147795, 1212921, 1275111, 1332063, 1381489, 1421289, 1449699, 1465610, 1468855, 1459984, 1439687, 1408584, 1367547, 1318028, 1261962, 1201465, 1138651, 1075520, 1013815, 954919, 899924, 849679, 804644]
51352H04644l9953l5392l1202k6882k2381j8499j6189j5392j4984j3975j2443
51341E57352j1014r867q703p393o128n023m094l585l710m091l973l135k097j310
51327D83229p21k18N8J78N72J353K017K278K648L585M574M738M126L559L355K996
51311E18327K121J145O21N77O49N09p5j158k415l389m039m647n125n053m609m734
51295D88705n815o885o778n604m358l424k418j321o30k66O42K414M087M642M326
51280D67317M183M710N679O744P510P372O145M630L783L416K618J321M47M01M74
51265E26750J07j58L94J547K555L063L004K248R89j00p36j567l035m275m144l031
51249E23611k482l167m267m915n172n353n368n140m905m656l979k816j756j250
$$ y = [804644, 764691, 729299, 698097, 671215, 648834, 630335, 614146, 598754, 583770, 569795, 557352, 546338, 536471, 527768, 520375, 514247, 509224, 505130, 501545, 497835, 493744, 489771, 486636, 484539, 483229, 482508, 482290, 482348, 482526, 483098, 484451, 486468, 488746, 491394, 494979, 499553, 504291, 508417, 511976, 515331, 518327, 520448, 521593, 522214, 522791, 523440, 523949, 523874, 522716, 520301, 516912, 512873, 508226, 503101, 498048, 493439, 488705, 482890, 476005, 469227, 463623, 459265, 455841, 453423, 452102, 451472, 451206, 451848, 454262, 458349, 462991, 467317, 471500, 476210, 481889, 488633, 496143, 503515, 509660, 514290, 518073, 521489, 524107, 525428, 525875, 526276, 526750, 526857, 526699, 527093, 528640, 531195, 534258, 537262, 539510, 540499, 540399, 539663, 538096, 535061, 530786, 526642, 523611, 521129, 517962, 513695, 508780, 503608, 498255, 492887, 487747, 482842, 478186, 474207, 471391, 469635, 468385]
51235D68385j074r35q72p28K6J320K089J578M96J18O60J382J894K437K988L102
51219D82866K756K518K678K823K633K443K634K935K779K098J353Q85O48N33O24
51204E13206R93J440J645J543J315J007L64o57j478j410n83O3j01p29j168j322
51188E14128j419j314o25M59J094P18k25p07j70R80J828J879J361P16K7p34j263
51171E16733j275j178j617k264j968m71R43J175Q97J441K799L829M077M087L971
51156E31179L114J505K21l4O3m96j676k711l184l217l003k713k597k699k711k499
51140E08542k414k740l164l194k792k179j343k51O80R19N33J84L78J093K006K837
51124D99095L492M084M741N267N277M805M432M510M595M106L185K424J949J377
$$ y = [468385, 467311, 466376, 465504, 464776, 464802, 466122, 468211, 469789, 470285, 470403, 471063, 472445, 474339, 476776, 479764, 482866, 485622, 488140, 490818, 493641, 496274, 498717, 501351, 504286, 507065, 509163, 510516, 511401, 512049, 512582, 513206, 514199, 515639, 517284, 518827, 520142, 521149, 521513, 520856, 519378, 517968, 517385, 517448, 517347, 516618, 515450, 514128, 512709, 511395, 510770, 511229, 512323, 513041, 512816, 512109, 511939, 512919, 514747, 516626, 517987, 518703, 518730, 517996, 516733, 515458, 514280, 512663, 510399, 508431, 507960, 508903, 510078, 510975, 512416, 515215, 519044, 523121, 527208, 531179, 534293, 535798, 536019, 535985, 536048, 535552, 533876, 531165, 527981, 524764, 521761, 519048, 516451, 513752, 511041, 508542, 506128, 503388, 500224, 497030, 494238, 492059, 490716, 490465, 491145, 492064, 492597, 492781, 493159, 494252, 496258, 499095, 502587, 506671, 511412, 516679, 521956, 526761, 531193, 535703, 540298, 544404, 547589, 550013, 551962, 553339]
51110E53339O02kj72o6J10L00L42l3p62j304j201n98m0P2k07m75l12L20R22Q67
51090E51702j3j272k316k830k846k501j862r10J98R76R43K87j36K16Q82J012N09
51073E42039Q0J75M87N93O77J331K828M760O315O945P002P584R411J1910J3832
51058F15969J4772J5539J6901J8495J9349J9096J8237J7465J7102J7058J6909
51047H06892J6062J4175J1528Q817O538M681K978J152j031l778p003j0025j1730
51034H39256j1385r526p792p532q560r516r405q406p230o250n529n151n006m578
51020G33390l478k107j175o76J05J473K790L445L793M672O240P891R180J0269
51006G75812J1327J2115J2410J2401J2216J1398R474O886M763L655K994J954L83
$$ y = [553339, 553941, 553939, 553767, 553701, 553811, 554111, 554453, 554420, 553658, 552354, 551153, 550555, 550515, 550587, 550380, 549905, 549593, 549913, 550835, 551702, 551689, 550417, 548101, 545271, 542425, 539924, 538062, 537152, 537350, 538326, 539269, 539556, 539420, 539636, 540518, 541530, 542039, 542119, 542294, 542781, 543374, 544051, 545382, 548210, 552970, 559285, 566230, 573232, 580816, 590227, 602137, 615969, 630741, 646280, 663181, 681676, 701025, 720121, 738358, 755823, 772925, 789983, 806892, 822954, 837129, 848657, 857474, 864012, 868693, 871671, 872823, 871792, 868014, 861011, 850986, 839256, 827871, 818345, 810553, 803021, 794461, 784945, 775540, 767134, 759904, 753654, 748125, 742974, 737968, 733390, 729912, 727805, 726630, 725954, 726059, 727532, 730322, 733767, 737560, 742232, 748472, 756363, 765543, 775812, 787139, 799254, 811664, 824065, 836281, 847679, 857153, 864039, 868802, 872457, 875451, 877405, 877788]
50993H77788j339k927m275n253n770n854n442m372k782j132N15K782O037R582
50979H57558J2441J4608J6776J9012K0713K1798K3076K5125K7660L0274L3034
50968A102075L5983L8802M1500M4764M9053N3775N7989O1372O3982O5573O5899
50957A680767O5343O4443O3020O0491N6908N2901M8621M3488L7161L0164K3351
50946B226658J7235J1988P681M257J534n99k206l554n050o866q882j1000j3264
50933B217932j5640j8007k0391k2957k5681k8351l0909l3547l6449l9628m3024
50922A903348m6391m9191n0906n1594n1810n1853n1472n0362m8566m6263m3527
50911A361413m0554l7755l5278l2648k9409k5965k3365k2103k1467k0332j8344
$$ y = [877788, 876449, 873522, 869247, 863994, 858224, 852370, 846928, 842556, 839774, 838642, 839157, 841939, 847976, 857558, 869999, 884607, 901383, 920395, 941108, 962906, 985982, 1011107, 1038767, 1069041, 1102075, 1138058, 1176860, 1218360, 1263124, 1312177, 1365952, 1423941, 1485313, 1549295, 1614868, 1680767, 1746110, 1810553, 1873573, 1934064, 1990972, 2043873, 2092494, 2135982, 2173143, 2203307, 2226658, 2243893, 2255881, 2263562, 2267819, 2269353, 2268754, 2266548, 2262994, 2257944, 2251078, 2242196, 2231196, 2217932, 2202292, 2184285, 2163894, 2140937, 2115256, 2086905, 2055996, 2022449, 1986000, 1946372, 1903348, 1856957, 1807766, 1756860, 1705266, 1653456, 1601603, 1550131, 1499769, 1451203, 1404940, 1361413, 1320859, 1283104, 1247826, 1215178, 1185769, 1159804, 1136439, 1114336, 1092869, 1072537, 1054193]
50900A054193j6089j4190j2690j1380j0269r348q234o622m952l950l490k558p12
50887I49709J115J775J392J110J644K716L738M427M809N139N816P008Q432R794
50873A008624J1185J2578J3399J3200J2589J2753J4101J6139J8440K0983K3530
50862A177521K5679K7712L0556L4556L9077M3613M8516N4200O0354O6538P3005
50851A681327Q0339Q8662R7621J06844J16020J24907J33492J41675J48647J53180
50841B872714J54880J54536J52736J48819J41720J31178J17592J01358Q3138O4224
50831D122895M5647K7410R384p358k1179l1624l9500m5287m8473m8663m6415m2697
50819C874140l8258l3899l0675k9374l0079l2545l6671m2422m9685n8344o8191
$$ y = [1054193, 1038104, 1023914, 1011224, 999844, 989575, 980227, 971993, 965371, 960419, 956469, 952979, 950421, 949709, 950824, 952599, 953991, 955101, 956745, 959461, 963199, 967626, 972435, 977574, 983390, 990398, 998830, 1008624, 1019809, 1032387, 1045786, 1058986, 1071575, 1084328, 1098429, 1114568, 1133008, 1153991, 1177521, 1203200, 1230912, 1261468, 1296024, 1335101, 1378714, 1427230, 1481430, 1541784, 1608322, 1681327, 1761666, 1850328, 1947949, 2054793, 2170813, 2295720, 2429212, 2570887, 2719534, 2872714, 3027594, 3182130, 3334866, 3483685, 3625405, 3756583, 3874175, 3975533, 4058671, 4122895, 4168542, 4195952, 4205336, 4197978, 4176799, 4145175, 4105675, 4060388, 4011915, 3963252, 3916837, 3874140, 3835882, 3801983, 3771308, 3741934, 3711855, 3679310, 3642639, 3600217, 3550532, 3492188, 3423997]
50808C423997p8603q8661r7750j05770j12627j17824j20737j21113j19134j15236
50798B346542j09849j03237r5544q7142p8735p0765o2924n4660m6148l8278l1706
50787A567554k6292k1520j7048j2810r066o406n221n046m837m112l347l152l535
50774A445162m242n269o614p852q546q898r552j0776j2166j3201j3758j4015j4121
50761A316152j4106j4049j4065j4097j3876j3171j2023j0548q642o168l390q17
50749A191200J454L890O744R712J2604J5853J9882K4365K8761L3213L8225M3670
50737A429573M8911N3817N8778O3742O8039P1395P4337P7321Q0096Q2226Q3621
50726B191856Q4192Q3531Q1380P7964P3530O7933O0992N2794M3427L2846K1312
$$ y = [3423997, 3345394, 3256733, 3158983, 3053213, 2940586, 2822762, 2702025, 2580912, 2461778, 2346542, 2236693, 2133456, 2037912, 1950770, 1872035, 1801270, 1738346, 1683686, 1637538, 1599260, 1567554, 1541262, 1519742, 1502694, 1489884, 1480818, 1474412, 1469191, 1464145, 1459308, 1455196, 1451849, 1448697, 1445162, 1440920, 1435651, 1429037, 1421185, 1412639, 1403741, 1394189, 1383413, 1371247, 1358046, 1344288, 1330273, 1316152, 1302046, 1287997, 1273932, 1259835, 1245959, 1232788, 1220765, 1210217, 1201575, 1195407, 1192017, 1191200, 1192654, 1196544, 1203288, 1213000, 1225604, 1241457, 1261339, 1285704, 1314465, 1347678, 1385903, 1429573, 1478484, 1532301, 1591079, 1654821, 1722860, 1794255, 1868592, 1945913, 2026009, 2108235, 2191856, 2276048, 2359579, 2440959, 2518923, 2592453, 2660386, 2721378, 2774172, 2817599, 2850445, 2871757]
50715B871757R490k229j3937k5328l5177m2219m6237m7843m7561m5637m2384l8092
50703B494603l2862k6970k1283j6815j4078j3137j4017j6619k0563k5591l1809
50692B260859l9008m6141n2122n6873o0926o4194o5885o5569o3561o0324n6176
50681A630080n1607m6993m1942l5669k8340k1253j5332j0139m806O87N764J0199
50669A390649J4086J7234J9303K0436K1125K1500K1321K0691K0098J9661J8875
50658A604979J7481J6043J5240J4943J4516J3877J3677J4330J5554J7004J8873
50647A776517K1386K4153K6623K8993L1974L5656L9265M2223M4798M7350M9539
50636B168477N0826N1351N1644N1718N1104M9800M8461M7515M6668M5532M4266
$$ y = [2871757, 2881247, 2879018, 2865081, 2839753, 2804576, 2762357, 2716120, 2668277, 2620716, 2575079, 2532695, 2494603, 2461741, 2434771, 2413488, 2396673, 2382595, 2369458, 2355441, 2338822, 2318259, 2292668, 2260859, 2221851, 2175710, 2123588, 2066715, 2005789, 1941595, 1875710, 1810141, 1746580, 1686256, 1630080, 1578473, 1531480, 1489538, 1453869, 1425529, 1404276, 1388944, 1378805, 1373999, 1374686, 1380450, 1390649, 1404735, 1421969, 1441272, 1461708, 1482833, 1504333, 1525654, 1546345, 1566443, 1586104, 1604979, 1622460, 1638503, 1653743, 1668686, 1683202, 1697079, 1710756, 1725086, 1740640, 1757644, 1776517, 1797903, 1822056, 1848679, 1877672, 1909646, 1945302, 1984567, 2026790, 2071588, 2118938, 2168477, 2219303, 2270654, 2322298, 2374016, 2425120, 2474920, 2523381, 2570896, 2617564, 2663096, 2707362]
50625B707362M3078M1438L8169L2415K4187J4172L386o903j5365k1291k5077k7728
50613B807843k9731l0537k9368k6326k2422j8601j5148j2143j0093r786j1632
50602B592056j5398k0501k6393l2761l9475m6310n2733n8084o2073o4837o6522
50591B106969o7013o6277o4582o2220n9281n5896n2493m9477m6924m4736m2797
50580A495273m0713l7837l3989k9847k6136k2744j9189j5571j2388r539o417k926
50568A237977L27L088N861R031J2200J4814J6901J8785K0520K2036K3441K4786
50556A409767K5815K6303K6454K6644K7002K7500K8076K8439K8117K7072K5929
50545A707118K5217K4725K4080K3662K4340K6403K9294L2385L5544L9003M3112
$$ y = [2707362, 2750440, 2791878, 2830047, 2862462, 2886649, 2900821, 2904207, 2897304, 2881939, 2860648, 2835571, 2807843, 2778112, 2747575, 2718207, 2691881, 2669459, 2650858, 2635710, 2623567, 2613474, 2603688, 2592056, 2576658, 2556157, 2529764, 2497003, 2457528, 2411218, 2358485, 2300401, 2238328, 2173491, 2106969, 2039956, 1973679, 1909097, 1846877, 1787596, 1731700, 1679207, 1629730, 1582806, 1538070, 1495273, 1454560, 1416723, 1382734, 1352887, 1326751, 1304007, 1284818, 1269247, 1256859, 1247320, 1240903, 1237977, 1238304, 1241392, 1247253, 1256284, 1268484, 1283298, 1300199, 1318984, 1339504, 1361540, 1384981, 1409767, 1435582, 1461885, 1488339, 1514983, 1541985, 1569485, 1597561, 1626000, 1654117, 1681189, 1707118, 1732335, 1757060, 1781140, 1804802, 1829142, 1855545, 1884839, 1917224, 1952768, 1991771, 2034883]
50534B034883M8173N4093O0112O5366O9889P4661Q0503Q7212R3966J00240J05978
50523B875076J11037J14907J17135J17817J17376J15746J12002J05141R5209Q3213
50513C964659O9911N5166L8776K1408M090j2843k9537m5569n9898p1849q1372
50502C852942q8109r1142r0065q5745p9391p1293o1026m8505l4308j9281m438
50491C179639Q961J9826K7666L2242L2951K9151K0926R045n725k2727m0837n8582
50479C232536p4893q9335j01479j10735j16965j20619j21918j20467j16067j09423
50469B150635j01562r3010q3984p5055o6987n9976n3616m7526m1670l6178l1218
50458A459853k6965k3391k0133j6815j3334r723n946k177J145L896O616R753J2933
$$ y = [2034883, 2083056, 2137149, 2197261, 2262627, 2332516, 2407177, 2487680, 2574892, 2668858, 2769098, 2875076, 2986113, 3101020, 3218155, 3335972, 3453348, 3569094, 3681096, 3786237, 3881446, 3964659, 4034570, 4089736, 4128512, 4149920, 4154010, 4141167, 4111630, 4066061, 4006163, 3934314, 3852942, 3764833, 3673691, 3583626, 3497881, 3418490, 3347197, 3286171, 3237666, 3203358, 3184077, 3179639, 3188600, 3208426, 3236092, 3268334, 3301285, 3330436, 3351362, 3360407, 3354682, 3331955, 3291118, 3232536, 3157643, 3068308, 2966829, 2856094, 2739129, 2618510, 2496592, 2376125, 2260058, 2150635, 2049073, 1956063, 1872079, 1797024, 1730037, 1670061, 1616445, 1568919, 1527249, 1491071, 1459853, 1432888, 1409497, 1389364, 1372549, 1359215, 1349492, 1343546, 1341369, 1342514, 1346410, 1353026, 1362779, 1375712]
50445A375712J5552J7749K0078K2460K4394K6024K7962K9839L0163K8047K4339
50434A642319K0448J6869J3464J0439Q128O185L901J256j075k717l909m777m888
50421A705643l805j749N98K855N297Q463J2509J7107K2082K7743L4232M0733M6016
50408A917724M9830N3045N6232N8779N9888N9709N8858N7305N4508N0282M4861
50397B521021L8334L0652K1983J2480K022r193k0159k9978l9012m8057n6529o2555
50385B361009o5089o4982o3610o1320n7699n2525m5843l7636k8187j8430r481
50374A856207j969L928Q161J0842J2133J1701Q755L089m282j2006j9588k7099
50362A849872l4098l9728m3814m7030m9738n1356n1251m9726m7591m5113m1936
$$ y = [1375712, 1391264, 1409013, 1429091, 1451551, 1475945, 1501969, 1529931, 1559770, 1589933, 1617980, 1642319, 1662767, 1679636, 1693100, 1703539, 1711667, 1717852, 1721753, 1723009, 1721934, 1719217, 1715308, 1710531, 1705643, 1701838, 1700089, 1700687, 1703542, 1708839, 1717302, 1729811, 1746918, 1769000, 1796743, 1830975, 1871708, 1917724, 1967554, 2020599, 2076831, 2135610, 2195498, 2255207, 2314065, 2371370, 2425878, 2476160, 2521021, 2559355, 2590007, 2611990, 2624470, 2626492, 2617299, 2597140, 2567162, 2528150, 2480093, 2423564, 2361009, 2295920, 2230938, 2167328, 2106008, 2048309, 1995784, 1949941, 1912305, 1884118, 1865688, 1856207, 1854238, 1858166, 1866327, 1877169, 1889302, 1901003, 1909758, 1912847, 1908565, 1896559, 1876971, 1849872, 1815774, 1776046, 1732232, 1685202, 1635464, 1584108, 1532857, 1483131, 1435540, 1390427, 1348491]
50351A348491l7964l3671k9405k4913j9905j4743j0139o371l316j184n64j552
50339A164764l423n458p558r649j1067j1278j0866j0930j1592j1828j0869q983
50327A051263o808m619k550q30O37K418M785P156Q748R486R847J0012R617Q374
50313A107536O640N255M783M898M721L967L485M178N653O713P155Q211J0821J4415
50299A198431J7880K1032K4408K8106L1584L4208L5298L3841K8973K0810J0472
50288A485043n60j0796j9016k4922k9371l3254l6293l7492l6608l4342l1176k6942
50276A164271k1717j6413j1927q327n220k542m81J019K271L415M350M998N408
50263A119105N681N947O347O969P753Q582R321R841J0040J0009J0054J0479J1301
$$ y = [1348491, 1310527, 1276856, 1247451, 1222538, 1202633, 1187890, 1177751, 1171380, 1168064, 1166880, 1166316, 1164764, 1161341, 1155883, 1148325, 1138676, 1127609, 1116331, 1105465, 1094535, 1082943, 1071115, 1060246, 1051263, 1044455, 1039836, 1037286, 1036456, 1037093, 1039511, 1044296, 1051452, 1060200, 1069686, 1079533, 1089545, 1099162, 1107536, 1114176, 1119431, 1124214, 1129112, 1133833, 1137800, 1141285, 1145463, 1151116, 1157829, 1164984, 1173195, 1184016, 1198431, 1216311, 1237343, 1261751, 1289857, 1321441, 1355649, 1390947, 1424788, 1453761, 1474571, 1485043, 1484483, 1473687, 1454671, 1429749, 1400378, 1367124, 1330831, 1293339, 1256731, 1222389, 1191213, 1164271, 1142554, 1126141, 1114214, 1105887, 1100667, 1098125, 1097644, 1098663, 1100934, 1104349, 1108699, 1113697, 1119105, 1124786, 1130733, 1137080, 1144049, 1151802, 1160384, 1169705, 1179546, 1189586, 1199595, 1209649, 1220128, 1231429]
50250A231429J2145J2435J1868J0767R838R490R483R325Q821Q117P453P095P260
50237A355526P740P691O253L475L83j986l538n003o897q681r168p917n990m792
50223A327096m416l828k835k873n189r003j2341j4272j5420j6645j8168j9917
50211A202189k1698k2967k3174k2496k1567k0520j9100j7687j7119j7313j7091
50200I81457j5851j4452j3775j3377j2398j1084j0387j0417j0372r773q971q341
50188H42259p784p086o229n197l937k614j597j104j129j550j956j613j76J572
50174H01859K313J709Q46Q93J782K560K724K715L116L802M133L777L064K553K438
50159H40284K506K480K188J622J108J263K325L583M026L617L310L645L973L588
$$ y = [1231429, 1243574, 1256009, 1267877, 1278644, 1288482, 1297972, 1307455, 1316780, 1325601, 1333718, 1341171, 1348266, 1355526, 1363266, 1370957, 1377210, 1380685, 1381068, 1379082, 1375544, 1370541, 1363644, 1354963, 1345795, 1337878, 1331888, 1327096, 1322680, 1318852, 1316017, 1313144, 1307955, 1298952, 1286611, 1272339, 1256919, 1240274, 1222106, 1202189, 1180491, 1157524, 1134350, 1111854, 1090287, 1069767, 1050667, 1032980, 1015861, 998548, 981457, 965606, 951154, 937379, 924002, 911604, 900520, 890133, 879716, 869344, 859571, 850600, 842259, 834475, 827389, 821160, 815963, 812026, 809412, 807815, 806711, 805582, 804032, 802076, 800463, 800287, 801859, 804172, 805881, 806727, 807620, 809402, 811962, 814686, 817401, 820517, 824319, 828452, 832229, 835293, 837846, 840284, 842790, 845270, 847458, 849080, 850188, 851451, 853776, 857359, 861385, 865002, 868312, 871957, 875930, 879518]
50145H79518K890K730L063L205L173L836N629Q029J0538J3403J6949K0800K4261
50132I98024K7109K9549L1697L3481L4857L5760L6085L5977L5889L5944L5454
50121A369826L3524L0076K5834K1383J6633J1318N531m14o348j2187j7685k2470
50109A455021k6333k9252l1217l2185l2226l1550l0313k8566k6431k4320k2785
50098A139843k2077k1897k1595k0726j9436j8317j7699j7177j6009j4097j2353
50087I38460j1687j1808j1476j0019q176p183p318p725p405o109m352k917k248
50074H40037k010j329K52K175L541M241N004O341P962R270J0001J0153R830R325
50060I14793R029R020R031Q952Q900Q633P434N092K532Q86K62l8l35l50p2o1o49
$$ y = [879518, 882408, 885138, 888201, 891406, 894579, 898415, 904044, 912073, 922611, 936014, 952963, 973763, 998024, 1025133, 1054682, 1086379, 1119860, 1154717, 1190477, 1226562, 1262539, 1298428, 1334372, 1369826, 1403350, 1433426, 1459260, 1480643, 1497276, 1508594, 1514125, 1513711, 1507363, 1495176, 1477491, 1455021, 1428688, 1399436, 1368219, 1336034, 1303808, 1272258, 1241945, 1213379, 1186948, 1162628, 1139843, 1117766, 1095869, 1074274, 1053548, 1034112, 1015795, 998096, 980919, 964910, 950813, 938460, 926773, 914965, 903489, 893470, 885294, 878111, 870793, 863068, 855663, 849554, 845202, 842285, 840037, 838027, 836698, 836950, 839125, 842666, 846907, 851911, 858252, 866214, 875484, 885485, 895638, 905468, 914793, 923822, 932842, 941873, 950825, 959725, 968358, 975792, 980884, 983416, 984302, 984564, 984526, 984191, 983841, 983769, 983708, 983059]
50043I83059j429j726j260j70J235K579L633M535N572O656P457Q103R177J0781
50029A038202J2119J2485J2227J2283J3017J4017J4885J5638J6371J6985J7358
50018A195587J7456J7269J6838J6401J6197J6176J6103J5949J5884J5852J5553
50007A375265J4877J4123J3682J3719J4145J4629J4607J3512J1176P762L382j874
49995A509005p423j2322j6270k0138k4954l0508l5387l8460l9868m0451m0640
49984A202584m0180l8751l6440l3560l0275k6586k2697j9102j6234j4049j2168
49973I12542j0380q854p742o767n462l768k207j367j276j345q40O24K887N396
49959H71441P524Q875R451R607R806J0342J1135J1769J1710J0631Q626O136L649
$$ y = [983059, 981630, 979904, 978644, 978474, 979709, 982288, 985921, 990456, 996028, 1002684, 1010141, 1018244, 1027421, 1038202, 1050321, 1062806, 1075033, 1087316, 1100333, 1114350, 1129235, 1144873, 1161244, 1178229, 1195587, 1213043, 1230312, 1247150, 1263551, 1279748, 1295924, 1312027, 1327976, 1343860, 1359712, 1375265, 1390142, 1404265, 1417947, 1431666, 1445811, 1460440, 1475047, 1488559, 1499735, 1507497, 1510879, 1509005, 1501582, 1489260, 1472990, 1452852, 1427898, 1397390, 1362003, 1323543, 1283675, 1243224, 1202584, 1162404, 1123653, 1087213, 1053653, 1023378, 996792, 974095, 954993, 938759, 924710, 912542, 902162, 893308, 885566, 878799, 873337, 869569, 867362, 865995, 864719, 863374, 862534, 863158, 866045, 871441, 878965, 887840, 897291, 906898, 916704, 927046, 938181, 949950, 961660, 972291, 980917, 987053, 990702]
49946I90702J458l59j840l158m569o211p923r443j0714j1814j2676j3188j3519
49933H96746j3973j4447j4460j3862j3034j2189j0998r359p931p229o640n216
49921G67408l176j650r74k98R47K263L207M258N866P491Q497R372J0979J3015
49907H27205J4315J4541J4481J4612J4440J3599J2654J2189J1752J0442Q166N709
49895I74105L653J774n16l426o588r370j1423j3010j4588j6048j6647j5982j4724
49882H57210j3941j3771j3364j2088j0261q492o899n391m281l951m005l501k137
49869G55128o16L57R72J854L180M686O281Q053R878J1546J3080J4487J5322J5101
$$ y = [990702, 992160, 991801, 989961, 986803, 982234, 976023, 968100, 958657, 947943, 936129, 923453, 910265, 896746, 882773, 868326, 853866, 840004, 826970, 814781, 803783, 794424, 786493, 779264, 772624, 767408, 764232, 762582, 761608, 761310, 762257, 764520, 767727, 771985, 777851, 785342, 793839, 803211, 814190, 827205, 841520, 856061, 870542, 885154, 899594, 913193, 925847, 938036, 949788, 960230, 968396, 974105, 977758, 979532, 979016, 975590, 969002, 959632, 948209, 935199, 920611, 904563, 887916, 871934, 857210, 843269, 829498, 816134, 804046, 793785, 785293, 778394, 773003, 768722, 764771, 760766, 757265, 755128, 754512, 754869, 755841, 757695, 760875, 765561, 771842, 779895, 789773, 801319, 814399, 828886, 844208, 859309]
$$ [...]
##END NTUPLES=NMR SPECTRUM
##END=
