##TITLE=AC1645_HPIAH13378_8569767_NZvJ1gqTjF
##JCAMPDX= 6.0         $$ Bruker NMR JCAMP-DX V2.0
##DATA TYPE= NMR SPECTRUM
##DATA CLASS= NTUPLES
##ORIGIN= BRUKER
##OWNER= Administrator
$$ 1.72 TOPSPIN		Version 2.1
$$ 2014-04-10 23:25:31.489 -0700  Administrator@X
$$ Compression mode = diff/dup
##.OBSERVE FREQUENCY= 400.02188249412
##.OBSERVE NUCLEUS= ^1H
##.ACQUISITION MODE= SIMULTANEOUS (DQD)
##.ACQUISITION SCHEME= undefined
##.AVERAGES= 64
##.DIGITISER RES= 22
##SPECTROMETER/DATA SYSTEM= spect
##.PULSE SEQUENCE= noesygpps1d.comp
##.SOLVENT NAME= COFFEE_meoh
##.SHIFT REFERENCE= INTERNAL, COFFEE_meoh, 1, 14.96146
##AUDIT TRAIL= $$ (NUMBER, WHEN, WHO, WHERE, PROCESS, VERSION, WHAT)
$$ ##TITLE= Audit trail, TOPSPIN		Version 2.1
$$ ##JCAMPDX= 5.01
$$ ##ORIGIN= Bruker BioSpin GmbH
$$ ##OWNER= Administrator
$$ $$ E:\/data/COFFEE/nmr/AC1645_HPIAH13378_8569767_NZvJ1gqTjF/12/pdata/1/auditp.txt
$$ ##AUDIT TRAIL=  $$ (NUMBER, WHEN, WHO, WHERE, PROCESS, VERSION, WHAT)
(   1,<2014-04-10 23:25:25.364 -0700>,<Administrator>,<X>,<go>,<TOPSPIN 2.1>,
      <created by zg
	started at 2014-04-10 23:13:55.595 -0700,
	POWCHK enabled, PULCHK disabled,
       configuration hash MD5:
       C8 4E 4E 5D D3 5C D8 9E 9F 52 82 E0 59 8A DE 15
       data hash MD5: 64K
       CA D0 79 08 1C F8 28 F0 01 41 14 8D A9 24 6F D8>)
(   2,<2014-04-10 23:25:28.864 -0700>,<Administrator>,<X>,<proc1d>,<TOPSPIN 2.1>,
      <Start of raw data processing
       efp LB = 0.3 FT_mod = 6 PKNL = 1 PHC0 = 0 PHC1 = 0 SI = 128K 
       data hash MD5: 128K
       AA 61 18 4A 57 7A 98 48 6C D0 6B 5D 96 3E D1 3A>)
(   3,<2014-04-10 23:25:30.098 -0700>,<Administrator>,<X>,<proc1d>,<TOPSPIN 2.1>,
      <pk PHC0 = -81.95251 PHC1 = 0 
       data hash MD5: 128K
       BE B6 39 60 FE CB A1 0D 54 2F C8 09 E9 59 27 FC>)
(   4,<2014-04-10 23:25:30.754 -0700>,<Administrator>,<X>,<proc1d>,<TOPSPIN 2.1>,
      <abs ABSG = 1 
       data hash MD5: 128K
       3B 68 21 12 ED 17 BC 75 5E 78 BC 15 79 01 5B 8F>)
(   5,<2014-04-10 23:25:30.895 -0700>,<Administrator>,<X>,<proc1d>,<TOPSPIN 2.1>,
      <abs ABSG = 2 
       data hash MD5: 128K
       30 A5 D2 E9 D0 4E 51 E8 63 32 6F B5 59 EE 87 50>)
(   6,<2014-04-10 23:25:30.989 -0700>,<Administrator>,<X>,<proc1d>,<TOPSPIN 2.1>,
      <abs ABSG = 3 
       data hash MD5: 128K
       11 AC 4F DB 1E 9D 7D 27 02 7D 6E 6E 83 25 35 86>)
(   7,<2014-04-10 23:25:31.129 -0700>,<Administrator>,<X>,<proc1d>,<TOPSPIN 2.1>,
      <abs ABSG = 4 
       data hash MD5: 128K
       26 E2 23 E9 70 55 88 AC 1F F4 02 03 BB 97 86 3E>)
(   8,<2014-04-10 23:25:31.239 -0700>,<Administrator>,<X>,<proc1d>,<TOPSPIN 2.1>,
      <abs ABSG = 5 
       data hash MD5: 128K
       5B 19 29 CB 5E 1F B3 42 C0 A4 DB DB E6 3F AA 8B>)
$$ ##END=
$$ 
$$ $$ hash MD5
$$ $$ 30 4E 87 E2 97 37 DF 80 B2 6D 9D 36 90 7B 5A 09
##$RELAX= 
##$RELAX= 
##$RELAX= 
##$RELAX= 
##$RELAX= 
##$RELAX= 
##$RELAX= 
##$RELAX= 
$$ Bruker specific parameters
$$ --------------------------
##$DU= <E:\>
##$EXPNO= 12
$$ [...]
##$TP07= 0
##$TPNAME0= <>
##$TPNAME1= <>
##$TPNAME2= <>
##$TPNAME3= <>
##$TPNAME4= <>
##$TPNAME5= <>
##$TPNAME6= <>
##$TPNAME7= <>
##$TPOAL= (0..7)
0.5 0.5 0.5 0.5 0.5 0.5 0.5 0.5
##$TPOFFS= (0..7)
0 0 0 0 0 0 0 0
##$TUNHIN= 0
##$TUNHOUT= 0
##$TUNXOUT= 0
##$USERA1= <user>
##$USERA2= <user>
##$USERA3= <user>
##$USERA4= <user>
##$USERA5= <user>
##$V9= 5
##$VALIST= <valist>
##$VCLIST= <CCCCCCCCCCCCCCC>
##$VD= 0
##$VDLIST= <DDDDDDDDDDDDDDD>
##$VPLIST= <PPPPPPPPPPPPPPP>
##$VTLIST= <TTTTTTTTTTTTTTT>
##$WBST= 1024
##$WBSW= 4
##$XGAIN= (0..3)
0 0 0 0
##$XL= 0
##$YL= 0
##$YMAX_a= 6246018
##$YMIN_a= -13868247
##$ZGOPTNS= <>
##$ZL1= 120
##$ZL2= 120
##$ZL3= 120
##$ZL4= 120
##$ABSF1= 14.96146
##$ABSF2= -5.596722
##$ABSG= 5
##$ABSL= 3
##$ALPHA= 0
##$AQORDER= 0
##$ASSFAC= 0
##$ASSFACI= 0
##$ASSFACX= 0
##$ASSWID= 0
##$AUNMP= <proc_prof1d_extract.lims>
##$AXLEFT= 0
##$AXNAME= <>
##$AXNUC= <1H>
##$AXRIGHT= 0
##$AXTYPE= 0
##$AXUNIT= <>
##$AZFE= 0.1
##$AZFW= 0.1
##$BCFW= 0
##$BC_mod= 0
##$BYTORDP= 0
##$COROFFS= 0
##$CY= 15
##$DATMOD= 1
##$DC= 0
##$DFILT= <>
##$DTYPP= 0
##$F1P= 0
##$F2P= 0
##$FCOR= 0.5
##$FTSIZE= 131072
##$FT_mod= 6
##$GAMMA= 0
##$GB= 0
##$INTBC= 1
##$INTSCL= 1
##$ISEN= 128
##$LB= 0.3
##$LEV0= 0
##$LPBIN= 0
##$MAXI= 10000
##$MC2= 0
##$MEAN= 0
##$ME_mod= 0
##$MI= 0
##$NCOEF= 0
##$NC_proc= -2
##$NLEV= 6
##$NOISF1= 0
##$NOISF2= 0
##$NSP= 0
##$NTH_PI= 0
##$NZP= 0
##$OFFSET= 14.96146
##$PC= 1
##$PHC0= -81.95251
##$PHC1= 0
##$PH_mod= 1
##$PKNL= yes
##$PPARMOD= 0
##$PPDIAG= 0
##$PPIPTYP= 0
##$PPMPNUM= 2147483647
##$PPRESOL= 1
##$PSCAL= 4
##$PSIGN= 0
##$PYNMP= <proc.py>
##$REVERSE= no
##$SF= 400.02000945243
##$SI= 131072
##$SIGF1= 0
##$SIGF2= 0
##$SINO= 400
##$SIOLD= 131072
##$SPECTYP= <>
##$SREGLST= <1H.CDCl3>
##$SSB= 0
##$STSI= 131072
##$STSR= 0
##$SW_p= 8223.68421052631
##$SYMM= 0
##$S_DEV= 0
##$TDeff= 65536
##$TDoff= 0
##$TI= <>
##$TILT= no
##$TM1= 0
##$TM2= 0
##$TOPLEV= 0
##$USERP1= <user>
##$USERP2= <user>
##$USERP3= <user>
##$USERP4= <user>
##$USERP5= <user>
##$WDW= 1
##$XDIM= 131072
##$YMAX_p= 383199365
##$YMIN_p= -233398
##$CURPLOT= <Network HP LaserJet P1505>
##$CURPRIN= <$Network HP LaserJet P1505>
##$DFORMAT= <normdp>
##$LAYOUT= <+/1D_H.xwp>
##$LFORMAT= <normlp>
##$PFORMAT= <normpl>
##$SURQMSG= 1
$$ End of Bruker specific parameters
$$ ---------------------------------
##NTUPLES= NMR SPECTRUM
##VAR_NAME=  FREQUENCY,     SPECTRUM/REAL,   SPECTRUM/IMAG
##SYMBOL=    X,             R,               I
##VAR_TYPE=  INDEPENDENT,   DEPENDENT,       DEPENDENT
##VAR_FORM=  AFFN,          ASDF,            ASDF
##VAR_DIM=   131072,        131072,          131072
##UNITS=     HZ,            ARBITRARY UNITS, ARBITRARY UNITS
##FACTOR=    0.0627417313425164, 1,          1
##FIRST=     8223.62146879497, -920,         -64525
##LAST=      0,             1955,            -65170
##MIN=       0,             -233398,         0
##MAX=       8223.62146879497, 383199365,    0
$$ Real data points
##PAGE= N=1
##DATA TABLE= (X++(R..R)), XYDATA
$$ [...]
61499D33344p0M14O70P22O92P50J063J623K142K224J789J356J615K527L122K566
61483D56549J293N63R44J797K292K339K209J914J424J032J074J443J776J829J476
61468D79954O47l90j085j202j082j044r33n83k88l95p94j150j323j229o69K48
61452D68682R15Q65L35j12j70J95Q32J191O38n40j088k91J074J814J855J865J973
61435D80033J730J104O21O19R80J498J915J826J172N50N55J031J521K012K640
61420D99807L046K841K359K191K193J815J086M34j84r91j538j173l41k77j258
61405E10010k174k102j455j120j272j448j272o81J95J043J493J416R14J32o69
61390E03010r99n63L20J060J456J607J530J334J476K155K806K820K512K577K918
$$ y = [433344, 433274, 433688, 434358, 435080, 435772, 436522, 437585, 439208, 441350, 443574, 445363, 446719, 448334, 450861, 453983, 456549, 457842, 458405, 459349, 461146, 463438, 465777, 467986, 469900, 471324, 472356, 473430, 474873, 476649, 478478, 479954, 480601, 480211, 479126, 477924, 476842, 475798, 474865, 474282, 473994, 473599, 472805, 471655, 470332, 469103, 468434, 468682, 469597, 470462, 470797, 470685, 470515, 470710, 471542, 472733, 473371, 472831, 471743, 471452, 472526, 474340, 476195, 478060, 480033, 481763, 482867, 483488, 484107, 485087, 486585, 488500, 490326, 491498, 492048, 492603, 493634, 495155, 497167, 499807, 502853, 505694, 508053, 510244, 512437, 514252, 515338, 515772, 515588, 514597, 513059, 511886, 511545, 511268, 510010, 507836, 505734, 504279, 503159, 501887, 500439, 499167, 498486, 498681, 499724, 501217, 502633, 503547, 503679, 503010, 502011, 501448, 501768, 502828, 504284, 505891, 507421, 508755, 510231, 512386, 515192, 518012, 520524, 523101, 526019]
61375E26019K904K614K737L339L750L815M149M908N304M768L755K965K535K388
61361E75950K690L456M230M682N046N634O279O667O821O972P285P875Q733R416
61347F61736R218P919O036M220K708J398J21j265k654l537l544l137l216l980
61333F72023m687m658m051l468l299l578m048m216l786l023k353j604k61J566
61319F30557L084L843M234M885O065P727R509J0718J1018J1205J2444J4643J6449
61306G46381J7130J7450J8165J8692J7965J5903J3154R911N988J744j996m887
61294H75600p199q986r822r597r045r071r767j0388j0285r596q885q361p742o883
61280G49973o011n189l946j914N59K794M477N537N771N337N176O027P188P251
$$ y = [526019, 528923, 531537, 534274, 537613, 541363, 545178, 549327, 554235, 559539, 564307, 568062, 571027, 573562, 575950, 578640, 582096, 586326, 591008, 596054, 601688, 607967, 614634, 621455, 628427, 635712, 643587, 652320, 661736, 670954, 678873, 684909, 689129, 691837, 693235, 693356, 692091, 689437, 685900, 682356, 679219, 676003, 672023, 667336, 662678, 658627, 655159, 651860, 648282, 644234, 640018, 636232, 633209, 630856, 629252, 628991, 630557, 633641, 637484, 641718, 646603, 652668, 660395, 669904, 680622, 691640, 702845, 715289, 729932, 746381, 763511, 780961, 799126, 817818, 835783, 851686, 864840, 874751, 880739, 882483, 880487, 875600, 868401, 859415, 849593, 839996, 830951, 821880, 812113, 801725, 791440, 781844, 772959, 764598, 756856, 749973, 743962, 738773, 734827, 732913, 733472, 736266, 740743, 746280, 752051, 757388, 762564, 768591, 775779, 783030]
61266G83030O098N091N058N289N044M973O083P972R169Q988Q029O834M968J920
61252H68546j616m210n364o106p479q968r187p946o596o072n635m286k490j422
61238G91169j095n13O53J676K011J806J292P17Q88K533M964O511O562O150O300
61223H31624O866P358P729P856P230N915M899M921N639O404P056P480P319O665
61209I24961O180N946N188L867L467N157P958R947J0747J1623J3423J5658J7569
61196A041691J9097K0569K2057K3347K4112K3955K2563J9821J5771J0750N595
61185A249328J315j670l657n012n989p158r206j1853j3895j4798j5469j6859j8577
61172A126500j9696k0196k0649k0989k0650j9675j8782j8389j8278j8138j7792
$$ y = [783030, 789128, 794219, 799277, 804566, 809610, 814583, 820666, 828638, 837807, 846795, 854824, 861658, 866626, 868546, 866930, 862720, 857356, 851250, 843771, 834803, 825616, 817670, 811074, 805002, 799367, 795081, 792591, 791169, 790074, 789561, 790214, 791890, 793901, 795707, 796999, 797716, 798604, 801137, 806101, 812612, 819174, 825324, 831624, 838490, 845848, 853577, 861433, 868663, 874578, 879477, 884398, 890037, 896441, 903497, 910977, 918296, 924961, 931141, 937087, 942275, 946142, 949609, 954766, 962724, 972671, 983418, 995041, 1008464, 1024122, 1041691, 1060788, 1081357, 1103414, 1126761, 1150873, 1174828, 1197391, 1217212, 1232983, 1243733, 1249328, 1250643, 1248973, 1245316, 1240304, 1234315, 1227157, 1217951, 1206098, 1192203, 1177405, 1161936, 1145077, 1126500, 1106804, 1086608, 1065959, 1044970, 1024320, 1004645, 985863, 967474, 949196, 931058, 913266]
61161I13266j6998j5584j3734j1716r556p276n214l584k073l05J622L410M976
61148H37234O142O391N529M106K601O61k146n280p631q669q542p430n557l553
61134H13856j932l79J805M727P925J0997J3582J5169J5806J6603J8606K1391K3700
61121I61856K5197K6577K8163K9457L0165L0618L1007L1095L0879L0631L0223
61110A285868K9141K7383K5496K3620K1306J8482J5672J2999R892O123K207j631
61098A476558o010j1236j6408k0472k3483k6031k7865k8174k7084k5928k5649
61087A238218k5601k4307k1301j7723j5103j3695j2380j0147p272m740k954j520
61075A081475k5J654L756O542R619J2028J3306J3945J4634J5550J6608J7868J9293
$$ y = [913266, 896268, 880684, 866950, 855234, 845678, 838402, 833188, 829604, 827531, 827226, 828848, 832258, 837234, 843376, 849767, 855296, 859402, 862003, 862664, 860518, 855238, 847607, 838938, 830396, 822966, 817409, 813856, 811924, 811545, 813350, 818077, 826002, 836999, 850581, 865750, 881556, 898159, 916765, 938156, 961856, 987053, 1013630, 1041793, 1071250, 1101415, 1132033, 1163040, 1194135, 1225014, 1255645, 1285868, 1315009, 1342392, 1367888, 1391508, 1412814, 1431296, 1446968, 1459967, 1469859, 1475982, 1478189, 1476558, 1470548, 1459312, 1442904, 1422432, 1398949, 1372918, 1345053, 1316879, 1289795, 1263867, 1238218, 1212617, 1188310, 1167009, 1149286, 1134183, 1120488, 1108108, 1097961, 1090689, 1085949, 1082995, 1081475, 1081450, 1083104, 1086860, 1093402, 1103021, 1115049, 1128355, 1142300, 1156934, 1172484, 1189092, 1206960, 1226253]
61062A226253K0554K1461K2255K3199K4257K5359K6579K7778K8609K9091K9703
61051A505098L0552L1114L1176L1362L2059L2472L1658K9957K8488K7444K6037
61040A837417K4026K2174K0986J9951J8411J6406J4239J1908R463P335N837M747
61028B012900L861L491L903M723N423O112P402R700J3072J7375K2125K6581L0495
61015B167163L4481L9211M4664N0748N8148O7834Q0058R4701J12197J33299J58180
61004C040684J86810K19979K58979L04487L56820M16931M85885N63638O49839
60995F484052P45338Q50980R65304J086183J214166J349852J486833J612197J715591
60986A7510496J788700J806291J715029J463173J056933N83163J63263j21484
$$ y = [1226253, 1246807, 1268268, 1290523, 1313722, 1337979, 1363338, 1389917, 1417695, 1446304, 1475395, 1505098, 1535650, 1566764, 1597940, 1629302, 1661361, 1693833, 1725491, 1755448, 1783936, 1811380, 1837417, 1861443, 1883617, 1904603, 1924554, 1942965, 1959371, 1973610, 1985518, 1994981, 2002316, 2008153, 2012900, 2016761, 2020252, 2024155, 2028878, 2034301, 2040413, 2047815, 2057515, 2070587, 2087962, 2110087, 2136668, 2167163, 2201644, 2240855, 2285519, 2336267, 2394415, 2462249, 2542307, 2637008, 2749205, 2882504, 3040684, 3227494, 3447473, 3706452, 4010939, 4367759, 4784690, 5270575, 5834213, 6484052, 7229390, 8080370, 9045674, 10131857, 11346023, 12695875, 14182708, 15794905, 17510496, 19299196, 21105487, 22820516, 24283689, 25340622, 25923785, 26087048, 25965564]
60978B5965564k61786k92409k55637k01032k01474l35592o33698j042155j449946
60969B1291835j755181j912028j929184j841818j689453j507147j320730j143811
60961H192483r80840q33652p04026n92034m96013m14962l48720k95755k53131
60952C273350k18938j92476j71906j54219j38174j24917j14730j05538r5727q6342
60942A870383p8959p3125o7574o2481n8762n6212n3911n1720m9847m7752m4828
60931A225212m1513l8433l5122l0896k6394k2946k0830j9320j8012j6865j5430
60920I39451j3288j1028r616q965q232p240o518o110n457m449l642l329l266l323
60906H44988l616l966l921l457l130l452m455n848p247q396r377j0346j0958j0635
$$ y = [25965564, 25703778, 25411369, 25155732, 24954700, 24753226, 24417634, 23783936, 22741781, 21291835, 19536654, 17624626, 15695442, 13853624, 12164171, 10657024, 9336294, 8192483, 7211643, 6377991, 5673965, 5081931, 4585918, 4170956, 3822236, 3526481, 3273350, 3054412, 2861936, 2690030, 2535811, 2397637, 2272720, 2157990, 2052452, 1956725, 1870383, 1791424, 1718299, 1650725, 1588244, 1529482, 1473270, 1419359, 1367639, 1317792, 1270040, 1225212, 1183699, 1145266, 1110144, 1079248, 1052854, 1029908, 1009078, 989758, 971746, 954881, 939451, 926163, 915135, 905519, 896554, 888322, 881082, 874564, 868454, 862997, 858548, 854906, 851577, 848311, 844988, 841372, 837406, 833485, 830028, 826898, 823446, 818991, 813143, 805896, 797500, 788123, 777777, 766819, 756184]
60892G56184r636r106r565j0146r912r152q553p883o524m767l564l244l346l392
60878F57394l138k487j860k169l633n115n449m876m315l854l021j967j199n23
60864F13788N14J522J837J885K657L973M573M055L422L517M005M257M340M681
60850F59026N360O033O100M984K807O27n47q34r95j218j133p99q08j578l168n499
60834F68358q008r483r226q062p311p074o588n880n762o293o567o080n248m450
60820E72326l643l021k968l232l120k675k661l247l760l901m196m904n453n292
60806E20253m561l682k894k377k145j790j077o25j127k028k065j079j25K60O64
60791D95602J401J796J403Q46Q16J056J004P59Q43J460K338K886K474J146j0O0
$$ y = [756184, 746548, 737442, 727877, 717731, 707819, 698667, 690114, 682231, 675707, 670940, 667376, 664132, 660786, 657394, 654256, 651769, 649909, 647740, 644107, 638992, 633543, 628667, 624352, 620498, 617477, 615510, 614311, 613788, 614302, 615824, 617661, 619546, 622203, 626176, 630749, 634804, 638226, 641743, 645748, 650005, 654345, 659026, 664386, 670419, 676519, 681503, 684310, 684937, 684390, 683556, 682561, 681343, 680210, 679411, 678603, 677025, 673857, 668358, 660350, 650867, 641641, 633579, 626268, 619194, 612606, 606726, 600964, 594671, 588104, 582024, 576776, 572326, 568683, 565662, 562694, 559462, 556342, 553667, 551006, 547759, 543999, 540098, 535902, 530998, 525545, 520253, 515692, 512010, 509116, 506739, 504594, 502804, 501727, 501102, 499975, 497947, 495882, 494803, 494678, 494938, 495602, 497003, 498799, 500202, 501048, 501864, 502920, 503924, 504683, 505526, 506986, 509324, 512210, 514684, 515830, 515820, 515880]
60775E15880R36J275P70M34P91J028M61l22m81j93j18k51j26K94O01N26J38l50
60757E21293o93p85q06r34r71o79l45l75n28l01L8k82j193j674j235o10p27j649
60739E07544k895m043m739m751m303l925l797l647l261k568j490l02J83l53q61
60724D66792j14J500K452K205J598J236Q95N64O88J112J108P58J030K098K896
60709D86818K732K145J769J559J599K314L312L297J837J29o34n84l76k15k92r75
60693E04435j841j707l86P07N26j47j09M69O31J98k16j13O69J940K856K460J079
60676E11451K52P51J692K153K384K733K648J783R32P71O73j66j346k100k600l261
60660E18750l580k927j827j355j671k070k030j422k68R42J382R78O31Q15R35O79
$$ y = [515880, 516816, 518091, 518861, 519295, 520086, 521114, 521575, 521253, 520772, 520579, 520461, 520210, 520084, 520378, 520979, 521505, 521643, 521293, 520600, 519815, 519009, 518075, 517104, 516425, 516080, 515705, 515177, 514876, 514914, 514632, 513439, 511765, 510530, 509920, 509193, 507544, 504649, 500606, 495867, 491116, 486813, 482888, 479091, 475444, 472183, 469615, 468125, 467823, 468006, 467653, 466792, 466678, 468178, 470630, 472835, 474433, 475669, 476564, 477128, 477816, 478928, 480036, 480794, 481824, 483922, 486818, 489550, 491695, 493464, 495023, 496622, 498936, 502248, 505545, 507382, 507511, 506877, 506293, 505917, 505702, 505410, 504435, 502594, 500887, 500501, 501208, 501734, 501587, 501478, 501947, 502578, 502776, 502560, 502447, 503116, 505056, 507912, 510372, 511451, 511703, 512454, 514146, 516299, 518683, 521416, 524064, 525847, 526779, 527550, 528223, 528057, 526711, 524611, 522011, 518750, 515170, 512243, 510416, 509061, 507390, 505320, 503290, 501868, 501600, 502542, 503924, 504902, 505533, 506348, 507283, 507962]
60644E07962P24J254J135k45j613j658j077j232j871j831j197r30j067r21o67
60629D96766r10j201n84O43J395J664K235K759K002R8j191q63J57O53N84M63L99
60612E05069L04K39J28k47p28r29q83r34j066j055j060j356j660j560j314j338
60596D91610j186j10J518K463K275J705J507J800K545L627M413M218L279K508
60582E22172K229K053J826J791J848J648J394J629K169K359K337K996M499N870
60568E56820O348O241O199O508P372Q984J0934J2262J2511J2166J1855J1678J1440
60555F81318J0919R726P530M625J748p43k941m698n552n436m795l887k584r19
60541F84311P84K406M085N654O741P525Q788J0926J3450J5655J7375J8911K0462
$$ y = [507962, 508686, 509940, 511075, 510830, 509217, 507559, 506482, 505250, 503379, 501548, 500351, 499421, 498354, 497433, 496766, 495856, 494655, 494071, 494714, 496109, 497773, 500008, 502767, 504769, 504867, 503676, 502813, 502970, 503623, 504207, 504670, 505069, 505373, 505612, 505740, 505493, 504765, 503836, 502953, 502019, 500953, 499898, 498838, 497482, 495822, 494262, 492948, 491610, 490424, 490314, 491832, 494295, 496570, 498275, 499782, 501582, 504127, 507754, 512167, 516385, 519664, 522172, 524401, 526454, 528280, 530071, 531919, 533567, 534961, 536590, 538759, 541118, 543455, 546451, 550950, 556820, 563168, 569409, 575608, 582116, 589488, 598472, 609406, 621668, 634179, 646345, 658200, 669878, 681318, 692237, 701963, 709493, 714118, 715866, 715123, 712182, 707484, 701932, 696496, 691701, 687814, 685230, 684311, 685095, 687501, 691586, 697240, 703981, 711506, 720294, 731220, 744670, 760325, 777700, 796611, 817073]
60528H17073K1810K2356K1586J9604J7014J4060J0357N829J308k400n523q643
60516I34431j1490j3283j3883j3816j3375j2548j1540j0488q920o392l412q68
60504H14416J203L401N868Q448J1530J5532J9712K2857K5158K8081L2231L6612
60492A025049M0298M3581M7014N0329N2868N4230N4086N2087M8371M3511L7716
60481A549140L0752K2802J4547O220k610j1967k1078k9384l7223m5028n2462n8754
60469A364955o3291o5612o5360o2711n8489n3607m8660m4019l9834l5880l1898
60458G95594k8036k4552k1293j8128j5584j4239j3623j2682j1206r893q981p927
60446F09450o518n235m313l421k547k212k519k859k848k646k183j182k31n70k260
$$ y = [817073, 838883, 861239, 882825, 902429, 919443, 933503, 943860, 949689, 950997, 948597, 943074, 934431, 922941, 909658, 895775, 881959, 868584, 856036, 844496, 834008, 825088, 818696, 815284, 814416, 815619, 819020, 824888, 833336, 844866, 860398, 880110, 902967, 928125, 956206, 988437, 1025049, 1065347, 1108928, 1155942, 1206271, 1259139, 1313369, 1367455, 1419542, 1467913, 1511424, 1549140, 1579892, 1602694, 1617241, 1623461, 1620851, 1608884, 1587806, 1558422, 1521199, 1476171, 1423709, 1364955, 1301664, 1236052, 1170692, 1107981, 1049492, 995885, 947225, 903206, 863372, 827492, 795594, 767558, 743006, 721713, 703585, 688001, 673762, 660139, 647457, 636251, 626358, 617377, 609450, 602932, 597697, 593384, 589963, 587416, 585204, 582685, 579826, 576978, 574332, 572149, 570967, 570736, 570166, 567906]
60431E67906l688l606k649k026j694q79L28J092J137R59R18R70J195J783K423
60416E64169K367J350P6m74k7Q08J271J255J228J468J697J626J466J538J746J853
60400E83417J927K052J938J467J235J750K470K514K099K195K863L143K764K713
60386F14547L643M720M751L773K819K601K938L271L302L198L289L517L434K937
60372F62740K664L053L442K858J474M37M13J075J900K569K732K306J952K321L036
60357F94972L296L343M048N194N580M991M667N452O803Q059R379J0734J1222J0197
60343G87937Q234O249M416K523O14j328l538n819p427q126q533r057r297q976
60329G47872q522q150p370o014m843m385m044l161k214j974k128j748p03K82Q05
$$ y = [567906, 564218, 560612, 557963, 555937, 554243, 553364, 553692, 554784, 555921, 556880, 557798, 558768, 559963, 561746, 564169, 566536, 567886, 567962, 567488, 567461, 568269, 569540, 570795, 572023, 573491, 575188, 576814, 578280, 579818, 581564, 583417, 585344, 587396, 589334, 590801, 592036, 593786, 596256, 598770, 600869, 603064, 605927, 609070, 611834, 614547, 618190, 622910, 627661, 631434, 634253, 636854, 639792, 643063, 646365, 649563, 652852, 656369, 659803, 662740, 665404, 668457, 671899, 674757, 676231, 676668, 677081, 678156, 680056, 682625, 685357, 687663, 689615, 691936, 694972, 698268, 701611, 705659, 710853, 716433, 721424, 726091, 731543, 738346, 746405, 755784, 766518, 777740, 787937, 796171, 802420, 806836, 809359, 809973, 808645, 805107, 799288, 791861, 783735, 775202, 766145, 756848, 747872, 739350, 731200, 723830, 717816, 712973, 708588, 704544, 701383, 699169, 697195, 695067, 693319, 692616, 692898, 693703]
60314F93703J234K125L607N313O685P571Q640J0663J3314J5341J6083J6137J6190
60301H16606J6059J5295J4014J2599J1160R751Q468O951M474R59k718n878q782
60288H98958j1832j4677j6593j7300j6986j6088j5262j4909j4521j3225j1209
60277G36356r652r039q607p818p187p032o650n605m767n029n785n752m674l254
60263F45505k016j148r27j278j338l94J029J856J872J760J910K065J966J718J467
60248F54047J208Q86M52k4k96k87m43j171j957j872j016m88o94p32J01J242J905
60231F50861K188K512K910L458M518N817O314N781N542O695Q481R439R480R633
60217G33629J0371J1251J1793J1817J1253J0448J0211J0851J1595J1653J1248
$$ y = [693703, 694937, 697062, 700669, 705982, 712667, 720238, 728878, 739541, 752855, 768196, 784279, 800416, 816606, 832665, 847960, 861974, 874573, 885733, 895484, 903952, 910903, 915377, 916336, 913618, 907740, 898958, 887126, 872449, 855856, 838556, 821570, 805482, 790220, 775311, 760790, 747565, 736356, 726704, 717665, 709058, 701240, 694053, 687021, 680371, 674766, 669999, 664970, 659185, 653433, 648759, 645505, 643489, 642341, 641414, 640136, 638798, 638404, 639433, 641289, 643161, 644921, 646831, 648896, 650862, 652580, 654047, 655255, 656141, 656593, 656569, 656273, 655986, 655543, 654372, 652415, 650543, 649527, 649039, 648345, 647613, 647714, 648956, 650861, 653049, 655561, 658471, 661929, 666447, 672264, 678578, 684359, 689901, 696596, 705077, 714516, 723996, 733629, 744000, 755251, 767044, 778861, 790114, 800562, 810773, 821624, 833219, 844872, 856120]
60206H56120J0984J0777J0242R419Q405O940N118L829L543L368K154j3k305m332
60192I24249n960o739o664o815q071r766j0689j0795j0745j0397r215p713o965
60179H13715o885o381n164m095l710l619l472l400l319k859k169j859j918j559
60165G63306m48P09J092P14J68o2O0J99o1o38q15J8J570K902L354K972K353K208
60147G79601K825L703M151M311M961O175P037P039O780O861P026O998P164P706
60133H62338Q035P861P850Q367Q607Q007P392P584P849P093N715M804M309L529
60119I59340K770K866L559L877L757L687L236J555p73k158k228k161k785l801
60105I70741m975o558q281r248r158q571p813o700n397m425l694k624j318n19
$$ y = [856120, 867104, 877881, 888123, 897542, 905947, 912887, 918005, 921834, 925377, 928745, 930899, 930886, 928581, 924249, 918289, 911550, 904886, 898071, 890000, 880234, 869545, 858750, 848005, 837608, 828393, 820680, 813715, 806830, 800449, 795285, 791190, 787480, 783861, 780389, 776989, 773670, 770811, 768642, 766783, 764865, 763306, 762858, 763567, 764659, 765373, 765541, 765479, 765539, 765738, 765677, 765039, 764224, 764242, 765812, 768714, 772068, 775040, 777393, 779601, 782426, 786129, 790280, 794591, 799552, 805727, 812764, 819803, 826583, 833444, 840470, 847468, 854632, 862338, 870373, 878234, 886084, 894451, 903058, 911065, 918457, 926041, 933890, 940983, 946698, 951502, 955811, 959340, 962110, 964976, 968535, 972412, 976169, 979856, 983092, 984647, 983874, 981716, 979488, 977327, 974542, 970741, 965766, 959208, 950927, 941679, 932521, 923950, 916137, 909437, 904040, 899615, 895921, 893297, 891979, 891460]
60091H91460l88l68l12n66r05o00L00Q74O83Q0p95k229l958n192n794o356o983
60074H58951p236p377q300r900j0820j0377r471q999q528p387o002n229m978m443
60060G49904l306k101j493j565j722j206J6J094J436J694K887M780O070O135N634
60045G68257N349N411N741O317O725O362N372M565M159L421J847r8j779l209m673
60030H13767o111p260q018q433q637q856r122r123q793q750r539j0653j1124j0878
60016F88470j0636j0561r995q583o888n609m866m361l726k690j383l01M00J230
60002F20501K370L030K612J901J992K612K771K611L093M142M633M263L924M126
59988F64581M405M465M512M320L310J753N65k97j752l693m803m721m686n383n689
$$ y = [891460, 891072, 890704, 890392, 889826, 888921, 888321, 888621, 889495, 890178, 890258, 889463, 887234, 883276, 878084, 872290, 865934, 858951, 851715, 844338, 836038, 826138, 815318, 804941, 795470, 786471, 777943, 770556, 764554, 759325, 754347, 749904, 746598, 744497, 743004, 741439, 739717, 738511, 738527, 739621, 741057, 742751, 745638, 750418, 756488, 762623, 768257, 773606, 779017, 784758, 791075, 797800, 804162, 809534, 814099, 818258, 821679, 823526, 823428, 821649, 818440, 813767, 807656, 800396, 792378, 783945, 775308, 766452, 757330, 748207, 739414, 730664, 721125, 710472, 699348, 688470, 677834, 667273, 657278, 648695, 641807, 636198, 631332, 626971, 623245, 620555, 619172, 618871, 619271, 620501, 622871, 625901, 628513, 630414, 632406, 635018, 637789, 640400, 643493, 647635, 652268, 656531, 660455, 664581, 668986, 673451, 677963, 682283, 685593, 687346, 687911, 687614, 685862, 682169, 677366, 672645, 667959, 662576, 656887]
59973F56887m594k989k337k634k818k481k023j627j024l3J229K526L438L589L184
59958F48293K903K992L042K811K606K616K584K323J955J438O14j89l21J84N45
59943F74396L23j70o76j325k047k502k750l139l374k707j175K85J190J947K772
59928F61048L310L652M541O068P129O854N677M517L676L019K512K058J409O38
59914G16108K16L50Q03J345J836J985J751J785K454K863K017O92N55J566J941
59899G38267R80O5L64J300K060K989M466N756O093N849N722N766N986O810Q106
59884H00579Q827Q502Q099Q475Q936Q348O847N447M593M036L555K960J845O3j923
59869H79189l582m736n241n072m847n411o581p278p185p082p309p142o242n354
$$ y = [656887, 652293, 649304, 646967, 644333, 641515, 639034, 637011, 635384, 634360, 634327, 635556, 638082, 641520, 645109, 648293, 651196, 654188, 657230, 660041, 662647, 665263, 667847, 670170, 672125, 673563, 674177, 673988, 673667, 673851, 674396, 674719, 674549, 673873, 672548, 670501, 667999, 665249, 662110, 658736, 656029, 654854, 655139, 656329, 658276, 661048, 664358, 668010, 672551, 678619, 685748, 692602, 698279, 702796, 706472, 709491, 712003, 714061, 715470, 716108, 716324, 716674, 717477, 718822, 720658, 722643, 724394, 726179, 728633, 731496, 733513, 734205, 734760, 736326, 738267, 739247, 739312, 739676, 740976, 743036, 746025, 750491, 756247, 762340, 768189, 773911, 779677, 785663, 792473, 800579, 809406, 817908, 826007, 834482, 843418, 851766, 858613, 864060, 868653, 872689, 876244, 879204, 881049, 881112, 879189, 875607, 870871, 865630, 860558, 855711, 850300, 843719, 836441, 829256, 822174, 814865, 807723, 801481, 796127]
59855G96127m910m263l078k205k256k451j890q49J11J277K993M664N604O118O799
59840H01791P630Q487R687J1186J2147J2113J1694J1317J0369Q487O630N762N483
59827I22783M969M335L902K980O63k844o635j0196j3116j4602j4430j3670j3427
59814H50712j3409j2757j1559j0482r540q306o964o127n997o322o663o248m436
59801G41902j994q46j705k966k923k037j859k661l444l578l176k430j653j440
59787G09190j776j642m06J074J660J458J167Q20K89J41P99J521J494J192J525
59772G18506K308K743K766K808K875K964L563M666N235M759M386N164O219O245
59758G75207N751O055O899P082O793P227Q291Q737Q401Q318Q584Q101O646N392
$$ y = [796127, 791217, 786954, 783876, 781671, 779415, 776964, 775074, 774225, 774336, 775613, 778606, 783270, 788874, 794992, 801791, 809421, 817908, 827595, 838781, 850928, 863041, 874735, 886052, 896421, 904908, 911538, 917300, 922783, 927752, 932087, 935989, 938969, 939632, 936788, 930153, 919957, 906841, 892239, 877809, 864139, 850712, 837303, 824546, 812987, 802505, 792965, 784659, 777695, 771568, 765571, 759249, 752586, 746338, 741902, 739908, 739062, 737357, 734391, 731468, 729431, 727572, 724911, 721467, 717889, 714713, 712283, 710630, 709190, 707414, 705772, 705366, 706440, 708100, 709558, 710725, 711545, 711834, 711975, 712774, 714295, 715789, 716981, 718506, 720814, 723557, 726323, 729131, 732006, 734970, 738533, 743199, 748434, 753193, 757579, 762743, 768962, 775207, 780958, 787013, 793912, 800994, 807787, 815014, 823305, 832042, 840443, 848761, 857345, 865446, 872092, 877484]
59744H77484M966M609L765K944K543K092J349R08J089J170M44o50j039k73J072
59729I02473J986J940J390J297J883K274J730O83J2j62k05r2L27O47L92k22o99
59712I15654j096j598j767j126r7M37K84l9JP50K272L891M515M093L883M600N310
59695I39967N093M635N035N990O550O705O828O298M267J251j502l680n592o814
59681I75031o725n919n641o123o757p469q517r414r420q764q112p359o138m948
59667H73725m356l782k490j073m77k56N39J519J763J781K722M199M880M797N068
59652H88559N639N465M525L657K647O51j713l006l543m991p383r017r459j0135
59638H61896j1394j1558r784p582o478o108n622n172n000m692m316m752o008o777
$$ y = [877484, 882450, 887059, 890824, 893768, 896311, 898403, 899752, 900660, 901749, 902919, 903363, 902713, 901674, 901401, 902473, 904459, 906399, 907789, 909086, 910969, 913243, 914973, 915656, 915668, 915506, 915301, 915209, 915536, 916183, 916575, 916353, 915654, 914558, 912960, 911193, 910067, 909970, 910407, 910691, 910652, 910653, 911403, 913675, 917566, 922081, 926174, 930057, 934657, 939967, 945060, 949695, 954730, 960720, 967270, 973975, 980803, 987101, 991368, 992619, 991117, 987437, 981845, 975031, 968306, 962387, 956746, 950623, 943866, 936397, 927880, 918466, 909046, 900282, 892170, 884811, 878673, 873725, 869369, 865587, 863097, 862024, 861547, 861291, 861830, 863349, 865112, 866893, 869615, 873814, 878694, 883491, 888559, 894198, 899663, 904188, 907845, 910492, 911143, 909430, 906424, 902881, 897890, 890507, 881490, 872031, 861896, 850502, 838944, 829160, 821578, 815100, 808992, 803370, 798198, 793198, 788506, 784190, 779438, 773430, 766653]
59624G66653o455o075o388o555n793m803m445m266l537k667k395k495k245j553
59610G06981p89j03M76R11J493K525L469L348K298J633J945K251J517O4j111j546
59594G25362j399j041q75q88m39P21J533Q44p01j398r29m84n62m68j73o15j782
59577G16706k348j890j617k148k393j619q04q63j060n06J94J01m27n66n18q99
59561F99343j503j776j812j896j740j098m24q5L60J297K142K128J490J065J232
59546F98723J769K375K897L482M610O478Q328R298R814J0999J2790J4021J4530
59533H00114J5394J6627J6360J3292Q501L872R5k738m014l513k463k269k765k910
59519H53583k621k772l861n631p622r324j0098r795r158r032r389r538q961p647
$$ y = [766653, 760198, 754123, 747735, 741180, 735387, 730584, 726139, 721873, 718336, 715669, 713274, 710779, 708534, 706981, 706192, 706089, 706565, 707476, 708969, 711494, 714963, 718311, 720609, 722242, 724187, 726438, 727955, 728019, 726908, 725362, 723963, 722922, 722047, 721159, 720720, 721441, 722974, 723818, 723117, 721719, 720790, 720306, 719744, 719276, 719103, 718488, 716706, 714358, 712468, 710851, 708703, 706310, 704691, 703887, 703024, 701964, 701458, 701652, 701753, 701326, 700760, 700242, 699343, 697840, 696064, 694252, 692356, 690616, 689518, 689094, 689009, 689369, 690666, 692808, 694936, 696426, 697491, 698723, 700492, 702867, 705764, 709246, 713856, 720334, 728662, 737960, 747774, 758773, 771563, 785584, 800114, 815508, 832135, 848495, 861787, 870288, 874160, 874255, 871517, 867503, 863990, 861527, 859258, 856493, 853583, 850962, 848190, 844329, 838698, 831076, 821752, 811654, 801859, 792701, 783669, 774280, 764742, 755781, 748134]
59505G48134o010m728m213m079l595k677j843j268p01k00L0M40J628L038L429
59490G27385K801K444K955L543L636L735M138M291M063M296N371O450O881P188
59476G89177P901Q544Q597Q440Q543Q558P984O890N534M003K641J968J843J612
59462H72235J233J197J380J284J439K934N318O783O853P019Q100Q887Q260O849
59448I39771N477L730J306p71j606j830k417l314m313n828p703q637p941o614
59434H99310n581m329k454r74o27l00J153K819L186K822L725O594J0218J3173
59420I28735J4893J5659J6413J8030J9920K0368J9028J7741J7835J8068J6777
59409A123467J4663J3525J3087J1130O459Q0o230j1083j3437j2836r946o007j942
$$ y = [748134, 742124, 737396, 733183, 729104, 725509, 722832, 720989, 719721, 719020, 718820, 718850, 719290, 720918, 723956, 727385, 730186, 732630, 735585, 739128, 742764, 746499, 750637, 754928, 758991, 763287, 768658, 775108, 781989, 789177, 797078, 805622, 814219, 822659, 831202, 839760, 847744, 854634, 860168, 864171, 866812, 868780, 870623, 872235, 873468, 874665, 876045, 877329, 878768, 881702, 887020, 893803, 900656, 907675, 915775, 924662, 932922, 939771, 945248, 948978, 950284, 949513, 947907, 946077, 943660, 940346, 936033, 930205, 922502, 913865, 905924, 899310, 893729, 889400, 886946, 885972, 885345, 885045, 886198, 889017, 892203, 895025, 898750, 905344, 915562, 928735, 943628, 959287, 975700, 993730, 1013650, 1034018, 1053046, 1070787, 1088622, 1106690, 1123467, 1138130, 1151655, 1164742, 1175872, 1182331, 1182411, 1176181, 1165098, 1151661, 1138825, 1128879, 1122872, 1120930]
59396A120930J565L699L995K609m74n659j2392j8508k1967k2637k1645j9806j7483
59383I92227j5110j2809j0231p548n751n240n035m173k925j860q26K95R11P93
59369I22718P53J373K178K866M044N817P075P303P693R208J0959J1846J2409J3613
59355A019855J5079J6074J7001J8334J9264J9039J8556J8922J9497J9063J7923
59344A218607J7060J6108J3990J0872P736M684J159k688o360j0029j3840j6986
59332A240313j8860k0273k2169k4019k4855k4865k4629k3818k2167k0586j9734
59321I94338j8699j6731j5004j4724j4856j3787j2065j1211j0873r655p946p320
59309H41467p657p302n963n024n088n265m911m185k961r65J100K253K743L468
$$ y = [1120930, 1122495, 1126194, 1130189, 1132798, 1132324, 1126665, 1114273, 1095765, 1073798, 1051161, 1029516, 1009710, 992227, 977117, 964308, 954077, 946529, 940778, 935538, 930503, 926330, 923405, 921545, 920719, 921014, 921925, 922718, 923471, 924844, 927022, 929888, 933932, 939749, 946824, 954127, 961820, 971028, 981987, 993833, 1006242, 1019855, 1034934, 1051008, 1068009, 1086343, 1105607, 1124646, 1143202, 1162124, 1181621, 1200684, 1218607, 1235667, 1251775, 1265765, 1276637, 1284373, 1289057, 1290216, 1287528, 1281168, 1271139, 1257299, 1240313, 1221453, 1201180, 1179011, 1154992, 1130137, 1105272, 1080643, 1056825, 1034658, 1014072, 994338, 975639, 958908, 943904, 929180, 914324, 900537, 888472, 877261, 866388, 856733, 848787, 841467, 833810, 826508, 820545, 815521, 810433, 805168, 800257, 796072, 793111, 792146, 793246, 795499, 798242, 801710]
59295H01710M317M788N575P702J0564J2692J4012J5408J6668J6852J6163J5304
59283I41755J3485R385L913l11k155k528j940J88L610O859R159J0958J2384J2978
59269A017740J3061J3493J3929J3045J0715Q263O475M886L074J051j575n099q427
59256A090631r998r979r941j0414j0436r479q099o761n540m826m725m078j828
59243I94527R81K458K661L133M021L991K885K082J983J392k87k175l634n036o531
59228A002451p846r348j1575j3705j4353j3829j3655j3960j3514j2218j1299j0858
59216H56291r612p389n616m854m058k738j747j403q93o8K13J1N47J989K992L014
59200H26679L130L969M756M914M777M351L254K181K373L255K932J350O20J589
$$ y = [801710, 806027, 810815, 816390, 824092, 834656, 847348, 861360, 876768, 893436, 910288, 926451, 941755, 955240, 964625, 968538, 968227, 966072, 963544, 961604, 961792, 965402, 972261, 981420, 992378, 1004762, 1017740, 1030801, 1044294, 1058223, 1071268, 1081983, 1090246, 1096721, 1101607, 1104681, 1105732, 1104157, 1099058, 1090631, 1080633, 1070654, 1060713, 1050299, 1039863, 1030384, 1022285, 1015524, 1009984, 1005158, 1000433, 996355, 994527, 995508, 997966, 1000627, 1003760, 1007781, 1011772, 1014657, 1016739, 1018722, 1020114, 1019827, 1017652, 1014018, 1008982, 1002451, 994605, 985257, 973682, 959977, 945624, 931795, 918140, 904180, 890666, 878448, 867149, 856291, 846679, 839290, 833674, 828820, 824762, 822024, 820277, 818874, 817981, 817913, 818126, 818137, 818684, 820673, 823665, 826679, 829809, 833778, 838534, 843448, 848225, 852576, 855830, 858011, 860384, 863639, 866571, 867921, 868541, 870130]
59186H70130K600K423J966K029J695K25j427k228k406k180j076N55J283Q50P62
59171H75201J650K145J501J187K429M059M441L758K935J760k20k264l500m359
59157H90723n699p416q979j0352j1485j1955j1875j1980j2194j1481r753q373
59145G69181q059p853p080o501o534o112m628l384l601m387m163k988j967j271
59131G00653k03J395K990M129M670M773N116O362Q081R175R550J0168J1253J1982
59117G90094J2285J3198J4892J6049J5984J5684J5878J5722J4408J2569J1005
59106I47768R400P361N392L863K193L6j930l219m346n627o415o355o155o332o397
59091I29237n962n432m933l902k406j561j890k624l216m210n868p390q169q608
$$ y = [870130, 872730, 875153, 877119, 879148, 880843, 881068, 879641, 877413, 875007, 872827, 871751, 872306, 873589, 874439, 875201, 876851, 878996, 880497, 881684, 884113, 888172, 892613, 896371, 899306, 901066, 900846, 898582, 895082, 890723, 885024, 877608, 868629, 858277, 846792, 834837, 822962, 810982, 798788, 787307, 777554, 769181, 761122, 753269, 746189, 739688, 733154, 727042, 722414, 719030, 715429, 711042, 706879, 703891, 701924, 700653, 700450, 701845, 704835, 708964, 713634, 718407, 723523, 729885, 737966, 747141, 756691, 766859, 778112, 790094, 802379, 815577, 830469, 846518, 862502, 878186, 894064, 909786, 924194, 936763, 947768, 957168, 964529, 969921, 973784, 975977, 976013, 974083, 970864, 966518, 960891, 954476, 948121, 941966, 935634, 929237, 923275, 917843, 912910, 909008, 906602, 905041, 903151, 900527, 897311, 893101, 887233, 879843, 871674, 863066]
59077H63066r079r317r269r180q561o683m373l474m199m838m498m091m126l796
59063G77582k931k662l229l295k333j603j776j775r89m46o93o88P5N16K01L08
59047G56262J141J105m86j881j716j099j246j396p87m36j045j245M4J548J955
59032G50718K240L670N364O059O431P553Q727R053R429J0793J1938J1385R990
59019H53350R403R279Q213O199M086J748j092l422m234m174m172l767k477j329
59005H67611j055l69J917M542N745O034O800P653P423O599O302O013M649K858
58991I32722J979J656P87k44m00j47n49j174r62k15L33J299L386N538O497P038
58975I57544Q390R676R484Q776R590J1655J3086J3671J4747J6235J6540J5258
$$ y = [863066, 853987, 844670, 835401, 826221, 817660, 810977, 806604, 803130, 798931, 794093, 789595, 785504, 781378, 777582, 774651, 771989, 768760, 765465, 763132, 761529, 759753, 757978, 756989, 756543, 755850, 755162, 755237, 755753, 755954, 756262, 757403, 758508, 758022, 756141, 754425, 753326, 752080, 750684, 749897, 749461, 748416, 747171, 747215, 748763, 750718, 752958, 756628, 761992, 768051, 774482, 782035, 790762, 799815, 809244, 820037, 831975, 843360, 853350, 862753, 872032, 880245, 886444, 890530, 892278, 891186, 887764, 883530, 879356, 875184, 871417, 868940, 867611, 866556, 866187, 868104, 872646, 878391, 884425, 891225, 898878, 906301, 912900, 919202, 925215, 929864, 932722, 934701, 936357, 937144, 936900, 936500, 936353, 935804, 934630, 933668, 933453, 933786, 935085, 938471, 944009, 950506, 957544, 965934, 975610, 985094, 993870, 1003460, 1015115, 1028201, 1041872, 1056619, 1072854, 1089394, 1104652]
58963A104652J3606J2250J0712Q805O698L864j81m487p754j0264j3024j5758j7585
58950A091534j8862k0310k1184k0448j8982j8383j8236j6903j4414j2260j0751
58939I00801q857o435m473l298k439j936k040k026j174l31o70j530j435o55o61
58924H62841j594k351k684l143l355k446q76J03M46J060J975K575L058L886M442
58909H63937M118M051N814Q932J1530J2904J3707J4410J5317J7212K0110K2334
58897A014376K2711K2547K3367K4126K3048K1003K0228K0765K1006K0895K1534
58886A255606K2251K1136J8226J5276J2574Q788L936k29k984n323p780r869j1670
58873A319938j3774j5720j6553j6690j7130j7276j5787j3250j1571j1041j0382
$$ y = [1104652, 1118258, 1130508, 1141220, 1150025, 1156723, 1160587, 1160406, 1155919, 1148165, 1137901, 1124877, 1109119, 1091534, 1072672, 1052362, 1031178, 1010730, 991748, 973365, 955129, 938226, 923812, 911552, 900801, 891944, 885509, 881036, 877738, 875299, 873363, 871323, 869297, 868123, 867792, 867122, 865592, 864157, 863502, 862841, 861247, 858896, 856212, 853069, 849714, 847268, 846392, 846495, 846941, 848001, 849976, 852551, 855609, 859495, 863937, 868055, 872106, 877920, 886852, 898382, 911286, 924993, 939403, 954720, 971932, 992042, 1014376, 1037087, 1059634, 1083001, 1107127, 1130175, 1151178, 1171406, 1192171, 1213177, 1234072, 1255606, 1277857, 1298993, 1317219, 1332495, 1345069, 1353857, 1357793, 1357564, 1354580, 1349257, 1341477, 1331608, 1319938, 1306164, 1290444, 1273891, 1257201, 1240071, 1222795, 1207008, 1193758, 1182187, 1171146, 1160764]
58862A160764r440r419j0486j1478j1892j2176j2342j2227j2600j3925j4842j4055
58850A015882j2831j3132j4231j4000j2648j2189j2831j2996j2483j2448j2663
58839H73430j1858j0499j0110j0155q805o552n646o040n422l354j847j472m90
58826G91180J530K723K393K282L353M216L897L421L642L895L695L529L345K430
58812H35531J207R25J288Q57j57j45O77K44j780l293l238k957l432l905l933m269
58796H13620m936m913m274m259m790m343k694j207j76J499L657M711M592N026
58782H01513O454P338P066O718O571N639M153L587L772K841M81j647l141n348
58768H45997q215r844r879j0098j0952j0707q906p428p100o387m438k502j320
$$ y = [1160764, 1151324, 1141905, 1131419, 1119941, 1108049, 1095873, 1083531, 1071304, 1058704, 1044779, 1029937, 1015882, 1003051, 989919, 975688, 961688, 949040, 936851, 924020, 911024, 898541, 886093, 873430, 861572, 851073, 840963, 830808, 822003, 815451, 809805, 803765, 798343, 794989, 793142, 791670, 791180, 792710, 795433, 797826, 800108, 803461, 807677, 811574, 814995, 818637, 822532, 826227, 829756, 833101, 835531, 836738, 837663, 838951, 839808, 839651, 839506, 840183, 840427, 838647, 835354, 832116, 829159, 825727, 821822, 817889, 813620, 808684, 803771, 799497, 795238, 790448, 786105, 783411, 782204, 782028, 783527, 787184, 791895, 796487, 801513, 807967, 815305, 822371, 829089, 835660, 841299, 845452, 849039, 852811, 855652, 856133, 854486, 851345, 845997, 837782, 827938, 818059, 807961, 797009, 786302, 777396, 769968, 762868, 756481, 752043, 749541, 748221]
58755G48221m7J357J670J116J495K833L168K377K738M763O116N850O088P971R524
58740H05240R226Q384Q274Q075P389P602Q969R386P922O582O872P516P318P248
58726I16003P864P659N915M470M682N280N038M874N506N747M978M610N359N555
58712I93540L956J699j60k348n085o867p295q356j1223j4369j6385j7952j9527
58699H89628k0033j9413j9415k0303j9841j7272j5025j4621j4244j2326j0283
58688G06852r469q691p021n951o370o488n157m134m609m694k886r52n77k58J578
58673F41173L341L189K530L537N557O893P939R665J1217J1646J1902J2722J2678
58660G43989J0574P455M195j61n516r265j0195j0729j2679j3901j2208r459q406
$$ y = [748221, 748174, 749531, 751201, 752317, 753812, 756645, 759813, 762190, 764928, 769691, 775807, 781657, 787745, 795716, 805240, 814466, 822850, 831124, 839199, 846588, 854190, 863159, 872545, 880467, 887049, 893921, 901437, 908755, 916003, 923867, 931526, 937441, 941911, 946593, 951873, 956911, 961785, 967291, 973038, 978016, 982626, 987985, 993540, 997496, 999195, 999035, 996687, 991602, 984735, 977440, 969084, 957861, 943492, 927107, 909155, 889628, 869595, 850182, 830767, 810464, 790623, 773351, 758326, 743705, 729461, 717135, 706852, 697383, 688692, 681671, 675720, 669350, 662862, 657705, 653571, 648962, 644268, 641382, 640430, 639853, 639595, 641173, 644514, 647703, 650233, 653770, 659327, 666220, 674159, 683824, 695041, 706687, 718589, 731311, 743989, 754563, 762018, 766213, 766052, 760536, 751271, 741076, 730347, 717668, 703767, 691559, 682100, 673694]
58647F73694q336p198n520m709l868j796J32K97k3R22K051J727J039J570K110
58632F52092R77n75n53J70k29j000o28p9q73j758p79J071J660J566K722M703N660
58615F64147N646O006O700O951P145P574O939M588K472K326K869K309J443J593
58601G28708J783P84k42K5M48q4j02J624L265L080K806M537O863P621P934R851
58585G78901J2368J3529J4157J5733J6859J5742J3921J3583J3487J1577R417R740
58573I39014J1557J2127J1928J3416J6426J9033K1461K5014K8592L0392L1505
58562A160465L3821L5874L4850L1201K7259K2908J6676R631L968q01o206j0895
58550A358751j2484j1907j1775j1909j0677r158r725j1867j3633j5689j9692k4163
$$ y = [673694, 665358, 658160, 652640, 647931, 644063, 642267, 642399, 642696, 642673, 643595, 645646, 647373, 648412, 649982, 652092, 653069, 652494, 651941, 652111, 651882, 650882, 650254, 650175, 649302, 647544, 646765, 647836, 649496, 651062, 653784, 658487, 664147, 669793, 675799, 682499, 689450, 696595, 704169, 711108, 715696, 718168, 720494, 723363, 725672, 727115, 728708, 730491, 731275, 731033, 731058, 731506, 731422, 731320, 732944, 736209, 739289, 742095, 746632, 753495, 761116, 769050, 778901, 791269, 804798, 818955, 834688, 851547, 867289, 881210, 894793, 908280, 919857, 929274, 939014, 950571, 962698, 974626, 988042, 1004468, 1023501, 1044962, 1069976, 1098568, 1128960, 1160465, 1194286, 1230160, 1265010, 1296211, 1323470, 1346378, 1363054, 1372685, 1376653, 1375852, 1369646, 1358751, 1346267, 1334360, 1322585, 1310676, 1299999, 1290841, 1281116, 1269249, 1255616, 1239927, 1220235, 1196072]
58538A196072k6465k7409k9470l1852l1871k9839k8001k5962k1884j7034j4368
58527I11917j3577j2110j0079r468r618q206n780m719m621l388j803k300m078
58514H22170m223k841k359k680j806m39j027k896l142j784j309j824j313m9k2
58499G94456o84R9J637J634R13K073M428N174M680N591P640Q507Q884J1297J4686
58484H71015J5782J5172J6382J9384K0756K0029K0084K1237K0612J7551J4194
58473A072198J0553M446l330r079j1807j3823j5628j5313j3114j1424j0173p167
58461I76339k828L35K697O656J1173J2767J1703J1640J3124J3175J1240R700Q311
58448A086032M074k826q636j2101j5387j8694j9476j7602j5873j4925j2784r616
$$ y = [1196072, 1169607, 1142198, 1112728, 1080876, 1049005, 1019166, 991165, 965203, 943319, 926285, 911917, 898340, 886230, 876151, 866683, 857065, 848859, 843079, 838360, 833739, 830351, 828548, 826248, 822170, 817947, 815106, 812747, 810067, 808261, 807822, 806795, 803899, 800757, 798973, 797664, 795840, 794527, 794478, 794456, 793772, 793871, 795508, 797142, 798055, 800128, 804556, 809730, 814410, 820001, 827641, 836148, 845032, 856329, 871015, 886797, 901969, 918351, 937735, 958491, 978520, 998604, 1019841, 1040453, 1058004, 1072198, 1082751, 1087197, 1083867, 1074788, 1062981, 1049158, 1033530, 1018217, 1005103, 993679, 983506, 976339, 973511, 973846, 976543, 983199, 994372, 1007139, 1018842, 1030482, 1043606, 1056781, 1068021, 1077721, 1086032, 1090106, 1087280, 1078644, 1066543, 1051156, 1032462, 1012986, 995384, 979511, 964586, 951802, 942186]
58436I42186p657o470l660l2J487J596L475O481P220O361P644J0454J0390P246
58422I86721N341N530M162N06k071l105n979j0731j3174j2444j2398j4186j4404
58409I13768j2153j0882j1631j1215q772p377p705o672l867k575l083j884J207
58396H27159K210N53K79K263K637N38p7J889K693J372J756M817O614N999O818
58381H67520J0135J1881J0653J0282J2141J2490J0042Q588R534R372P186P067
58369I86891J0202J2258J1400J1380J3876J5443J4775J5259J7536J7396J3887
58358A140303J1514J1554R473L890k34n96j298m305n634l505j865k259p81L441
58344A159698N439L730L636P472J0414J0005J0622J4302J6364J4677J4112J7083
$$ y = [942186, 934529, 928059, 924399, 924367, 925854, 927450, 930925, 937406, 944626, 950987, 958631, 969085, 979475, 986721, 992062, 997592, 1001754, 1002260, 1000189, 997084, 991105, 980374, 967200, 954756, 942358, 928172, 913768, 901615, 890733, 879102, 867887, 859115, 851738, 844033, 837361, 833494, 830919, 827836, 825952, 827159, 829369, 829922, 830201, 832464, 835101, 835639, 835562, 837451, 840144, 841516, 843272, 848089, 854703, 860702, 867520, 877655, 889536, 900189, 910471, 922612, 935102, 945144, 953732, 963266, 972638, 979824, 986891, 997093, 1009351, 1020751, 1032131, 1046007, 1061450, 1076225, 1091484, 1109020, 1126416, 1140303, 1151817, 1163371, 1172844, 1176734, 1176500, 1175904, 1174606, 1170301, 1164667, 1161162, 1159297, 1157038, 1156257, 1159698, 1165137, 1168867, 1172503, 1179975, 1190389, 1200394, 1211016, 1225318, 1241682, 1256359, 1270471, 1287554]
58332A287554J8748J6314J4085J4503J3311Q475M763M490L043j598m292k618j649
58319A375129l809l876N44L728K494K109N783Q508P293P105J0580J2248R365P890
58305A445091J1223J3655J1691J0934J4791J7410J5138J3848J7368J9826J7287
58294A608262J5627J8817K0916J7984J6411K0648K4246K2027J9756K2637K5684
58283A833015K4594K4538K8940L1455K8457K7378L3009L8076L7141L6930M2614
58272B186147M7096M4839M2941M7287N1163M9147M8465N4571N9462N6779N4338
58261B742235N8882O2875N9585N6488N9983O2020N6191N1681N6335O1651N9870
58250C387796N9696O8919P8076P8452P9398R0001J00726J01910J03135J14634
$$ y = [1287554, 1306302, 1322616, 1336701, 1351204, 1364515, 1372990, 1377753, 1382243, 1385286, 1383688, 1379396, 1376778, 1375129, 1371320, 1367444, 1367988, 1371716, 1374210, 1376319, 1382102, 1390610, 1397903, 1405008, 1415588, 1427836, 1437201, 1445091, 1456314, 1469969, 1481660, 1492594, 1507385, 1524795, 1539933, 1553781, 1571149, 1590975, 1608262, 1623889, 1642706, 1663622, 1681606, 1698017, 1718665, 1742911, 1764938, 1784694, 1807331, 1833015, 1857609, 1882147, 1911087, 1942542, 1970999, 1998377, 2031386, 2069462, 2106603, 2143533, 2186147, 2233243, 2278082, 2321023, 2368310, 2419473, 2468620, 2517085, 2571656, 2631118, 2687897, 2742235, 2801117, 2863992, 2923577, 2980065, 3040048, 3102068, 3158259, 3209940, 3266275, 3327926, 3387796, 3447492, 3516411, 3594487, 3672939, 3752337, 3842338, 3943064, 4044974, 4148109, 4262743]
58240D262743J27015J29731J32020J44488J57892J62019J67095J83798K01008
58231E667809K07111K13938K34685K58140K70809K83953L11435L41937L61864
58222H151681L83935M23025M66273M98826N35499N93545O58921P15062P79061
58213A3205828Q71603R78828J084728J212054J387348J596931J825856K107940
58205B4271116K485604K955487L509446M187624N023814N979374P005270Q126469
58197F3544204R385119J0754198J2207139J3814303J5643729J7615540J9591729
58190A62555961K1539674K3412317K4927412K5731290K5748576K4968191K2737426
58183C31620847J7732236R163196j989380j3245599k2190380k7703039k9928430
$$ y = [4262743, 4389758, 4519489, 4651509, 4795997, 4953889, 5115908, 5283003, 5466801, 5667809, 5874920, 6088858, 6323543, 6581683, 6852492, 7136445, 7447880, 7789817, 8151681, 8535616, 8958641, 9424914, 9923740, 10459239, 11052784, 11711705, 12426767, 13205828, 14077431, 15056259, 16140987, 17353041, 18740389, 20337320, 22163176, 24271116, 26756720, 29712207, 33221653, 37409277, 42433091, 48412465, 55417735, 63544204, 72929323, 83683521, 95890660, 109704963, 125348692, 142964232, 162555961, 184095635, 207507952, 232435364, 258166654, 283915230, 308883421, 331620847, 349353083, 358516279, 356526899, 343281300, 321090920, 293387881, 263459451]
58176B63459451k9589849k7525508k4537316k1258623j8051088j5073543j2423933
58169A14999591j0194503q474334p353021o852058o805353o885587o818615o535666
58161E5080454o096428n550727m933680m315270l761183l272345k821955k420487
58153B1908379k092038j820318j573075j354526j184872j051600r27445q15667
58145A1088838p34138o73203o10259n49164n06827m76042m37881l96662l68239
58136F336423l46907l16654k82654k60399k45193k22337j96429j81860j74722
58127D109268j61703j46774j42304j43224j35968j24158j20451j21400j14675
58118B898611j03102r8018r6548q8284p7059p3756p4680o8857n9733n8218o0928
$$ y = [263459451, 233869602, 206344094, 181806778, 160548155, 142497067, 127423524, 114999591, 104805088, 96330754, 88977733, 82125675, 75320322, 68434735, 61616120, 55080454, 48984026, 43433299, 38499619, 34184349, 30423166, 27150821, 24328866, 21908379, 19816341, 17996023, 16422948, 15068422, 13883550, 12831950, 11904505, 11088838, 10354700, 9681497, 9071238, 8522074, 8015247, 7539205, 7101324, 6704662, 6336423, 5989516, 5672862, 5390208, 5129809, 4884616, 4662279, 4465850, 4283990, 4109268, 3947565, 3800791, 3658487, 3515263, 3379295, 3255137, 3134686, 3013286, 2898611, 2795509, 2697491, 2600943, 2512659, 2435600, 2361844, 2287164, 2218307, 2158574, 2100356, 2039428]
58107B039428n6653m8177m6621m9898m7360m0686l9841m3035m0483l3900l3026
58096A559748l6461l4625k8324k6389k8053k5261j9369j8500k1176j9226j4105
58085A288259j4002j7625j6907j3075j4113j8859j9356j6544j7992k2326k1457
58074A096003j6385j5456j8536j7932j3701j3175j6273j5842j1835j1050j3391
58063I32427j2249p982p465j0537j0254o396n619q306q185n118n486r533j0727
58050H24570q207p816j0240r944o519n594p696p419m352l927o649p261n154n098
58036G28694p233o809m279n035q662r096o037n556q604r577p331p019r606r856
58022F23994o562m775o076o132l775l199n271n690l548k968m688m642k357k065
$$ y = [2039428, 1982775, 1934598, 1887977, 1838079, 1790719, 1750033, 1710192, 1667157, 1626674, 1592774, 1559748, 1523287, 1488662, 1460338, 1433949, 1405896, 1380635, 1361266, 1342766, 1321590, 1302364, 1288259, 1274257, 1256632, 1239725, 1226650, 1212537, 1193678, 1174322, 1157778, 1139786, 1117460, 1096003, 1079618, 1064162, 1045626, 1027694, 1013993, 1000818, 984545, 968703, 956868, 945818, 932427, 920178, 912196, 904731, 894194, 883940, 877544, 871925, 863619, 855434, 850316, 844830, 835297, 824570, 816363, 808547, 798307, 788363, 781844, 776250, 768554, 761135, 756783, 752856, 746207, 738946, 733792, 728694, 721461, 714652, 710373, 705338, 696676, 687580, 681543, 675987, 667383, 657806, 650475, 643456, 633850, 623994, 617432, 612657, 606581, 600449, 596674, 593475, 588204, 582514, 578966, 575998, 571310, 566668, 564311, 562246]
58008E62246m045l605k24J069r06j411J094K334P57L25K546L732K475K180M066
57993E72633M945L937M144N953N865L540K778M037L373K16j249J7J36k013k889
57978F05423j613j697l711l798j255j19j356j070J514J951j155l341k269j299
57964E86205k413k697p18M28p97j596p59r66k777k881o81j07k413l692k083q41
57948E61212j633j343J526L716L458L664N922P476P055P659J0463J2052J0757
57935F31984R878J1414J2460J1012R574R757Q906N474K184P21j353n226p886p863
57921F91036q372j1393j3880j3453j2544j3305j3507j1229q774q222p692n525
57909E63140l658l421k612j20J186l61j768o48O22l47j526n51R62R88J018K710
$$ y = [562246, 558201, 554596, 554372, 555441, 554535, 553124, 554218, 556552, 557309, 557634, 560180, 563912, 566387, 568567, 572633, 577578, 581515, 585659, 591612, 597477, 601017, 603795, 607832, 611205, 611421, 610172, 610189, 610325, 608312, 605423, 603810, 602113, 598402, 594604, 593349, 593230, 591874, 590804, 592318, 594269, 593114, 589773, 587504, 586205, 583792, 581095, 580377, 580805, 580008, 578412, 577653, 576687, 573910, 571029, 570348, 570241, 567828, 564136, 562053, 561212, 559579, 558236, 559762, 563478, 566936, 570600, 576522, 583998, 591053, 598712, 609175, 621227, 631984, 641862, 653276, 665736, 676748, 686322, 696079, 704985, 710459, 712643, 713364, 712011, 706785, 698899, 691036, 682664, 671271, 657391, 643938, 631394, 618089, 604582, 593353, 584579, 576357, 568665, 563140, 559482, 556061, 553449, 553329, 554515, 554154, 552386, 551738, 552360, 552013, 550487, 549936, 550898, 551886, 552904, 555614]
57893E55614M389M398M325N584O476N876O018Q305J0078Q895O444N042L850J676
57879F36970q2m06j073l113m458l880l496m570m807k843j224j817k385r97K75
57864F02094l62o60J460L892M389M721O864Q722P913O264O399O968N583L498L128
57849F70873L608K839J474J068P60n78j470o76k92k301m705m677l178k679k774
57834F57292j714j72K23M2N03Q28J75k9J298K317J333j00j82k88k112m106m173
57817F51135l514m209n482n750o035p756r372q808p169o604o609n719m743m979
57803E64386n286m334l606m914o986p700p540p686p038m486j826j004p05R17K559
57788E04751K362J734K881M805N520N980P889R811R522Q242Q453R470R193Q342
$$ y = [555614, 560003, 564401, 568726, 574310, 580786, 586662, 592680, 600985, 611063, 619958, 626402, 631444, 635294, 636970, 636888, 636482, 635409, 632296, 627838, 623958, 620462, 615892, 611085, 608242, 607018, 605201, 602816, 601819, 602094, 601732, 601072, 602532, 606424, 610813, 615534, 622398, 631120, 639033, 645297, 651696, 658664, 664247, 667745, 670873, 674481, 677320, 678794, 679862, 680622, 680044, 678574, 677898, 677606, 675305, 670600, 665923, 662745, 660066, 657292, 655578, 655406, 655629, 655671, 656174, 657002, 657177, 657148, 658446, 660763, 662096, 661996, 661814, 661526, 659414, 655308, 651135, 647621, 643412, 637930, 632180, 626145, 618389, 609017, 600209, 593040, 586436, 579827, 574108, 569365, 564386, 559100, 554766, 551160, 546246, 539260, 531560, 524020, 516334, 509296, 504810, 502984, 501980, 501275, 502192, 504751, 507113, 508847, 511728, 516533, 522053, 528033, 535922, 545733, 555255, 563497, 571950, 581420, 590613, 598955]
57774E98955Q789R482Q226N933M854M182J684j711l317l381m121n315n118m199
57760F14943m665n807n268l633l503m620m307k364j248j494j136K92J034N99L68
57745E79191O05K19m70l1J026O72j116k400k653l082l725l289j886j005q41m27
57729E60788o3q17j920j527K03J492J977K620L136K445J251J243K137K354K081
57714E77400K727L889L839K682K019J966J408P31J183J936R97j260k507k150j648
57699E93212j494r31l50q74j769j371k93o06k105k664k099k318l556l817k426
57684E66539r49k15P51K393L991N635Q277J1695J4847J8156K2807K8036L1964
57671G13927L4933L9114M4883N0520N5321N9977O3953O5546O4340O0357N0982
$$ y = [598955, 607744, 617226, 625452, 631385, 636239, 640421, 642105, 640394, 637077, 633696, 629575, 624260, 619142, 614943, 610278, 604471, 599203, 595570, 592067, 587447, 583140, 580776, 579528, 578034, 576898, 577190, 578224, 578823, 579191, 579796, 580015, 579545, 579514, 580540, 581212, 580096, 577696, 575043, 571961, 568236, 564947, 563061, 562056, 561215, 560788, 560725, 559908, 557988, 556461, 556664, 558156, 560133, 562753, 565889, 568334, 569585, 570828, 572965, 575319, 577400, 580127, 584016, 587855, 590537, 592556, 594522, 595930, 596661, 597844, 599780, 600777, 599517, 597010, 594860, 593212, 591718, 590787, 590437, 589563, 587794, 586423, 586130, 585524, 583419, 580755, 578656, 576338, 572782, 568965, 566539, 565590, 565375, 566126, 568519, 572510, 578145, 586422, 598117, 612964, 631120, 653927, 681963, 713927, 748860, 787974, 832857, 883377, 938698, 998675, 1062628, 1128174, 1192514, 1252871, 1303853]
57660A303853L2619O184k2211m6640o4682p5483p8486p5196o8981o1777n3306
57649G95894m4085l6265l0699k5939k1076j7091j4541j2489j0464r123q376p217
57637E58529n873n637o124n422l399k136k425k653j849j119j129q40K44J002Q50
57622E22019O92Q89N69k93m41K38J92j111k189j953j057j35J050K132K024Q60
57606E23486K6j92p48j489j126J70O91J41J7O15M79o13j001j94K94q2N5J021J063
57587E22613n56k129k403k269k481k263j397j072j478j088M07J056j48j517j571
57572E03704j241j669k208k119k097k606k722j977j269q78K14J920K401J084r8
57557D90439J20N19J52K94J782K971K392J330J579K622L077L215L938M837N149
$$ y = [1303853, 1336472, 1342656, 1320445, 1273805, 1209123, 1133640, 1055154, 979958, 910977, 849200, 795894, 751809, 715544, 684845, 658906, 637830, 620739, 606198, 593709, 583245, 574122, 565746, 558529, 552656, 547019, 540895, 535473, 532074, 529938, 527513, 524860, 523011, 521892, 520763, 519923, 520167, 521169, 522019, 522711, 523600, 524169, 523876, 523435, 523673, 523865, 522754, 520565, 518612, 517555, 517420, 518470, 520602, 522626, 523486, 523512, 523320, 522572, 521083, 519957, 520127, 520818, 520959, 520976, 521591, 522070, 521457, 520456, 520262, 520556, 520474, 520529, 521550, 522613, 522057, 519928, 517525, 515256, 512775, 510512, 509115, 508043, 506565, 505477, 505884, 506940, 506792, 505275, 503704, 502463, 500794, 498586, 496467, 494370, 491764, 489042, 487065, 485796, 484918, 485132, 487052, 489453, 490537, 490439, 490559, 491078, 491230, 491524, 493306, 496277, 498669, 499999, 501578, 504200, 507277, 510492, 514430, 519267, 524416]
57542E24416N248N480M950L122J242O29Q97J203J689K350K133O99m50j05Q39J102
57526E55444R89J259J556J398J334J784K071J801J754K328K671K421K556L445
57512E82811L907L410L215M031M538L764K943L376M244M225L615L221K781K052
57498F32133J807K230K077Q19j44R2K83n23j048j35R47O55j97j73J48m21j185
57481F37365p53M56J149J388J892K268J923J629K221K840K351J404J241J547J391
57466F60312J166J684K440K584K631L411M324M358L856L628L432K917K774L414
57452G02931L850L460L364M261M716L601K463L141M599M780M135M507N634N689
57438G61131M581L907M127M342M484N198N887N304L954L618M577N381N318N089
$$ y = [524416, 529664, 535144, 540094, 543216, 544458, 545087, 545984, 547187, 548876, 551226, 553359, 554058, 553608, 553503, 554342, 555444, 556433, 557692, 559248, 560646, 561980, 563764, 565835, 567636, 569390, 571718, 574389, 576810, 579366, 582811, 586718, 590128, 593343, 597374, 601912, 605676, 608619, 611995, 616239, 620464, 624079, 627300, 630081, 632133, 633940, 636170, 638247, 639066, 638922, 639014, 639297, 638774, 637726, 637591, 638538, 639193, 638996, 638823, 638971, 638550, 637365, 636612, 637068, 638217, 639605, 641497, 643765, 645688, 647317, 649538, 652378, 654729, 656133, 657374, 658921, 660312, 661478, 663162, 665602, 668186, 670817, 674228, 678552, 682910, 686766, 690394, 693826, 696743, 699517, 702931, 706781, 710241, 713605, 717866, 722582, 726183, 728646, 731787, 736386, 741166, 745301, 749808, 755442, 761131, 765712, 769619, 773746, 778088, 782572, 787770, 793657, 798961, 802915, 806533, 811110, 816491, 821809, 826898]
57424H26898N083M845M341M116M252M452M897N705O062N254M049L652M020M554
57410H92180N491P050Q173P889P067P040P432P145O488O320O138N134M291N068
57396I82906O729P363O936O985P714P873P233O884P161P419P671Q422R138Q948
57382A089382Q619R625J1464J2165J1313J0428J0271R997R124Q319P912P468O967
57369A213054O770O484N580M943N872P707Q441P670O960P233P835Q214Q617Q887
57355A314267Q537Q144Q853J0391J1378J1639J2265J3356J3793J3496J3738J4769
57343A454626J5182J4233J2951J2336J2146J2060J2396J3070J3280J2852J2598
57332A597730J2900J3251J3413J3727J4094J3997J3702J4003J4679J4693J4037
$$ y = [826898, 831981, 836826, 841167, 845283, 849535, 853987, 858884, 864589, 870651, 875905, 879954, 883606, 887626, 892180, 897671, 904721, 912894, 920783, 927850, 934890, 942322, 949467, 955955, 962275, 968413, 973547, 977838, 982906, 989635, 996998, 1003934, 1010919, 1018633, 1026506, 1033739, 1040623, 1047784, 1055203, 1062874, 1071296, 1080434, 1089382, 1098001, 1107626, 1119090, 1131255, 1142568, 1152996, 1163267, 1173264, 1182388, 1190707, 1198619, 1206087, 1213054, 1219824, 1226308, 1231888, 1236831, 1242703, 1250410, 1258851, 1266521, 1273481, 1280714, 1288549, 1296763, 1305380, 1314267, 1322804, 1330948, 1339801, 1350192, 1361570, 1373209, 1385474, 1398830, 1412623, 1426119, 1439857, 1454626, 1469808, 1484041, 1496992, 1509328, 1521474, 1533534, 1545930, 1559000, 1572280, 1585132, 1597730, 1610630, 1623881, 1637294, 1651021, 1665115, 1679112, 1692814, 1706817, 1721496, 1736189, 1750226]
57321A750226J3821J4382J4878J4940J5077J5310J5095J4794J5496J6965J7597
57310A918581J6850J6082J6341J6884J6714J6162J6166J7033J8445J9831K0411
57299B109500J9900J9269J9759K1059K1709K1261K0754K0965K1622K2350K3149
57288B341297K3734K3821K3994K5009K6303K6730K6601K7281K8759K9478K8854
57277B631861K8095K8171K8662K9088K9689L0359L0301K9384K8572K8531K8913
57266B951626K9260K9454K9237K8476K7936K8415K9279K9326K8817K8923K9416
57255C270165K8999K7866K7725K9051L0457L1151L1847L2785L3074L2728L3163
57244C609011L4811L6132L6010L5326L5261L5652L5968L6330L6723L6647L6213
$$ y = [1750226, 1764047, 1778429, 1793307, 1808247, 1823324, 1838634, 1853729, 1868523, 1884019, 1900984, 1918581, 1935431, 1951513, 1967854, 1984738, 2001452, 2017614, 2033780, 2050813, 2069258, 2089089, 2109500, 2129400, 2148669, 2168428, 2189487, 2211196, 2232457, 2253211, 2274176, 2295798, 2318148, 2341297, 2365031, 2388852, 2412846, 2437855, 2464158, 2490888, 2517489, 2544770, 2573529, 2603007, 2631861, 2659956, 2688127, 2716789, 2745877, 2775566, 2805925, 2836226, 2865610, 2894182, 2922713, 2951626, 2980886, 3010340, 3039577, 3068053, 3095989, 3124404, 3153683, 3183009, 3211826, 3240749, 3270165, 3299164, 3327030, 3354755, 3383806, 3414263, 3445414, 3477261, 3510046, 3543120, 3575848, 3609011, 3643822, 3679954, 3715964, 3751290, 3786551, 3822203, 3858171, 3894501, 3931224, 3967871, 4004084]
57233D004084L6211L6591L6406L5726L5796L6763L7219L6682L6594L7976L9908
57222D409956M1280M2344M3573M4766M6103M8324N0947N2200N1726N1437N2566
57211D935222N3765N3435N2110N1048N0211M9144M8360M8278M8064M7052M6088
57200E482777M6153M6911M7811M9342N1887N4556N6473N7997N9509O0293N9976
57189F073685N9719O0529O1519O1267N9854N8252N6767N5354N4374N3801N2789
57178F707910N1206N0395N1108N1954N1304M9513M7785M6067M3724M1095L8722
57167G230783L5901L1699K6558K1357J5828R513L419j115m533q284j2508j6146
57155G332472j8879k1299k3506k5132k6399k7764k8793k8788k8121k7519k6441
$$ y = [4004084, 4040295, 4076886, 4113292, 4149018, 4184814, 4221577, 4258796, 4295478, 4332072, 4370048, 4409956, 4451236, 4493580, 4537153, 4581919, 4628022, 4676346, 4727293, 4779493, 4831219, 4882656, 4935222, 4988987, 5042422, 5094532, 5145580, 5195791, 5244935, 5293295, 5341573, 5389637, 5436689, 5482777, 5528930, 5575841, 5623652, 5672994, 5724881, 5779437, 5835910, 5893907, 5953416, 6013709, 6073685, 6133404, 6193933, 6255452, 6316719, 6376573, 6434825, 6491592, 6546946, 6601320, 6655121, 6707910, 6759116, 6809511, 6860619, 6912573, 6963877, 7013390, 7061175, 7107242, 7150966, 7192061, 7230783, 7266684, 7298383, 7324941, 7346298, 7362126, 7371639, 7375058, 7373943, 7369410, 7361126, 7348618, 7332472, 7313593, 7292294, 7268788, 7243656, 7217257, 7189493, 7160700, 7131912, 7103791, 7076272, 7049831]
57144G049831k3701j9496j5280j1743q330m737j468J242L795O197P660P500N672
57131F997142K359k237p748j3932k0875k8164l4208l7286l7012l3809k7252j6312
57119F740666j405J5015L0431M3862N5120O3627O9046P2715P7329Q5220R7596
57108G349222J15446J40219J73176K14865K65894L27798M02764M93352O03153
57099A0085889P36497Q96173J082313J294693J534126J799355K084898K384348
57091B1898292K688275K965798L148143L150012K928544K528646K073063J717116
57083D3097889J610410J862575K484424L329396M112271M530658M407015L744940
57075F9179578K682469J409396J06936j085766k090684k891212l509363l975736
$$ y = [7049831, 7026130, 7006634, 6991354, 6979611, 6971281, 6966544, 6965076, 6966318, 6970113, 6976310, 6983970, 6991470, 6997142, 6999501, 6997264, 6989516, 6975584, 6954709, 6926545, 6892337, 6855051, 6818039, 6784230, 6756978, 6740666, 6739261, 6754276, 6784707, 6828569, 6883689, 6947316, 7016362, 7089077, 7166406, 7251626, 7349222, 7464668, 7604887, 7778063, 7992928, 8258822, 8586620, 8989384, 9482736, 10085889, 10822386, 11718559, 12800872, 14095565, 15629691, 17429046, 19513944, 21898292, 24586567, 27552365, 30700508, 33850520, 36779064, 39307710, 41380773, 43097889, 44708299, 46570874, 49055298, 52384694, 56496965, 61027623, 65434638, 69179578, 71862047, 73271443, 73378379, 72292613, 70201929, 67310717, 63801354, 59825618]
57067E9825618m312241m530179m633985m625083m506375m286939l984720l625688
57059B5320408l239240k851648k481776k141577j838277j574492j347910j153797
57051H691691r88375q48974p32220o34203n51986m83309m25366l75597l33167
57042C318494k98040k69180k45141k25539k10090j96954j83944j70779j58344
57033A360483j46422j33996j21171j08813r6721q4023p0910n8258m5975l3427
57023D60767k0971r460J373J2500K4161L6077M8130N9582O8805P4893P7529P3593
57011I06979N6743K4059j8170n8421q8958j08291j16906j15311j06316r4795q3787
57000A96826p3260F0652G270c7157l5077k6085j9611j5759j2200p812m003j694
$$ y = [59825618, 55513377, 50983198, 46349213, 41724130, 37217755, 32930816, 28946096, 25320408, 22081168, 19229520, 16747744, 14606167, 12767890, 11193398, 9845488, 8691691, 7703316, 6854342, 6122122, 5487919, 4935933, 4452624, 4027258, 3651661, 3318494, 3020454, 2751274, 2506133, 2280594, 2070504, 1873550, 1689606, 1518827, 1360483, 1214061, 1080065, 958894, 850081, 753360, 669337, 598427, 540169, 494194, 460767, 439796, 430336, 431709, 444209, 468370, 504447, 552577, 612159, 680964, 755857, 833386, 906979, 963722, 987781, 969611, 911190, 822232, 713941, 597035, 481724, 375408, 280613, 196826, 123566, 60652, 7270, -37157, -72234, -98319, -117930, -133689, -145889, -153701, -157704, -159398]
56988a59398K77K772M900O055P269R349J1452J2307J1221P446O11p556j3996j7426
56974a24717j8937j9242j7641j4270j0922q572o149k757Q64M092P635J1874J5810
56961a82932J8761K1474K4487K6926K7986K7962h493A4799J6318O757l606j3397
56949B0871d94k6191k7480k6063k2892j8522j3791r561n532q23M135P948J0658
56936a28608J3896J8201K2244K5243b0934A0281L3347L3262L0989K6058J6723
56925A50660K602j3207k6273l4344l7851C528c2563l2967k9402k5696k2057j8642
56913a61327j5307j2092r788q891q363o778m476k934k251j191L20R36M73N23J983
56898b29163L927N582P413R615J1444J2798J4633J7117J9189K0521K1954K3381
$$ y = [-159398, -159121, -156349, -151449, -145394, -138125, -128776, -117324, -105017, -93796, -86350, -85739, -93295, -107291, -124717, -143654, -162896, -180537, -194807, -205729, -214301, -220450, -223207, -222343, -218251, -210616, -198742, -182932, -164171, -142697, -118210, -91284, -63298, -35336, -8493, 14799, 31117, 37874, 34268, 20871, -494, -26685, -54165, -80228, -103120, -121642, -135433, -144994, -150526, -151349, -147214, -139266, -128608, -114712, -96511, -74267, -49024, -20934, 10281, 43628, 76890, 107879, 133937, 150660, 153262, 140055, 113782, 79438, 41587, 3528, -32563, -65530, -94932, -120628, -142685, -161327, -176634, -188726, -198514, -207405, -215768, -222546, -227022, -229956, -232207, -233398, -233078, -232142, -231669, -231146, -229163, -225236, -219654, -212241, -202626, -191182, -178384, -163751, -146634, -127445, -106924, -84970, -61589]
56886f1589K3426a6158D718K0616J9125J4633Q105J501m445r335j1977j1781r865
56873B1295p344l954N05M981Q752J2629J7278K1802K5383K8930L3588L8782M3076
56860B45703M6009M7872M8505M7089M2209L1921J5513m168k1786l3771m0072m1598
56848C83426l8472l1713k3949j6711q939L34R975J8873K7857L7617M6775N4081
56836D59154O0655O7815P4325P8039P8581P5815O7012M8589K0704j1716m2245
56825I76728o5888q0012q4671q2221p5408o5848n4657m3210l2154k0887r246J468
56813C63994J0338J8467K7321L6569M4742N0916N4618N5213N2471M6247L4803
56802G95699J5733r752l5340n4494o5497p0131o9574o4241n6052m7695l9950l1935
$$ y = [-61589, -38163, -16158, 4718, 25334, 44459, 59092, 67197, 68698, 64253, 54918, 42941, 31160, 21295, 13951, 9997, 10502, 15483, 24235, 36864, 54142, 75944, 101327, 130257, 163845, 202627, 245703, 291712, 339584, 388089, 435178, 477387, 509308, 524821, 520653, 498867, 465096, 425024, 383426, 344954, 313241, 289292, 272581, 263642, 263976, 273951, 292824, 320681, 358298, 405073, 459154, 519809, 587624, 661949, 739988, 818569, 894384, 961396, 1009985, 1030689, 1018973, 976728, 910840, 830828, 746157, 663936, 588528, 522680, 468023, 424813, 392659, 371772, 362526, 363994, 374332, 392799, 420120, 456689, 501431, 552347, 606965, 662178, 714649, 760896, 795699, 811432, 801680, 766340, 711846, 646349, 576218, 506644, 442403, 386351, 338656, 298706, 266771]
56790B66771k3486j5395p834n20O087J1345J5654J9600K2742K4625K5992K7198
56778C72779K6331K0780J0192l487j7876l0617l9243m2713m2511m0786l8068l4131
56766A40650k9787k6069k2709j9171j6116A2658C52i406p607p117p286o296m357
56753d2069l017k538k225k321l290l985k937r25ln45j268j603j876j777q14J70
56737g1023L0n98k71P76J199R21Q87R92M78j06M37J702K241J991K097K665K769
56720e2813K379K307K517K370K148K468K757K163J370J552K200K063J507J652
56706b3360J966J133k32l19Q63J646J571J572J627Q18m35p47k54l40r36n78Q08
56689a5197J682J546J489J868J835J356J463a730H38K233J985J871J273O63J128
$$ y = [266771, 243285, 227890, 220056, 219536, 225623, 236968, 252622, 272222, 294964, 319589, 345581, 372779, 399110, 419890, 430082, 426595, 408719, 378102, 338859, 296146, 253635, 212849, 174781, 140650, 110863, 84794, 62085, 42914, 26798, 12658, 352, -9406, -17013, -24130, -31416, -37712, -42069, -45086, -47624, -49849, -52170, -55460, -59445, -62382, -63307, -63310, -63855, -65123, -66726, -68602, -70379, -71193, -71023, -70993, -71591, -71862, -71086, -69887, -68966, -68079, -67087, -66609, -66715, -66278, -64576, -62335, -60344, -58247, -55582, -52813, -50434, -48127, -45610, -43240, -41092, -38624, -35867, -33704, -32334, -30782, -28582, -26519, -25012, -23360, -21394, -20261, -20493, -20812, -19949, -18303, -16732, -15160, -13533, -12715, -13150, -13897, -14151, -14491, -15427, -16005, -15197, -13515, -11969, -10480, -8612, -6777, -5421, -3958, -1730, 838, 3071, 5056, 6927, 8200, 8863, 9991]
56674I991K205K417J829J801K270J793L74k49N43J462J731J990K400K032P14m92
56658C2811j034j356j506j072n44p65j166m78R41J573J306J346J773J527O11L0
56642C3997k93j155j939j365r5R8m92q5J067Q84p99j878j625j513k007j770o65
56625B0365l63j219j539p91n50j398j886j474j496k231k039m78O28M53N29J658
56609H169K337J706J205J778K120J252L68N51J016J020J195J637J108m81j260
56594B3721m05M14rm88J17R86J358K011L187L429K121Q84R33J261J003J157K303
56577D3983L027K366J573J747J905J220R17K104L781M780N642O859P358O525N762
56562I9549O316P538Q792J0821J3563J5042J4347J3360J3479J3025J0169O170
$$ y = [9991, 12196, 14613, 16442, 18243, 20513, 22306, 22680, 22431, 22974, 24436, 26167, 28157, 30557, 32589, 33303, 32811, 31777, 30421, 28915, 27843, 27299, 26534, 25368, 24890, 25831, 27404, 28710, 30056, 31829, 33356, 33967, 33997, 33704, 32549, 30610, 29245, 29150, 29248, 28756, 28671, 29738, 30622, 29823, 27945, 26320, 24807, 22800, 21030, 20365, 20002, 18783, 17244, 16453, 15903, 14505, 12619, 11145, 9649, 7418, 5379, 4901, 5529, 5982, 6511, 8169, 10506, 12212, 13417, 15195, 17315, 18567, 18935, 19486, 20502, 21522, 22717, 24354, 25462, 24981, 23721, 23316, 23730, 23721, 23233, 23350, 24336, 25694, 27705, 30892, 34321, 36442, 37326, 38259, 39520, 40523, 41680, 43983, 47010, 49376, 50949, 52696, 54601, 55821, 56738, 58842, 62623, 67403, 73045, 79904, 87262, 93787, 99549, 105865, 113403, 122195, 133016, 146579, 161621, 175968, 189328, 202807, 215832, 226001, 232171]
56550B32171L262J319q29k620k942k500k607k942k707k662l734n020n276n098
56536A97815n588o122n604m697m793n711o329o425o299n679m582m033m415m403
56522A23135l021j407j022j564k015k285k395j750n93n12j914k905k159r93r50
56507I7650j369j184j071j794k285j523o54j103k197k600k494k476j924m54P09
56492G5231P06O53J496K133J526P17P13M27j033k141j299L76J030R86J407J834
56476H4762J385P63P66N71l83p63J83P43l08j098K27K092K126J090J014J374N28
56459I5072o93l50R57J164L19J9L67M37O27J640K350J595P74J645K864K013j49
56442A10651q56K14R42N28L9k03p85j309j009n99j027j359m42N16j89j603j720
$$ y = [232171, 235433, 236752, 235923, 233303, 230361, 227861, 225254, 222312, 219605, 216943, 213209, 208189, 202913, 197815, 192227, 186105, 180501, 175804, 171011, 165300, 158971, 152546, 146247, 140568, 135986, 131953, 127538, 123135, 120114, 118707, 117685, 116121, 114106, 111821, 109426, 107676, 107083, 106571, 104657, 101752, 99593, 98600, 97650, 96281, 95097, 94026, 92232, 89947, 88424, 87770, 86667, 84470, 81870, 79376, 76900, 74976, 74522, 75231, 75937, 76590, 78086, 80219, 81745, 82462, 83175, 83602, 82569, 80428, 79129, 79505, 80535, 81521, 82928, 84762, 86147, 86910, 87676, 88247, 87864, 87101, 87284, 88027, 87719, 86621, 86848, 88940, 91066, 92156, 93170, 94544, 95072, 94379, 94029, 94986, 96150, 96469, 96488, 96855, 97292, 97919, 99559, 101909, 103504, 104278, 105923, 108787, 110800, 110651, 109795, 110009, 110951, 111479, 111518, 111315, 110530, 109221, 108212, 107613, 106586, 105227, 104785, 105301, 105112, 103509, 101789]
56425A01789r69j019j391n29Q64R83M03J037K448K671J917K003K756K405J070
56410A16438N16Q65P93M41R55J701J180J80O43J985J935O45L75J368J634P71N53
56393A32978J496K098J707J210Q38O5l93O66K316K491J299N77N84R7o79m38L60
56376A47272Q7q50n47Q85J452P46K03J88j76n46J65J232J108M86J239K788K958
56359A58690J921J820K756K841J979J942K709K353P80K3O30J091R75J348K042
56344A83900J791J051J421K424K216J260J633K955K816J213O97J932K961L128
56330B11398L853N172N298M145L693M325M342L450L226L815L617K599K329K637
56316B63899J794J49j94O69O32k16L74K400L437L112L567N053N444M607M899O558
$$ y = [101789, 100820, 99801, 98410, 97881, 98745, 99728, 100131, 101168, 103616, 106287, 108204, 110207, 112963, 115368, 116438, 116954, 117819, 118612, 119053, 120008, 121709, 122889, 123069, 123712, 125697, 127632, 128277, 128652, 130020, 131654, 132425, 132978, 134474, 136572, 138279, 139489, 140327, 140392, 139999, 140665, 142981, 145472, 146771, 147348, 147932, 148029, 147350, 146912, 147272, 147359, 146509, 145962, 146847, 148299, 149045, 149248, 149436, 149260, 148714, 148879, 150111, 151219, 151705, 152944, 155732, 158690, 160611, 162431, 165187, 168028, 170007, 171949, 174658, 177011, 177791, 177814, 178444, 179535, 180510, 181858, 183900, 185691, 186742, 188163, 190587, 192803, 194063, 195696, 198651, 201467, 202680, 203377, 205309, 208270, 211398, 215251, 220423, 225721, 229866, 233559, 237884, 242226, 245676, 248902, 252717, 256334, 258933, 261262, 263899, 265693, 265842, 265648, 266317, 266949, 266733, 267107, 269507, 272944, 276056, 279623, 284676, 290120, 294727, 299626, 306184]
56300C06184P047N764N152O138O778O376O678P975Q185O979O643P749Q122P141
56286D02911O909Q032Q485P781Q038R680J0463R959J0595J2880J4072J3105J2509
56273E35419J3750J5007J5242J6211J8588K0322K0715K2136K5819K9867L3135
56262G66211L7099M2254M6781N0508N6085O4368P2671P9396Q6415R5055J03903
56251A500746J12335J22071J33282J43254J50746J57665J64645J69219J70129
56242B824092J69174J66796J60349J48785J34621J19148J00094P6393N0863K5770
56232C976085j2k7026n2616p4764r4471j12129j25716j34813j42104j48586j51661
56221B912187j50216j47191j44626j40711j34245j27527j22120j16140j08385
$$ y = [306184, 313231, 318995, 324147, 330285, 337063, 343439, 350117, 358092, 366277, 373256, 379899, 387648, 395770, 402911, 409820, 417852, 426337, 434118, 442156, 451836, 462299, 472258, 482853, 495733, 509805, 522910, 535419, 549169, 564176, 579418, 595629, 614217, 634539, 655254, 677390, 703209, 733076, 766211, 803310, 845564, 892345, 942853, 998938, 1063306, 1135977, 1215373, 1301788, 1396843, 1500746, 1613081, 1735152, 1868434, 2011688, 2162434, 2320099, 2484744, 2653963, 2824092, 2993266, 3160062, 3320411, 3469196, 3603817, 3722965, 3823059, 3899452, 3950315, 3976085, 3976073, 3949047, 3896431, 3821667, 3727196, 3615067, 3489351, 3354538, 3212434, 3063848, 2912187, 2761971, 2614780, 2470154, 2329443, 2195198, 2067671, 1945551, 1829411, 1721026]
56212A721026j00858r4622q7663p9443p2885o9151o5072n8717n2778m9499m6784
56201I43554m2509l8174l5173l1844k7310k3914k2822k1538j8565j6016j4964
56190F50725j3043r490p501q466r036p127n606o546p203n404l697m180m332k032
56176E57062K28J92l1J357K051N92Q2K697N423N516N285P152Q975Q630Q384J0236
56160F23831J1888J1669J2477J6308K0049K1174K2453K6377L0352L2265L5362
56149H64205M2413N0400N6219O2456P2152Q3091R2696J03379J17427J31752J43270
56138A819460J54355J67323J78645J84366J86023J85583J79878J66167J47959
56129C369759J29506J09906Q8565P0544N9727N1926M1307K8335J5122r49k1743
$$ y = [1721026, 1620168, 1525546, 1437883, 1358440, 1285555, 1216404, 1151332, 1092615, 1039837, 990338, 943554, 901045, 862871, 827698, 795854, 768544, 744630, 721808, 700270, 681705, 665689, 650725, 637682, 628192, 620691, 612225, 603189, 596062, 590456, 583910, 576707, 571303, 567606, 563426, 559094, 557062, 557290, 557482, 557451, 558808, 560859, 561451, 561533, 564230, 569653, 575169, 580454, 587606, 596581, 605211, 613595, 623831, 635719, 647388, 659865, 676173, 696222, 717396, 739849, 766226, 796578, 828843, 864205, 906618, 957018, 1013237, 1075693, 1147845, 1230936, 1323632, 1427011, 1544438, 1676190, 1819460, 1973815, 2141138, 2319783, 2504149, 2690172, 2875755, 3055633, 3221800, 3369759, 3499265, 3609171, 3697736, 3768280, 3828007, 3879933, 3921240, 3949575, 3964697, 3963748, 3942005]
56118C942005m2137n6753o7921q0195r2547j03230j16365j35537j55956j70826
56108B920538j80431j87442j88856j80990j67438j53701j38740j19834j00648
56099A502458q6113p4252o1319m9911m3621l8965l1300k3536k0288j8750j4265
56088A040138r437q553q485m656l77n75j795J452N999O030M270O447J0070R657
56074A050185P959J0610J4667J3927J0922J2029J5336J4952J2814J4325J6913
56063A194639J4793J0689J0815J2709J0211N941O423R458Q829O863R483J3650
56051A314503J2870J0390J3338J8685J8890J6580J9233K4181K3747K0592K2723
56040A515732K7766K7782K5205K8118L3965L4338L1688L4631M0682M0734L6818
$$ y = [3942005, 3899868, 3843115, 3775194, 3694999, 3602452, 3499222, 3382857, 3247320, 3091364, 2920538, 2740107, 2552665, 2363809, 2182819, 2015381, 1861680, 1722940, 1603106, 1502458, 1416345, 1342093, 1280774, 1230863, 1187242, 1148277, 1116977, 1093441, 1073153, 1054403, 1040138, 1030701, 1022148, 1013663, 1009007, 1008630, 1008055, 1006260, 1007712, 1013711, 1019741, 1024011, 1030458, 1040528, 1050185, 1058144, 1068754, 1083421, 1097348, 1108270, 1120299, 1135635, 1150587, 1163401, 1177726, 1194639, 1209432, 1220121, 1230936, 1243645, 1253856, 1259797, 1266220, 1275678, 1284507, 1291370, 1300853, 1314503, 1327373, 1337763, 1351101, 1369786, 1388676, 1405256, 1424489, 1448670, 1472417, 1493009, 1515732, 1543498, 1571280, 1596485, 1624603, 1658568, 1692906, 1724594, 1759225, 1799907, 1840641, 1877459]
56029A877459L8100M2999M2935M0071M3256M9953N0593M7323M9803N6019N6459
56018B394970N3522N7056O4373O5150O2301O6853P5859P7343P3677P7429Q7274
56007C155807R1246R0698R7137J08297J12048J11149J18739J32174J37573J37402
55997D292270J46230J62006J69976J72428J84883K05157K17098K22790K38905
55988F011743K63183K78192K86642L07798L40240L64890L83742M17080M63142
55979I116652N01198N34191N85561O53914P16154P75902Q60852R71486J083762
55970A5799672J204097J367076J576962J810782K082697K442348K906150L458334
55962C2648118M121275M944981N920085O988176Q147977R456165J0913865J2464152
$$ y = [1877459, 1915559, 1958558, 2001493, 2041564, 2084820, 2134773, 2185366, 2232689, 2282492, 2338511, 2394970, 2448492, 2505548, 2569921, 2635071, 2697372, 2764225, 2840084, 2917427, 2991104, 3068533, 3155807, 3247053, 3337751, 3434888, 3543185, 3655233, 3766382, 3885121, 4017295, 4154868, 4292270, 4438500, 4600506, 4770482, 4942910, 5127793, 5332950, 5550048, 5772838, 6011743, 6274926, 6553118, 6839760, 7147558, 7487798, 7852688, 8236430, 8653510, 9116652, 9617850, 10152041, 10737602, 11391516, 12107670, 12883572, 13744424, 14715910, 15799672, 17003769, 18370845, 19947807, 21758589, 23841286, 26283634, 29189784, 32648118, 36769393, 41714374, 47634459, 54622635, 62770612, 72226777, 83140642, 95604794]
55954I5604794J4115727J5935893J7896531J9881667K1875265K3929587K5869287
55947B35108751K7278287K7910435K7756927K6345938K2279615J4176264K343148
55940C83199365j0795904k2172055k9887482l3705994l4349155l2774084k9916340
55933A89598351k6558631k3169911j9934512j6955030j4332795j2085779j0145637
55926F6416056q473808p089799n978375n064870m298299l677936l185361k766195
55918B5881413k394418k088030j847055j635949j439006j275947j150313j034939
55910A3015756r20106q26698p59959o96235o26651n70198n32592m93490m45536
55901G144291m06925l84172l59349l25051k97056k81622k63467k36769k16358
$$ y = [95604794, 109720521, 125656414, 143552945, 163434612, 185309877, 209239464, 235108751, 262387038, 290297473, 318054400, 344400338, 366679953, 380856217, 383199365, 372403461, 350231406, 320343924, 286637930, 252288775, 219514691, 189598351, 163039720, 139869809, 119935297, 102980267, 88647472, 76561693, 66416056, 57942248, 50852449, 44874074, 39809204, 35510905, 31832969, 28647608, 25881413, 23486995, 21398965, 19551910, 17915961, 16476955, 15201008, 14050695, 13015756, 12095650, 11268952, 10508993, 9812758, 9186107, 8615909, 8083317, 7589827, 7144291, 6737366, 6353194, 5993845, 5668794, 5371738, 5090116, 4826649, 4589880, 4373522]
55892D373522k07819j96537j76497j61220j56338j48947j33584j22260j19497
55883B950823j13134r8936q9412q9242q6054p4492o5937o5527o2458n2107m5523
55872B108001m7728m7966m0872l6799m1803m6950m6631m8374n5533n8645n3187
55861A583513m8311m9220m7939m0108l4174l5229l5835l1322k8455l0733l0537
55850A171650k4209j9951k2588k4974k2416k1266k5187k7060k2777j9462k1795
55839I19965k3340j9469j6114j7660j8593j5075j2739j5195j6519j2774r636j1138
55827G31713j2053q702o298q278r342o225m586p983j0572p961n052n989o526l389
55813F28757j222l110l960l29K766J662J112M702P733O505N323P361P892L672
$$ y = [4373522, 4165703, 3969166, 3792669, 3631449, 3475111, 3326164, 3192580, 3070320, 2950823, 2837689, 2738753, 2649341, 2560099, 2474045, 2399553, 2333616, 2268089, 2205631, 2153524, 2108001, 2060273, 2012307, 1971435, 1934636, 1892833, 1845883, 1799252, 1750878, 1695345, 1636700, 1583513, 1535202, 1485982, 1438043, 1397935, 1363761, 1328532, 1292697, 1261375, 1232920, 1202187, 1171650, 1147441, 1127490, 1104902, 1079928, 1057512, 1036246, 1011059, 983999, 961222, 941760, 919965, 896625, 877156, 861042, 843382, 824789, 809714, 796975, 781780, 765261, 752487, 742851, 731713, 719660, 710958, 704660, 696382, 687040, 680815, 676229, 668246, 657674, 649713, 644661, 638672, 632146, 628757, 627535, 624425, 620465, 620136, 622902, 624564, 625676, 630378, 638111, 644616, 649939, 657300, 665192, 668864]
55799F68864j60K55j8n209j0660j1612j1621j4690j7234j5578j3550j5000j6147
55786E37640j2933q774p651o612k402J312P32o90J146L372K191K90J335L019K465
55771E14440K528O071R614R344P823Q392Q417M419j550o608j2501k0378k5812
55758E04199k5274k2192k0724j9017j4594j0551j0022r988o931l478l156l730
55746C54542k078n43k095m090l144j513k403l621k132k90j286k797j460N90k05
55731C27475k294k513k125l534m955m102l238m905o635n455l622m287n495m188
55717B70127k106k038k202l2K375K290J901M091O554N933M083M325N176L587J002
55702C05066L09J71j952m488m978n126p115q513o524l768l931n196l948j513j116
$$ y = [668864, 668704, 668959, 668941, 663732, 653072, 641460, 629839, 615149, 597915, 582337, 568787, 553787, 537640, 524707, 515933, 508282, 501670, 499268, 500580, 501312, 500622, 501768, 505140, 507331, 507621, 508956, 511975, 514440, 516968, 523039, 532653, 541997, 549820, 558212, 566629, 571048, 569498, 562890, 550389, 530011, 504199, 478925, 456733, 436009, 416992, 402398, 391847, 381825, 371837, 364906, 361428, 358272, 354542, 352464, 351921, 349826, 345736, 342592, 341079, 338676, 335055, 332923, 332633, 331347, 328550, 327090, 327680, 327475, 325181, 322668, 320543, 317009, 312054, 307952, 304714, 299809, 293174, 287719, 284097, 279810, 274315, 270127, 268021, 265983, 263781, 263749, 266124, 268414, 270315, 274406, 280960, 286893, 290976, 295301, 300477, 304064, 305066, 305375, 305546, 303594, 299106, 294128, 289002, 281887, 273374, 266850, 263082, 259151, 253955, 250007, 248494, 247378]
55687B47378j425N37L135L058J730K620M691M674L303L359L970K760J170J765
55673B82725K707Q24k203k677j506j991l271k166M57J313Q54J815L375K754J016
55658B84026J292K732K044k72r89j55l96j497j285p01k454n608o975o763p576
55643B55423q876p961n475m525n059m356k475k052l273l882l534l613l615k262
55629A94465j098k271m081l497j680j919l460k881n18R8j484k374j922k190l132
55614A62056k567q31n11j620j752q47j067k154j699J14O18n64j283j224j945k886
55598A41838j943J71O18o54j112m95q84k090j662L75J347O57M15J165J203L81
55582A39330L91J124P77l40p6J406J797R31R50K175K800K606L063L874L387K294
$$ y = [247378, 245953, 246490, 249625, 252683, 254413, 257033, 261724, 266398, 269701, 273060, 277030, 279790, 280960, 282725, 285432, 286256, 284053, 281376, 279870, 277879, 274608, 272442, 272899, 274212, 275066, 276881, 280256, 283010, 284026, 285318, 288050, 290094, 289822, 288833, 288678, 288282, 286785, 285500, 284799, 282345, 276737, 269762, 262999, 255423, 246547, 238586, 233111, 228586, 223527, 219171, 216696, 214644, 211371, 207489, 203955, 200342, 196727, 194465, 193367, 191096, 187015, 183518, 181838, 179919, 176459, 173578, 173060, 173158, 171674, 169300, 167378, 165188, 162056, 159489, 158658, 158147, 156527, 154775, 153928, 152861, 150707, 149008, 149122, 149740, 149176, 147893, 146669, 144724, 141838, 139895, 140066, 140684, 140030, 138918, 138423, 137539, 135449, 133787, 134162, 135509, 136166, 136581, 137746, 138949, 139330, 139721, 140845, 141622, 141282, 141206, 142612, 144409, 145340, 146290, 148465, 151265, 153871, 156934, 160808, 164195, 166489]
55566A66489K801M361M403L101L062M369M328K316N67r6j113k563k905k555l513
55551A83052n259n189l329k363k726k091j19P74jk08Q59J249M14K76J311J512
55535A68162J98q88j063j604k539k304j241j561l234l784k792k609l830m217l053
55520A33641k501l456l983l116k480k782k383p17L45j25o11k53k20q87q51J63
55504A09784N18k77p47m62o67j236l78J738K559J243j01j85j39n29k00Q65R05
55487A12691l48r93m56l74j146j069J51N37m74r68j64L12j39L9J147J266n2o76
55469A09284K57Q72K41j03L82p0j795k322n60J090P13l13l67k29p15o79N29J409
55451A07624R21J86J2n39j622j588l0J036O17L85J280J596K84r39p04l38j069
$$ y = [166489, 169290, 173651, 178054, 181155, 184217, 188586, 192914, 195230, 195797, 195701, 194588, 192025, 189120, 186565, 183052, 177793, 172604, 169275, 166912, 164186, 162095, 161976, 162750, 162749, 162541, 163400, 164649, 165063, 165339, 166650, 168162, 168360, 167472, 166409, 164805, 162266, 159962, 158721, 157160, 153926, 150142, 147350, 144741, 140911, 136694, 133641, 131140, 127684, 123701, 120585, 118105, 115323, 112940, 112223, 112568, 112443, 111832, 111579, 111359, 110472, 109621, 109784, 110302, 110025, 109278, 108816, 108149, 106913, 106535, 108273, 110832, 112075, 111974, 111789, 111650, 111121, 110921, 111786, 112691, 112343, 111350, 110894, 110520, 109374, 108305, 108456, 108993, 108519, 107551, 107387, 107699, 107560, 107599, 108746, 110012, 109960, 109284, 109541, 110413, 110654, 110551, 110933, 110863, 109068, 106746, 106186, 107276, 107989, 107676, 107309, 107080, 106365, 105686, 106215, 107624, 108545, 108731, 108743, 108204, 106582, 104994, 104964, 106000, 106617, 107002, 108282, 109878, 110162, 109223, 108519, 108181, 107112]
55434A07112j697j066k63l21k17Q52J680J337Q81J083R32O5M7J418K062N05j598
55417A12812k186j650j131l20J094J964J516P90P10P09M82P88J379O49j389k475
55401A13742j702r34j269j216j3M89p59j843j307p10j443j911m92J348J592R31
55385A04503R01J057N27K12Q57J014n10k142j956p32k33j92N11J367J305P13L99
55368A07601j7q07r81j56K57n68j252p48k36o10n45Q24J620K29j659j584o8P77
55350A02077O08L04k18j151j309L0J299R38k0R4O74K67o79r14p95j150j174Q3
55332I8964J437J199k5m47L6L39M26Q73J245Q76L31K52r9j381k480k127r06J1
55314I8524Q33K019K654J854M82k77p01j311j454p67l84r47j221m39j3r44j580
$$ y = [107112, 105415, 104349, 104086, 103765, 103548, 104400, 106080, 107417, 108298, 109381, 110313, 110378, 110425, 111843, 113905, 114410, 112812, 110626, 108976, 107845, 107525, 108619, 110583, 112099, 112889, 113599, 114308, 114790, 115578, 116957, 117606, 116217, 113742, 112040, 111106, 109837, 108621, 108608, 109097, 108338, 106495, 105188, 104478, 103035, 101124, 100632, 101980, 103572, 104503, 105404, 106461, 106988, 107200, 108057, 109071, 108561, 106419, 104463, 103731, 103498, 103306, 103817, 105184, 106489, 107202, 107601, 107584, 106777, 105796, 105640, 105897, 105329, 104077, 103329, 103093, 102483, 101938, 102762, 104382, 104611, 102952, 101368, 101300, 102077, 102685, 102989, 102771, 101620, 100311, 100341, 101640, 102578, 102558, 102652, 103326, 103593, 102914, 102000, 101205, 100055, 98881, 98964, 100401, 101600, 101575, 101128, 101164, 101503, 101929, 102802, 104047, 104923, 105254, 105506, 105407, 104026, 101546, 99419, 98513, 98524, 99357, 101376, 104030, 105884, 106366, 106089, 105388, 104077, 102623, 101856, 101472, 100525, 99304, 98865, 98852, 97908, 96328]
55297I6328k95J529J676N40j32k89q13j208n72L95P21J109K273K920J817L27L21
55280A06647J036O29n20q20m86q15j484j257m59k47l76j9K54l71r49k70Q32J023
55262A02348R50J698K240J135m90n81M07N60q4j14K72j34p54j22J109J026k43
55245A09223q66m63k06k71K6J55q49j965j422J56N40m68j065o72l72k99N15J697
55227A03394J670L41p42r69j043j023l36L84k1q60l61J246J889R40q7k01LJ47
55209A04371O86J442J574J147R09O43l60j422j165J23Q60O77N27N67J05n70m80
55192A09634K6k45j030r51ON45L93M18N56o2j040j048k33q0q09j152p27m70o24
55173A03107m27J27K72K30Q99J841J717P28M46J138J473R57N57P06Q08Q30J358
$$ y = [96328, 96033, 97562, 99238, 99778, 99646, 99357, 98544, 97336, 96764, 97159, 97880, 98989, 101262, 104182, 105999, 106326, 106647, 107683, 108312, 107792, 106972, 106486, 105671, 104187, 102930, 102471, 102224, 101848, 101829, 102083, 101712, 100763, 100493, 101325, 102348, 103298, 104996, 107236, 108371, 107881, 107300, 107707, 108267, 108183, 108069, 108341, 108207, 107453, 107331, 108440, 109466, 109223, 108357, 107894, 107688, 107417, 107443, 107598, 106749, 104784, 103362, 103518, 104058, 103590, 102525, 101853, 101481, 101182, 101697, 103394, 105064, 105405, 104663, 103694, 102651, 101628, 101292, 101676, 101655, 100795, 100434, 101680, 103569, 104509, 104422, 104221, 104224, 104371, 105057, 106499, 108073, 109220, 110129, 110772, 110412, 108990, 107825, 107948, 108808, 109485, 110012, 110579, 110684, 110114, 109634, 109660, 109415, 108385, 107434, 107440, 107985, 108378, 108796, 109352, 109290, 108250, 107202, 106969, 106889, 106080, 104928, 104201, 103731, 103107, 102680, 102807, 103079, 103309, 104208, 106049, 107766, 108494, 108940, 110078, 111551, 112508, 113065, 113771, 114579, 115409, 116767]
55156A16767J965J608P08P10J510J488L07n63m22l21j004j765j857j466r10l25
55140A16430j99p97j201n22M42L22n07p11m78j000j951j836n81M94J048J697J981
55123A12631Q90p37j012n2K93k46q1J130J817J333P77O61K28m57l02N69P86L24
55105A18552N89J589J648M66k65J26L09k93m03N40J248R15M16L05q6p41m99O92
55087A25108J327R66R62J686J571l1j349r07L74J022J025Q75M03k67k97L78O94
55070A33540K94KM7l18r68p89Q0J25q50j295p70o89j431j405n9Q05J04o83k03
55051A25537N61L55k70n15r53j923k245j219q1l0m26l66l15o99o91J51P35L26
55033A17932r8K69N92J90K2P98J387P31k39k21L82N47L59K10k91j183j377m56
$$ y = [116767, 118732, 120340, 121048, 121758, 123268, 124756, 125063, 124500, 124078, 123757, 122753, 120988, 119131, 117665, 116755, 116430, 116231, 115434, 114233, 113711, 114153, 114475, 113968, 113257, 112779, 111779, 109828, 107992, 107411, 107905, 108953, 110650, 112631, 113521, 112784, 111772, 111720, 112013, 111767, 111686, 112816, 114633, 115966, 116743, 117404, 117632, 117175, 116873, 117442, 118228, 118552, 119141, 120730, 122378, 122844, 122579, 122705, 123014, 122721, 122318, 122858, 124106, 125021, 125437, 125742, 125656, 124915, 124416, 125108, 126435, 127401, 128363, 130049, 131620, 131589, 130240, 129333, 129707, 130729, 131754, 132629, 133032, 132765, 132468, 132846, 133540, 133834, 133836, 133883, 133565, 132597, 131808, 131888, 132013, 131163, 129868, 129098, 128409, 126978, 125573, 125514, 126319, 126423, 125740, 125537, 126098, 126453, 126183, 125668, 124715, 122792, 120547, 119328, 119247, 119217, 118791, 118425, 118110, 117411, 116720, 116871, 117606, 117932, 117834, 118103, 118695, 118885, 118907, 119705, 121092, 121823, 121584, 121363, 121745, 122292, 122651, 122861, 122570, 121387, 120010, 119554]
55015A19554K28l52j199j047l12J73P42J684J986R71k22l73o8k58l81L56J226
54998A22708J283J186J917K818K683J818J280J014L91k44k72k23q85j725j730
54983A32019j113p74o82k32M33P65Q79J132J170N85j00j40L32Q06J262J765J908
54966A40015J517J090Q25K44n99p02K84J242J276R82J108J221P44J33JJ13J62
54949A49656M11P80N28l70r11q14j052j801j724k91J022J153J127J918K557K116
54933A54305J792K994M816N517N243N260N588N446N160N658O685P275P360P362
54919B30461O944N603L818K193L29k190m607o122p187q333q835p996o691o051
54905A91336n703m876m164m406m818m106k570j430p90J4Q06J011J063J763K833
$$ y = [119554, 119782, 119430, 118231, 117184, 116872, 117045, 117787, 119471, 121457, 122428, 122206, 121833, 121765, 121507, 121126, 121482, 122708, 123991, 125177, 127094, 129912, 132595, 134413, 135693, 136707, 137098, 136854, 136582, 136359, 135474, 133749, 132019, 130906, 130132, 129450, 129218, 129651, 130416, 131295, 132427, 133597, 134182, 134082, 133942, 134274, 135080, 136342, 138107, 140015, 141532, 142622, 143447, 143691, 143092, 142390, 142674, 143916, 145192, 146174, 147282, 148503, 149247, 149380, 149381, 149494, 149656, 150067, 150847, 151375, 151005, 150094, 149280, 148228, 146427, 144703, 144412, 145434, 146587, 147714, 149632, 152189, 154305, 156097, 159091, 163907, 169424, 174667, 179927, 185515, 190961, 196121, 201779, 208464, 215739, 223099, 230461, 237405, 243008, 246826, 249019, 249348, 247158, 242551, 236429, 229242, 220909, 212074, 204078, 197387, 191336, 185633, 180757, 176593, 172187, 167369, 163263, 160693, 159263, 158473, 158487, 159293, 160304, 161367, 163130, 165963]
54890A65963L508L901M422M666M296M123M861N692N599N156N469O297O750O836
54876B37539O739N655L132M63j080k357m740p490q911r126r446r715q747o900
54862A85016n766n532m868l409k294k164k478k862l416l713l122k047j409j081
54848A40855l60M62N08K8l0J92k57j281j865j824j842j976j710j250j181j147
54832A27322m08N80P97N37R20J786J891J074M17K44k26j130j549j113n54l48j44
54815A30096K92O62Q39R90J028Q46Q06J107J127M51j20K79J087J290J118J318
54799A43216J542J048L28K96N62K65q0M83J303J050J34lM81L06j78O53K620L575
54781A57601K738J744J905K583L039L697M749N359N193N140N719O221O133O095
$$ y = [165963, 169471, 173372, 177794, 182460, 186756, 190879, 195740, 201432, 207031, 212187, 217656, 223953, 230703, 237539, 244278, 249933, 253065, 253528, 252448, 250091, 245351, 237861, 228950, 219824, 210378, 200663, 191916, 185016, 179250, 173718, 168850, 165441, 163147, 160983, 158505, 155643, 152227, 148514, 145392, 143345, 141936, 140855, 140495, 140957, 141465, 141493, 141463, 141655, 141398, 140117, 138252, 136428, 134586, 132610, 130900, 129650, 128469, 127322, 126914, 127494, 128291, 128828, 129748, 131534, 133425, 134499, 134916, 135160, 134934, 133804, 132255, 131142, 130588, 130240, 130096, 130388, 131050, 131889, 132879, 133907, 134753, 135559, 136666, 137793, 138244, 138124, 138403, 139490, 140780, 141898, 143216, 144758, 145806, 146134, 146430, 146992, 147257, 147177, 147660, 148963, 150013, 150147, 150144, 150625, 150931, 150753, 151406, 154026, 157601, 160339, 162083, 163988, 166571, 169610, 173307, 178056, 183415, 188608, 193748, 199467, 205688, 211821, 217916]
54767B17916O641P291P447P065N961L678N80k093l680m671n510o009o189o506
54753B21921o901o727n941n273n054m833m351l833l200k121r57n43r19j268j144
54738A68856p48j25Q11J593J711J698K489L906N016N672O370O885O629O150O523
54723B23436P379P150N399L278J591L1j499k520l224m527o476q018q586q669q553
54708A96192p880o656n457m533l751l381l612l608k467q44m7R3O68J371Q85n91
54692A56382j419j238j332k042k079r96j16k29m59j93j54o80q05q6L27m72j694
54675A42715k167j782r35J90J069R72K14p7J62j76j214j574p46l7l74q44m53L22
54657A35265P55J109J607J560O49j82j31K58K27m6k02l89m71J52J253J617Q70
$$ y = [217916, 224557, 231848, 239295, 246360, 252321, 255999, 256579, 254486, 250806, 246135, 240625, 234616, 228427, 221921, 215020, 208293, 202352, 197079, 192025, 187192, 182841, 179008, 175808, 173687, 172730, 172187, 171268, 170000, 168856, 168108, 167983, 168794, 170387, 172098, 173796, 176285, 180191, 185207, 190879, 197249, 204134, 210763, 216913, 223436, 230815, 237965, 243364, 246642, 248233, 248264, 246765, 244245, 241021, 236494, 230018, 222000, 213414, 204745, 196192, 188312, 181656, 176199, 171666, 167915, 164534, 160922, 157314, 154847, 154003, 153956, 154049, 154717, 156088, 156973, 156382, 154963, 153725, 152393, 150351, 148272, 147276, 147160, 146931, 146472, 146279, 146125, 145445, 144640, 144554, 144881, 144409, 142715, 140548, 138766, 137831, 138021, 139090, 140062, 140276, 140199, 140361, 140185, 138971, 137397, 136651, 136614, 136240, 135396, 134943, 135265, 136020, 137129, 138736, 140296, 140945, 140763, 140632, 140890, 141117, 141071, 140869, 140480, 140009, 140161, 141414, 143031, 143901]
54640A43901J22R1J36j24J46J202J697O28j039j938k177k362k094r15L27N29q
54623A38122k00K09P49J170J363R93J58l28r6P0n19j314j386p16Q8O50Q31O62
54605A40506O45J255J859J283k16r33j55Q47R37O36O35L93o55j744j896j301n88
54588A41508J93R13Q90J49o7Q34J580R59k37n35n5J9n18p99l79L73J008J195O85
54569A47716k14o20k21K82L32K52K91Ko59p75J13J044J057N19K25J48Q3M27J283
54550A51285J740J106Q9k26J91P83J336J686J459R10J023J933K403J698P20L27
54534A68463j08j253k259k036j004k10K44O46N13m85j442j479j196j532k003j582
54518A53277n57l0j86m59p76j277j414o28N24J106J097R16M30m11q09k54L45J7
$$ y = [143901, 144023, 144114, 144250, 144126, 144272, 145474, 147171, 147799, 146760, 144822, 142645, 140283, 138189, 137274, 137601, 138130, 138122, 137922, 138131, 138880, 140050, 141413, 142406, 142564, 142236, 142140, 142210, 141691, 140377, 138991, 138275, 138363, 139013, 139844, 140506, 141151, 142406, 144265, 145548, 145332, 144399, 144244, 145091, 146028, 146664, 147299, 147692, 147037, 145293, 143397, 142096, 141508, 141701, 142614, 143504, 143653, 143586, 144420, 146000, 146959, 146722, 146187, 146132, 146151, 145633, 144834, 144455, 144828, 145836, 147031, 147716, 147502, 146882, 146661, 146943, 147275, 147527, 147818, 147820, 147161, 146386, 146499, 147543, 148600, 149119, 149344, 149492, 149575, 150002, 151285, 153025, 154131, 154220, 153994, 154185, 154968, 156304, 157990, 159449, 160359, 161382, 163315, 165718, 167416, 168136, 168463, 168355, 167102, 164843, 162807, 161803, 161593, 161837, 162483, 162996, 162511, 161069, 159590, 158394, 156862, 154859, 153277, 152720, 152690, 152504, 152045, 151269, 149992, 148578, 147950, 148474, 149580, 150677, 151593, 152023, 151612, 150803, 150549, 150894, 150911]
54500A50911o19l92M72R43J009J327J671J260K87l56n12o56p48m75j44j00K12
54483A54090J282K205J813O05R7O28J235J391J392J259P18J43K10P03Q65P62J142
54466A70540K118L057L514L289K021j15j756j733p16k21m66n21j94k09o84r75
54450A76949r38j042j224r71n12o12j154j199n39J1j0j34L7K84M04N07N81M89
54432A70927L33K04k65j254j997j587l26O50Q59O89M40J05m2L61J027J303J032
54415A72459N07j21o78o92m1O02O82N90Q11R82P56P82J578K237J570L1q99q07
54397A80349m65k74N4N54R70J370J716J367J67o56j08P47K63j117j529n88L20
54380A83140N19O98J005N30q04j561p63R14K369L250L472K858J828J360J726K218
$$ y = [150911, 150292, 149900, 150372, 151315, 152324, 153651, 155322, 156582, 156869, 156513, 156001, 155345, 154597, 154122, 153978, 153878, 154090, 155372, 157577, 159390, 159995, 160092, 160720, 161955, 163346, 164738, 165997, 166715, 166858, 167068, 167771, 168636, 169398, 170540, 172658, 175715, 179229, 182518, 184539, 184424, 182668, 180935, 180219, 179998, 179532, 179011, 178817, 178608, 177924, 176949, 176011, 174969, 173745, 172774, 172262, 171650, 170496, 169297, 168758, 168769, 168759, 168625, 168662, 168946, 169350, 169857, 170438, 170927, 171260, 171464, 171199, 169945, 167948, 166361, 166035, 166685, 167544, 168233, 168673, 168778, 168736, 169097, 170124, 171427, 172459, 172966, 172845, 172167, 171475, 171434, 172036, 172718, 173308, 174119, 175101, 175857, 176639, 178217, 180454, 182024, 182055, 181156, 180349, 179884, 179610, 179664, 180218, 181188, 182558, 184274, 185641, 185808, 185152, 185044, 185791, 186054, 184937, 183408, 182820, 183140, 183659, 184357, 185362, 185892, 185088, 183527, 182764, 183678, 186047, 189297, 192769, 195627, 197455, 198815, 200541, 202759]
54364B02759K352K438K672K715K469K273K086J311j79j665k449k430j827j105
54350B11420j074k133l372l432k325j451j736k584k876k223j102l54n08j148j201
54335A83901l91K14k00p73k46J003J536R26l3p53j114p54M42J444J162K08J1N50
54317A87133N59j89o32m26m14q95j064n67o2K9k8k89j122k027j986j262j255k173
54299A73330k457j095R02J976J785R59J89P1Q11J694J783J290J208J588J527Q47
54283A86408L83L76K14m4N14J732K073Q34p22j254r45n11M6Q45J401J401J248
54266A93999J179P98j0o10o02k78K23J107J905J579K23o61k68M04L15n2K17Q89
54248B00357J152R37O10O3r71k131k731k471j480j16R83J227P52K51j5l19o05
$$ y = [202759, 205111, 207549, 210221, 212936, 215405, 217678, 219764, 221075, 220896, 219231, 216782, 214352, 212525, 211420, 210346, 208213, 204841, 201409, 199084, 197633, 195897, 193313, 190437, 188214, 187112, 186758, 186250, 185102, 183901, 183510, 183724, 183524, 182751, 182505, 183508, 185044, 185970, 185937, 185184, 184070, 183316, 183758, 185202, 186364, 186572, 186583, 187133, 187692, 187503, 186871, 186445, 186031, 185136, 184072, 183505, 183443, 183472, 183444, 183155, 182033, 180006, 178020, 176758, 175503, 173330, 170873, 169778, 170680, 172656, 174441, 175400, 175589, 175660, 176471, 178165, 179948, 181238, 182446, 184034, 185561, 186408, 186791, 187167, 187381, 187337, 187851, 189583, 191656, 192490, 191768, 190514, 189569, 189058, 189104, 189949, 191350, 192751, 193999, 195178, 195976, 195966, 195356, 194754, 194476, 194699, 195806, 197711, 199290, 199513, 198852, 198584, 198988, 199303, 199251, 199468, 200357, 201509, 202446, 203056, 203119, 202148, 200017, 197286, 194815, 193335, 193219, 194202, 195429, 196181, 196432, 196417, 196098, 195493]
54231A95493m46M9K28n7k88k61k15J4P78J578J470O54K89O03O23M0k61O0J31m54
54211B00028q23l92J43J51N1K38K54j95o06p40j063j563j406m99M5l08o20k21
54193A92474J12k57n45J7P36O72J79np9m60o44m9P96J054Q43P18O56M76M41N89
54173A97724K79o81j316q07L23J192J743K046J460k99k122k686k055j148l85K07
54157A93475L47j1k29M5J70l70r86j035r46j247j380o37M50Q48N51K59J52k3j23
54138A89310J17M66O52Q61J055O73k23m69N12J492J140N6k38M07R26R39J020J375
54120B00071J600J634J784J947J724J251J097J480K148K808L129K886K526K918
54106B29003L997M576M161L882M655N520N073L569K265J395L31q53j499j699k095
$$ y = [195493, 195047, 195096, 195324, 195267, 194979, 194718, 194503, 194517, 195295, 196873, 198343, 198997, 199286, 199889, 200512, 200552, 200291, 200351, 200482, 200028, 199205, 198813, 198956, 199107, 199158, 199396, 199650, 199455, 198849, 198109, 197046, 195483, 194077, 193578, 193623, 193315, 192695, 192474, 192586, 192329, 191784, 191801, 192537, 193209, 193388, 193383, 193304, 192844, 192200, 192151, 192947, 194001, 194844, 195562, 196218, 196694, 197135, 197724, 198003, 197322, 196006, 195199, 195522, 196714, 198457, 200503, 201963, 201664, 199542, 196856, 194801, 193653, 193268, 193475, 193822, 193811, 193582, 193627, 193797, 193427, 192441, 191406, 190460, 189213, 187833, 187196, 187646, 188494, 189045, 189304, 189456, 189433, 189310, 189427, 189893, 190545, 191406, 192461, 193134, 192911, 192442, 192954, 194446, 195586, 195642, 195404, 195811, 196737, 197676, 198696, 200071, 201671, 203305, 205089, 207036, 208760, 210011, 211108, 212588, 214736, 217544, 220673, 223559, 226085, 229003, 233000, 237576, 241737, 245619, 250274, 255794, 260867, 264436, 266701, 268096, 268427, 267574, 266075, 264376, 262281]
54091B62281k588k547k091j874j827j362o97p35j594k419k695k717k690k353j709
54076B32383j288j410j766j851j494r67p70j069j247n32O99J134L65l73k6P76
54060B22564Q47K39j42j8K55N92J085J482J559J643J943K030J637J297J389J408
54044B39810J057J117K158L332L632L538M096N106N563N302M921M616M342M522
54030B93112N341N980N768N400N753O269N992N345N229N099L795J758N58N28P46
54015C56673R81J726K395J592o55k729l726m223m570m262l456l329m297n325n573
54000C21222n410n276m868m111l672l806l804l184k525k444k648k596k367k307
53986B72204k418k528k545k277j507m80K24L63J49k88r17j450j516j161o23O0
$$ y = [262281, 259693, 257146, 255055, 253181, 251354, 249992, 249295, 248560, 246966, 244547, 241852, 239135, 236445, 234092, 232383, 231095, 229685, 227919, 226068, 224574, 223607, 222837, 221768, 220521, 219989, 220688, 221822, 222187, 221814, 221788, 222564, 223411, 223650, 223508, 223490, 223745, 224337, 225422, 226904, 228463, 230106, 232049, 234079, 235716, 237013, 238402, 239810, 240867, 241984, 244142, 247474, 251106, 254644, 258740, 263846, 269409, 274711, 279632, 284248, 288590, 293112, 298453, 304433, 310201, 315601, 321354, 327623, 333615, 338960, 344189, 349288, 353083, 354841, 355399, 355927, 356673, 357654, 359380, 361775, 363367, 362712, 359983, 356257, 352034, 347464, 343202, 339746, 336417, 332120, 326795, 321222, 315812, 310536, 305668, 301557, 297885, 294079, 290275, 287091, 284566, 282122, 279474, 276878, 274511, 272204, 269786, 267258, 264713, 262436, 260929, 260449, 260673, 261036, 261185, 260897, 259980, 258530, 257014, 255853, 255230, 255290]
53970B55290P13Q50O38J274L336N362N462L901K622K593L165L889N095O519P141
53955C07850O814O615O976O868N380K971N52j540l153l957m057m078m178l736
53941C19327k412p39P00J838K616K762K431K236K410K580K544K471K282J711J043
53926C43800Q86J145J211J210J914L296M337M535M506M743M943M923N156N957
53912C92562P009Q051R128R918R801Q901Q049P479O611N387M606M514M196K891
53898D89103R65r14k527l607l723l266l428m583n636n700n406n757o596p091p086
53883D24748p058p207p324p263p032o726o641o993p307o789n497m437m166m183
53869C36125m041m158m919n725n685m747l546k570j989j918k350l020l557l623
$$ y = [255290, 256003, 256853, 257491, 258765, 262101, 267463, 272925, 276826, 279448, 282041, 285206, 289095, 294190, 300709, 307850, 314664, 321279, 328255, 335123, 340503, 343474, 344026, 342486, 339333, 335376, 331319, 327241, 323063, 319327, 316915, 316176, 316876, 318714, 321330, 324092, 326523, 328759, 331169, 333749, 336293, 338764, 341046, 342757, 343800, 344686, 345831, 347042, 348252, 350166, 353462, 357799, 362334, 366840, 371583, 376526, 381449, 386605, 392562, 399571, 407622, 416750, 426668, 436469, 445370, 453419, 460898, 467509, 472896, 477502, 482016, 486212, 489103, 490068, 489154, 486627, 483020, 479297, 476031, 472603, 468020, 462384, 456684, 451278, 445521, 438925, 431834, 424748, 417690, 410483, 403159, 395896, 388864, 382138, 375497, 368504, 361197, 354408, 348911, 344474, 340308, 336125, 332084, 327926, 323007, 317282, 311597, 306850, 303304, 300734, 298745, 296827, 294477, 291457, 287900, 284277]
53855B84277l014k029j567k174l108l125k081r15k15J49J09o30j559j623q15l06
53839B61374o36j025r24r05j320j436o83K39M62J78p2l50p23n99L73J367J422
53822B56742Q36O32J067J542J612J360R87O41M51L02j5k24L38J732L064L546L322
53805B77935K920K579K464K879L748M545N100N771O530O744O267N845N922N989
53791C45238N695N583N937N913M825L434K809K570J499m59k028k356j926j668
53777C75066j943k555l180l603l858m155m563m915n100n174n060m638m205m280
53763C17837m723m675l714k469j757j677j920k353k856l122l075k981k867k345
53749B77303j449r63j434k331k750k475j896j291p16k68m9m0j90l76k83L26J129
$$ y = [284277, 281263, 279234, 277667, 275493, 272385, 269260, 267179, 266264, 266049, 266198, 266307, 265677, 264118, 262495, 261680, 261374, 260738, 259713, 258789, 257884, 256564, 255128, 254445, 254684, 255146, 255324, 255252, 254902, 254179, 253580, 253953, 255320, 256742, 257578, 258210, 259277, 260819, 262431, 263791, 264778, 265419, 265870, 266172, 266157, 265933, 266271, 268003, 271067, 274613, 277935, 280855, 283434, 285898, 288777, 292525, 297070, 302170, 307941, 314471, 321215, 327482, 333327, 339249, 345238, 350933, 356516, 362453, 368366, 373191, 376625, 379434, 382004, 383503, 383044, 381016, 378660, 376734, 375066, 373123, 370568, 367388, 363785, 359927, 355772, 351209, 346294, 341194, 336020, 330960, 326322, 322117, 317837, 313114, 308439, 304725, 302256, 300499, 298822, 296902, 294549, 291693, 288571, 285496, 282515, 279648, 277303, 275854, 274891, 273457, 271126, 268376, 265901, 264005, 262714, 261998, 261730, 261681, 261641, 261451, 261075, 260792, 261118, 262247]
53732B62247J588J641J581J337O82m4k37l8q6l40j59M62Q91J130J750K506K401
53715B77312J515J192J929K516K005J122Q93J162J345J477J604J314P51R60K348
53700B99445L912M741N155N487N185M169L634M169M411L087J146K89M08K39l01
53685C45176k95K47M35J04j79l66p36q68k87K91j49j100j155k82J73k84o40j48
53667C39937O03P81L65j66l90l2O92Q90k9j318j646q06K53Q64J137J198R50N90
53649C43873M21K07m08j009q05J66J087J495J533J282P68M28O58J065J101J168
53633C53030K034L361L965L525K888K681K636K440K246K181K186K380K878L301
53619C91732L290L280L896M793N191N273N804O506O238M950M013M190M619M309
$$ y = [262247, 263835, 265476, 267057, 268394, 269076, 269032, 268795, 268757, 268671, 268331, 268172, 268634, 269525, 270655, 272405, 274911, 277312, 278827, 280019, 281948, 284464, 286469, 287591, 288484, 289646, 290991, 292468, 294072, 295386, 296137, 297097, 299445, 303357, 308098, 313253, 318740, 323925, 328094, 331728, 335897, 340308, 343395, 344541, 344830, 345238, 345477, 345176, 344881, 345128, 345563, 345667, 345488, 345122, 344386, 343518, 343231, 343522, 343373, 342273, 341118, 340836, 341009, 340725, 340085, 339937, 340540, 341321, 341686, 341520, 341130, 341098, 341790, 342680, 342651, 341333, 339687, 338881, 339134, 339998, 341135, 342333, 343283, 343873, 344294, 344501, 344093, 343084, 342279, 342445, 343532, 345027, 346560, 347842, 348610, 349038, 349696, 350761, 351862, 353030, 355064, 358425, 362390, 365915, 368803, 371484, 374120, 376560, 378806, 380987, 383173, 385553, 388431, 391732, 395022, 398302, 402198, 406991, 412182, 417455, 423259, 429765, 436003, 440953, 444966, 449156, 453775, 458084]
53605D58084L484K761K075J231O58P86J259J422J220R86Q26O87O20N91L52j38
53589D76904n58p63j022j489j848j857j809k066k429k452k080j663j416j260j208
53574D52984j510k230k832k598j565q05j295k621l357k765j534p32o38q68r49
53559D26685m71P22J941K057J007J74N85J485J519O97J26L28Q86J430J885J961
53543D43017J458R58J272K222K832K693K351K333K654L210L955M704N370O237
53529D85266P368Q070P783P229P684R156J0334J0366R787R550J0028J1151J2700
53516F06472J4183J5060J5383J5756J6567J7663J8740J9600K0069K0219K0576
53505H00288K1571K2870K3693K3671K2983K1965K1052K0776K1229K1766K1796
$$ y = [458084, 461568, 464329, 466404, 467635, 468293, 469079, 470338, 471760, 472980, 473966, 474792, 475479, 476099, 476690, 477042, 476904, 476346, 475583, 474561, 473072, 471224, 469367, 467558, 465492, 463063, 460611, 458531, 456868, 455452, 454192, 452984, 451474, 449244, 446412, 443814, 442249, 441444, 440149, 437528, 434171, 431406, 429872, 429140, 428502, 427634, 426685, 426214, 426936, 428877, 430934, 431941, 432115, 432700, 434185, 435704, 436401, 436527, 436855, 437741, 439171, 441056, 443017, 444475, 445433, 446705, 448927, 451759, 454452, 456803, 459136, 461790, 465000, 468955, 473659, 479029, 485266, 492634, 500704, 508487, 515716, 523400, 532556, 542890, 553256, 563043, 572593, 582621, 593772, 606472, 620655, 635715, 651098, 666854, 683421, 701084, 719824, 739424, 759493, 779712, 800288, 821859, 844729, 868422, 892093, 915076, 937041, 958093, 978869, 1000098, 1021864, 1043660]
53494A043660K1466K1075K0429J9464J8843J9019J9327J8984J8449J8586J8971
53483A258273J8521J7420J6995J7664J8420J8476J8150J7807J7148J5937J4536
53472A449347J3316J2197J0989R522P547N116K949J640O69r46l270n647p875j0172
53458A485382j2184j3292j3716j4240j4932j5304j5491j5996j6537j6584j6762
53447A320344j8083j9846k0159j8769j7479j7360j7410j6676j5805j5479j4905
53436A128373j3208j1052r521q353o571m210k218j049l29M00J319K410L456M190
53422A083637M820N915P526R038J0143J1321J2992J4871J6541J8047J9532K0891
53410A235274K2072K3251K4392K5226K5774K6386K7191K8117K9396L1269L3310
$$ y = [1043660, 1065126, 1086201, 1106630, 1126094, 1144937, 1163956, 1183283, 1202267, 1220716, 1239302, 1258273, 1276794, 1294214, 1311209, 1328873, 1347293, 1365769, 1383919, 1401726, 1418874, 1434811, 1449347, 1462663, 1474860, 1485849, 1495371, 1502918, 1508034, 1510983, 1512623, 1513292, 1512346, 1509076, 1503429, 1495554, 1485382, 1473198, 1459906, 1446190, 1431950, 1417018, 1401714, 1386223, 1370227, 1353690, 1337106, 1320344, 1302261, 1282415, 1262256, 1243487, 1226008, 1208648, 1191238, 1174562, 1158757, 1143278, 1128373, 1115165, 1104113, 1094592, 1086239, 1079668, 1075458, 1073240, 1072191, 1071862, 1072262, 1073581, 1075991, 1079447, 1083637, 1088457, 1094372, 1101898, 1110936, 1121079, 1132400, 1145392, 1160263, 1176804, 1194851, 1214383, 1235274, 1257346, 1280597, 1304989, 1330215, 1355989, 1382375, 1409566, 1437683, 1467079, 1498348, 1531658]
53399A531658L4924L6410L8533M1102M3176M4611M6139M7813M8906M9535N0823
53388B013630N2903N4297N4051N3104N2701N2674N2222N1277N0075M8330M5782
53377B581046M2893M0215L7656L4979L2226K9169K5239K0507J5754J1163O074
53366B876921N33m227p716j1298j6326k2298k7900l2892l7682m2013m5316m7751
53354B582035m9755n1117n1565n1657n2005n2106n1001m8758m6354m4460m3107
53343B040150m2139m1284m0052l8318l6608l5341l4238l2969l1735l0695k9521
53332A647250k8064k6650k5230k3129k0304j7864j6559j5681j4340j2853j1916
53321A434660j1363j0844j0837j1809j3042j3487j3193j2789j2249j1272j0239
$$ y = [1531658, 1566582, 1602992, 1641525, 1682627, 1725803, 1770414, 1816553, 1864366, 1913272, 1962807, 2013630, 2066533, 2120830, 2174881, 2227985, 2280686, 2333360, 2385582, 2436859, 2486934, 2535264, 2581046, 2623939, 2664154, 2701810, 2736789, 2769015, 2798184, 2823423, 2843930, 2859684, 2870847, 2876921, 2877454, 2873227, 2865511, 2854213, 2837887, 2815589, 2787689, 2754797, 2717115, 2675102, 2629786, 2582035, 2532280, 2481163, 2429598, 2377941, 2325936, 2273830, 2222829, 2174071, 2127717, 2083257, 2040150, 1998011, 1956727, 1916675, 1878357, 1841749, 1806408, 1772170, 1739201, 1707466, 1676771, 1647250, 1619186, 1592536, 1567306, 1544177, 1523873, 1506009, 1489450, 1473769, 1459429, 1446576, 1434660, 1423297, 1412453, 1401616, 1389807, 1376765, 1363278, 1350085, 1337296, 1325047, 1313775, 1303536]
53310A303536r603q905p547n993m994m187k751r66K44R44K046L724N241O279P308
53295A284376Q686J0410J2593J5252J7692J9048J9373J9473J9868K0622K1721
53284A469114K2893K3435K3048K2350K1753K0589J8312J5807J4200J2986J0777
53273A675264P453M144J386j219l747n867p968j0869j4298j6981j8369j9106j9763
53260A570060k0422k1502k3582k6150k7838k8193k8089k8149k8044k7665k7678
53249A282748k8345k8910k8727k8082k7411k6572k5405k4210k3205k2273k1531
53238I98077k1396k1649k1376k0188j8811j7967j7414j6573j5399j4176j3022
53227H00106j2010j1273j0657r797q813q246q160p986p625p858r134j0646j1309
$$ y = [1303536, 1293933, 1285028, 1277481, 1271488, 1266494, 1262307, 1259556, 1258590, 1258834, 1259778, 1261824, 1265548, 1270789, 1277068, 1284376, 1293062, 1303472, 1316065, 1331317, 1349009, 1368057, 1387430, 1406903, 1426771, 1447393, 1469114, 1492007, 1515442, 1538490, 1560840, 1582593, 1603182, 1621494, 1637301, 1651501, 1664487, 1675264, 1682717, 1686861, 1688247, 1687028, 1683281, 1677414, 1669446, 1658577, 1644279, 1627298, 1608929, 1589823, 1570060, 1549638, 1528136, 1504554, 1478404, 1450566, 1422373, 1394284, 1366135, 1338091, 1310426, 1282748, 1254403, 1225493, 1196766, 1168684, 1141273, 1114701, 1089296, 1065086, 1041881, 1019608, 998077, 976681, 955032, 933656, 913468, 894657, 876690, 859276, 842703, 827304, 813128, 800106, 788096, 776823, 766166, 756369, 747556, 739310, 731150, 723164, 715539, 707681, 698547, 687901, 676592]
53214F76592j1177j1241j2085j3310j4097j3947j3024j2065j1791j2139j2246
53203E39470j1404r866q555q067q117p941p177o322o178o862p705q224q659r208
53189D25185r334q508p194o343o192o261o302o440o531o222n622n149m720l873
53175C36494k607j441o45j32m4n64j278j559j585k040k790k944k332j808j829
53160C12896j832j477j331j695j827j164m29n53j176j236n75J9J26M2q2m99j112
53143B98095j302p93j68o0l08l16k4M6k98m97k7P79J211J246J476J942J900J044
53125C03946K64N61J668K469K414J843J172N42J32J04K62L32N12J171K042K391
53109C21825J965J188M78j26o40j054j524k090k338j942j421j592k353k770k418
$$ y = [676592, 665415, 654174, 642089, 628779, 614682, 600735, 587711, 575646, 563855, 551716, 539470, 528066, 518200, 509645, 501578, 493461, 485520, 478343, 472021, 465843, 458981, 451276, 443052, 434393, 425185, 415851, 407343, 400149, 393806, 387614, 381353, 375051, 368611, 362080, 355858, 350236, 345087, 340367, 336494, 333887, 332446, 331801, 331669, 331625, 331061, 329783, 328224, 326639, 324599, 321809, 318865, 316533, 314725, 312896, 311064, 309587, 308256, 306561, 304734, 303570, 303141, 302588, 301412, 300176, 299601, 299620, 299746, 299788, 299706, 299207, 298095, 296793, 296000, 295832, 295772, 295464, 295148, 295124, 295170, 294872, 294375, 294348, 295127, 296338, 297584, 299060, 301002, 302902, 303946, 304210, 304771, 306439, 308908, 311322, 313165, 314337, 314879, 315011, 315115, 315377, 315709, 316221, 317392, 319434, 321825, 323790, 324978, 325456, 325330, 324690, 323636, 322112, 320022, 317684, 315742, 314321, 312729, 310376, 307606, 305188]
53094C05188j850j625j625j562j439j236p67j34K30J98K04N61J011J106P11J2
53078B98983o38q78o55k91M8O55J518J769P66o09q98j72J4j018k098k003j101
53061B93392m56k79o4L10M57J34n41j231j442q96q6J16l23m22L86J387J688J434
53043B93564J271J165O73n2l86k00M2M5p2k55n92q29m59N35J406J409O33j49l40
53024B97409q1J5m02j002j098l83P13J383J147L14k63j3P07R89L92n81j135r27
53006B97184j15R25J652J654J187J000J227J086J86n74j90Q74J343R55N24M81
52990C09399M73M17P58J489J990K112K462L255L763L303K140J074O13P79J136
52975C35163R48j3q50n00O96J295O91k35o02o00o60o53l50J34P85J709K414K068
$$ y = [305188, 303338, 301713, 300088, 298526, 297087, 295851, 295084, 294950, 295180, 295378, 295582, 296143, 297154, 298260, 298971, 298983, 298345, 297467, 296812, 296521, 296569, 297224, 298742, 300511, 301277, 300668, 299770, 299598, 299612, 298594, 296496, 294493, 293392, 292936, 292657, 292593, 292903, 293360, 293494, 292953, 291722, 290280, 289384, 289298, 289414, 289091, 288669, 289055, 290442, 292130, 293564, 294835, 296000, 296673, 296621, 296235, 296035, 296077, 296122, 296050, 295795, 295203, 294374, 293915, 294450, 295856, 297265, 297898, 297749, 297409, 297328, 297343, 296941, 295939, 294841, 294458, 295171, 296554, 297701, 298015, 297752, 297739, 298446, 299435, 299827, 299246, 298111, 297184, 297069, 297994, 299646, 301300, 302487, 303487, 304714, 305800, 305986, 305412, 305222, 306096, 307439, 308394, 308918, 309399, 309872, 310289, 311047, 312536, 314526, 316638, 319100, 322355, 326118, 329421, 331561, 332635, 333248, 334027, 335163, 336111, 336098, 335248, 334748, 335444, 336739, 337430, 337195, 336593, 335993, 335333, 334680, 334330, 334464, 335249, 336958, 339372, 341440]
52957C41440R30L73R08J287L82j171k148k532k951l192k621j609j152j352j425
52942C25167j089q50q72o64n0M62N06L70L93M28J79k99o94q12o79n01n20q08j196
52923C18471j492j585j336o33K45O89M27j71o10p52n90k0P68J121O90M6L5O69
52905C15972J181J047M54j20l77k61P2K59N6l42m75k12J34K81M40J047K073K761
52887C23990K341R40m76j173j297j275j108o77k81j84J0P98J795K190J984J900
52871C29477K100J975J381J001J220J555J639J874K541L040K636J406n0j398k514
52856C47883l159l172k716k070j498j436k200l371m042l943l644l521l274k722
52842C07115k242k018j651r57l90k58l19n20j259k426l046k591j757j305r81k60
$$ y = [341440, 342370, 342743, 343651, 344938, 345320, 344149, 342001, 339469, 336518, 333326, 330705, 329096, 327944, 326592, 325167, 324078, 323228, 322356, 321692, 321642, 322104, 322610, 322980, 323373, 323801, 323980, 323681, 322987, 322175, 321496, 320995, 320475, 319667, 318471, 316979, 315394, 314058, 313425, 313670, 314359, 314786, 314615, 314005, 313253, 312663, 312643, 313411, 314532, 315222, 315268, 315303, 315972, 317153, 318200, 318654, 318534, 318157, 317896, 317968, 318227, 318283, 317941, 317466, 317254, 317388, 317669, 318109, 319156, 321229, 323990, 326331, 327271, 326795, 325622, 324325, 323050, 321942, 321265, 320984, 320800, 320810, 321608, 323403, 325593, 327577, 329477, 331577, 333552, 334933, 335934, 337154, 338709, 340348, 342222, 344763, 347803, 350439, 351845, 351795, 350397, 347883, 344724, 341552, 338836, 336766, 335268, 333832, 331632, 328261, 324219, 320276, 316632, 313111, 309837, 307115, 304873, 302855, 301204, 300247, 299857, 299599, 299280, 298760, 297501, 295075, 292029, 289438, 287681, 286376, 285395, 285135]
52826B85135O60J405K122K789K640J270l47r91p32m00j50L29P43M89j88m51n4
52809B94269N58J122J618J786J468J156J290J305L89j098k004k051k046k424k671
52794B92667k302j530p62j96p0n71j282j340m68O39J124Q38K90L4J67K65p9n64
52776B86860l92O17J605J764J310R26P22M06k7m06q24j288j357p87j37Mp0K16
52758B89142O63O88M32M95Q55R27N14j5k78l3Q95K085K543K015J620K170K632
52741C07350J607k77j080l05P18J077J184J328J079N45O35J410J643P46j79o4
52725C17417N65O89L77K43J59l91j199j619j553j375j103m79L16P17M79r7n77
52708C12569o87l64J70M84L37j24o10q80p33j48M87P02N47M63N21L41j49m48k03
$$ y = [285135, 285795, 287200, 289322, 292111, 294751, 296021, 295674, 294683, 293951, 293551, 293401, 293730, 294473, 294962, 294774, 294323, 294269, 294827, 295949, 297567, 299353, 300821, 301977, 303267, 304572, 304961, 303863, 301859, 299808, 297762, 295338, 292667, 290365, 288835, 288073, 287877, 287807, 287236, 285954, 284614, 284146, 284785, 285909, 286747, 287037, 287071, 287238, 287503, 287424, 286860, 286468, 287085, 288690, 290454, 291764, 292690, 293412, 293818, 293791, 293385, 292561, 291273, 289916, 289129, 288992, 288996, 288926, 289142, 289805, 290493, 290925, 291420, 292275, 293202, 293716, 293701, 293423, 293390, 294285, 296370, 298913, 300928, 302548, 304718, 307350, 308957, 308680, 307600, 307295, 308013, 309090, 310274, 311602, 312681, 313226, 313861, 315271, 316914, 317660, 317481, 317417, 317982, 318671, 319048, 319291, 319450, 319059, 317860, 316241, 314688, 313313, 312210, 311731, 312047, 312764, 313243, 313146, 312569, 311882, 311518, 311688, 312172, 312509, 312385, 311775, 310895, 310162, 310014, 310501, 311203, 311750, 312213, 312734, 313075, 312926, 312478, 312275]
52689C12275L10O37O29K90k78o48k65P65J597J611J055M97R8l13q40j465k053
52672C13902k208j550l41O45J029J142J261J128N89R8J17L82L29ml3N13J239J646
52654C19884J700J787K162K590K603K136J609J267P73j41j018j244j040j153j627
52639C30288j709j041j94K98O73J346K119K424J972Q60n37j543j502m69P54J506
52623C35245J786J738J185M0j201j900j942j685j426j232j098j103j393k010k571
52608C22433k365j215J4L27j2J87J274K238K227J601J037M57l21o66M8J157J301
52591C29722K24r31j230j001r55r58k77J233K679K978J969N70j31J32P86J181
52575C35991J197J060Q96O54L15n3m51r81j644k141k025j152%O92O31J97j49l47
$$ y = [312275, 312585, 313222, 313851, 314141, 313863, 313215, 312950, 313715, 315312, 316923, 317978, 318475, 318573, 318260, 317420, 315955, 313902, 311694, 310144, 309803, 310448, 311477, 312619, 313880, 315008, 315597, 315695, 315812, 316194, 316523, 316519, 316486, 316999, 318238, 319884, 321584, 323371, 325533, 328123, 330726, 332862, 334471, 335738, 336511, 336370, 335352, 334108, 333068, 331915, 330288, 328579, 327538, 327344, 327642, 328315, 329661, 331780, 334204, 336176, 337036, 336499, 334956, 333454, 332985, 333739, 335245, 337031, 338769, 339954, 339994, 338793, 336893, 334951, 333266, 331840, 330608, 329510, 328407, 327014, 325004, 322433, 320068, 318853, 318867, 319194, 319182, 319369, 320643, 322881, 325108, 326709, 327746, 328203, 327882, 327216, 327264, 328421, 329722, 329946, 329015, 327785, 326784, 325829, 324871, 324594, 325827, 328506, 331484, 333453, 334023, 333892, 334024, 334810, 335991, 337188, 338248, 339144, 339798, 340113, 340060, 339609, 338628, 336984, 334843, 332818, 331666, 331666, 332358, 332989, 333186, 333037, 332690]
52557C32690n00n26m10m43q11j174j166r78r82r92n52K11O89O98O25O23M36N6
52539C27494j06M2L6l49o29k82N36J216J290P45P1O2R88J994J914Q18J4L37J225
52520C37416J803K044K358K652K553K141J830J844K230L027L994M488M105L155
52506C75640K096R11n19j798k391k399k355k441k444k367k464k731k882k890l064
52491C47902l390l303k395j060j22Q0o4q8o9l14o78o35j46J21j73k58Q02K600
52473C38810L625L085J716O69L59P86K056L903N281N287M290L411L068K698J876
52458C80920R36K95k05r98k204l623m998n956n978m865l196j929j468j415j354
52443C43962j476k113k915l052k252j205o96p47q72q41q39r25q24l05L76N70q5
$$ y = [332690, 332190, 331664, 331254, 330811, 330000, 328826, 327660, 326682, 325700, 324708, 324156, 324367, 325056, 325754, 326379, 327002, 327438, 327494, 327388, 327430, 327466, 327117, 326488, 326206, 326742, 327958, 329248, 329993, 330064, 330126, 331114, 333108, 335022, 335840, 335854, 336191, 337416, 339219, 341263, 343621, 346273, 348826, 350967, 352797, 354641, 356871, 359898, 363892, 368380, 372485, 375640, 377736, 378647, 378128, 376330, 373939, 371540, 369185, 366744, 364300, 361933, 359469, 356738, 353856, 350966, 347902, 344512, 341209, 338814, 337754, 337632, 337712, 337648, 337560, 337491, 337177, 336499, 335864, 335718, 335839, 335666, 335408, 336210, 338810, 342435, 345520, 347236, 347905, 348264, 349050, 351106, 355009, 360290, 365577, 369867, 373278, 376346, 379044, 380920, 381856, 382151, 381946, 380948, 378744, 375121, 370123, 364167, 358189, 353324, 350128, 348199, 346731, 345316, 343962, 342486, 340373, 337458, 334406, 332154, 330949, 330253, 329506, 328634, 327793, 326954, 326029, 325205, 324900, 325276, 325846, 325761]
52426C25761j069j267k26J147J618J165P71Q62R43Q95J422K631L374K888K062
52411C42977K037K401K121J553K022L688N353O280O878P501P879P977Q151Q245
52397D15063P524N778L496Q66k288n362p056p025o379o097n964n492m792l972
52383C78300k702j057J21L76L88R15J735K274K555K901L237L354L304L079K489
52368D01269J735J475J868K206J892J027k12j853l348l577k366j074q45j146q53
52353C96198J1N98O35N04M31M62Q40J605K270K518K702L041K985K270J790K480
52337D21340L772M376M092L874M264M889N398N887O403O780P073P469P849Q007
52323E01473Q173Q715R539J0278J0828J1143J0848R770Q624Q418R297J0589J1796
$$ y = [325761, 324692, 323425, 323199, 324346, 325964, 327129, 327900, 328762, 329705, 330600, 332022, 334653, 338027, 340915, 342977, 345014, 347415, 349536, 351089, 353111, 356799, 362152, 368432, 375310, 382811, 390690, 398667, 406818, 415063, 422587, 428365, 431861, 432727, 430439, 425077, 418021, 410996, 404617, 398520, 392556, 387064, 382272, 378300, 375598, 374541, 374662, 375038, 375426, 376341, 378076, 380350, 382905, 385806, 389043, 392397, 395701, 398780, 401269, 403004, 404479, 406347, 408553, 410445, 411472, 411260, 409407, 406059, 402482, 400116, 399042, 398197, 397051, 396198, 396209, 396807, 397442, 397946, 398377, 398839, 399679, 401284, 403554, 406072, 408774, 411815, 414800, 417070, 418860, 421340, 425112, 429488, 433580, 437454, 441718, 446607, 452005, 457892, 464295, 471075, 478148, 485617, 493466, 501473, 509646, 518361, 527900, 538178, 549006, 560149, 570997, 580767, 589391, 597809, 607106, 617695, 629491]
52310F29491J2883J3861J4723J5752J7190J8688J9678K0144K0540K1115K1858
52299H25923K2840K4012K4869K4910K4235K3119K1334J8607J5522J3140J1756
52288A050267J0726R513Q234P086N906M451K799J311L52k6k88r87k002k595k488
52273A092259k325k622k926k604j916j585j747k045k332k525k231j287k55M63
52259A066322J519L653O250Q069R163J0768J3214J5302J6071J6034J6055J5970
52247A198390J5088J3476J1935J0958J0318R591Q679P723O753N590M101K454R99
52234A306055j75j304k562l788m772n546o368p525r146j0906j2104j2527j2997
52221A216335j4305j5773j5881j4449j2976j2575j2736j2654j2435j2253j1501
$$ y = [629491, 642374, 656235, 670958, 686710, 703900, 722588, 742266, 762410, 782950, 804065, 825923, 848763, 872775, 897644, 922554, 946789, 969908, 991242, 1009849, 1025371, 1038511, 1050267, 1060993, 1070506, 1078740, 1085826, 1091732, 1096183, 1098982, 1100293, 1100645, 1100619, 1100331, 1099344, 1097342, 1094747, 1092259, 1089934, 1087312, 1084386, 1081782, 1079866, 1078281, 1076534, 1074489, 1072157, 1069632, 1067401, 1066114, 1065859, 1066322, 1067841, 1071494, 1077744, 1085813, 1094976, 1105744, 1118958, 1134260, 1150331, 1166365, 1182420, 1198390, 1213478, 1226954, 1238889, 1249847, 1260165, 1269756, 1278435, 1286158, 1292911, 1298501, 1302602, 1305056, 1306055, 1305880, 1304576, 1302014, 1298226, 1293454, 1287908, 1281540, 1274015, 1264869, 1253963, 1241859, 1229332, 1216335, 1202030, 1186257, 1170376, 1155927, 1142951, 1130376, 1117640, 1104986, 1092551, 1080298, 1068797]
52210A068797r907q386p676p049n546l687k607k237j667p08J72R54J890K703L217
52195A028263M113N776P060O722N492N002N103M150J765o24k069l093m177m971
52181A058512n489o386p565p937p157o287o072n893n016l826l039k712k612k711
52167I85810k797k332j174J72J312K221K729K694K698L468M478M340K838J266
52153A007723M67j12r54j453j055k22N09J404K632L603L904M038M469M769M435
52138A034157L754L207K777K494K786L668M393M604N005O200P724Q888R802J0835
52124A110294J1886J2899J4246J5842J6715J6336J5590J5493J5735J5505J5070
52113A275611J5301J6156J6728J6569J6024J5535J5400J5964J7191J8302J8655
$$ y = [1068797, 1058890, 1050504, 1042828, 1035779, 1030233, 1026546, 1023939, 1021702, 1020035, 1019327, 1019499, 1020453, 1022343, 1025046, 1028263, 1032376, 1038152, 1045212, 1051934, 1057426, 1062428, 1067531, 1071681, 1073446, 1072822, 1070753, 1067660, 1063483, 1058512, 1053023, 1046637, 1039072, 1031135, 1023978, 1017691, 1011619, 1005726, 1000710, 996884, 993845, 991133, 988521, 985810, 983013, 980681, 979507, 979679, 980991, 983212, 985941, 988635, 991333, 994801, 999279, 1003619, 1006457, 1007723, 1008190, 1008078, 1007124, 1005671, 1004616, 1004394, 1004903, 1006307, 1008939, 1012542, 1016446, 1020484, 1024953, 1029722, 1034157, 1037911, 1041118, 1043895, 1046389, 1049175, 1052843, 1057236, 1061840, 1066845, 1073045, 1080769, 1089657, 1099459, 1110294, 1122180, 1135079, 1149325, 1165167, 1181882, 1198218, 1213808, 1229301, 1245036, 1260541, 1275611, 1290912, 1307068, 1323796, 1340365, 1356389, 1371924, 1387324, 1403288, 1420479, 1438781, 1457436]
52102A457436J8737J9419K0514K0866J9856J8012J6165J4611J3107J1140Q278
52091A638141M658J150j422l047m244n305o210p005p761q386q824r361j0257j1341
52077A560786j2225j2738j2866j2599j2152j1996j2271j2503j2197j1397j0331
52066A427511q920p037m933k900q51J395L687N738P537R160J0434J1168J1527
52053A463516J1881J2412J2955J3069J2234J0364Q163O509N482M530L531K984
52041A567630L011L000K602K269K383K541K174J245j03j942m153o217p896r510
52027A557034j1118j2145j2351j2482j3311j4580j5505j5827j5812j5709j5732
52016A402462j6075j6462j6247j5378j4609j4296j3773j2492j1020j0231j0221
$$ y = [1457436, 1476173, 1495592, 1516106, 1536972, 1556828, 1574840, 1591005, 1605616, 1618723, 1629863, 1638141, 1642799, 1643949, 1642527, 1639480, 1635236, 1629931, 1623721, 1616716, 1608955, 1600569, 1591745, 1582384, 1572127, 1560786, 1548561, 1535823, 1522957, 1510358, 1498206, 1486210, 1473939, 1461436, 1449239, 1437842, 1427511, 1418591, 1411554, 1406621, 1403721, 1402870, 1404265, 1407952, 1413690, 1421227, 1430387, 1440821, 1451989, 1463516, 1475397, 1487809, 1500764, 1513833, 1526067, 1536431, 1544594, 1551103, 1556585, 1561115, 1564646, 1567630, 1570641, 1573641, 1576243, 1578512, 1580895, 1583436, 1585610, 1586855, 1586752, 1584810, 1580657, 1574440, 1566544, 1557034, 1545916, 1533771, 1521420, 1508938, 1495627, 1481047, 1465542, 1449715, 1433903, 1418194, 1402462, 1386387, 1369925, 1353678, 1338300, 1323691, 1309395, 1295622, 1283130, 1272110, 1261879, 1251658]
52005A251658j0728j1858j3513j4857j5264j5251j5515j5719j5133j3942j2850
51994A097028j1960j1116j0820j1649j3104j4251j5224j6874j9094k0726k1143
51983I31067k0797k0197j9427j8775j8710j8922j8352j6588j4443j2835j1728
51972G40293j0460q597o141l357o60J595L330M523M969M632M022L583K882J111
51958G41725j656m286n844o465o832p229p320o583m876k624m12J709M142O899
51944G00348R294J0873J2140J3864J6151J8582K0823K2453K2767K1582J9831J8589
51932I07297J7707J6194J3652J0524P101L125j652p165j3184j9163k4179k7637
51920H82620k9789l0960l0702k8534k5136k1809j8917j5870j2530r530p214n195
$$ y = [1251658, 1240930, 1229072, 1215559, 1200702, 1185438, 1170187, 1154672, 1138953, 1123820, 1109878, 1097028, 1085068, 1073952, 1063132, 1051483, 1038379, 1024128, 1008904, 992030, 972936, 952210, 931067, 910270, 890073, 870646, 851871, 833161, 814239, 795887, 779299, 764856, 752021, 740293, 729833, 721236, 715095, 711738, 711078, 712673, 716003, 720526, 725495, 730127, 734149, 737732, 740614, 741725, 740069, 735783, 729939, 723474, 716642, 709413, 702093, 695510, 690634, 688010, 687598, 689307, 693449, 700348, 709642, 720515, 732655, 746519, 762670, 781252, 802075, 824528, 847295, 868877, 888708, 907297, 925004, 941198, 954850, 965374, 972475, 975600, 973948, 966783, 953599, 934436, 910257, 882620, 852831, 821871, 791169, 762635, 737499, 715690, 696773, 680903, 668373, 658843, 651629, 646434]
51908F46434l175j282M52K170L533L822K873J276m88k422m499o501q392j0202
51894F23599j1557j2044j1966j1923j1690j0529q577o874n764m409k234J85K151
51881E28368L860N741P584Q967R960J0763J1176J0961J0297R451Q378P057N668
51868F38231M080J763j219l636m236l156j698q33n38m14l08k55k23k25m91j262
51852F25580k418l411l843m052m840o439q084q910q943q776q601q196p648p363
51838E34056p277o750n406l613k023j012n93m55q1P37J543J761J412P75l16j984
51822E10774l299k927j002O37O15l62o76J39J112J244N00m29q63o45j99l3k26
51805E04360n04p17q46o68P3J063J603J536J404J587J870K038K248K432K044Q74
$$ y = [646434, 643259, 641977, 642429, 644599, 648132, 651954, 654827, 656103, 655615, 653193, 648694, 642193, 633801, 623599, 612042, 599998, 588032, 576109, 564419, 553890, 545313, 538439, 532675, 528266, 526032, 526217, 528368, 532228, 537969, 545553, 554520, 564480, 575243, 586419, 597380, 607677, 617128, 625506, 632563, 638231, 642311, 644074, 642855, 639219, 634983, 631827, 630129, 629296, 628758, 628344, 628036, 627781, 627558, 627333, 626842, 625580, 623162, 619751, 615908, 611856, 607016, 600577, 592493, 583583, 574640, 565864, 557263, 549067, 541419, 534056, 526779, 520029, 514623, 511010, 508987, 507975, 507382, 506927, 506846, 507583, 509126, 510887, 512299, 513074, 512758, 510774, 507475, 504548, 503546, 504183, 504798, 504436, 503760, 503899, 505011, 506255, 506755, 506326, 505463, 504818, 504619, 504586, 504360, 503856, 503139, 502293, 501625, 501698, 502761, 504364, 505900, 507304, 508891, 510761, 512799, 515047, 517479, 519523, 520397]
51789E20397l83q93o64k69j0J69K24P4k4L46J148J880K251K551L273M584O200
51772E40854P704Q792R307R183Q534P672O786N666M019K068L43j195l206n835
51758F00692q150r273r456r423r136q183o973o477o824p104o654n648m374k839
51744E00178j275k40J08K12M21P09J144J910K771L260L497M029M767M983M509
51729E30983M042L883L418K270J048M60M03N48R85J734K284K280J998J622P65
51714E58723o54j815k031j779j932k523l010l203l086k287o53R81J591J313J137
51699E40772J406J484Q73j20r26j309j359j346j612k144k361j783p59j17j98p86
51683E29715j709k869l796l914l335k779k576k243j288Q2J188J566J284Q38Q53
$$ y = [520397, 520014, 519121, 518457, 518188, 518178, 518347, 518571, 518645, 518621, 518967, 520115, 521995, 524246, 526797, 530070, 534654, 540854, 548558, 557350, 566657, 575840, 584374, 592046, 598832, 604498, 608517, 610585, 610928, 609733, 606527, 600692, 592542, 583269, 573813, 564390, 555254, 547071, 540098, 533621, 526797, 519693, 513039, 507391, 503017, 500178, 498903, 498663, 498771, 498983, 499404, 500113, 501257, 503167, 505938, 509198, 512695, 516724, 521491, 526474, 530983, 535025, 538908, 542326, 544596, 545644, 546104, 546507, 547055, 548040, 549774, 552058, 554338, 556336, 557958, 558723, 558069, 556254, 554223, 552444, 550512, 547989, 544979, 541776, 538690, 536403, 535750, 536731, 538322, 539635, 540772, 542178, 543662, 544535, 544415, 543489, 542180, 540821, 539475, 537863, 535719, 533358, 531575, 530816, 530699, 530501, 529715, 528006, 525137, 521341, 517427, 514092, 511313, 508737, 506494, 505206, 505288, 506476, 508042, 509326, 510164, 511017]
51668E11017J662L058M615O106P462Q544R277R786J0042R549P883N387K849N82
51654E97819j560l338m115l889l532l557l283j825M23K080K315J486K26j333l209
51639E74708m986o113o560o721o784o532n800m818l978l474l187k888k422j881
51625E08564j554j601j815j852j697j616j728j906k152k688l523m320m802n006
51611D72304m981m627l994l320k615j629m62L44O64J105K017K835L022L073L817
51596D67553N156O365P284Q282R290R809R830R812R720Q920P116M663J931q01
51582E64930k825l268k122l75J168K566M225O309Q834J1743J4754J7619K0355
51569F43913K2719K3898K3619K3234K4379K6715K8266K8158K7553K7613K8089
$$ y = [511017, 512679, 515737, 520352, 526458, 533920, 542464, 551741, 561527, 571569, 581118, 589001, 594388, 597237, 597819, 596259, 592921, 588806, 584917, 581385, 577828, 574545, 572720, 573143, 575223, 577538, 579024, 579250, 577917, 574708, 569722, 563609, 557049, 550328, 543544, 537012, 531212, 526394, 522416, 518942, 515755, 512867, 510445, 508564, 507010, 505409, 503594, 501742, 500045, 498429, 496701, 494795, 492643, 489955, 486432, 482112, 477310, 472304, 467323, 462696, 458702, 455382, 452767, 451138, 450676, 451020, 451684, 452789, 454806, 457641, 460663, 463736, 467553, 472709, 479074, 486358, 494640, 503930, 513739, 523569, 533381, 543101, 552021, 559137, 563800, 565731, 564930, 562105, 558837, 556715, 556340, 557508, 560074, 564299, 570608, 579442, 591185, 605939, 623558, 643913, 666632, 690530, 714149, 737383, 761762, 788477, 816743, 844901, 872454, 900067, 928156]
51558I28156K8522K9336L0711L1603L0936K8902K5947K1411J4369N329m023j2453
51546A158746j9677k5686l0482l4295l7264l9030l9151l7705l5061l1525k7569
51535H01301k3922k0825j7748j4381j1385r570q904q946r627j0881j2082j2593
51523F40437j2474j1969j0943r530q622q774r159q667p526o752o476n973n062
51510E28510m216l518k672k034k324l270l755l488l365l825l951k876j141Q4M83
51495D88642O03Q19R82R29P83P78R97J324J498J348R81O67M98L26m6o73j414j896
51477D97146j773j203q86j349k308l014l053k599k078j784j738j687j524j657
51463D70493k551l809m296l577k556k205k288k041j487j194j064l97R39K293L248
$$ y = [928156, 956678, 986014, 1016725, 1048328, 1079264, 1108166, 1134113, 1155524, 1169893, 1175222, 1171199, 1158746, 1139069, 1113383, 1082901, 1048606, 1011342, 972312, 933161, 895456, 860395, 828870, 801301, 777379, 756554, 738806, 724425, 713040, 703470, 694566, 685620, 675993, 665112, 653030, 640437, 627963, 615994, 605051, 595521, 586899, 578125, 568966, 560299, 552773, 546021, 539545, 533572, 528510, 524294, 520776, 518104, 516070, 513746, 510476, 506721, 503233, 499868, 496043, 492092, 489216, 488075, 488159, 488642, 489245, 490064, 491046, 491975, 492758, 493536, 494533, 495857, 497355, 498703, 499684, 500351, 500849, 501175, 501129, 500456, 499042, 497146, 495373, 494170, 493284, 491935, 489627, 486613, 483560, 480961, 478883, 477099, 475361, 473674, 472150, 470493, 467942, 464133, 459837, 456260, 453704, 451499, 449211, 447170, 445683, 444489, 443425, 443028, 443967, 446260, 449508]
51448D49508M092N122O205P207Q272R443J0446J1093J1573J2113J2539J2378J1278
51435E71269R320O965M707K815J494J094J601K030J074j446m423o920r004j0748
51421E69828j1517j1038j0205r831r264p490n068l604l506l545k807j785j280
51408D88888j185q65r0Q65J573J778J599J540J948K614L292M243N719P278Q316
51393E27513R055J0152J1564J2762J3950J5973J8920K1849K4221K6662K9827L3328
51381G55776L6382L8964M1707M4991M8519N1594N3529N3901N2704N0159M6363
51370A274589M1059L3653K3427J0272m502j8538l0172l9504m7379n3868n8395
51359A130642o0762o1155n9505n5918n1423m7182m3073l8238l2926k8519k5510
$$ y = [449508, 453600, 458722, 464927, 472134, 480406, 489849, 500295, 511388, 522961, 535074, 547613, 559991, 571269, 580589, 587554, 592261, 595076, 596570, 597664, 599265, 601295, 602369, 600923, 596500, 589580, 580576, 569828, 558311, 547273, 537068, 527237, 517973, 510483, 505415, 501811, 498305, 494760, 491953, 490168, 488888, 487703, 486838, 486748, 487613, 489186, 490964, 492563, 494103, 496051, 498665, 501957, 506200, 511919, 519197, 527513, 536568, 546720, 558284, 571046, 584996, 600969, 619889, 641738, 665959, 692621, 722448, 755776, 792158, 831122, 872829, 917820, 966339, 1017933, 1071462, 1125363, 1178067, 1228226, 1274589, 1315648, 1349301, 1372728, 1383000, 1378498, 1359960, 1329788, 1290284, 1242905, 1189037, 1130642, 1069880, 1008725, 949220, 893302, 841879, 794697, 751624, 713386, 680460, 651941, 626431]
51348F26431k2733j9130j5232j2226j0477r561r087q724p977o618n084l917l057
51335D92608k065q33K79Q60Q44N47L96M77M52R4l75p19j126j783k417k796l222
51318D81221l798l737k374n32K98nk34J45L92J34J77J144K427L155L267K914J816
51301D86410q5j962k945l106l070l126l218l294l174k638k008j948k332k033m59
51286D51012J427K322K226K083K319K603K780L174L985M959N703N959N694N137
51272E01383M628M196L550K606J698J151J007J258J828K207J738N73k75k66m6
51257E27236m57j412k376l317m452n410n479m588l500k968l118l645m246m758
51243D77510n031m716l478j599j48J3o32p56J36J152J364R54O75P85J003J081
$$ y = [626431, 603698, 584568, 569336, 557110, 546633, 537072, 527985, 519261, 511284, 504666, 499582, 495665, 492608, 490543, 489710, 489989, 490849, 491693, 492240, 492636, 493113, 493565, 493659, 493284, 492565, 491439, 489656, 487239, 484443, 481221, 477423, 473686, 471312, 470780, 471078, 471073, 470839, 470984, 471376, 471510, 471687, 472831, 475258, 478413, 481680, 484594, 486410, 486325, 484363, 481418, 478312, 475242, 472116, 468898, 465604, 462430, 459792, 457784, 455836, 453504, 451471, 451012, 452439, 454761, 456987, 459070, 461389, 463992, 466772, 469946, 473931, 478890, 484593, 490552, 496246, 501383, 506011, 510207, 513757, 516363, 518061, 519212, 520219, 521477, 523305, 525512, 527250, 527823, 527548, 527282, 527236, 526779, 525367, 522991, 519674, 515222, 509812, 504333, 499745, 496245, 493277, 490159, 486514, 482268, 477510, 472479, 467763, 464285, 462686, 462538, 462551, 461919, 461163, 461299, 462451, 463815, 464769, 465444, 466229, 467232, 468313]
51227D68313R54O69M43M88O02L35l23q78j043r66p25l07j12o09j284r34O28K086
51209D67337K384J967J751J737J562J516K066K966L681M194M573M417L624L076
51195E06851L455L902L040J021o30j070r07q99j061j252j661k238k413j865j159
51180E03114j176k094l161l278j910L52K171K701K335J984J867J493O18l36q81
51165E03799j030j095j266j500j634j553j303r84n44J07P57R72O28K2o18j307
51149D93451j858j790j019j52K60L17K99J18k71m44j20K43P1l82l43M25J364J807
51131D91976J512P61K59O47J727K461K133J167M49L07O07J302K217K749K496J899
51115E14669J632J668J604J552J916K491K610K162J716J659J806J917J995K058
$$ y = [468313, 469267, 469936, 470379, 470867, 471469, 471804, 471481, 470603, 469560, 468594, 467869, 467562, 467450, 466841, 465557, 464623, 465251, 467337, 469721, 471688, 473439, 475176, 476738, 478254, 480320, 483286, 486967, 491161, 495734, 500151, 503775, 506851, 510306, 514208, 517248, 518269, 517639, 516569, 515662, 514763, 513702, 512450, 510789, 508551, 506138, 504273, 503114, 501938, 499844, 496683, 493405, 491495, 491847, 494018, 496719, 499054, 501038, 502905, 504398, 505016, 504680, 503799, 502769, 501674, 500408, 498908, 497274, 495721, 494418, 493434, 492890, 492997, 493754, 494726, 495354, 495376, 494758, 493451, 491593, 489803, 488784, 488632, 488892, 489209, 489508, 489626, 489355, 488911, 488791, 489034, 489105, 488723, 488380, 488805, 490169, 491976, 493488, 494249, 494508, 495155, 496882, 499343, 501476, 502643, 503092, 503399, 504006, 505308, 507525, 510274, 512770, 514669, 516301, 517969, 519573, 521125, 523041, 525532, 528142, 530304, 532020, 533679, 535485, 537402, 539397, 541455]
51101E41455K080K173K395K442J954J107N05M69P18O80qj093j698j191j77K5q27
51084E51009j450r43j74k95q36n04O27J229Q26L30M10O39O01P21J481K693L953
51067E60317N104N968O377O781Q047J0277J2488J3904J4920J6294J8035J9634
51055F98146K0996K2380K3568K3631K1671J7731J3005R056O616N169L899K817
51043H68685K444K608K229N24k100m588o275p192p728q246q791r022q583p602
51029H06363o663o328o871q296j0172j1581j1706j0563q826o934m728k046Q12
51016G12461L287N048O179P150Q472J0142J1464J1714J0885R584Q355P401O692
51003H18834N929M682K976J450M62n45k180m001n070n379n700o136n832m325k287
$$ y = [541455, 543535, 545708, 548103, 550545, 552499, 553606, 554111, 554580, 555298, 555978, 555970, 554877, 553179, 551988, 551811, 551836, 551009, 549559, 548616, 548442, 548147, 547311, 546807, 547434, 548663, 549489, 549819, 550229, 550868, 551469, 552190, 553671, 556364, 560317, 565421, 571389, 577766, 584547, 592594, 602871, 615359, 629263, 644183, 660477, 678512, 698146, 719142, 741522, 765090, 788721, 810392, 828123, 841128, 850184, 856800, 861969, 865868, 868685, 871129, 873737, 875966, 876490, 874390, 869802, 863527, 856335, 848607, 840361, 831570, 822548, 813965, 806363, 799700, 793372, 786501, 778205, 768033, 756452, 744746, 734183, 725357, 718423, 713695, 711649, 712461, 715748, 720796, 726975, 734125, 742597, 752739, 764203, 775917, 786802, 796386, 804741, 812142, 818834, 824763, 829445, 832421, 833871, 834333, 833788, 831608, 827607, 822537, 817158, 811458, 805322, 799490, 795165, 792878]
50988G92878n42R02K474M347O460Q776J1142J3339J5449J7778K0264K2477K4345
50975I40089K6283K8433L0358L1778L3066L4655L6510L8568M1213M4785M8904
50964A334642N2747N5866N8470O1075O3984O6923O9019O9475O8383O6501O4164
50953B031249O0842N6039N0116M3770L7138K9858K1927J3902O381m24o482j1659
50941B332657j5743j8621k0371k1240k1716k2478k4093k6588k9310l1437l2597
50930B068463l2929l2698l2202l2025l2796l4489l6377l7885l9157m0501m1826
50919A675578m2941m3923m4709m4731m3561m1538l9287l6942l4404l1964l0007
50908A241571k8392k6712k4863k2891k0735j8649j7343j6849j6000j3971j1728
$$ y = [792878, 792336, 793238, 795712, 800059, 806519, 815295, 826437, 839776, 855225, 873003, 893267, 915744, 940089, 966372, 994805, 1025163, 1056941, 1090007, 1124662, 1161172, 1199740, 1240953, 1285738, 1334642, 1387389, 1443255, 1501725, 1562800, 1626784, 1693707, 1762726, 1832201, 1900584, 1967085, 2031249, 2092091, 2148130, 2198246, 2242016, 2279154, 2309012, 2330939, 2344841, 2351222, 2350798, 2344316, 2332657, 2316914, 2298293, 2277922, 2256682, 2234966, 2212488, 2188395, 2161807, 2132497, 2101060, 2068463, 2035534, 2002836, 1970634, 1938609, 1905813, 1871324, 1834947, 1797062, 1757905, 1717404, 1675578, 1632637, 1588714, 1544005, 1499274, 1455713, 1414175, 1374888, 1337946, 1303542, 1271578, 1241571, 1213179, 1186467, 1161604, 1138713, 1117978, 1099329, 1081986, 1065137, 1049137, 1035166, 1023438]
50897A023438j0682j0422r272o872m570l240k317j320p09o44l33O15J447J721
50883I76840K311L914N649O262N980O037O899Q061R219J0497J1734J2564J3228
50870A079195J4423J6269J8110J9481K0762K2619K5221K8190L1141L4047L7116
50859A346574M0460M4053M8083N3038N9116O5820P2588P9595Q7385R5820J04192
50848B096724J12337J20802J29707J38249J45580J51463J55764J58139J58551
50839C367316J57338J54284J48274J38477J25239J09342R1097P0754M9170K7347
50829D438638N732j5267l4499n0551o2917p2120p8830q3200q4859q3313p8702
50818C800112p2387o6290o1374n7352n4137n2756n4137n7759o2398o7637p3751
$$ y = [1023438, 1012756, 1002334, 993062, 986190, 981620, 978380, 976063, 974743, 974034, 973390, 973057, 973672, 975119, 976840, 979151, 983065, 988714, 994976, 1000956, 1006993, 1013892, 1021953, 1031172, 1041669, 1053403, 1065967, 1079195, 1093618, 1109887, 1127997, 1147478, 1168240, 1190859, 1216080, 1244270, 1275411, 1309458, 1346574, 1387034, 1431087, 1479170, 1532208, 1591324, 1657144, 1729732, 1809327, 1896712, 1992532, 2096724, 2209061, 2329863, 2459570, 2597819, 2743399, 2894862, 3050626, 3208765, 3367316, 3524654, 3678938, 3827212, 3965689, 4090928, 4200270, 4291367, 4362121, 4411291, 4438638, 4444370, 4429103, 4394604, 4344053, 4281136, 4209016, 4130186, 4046986, 3962127, 3878814, 3800112, 3727725, 3661435, 3600061, 3542709, 3488572, 3435816, 3381679, 3323920, 3261522, 3193885, 3120134]
50807C120134q0493q7038r2923r8091j02136j04387j04803j03873j01568r7248
50797B147574r0833q3320p5770o8417o1120n4079m7545m1211l4596k7924k2051
50786A540708j7418j3530r798o424m063k729j754r09q14j813l100l742m043m979
50772A465592o538p695q072q453r402j0484j1301j2293j3752j4956j5178j4875
50760A332593j4953j5308j5039j3834j2207j0574q877p120n466l638j041K427
50748A226963O046R182J2049J5341J9295K3443K7354L1312L5933M1133M5977M9903
50736A543931N3564N7853O2496O6534O9982P3751P7839Q0871Q2051Q2331Q2859
50725B334062Q3137Q1851P8790P4864P0587O5570N9297N1535M2094L0929J8453
$$ y = [3120134, 3039641, 2952603, 2859680, 2761589, 2659453, 2555066, 2450263, 2346390, 2244822, 2147574, 2056741, 1973421, 1897651, 1829234, 1768114, 1714035, 1666490, 1625279, 1590683, 1562759, 1540708, 1523290, 1509760, 1499962, 1493538, 1489475, 1486746, 1484992, 1484083, 1483269, 1481456, 1478356, 1474614, 1470571, 1465592, 1459054, 1451359, 1443287, 1434834, 1425432, 1414948, 1403647, 1391354, 1377602, 1362646, 1347468, 1332593, 1317640, 1302332, 1287293, 1273459, 1261252, 1250678, 1241801, 1234681, 1229215, 1225577, 1224536, 1226963, 1233009, 1242191, 1254240, 1269581, 1288876, 1312319, 1339673, 1370985, 1406918, 1448051, 1494028, 1543931, 1597495, 1655348, 1717844, 1784378, 1854360, 1928111, 2005950, 2086821, 2168872, 2251203, 2334062, 2417199, 2499050, 2577840, 2652704, 2723291, 2788861, 2848158, 2899693, 2941787, 2972716, 2991169]
50714B991169N178q780k3142l6701m7852n5887o1260o4570o5819o4661o0988n5312
50702B451375m8796m2660l7318l2385k7755k4234k2713k3273k5532k9222l3911
50691B103576l8756m3309m7931n2679n6403n7882n7346n5781n3236m9064m3586
50680A547603l8097l3102k7798k1575j5051r147m069M71M677Q775J3016J7232
50668A442935K0780K3203K4597K5282K5566K5741K5758K4998K3024K0553J8940
50657A701377J8562J8543J8175J7829J8099J8828J9430J9666J9702J9838K0502
50646A910551K2030K4196K6391K8512L1167L4609L8030M0409M1723M2848M4435
50635B284901M6314M7884M8715M8806M8437M7816M6801M5111M2758M0077L7329
$$ y = [2991169, 2996347, 2987567, 2964425, 2927724, 2879872, 2823985, 2762725, 2698155, 2632336, 2567675, 2506687, 2451375, 2402579, 2359919, 2322601, 2290216, 2262461, 2238227, 2215514, 2192241, 2166709, 2137487, 2103576, 2064820, 2021511, 1973580, 1920901, 1864498, 1806616, 1749270, 1693489, 1640253, 1591189, 1547603, 1509506, 1476404, 1448606, 1427031, 1411980, 1402833, 1398764, 1399235, 1403912, 1412687, 1425703, 1442935, 1463715, 1486918, 1511515, 1536797, 1562363, 1588104, 1613862, 1638860, 1661884, 1682437, 1701377, 1719939, 1738482, 1756657, 1774486, 1792585, 1811413, 1830843, 1850509, 1870211, 1890049, 1910551, 1932581, 1956777, 1983168, 2011680, 2042847, 2077456, 2115486, 2155895, 2197618, 2240466, 2284901, 2331215, 2379099, 2427814, 2476620, 2525057, 2572873, 2619674, 2664785, 2707543, 2747620, 2784949]
50624B784949L4549L1791K9127K6156K1729J4518M022q787k1638l1962l8100l9851
50612B806503l7986l3543k7670k1696j6745j3278j1254j0631j1347j3095j5605
50601B593653j9073k3861k9776l6084m2271m8312n4156n9329o3220o5540o6482
50590B085549o6575o6276o5549o4009o1648n9054n6541n3604m9741m5456m1603
50579A455493l8069l4084k9660k5732k2674j9661j5934j1850q127m718j105K727
50567A246606O246R144J1578J3711J5461J6810J8073J9666K1618K3483K4826K5714
50555A452936K6524K7289K7677K7710K8031K9083L0486L1690L2812L4182L5398
50544A783818L5695L5152L4745L5168L6278L7789L9807M2429M5436M8671N2310
$$ y = [2784949, 2819498, 2851289, 2880416, 2906572, 2928301, 2942819, 2946841, 2938054, 2916416, 2884454, 2846354, 2806503, 2768517, 2734974, 2707304, 2685608, 2668863, 2655585, 2644331, 2633700, 2622353, 2609258, 2593653, 2574580, 2550719, 2520943, 2484859, 2442588, 2394276, 2340120, 2280791, 2217571, 2152031, 2085549, 2018974, 1952698, 1887149, 1823140, 1761492, 1702438, 1645897, 1592293, 1542552, 1497096, 1455493, 1417424, 1383340, 1353680, 1327948, 1305274, 1285613, 1269679, 1257829, 1249702, 1244984, 1243879, 1246606, 1252852, 1261996, 1273574, 1287285, 1302746, 1319556, 1337629, 1357295, 1378913, 1402396, 1427222, 1452936, 1479460, 1506749, 1534426, 1562136, 1590167, 1619250, 1649736, 1681426, 1714238, 1748420, 1783818, 1819513, 1854665, 1889410, 1924578, 1960856, 1998645, 2038452, 2080881, 2126317, 2174988, 2227298]
50533B227298N6539O1225O6075P0791P5205P9454Q4023Q9170R4483R9435J04061
50522C107759J08469J11962J13462J12801J10681J07375J02282R4896Q5321P3602
50512D128610N9563M3648K7134J0965m977k0998l6677n1288o4383p5388q3301
50501C932908q7595q8869q7805q3909p6182o4854n1643l8269k5417j3232k069
50490C313064P563J5343K0920K3515K2219J6807P964l529j7619l4536n3490p2358
50478C245863q8983j02410j12517j19041j21715j21097j18362j14198j08583j01660
50468B137297r4099q6455p8875p1683o5528o0540n5902n0661m4703l8641l3123
50457A457087k8389k4114j9524j4085q250l072R48M227P256J0107J2925J6167
$$ y = [2227298, 2283837, 2345062, 2411137, 2481928, 2557133, 2636587, 2720610, 2809780, 2904263, 3003698, 3107759, 3216228, 3328190, 3441652, 3554453, 3665134, 3772509, 3874791, 3969687, 4055008, 4128610, 4188173, 4231821, 4258955, 4269920, 4264943, 4243945, 4207268, 4155980, 4091597, 4016209, 3932908, 3845313, 3756444, 3668639, 3584730, 3508548, 3443694, 3392051, 3353782, 3328365, 3315133, 3313064, 3320627, 3335970, 3356890, 3380405, 3402624, 3419431, 3427395, 3423866, 3406247, 3371711, 3318221, 3245863, 3156880, 3054470, 2941953, 2822912, 2701197, 2580100, 2461738, 2347540, 2238957, 2137297, 2043198, 1956743, 1877868, 1806185, 1740657, 1680117, 1624215, 1573554, 1528851, 1490210, 1457087, 1428698, 1404584, 1385060, 1370975, 1362725, 1359653, 1360601, 1364828, 1372084, 1382191, 1395116, 1411283]
50445A411283J9865K3166K5169K5986K6580K7769K9520L0919L0754K8458K4606
50434A704075K0197J5499J0147M319q98m509o357o833o441n798n243m263k063
50421A711832J081L961O214Q898J2778J7093K0806K4209K8289L3172L8139M2743
50409A949215M7001N0829N4131N7112N9693O1028O0433N8482N6277N3845N0152
50398B558198M4641L7818L0301K2072J2922L080o878j6465k5616l4734m4122n3094
50386B528123o0103o4161o5692o5515o3573n9494n3832m7659m1144l3702k5514
50375A947734j7775j1238n540l21L956O663P701P003M128r77p336j3799k0177
50362A900022k6978l4181m0796m5535m7608m7045m4704m1818l9114l6350l2915
$$ y = [1411283, 1431148, 1454314, 1479483, 1505469, 1532049, 1559818, 1589338, 1620257, 1651011, 1679469, 1704075, 1724272, 1739771, 1749918, 1754237, 1753339, 1748830, 1742473, 1735640, 1729199, 1723401, 1718158, 1713895, 1711832, 1712913, 1716874, 1723088, 1731986, 1744764, 1761857, 1782663, 1806872, 1835161, 1868333, 1906472, 1949215, 1996216, 2047045, 2101176, 2158288, 2217981, 2279009, 2339442, 2397924, 2454201, 2508046, 2558198, 2602839, 2640657, 2670958, 2693030, 2705952, 2709032, 2702154, 2685689, 2660073, 2625339, 2581217, 2528123, 2468020, 2403859, 2338167, 2272652, 2209079, 2149585, 2095753, 2048094, 2006950, 1973248, 1947734, 1929959, 1918721, 1913181, 1912860, 1916816, 1923479, 1931180, 1938183, 1942311, 1941334, 1933998, 1920199, 1900022, 1873044, 1838863, 1798067, 1752532, 1704924, 1657879, 1613175, 1571357, 1532243, 1495893, 1462978]
50351A462978k8911k5296k2956k1903k1555k1604k2338k4090k6549k8761k9836
50340A189179k9521k8085k5855k3009j9694j6160j2713r635p137n266l822k450
50328A005832q46J042K967M549N554O089O469O897P351P737P992Q048P940P930
50314A085551Q316R008R452R175Q336P655P730Q485R302R822J0490J2057J4497
50301A209876J6871J8545J9951K1713K3525K4647K5205K5912K6632K6180K3690
50290A462747J9113J2161K089j0610k3191l2430l7119l8196l7074l4719l1910
50279A250861k9200k6458k3158j9276j5406j1979q909o026l408j169O74K126L209
50266A111881M167N373P007Q973J1019J2808J4099J4951J5603J6059J6151J6084
$$ y = [1462978, 1434067, 1408771, 1385815, 1363912, 1342357, 1320753, 1298415, 1274325, 1247776, 1219015, 1189179, 1159658, 1131573, 1105718, 1082709, 1063015, 1046855, 1034142, 1024507, 1017370, 1012104, 1008282, 1005832, 1004986, 1006028, 1008995, 1013544, 1019098, 1025187, 1031656, 1038553, 1045904, 1053641, 1061633, 1069681, 1077621, 1085551, 1093867, 1102875, 1112327, 1121502, 1129838, 1137493, 1145223, 1153708, 1163010, 1172832, 1183322, 1195379, 1209876, 1226747, 1245292, 1265243, 1286956, 1310481, 1335128, 1360333, 1386245, 1412877, 1439057, 1462747, 1481860, 1494021, 1496110, 1485500, 1462309, 1429879, 1392760, 1354564, 1317490, 1282771, 1250861, 1221661, 1195203, 1172045, 1152769, 1137363, 1125384, 1116475, 1110449, 1107041, 1105872, 1106546, 1108672, 1111881, 1116048, 1121421, 1128428, 1137401, 1148420, 1161228, 1175327, 1190278, 1205881, 1221940, 1238091, 1254175]
50254A254175J6421J7227J7668J6920J5049J2667J0142P636N475L890K691J654
50242A381615P87k23k226n425q569j0281j0849j1598j2728j2973j1528r115o856
50229A280031n109l869l412l907n154p238j0746j5608k0292k3022k3537k2979
50217A135158k2286k1398j9971j8123j6221j4445j2767j1196r825q802q247q111
50205I63766q091p932p794q086q842r521r600r159q676q386q183q019q016q092
50191H45369p894p279o554n976n366m538l747l278k844k015r98l75j82R1N72Q79
50175G95865R91J386K092K447K184J942K172K290J646P17M84J055J734K125K475
50160H21605L003L672M432N152N426N094M779N296O599Q014R318J0922J2933J4849
$$ y = [1254175, 1270596, 1287823, 1305491, 1322411, 1337460, 1350127, 1360269, 1367905, 1373380, 1377270, 1379961, 1381615, 1382402, 1382179, 1379953, 1374528, 1365959, 1355678, 1344829, 1333231, 1320503, 1307530, 1296002, 1286887, 1280031, 1274922, 1271053, 1267641, 1263734, 1258580, 1251342, 1240596, 1224988, 1204696, 1181674, 1158137, 1135158, 1112872, 1091474, 1071503, 1053380, 1037159, 1022714, 1009947, 998751, 988926, 980124, 971877, 963766, 955675, 947743, 939949, 931863, 923021, 913500, 903900, 894741, 886065, 877679, 869496, 861477, 853461, 845369, 837475, 830196, 823642, 817666, 812300, 807762, 804015, 800737, 797893, 795878, 794880, 794505, 794323, 794414, 794986, 795865, 796856, 798242, 800334, 802781, 804965, 806907, 809079, 811369, 813015, 813732, 814216, 815271, 817005, 819130, 821605, 824608, 828280, 832712, 837864, 843290, 848384, 853163, 858459, 865058, 873072, 882390, 893312, 906245, 921094]
50146I21094J6294J7457J8529J9271J9511J9673K0479K2250K4645K6939K8499
50135A154641K9105K8926K8220K7174K6122K5455K5150K4600K3200K0832J7536
50124A430961J3142P660J676m214j0050j6038k1702k6167k9125l0936l1798l1520
50112A251889l0134k8180k6237k4458k2653k0550j8073j5691j4209j3854j3886
50101A023964j3572j3149j3177j3326j2724j1317r963r127q470p799p521p750
50089H96069p821p175o164n482n251n104m864m669m610m558m257l503k432j534
50075H28645j123q42m8J305K659L659M496N305N869O103O367O945P628Q094Q355
50060H93417Q494Q242P238N621M068L197K952K697J880O30m57j064j365j445r74
$$ y = [921094, 937388, 954845, 973374, 992645, 1012156, 1031829, 1052308, 1074558, 1099203, 1126142, 1154641, 1183746, 1212672, 1240892, 1268066, 1294188, 1319643, 1344793, 1369393, 1392593, 1413425, 1430961, 1444103, 1451763, 1453439, 1449225, 1439175, 1423137, 1401435, 1375268, 1346143, 1315207, 1283409, 1251889, 1221755, 1193575, 1167338, 1142880, 1120227, 1099677, 1081604, 1065913, 1051704, 1037850, 1023964, 1010392, 997243, 984066, 970740, 958016, 946699, 936736, 927609, 919139, 911340, 903819, 896069, 888248, 881073, 874909, 869427, 864176, 859072, 854208, 849539, 844929, 840371, 836114, 832611, 830179, 828645, 827522, 826680, 826632, 827937, 830596, 834255, 838751, 844056, 849925, 856028, 862395, 869340, 876968, 885062, 893417, 901911, 910153, 917391, 923012, 927080, 930277, 933229, 935926, 937806, 938436, 937979, 936915, 935550, 934105, 933131]
50045I33131J84J444K083K100K055K342L130M653O867R002J0181J0432J0532J0957
50031A009093J1676J2780J4499J6542J8227J9343K0253K1140K1859K2507K3334
50020A211253K4014K3901K3165K2700K2655K2026K0159J7673J5249J2386Q367
50009A423548L867N66p61j012j673l525o433r866j3405j6856k0060k2658k4327
49996A307405k5192k5679k5863k5335k3862k1891k0164j9077j8612j8620j8983
49985A064127j9631k0467k1214k1379k0660j9345j7951j6592j5050j3372j1887
49974H66579j0626r238p566n853m346l113k306k042j953j450n52N7M2k8N80J876
49958H20061L303M404N173N957P100Q503R544R797R643R738R932R332P398M491
$$ y = [933131, 933315, 934759, 936842, 938942, 940997, 943339, 946469, 951122, 957989, 966991, 977172, 987604, 998136, 1009093, 1020769, 1033549, 1048048, 1064590, 1082817, 1102160, 1122413, 1143553, 1165412, 1187919, 1211253, 1235267, 1259168, 1282333, 1305033, 1327688, 1349714, 1369873, 1387546, 1402795, 1415181, 1423548, 1427415, 1427981, 1427220, 1426208, 1424535, 1421010, 1414577, 1404711, 1391306, 1374450, 1354390, 1331732, 1307405, 1282213, 1256534, 1230671, 1205336, 1181474, 1159583, 1139419, 1120342, 1101730, 1083110, 1064127, 1044496, 1024029, 1002815, 981436, 960776, 941431, 923480, 906888, 891838, 878466, 866579, 855953, 846715, 839149, 833296, 828950, 825837, 823531, 821489, 819536, 818086, 817534, 817591, 817633, 817605, 818185, 820061, 823364, 827768, 832941, 838898, 845998, 854501, 864045, 873842, 883485, 893223, 903155, 912487, 919885, 924376]
49944I24376J344j431l367m322m777n387o223o934p502q153q721q905r043r745
49930H41210j0714j1000j0482r992r815r183p627n749m183k802j486o09j87N02
49916G57883J759K864L365M003N471P146Q029Q234Q509Q942R183R502J0491J1959
49902H57340J3020J3219J2792J2014J0949R743Q537P186N491L496J214j601m917
49889I48483q133j0707j2700j4254j5082j4997j4405j3719j2777j1466j0281r579
$$ y = [924376, 925720, 924289, 920922, 916600, 911823, 906436, 900213, 893279, 885777, 877624, 868903, 859998, 850955, 841210, 830496, 819496, 809014, 799022, 789207, 780024, 772397, 766648, 762465, 759663, 758177, 757568, 757381, 757883, 759642, 762506, 765871, 769874, 775345, 782491, 790520, 798754, 807263, 816205, 825388, 834890, 845381, 857340, 870360, 883579, 896371, 908385, 919334, 929077, 937614, 944800, 950291, 953787, 955001, 953400, 948483, 940350, 929643, 916943, 902689, 887607, 872610, 858205, 844486, 831709, 820243, 809962, 800383]
$$ [...]
##END NTUPLES=NMR SPECTRUM
##END=
