##TITLE=AC1646_HPIAH13379_8569811_LtuT1ecJIy
##JCAMPDX= 6.0         $$ Bruker NMR JCAMP-DX V2.0
##DATA TYPE= NMR SPECTRUM
##DATA CLASS= NTUPLES
##ORIGIN= BRUKER
##OWNER= Administrator
$$ 1.72 TOPSPIN		Version 2.1
$$ 2014-04-10 22:53:08.229 -0700  Administrator@X
$$ Compression mode = diff/dup
##.OBSERVE FREQUENCY= 400.02188249412
##.OBSERVE NUCLEUS= ^1H
##.ACQUISITION MODE= SIMULTANEOUS (DQD)
##.ACQUISITION SCHEME= undefined
##.AVERAGES= 64
##.DIGITISER RES= 22
##SPECTROMETER/DATA SYSTEM= spect
##.PULSE SEQUENCE= noesygpps1d.comp
##.SOLVENT NAME= COFFEE_meoh
##.SHIFT REFERENCE= INTERNAL, COFFEE_meoh, 1, 14.96113
##AUDIT TRAIL= $$ (NUMBER, WHEN, WHO, WHERE, PROCESS, VERSION, WHAT)
$$ ##TITLE= Audit trail, TOPSPIN		Version 2.1
$$ ##JCAMPDX= 5.01
$$ ##ORIGIN= Bruker BioSpin GmbH
$$ ##OWNER= Administrator
$$ $$ E:\/data/COFFEE/nmr/AC1646_HPIAH13379_8569811_LtuT1ecJIy/12/pdata/1/auditp.txt
$$ ##AUDIT TRAIL=  $$ (NUMBER, WHEN, WHO, WHERE, PROCESS, VERSION, WHAT)
(   1,<2014-04-10 22:53:01.995 -0700>,<Administrator>,<X>,<go>,<TOPSPIN 2.1>,
      <created by zg
	started at 2014-04-10 22:41:32.135 -0700,
	POWCHK enabled, PULCHK disabled,
       configuration hash MD5:
       C8 4E 4E 5D D3 5C D8 9E 9F 52 82 E0 59 8A DE 15
       data hash MD5: 64K
       E0 D4 C9 C5 E7 2E 86 3A 18 DC ED 6C C4 0A 12 A6>)
(   2,<2014-04-10 22:53:05.291 -0700>,<Administrator>,<X>,<proc1d>,<TOPSPIN 2.1>,
      <Start of raw data processing
       efp LB = 0.3 FT_mod = 6 PKNL = 1 PHC0 = 0 PHC1 = 0 SI = 128K 
       data hash MD5: 128K
       2E 58 37 37 92 AE C1 99 08 F7 89 E5 71 68 5E 09>)
(   3,<2014-04-10 22:53:06.479 -0700>,<Administrator>,<X>,<proc1d>,<TOPSPIN 2.1>,
      <pk PHC0 = -83.47412 PHC1 = 0 
       data hash MD5: 128K
       8D C4 1C B7 3A 73 02 82 00 DD A2 A3 EF 02 B2 E7>)
(   4,<2014-04-10 22:53:07.276 -0700>,<Administrator>,<X>,<proc1d>,<TOPSPIN 2.1>,
      <abs ABSG = 1 
       data hash MD5: 128K
       80 8A 3A AF C7 DB 63 C4 73 CF 10 18 0E BC 0D 7C>)
(   5,<2014-04-10 22:53:07.416 -0700>,<Administrator>,<X>,<proc1d>,<TOPSPIN 2.1>,
      <abs ABSG = 2 
       data hash MD5: 128K
       16 D1 E9 AC 28 EA 55 78 F1 3A 29 00 BA 27 55 FF>)
(   6,<2014-04-10 22:53:07.604 -0700>,<Administrator>,<X>,<proc1d>,<TOPSPIN 2.1>,
      <abs ABSG = 3 
       data hash MD5: 128K
       7E 35 E1 91 83 49 F3 DD C8 4B 6B DA 2D E4 29 12>)
(   7,<2014-04-10 22:53:07.682 -0700>,<Administrator>,<X>,<proc1d>,<TOPSPIN 2.1>,
      <abs ABSG = 4 
       data hash MD5: 128K
       97 8A 17 36 1F 13 61 FA 7B 64 52 CB 06 6C F5 95>)
(   8,<2014-04-10 22:53:07.885 -0700>,<Administrator>,<X>,<proc1d>,<TOPSPIN 2.1>,
      <abs ABSG = 5 
       data hash MD5: 128K
       75 63 D6 15 B6 EF AF 6A 40 0F 75 39 00 FC 9B 0C>)
$$ ##END=
$$ 
$$ $$ hash MD5
$$ $$ CB A3 8E 89 8A F3 4F 7F 92 0C 23 84 31 83 72 82
##$RELAX= 
##$RELAX= 
##$RELAX= 
##$RELAX= 
##$RELAX= 
##$RELAX= 
##$RELAX= 
##$RELAX= 
$$ Bruker specific parameters
$$ --------------------------
##$DU= <E:\>
##$EXPNO= 12
$$ [...]
##$TP07= 0
##$TPNAME0= <>
##$TPNAME1= <>
##$TPNAME2= <>
##$TPNAME3= <>
##$TPNAME4= <>
##$TPNAME5= <>
##$TPNAME6= <>
##$TPNAME7= <>
##$TPOAL= (0..7)
0.5 0.5 0.5 0.5 0.5 0.5 0.5 0.5
##$TPOFFS= (0..7)
0 0 0 0 0 0 0 0
##$TUNHIN= 0
##$TUNHOUT= 0
##$TUNXOUT= 0
##$USERA1= <user>
##$USERA2= <user>
##$USERA3= <user>
##$USERA4= <user>
##$USERA5= <user>
##$V9= 5
##$VALIST= <valist>
##$VCLIST= <CCCCCCCCCCCCCCC>
##$VD= 0
##$VDLIST= <DDDDDDDDDDDDDDD>
##$VPLIST= <PPPPPPPPPPPPPPP>
##$VTLIST= <TTTTTTTTTTTTTTT>
##$WBST= 1024
##$WBSW= 4
##$XGAIN= (0..3)
0 0 0 0
##$XL= 0
##$YL= 0
##$YMAX_a= 6183224
##$YMIN_a= -13557747
##$ZGOPTNS= <>
##$ZL1= 120
##$ZL2= 120
##$ZL3= 120
##$ZL4= 120
##$ABSF1= 14.96113
##$ABSF2= -5.597052
##$ABSG= 5
##$ABSL= 3
##$ALPHA= 0
##$AQORDER= 0
##$ASSFAC= 0
##$ASSFACI= 0
##$ASSFACX= 0
##$ASSWID= 0
##$AUNMP= <proc_prof1d_extract.lims>
##$AXLEFT= 0
##$AXNAME= <>
##$AXNUC= <1H>
##$AXRIGHT= 0
##$AXTYPE= 0
##$AXUNIT= <>
##$AZFE= 0.1
##$AZFW= 0.1
##$BCFW= 0
##$BC_mod= 0
##$BYTORDP= 0
##$COROFFS= 0
##$CY= 15
##$DATMOD= 1
##$DC= 0
##$DFILT= <>
##$DTYPP= 0
##$F1P= 0
##$F2P= 0
##$FCOR= 0.5
##$FTSIZE= 131072
##$FT_mod= 6
##$GAMMA= 0
##$GB= 0
##$INTBC= 1
##$INTSCL= 1
##$ISEN= 128
##$LB= 0.3
##$LEV0= 0
##$LPBIN= 0
##$MAXI= 10000
##$MC2= 0
##$MEAN= 0
##$ME_mod= 0
##$MI= 0
##$NCOEF= 0
##$NC_proc= -2
##$NLEV= 6
##$NOISF1= 0
##$NOISF2= 0
##$NSP= 0
##$NTH_PI= 0
##$NZP= 0
##$OFFSET= 14.96113
##$PC= 1
##$PHC0= -83.47412
##$PHC1= 0
##$PH_mod= 1
##$PKNL= yes
##$PPARMOD= 0
##$PPDIAG= 0
##$PPIPTYP= 0
##$PPMPNUM= 2147483647
##$PPRESOL= 1
##$PSCAL= 4
##$PSIGN= 0
##$PYNMP= <proc.py>
##$REVERSE= no
##$SF= 400.020009583796
##$SI= 131072
##$SIGF1= 0
##$SIGF2= 0
##$SINO= 400
##$SIOLD= 131072
##$SPECTYP= <>
##$SREGLST= <1H.CDCl3>
##$SSB= 0
##$STSI= 131072
##$STSR= 0
##$SW_p= 8223.68421052631
##$SYMM= 0
##$S_DEV= 0
##$TDeff= 65536
##$TDoff= 0
##$TI= <>
##$TILT= no
##$TM1= 0
##$TM2= 0
##$TOPLEV= 0
##$USERP1= <user>
##$USERP2= <user>
##$USERP3= <user>
##$USERP4= <user>
##$USERP5= <user>
##$WDW= 1
##$XDIM= 131072
##$YMAX_p= 376611107
##$YMIN_p= -13507
##$CURPLOT= <Network HP LaserJet P1505>
##$CURPRIN= <$Network HP LaserJet P1505>
##$DFORMAT= <normdp>
##$LAYOUT= <+/1D_H.xwp>
##$LFORMAT= <normlp>
##$PFORMAT= <normpl>
##$SURQMSG= 1
$$ End of Bruker specific parameters
$$ ---------------------------------
##NTUPLES= NMR SPECTRUM
##VAR_NAME=  FREQUENCY,     SPECTRUM/REAL,   SPECTRUM/IMAG
##SYMBOL=    X,             R,               I
##VAR_TYPE=  INDEPENDENT,   DEPENDENT,       DEPENDENT
##VAR_FORM=  AFFN,          ASDF,            ASDF
##VAR_DIM=   131072,        131072,          131072
##UNITS=     HZ,            ARBITRARY UNITS, ARBITRARY UNITS
##FACTOR=    0.0627417313425164, 1,          1
##FIRST=     8223.62146879497, -1834,        -61993
##LAST=      0,             612,             -62394
##MIN=       0,             -13507,          0
##MAX=       8223.62146879497, 376611107,    0
$$ Real data points
##PAGE= N=1
##DATA TABLE= (X++(R..R)), XYDATA
$$ [...]
63840A023536l1004l1248l2092l3837l5444l5678l4685l3699l3232l2529l0985
63829F59103k9079k7463k5942k3947k1406j8646j6014j3995j3063j2989j2803
63818D43756j1887j0583r419q333p173o193n576m960m038l147k735k700k744k824
63804C61444k817k391j711j605k346l006k852k619l338m478m580l464k531k740
63790C20966l491l743l295k538j743j110r19j157j363j142n92n3K87L25Nn33r41
63773B98963j004p90m76j88n8k03n49q47q69n72j39M0l42j061j484j346j099j142
63755B86834j158o74M4K79q1m01j09P61J855K726K944K464J874J800K114K292
63739C03564K357K772L414L468K608J559J125J215J280J169J173J462J990K730
$$ y = [1023536, 992532, 961284, 929192, 895355, 859911, 824233, 789548, 755849, 722617, 690088, 659103, 630024, 602561, 576619, 552672, 531266, 512620, 496606, 482611, 469548, 456559, 443756, 431869, 421286, 411867, 403534, 396361, 390168, 384592, 379632, 375594, 372447, 369712, 367012, 364268, 361444, 358627, 356236, 354525, 352920, 350574, 347568, 344716, 342097, 338759, 334281, 329701, 326237, 323706, 320966, 317475, 313732, 310437, 307899, 306156, 305046, 304127, 302970, 301607, 300465, 299873, 299820, 300107, 300432, 300437, 299904, 298963, 297959, 297169, 296693, 296505, 296447, 296244, 295695, 294848, 293979, 293407, 293268, 293308, 292966, 291905, 290421, 289075, 287976, 286834, 285676, 285002, 285046, 285325, 285244, 284843, 284734, 285495, 287350, 290076, 293020, 295484, 297358, 299158, 301272, 303564, 305921, 308693, 312107, 315575, 318183, 319742, 320867, 322082, 323362, 324531, 325704, 327166, 329156, 331886]
63725C31886L631M452M874M760M214L555L203L297L350K663J234q8n52k92O3J62
63709C70412J8l30p72q88l31N66R66M76l47n78J56J445K598L199L233K968K769
63692C85560K877L141L050K255J068J91o7o0j92m11n79r48j706k311j909n39O74
63675C90094Q53M17L49Q18J112P77K22n2j76m75p01l44L73N20l17j454k089k344
63657C87583k815l475l797l733l770l980l768k773j415l11K99L82j6m31j97P09
63641C58492J574J996K347K877L177L126L485M700N860N873N180N134N986O665
63627D16472O560O375O995Q368R858J1020J1842J2629J3820J5418J6723J7217
63615E53297J7515J8671K0617K2266K3222K4324K6132K7850K8327K7393K5688
$$ y = [331886, 335517, 339969, 344843, 349603, 353817, 357372, 360575, 363872, 367222, 369885, 371119, 371031, 370479, 370187, 370250, 370412, 370430, 370100, 369328, 368440, 368109, 368675, 369641, 370117, 369770, 369192, 369348, 370793, 373391, 376590, 379823, 382791, 385560, 388437, 391578, 394628, 396883, 397951, 398142, 398075, 398015, 397823, 397412, 396833, 395885, 394179, 391868, 389959, 389420, 390094, 390947, 391364, 391713, 392531, 393643, 394420, 394642, 394590, 394414, 393939, 393238, 392894, 393267, 393787, 393470, 392016, 389927, 387583, 384768, 381293, 377496, 373763, 369993, 366013, 362245, 359472, 358057, 357746, 358045, 358427, 358411, 357980, 357783, 358492, 360066, 362062, 364409, 367286, 370463, 373589, 377074, 381774, 387634, 393507, 398687, 403821, 409807, 416472, 423032, 429407, 436402, 444770, 454628, 465648, 477490, 490119, 503939, 519357, 536080, 553297, 570812, 589483, 610100, 632366, 655588, 679912, 706044, 733894, 762221, 789614, 815302]
63604H15302K3736K1731J9675J7177J3542Q593L189j530n088p599r142r737r722
63591H80127r693j0084j0995j2319j3940j5892j8322k0992k2987k3437k2536k1223
63579F77707j9849j7903j5196j2512j0503q760o624m341k662j600m15J301L060
63566E81703M107M176L716L524M131N326O554P725R296J1360J3332J4831J6301
63553F86082J8305K0650K2837K4857K6956K8946L0441L1525L2575L3589L4173
63542I90936L3782L1449K5792J6492N611l661r813j3775j6805j8703j8734j7314
63530A005257j5844j5198j5282j5967j7610k0361k3505k6010k7607k8912l0408
63519G68553l1583l1398k9497k6680k4083k2237k0986j9926j8596j6581j3906
$$ y = [815302, 839038, 860769, 880444, 897621, 911163, 919756, 922945, 921415, 916327, 908728, 899586, 889849, 880127, 870434, 860350, 849355, 837036, 823096, 807204, 788882, 767890, 744903, 721466, 698930, 677707, 657858, 639955, 624759, 612247, 601744, 592984, 586360, 582019, 579357, 577757, 577342, 578643, 581703, 585810, 589986, 593702, 597226, 601357, 606683, 613237, 620962, 630258, 641618, 654950, 669781, 686082, 704387, 725037, 747874, 772731, 799687, 828633, 859074, 890599, 923174, 956763, 990936, 1024718, 1056167, 1081959, 1098451, 1104062, 1100401, 1090588, 1076813, 1060008, 1041305, 1022571, 1005257, 989413, 974215, 958933, 942966, 925356, 904995, 881490, 855480, 827873, 798961, 768553, 736970, 705572, 676075, 649395, 625312, 603075, 582089, 562163, 543567, 526986, 513080]
63508E13080j1207r125p639o388n430n145n416n516n021m327l967l830l378k418
63494D34273j274l87pj56o03r52r60p54n76l90M9P65J478J970K348K765L034K753
63476D43376J849Q38M38R06J845K591K702K123J032l18j634k610l003k751k054
63461D45330j275o69k67l5j8j95k20L79J706L308M659N572O132O381O393O491
63445D83672P134Q423R996J1468J2866J4426J6065J7410J8486J9971K2419K5337
63433F67673K7619K8895K9827L0683L0317K7313K1932J6105J1474Q219N961N053
63421I11071O304R777J4333J8420K1150K2797K4307K6062K7149K6199K3030J8823
63409A149422J4485R576L476l009q125j1107j2765j4168j5469j6333j6823j7403
$$ y = [513080, 501873, 492748, 485109, 478721, 473291, 468146, 462730, 457214, 452193, 447866, 443899, 440069, 436691, 434273, 432999, 432612, 432605, 432449, 431846, 430894, 429934, 429180, 428604, 428214, 428263, 429028, 430506, 432476, 434824, 437589, 440623, 443376, 445225, 446063, 446501, 447407, 449252, 451843, 454545, 456668, 457700, 457382, 455748, 453138, 450135, 447384, 445330, 444055, 443386, 443119, 443084, 443066, 442871, 442651, 443030, 444736, 448044, 452703, 458275, 464407, 470788, 477181, 483672, 490806, 499229, 509225, 520693, 533559, 547985, 564050, 581460, 599946, 619917, 642336, 667673, 695292, 724187, 754014, 784697, 815014, 842327, 864259, 880364, 891838, 900057, 906018, 911071, 917375, 927152, 941485, 959905, 981055, 1003852, 1028159, 1054221, 1081370, 1107569, 1130599, 1149422, 1163907, 1173483, 1176959, 1173950, 1165825, 1154718, 1141953, 1127785, 1112316, 1095983, 1079160, 1061757]
63397A061757j8464k0247k2936k6329k9575l1683l2415l2295l1672l0223k7683
63386G58235k4725k2553k1470k0461j8456j5554j2552r701o698l719j500k11J022
63373F01657K944N189P014Q474J0164J2136J3853J5179J6574J8245J9848K1295
63361G52572K3177K5869K8645L0358L0857L1121L1884L2664L2466L0984K8579
63350A079176K5257K0490J4293P826K332k139o306j0252j3218j4832j5658j6315
63338A070654j6850j7401j8717k1231k4159k6320k7530k8422k9101k8882k7419
63327H04622k5266k3006k0552j7681j4717j2190j0118q162o228m559l341k752
63315F56050l360n906j0326j5258j8855k0187j9647j8159j6305j4279j2254j0384
$$ y = [1061757, 1043293, 1023046, 1000110, 973781, 944206, 912523, 880108, 847813, 816141, 785918, 758235, 733510, 710957, 689487, 669026, 650570, 635016, 622464, 612763, 606065, 602346, 600846, 600635, 601657, 604601, 609790, 616804, 625278, 635442, 647578, 661431, 676610, 693184, 711429, 731277, 752572, 775749, 801618, 830263, 860621, 891478, 922599, 954483, 987147, 1019613, 1050597, 1079176, 1104433, 1124923, 1139216, 1147042, 1149374, 1147235, 1140929, 1130677, 1117459, 1102627, 1086969, 1070654, 1053804, 1036403, 1017686, 996455, 972296, 945976, 918446, 890024, 860923, 832041, 804622, 779356, 756350, 735798, 718117, 703400, 691210, 681092, 672930, 666702, 662143, 658802, 656050, 652690, 646784, 636458, 621200, 602345, 582158, 562511, 544352, 528047, 513768, 501514, 491130]
63303D91130q632o936n546m801m574m259l462k475j881j894k237k502k524k437
63289D36970k491k712k800k467j804j182q62r06j284j743j772j143m06l15q26
63274D14257j227j189r87p10q8P00J020R16J319K533L485L242K435K222K546K608
63258D33082K526L137M354N042M758M401M765N491N879N965O208O729P402Q218
63244E07957R161J0033J0794J1690J2859J4139J5478J7132J9155K1088K2463K3317
63232F95266K3944K4465K4897K5388K6003K6538K6804K6883K6883K6636K5938
63221I79645K4943K4017K3274K2504K1542K0568J9888J9479J8823J7364J5199
63210A207246J3007J1070Q578M396j514p898j3471j8016k2054k5891k9260l1652
$$ y = [491130, 482498, 475562, 470016, 465215, 460641, 456382, 452920, 450445, 448564, 446670, 444433, 441931, 439407, 436970, 434479, 431767, 428967, 426500, 424696, 423514, 422652, 421746, 420462, 418719, 416947, 415804, 415398, 415083, 414257, 413030, 411841, 410854, 410144, 410056, 410756, 411776, 412692, 414011, 416544, 420029, 423271, 425706, 427928, 430474, 433082, 435608, 438745, 443099, 448141, 452899, 457300, 462065, 467556, 473435, 479400, 485608, 492337, 499739, 507957, 517118, 527151, 537945, 549635, 562494, 576633, 592111, 609243, 628398, 649486, 671949, 695266, 719210, 743675, 768572, 793960, 819963, 846501, 873305, 900188, 927071, 953707, 979645, 1004588, 1028605, 1051879, 1074383, 1095925, 1116493, 1136381, 1155860, 1174683, 1192047, 1207246, 1220253, 1231323, 1239901, 1244297, 1242783, 1234885, 1221414, 1203398, 1181344, 1155453, 1126193, 1094541]
63198A094541l2747l2596l1544k9913k7771k5065k1936j8670j5386j2021q614
63187H38278n300k039J294M507P175R197J0993J2983J5096J6910J7980J8061J7295
63174I62430J6312J5723J5449J4839J3606J2216J1139J0143Q712O816M830K897
63162A095112P03k054n380r104j3028j6898k0411k3306k5428k6706k7196k7110
63150H99194k6724k6182k5449k4411k2999k1207j9043j6587j4145j2143j0691
63139F79613r357p658n788m420l745l130j979n60M66R87J495K376L534M556M976
63124F61366M671M243M656O039P309P500O999O735O646N925M548L409K906K533
63110G35485K037J889K202K236J481M48k18o73j305j943k187k088j822j323p44
$$ y = [1094541, 1061794, 1029198, 997654, 967741, 939970, 914905, 892969, 874299, 858913, 846892, 838278, 832978, 830939, 832233, 836740, 843915, 853112, 864105, 877088, 892184, 909094, 927074, 945135, 962430, 978742, 994465, 1009914, 1024753, 1038359, 1050575, 1061714, 1071857, 1080569, 1087385, 1092215, 1095112, 1095815, 1093761, 1088381, 1079277, 1066249, 1049351, 1028940, 1005634, 980206, 953500, 926304, 899194, 872470, 846288, 820839, 796428, 773429, 752222, 733179, 716592, 702447, 690304, 679613, 670256, 662598, 656810, 652390, 648645, 645515, 643536, 642976, 643442, 644429, 645924, 648300, 651834, 656390, 661366, 666037, 670280, 674936, 680975, 688284, 695784, 702783, 709518, 716164, 722089, 726637, 730046, 732952, 735485, 737522, 739411, 741613, 743849, 745330, 745778, 745560, 744887, 743582, 741639, 739452, 737364, 735542, 734219, 733475]
63095G33475p30j526k321k192j306m84LM40Q40R74J065J620K603L469L977M351
63079G44258M666M799M965N692O985Q157Q672Q767R006R658J0707J2067J3559
63066H51958J4930J6103J7341J8936K0932K3135K5322K7399K9512L1944L4816
63055A112328L7959M1234M4774M8680N2622N6014N8583O0466O1889O3018O4029
63044A701596O4988O5608O5436O4356O2701O0908N9218N7609N5749N3103M9486
63033B360758M5539M2274L9958L7657L4044K8518K1476J3660N411l488j3332k3949
63021B588526l4695m4956n4448o2977p0102p5205p7798p7730p5344p1521o7218
63010A876532o2662n7279n0663m3291l5888k8511k0871j3299o603r35M391R762
$$ y = [733475, 732745, 731219, 728898, 726706, 725400, 724916, 724919, 725359, 726199, 727173, 728238, 729858, 732461, 735930, 739907, 744258, 748924, 753723, 758688, 764380, 771365, 779522, 788194, 796961, 805967, 815625, 826332, 838399, 851958, 866888, 882991, 900332, 919268, 940200, 963335, 988657, 1016056, 1045568, 1077512, 1112328, 1150287, 1191521, 1236295, 1284975, 1337597, 1393611, 1452194, 1512660, 1574549, 1637567, 1701596, 1766584, 1832192, 1897628, 1961984, 2024685, 2085593, 2144811, 2202420, 2258169, 2311272, 2360758, 2406297, 2448571, 2488529, 2526186, 2560230, 2588748, 2610224, 2623884, 2629295, 2625807, 2612475, 2588526, 2553831, 2508875, 2454427, 2391450, 2321348, 2246143, 2168345, 2090615, 2015271, 1943750, 1876532, 1813870, 1756591, 1705928, 1662637, 1626749, 1598238, 1577367, 1564068, 1557465, 1556530, 1560921, 1570683]
62998A570683J4590J8166K0676K2832K4859K6405K7239K7538K7462K6984K6206
62987A833640K5449K4768K3603K1242J7598J3327R136N119P77m431j0639j7503
62975A942086k4371l0620l6036m0897m5503m9576n2378n3519n3446n2930n2220
62964A450590n0974m8972m6569m4270m2095l9675l6967l4563l3009l2016l0741
62953A010739k8889k6995k5464k3831k1541j9118j7695j7492j7459j6622j5119
62942G80514j3579j2158j0632r043p693o766o284o208o204n652m370l042k463
62929F86420k528k450j865j195r70j217j642k016k288k539k880l299l640l831
62915F54060l957l982l686l085k579k423k336k006j679j763k206k672l061l276
$$ y = [1570683, 1585273, 1603439, 1624115, 1646947, 1671806, 1698211, 1725450, 1752988, 1780450, 1807434, 1833640, 1859089, 1883857, 1907460, 1928702, 1946300, 1959627, 1968763, 1973882, 1974659, 1970228, 1959589, 1942086, 1917715, 1887095, 1851059, 1810162, 1764659, 1715083, 1662705, 1609186, 1555740, 1502810, 1450590, 1399616, 1350644, 1304075, 1259805, 1217710, 1178035, 1141068, 1106505, 1073496, 1041480, 1010739, 981850, 954855, 929391, 905560, 884019, 864901, 847206, 829714, 812255, 795633, 780514, 766935, 754777, 744145, 735102, 727409, 720643, 714359, 708151, 701947, 696295, 691925, 688883, 686420, 683892, 681442, 679577, 678382, 677412, 676195, 674553, 672537, 670249, 667710, 664830, 661531, 657891, 654060, 650103, 646121, 642435, 639350, 636771, 634348, 632012, 630006, 628327, 626564, 624358, 621686, 618625, 615349]
62901F15349k881j704n65m67j142j359p57m10j166k302k437j178O46J909J904
62886F03440O28r96j625p73N92J267J205J198J500J590J163N86K20l9l41n95q12
62869F08208j264j972k505k559k376k234j970j466j199j578j998j331N02K172
62855E88430K444J432O5j037j638j396j90J183J547O72m68r41p44l89j71k44p80
62838E87775j619k120j846j120n21j11L37O39L80l02p11m52J38N71Q25J205J831
62821E84899K527L069L460L892M506N156N532N544N417N348N294N221N323N750
62807F50938O290O623O680O589O448O382O661P443Q569R817J1130J2389J3302
62794G59261J3935J4934J6782J9151K1537K4199K7735L1999L6247M0331M4862
$$ y = [615349, 612468, 610764, 610199, 609732, 608590, 607231, 606474, 606064, 604898, 602596, 600159, 598981, 599627, 601536, 603440, 604068, 603072, 601447, 600674, 601266, 602533, 603738, 604936, 606436, 608026, 609189, 609775, 609995, 609956, 609615, 609020, 608208, 606944, 604972, 602467, 599908, 597532, 595298, 593328, 591862, 590663, 589085, 587087, 585756, 586258, 588430, 590874, 592306, 592371, 591334, 589696, 588300, 588110, 589293, 590840, 591512, 591044, 590103, 589359, 588970, 588799, 588555, 587775, 586156, 584036, 582190, 581070, 580549, 580438, 580775, 581414, 581794, 581492, 580781, 580329, 580467, 581038, 581863, 583068, 584899, 587426, 590495, 593955, 597847, 602353, 607509, 613041, 618585, 624002, 629350, 634644, 639865, 645188, 650938, 657228, 663851, 670531, 677120, 683568, 689950, 696611, 704054, 712623, 722440, 733570, 745959, 759261, 773196, 788130, 804912, 824063, 845600, 869799, 897534, 929533, 965780, 1006111, 1050973]
62783A050973N0035N5196N9814O4128O8495P2787P6806Q0591Q3899Q6042Q6898
62772A835664Q7362Q8006Q7674Q4408P7655O8739N9052M8540L6306K2086O641
62761B502133r015k4281l8921n2673o5107p5750q4261r0470r4360r6133r6206
62750A774956r4954r2407q8457q3408p8045p2935o7910o2540n6963n1860m7550
62739I77927m3538l9128l4311k9728k5896k2735j9946j7520j5668j4320j3047
62728G02090j1486r723q062o601n163l559j795r0J257K073K509K996L912N328
62714F73686P070Q861J0486J1924J3412J5116J6844J8467K0527K3790K7934L1553
62702H79670L3977L6382M0114M4530M7727M9266N0751N3435N6564N8715N9699
$$ y = [1050973, 1101008, 1156204, 1216018, 1280146, 1348641, 1421428, 1498234, 1578825, 1662724, 1748766, 1835664, 1923026, 2011032, 2098706, 2183114, 2260769, 2329508, 2388560, 2437100, 2473406, 2495492, 2502133, 2493118, 2468837, 2429916, 2377243, 2312136, 2236386, 2152125, 2061655, 1967295, 1871162, 1774956, 1680002, 1587595, 1499138, 1415730, 1337685, 1264750, 1196840, 1134300, 1077337, 1025477, 977927, 934389, 895261, 860950, 831222, 805326, 782591, 762645, 745125, 729457, 715137, 702090, 690604, 680881, 672819, 666218, 661055, 657496, 655701, 655611, 656868, 658941, 661450, 664446, 668358, 673686, 680756, 689617, 700103, 712027, 725439, 740555, 757399, 775866, 796393, 820183, 848117, 879670, 913647, 950029, 990143, 1034673, 1082400, 1131666, 1182417, 1235852, 1292416, 1351131, 1410830]
62691A410830O0060N9544N7333N3521M9116M4445L8567L0609K0954J0616N0j0855
62679A824790k1920l2489m2041n0489n7703o3171o6394o7455o6976o5532o3383
62668A227237o0699n7752n4729n1520m7905m3865l9659l5641l2120k9200k6647
62657G47500k4097k1495j9113j7062j5049j2933j1155j0195r792r221q277p432
62645E81679o996o675o079n239m370l565k905k445j916r07L42Q08j22j638k278
62630E37694j626p53q29j775k468k114j058k59j29j03N71J764K585K578K416L072
62614E39566M517N735O022N808N946O576P139P421Q007R469J1480J3216J4436
62601F45338J5715J7563J9843K2197K4600K7140K9556L1491L3060L4875L7408
$$ y = [1410830, 1470890, 1530434, 1587767, 1641288, 1690404, 1734849, 1773416, 1804025, 1824979, 1835595, 1835645, 1824790, 1802870, 1770381, 1728340, 1677851, 1620148, 1556977, 1490583, 1423128, 1356152, 1290620, 1227237, 1166538, 1108786, 1054057, 1002537, 954632, 910767, 871108, 835467, 803347, 774147, 747500, 723403, 701908, 682795, 665733, 650684, 637751, 626596, 616401, 606609, 597388, 589111, 581679, 574683, 568008, 561929, 556690, 552320, 548755, 545850, 543405, 541489, 540582, 540924, 541732, 541610, 539972, 537694, 536068, 535315, 534486, 532711, 530243, 528129, 527071, 526812, 526683, 526580, 527151, 528915, 531500, 534078, 536494, 539566, 544083, 549818, 555840, 561648, 567594, 574170, 581309, 588730, 596737, 606206, 617686, 630902, 645338, 661053, 678616, 698459, 720656, 745256, 772396, 801952, 833443, 866503, 901378, 938786]
62590I38786M0465M3193M4537M3945M1854L9230L6459L2987K8221K2297J5621
62579A327595Q176j29q773j6907k4115l0283l5077l8252m0315m2001m3234m3432
62567A013253m2682m1687m0492l8346l5122l1753k8880k6036k2784j9717j7544
62556F68210j5898j4013j1996j0549r733q922p865o860o014n017l853l013k792
62543E61685k790k401j501m93J94M73N68P10R03R87R13Q27Q85J191J852K864L978
62526E70845M989O108P671R544J1285J2851J4615J6602J8407K0094K2377K5458
62514G40846K8411L0371L1808L3806L6485L8840M0107M0566M0875M1177M0971
62503A144263L9698L7297L4291L1165K7728K3502J8786J4779J2302J0961J0013
$$ y = [938786, 979251, 1022444, 1066981, 1110926, 1152780, 1192010, 1228469, 1261456, 1289677, 1311974, 1327595, 1335771, 1335642, 1326869, 1309962, 1285847, 1255564, 1220487, 1182235, 1141920, 1099919, 1056685, 1013253, 970571, 928884, 888392, 850046, 814924, 783171, 754291, 728255, 705471, 685754, 668210, 652312, 638299, 626303, 615754, 606021, 597099, 589234, 582374, 576360, 571343, 567490, 564477, 561685, 558895, 556494, 554993, 554500, 554694, 555167, 555735, 556445, 557348, 558335, 559248, 560075, 560960, 562151, 564003, 566867, 570845, 575834, 581942, 589613, 599157, 610442, 623293, 637908, 654510, 672917, 693011, 715388, 740846, 769257, 799628, 831436, 865242, 901727, 940567, 980674, 1021240, 1062115, 1103292, 1144263, 1183961, 1221258, 1255549, 1286714, 1314442, 1337944, 1356730, 1371509, 1383811, 1394772, 1404785]
62492A404785R577J0345J2472J5459J8923K2829K6914L0557L3257L4977L5964
62481A656059L6506L6566L5326L1278K3359J2125k95j1524k0339k7396l4815m4368
62469A692482n5518o5570p2124p5023p5538p4511p2157o8982o5640o1942n7076
62458I48401n0962m4516l8453l2688k7097k2069j7948j4466j1150p920n025k737
62446F73370j179j97P33K085L784N352O470P072P092O611O067N764N252L849J638
62431G33763o19k602m715p168r451j1027j1948j2535j2865j2854j2526j2008j1474
62418F11971j1103j0833j0255r143p861o845n939m827l814l388l233k656j850
62405E30224j722k324k624k030j118m17M77J885L212L825L989M221M361M148M020
$$ y = [1404785, 1414362, 1424707, 1437179, 1452638, 1471561, 1494390, 1521304, 1551861, 1585118, 1620095, 1656059, 1692565, 1729131, 1764457, 1795735, 1819094, 1831219, 1830924, 1819400, 1799061, 1771665, 1736850, 1692482, 1636964, 1571394, 1499270, 1424247, 1348709, 1274198, 1202041, 1133059, 1067419, 1005477, 948401, 897439, 852923, 814470, 781782, 754685, 732616, 714668, 700202, 689052, 681132, 676107, 673370, 672191, 671994, 672727, 674812, 678596, 683948, 690418, 697490, 704582, 711193, 717260, 723024, 728276, 732125, 733763, 733144, 730542, 725827, 718659, 709208, 698181, 686233, 673698, 660833, 647979, 635453, 623445, 611971, 600868, 590035, 579780, 570637, 562776, 555931, 549992, 545165, 541351, 537963, 534730, 532074, 530224, 528502, 526178, 523554, 521524, 520406, 519989, 520466, 522351, 525563, 529388, 533377, 537598, 541959, 546107, 550127]
62390E50127M506N296N746N876O078O192N780N083M957N838P430R154J0425J0706
62376F43194J0046R322R309R740R977J0242J1369J3371J5318J6669J7841J9277
62364G95675K0886K2736K5412K9159L3293L7051M0455M3811M6801M8852N0101
62353A194232N1193N2048N1509M8518M3244L6743K9821K2529J4743O827m38o502
62341A544467j1461j5819j9964k3899k7410l0340l2712l4619l5984l6533l6016
62330A239710l4559l2652l0769k9019k7252k5491k4093k3449k3537k3841k3805
62319I41243k3388k3075k3280k3811k4085k3700k2657k1092j9204j7365j5906
62308G03680j4610j2788j0184p445n454m358l638k922k269j670q19M06J577K213
$$ y = [550127, 554633, 559929, 565675, 571551, 577629, 583821, 589601, 594684, 599641, 605479, 612909, 622063, 632488, 643194, 653240, 662562, 671871, 681611, 691588, 701830, 713199, 726570, 741888, 758557, 776398, 795675, 816561, 839297, 864709, 893868, 927161, 964212, 1004667, 1048478, 1095279, 1144131, 1194232, 1245425, 1297473, 1348982, 1397500, 1440744, 1477487, 1507308, 1529837, 1544580, 1551407, 1550969, 1544467, 1533006, 1517187, 1497223, 1473324, 1445914, 1415574, 1382862, 1348243, 1312259, 1275726, 1239710, 1205151, 1172499, 1141730, 1112711, 1085459, 1059968, 1035875, 1012426, 988889, 965048, 941243, 917855, 894780, 871500, 847689, 823604, 799904, 777247, 756155, 736951, 719586, 703680, 689070, 676282, 666098, 658653, 653199, 648841, 645203, 642281, 640012, 638342, 637523, 637929, 639506, 641719]
62294F41719K501L144M450N870O657O770O784O985P034O700O473P049Q336R497
62280G29969R936R887R973J0602J1782J3159J4143J4375J4262J4641J5754J6932
62268H85415J7545J7802J8376J9561K1207K3120K5125K7045K9062L1772L5334
62257A151364L8842M1164M2320M3355M4871M6300M6695M5546M2611L7694L1073
62246A611835K3603J5912P824q80r569j7211k3590k9453l5452m1468m7010n1666
62234A402875n5003n6609n6530n5369n3513n0734m6805m2259l7956l4142l0432
62223H83523k6692k3278k0371j7634j4864j2489j1011j0221r414q258p071o262
62211G15958n805n293m319k810j156K7M76O00R86J692K300K678L263M383N581
$$ y = [641719, 644220, 647364, 651814, 657684, 664341, 671111, 677895, 684880, 691914, 698614, 705087, 712136, 720472, 729969, 739905, 749792, 759765, 770367, 782149, 795308, 809451, 823826, 838088, 852729, 868483, 885415, 902960, 920762, 939138, 958699, 979906, 1003026, 1028151, 1055196, 1084258, 1116030, 1151364, 1190206, 1231370, 1273690, 1317045, 1361916, 1408216, 1454911, 1500457, 1543068, 1580762, 1611835, 1635438, 1651350, 1659174, 1658294, 1648725, 1631514, 1607924, 1578471, 1543019, 1501551, 1454541, 1402875, 1347872, 1291263, 1234733, 1179364, 1125851, 1075117, 1028312, 986053, 948097, 913955, 883523, 856831, 833553, 813182, 795548, 780684, 768195, 757184, 746963, 737549, 729291, 722220, 715958, 710153, 704860, 700541, 697731, 696575, 696602, 697078, 697678, 698664, 700356, 702656, 705334, 708597, 712980, 718561]
62196G18561N985N465M948N380O584P549P845Q155R140J0375J0955J0881J0921
62183H22744J1232J1095J0236R453R389R515R140Q698R067J0060J0712J0930J1797
62170I54068J4092J7420K0976K4389K7472K9941L1796L3455L5095L6217L6178
62159A261099L4738L1883K7606K2137J6058R869L752k072p214j1570j5481j9204
62147A351601k2570k5396k7784k9715l0818l0853k9994k8361k5764k2335j8936
62136A059075j6312j4243j2032r648p771o807o412n958n161m220l647l848m595
62123I58421n120m888m096l157k080p39N87J482K012K509K920K954K771K860L190
62108I59626L062K000L15j463l228n056o637p411p105n894m031j739M59J586Q19
$$ y = [718561, 724546, 730011, 734959, 740339, 746923, 754472, 762317, 770472, 779612, 789987, 800942, 811823, 822744, 833976, 845071, 855307, 864760, 874149, 883664, 892804, 901502, 910569, 920629, 931341, 942271, 954068, 968160, 985580, 1006556, 1030945, 1058417, 1088358, 1120154, 1153609, 1188704, 1224921, 1261099, 1295837, 1327720, 1355326, 1377463, 1393521, 1403390, 1407142, 1405070, 1397856, 1386286, 1370805, 1351601, 1329031, 1303635, 1275851, 1246136, 1215318, 1184465, 1154471, 1126110, 1100346, 1078011, 1059075, 1042763, 1028520, 1016488, 1006840, 999069, 992262, 985850, 979892, 974731, 970511, 966864, 963016, 958421, 953301, 948413, 944317, 941160, 939080, 938341, 938928, 940410, 942422, 944931, 947851, 950805, 953576, 956436, 959626, 962688, 964688, 965003, 963540, 960312, 955256, 948619, 941208, 934103, 928209, 924178, 922439, 922898, 924484, 925303]
62093I25303j604m293n825n897n163m132k652o30J354K549K941L197L883N028
62079I14059O428Q015R861J2014J4307J6318J7684J8548J9448K0565K1437K1709
62067A100393K1833K2552K3875K5058K5529K5331K4670K3577K2139K0535J8491
62056A353983J5252J0443M799m36m726q492j2257j5947j9216k2104k4949k7857
62044A248493l0589l2963l5024l6686l7589l7537l6819l5808l4544l2975l1269
62033H66690k9462k7184k4373k1958k0971k0991k0407j8414j5898j3997j2657
62022F40378j1225r763q913q835q971q724p899o690n675n459n896n972m923l141
62008E38292j490k30Q00J431J480J540K465M071N255N476N321N433N611N303M391
$$ y = [925303, 923699, 919406, 913581, 907684, 902521, 898389, 895737, 895107, 896461, 899010, 901951, 905148, 909031, 914059, 920487, 928502, 938363, 950377, 964684, 981002, 998686, 1017234, 1036682, 1057247, 1078684, 1100393, 1122226, 1144778, 1168653, 1193711, 1219240, 1244571, 1269241, 1292818, 1314957, 1335492, 1353983, 1369235, 1379678, 1384477, 1384041, 1379315, 1370823, 1358566, 1342619, 1323403, 1301299, 1276350, 1248493, 1217904, 1184941, 1149917, 1113231, 1075642, 1038105, 1001286, 965478, 930934, 897959, 866690, 837228, 810044, 785671, 763713, 742742, 721751, 701344, 682930, 667032, 653035, 640378, 629153, 619390, 610477, 601642, 592671, 583947, 576048, 569358, 563683, 558224, 552328, 546356, 541433, 538292, 536802, 536572, 537372, 538803, 540283, 541823, 544288, 548359, 553614, 559090, 564411, 569844, 575455, 580758, 585149]
61993E85149L136J797O30j71p32j432k359l134l485l663m118m971n953o689o939
61978E47066o744o339n794m888l612k563k416l054l721l925l695l069k030r93
61964D94223o67j138j701j798j565j163l09J050K199K395J826J261J037J018J281
61949D97949K153L497M657N293N830O797Q072R060R434R442R520R882J0419J0804
61935F02809J0709J0055R147Q395P848P194O358N739N604N441M412K406K00j450
61921F84867k420k820k672k214j963j938j378K15K200L585M323N138O310P467
61907F98700Q444R446J0341J0568R986R055Q007O476M285J970J40j197k374l500
61893G70347m578n701o820p611p895p918p959p965p828p707p761p865p852p806
$$ y = [585149, 588285, 590082, 590712, 590541, 589809, 588377, 586018, 582884, 579399, 575736, 571618, 566647, 560694, 554005, 547066, 540322, 533983, 528189, 523301, 519689, 517126, 514710, 511656, 507935, 504010, 500315, 497246, 495216, 494223, 493556, 492418, 490717, 488919, 487354, 486191, 485882, 486932, 489131, 491526, 493352, 494613, 495650, 496668, 497949, 500102, 503599, 508256, 513549, 519379, 526176, 534248, 543308, 552742, 562184, 571704, 581586, 592005, 602809, 613518, 623573, 632720, 641115, 648963, 656157, 662515, 668254, 673858, 679299, 683711, 686117, 686317, 684867, 682447, 679627, 676955, 674741, 672778, 670840, 669462, 669677, 671877, 675462, 679785, 684923, 691233, 698700, 707144, 716590, 726931, 737499, 747485, 756540, 764547, 771023, 775308, 777278, 777418, 776221, 773847, 770347, 765769, 760068, 753248, 745637, 737742, 729824, 721865, 713900, 706072, 698365, 690604, 682739, 674887, 667081]
61879F67081p863p964q063q239q338p850o564n086m211l951l601k742j696r33
61865E89980l99L04J366K643M048N734P766R739J1013J1381J1300J1378J1890
61852F78143J2889J4426J6292J7846J8517J8387J7909J7262J6383J5390J4338
61841H57782J2721R906O138K476l62k455l936m556m312l815l588l418k785j557
61827H58239L1J697L111M000M494M957N281M856L501J757o7k453n684q984j1329
61812H63407j2715j3768j4539j4552j3896j3364j3396j3556j3268j2515j1617
61801G16221j0733r848q950q031p033n898m695l753l568m289n249n471m770l911
61787F30022l433l001k326j991k569l453l520k707j957j750j679j475j476j749
$$ y = [667081, 659218, 651254, 643191, 634952, 626614, 618764, 612200, 607114, 602903, 598952, 595351, 592609, 590913, 589980, 589581, 589885, 591251, 593894, 597942, 603676, 611442, 621181, 632194, 643575, 654875, 666253, 678143, 691032, 705458, 721750, 739596, 758113, 776500, 794409, 811671, 828054, 843444, 857782, 870503, 880409, 886547, 889023, 888661, 886206, 882270, 877714, 873402, 869587, 865999, 862581, 859796, 858239, 858270, 859967, 863078, 867078, 871572, 876529, 881810, 886666, 890167, 891924, 891857, 889404, 883720, 874736, 863407, 850692, 836924, 822385, 807833, 793937, 780573, 767177, 753621, 740353, 727838, 716221, 705488, 695640, 686690, 678659, 671626, 665728, 661033, 657280, 653712, 649423, 644174, 638703, 633933, 630022, 626589, 623588, 621262, 619271, 616702, 613249, 609729, 607022, 605065, 603315, 601636, 600161, 598685, 596936]
61773E96936j714j114n78o58q69l62Q60J981K421K371K272K268K183J827J287
61758F09111R67J284K192L163L632L377K457J063m50j670k443l001l604m210m576
61743F07292m585m368m197m263m378m002k864j472p22q62j247j194o60Q2R58J838
61727E75356K250J908J360J528K544L562L747L064J982Q94P8k04P0M36L78r3n12
61710E98348o34p11j087j787k641l582m547n260n354m806m039l568l579l861m037
61695E48855l837l311k850k906l592m530n156n110m433l480k728k507k803l267
61681D98345l505l314k782k165j729j567j609j813k225k734k854k140q42J74L78
61666D69618J11qN4o6l30k24M35J118J259R68P61Q17R47J064J249J356J046L85
$$ y = [596936, 595222, 594108, 593530, 592872, 592003, 591641, 592501, 594482, 596903, 599274, 601546, 603814, 605997, 607824, 609111, 610078, 611362, 613554, 616717, 620349, 623726, 626183, 627246, 626796, 625126, 622683, 619682, 616078, 611868, 607292, 602707, 598339, 594142, 589879, 585501, 581499, 578635, 577163, 576441, 575579, 574332, 573138, 572478, 572560, 573518, 575356, 577606, 579514, 580874, 582402, 584946, 588508, 592255, 595319, 597301, 598195, 598273, 598069, 598139, 598575, 598953, 598860, 598348, 597714, 597003, 595916, 594129, 591488, 587906, 583359, 578099, 572745, 567939, 563900, 560332, 556753, 552892, 548855, 545018, 541707, 538857, 535951, 532359, 527829, 522673, 517563, 513130, 509650, 506922, 504415, 501612, 498345, 494840, 491526, 488744, 486579, 484850, 483283, 481674, 479861, 477636, 474902, 472048, 469908, 469066, 469240, 469618, 469729, 469721, 469775, 469709, 469379, 469155, 469590, 470708, 471967, 472935, 473696, 474513, 475460, 476524, 477773, 479129, 480175, 480560]
61648D80560m9J02M75N57M71O77J127J330J178J101J231J088L83m45r09j199j705
61631D85973k219k267j981j974k403k780k720k340j898j547j465j748k058j969
61617D56604j654j728k291k740k677k406k294k250k165k286k717l068l050k983
61603D22295l229l550l557l435l607l903l786l255k891k986l122k776j937j019
61589C79242m12k64m84q65j261j584j623j151l50J77J19o4K79J097J696J540O41
61572C76733o45j772k131j502m20K88L67K35K76M53O02P29R01J139J498J971K273
61555C80995K075J506J114J188J422J378J035O76M10J21j71j82K96R90J349J201
61539C95403J041J383K054K429K369K348K566K509J745P40L31O59J104J074L94
$$ y = [480560, 480511, 480613, 481088, 481645, 482116, 482793, 483920, 485250, 486428, 487529, 488760, 489848, 490231, 489786, 488877, 487678, 485973, 483754, 481487, 479506, 477532, 475129, 472349, 469629, 467289, 465391, 463844, 462379, 460631, 458573, 456604, 454950, 453222, 450931, 448191, 445514, 443108, 440814, 438564, 436399, 434113, 431396, 428328, 425278, 422295, 419066, 415516, 411959, 408524, 404917, 401014, 397228, 393973, 391082, 388096, 384974, 382198, 380261, 379242, 378830, 378566, 378082, 377217, 375956, 374372, 372749, 371598, 371248, 371425, 371544, 371480, 371759, 372856, 374552, 376092, 376733, 376088, 374316, 372185, 370683, 370263, 370551, 370918, 371153, 371429, 371882, 372484, 373213, 374114, 375253, 376751, 378722, 380995, 383070, 384576, 385690, 386878, 388300, 389678, 390713, 391389, 391799, 391920, 391749, 391567, 391863, 392853, 394202, 395403, 396444, 397827, 399881, 402310, 404679, 407027, 409593, 412102, 413847, 414587, 414918, 415577, 416681, 417755, 418149]
61524D18149q01k099k865k813k439k363k406j920r41l11n07j008j073o48j84k4
61508C95747j90n25p50o66m07k50j45J64M98L10m29r06m70M99J128J115Q33O20
61490C96176N40O74J117J670J926J757J462J409J714K232K643K599K062J459J284
61475D20724J483J525J037J93o08j066j046n57J28N78O20M89M28L11k7l66l23
61458D23523O8L37K08j31l60l42JP17J528J912J772J630J816J874J290N17M95
61441D36855J307K101K391K620L138L414K817J641O90K76J25P3J98M11M65L19
61425D58841J42M3O2K79O00O18J31m64p21q14j082j153l30J130J984J458J41r08
61407D59957j399j688j943j982j745j352q55k70N6l71j558k735k946j924l06R45
$$ y = [418149, 417348, 415249, 412384, 409571, 407132, 404769, 402363, 400443, 399502, 399191, 398684, 397676, 396603, 395955, 395771, 395747, 395557, 395032, 394282, 393616, 393209, 392959, 392814, 392978, 393476, 393786, 393357, 392451, 391981, 392480, 393608, 394723, 395556, 396176, 396716, 397390, 398507, 400177, 402103, 403860, 405322, 406731, 408445, 410677, 413320, 415919, 417981, 419440, 420724, 422207, 423732, 424769, 424962, 424354, 423288, 422242, 421685, 421813, 422391, 423011, 423500, 423928, 424239, 424212, 423846, 423523, 423591, 423928, 424136, 424005, 423645, 423303, 423304, 424021, 425549, 427461, 429233, 430863, 432679, 434553, 435843, 436360, 436855, 438162, 440263, 442654, 445274, 448412, 451826, 454643, 456284, 456974, 457250, 457375, 457448, 457646, 458057, 458522, 458841, 458983, 459026, 459088, 459367, 459967, 460585, 460716, 460252, 459531, 458717, 457635, 456482, 456152, 457282, 459266, 460724, 460865, 459957, 458558, 456870, 454927, 452945, 451200, 449848, 448993, 448723, 448779, 448408, 446850, 444115, 441169, 439245, 438939, 439884]
61391D39884J331J112R53J319K083K677K649K177J894K119K450K320J858J683
61377D66509J946K099J803J534J921K867L734M121M015L477K664K008J876K058
61363E02632J992J501J050J253K304L716M556M271L535L794N536P473Q083P534
61349E59230P245P816Q378Q096P258O501N704M353K539R74J72m8j98n36r17j116
61333F15451j210j438j756j883j890k203k794k932k257j512j358j097M00K793
61319E96314M579N204N578O315O886P048P714R463J1238J1717J1325J1665J3288
61306G08334J5071J5767J5293J4446J3965J3928J3572J1770Q103L465q17m204
61294H28693o906q990j0261j0893j1358j1631j1230j0222r463r424r402q500o980
$$ y = [439884, 441215, 442327, 443280, 444599, 446682, 449359, 452008, 454185, 456079, 458198, 460648, 462968, 464826, 466509, 468455, 470554, 472357, 473891, 475812, 478679, 482413, 486534, 490549, 494026, 496690, 498698, 500574, 502632, 504624, 506125, 507175, 508428, 510732, 514448, 519004, 523275, 526810, 530604, 536140, 543613, 551696, 559230, 566475, 574291, 582669, 590765, 598023, 604524, 610228, 614581, 617120, 618094, 618266, 618218, 618020, 617484, 616567, 615451, 614241, 612803, 611047, 609164, 607274, 605071, 602277, 599345, 597088, 595576, 594218, 593121, 593521, 596314, 600893, 606097, 611675, 617990, 624876, 631924, 639638, 649101, 660339, 672056, 683381, 695046, 708334, 723405, 739172, 754465, 768911, 782876, 796804, 810376, 822146, 830249, 833714, 832897, 828693, 821787, 812797, 802536, 791643, 780285, 768654, 757424, 747202, 737739, 728315, 718913, 710413, 703433]
61281G03433n929n683n348m158k640j857j817j348L04K372L501L357K797K613
61267F89597K768K887K921L005L130L304L817M918O360P523Q005P833P121N783
61253G58972L719J207j084k590l269l441l312k950k658k841l276l097j950p05
61239G32725l40m95l3J181K032J860J397J599K397L197L984N206O883Q518R696
61224G79807J0319J0394J0123R961J0146J0287R916R308R190R658R886R167P812
61211I05974O735O333O147N606M821M481N013O076O956P314P461Q080R697J2260
61197A002954J4975J6838J7545J7727J8027J8216J7596J6041J3999J1616Q561
61186A174095M883J360j304l211m844o317p417q202r109j0470j2103j3492j4430
$$ y = [703433, 697504, 691821, 686473, 682315, 679675, 677818, 676001, 674653, 674957, 677329, 680830, 684187, 686984, 689597, 692365, 695252, 698173, 701178, 704308, 707612, 711429, 716347, 722707, 730230, 738235, 746068, 753189, 758972, 762691, 763898, 762814, 760224, 756955, 753514, 750202, 747252, 744594, 741753, 738477, 735380, 733430, 732725, 732385, 731890, 731857, 733038, 735070, 736930, 738327, 739926, 742323, 745520, 749504, 754710, 761593, 770111, 779807, 790126, 800520, 810643, 820604, 830750, 841037, 850953, 860261, 869451, 879109, 888995, 898162, 905974, 912709, 919042, 925189, 930795, 935616, 940097, 945110, 951186, 958142, 965456, 972917, 980997, 990694, 1002954, 1017929, 1034767, 1052312, 1070039, 1088066, 1106282, 1123878, 1139919, 1153918, 1165534, 1174095, 1178978, 1180338, 1179034, 1175823, 1170979, 1164662, 1157245, 1149043, 1139934, 1129464, 1117361, 1103869, 1089439]
61173A089439j5358j6835j8617j9727j9710j9293j9330j9574j9260j8508j8127
61162H85100j8200j7879j6733j5281j3958j2481j0625q748p162n619l881k157
61150G52376n81J037K598L429L143K145R57l99j922l184l853m113m132l654k575
61135G41272j248J23J829L969O068P897R893J2294J4561J6318J8036K0140K2188
61122H73340K3761K5419K7755L0198L1790L2614L3376L3954L3592L2360L1198
61111A209357L0452K9434K7534K4956K2113J9037J5637J2033Q409M835J255k592
61099A402460p013j1818j6239j9780k2825k5921k8917l1345l3179l4525l5001
61088A135897l4198l2476l0573k8656k6468k4104k1892j9785j7620j5648j4000
$$ y = [1089439, 1074081, 1057246, 1038629, 1018902, 999192, 979899, 960569, 940995, 921735, 903227, 885100, 866900, 849021, 832288, 817007, 803049, 790568, 779943, 771195, 764033, 758414, 754533, 752376, 751795, 752832, 755430, 758859, 762002, 764147, 765104, 764705, 762783, 759599, 755746, 751633, 747501, 743847, 741272, 740024, 740147, 741976, 745945, 752013, 759910, 769803, 782097, 796658, 812976, 831012, 851152, 873340, 897101, 922520, 950275, 980473, 1012263, 1044877, 1078253, 1112207, 1145799, 1178159, 1209357, 1239809, 1269243, 1296777, 1321733, 1343846, 1362883, 1378520, 1390553, 1398962, 1403797, 1405052, 1402460, 1395447, 1383629, 1367390, 1347610, 1324785, 1298864, 1269947, 1238602, 1205423, 1170898, 1135897, 1101699, 1069223, 1038650, 1009994, 983526, 959422, 937530, 917745, 900125, 884477, 870477]
61077H70477j2083r394o647n006m400l681k361j018K5J237K823M203M936N363
61063H44474N964O845Q071R800J1739J3210J4089J5065J6658J8564K0271K1756
61051A006506K3205K4501K5454K6228K7238K8752L0721L2789L4457L5468L5952
61040A331271L6116L6009L5842L6143L7162L8376L9059L9053L8624L7990L7513
61029A743158L7804L9008M0445M1681M3342M6127M9565N2814N6147O0442O5594
61018B276127P0640P5233P9895Q5090R1265R9457J10607J24415J40200J58589
61008C311518J81006K07833K38617K73669L13716L58370M07265M62643N28329
60999F282966O05762O93649P92320R05594J036453J181734J330889J468162J578875
$$ y = [870477, 858394, 849000, 842353, 837347, 832947, 829266, 826905, 825887, 825912, 827149, 829972, 834175, 839111, 844474, 850438, 857283, 865354, 875154, 886893, 900103, 914192, 929257, 945915, 964479, 984750, 1006506, 1029711, 1054212, 1079666, 1105894, 1133132, 1161884, 1192605, 1225394, 1259851, 1295319, 1331271, 1367387, 1403396, 1439238, 1475381, 1512543, 1550919, 1589978, 1629031, 1667655, 1705645, 1743158, 1780962, 1819970, 1860415, 1902096, 1945438, 1991565, 2041130, 2093944, 2150091, 2210533, 2276127, 2346767, 2422000, 2501895, 2586985, 2678250, 2777707, 2888314, 3012729, 3152929, 3311518, 3492524, 3700357, 3938974, 4212643, 4526359, 4884729, 5291994, 5754637, 6282966, 6888728, 7582377, 8374697, 9280291, 10316744, 11498478, 12829367, 14297529, 15876404]
60990A5876404J661622J735382J820513J896644J882421J680036J260761P09000
60982B8522783J73853k26293m53936n26565m74531l45814k37329k79456n54811
60973B5597901j024886j545156j958594k180715k213523k105681j912844j682164
60965A0974338j448910j233518j042424q75222p30977o08798n06533m21744l52882
60956C753330k98295k55075k19986j90987j67291j48442j33625j21498j10597
60947B107534j00260r0926q3047p6197o9908o4666o1095n8687n6401n4131n2359
60936A339857n0773m8495m5484m2415l9334l5707l1725k8270k5598k3217k1011
60925I47828j9262j7631j5492j3296j2174j1998j1282r357p280o156n821n589
$$ y = [15876404, 17538026, 19273408, 21093921, 22990565, 24872986, 26553022, 27813783, 28522783, 28696636, 28470343, 28016407, 27489842, 27015311, 26669497, 26432168, 26152712, 25597901, 24573015, 23027859, 21069265, 18888550, 16675027, 14569346, 12656502, 10974338, 9525428, 8291910, 7249486, 6374264, 5643287, 5034489, 4527956, 4106212, 3753330, 3455035, 3199960, 2979974, 2788987, 2621696, 2473254, 2339629, 2218131, 2107534, 2007274, 1916348, 1833301, 1757104, 1687196, 1622530, 1561435, 1502748, 1446347, 1392216, 1339857, 1289084, 1240589, 1195105, 1152690, 1113356, 1077649, 1045924, 1017654, 992056, 968839, 947828, 928566, 910935, 895443, 882147, 869973, 857975, 846693, 837336, 830056, 823900, 818079, 812490]
60913H12490n148m223k581q30k0n9K56J065Q81j050l233l922l495l528m429n319
60897G76855n650n620n398n116n390o697q426r390r197q395p513o778o460o611
60883F80214o609n901n061n229o449p461p386o790o784p636q646q953q207o742
60869E82360n352m654m487m059k815j037M39J009Q65R04J927L791N530O426O697
60854E87544O898P076O912O432N962N479M592L277K115J660J845K184K259J879
60840F46114J034j48j495k928m449n986p344q246q385p616o275n104m542m239
60826E80391l598k678k104k141k394k512k665l037l319l137k708k640l161l966
60812E40331m714n339n828o073o058n902n570m846l792k991k980l575m107m221
$$ y = [812490, 807342, 803119, 800538, 799708, 799688, 799629, 799885, 800950, 801831, 800781, 797548, 793626, 790131, 786603, 782174, 776855, 771205, 765585, 760187, 755071, 749681, 742984, 734558, 725168, 715971, 707576, 700063, 693285, 686825, 680214, 673605, 667704, 662643, 657414, 650965, 643504, 636118, 629328, 622544, 614908, 606262, 597309, 589102, 582360, 577008, 572354, 567867, 563808, 560993, 559956, 560395, 561404, 562269, 563173, 565100, 568891, 574421, 580847, 587544, 594442, 601518, 608430, 614862, 620824, 626303, 630895, 634172, 636287, 637947, 639792, 641976, 644235, 646114, 647148, 647000, 645505, 642577, 638128, 632142, 624798, 616552, 608167, 600551, 594276, 589172, 584630, 580391, 576793, 574115, 572011, 569870, 567476, 564964, 562299, 559262, 555943, 552806, 550098, 547458, 544297, 540331, 535617, 530278, 524450, 518377, 512319, 506417, 500847, 496001, 492209, 489218, 486238, 482663, 478556, 474335]
60798D74335m086l768k955j596l98j41o40r28n16L6j6o19j157j349j454j615j517
60781D51616q44K18J163J704J946K116K313K557K886L302L655L721L404K852K317
60766D84926K009K041K385K780K748K002Q37l7j88Q0M4o49j598k066j764j186
60750D92364j120j811k693l018k689k232k049j985j762j519j681k409l492m584
60736D59320n347n464m925m235l914l800l316k479k027k234k312j511l56R4j73
60721D17321j76M35Q62N74J95M34Q69O38j50n77k78K22N32R98K061L494M619M960
60703D37033M549L809L163K719K312J986K164L037M046M441M204L925L892L861
60689D85141L700L584L448K865J778P79L69L85M35N10P73J117J307J328J286J106
$$ y = [474335, 470249, 466481, 463526, 461930, 461532, 461391, 460751, 459823, 459307, 459343, 459327, 458708, 457551, 456202, 454748, 453133, 451616, 450772, 450990, 452153, 453857, 455803, 457919, 460232, 462789, 465675, 468977, 472632, 476353, 479757, 482609, 484926, 486935, 488976, 491361, 494141, 496889, 498891, 499728, 499691, 499503, 499583, 499627, 498978, 497380, 495314, 493550, 492364, 491244, 489433, 486740, 483722, 481033, 478801, 476752, 474767, 473005, 471486, 469805, 467396, 463904, 459320, 453973, 448509, 443584, 439349, 435435, 431635, 428319, 425840, 423813, 421579, 419267, 417756, 417400, 417494, 417321, 417145, 417580, 418442, 419016, 419211, 419645, 420514, 421152, 421002, 420425, 420147, 420369, 420901, 421899, 423960, 427454, 432073, 437033, 441582, 445391, 448554, 451273, 453585, 455571, 457735, 460772, 464818, 469259, 473463, 477388, 481280, 485141, 488841, 492425, 495873, 498738, 500516, 501295, 501664, 502049, 502484, 502994, 503767, 504884, 506191, 507519, 508805, 509911]
60673E09911O51n8q98j790k643l290l629l714l617l440l416l654l856l629l086
60658D69842k658k313j537l02O28O60J12l49m38j08P74J981K694K321J337P19
60642D73363P47P93J49j274k876l749l416k439j877j884j508k81Q18P55P7O8P15
60625D58181Q42J07m16M3Q25R45M62J03J77M72Q23J131J161P52J10m72j015j581
60607D62650j860j401k93P62J093O86Q9q5L89J262K017K200J694Q15J49J38P45
60590D71050J522K071K315K375K337K274K284K408K560K614K434J942J333J155
60576E00674J798K945L879M408M960N736O331O440O371O511O894P614R029J0988
60562E84578J2479J2739J2252J1935J1742J0920R283P378N435L114K79k646n189
$$ y = [509911, 510562, 510504, 509606, 507816, 505173, 501883, 498254, 494540, 490923, 487483, 484067, 480413, 476557, 472928, 469842, 467184, 464871, 463334, 463032, 463660, 464320, 464432, 464083, 463645, 463537, 464311, 466292, 468986, 471307, 472644, 473363, 474110, 474903, 475052, 473778, 470902, 467153, 463737, 461298, 459421, 457537, 456029, 455748, 456566, 457321, 457398, 457466, 458181, 459023, 459130, 458714, 458757, 459582, 460527, 460989, 461092, 461269, 461741, 462564, 463695, 464856, 465608, 465718, 465246, 464231, 462650, 460790, 459389, 459096, 459858, 460951, 461637, 461726, 461641, 462030, 463292, 465309, 467509, 469203, 470018, 470167, 470305, 471050, 472572, 474643, 476958, 479333, 481670, 483944, 486228, 488636, 491196, 493810, 496244, 498186, 499519, 500674, 502472, 505417, 509296, 513704, 518664, 524400, 530731, 537171, 543542, 550053, 556947, 564561, 573590, 584578, 597057, 609796, 622048, 633983, 645725, 656645, 665928, 673306, 678741, 681855, 682134, 679488, 674299]
60549F74299p048p824p204n528l597j839j45J515K956M286N931Q003J0168J2197
60535F86170J4107J5807J7148J8408K0010K1627K2219K1293J9494J7633J5545
60524H89461J2428P922K604k474o534r479j1694j3309j3909j3214j1832j0770
60512H19200j0308r851q838p159m744j518K033M973P009Q922J1517J4579J7272
60499H43087J9328K1457K4679K9435L5148M0582M4761M7601M9618N1160N2173
60488A259029N2448N1598M9018M4380L8087L0807K2740J3928N009l217j0866j8808
60476A534153k7235l5318m2366m8563n4134n8624o1427o2436o1819n9666n6249
60465I66316n2051m7255m1734l5835l0551k6520k3467k0898j8783j7141j5622
$$ y = [674299, 667251, 659427, 652223, 646695, 643098, 641259, 641114, 642629, 645585, 649871, 655802, 663805, 673973, 686170, 700277, 716084, 733232, 751640, 771650, 793277, 815496, 836789, 856283, 873916, 889461, 901889, 909811, 912415, 909941, 903407, 893928, 882234, 868925, 855016, 841802, 829970, 819200, 808892, 799041, 790203, 783044, 778300, 776782, 778815, 783788, 790797, 799719, 811236, 825815, 843087, 862415, 883872, 908551, 937986, 973134, 1013716, 1058477, 1106078, 1155696, 1206856, 1259029, 1311477, 1363075, 1412093, 1456473, 1494560, 1525367, 1548107, 1562035, 1567044, 1563827, 1552961, 1534153, 1506918, 1471600, 1429234, 1380671, 1326537, 1267913, 1206486, 1144050, 1082231, 1022565, 966316, 914265, 867010, 825276, 789441, 758890, 732370, 708903, 688005, 669222, 652081, 636459]
60454F36459j3952j2325j0889r410p848o734o407o366n906n031m190l571l073
60441E40757k641k108j105L52J521J622O72o89j855k439k278j725j525j945k415
60426E24199k378j989j579j014r3Q46J441J906K542L014K831K166J541J017L84
60411E34834j46k14o0j77l81l6Q73J605J712J520J539J940K614L245L326K699
60395E54893K022K119K837L191K719K066K046K757L740M556M930M854M700M839
60381F02269M983M442L238K334K425K961K932K288J960K522L409L640L039K352
60367F44794K266K560K444J635P82O96J415K317L039L783M726N531N813N799O129
60352F93729P066Q200R063R682J0371J1162J1769J1964J1665J0640Q582N581K173
$$ y = [636459, 622507, 610182, 599293, 589883, 582035, 575301, 568894, 562528, 556622, 551591, 547401, 543830, 540757, 538116, 536008, 534903, 535255, 536776, 538398, 539070, 538381, 536526, 534087, 531809, 530084, 528559, 526614, 524199, 521821, 519832, 518253, 517239, 517146, 517992, 519433, 521339, 523881, 526895, 529726, 531892, 533433, 534450, 534834, 534688, 534474, 534414, 534237, 533856, 533820, 534693, 536298, 538010, 539530, 541069, 543009, 545623, 548868, 552194, 554893, 556915, 559034, 561871, 565062, 567781, 569847, 571893, 574650, 578390, 582946, 587876, 592730, 597430, 602269, 607252, 611694, 614932, 617266, 619691, 622652, 625584, 627872, 629832, 632354, 635763, 639403, 642442, 644794, 647060, 649620, 652064, 653699, 654481, 655177, 656592, 658909, 661948, 665731, 670457, 675988, 681801, 687600, 693729, 700795, 708995, 718058, 727740, 738111, 749273, 761042, 773006, 784671, 795311, 803893, 809474, 811647]
60339H11647j283m882q522j1533j3388j4380j4920j4583j2760j0139q437q380
60327F88440q860q492p220n826m601l334k139j511j524j635j276l25J032K536
60313F45265M018N472P047Q854J0837J2816J4524J5748J6620J7637J8987K0073
60301G97898K0217J9644J9007J8010J5403J0637M639j270o495j0851j4147j6614
60289H56078j8931k1122k2191k1490j9753j8008j6305j4390j2804j2118j1658
60278F67308j0316q365p171p158p260o502n047l526k346j864k349l364l935l644
60264E94461l011k499j895r69j44K8l40o10l71K52P75Q27N47N79J335K298K485
60247E93748J596L71l56n00n17o83q30o36p7M41M83J97J87P09J281J481J592K030
$$ y = [811647, 810364, 805482, 796960, 785427, 772039, 757659, 742739, 728156, 715396, 705257, 696820, 688440, 679580, 671088, 663868, 658042, 653441, 650107, 647968, 646457, 644933, 643298, 642022, 641697, 642729, 645265, 649283, 654755, 661802, 670656, 681493, 694309, 708833, 724581, 741201, 758838, 777825, 797898, 818115, 837759, 856766, 874776, 890179, 900816, 905455, 904185, 897690, 886839, 872692, 856078, 837147, 816025, 793834, 772344, 752591, 734583, 718278, 703888, 691084, 678966, 667308, 656992, 648627, 641456, 634298, 627038, 620536, 615489, 611963, 609617, 607753, 605404, 602040, 598105, 594461, 591450, 588951, 587056, 586087, 585943, 585971, 585631, 585021, 584650, 584902, 585677, 586504, 587051, 587630, 588965, 591263, 593748, 595344, 595715, 595359, 594859, 594342, 593659, 592829, 592193, 592116, 592557, 593040, 593237, 593424, 594133, 595414, 596895, 598487, 600517]
60229F00517K538K701K881L784N186O030N915N620N896O528O974P325Q016R010
60215F78921R779R962R720R502R577R737R513Q884Q569R126R924R640P961O079
60201H06894N162M953M427L333K381K019J783J005l24j750l021m205n284o149
60187H11224o972q151r547j0239r501p825o414n726n255m662m320m394m232l293
60173G20693k090j466j345r51o7O69O99J68m39q04q16n29j31K23N59Q98J136J261
60155G17668J402J468J097K96k75q5N60J087J530K301L412M528N487O280O713
60140G53469O693O566O692O927P114P588Q521R211Q945Q193P919P976P302N742
60126H58858M395L950L775L095K122J438J009N60L46P87J624K070J776J141O17
$$ y = [600517, 603055, 605756, 608637, 612421, 617607, 623637, 629552, 635172, 641068, 647596, 654570, 661895, 669911, 678921, 688700, 698662, 708382, 717884, 727461, 737198, 746711, 755595, 764164, 773290, 783214, 792854, 800815, 806894, 812056, 817009, 821436, 824769, 827150, 829169, 830952, 831957, 831633, 829883, 826862, 822657, 817373, 811224, 804252, 796101, 786554, 776315, 766814, 758989, 752575, 746849, 741594, 736932, 732612, 728218, 723986, 720693, 718603, 717137, 715792, 714841, 714774, 715443, 716142, 716310, 715871, 715067, 714251, 713722, 713591, 713814, 714373, 715271, 716407, 717668, 719070, 720538, 721635, 721931, 721656, 721571, 722131, 723218, 724748, 727049, 730461, 734989, 740476, 746756, 753469, 760162, 766728, 773420, 780347, 787461, 795049, 803570, 812781, 821726, 829919, 837838, 845814, 853116, 858858, 863253, 867203, 870978, 874073, 876195, 877633, 878642, 879202, 879548, 880335, 881959, 884029, 885805, 886946, 887563]
60111H87563N6r64k334l384l837m385n735p327p872p225o670o905o940n791m186
60096H14064l428l369k929k001j396j182o45J88N15L53O67J609K081J520Q04P49
60080H07600Q64L46o44j480k139l045m316n785p308q621r393r675r879j0066r843
60065G26616r111q248p417o371n185m386m064l647k877k252k130k066j451k51
60051F67160J191K505L230L124K728K906L681M292M427M515M649M449M179M731
60037G17767N943O248M743K393M24j377l665n978p359p847q141q332q094p683
60023F79042p689q052q218q063p853p650p435p472p786p747o912n885n464n375
60009E77441m709l341j974r85j45N95Q90O56K84J82N37J432K620L446L490L191
$$ y = [887563, 887619, 886655, 884321, 880937, 877100, 872715, 866980, 859653, 851781, 844556, 837886, 830981, 824041, 818250, 814064, 810636, 807267, 804338, 802337, 800941, 799759, 799114, 799302, 799817, 800170, 800837, 802446, 804527, 806047, 806851, 807600, 808464, 808810, 808166, 806686, 804547, 801502, 797186, 791401, 784093, 775472, 766079, 756404, 746525, 736459, 726616, 717505, 709257, 701840, 695469, 690284, 685898, 681834, 678187, 675310, 673058, 670928, 668862, 667411, 667160, 668351, 670856, 674086, 677210, 679938, 682844, 686525, 690817, 695244, 699759, 704408, 708857, 713036, 717767, 723710, 729958, 734701, 737094, 737518, 736141, 732476, 726498, 719139, 711292, 703151, 694819, 686725, 679042, 671353, 663301, 655083, 647020, 639167, 631517, 624082, 616610, 608824, 601077, 594165, 588280, 582816, 577441, 572732, 569391, 567417, 566432, 566287, 566882, 567772, 568428, 568712, 568894, 569431, 570863, 573483, 576929, 580419, 583610]
59993E83610L237L574L576L059K489K310K577L168L801L922L123J684K92o83j414
59978F18325k192l182m349n342n683n284m578l902l099k032r79k07M46J148J785
59963E80875K431L558N182O407O467N742N054M487L682K867K565K520J869L67
59949F34073j289k406k941l126l028k663k185j867k025k716l458l546k898k147
59935E97778j641j038k13K13p9k69N82K190L568M428N148N824O286O754P456P928
59919F44915P669P200P300P476O437M213K445K280L061L611L775M060M526M775
59905G13743M655M357M032L712L392K993K439J927J786J956J942J519J158J476
59891G51087K434L370L790L858M058M443M535M025L336L158L604M241M805N307
$$ y = [583610, 586847, 590421, 593997, 597056, 599545, 601855, 604432, 607600, 611401, 615323, 618446, 620130, 620422, 619739, 618325, 616133, 612951, 608602, 603260, 597577, 592293, 587715, 583813, 580714, 578682, 577703, 577496, 577942, 579090, 580875, 583306, 586864, 592046, 598453, 604920, 610662, 615716, 620203, 623885, 626752, 629317, 631837, 633706, 634073, 632784, 630378, 627437, 624311, 621283, 618620, 616435, 614568, 612543, 609827, 606369, 602823, 599925, 597778, 596137, 595099, 594886, 595099, 595020, 594751, 595333, 597523, 601091, 605519, 610667, 616491, 622777, 629531, 636987, 644915, 652584, 659784, 667084, 674560, 680997, 685210, 687655, 689935, 692996, 696607, 700382, 704442, 708968, 713743, 718398, 722755, 726787, 730499, 733891, 736884, 739323, 741250, 743036, 744992, 746934, 748453, 749611, 751087, 753521, 756891, 760681, 764539, 768597, 773040, 777575, 781600, 784936, 788094, 791698, 795939, 800744, 806051]
59877H06051N504N047M209L626L160J948k9j523j783j706k426l643m444m929n745
59862H03317o570o460n524m896n032n187m729l954l388l060k732k241j466m18
59848G47660O42J580K658L969N056N664O379P696Q917R023Q212P500O994N858
59834H27808L886J909M89o51j617j901j261k37N01N13p87l783p643j0590j1686
59819G94950j1615j1367j0983j0041q700p647p346p674p957p368n742m027l331
59806F91152l554l629l009k064j085R0J244J597Q39m50j714k888l726l658k752
59791F66393j964j861j924j609j298j539k093k447k618k755k524j761j199j567
59777F39234k201j617M50K364K432R35j39O54K690M212M519M603N540O978P798
$$ y = [806051, 811555, 816602, 820811, 824437, 827597, 829545, 829516, 827993, 826210, 824504, 822078, 818435, 813991, 809062, 803317, 796747, 790287, 784763, 779867, 774835, 769648, 764919, 760965, 757577, 754517, 751785, 749544, 748078, 747660, 748302, 749882, 752540, 756509, 761565, 767229, 773608, 781304, 790221, 799244, 807456, 814956, 821950, 827808, 831694, 833603, 834092, 833441, 831824, 829923, 828662, 828425, 828926, 829439, 828652, 824869, 817226, 806636, 794950, 783335, 771968, 760985, 750944, 742244, 734597, 727251, 719577, 711620, 704252, 698510, 694483, 691152, 687598, 683969, 680960, 678896, 677811, 677901, 679145, 680742, 681581, 681131, 679417, 676529, 672803, 669145, 666393, 664429, 662568, 660644, 659035, 657737, 656198, 654105, 651658, 649040, 646285, 643761, 642000, 640801, 639234, 637033, 635416, 635866, 638230, 640662, 641597, 641458, 642112, 644802, 649014, 653533, 658136, 663676, 670654, 678452]
59762F78452P787P737Q092Q487Q670R052R964J1095J1957J2373J2326J1785J0970
59749H08747J0302R886R437Q797Q116P474O767N995N145L917K087J23j301k282
59735H83210l427m623n052m555m020m071m230l845l093k584k546k794l095l227
59721H32048l128l051l148k950j985q30o35j529k438k659k581k564k259j490p75
59706H00026l42L71J571K421K253J726J859K632L286L473L397L293L386L852M246
59691H37450L693K127O78J13k94j564l431m860n533n812n732n120m368m171m597
59676G98579n194n808o570p319p730p771p485o646n308m214l885l759l077k205
59662G21608k009k201j525M46K730M288M980N058M653M080L824L858L547K595
$$ y = [678452, 686239, 693976, 702068, 710555, 719225, 728277, 738241, 749336, 761293, 773666, 785992, 797777, 808747, 819049, 828935, 838372, 847169, 855285, 862759, 869526, 875521, 880666, 884583, 886670, 886793, 885492, 883210, 879783, 875160, 870108, 865553, 861533, 857462, 853232, 849387, 846294, 843710, 841164, 838370, 835275, 832048, 828920, 825869, 822721, 819771, 817786, 816956, 816321, 814792, 812354, 809695, 807114, 804550, 802291, 800801, 800026, 799684, 800055, 801626, 804047, 806300, 808026, 809885, 812517, 815803, 819276, 822673, 825966, 829352, 833204, 837450, 841143, 843270, 843948, 844061, 843767, 842203, 838772, 833912, 828379, 822567, 816835, 811715, 807347, 803176, 798579, 793385, 787577, 781007, 773688, 765958, 758187, 750702, 744056, 738748, 734534, 730649, 726890, 723813, 721608, 719599, 717398, 715873, 716319, 719049, 723337, 728317, 733375, 738028, 742108, 745932, 749790, 753337, 755932]
59648G55932J465O32p5j041k273l563m891o229p297p835p996q132q247p877o578
59633F85995m534k628j749j978k553k738k526k356k479k893l614m566n328n439
59619F40614m951m258l470k334r11J77M08M3j54K07P94J112J195J504K202K872
59603F35050L062K882K686K383J560L12n75n19J42N69L36k51n59k54L45M75k76
59586F47368j408k038j963j755j821j882j542r16m15k82n81j273j997k169j604
59571F25722q40n58q91j425j707j556j095o37l43j4N94J244J390Q83J05n46r37
59554F19389r11k99O27J207J181J058J469K433L421L972M113M408N459P175Q742
59539F63444R604J0174J1064J2150J3083J4206J5745J6329J3869Q256K004k320
$$ y = [755932, 757397, 758029, 757954, 756913, 754640, 751077, 746186, 739957, 732660, 724825, 716829, 708697, 700450, 692573, 685995, 681461, 678833, 677084, 675106, 672553, 669815, 667289, 664933, 662454, 659561, 655947, 651381, 646053, 640614, 635663, 631405, 627935, 625601, 624690, 624867, 625275, 625318, 625164, 625371, 626165, 627277, 628472, 629976, 632178, 635050, 638112, 640994, 643680, 646063, 647623, 647935, 647360, 646841, 646983, 647552, 647888, 647637, 647078, 646824, 647169, 647644, 647368, 645960, 643922, 641959, 640204, 638383, 636501, 634959, 634043, 633628, 633346, 632765, 631492, 629495, 627326, 625722, 624882, 624324, 623433, 622008, 620301, 618745, 617650, 617013, 616670, 616656, 617250, 618494, 619884, 620767, 620872, 620326, 619389, 618478, 618179, 618806, 620013, 621194, 622252, 623721, 626154, 629575, 633547, 637660, 642068, 647527, 654702, 663444, 673048, 683222, 694286, 706436, 719519, 733725, 749470, 765799, 779668, 787924, 789928, 787608]
59527G87608m242m572l742j941k6Q81N02n68j699k642l413m224n366o847q409
59512G41300r824j0863j1083j0268r114q648q895q877q053o891n828m639l110
59499F35207j567l71M04P04O61Q69J613J952R47l85l7J951L348L085K699L537
59483F54617M590M537M102M692O087P143P760Q419Q774Q265P430P030O621N466
59469G45533M078L358K970K071J022P41J032J142J455K843M797N913O050O407
59455G89412P557Q894R910J0644J0931J0511R787R189Q088N587K247m31k024l434
59441H76868n252p196r023j0685j1638j1259r760p777n409k879j319j359j557
59428G91755o9K590M431N259O767R429J1703J2762J3839J6025J8602K0447K1516
$$ y = [787608, 783366, 778794, 775052, 773111, 773085, 773966, 774468, 773900, 772201, 769559, 766146, 761922, 756556, 749709, 741300, 731476, 720613, 709530, 699262, 690148, 681500, 672605, 663728, 655675, 648784, 642956, 638317, 635207, 633640, 633269, 633673, 634377, 635038, 635907, 637520, 639472, 640419, 640034, 639997, 641948, 645296, 648381, 651080, 654617, 659207, 663744, 667846, 672538, 678625, 685768, 693528, 701947, 710721, 718986, 726416, 733446, 740067, 745533, 749611, 752969, 755939, 758010, 759032, 759773, 760805, 761947, 763402, 766245, 771042, 776955, 783005, 789412, 796969, 805863, 815773, 826417, 837348, 847859, 857646, 866835, 874923, 880510, 882757, 882326, 880302, 876868, 871616, 864420, 855397, 844712, 833074, 821815, 812055, 804278, 798869, 795990, 794671, 793312, 791755, 791686, 794276, 798707, 803966, 810733, 820162, 831865, 844627, 858466, 874491, 893093, 913540, 935056]
59415I35056K2129K2121K1431K0389J9019J7267J5833J5111J3204P255k477j1836
59403A094502j7000j7801j6079j2881q716m656j304J947M984N483J269o525j4313
59390A008910j9525k1812k1609j9369j6132j3261j1291r875q749p970p340o476
59378H45501n401m392l388k141q17J53O78R18R26Q25J077K030L409M675N614O230
59362H55897O482O580P104Q341R763J0729J1347J2254J3802J5827J7966J9752
59350I95844K0803K1202K1466K1768K1576K0413J8614J6906J5450J3688J0989
59339A198719P282L099q54m388p974j1931j5663j8292j9883k1294k2852k3939
59327A062030k4100k3701k3204k2518k1479k0336j9314j8230j6871j5325j3694
$$ y = [935056, 957185, 979306, 1000737, 1021126, 1040145, 1057412, 1073245, 1088356, 1101560, 1108815, 1106338, 1094502, 1077502, 1059701, 1043622, 1030741, 1022025, 1017369, 1016065, 1018012, 1022996, 1028479, 1029748, 1023223, 1008910, 989385, 967573, 945964, 926595, 910463, 897202, 885911, 876036, 867287, 859317, 851977, 845501, 840100, 835708, 832320, 830179, 829362, 829515, 830193, 831111, 832037, 832862, 833939, 835969, 839378, 844053, 849667, 855897, 862379, 868959, 876063, 884404, 894167, 904896, 916243, 928497, 942299, 958126, 976092, 995844, 1016647, 1037849, 1059315, 1081083, 1102659, 1123072, 1141686, 1158592, 1174042, 1187730, 1198719, 1206001, 1209100, 1208246, 1203858, 1195884, 1183953, 1168290, 1149998, 1130115, 1108821, 1085969, 1062030, 1037930, 1014229, 991025, 968507, 947028, 926692, 907378, 889148, 872277, 856952, 843258]
59316H43258j1994j0513r724r588r416q676p504o377n689n543n440m344j908O25
59302G47167J716J571J743K800L783M109M504N536O718P692Q960J0618J1692J1751
59288H30360J1928J3114J4071J2640Q288K470k945o588p646o211l464o63J878
59275H67232M386O814R046J1321J3685J5531J6376J6516J6251J5151J2835R846
59263A014990O929M063J036j623l384m817o884r456j1527j2577j2785j2227j0833
59250I40905q944p027n047k915j251o70o00J58J756L244M097M774N615O208O164
59235I46467N700N101M197K749Q87j077k989m869o839r034j1259j2932j3746j4211
59221H88145j5004j5848j5762j4403j2553j1067r973q891p776o848o039n098m039
$$ y = [843258, 831264, 820751, 811027, 801439, 792023, 783347, 775843, 769466, 763777, 758234, 752794, 748450, 746542, 747167, 748883, 750454, 752197, 754997, 758780, 762889, 767393, 772929, 779647, 787339, 796299, 806917, 818609, 830360, 842288, 855402, 869473, 882113, 890401, 892871, 889926, 883338, 875692, 869481, 866017, 865354, 867232, 871618, 878432, 887478, 898799, 912484, 928015, 944391, 960907, 977158, 992309, 1005144, 1014990, 1021919, 1025982, 1027018, 1025395, 1022011, 1017194, 1010310, 1000854, 989327, 976750, 963965, 951738, 940905, 931961, 924934, 919887, 916972, 915721, 915051, 914451, 914609, 916365, 919609, 923706, 928480, 934095, 940303, 946467, 952167, 957268, 961465, 964214, 965101, 964024, 961035, 956166, 949327, 940293, 929034, 916102, 902356, 888145, 873141, 857293, 841531, 827128, 814575, 803508, 793535, 784644, 776868, 770020, 763981, 758883, 754844]
59208G54844l145k458j668o48J94M50M02P26J524K197K437K720L428M067M071
59193G69141L854M209M882M824L837K971L063L728M146M098L843L573L392L388
59179H22949L437L270K884K433J869J152O97R27J520J880K180K977L958M209L715
59164H60057L321L122K246M87j265k701m606p125r018r599r959j1138j2343j2368
59150G89111j1656j1508j1924j1780j0668r267q098p116o374o046n888n400m566
59137F78820l814l368l123k935k624j962r25L31J832L582M997N369N061N230O218
59122F92689P284Q175R534J1268J2117J1704J1478J2532J3822J3853J2858J1894
59110H29208J0946R464P795O533N212L277J546J065J115Q4k083l971m921n607
$$ y = [754844, 751699, 749241, 747573, 746925, 747119, 747569, 747971, 748697, 750221, 752418, 754855, 757575, 761003, 765070, 769141, 772995, 777204, 782086, 786910, 790747, 793718, 796781, 800509, 804655, 808753, 812596, 816169, 819561, 822949, 826386, 829656, 832540, 834973, 836842, 837994, 838691, 839618, 841138, 843018, 845198, 848175, 852133, 856342, 860057, 863378, 866500, 868746, 869233, 867968, 865267, 860661, 853536, 844518, 834919, 824960, 813822, 801479, 789111, 777455, 765947, 754023, 742243, 731575, 722308, 714210, 707094, 700720, 694674, 688786, 683386, 678820, 675006, 671638, 668515, 665580, 662956, 660994, 660069, 660400, 662232, 665814, 670811, 676180, 681241, 686471, 692689, 699973, 708148, 717682, 728950, 741067, 752771, 764249, 776781, 790603, 804456, 817314, 829208, 840154, 849618, 857413, 863946, 869158, 872435, 873981, 875046, 876161, 876245, 874162, 870191, 865270, 859663]
59096H59663o460p018o934o454n826n119m533m090l392k401j912k370k986l057
59082G97111l282m515o080o746o688o903p379p454p384p726p732o317m276l520
59068G11109m224m738m288l736l562l086k197j883k409k629j826p76l08j53J36
59053F75430L26K63L34O07N73J96J62O78J032P90L47k4n87j171r55J76J218J522
59035F80917J705K495L591M385M927N595O429P403Q675J0192J1540J2511J3227
59022G73592J3578J3261J2504J1859J1084R210O019K551k45k474m496o092o942
59009H33409p180o949o051m546l017j822o10J012K863M567O047P202P668P254
58995H39847O296N275M349L489K781K500K898L920M963N218M510L432K423J357
$$ y = [859663, 853203, 846185, 839251, 832797, 826971, 821852, 817319, 813229, 809837, 807436, 805524, 803154, 800168, 797111, 793829, 789314, 783234, 776488, 769800, 762897, 755518, 748064, 740680, 732954, 725222, 718905, 714629, 711109, 706885, 702147, 697859, 694123, 690561, 687475, 685278, 683395, 680986, 678357, 676531, 675755, 675447, 675294, 675430, 675756, 676019, 676353, 676960, 677533, 677729, 677891, 678569, 679601, 680391, 680738, 680714, 680127, 678956, 678001, 678177, 679395, 680917, 682622, 685117, 688708, 693093, 698020, 703615, 710044, 717447, 726122, 736314, 747854, 760365, 773592, 787170, 800431, 812935, 824794, 835878, 845088, 851107, 853658, 853413, 850939, 846443, 840351, 833409, 826229, 819280, 813229, 808683, 805666, 803844, 803234, 804246, 807109, 811676, 817723, 824925, 832593, 839847, 846143, 851418, 855767, 859256, 862037, 864537, 867435, 871355, 876318, 881536, 886046, 889478, 891901, 893258]
58981H93258M80Q43K986N878Q139R683J1204J2667J3638J4451J5695J6853J6943
58968A022718J6177J5585J5268J4469J3222J2300J1639J0337Q285O218M070R01
58956A151189l349p532j0992j4105j6959j8976k0173k1305k2351k2315k0911j9098
58944I53123j7562j6018j4241j2426j0252p187l936j942j152l4J778K784K180
58931H75115J111N72o4j237j868j208m79j144k758l956m476m814m806m005k793
58916H43190j918j486j204r79m95R36L310N558O946P977R270J0649J1960J3664
58902I07378J5739J7229J7823J8649K0495K2414K3259K3408K3723K3887K3225
58891A137229K2259K1957K2167K2114K1827K1720K1367J9945J7428J4225J0194
$$ y = [893258, 893738, 894581, 897567, 903445, 911584, 921267, 932471, 945138, 958776, 973227, 988922, 1005775, 1022718, 1038895, 1054480, 1069748, 1084217, 1097439, 1109739, 1121378, 1131715, 1140000, 1146218, 1150288, 1151189, 1147840, 1140308, 1129316, 1115211, 1098252, 1079276, 1059103, 1037798, 1015447, 993132, 972221, 953123, 935561, 919543, 905302, 892876, 882624, 875437, 871501, 869559, 868407, 868373, 870151, 872935, 875115, 876226, 876798, 876734, 875497, 873629, 872421, 871942, 870798, 868040, 864084, 859608, 854794, 849988, 845983, 843190, 841272, 839786, 838582, 837603, 837108, 838044, 841354, 846912, 853858, 861835, 871105, 881754, 893714, 907378, 923117, 940346, 958169, 976818, 997313, 1019727, 1042986, 1066394, 1090117, 1114004, 1137229, 1159488, 1181445, 1203612, 1225726, 1247553, 1269273, 1290640, 1310585, 1328013, 1342238, 1352432]
58880A352432N275M10l403o558j0016j3535j6031j7438j8799k0521k1765k1699
58868A208352k0436j8562j6463j4270j2051j0025q773q907j0193j1526j2196j2528
58856A052422j2861j2744j1818j0732j0268j0226j0012r815j0200j0969j1420
58845I31357j1473j1691j2362j3176j3734j3791j3218j2135j0864r568q288p325
58833G93732o963o671n533l663k181j479p14N57J529J763K265L894N839O853P032
58818G96260P180P257O684N497M063K290K38j176j347j167j879l289m315m760
58804H11536n259n912o266o372o674p080p201p278p772q290p983o865n756n009
58790G17819m183k912j328L49J941L198M099M987N945O477O353O179O468O733
$$ y = [1352432, 1357707, 1358117, 1354714, 1348156, 1338140, 1324605, 1308574, 1291136, 1272337, 1251816, 1230051, 1208352, 1187916, 1169354, 1152891, 1138621, 1126570, 1116545, 1107772, 1098865, 1088672, 1077146, 1064950, 1052422, 1039561, 1026817, 1014999, 1004267, 993999, 983773, 973761, 963946, 953746, 942777, 931357, 919884, 908193, 895831, 882655, 868921, 855130, 841912, 829777, 818913, 809345, 801057, 793732, 786769, 780098, 774565, 770902, 768721, 767242, 766528, 767085, 768614, 770377, 772642, 776536, 782375, 789228, 796260, 803440, 810697, 817381, 822878, 826941, 829231, 829469, 828293, 826946, 825779, 823900, 820611, 816296, 811536, 806277, 800365, 794099, 787727, 781053, 773973, 766772, 759494, 751722, 743432, 735449, 728584, 722828, 717819, 713636, 710724, 709396, 709745, 711686, 714884, 718983, 723970, 729915, 736392, 742745, 748924, 755392, 762125]
58776G62125O272N244M192L056J513k62k008m008o409q440r290r273r177q985
58762G24550q198o979n886m788l101r47Q51J826K166K180K108K177K300K066J571
58747G11896J664K772M152N125O199Q006R817J0381R837R538J0105J0745J0521
58734H10758R476Q354P832P998Q263P941P130O556O370N837M611L394K845K620
58720H99985K133J450Q72M61N47J679L405M183L265J601J34j616m259p161r488
58705H97191j1476j3472j4862j5301j5897j7693j9878k0922k0660j9810j8444
58694G08776j6428j4563j3667j3131j1854r947q202o668n166m321m522m773m109
58681E91425l284l361l669k996j792j162n88J058L000L609L558N197Q811J1984
$$ y = [762125, 768397, 773641, 777833, 780889, 782402, 782140, 780132, 776124, 769715, 761275, 751985, 742712, 733535, 724550, 716352, 709373, 703487, 698699, 695598, 694651, 695502, 697328, 699494, 701674, 703782, 705959, 708259, 710325, 711896, 713560, 716332, 720484, 725609, 731808, 739814, 749631, 760012, 769849, 779387, 789492, 800237, 810758, 820234, 828588, 836420, 844418, 852681, 860622, 867752, 874308, 880678, 886515, 891126, 894520, 897365, 899985, 902118, 903568, 904440, 904901, 905448, 907127, 910532, 914715, 917980, 919581, 919715, 918099, 913840, 906679, 897191, 885715, 872243, 857381, 842080, 826183, 808490, 788612, 767690, 747030, 727220, 708776, 692348, 677785, 664118, 650987, 639133, 629186, 620984, 614316, 609150, 604829, 600307, 595534, 591425, 588141, 584780, 581111, 578115, 576323, 575161, 574573, 575631, 578631, 582240, 585798, 590995, 599806, 611790]
58667F11790J3038J2817J2641J2617J2654J3168J3934J3715J1760Q485M320p45
58655G40194o134j0606j3619j5599j6589j5953j3741j1146r180p857o940o394
58643F06436n860m733l067j585n50N05J885L289M219M248L174J600Q20J243J569
58628F13193N10j266k167j874j166k68J043K161K238J795K147L390M489N150O055
58613F35430P308Q201Q458Q354P748O288M447L033J950O70m74q07p30j108j728
58598F87040j836j647j768j698o43P16J217J498L190O148Q573R747J0651J1870
58584G33058J2945J3801J4826J5433J4477J2288J0514R837R533R184R097R142
58572H74135R018R602J2060J5667J8529K0334K2407K5128K7493K9267L1198L2896
$$ y = [611790, 624828, 637645, 650286, 662903, 675557, 688725, 702659, 716374, 728134, 736619, 740939, 740194, 734060, 723454, 709835, 694236, 677647, 661694, 647953, 636807, 627627, 619770, 612830, 606436, 600576, 595843, 592776, 591191, 590641, 591146, 593031, 596320, 600539, 604787, 607961, 609561, 610381, 611624, 613193, 613703, 612437, 610270, 608396, 607230, 606962, 608005, 610166, 612404, 614199, 616346, 619736, 624225, 629375, 635430, 642738, 650939, 659397, 667751, 675499, 681787, 686234, 689267, 691217, 691887, 691413, 690606, 689876, 688768, 687040, 685204, 683557, 681789, 680091, 679448, 680164, 681381, 682879, 686069, 692217, 700790, 710537, 721188, 733058, 746003, 759804, 774630, 790063, 804540, 816828, 827342, 837179, 846712, 855896, 864993, 874135, 883153, 892755, 904815, 920482, 939011, 959345, 981752, 1006880, 1034373, 1063640, 1094838, 1127734]
58560A127734L2792L0592K7655K4553K0344J4698Q710L137k219o972j0018j1415
58548A259591j2514j3795j4416j4305j4662j5940j7194j7978j9118k1133k3520
58537A075016k5890k8138k9386k8634k6536k4695k3160k0620j7049j3925j1666
58526H25317r204o416m676m474m651m383m017l654k956k472l053l908l474k126
58512G65853j639k036j723p07o78j707k006j319j349k236j870K68J898J628Q89
58497G53266R36R15K61J62J183K087K347L335N693Q076R648J1281J3110J3772
58483H26072J3285J3891J6504J9082J9915J9803J9565J8259J5536J2888J0851
58472A005651P662K524k527n888q767j2327j5080j5321j3783j1835r237n713k483
$$ y = [1127734, 1160526, 1191118, 1218773, 1243326, 1263670, 1278368, 1287078, 1290215, 1287996, 1281024, 1271006, 1259591, 1247077, 1233282, 1218866, 1204561, 1189899, 1173959, 1156765, 1138787, 1119669, 1098536, 1075016, 1049126, 1020988, 991602, 962968, 936432, 911737, 888577, 867957, 850908, 836983, 825317, 816113, 809697, 805021, 800547, 795896, 791513, 787496, 783842, 780886, 778414, 775361, 771453, 767979, 765853, 764214, 762178, 760455, 759748, 759070, 757363, 755357, 754038, 752689, 750453, 748583, 748851, 750749, 752377, 753266, 754202, 755117, 755378, 755540, 756723, 758810, 761157, 764492, 770185, 778261, 787909, 799190, 812300, 826072, 839357, 853248, 869752, 888834, 908749, 928552, 948117, 966376, 981912, 994800, 1005651, 1013313, 1015837, 1013310, 1007422, 998655, 986328, 971248, 955927, 942144, 930309, 921072, 915359, 912876]
58459I12876k87K022N150P844R318J0762J2665J3222J1356Q753O836M249m02n669
58445I98695r486j2040j4193j5209j4409j3037j2206j0879q005m769k681j262
58433H80519M62K088L201M539O187O804O262O542Q333R390Q227O565N993N076
58419I60188K244j189l494n451q165j0417j0932j0935j1773j2258j1053r435r048
58406H58282r000p807o104m951l641j632l38n20l48J518L314L232K525K931L582
58391H41043L214K801L226K908O80j590k079k113l282m311l863l526m708n295
58377H23105k911J114M356P178J0546J2854J2665J2024J3275J5059J5196J4905
58365I39366J6276J8114J8233J7544J7884J8159J6587J4424J3574J2858J0503
$$ y = [912876, 912589, 914611, 919761, 927605, 936923, 947685, 960350, 973572, 984928, 993681, 1000517, 1004766, 1004364, 998695, 989209, 977169, 962976, 947767, 933358, 920321, 908115, 897236, 889231, 884462, 881781, 880519, 880981, 883069, 886270, 890809, 896996, 903800, 910062, 916604, 924937, 934327, 942554, 949119, 955112, 960188, 962432, 961243, 957749, 952298, 944133, 933716, 922784, 911849, 900076, 887818, 876765, 867330, 858282, 849282, 841475, 835371, 830420, 826779, 825147, 824809, 824289, 823941, 825459, 828773, 832005, 834530, 837461, 841043, 844257, 847058, 850284, 853192, 853872, 852282, 850203, 848090, 844808, 840497, 836634, 833108, 828400, 823105, 820194, 821308, 825664, 832842, 843388, 856242, 868907, 880931, 894206, 909265, 924461, 939366, 955642, 973756, 991989, 1009533, 1027417, 1045576, 1062163, 1076587, 1090161, 1103019, 1113522]
58354A113522P797O407M739J124k134k163l92L25O96K677M923N358N604Q089J1258
58339A167830J2477J3034J5331J7812J7850J7068J8343K0102J9166J6777J6091
58328A351881J6014J3420R361P039N685K511j104j641P4N00k3J558M724O356O719
58313A423074Q451J0915J1431J0817J1878J3867J4214J4108J6318J9241J9332
58302A573646J7741J8229K0266K0608J9907K1044K2773K1895K0028K1171K4216
58291A801524K5043K4350K5963K9042K9591K8330K9333L2172L3132L2810L4733
58280B126023L7845L8394L7791M0287M4423M5347M4200M6224N0894N3059N2846
58269B617333N4934N8970O0297N9528O1701O6444O8658O8451P0552P4408P4976
$$ y = [1113522, 1121319, 1127726, 1132465, 1133589, 1131455, 1129292, 1128900, 1129225, 1129921, 1132598, 1137521, 1142879, 1148483, 1156572, 1167830, 1180307, 1193341, 1208672, 1226484, 1244334, 1261402, 1279745, 1299847, 1319013, 1335790, 1351881, 1367895, 1381315, 1390676, 1397715, 1403400, 1405911, 1404807, 1403166, 1403240, 1403740, 1403717, 1405275, 1409999, 1416355, 1423074, 1431525, 1442440, 1453871, 1464688, 1476566, 1490433, 1504647, 1518755, 1535073, 1554314, 1573646, 1591387, 1609616, 1629882, 1650490, 1670397, 1691441, 1714214, 1736109, 1756137, 1777308, 1801524, 1826567, 1850917, 1876880, 1905922, 1935513, 1963843, 1993176, 2025348, 2058480, 2091290, 2126023, 2163868, 2202262, 2240053, 2280340, 2324763, 2370110, 2414310, 2460534, 2511428, 2564487, 2617333, 2672267, 2731237, 2791534, 2851062, 2912763, 2979207, 3047865, 3116316, 3186868, 3261276, 3336252]
58258C336252P2795P3092P5336P4263P0800P1173P5469P8061P9033Q3841R1994
58247D182109R7616J00984J07777J17291J23573J27693J36134J47642J55035J59518
58237E455372J69129J83431J94447K02555K15973K34425K49378K60986K78153
58228G443849L01212L21690L39964L65248L97166M26078M52814M88559N33912
58219A1070492N78663O23629O81024P51653Q24905R03174J001740J122466J254147
58210A8811893J401625J586403J815653K081816K397333K796764L298281L895836
58202C8085604M592109N399790O306743P286985Q355429R562936J0929544J2443910
58194A02963050J4143460J6114960J8357159K0671872K2714084K4140282K4792590
$$ y = [3336252, 3409047, 3482139, 3557475, 3631738, 3702538, 3773711, 3849180, 3927241, 4006274, 4090115, 4182109, 4279725, 4380709, 4488486, 4605777, 4729350, 4857043, 4993177, 5140819, 5295854, 5455372, 5624501, 5807932, 6002379, 6204934, 6420907, 6655332, 6904710, 7165696, 7443849, 7745061, 8066751, 8406715, 8771963, 9169129, 9595207, 10048021, 10536580, 11070492, 11649155, 12272784, 12953808, 13705461, 14530366, 15433540, 16435280, 17557746, 18811893, 20213518, 21799921, 23615574, 25697390, 28094723, 30891487, 34189768, 38085604, 42677713, 48077503, 54384246, 61671231, 70026660, 79589596, 90519140, 102963050, 117106510, 133221470, 151578629, 172250501, 194964585, 219104867, 243897457]
58187B43897457K4886789K4938345K5111423K4387999K0691154J2438315K59625
58180C76611107j2959139k3886657l0645025l3218752l2614517l0005385k6407852
58173A86873780k2574148j8893898j5497955j2552888j0365213r138665q724631
58166H9126382q696697q636643q323234p731068o948510o097017n269085m508192
58158C2915936l832821l255685k773608k365544k016526j727564j494718j299201
58150A4150269j127674r83219q67475p70140o84397o14749n61410n13683m66534
58141G560988m27366l98956l71615l39541l09654k86746k64624k39435k17698
58132D705353k03439j90313j73859j59548j51750j46122j39322j35093j34642
$$ y = [243897457, 268784246, 293722591, 318834014, 343222013, 363913167, 376351482, 376611107, 363651968, 339765311, 309120286, 275901534, 243287017, 213281632, 186873780, 164299632, 145405734, 129907779, 117354891, 106989678, 97851013, 89126382, 80429685, 71793042, 63469808, 55738740, 48790230, 42693213, 37424128, 32915936, 29083115, 25827430, 23053822, 20688278, 18671752, 16944188, 15449470, 14150269, 13022595, 12039376, 11171901, 10401761, 9717364, 9102615, 8541205, 8027522, 7560988, 7133622, 6734666, 6363051, 6023510, 5713856, 5427110, 5162486, 4923051, 4705353, 4501914, 4311601, 4137742, 3978194, 3826444, 3680322, 3541000, 3405907, 3271265]
58123C271265j31781j23612j15727j11405j05844r6335q7891q3493p8653p0963
58113B265561o5258o4016o2119n6539n1995n1654n1150m7224m3733m3717m3685
58102A684471m1067l9399m0980m1967l9784l7902l8478l7631l2904k8216k6556
58091A279587k4802k0571j7287j7496j7798j5340j3062j3756j4920j4150j3762
58080A096643j5666j7265j6773j6884j9115k0254j8480j7215j8754j9862j7868
58069H98507j5530j5481j5434j3220j1282j1677j1814r519p377p746q312o875
58057G64240n704o914q183p369o770q560j0436r939q826q968q406n541l034l295
58043F62295m225l489k877m327n739n003m245n756p497o903n544n835o663o364
$$ y = [3271265, 3139484, 3015872, 2900145, 2788740, 2682896, 2586561, 2498670, 2415177, 2336524, 2265561, 2200303, 2136287, 2074168, 2017629, 1965634, 1913980, 1862830, 1815606, 1771873, 1728156, 1684471, 1643404, 1604005, 1563025, 1521058, 1481274, 1443372, 1404894, 1367263, 1334359, 1306143, 1279587, 1254785, 1234214, 1216927, 1199431, 1181633, 1166293, 1153231, 1139475, 1124555, 1110405, 1096643, 1080977, 1063712, 1046939, 1030055, 1010940, 990686, 972206, 954991, 936237, 916375, 898507, 882977, 867496, 852062, 838842, 827560, 815883, 804069, 794550, 787173, 779427, 771115, 764240, 758536, 751622, 743439, 736070, 729300, 720740, 710304, 700365, 691539, 682571, 674165, 668624, 665590, 662295, 658070, 654581, 651704, 647377, 641638, 636635, 632390, 626634, 619137, 612234, 606690, 600855, 594192, 587828]
58029E87828o488q456r928q686o825p001p785o852n438n468n468l608j777k313
58015E01735l499k615p49l88q28j36P67J80n97M41K023J873Q54J121K122K132
57999E04436J748K331K895J940M26k23r71k840m257l897l702n576p602p238n797
57984D71673n926o953o669n608n556n741m523l070l403m406l709j988j515j905
57970D10701j161K96N06k05K0R66R64K30K40P28M51m5N06J382J157N26Q34J115
57952D19211k26k139k475j590j266j327n07O12Q32J242L451O171P035O698P542
57937D43264R318R726Q640Q047Q314P987O995O634O631N359K796L03k112n390
57923E16512q737j0332j0429j0747j1288j0629r049q247q193p249n285l800l044
$$ y = [587828, 581340, 572884, 562956, 554270, 547445, 540444, 532659, 525807, 520369, 514901, 509433, 505825, 504048, 501735, 498236, 495621, 494872, 494484, 493656, 493520, 494287, 494467, 493870, 494311, 496334, 498207, 499061, 500182, 502304, 504436, 506184, 508515, 511410, 513350, 513776, 513553, 512582, 509742, 505485, 501588, 497886, 492310, 484708, 477470, 471673, 465747, 458794, 452125, 446517, 440961, 435220, 430697, 427627, 424224, 419818, 416109, 414121, 412606, 410701, 409540, 409836, 410342, 410137, 410157, 411123, 412087, 412317, 412557, 413285, 413736, 413691, 414197, 415579, 416736, 417262, 418096, 419211, 418985, 416846, 414371, 412781, 411515, 410188, 409681, 410293, 411125, 412367, 415818, 421989, 429024, 435722, 443264, 452582, 462308, 470948, 478995, 487309, 495296, 502291, 508925, 515556, 520915, 523711, 524014, 521902, 516512, 507775, 497443, 487014, 476267, 464979, 454350, 445301, 437054, 428861, 421612, 416327, 412527, 409483]
57910D09483j803k1J057J345J978L008L425L259L301L125J811K32L5Q31R71O19
57894D32656J256K608K961K314K254K791K310P19k01J19L24k45p71j116k214l915
57878D41850m787m467m094m173m105l910m264m686l931k235j085o78J88J622K399
57863D03644K317K664L922N072N470N598N766N798N968O601O909O026M827M726
57849D75308N184M589L092K181J768L81j874l191l119l142l962m617m642m802
57835D63154n216n007m189l838m023l624k545j999k335k522k137j835j675j017
57821D21192k76p06k158l099l049l011l362l435l342l959m849m437k604r66k59
57806C81680L46R46L22j790l928n093n762o224n904m899m229m010l222j732o60
$$ y = [409483, 407680, 407659, 408716, 410061, 412039, 415047, 418472, 421731, 425032, 428157, 429968, 430200, 430235, 431066, 432037, 432656, 433912, 436520, 439481, 441795, 444049, 446840, 449150, 449869, 449668, 449787, 450111, 449866, 449095, 447979, 445765, 441850, 437063, 432596, 428502, 424329, 420224, 416314, 412050, 407364, 403433, 401198, 400113, 399435, 399623, 401245, 403644, 405961, 408625, 412547, 417619, 423089, 428687, 434453, 440251, 446219, 452820, 459729, 465755, 470582, 475308, 480492, 485081, 488173, 490354, 492122, 492503, 490629, 487438, 484319, 481177, 477215, 472598, 467956, 463154, 457938, 452931, 448742, 444904, 440881, 437257, 434712, 432713, 430378, 427856, 425719, 423884, 422209, 421192, 420916, 420210, 418052, 414953, 411904, 408893, 405531, 402096, 398754, 394795, 389946, 385509, 382905, 381939, 381680, 382026, 382972, 383294, 381504, 377576, 372483, 366721, 360497, 354593, 349694, 345465, 341455, 338233, 336501, 335841]
57791C35841k89L78J636K529K752L139L861M160M250N384P527Q995Q979Q430Q060
57776D05632P410O479O074O068N291L715K661K371J532k32j673k280l085m358
57762D35605m927m562m689n737o179n285m521m910n213m224k818k250k111j524
57748C76655p80m37j84J79O0o22q43j80L81K45K15Q09J225R81R05J528K093K127
57730C84357K336L000L169K497K092K507K699K091J819K658L472L164K433K193
57716D20487J889Q67j86o70j428l087m463m297l323k997l340l537l634m108m606
57701C83567m541m107l632k833j782j452k219k939k627j928j806k002j916j823
57687C47960j920j324O37L122M937O141P476R280J1826J5547J9941K3546K6097
$$ y = [335841, 335552, 335930, 337566, 340095, 342847, 345986, 349847, 354007, 358257, 363641, 371168, 380163, 389142, 397572, 405632, 413042, 419521, 425595, 431663, 436954, 440669, 443330, 445701, 447233, 447001, 445328, 443048, 439963, 435605, 430678, 426116, 421427, 415690, 409511, 404226, 399705, 394795, 389582, 385358, 382540, 380290, 378179, 376655, 375875, 375438, 375254, 375433, 375493, 374871, 374028, 373848, 374229, 374474, 374689, 375498, 376723, 377704, 378609, 380137, 382230, 384357, 386693, 389693, 392862, 395359, 397451, 399958, 402657, 404748, 406567, 409225, 412697, 415861, 418294, 420487, 422376, 423243, 423057, 422387, 420959, 417872, 413409, 409112, 405789, 402792, 399452, 395915, 392281, 388173, 383567, 379026, 374919, 371287, 368454, 366672, 365220, 363001, 360062, 357435, 355507, 353701, 351699, 349783, 347960, 346040, 344716, 345353, 348475, 353412, 359553, 367029, 376309, 388135, 403682, 423623, 447169, 473266]
57674D73266K9324L4498M0564M5892N0389N4476N7550N9099O0167O1679O1988
57663A028892N7412M4788K2988o290l7706o3771p9357q4588q2659p6232o7104
57652F56373n7486m9147m1976l5100k8782k3738j9528j5344j1576r087p587o299
57640C50723n394n237n028l843k357j874k217k182j490p99k78L05N65L0p78j110
57624C19036j283j961k731k800k511k701l120k917k257k022k260k283j939j556
57610B86695j000K0J103J662J834J905J489L60o93r48r12j217j299n14L60K76
57594B89121k18N6P55N52o90j916k647l140l175k287r75k60k54l78o37j347k084
57577B70476k236k152k418k524j694n14k39q30j222j115j007q89m20p2n12j199
$$ y = [473266, 502590, 537088, 577652, 623544, 673933, 728409, 785959, 845058, 905225, 966904, 1028892, 1086304, 1131092, 1154080, 1147790, 1110084, 1046313, 966956, 882368, 799709, 723477, 656373, 598887, 549740, 507764, 472664, 443882, 420144, 400616, 385272, 373696, 364609, 357022, 350723, 345329, 340092, 335064, 331221, 328864, 326990, 324773, 322591, 321101, 320302, 320024, 320329, 320894, 320924, 320146, 319036, 317753, 315792, 313061, 310261, 307750, 305049, 301929, 299012, 296755, 294733, 292473, 290190, 288251, 286695, 285695, 285715, 286818, 288480, 290314, 292219, 293708, 294068, 293375, 292427, 291515, 290298, 288999, 288485, 288845, 289121, 288903, 288959, 289714, 290266, 289576, 287660, 285013, 281873, 278698, 276411, 275436, 275176, 274922, 274544, 273907, 272560, 270476, 268240, 266088, 263670, 261146, 259452, 258938, 258699, 257869, 256647, 255532, 254525, 253636, 253216, 253144, 252632, 251433]
57561B51433j116n69n81r17m38P53J372J118J049J652K180K232K419L095L723
57546B67405L920M058M454M815M709L894K358O94P6Q80J864J702P90L67M17l1
57530C02372r93j448j022l36K05O98R78Q63R41J853L025L316K683K002J627J375
57514C18139J491K261L068L211L166L663M156L741K942K787K780J779M12L31J317
57499C55244J482L80m14j15J42n01j255j264p16Q7J208K099J793N35l01k71j96
57482C57937k46M18J697K199J576J276K101K876K494J665J418J358P08j06j97
57467C77174L76R87J479J978K338K483K648K833K789K854L762N250N954N242M063
57452D22210L437L138K605K074K033K315K526K750L280M043M738N106M918M241
$$ y = [251433, 250317, 249748, 249167, 248250, 247812, 248565, 249937, 251055, 252104, 253756, 255936, 258168, 260587, 263682, 267405, 271325, 275383, 279837, 284652, 289361, 293255, 295613, 296307, 296383, 297263, 299127, 300829, 301619, 301986, 302403, 302372, 301379, 299931, 298909, 298573, 298778, 299476, 300454, 301317, 302258, 304111, 307136, 310452, 313135, 315137, 316764, 318139, 319630, 321891, 324959, 328170, 331336, 334999, 339155, 342896, 345838, 348625, 351405, 353184, 353596, 353927, 355244, 356726, 357106, 356692, 356577, 356719, 356218, 354963, 353699, 352983, 353070, 354278, 356377, 358170, 358705, 358404, 358133, 357937, 357691, 358109, 359806, 362005, 363581, 364857, 366958, 369834, 372328, 373993, 375411, 376769, 377477, 377371, 377174, 377550, 378537, 380016, 381994, 384332, 386815, 389463, 392296, 395085, 397939, 401701, 406951, 412905, 418147, 422210, 425647, 428785, 431390, 433464, 435497, 437812, 440338, 443088, 446368, 450411, 455149, 460255, 465173, 469414]
57438D69414L681L728L987L849L655M133M998N329N170N371N865N618M446L426
57424E32670L266L589M039M668N097M728M052M257N308N969N922O149O903P104
57410F03721O336N628N645N736N530N729O477O654N761M957N165N677N691N707
57396F84414O300O890O985P334Q608J0055J0668J0652J0579J0245R499R142R769
57383H01140J0664J0961J1066J1707J2484J2486J1717J0828J0087R514R350R541
57371I31545R459Q979Q954R860J0740J0521R534Q892R023R661J0563J1413J1717
57358A060861J1505J1521J2103J2655J2727J2749J3089J3416J3562J3961J4563
57347A202712J4526J3731J3403J4312J5523J5889J5670J5637J5682J5410J5135
$$ y = [469414, 473095, 476823, 480810, 484659, 488314, 492447, 497445, 502774, 507944, 513315, 519180, 524798, 529244, 532670, 535936, 539525, 543564, 548232, 553329, 558057, 562109, 566366, 571674, 577643, 583565, 589714, 596617, 603721, 610057, 615685, 621330, 627066, 632596, 638325, 644802, 651456, 657217, 662174, 667339, 673016, 678707, 684414, 690714, 697604, 704589, 711923, 720531, 730586, 741254, 751906, 762485, 772730, 782229, 791371, 801140, 811804, 822765, 833831, 845538, 858022, 870508, 882225, 893053, 903140, 912654, 922004, 931545, 941004, 949983, 958937, 968797, 979537, 990058, 999592, 1008484, 1017507, 1027168, 1037731, 1049144, 1060861, 1072366, 1083887, 1095990, 1108645, 1121372, 1134121, 1147210, 1160626, 1174188, 1188149, 1202712, 1217238, 1230969, 1244372, 1258684, 1274207, 1290096, 1305766, 1321403, 1337085, 1352495, 1367630]
57336A367630J5169J5080J4650J4616J5441J6335J6541J6551J7006J7471J7493
57325A543983J7770J8889J9883J9499J8183J7428J7793J8786K0105K1706K3160
57314A757185K4071K4688K5279K5569K5577K6036K7086K7542K6666K5581K5682
57303B040962K6657K7380K7854K8736K9813L0491L1069L2040L2818L2673L2277
57292B372770L2784L3898L4482L4552L5101L6259L7172L7454L7436L7221L6791
57281B765920L6683L7306L8013L8110L8272L9584M1673M3284M4314M5638M7240
57270C216037M8159M8239M8369M8949M9503M9851N0365N0962N1107N0922N1153
57259C763616N1983N2923N3855N5205N7037N8979O0926O2915O4527O5372O6095
$$ y = [1367630, 1382799, 1397879, 1412529, 1427145, 1442586, 1458921, 1475462, 1492013, 1509019, 1526490, 1543983, 1561753, 1580642, 1600525, 1620024, 1638207, 1655635, 1673428, 1692214, 1712319, 1734025, 1757185, 1781256, 1805944, 1831223, 1856792, 1882369, 1908405, 1935491, 1963033, 1989699, 2015280, 2040962, 2067619, 2094999, 2122853, 2151589, 2181402, 2211893, 2242962, 2275002, 2307820, 2340493, 2372770, 2405554, 2439452, 2473934, 2508486, 2543587, 2579846, 2617018, 2654472, 2691908, 2729129, 2765920, 2802603, 2839909, 2877922, 2916032, 2954304, 2993888, 3035561, 3078845, 3123159, 3168797, 3216037, 3264196, 3312435, 3360804, 3409753, 3459256, 3509107, 3559472, 3610434, 3661541, 3712463, 3763616, 3815599, 3868522, 3922377, 3977582, 4034619, 4093598, 4154524, 4217439, 4281966, 4347338, 4413433]
57248D413433O7818P0801P4461P8446Q2619Q6308Q8788R0368R1934R3444R3937
57237E332357R2996R1251Q9540Q8376Q8079Q8543Q8991Q8754Q8182Q8156Q9064
57226F314289R0752R2914R4900R5797R5502R4985R4760R4020R2166R0015Q8304
57215G338404Q6249Q3089P9846P7722P5713P1937O6696O2126N9235N7346N6243
57204H114606N6624N8343O0132O1372O2516O3605O3919O3330O2457O1408N9671
57193H787983N7368N5272N3548N1791N0153M9104M8349M7431M7079M8294N0251
57182I346623N1001N0223M9533M9980N0961N1771N2544N3358N3861N4033N4001
57171I917889N3179N1050M8535M6964M5950M4066M1455L9681L8982L7754L4945
$$ y = [4413433, 4481251, 4552052, 4626513, 4704959, 4787578, 4873886, 4962674, 5053042, 5144976, 5238420, 5332357, 5425353, 5516604, 5606144, 5694520, 5782599, 5871142, 5960133, 6048887, 6137069, 6225225, 6314289, 6405041, 6497955, 6592855, 6688652, 6784154, 6879139, 6973899, 7067919, 7160085, 7250100, 7338404, 7424653, 7507742, 7587588, 7665310, 7741023, 7812960, 7879656, 7941782, 8001017, 8058363, 8114606, 8171230, 8229573, 8289705, 8351077, 8413593, 8477198, 8541117, 8604447, 8666904, 8728312, 8787983, 8845351, 8900623, 8954171, 9005962, 9056115, 9105219, 9153568, 9200999, 9248078, 9296372, 9346623, 9397624, 9447847, 9497380, 9547360, 9598321, 9650092, 9702636, 9755994, 9809855, 9863888, 9917889, 9971068, 10022118, 10070653, 10117617, 10163567, 10207633, 10249088, 10288769, 10327751, 10365505, 10400450]
57160A0400450L0915K5815J9196J1561M131l360j2509k3400l4034m3210n1826
57149A0323729o0593o8536p4547p8432p9536p6410o8947n9122m8660l7670k6420
57138I644856j6602r650n537m202o639j3501k4118l7663n3625p0308q4722r4906
57126I223383j00837j02465r8835r0299p9538o9370o1152n6217n6496o2103o9977
57115H376094p6291p8720p5802o6560n2347l6846k2457q125Q380K8392N3716Q7169
57103H136603J29811J80015K37291L04611L84926M77838N81771O96751Q22853
57094A1952470R59184J107561J274702J467588J687971J930709K179407K398357
57086B4957949K536800K553504K439758K216834J919640J592613J289153J044953
$$ y = [10400450, 10431365, 10457180, 10476376, 10487937, 10492068, 10488708, 10476199, 10452799, 10418765, 10375555, 10323729, 10263136, 10194600, 10120053, 10041621, 9962085, 9885675, 9816728, 9757606, 9708946, 9671276, 9644856, 9628254, 9618604, 9613067, 9608865, 9602226, 9588725, 9564607, 9526944, 9473319, 9403011, 9318289, 9223383, 9122546, 9020081, 8921246, 8830947, 8751409, 8682039, 8620887, 8564670, 8508174, 8446071, 8376094, 8299803, 8221083, 8145281, 8078721, 8026374, 7989528, 7967071, 7958946, 7967326, 7995718, 8049434, 8136603, 8266414, 8446429, 8683720, 8988331, 9373257, 9851095, 10432866, 11129617, 11952470, 12911654, 14019215, 15293917, 16761505, 18449476, 20380185, 22559592, 24957949, 27494749, 30048253, 32488011, 34704845, 36624485, 38217098, 39506251, 40551204]
57078D0551204Q38039N92634K44996j93111o44434j035101j344031j592115j804458
57069C5613623j992030k155804k291335k387719k430734k411349k330567k197450
57061A7416635k025751j831677j630625j433627j247146j075710r23004p90527
57053F458568o77259n81373n01244m34707l78809l31123k90443k55787k25639
57044B782184j98838j75403j55730j39420j25498j13290j02374r2131q2112p2595
57034A524793o4161n6780m9887m3239l7095l1577k6382k1131j5617r685l231L773
57022A169781J1454J9914K8501L5658M0301M3107M5458M6872M4128L3312J2748
57011A531234j5529m6220p2781r0270r7304r5605q8086p7593o6656n6955m8662
$$ y = [40551204, 41389243, 41981877, 42226873, 42033762, 41389328, 40354227, 39010196, 37418081, 35613623, 33621593, 31465789, 29174454, 26786735, 24356001, 21944652, 19614085, 17416635, 15390884, 13559207, 11928582, 10494955, 9247809, 8172099, 7249095, 6458568, 5781309, 5199936, 4698692, 4263985, 3885176, 3554053, 3263610, 3007823, 2782184, 2583346, 2407943, 2252213, 2112793, 1987295, 1874005, 1771631, 1679500, 1597388, 1524793, 1460632, 1403852, 1353965, 1310726, 1273631, 1242054, 1215672, 1194541, 1178924, 1169239, 1166008, 1169781, 1181235, 1201149, 1229650, 1265308, 1305609, 1348716, 1394174, 1441046, 1485174, 1518486, 1531234, 1515705, 1469485, 1396704, 1306434, 1209130, 1113525, 1025439, 947846, 881190, 824235, 775573]
57000G75573m1116l4210k8505k3995j9885j5767j2161r507p524n886m747m141
56988E68129l553k542j237P8J373K602L556M006L485J085l529r060j3516j6291
56974E34586j8102j8974j7874j4833j1703r834q323n707k237P68K938M968P278
56961D42951R698J2037J3981J4963J4922J4728J4768J3587R046Q22q971j7469
56949E35063k2822k4688k3894k1697j8905j5615j1822p921m388j406J097L479
56937C86481O468J0490J4747J7795J9202J9878K0595K1128K0963J9557J5644P829
56925E80777l280j4684k3531k9058l1594l1276k8719k5487k2576j9453j5756j2599
56913C22764j0857r508p305n010m155m430m192l012j853j113l23M34N63M16J126
$$ y = [775573, 734457, 700247, 671742, 647747, 627862, 612095, 599934, 590427, 582903, 577017, 572270, 568129, 564576, 562034, 560797, 560875, 562248, 564850, 568406, 572412, 575897, 576982, 573453, 564393, 550877, 534586, 516484, 497510, 479636, 464803, 453100, 443266, 434943, 429236, 426999, 427767, 430705, 435673, 442951, 452649, 464686, 478667, 493630, 508552, 523280, 538048, 551635, 560681, 561503, 552532, 535063, 512241, 487553, 463659, 441962, 423057, 407442, 395620, 387699, 383311, 381905, 383002, 386481, 392949, 403439, 418186, 435981, 455183, 475061, 495656, 516784, 537747, 557304, 572948, 580777, 577497, 562813, 539282, 510224, 478630, 447354, 418635, 393148, 370572, 351119, 335363, 322764, 311907, 302399, 295094, 290084, 285929, 281499, 277307, 274295, 272442, 271329, 271006, 271440, 272003, 272419, 273545]
56898B73545K800M343N200N972P107Q311R461J0970J2798J4120J4370J3963J3729
56885C96689J4188J5221J5806J4209R373K238m839j0027j2903j3785j2962j0652
56873D02556p162k984J174M838Q396J2661J7569K2128K5968K9827L3902L7025
56861E85898L8460L9318M0893M2415M1616L6704K6790J1768o424k3316l4684l9625
56849G59813l9725l6195k9588k1399j3423n689K997J2451K1096K8611L6494M5459
56837G60902N4004O0272O3925O5714O6425O6455O4880N8466M3186J7963j3479
56826A308713m4590o9259q3733q7386q2638p3294o2159n0341l8390k6939j6222
56815F73762o072L409J2009K0162K8439L6271M2205M5621M7238M7727M6503M1740
$$ y = [273545, 276345, 280688, 285888, 291860, 298967, 307278, 316739, 327709, 340507, 354627, 368997, 382960, 396689, 410877, 426098, 441904, 456113, 465486, 467724, 462885, 452858, 439955, 426170, 413208, 402556, 395394, 392410, 393584, 398422, 406818, 419479, 437048, 459176, 485144, 514971, 548873, 585898, 624358, 663676, 704569, 746984, 788600, 825304, 852094, 863862, 857438, 834122, 799438, 759813, 720088, 683893, 654305, 632906, 619483, 613794, 616791, 629242, 650338, 678949, 715443, 760902, 814906, 875178, 939103, 1004817, 1071242, 1137697, 1202577, 1261043, 1304229, 1322192, 1308713, 1264123, 1194864, 1111131, 1023745, 941107, 867813, 805654, 755313, 716923, 689984, 673762, 667690, 671099, 683108, 703270, 731709, 767980, 810185, 855806, 903044, 950771, 997274, 1039014]
56803A039014L0955J2462j2222l7665n7692o9528p4048p2768o6522n6828m6198
56792E88960l6324k7309j9036j1916n873r6N720J0974J5308J8939K1631K2795
56780E83773K2788K2536K1371J6799P256n995k0070l2344m0890m4721m4551m2221
56768D43731l8795l4188k8941k4706k2176j9991j6707j2788r647p765o737o274
56756B15016o122n655m487l091k217k031k259k576k592k037j269r29r58p47l01
56741A77745k23m87l21L75O76J06n77n74p3M20P99J009Q43M91M39O23M92J29K16
56722A82108P53R72P68R40J701K206K034J847K046K049J528J186J519J861J465
56707B04983O09l8l19l59j63R3J34J82O30J025N04o86j309j039p98r89q85k49
$$ y = [1039014, 1069969, 1082431, 1070209, 1032544, 974852, 905324, 831276, 758508, 691986, 635158, 588960, 552636, 525327, 506291, 494375, 488502, 488406, 494126, 505100, 520408, 539347, 560978, 583773, 606561, 629097, 650468, 667267, 674523, 668528, 648458, 616114, 575224, 530503, 485952, 443731, 404936, 370748, 341807, 317101, 294925, 274934, 258227, 245439, 235792, 228027, 221290, 215016, 208894, 203239, 198752, 195661, 193444, 191413, 189154, 186578, 183986, 181949, 180680, 179751, 178793, 178046, 177745, 177522, 177035, 176714, 177089, 177765, 177871, 177294, 176720, 176647, 177067, 177866, 178875, 179718, 180209, 180648, 181271, 181763, 181892, 182108, 182861, 183833, 184601, 185541, 187242, 189448, 191482, 193329, 195375, 197424, 198952, 200138, 201657, 203518, 204983, 205592, 205554, 205235, 204876, 204713, 204806, 204940, 205122, 205752, 206777, 207281, 206595, 205286, 204247, 203449, 202460, 201575, 201326]
56689B01326Q6j74q2P67J286O31l57m27M04J252J555J188M16J71J198K587K554
56672B14381J100K09Q48J578J126L77N78J223J276J053J281J520J028K51l3o4
56656B27732k74r7R64K011J952J301J304J919K050J293K31o10r94o49K74Q59M20
56639B39686o15j454j941k191k037j585j478j857j982j551j326j658j670q89l79
56624B17073j049j972j820r73p47j318j852j953j763j163j85L93L9n23l20M22
56608B02289Q76R70J069J036O74M19N79N57j53r04q61k80J50M61Q80J004N78K96
56590B09640P16J199R82N02N69J018J246J299J409J300R51J022J573J518N06j1
56574B25439J075K536K645J821J757K818M097N174O100O369N724N320O368Q156
$$ y = [201326, 201412, 201238, 201156, 201923, 203209, 203840, 203483, 203056, 203460, 204712, 206267, 207455, 207871, 208042, 209240, 211827, 214381, 215481, 215690, 216538, 218116, 219242, 219619, 220197, 221420, 222696, 223749, 225030, 226550, 227578, 227829, 227796, 227732, 227458, 227361, 228325, 230336, 232288, 233589, 234893, 236812, 238862, 240155, 240386, 239776, 238782, 238133, 238407, 239266, 239686, 239071, 237617, 235676, 233485, 231448, 229863, 228385, 226528, 224546, 222995, 221669, 220011, 218341, 217452, 217073, 216024, 214052, 212232, 211259, 210512, 209194, 207342, 205389, 203626, 202463, 202278, 202671, 202710, 202187, 201867, 202289, 203165, 204135, 205204, 206240, 206914, 207333, 207912, 208469, 208316, 207412, 206551, 206271, 206421, 206882, 207762, 208766, 209344, 209640, 210356, 211555, 212537, 213039, 213608, 214626, 215872, 217171, 218580, 219880, 220831, 221853, 223426, 224944, 225450, 225439, 226514, 229050, 231695, 233516, 235273, 238091, 242188, 247362, 253462, 259831, 265555, 270875, 277243, 285399]
56560B85399R061R003R210J0055J0704J0483R143O315K285j246k721k623k473
56547C52595k631k597k653l364m097l921l450l951n003n070m071l446l786m239
56533C00316m271m283m433m362m125m019l624k439j164q63j185r86m22o63j738
56518B61739k377k041j510j370j351j249j157r05m60n89j821l099k957j610m12
56503B38831K94J033J408M60j366k467k405k148k080j642r60r44j494j347j62
56488B25011Q98R92N68J88j65l33P5P09P15J80O4N60Q24N01K66N31Q74R30Q41
56469B34229O65K81p6j36j99n59o34J88J307J680J387J124P44k08j083q47J37
56452B38000O91P73J176J744J642J136J164J388O19q99j585r33o1K47K90J76l85
$$ y = [285399, 294460, 303463, 312673, 322728, 333432, 343915, 353058, 359373, 361658, 360412, 357691, 355068, 352595, 349964, 347367, 344714, 341350, 337253, 333332, 329882, 325931, 320928, 315858, 311787, 308341, 304555, 300316, 296045, 291762, 287329, 282967, 278842, 274823, 271199, 268760, 267596, 266733, 265548, 264562, 264140, 263477, 261739, 259362, 257321, 255811, 254441, 253090, 251841, 250684, 249779, 249319, 248730, 246909, 243810, 240853, 239243, 238831, 239125, 240158, 241566, 242026, 240660, 238193, 235788, 233640, 231560, 229918, 228958, 228014, 226520, 225173, 225011, 225909, 226901, 227469, 227657, 227492, 227159, 227234, 227943, 228658, 228838, 228902, 229462, 230286, 230787, 231053, 231584, 232458, 233388, 234229, 234894, 235175, 235099, 234963, 234764, 234205, 233571, 233759, 235066, 236746, 238133, 239257, 240001, 239793, 238710, 237863, 238000, 238691, 239464, 240640, 242384, 244026, 245162, 246326, 247714, 248333, 247434, 245849, 244916, 244855, 245102, 245392, 245568, 245183]
56435B45183r60p17J9J26l78m21J55M50K75L93R04J099R05Q66P37j79j324j311
56417B45822r7J003J372J529J639J374J098J408J685R53j03n6P35O57k67m57L89
56400B58684R27P32P95J280J212O87R42J930K185J519J337J890J713M32l32L39
56384B76272J333J655J714J780J289M67M94J362J579P08L1J10m3o57l97J124K338
56367B91159K227J759J826J762J044M99P26R82O55K87L14L35K63O19J212J225
56351C06894Q83J206J994K049J547J774K424J794R4l40J217K641K424J702J809
56336C30112K352K797L537M314L983K829K694L909M641M184M086M979N191L857
56322C83465K572K513K579J936J677K352K553J580R51J536J825Q25J17J098K672
$$ y = [245183, 244223, 243506, 243525, 243651, 243273, 242852, 243007, 243457, 243732, 244125, 245029, 246128, 247033, 247899, 248636, 248457, 247133, 245822, 245725, 246728, 248100, 249629, 251268, 252642, 253740, 255148, 256833, 257786, 257683, 257627, 258362, 259019, 258752, 258295, 258684, 259611, 260343, 261138, 262418, 263630, 264317, 265259, 267189, 269374, 270893, 272230, 274120, 275833, 276265, 275933, 276272, 277605, 279260, 280974, 282754, 284043, 284510, 285004, 286366, 287945, 288653, 288684, 288794, 288751, 288094, 287697, 288821, 291159, 293386, 295145, 296971, 298733, 299777, 300276, 301002, 301984, 302639, 302926, 303240, 303575, 303838, 304457, 305669, 306894, 307777, 308983, 310977, 313026, 314573, 316347, 318771, 320565, 320659, 320319, 321536, 324177, 326601, 328303, 330112, 332464, 335261, 338798, 343112, 347095, 349924, 352618, 356527, 361168, 365352, 369438, 374417, 379608, 383465, 386037, 388550, 391129, 393065, 394742, 397094, 399647, 401227, 402178, 403714, 405539, 406364, 406481, 407579, 410251]
56307D10251L546M375N749O525O071N809O578O905N896N293O482P907P783O997
56293D96167P001P113O406O077P272Q613Q513Q126R321J1336J2181J2025J2610
56280F12761J4326J6088J7211J7650J7409J7214J8388K0792K2532K3007K4163
56269H21541K7253L0655L2716L4545L7872M2372M7122N2671N9500O6448P2843
56258A325538Q0142Q9404R9141J07893J16756J27109J37945J47900J57810J68775
56248B558413J79430J87633J93099J96164J95873J91585J84537J75477J62662
56239D224873J44458J21912R6567O8068L6338L775k7462n8019q8476j16198j38157
56228D267679j54875j68471j78793j84548j86554j86597j84560j79646j72844
$$ y = [410251, 413797, 418172, 423921, 430446, 436517, 442326, 448904, 455809, 461705, 466998, 473480, 481387, 489170, 496167, 503168, 510281, 516687, 522764, 530036, 538649, 547162, 555288, 564609, 575945, 588126, 600151, 612761, 627087, 643175, 660386, 678036, 695445, 712659, 731047, 751839, 774371, 797378, 821541, 848794, 879449, 912165, 946710, 984582, 1026954, 1074076, 1126747, 1186247, 1252695, 1325538, 1405680, 1495084, 1594225, 1702118, 1818874, 1945983, 2083928, 2231828, 2389638, 2558413, 2737843, 2925476, 3118575, 3314739, 3510612, 3702197, 3886734, 4062211, 4224873, 4369331, 4491243, 4587810, 4655878, 4692216, 4695991, 4668529, 4610510, 4522034, 4405836, 4267679, 4112804, 3944333, 3765540, 3580992, 3394438, 3207841, 3023281, 2843635, 2670791]
56219B670791j65432j56612j45543j34079j24574j16492j07976r9219r1521q4597
56209A444746p7603p1195o6012o0831n4791m9430m5890m2355l7108l1820k8640
56198H79071k6345k2782j8921j6914j6118j4649j3034j2657j2415j0585q323p679
56186F98649p825o765n156m777m918l943k700k797l184k110o74p23j065L14K159
56171F54485K162J341K100L609L529K774M044O929Q746R186R934J0963J1240J1856
56157G42898J4244J6761J7134J6858J8849K2287K4308K5417K8422L3230L7382
56146I97790M0745M5192N0597N5614O1211O8980P7203Q3120Q7775R3896J00359
56135A762482J03616J03244J01083R6221Q6255P2587N9379M8120L8031L0393K6863
$$ y = [2670791, 2505359, 2348747, 2203204, 2069125, 1944551, 1828059, 1720083, 1620864, 1529343, 1444746, 1367143, 1295948, 1229936, 1169105, 1114314, 1064884, 1018994, 976639, 939531, 907711, 879071, 852726, 829944, 811023, 794109, 777991, 763342, 750308, 737651, 725236, 714651, 706328, 698649, 690824, 684059, 678903, 674126, 669208, 665265, 662565, 659768, 656584, 654474, 653800, 653077, 652012, 652326, 654485, 656647, 657988, 660088, 663697, 667226, 670000, 674044, 680973, 689719, 698905, 708839, 719802, 731042, 742898, 757142, 773903, 791037, 807895, 826744, 849031, 873339, 898756, 927178, 960408, 997790, 1038535, 1083727, 1134324, 1189938, 1251149, 1320129, 1397332, 1480452, 1568227, 1662123, 1762482, 1866098, 1969342, 2070425, 2166646, 2252901, 2325488, 2384867, 2432987, 2471018, 2501411, 2528274]
56124B528274K4563J8469Q089l221j4384k6481l7740m4907m9127n4759o2769p0735
56112B215272p8514q7990r7637j03311j04189j02483r7987q8865p7105o7040n8832
56101A251319m9388l9176l1679k6761k1106j4910j1444j0213p376k966p53r02
56089A034645L00L136L996K668L004N688P274P118Q308J0963J1653J0310J0721
56076A119784J3265J4192J2994J3359J5825J6692J5401J5764J8532J9860J8575
56065A294243J7911J8746J8164J6003J5750J7583J7611J5201J3989J4679J4099
56054A473979J2321J3101J6311J7645J6734J7686K0757K1755K0601K1800K5520
56043A678210K7019K6089K7781L2414L4440L2855L3074L6534L8359L7410L8616
$$ y = [2528274, 2552837, 2571306, 2579395, 2576174, 2561790, 2535309, 2497569, 2452662, 2403535, 2348776, 2286007, 2215272, 2136758, 2048768, 1951131, 1847820, 1743631, 1641148, 1543161, 1454296, 1377191, 1310151, 1251319, 1201931, 1162755, 1131076, 1104315, 1083209, 1068299, 1056855, 1046642, 1039266, 1036300, 1035547, 1034645, 1034945, 1038081, 1042077, 1044745, 1047749, 1053437, 1060711, 1067829, 1076137, 1087100, 1098753, 1109063, 1119784, 1133049, 1147241, 1160235, 1173594, 1189419, 1206111, 1221512, 1237276, 1255808, 1275668, 1294243, 1312154, 1330900, 1349064, 1365067, 1380817, 1398400, 1416011, 1431212, 1445201, 1459880, 1473979, 1486300, 1499401, 1515712, 1533357, 1550091, 1567777, 1588534, 1610289, 1630890, 1652690, 1678210, 1705229, 1731318, 1759099, 1791513, 1825953, 1858808, 1891882, 1928416, 1966775, 2004185, 2042801]
56032B042801M2832M4593M2576M2245M5265M6591M4955M5830N0738N4024N3628
56021B556078N4699N9140O2067O2008O4044O9479P3055P3618P6609Q2910Q6683
56010C320390Q7183R0871R8745J04060J05600J10130J18536J23405J23931J28667
56000D411518J39538J48045J51700J58706J71636J82590J89625K01284K19289
55991E973931K34074K43374K57365K79083K98593L13228L33840L63643L91480
55982H688611M14172M44061M85708N27661N66671O16384O81797P50128Q18362
55973A3993555R03499J013255J134622J265266J426887J632681J873203K151921
55965B5394889K501811K947393L483161M106947M835591N667762O576806P566999
$$ y = [2042801, 2085633, 2130226, 2172802, 2215047, 2260312, 2306903, 2351858, 2397688, 2448426, 2502450, 2556078, 2610777, 2669917, 2731984, 2793992, 2858036, 2927515, 3000570, 3074188, 3150797, 3233707, 3320390, 3407573, 3498444, 3597189, 3701249, 3806849, 3916979, 4035515, 4158920, 4282851, 4411518, 4551056, 4699101, 4850801, 5009507, 5181143, 5363733, 5553358, 5754642, 5973931, 6208005, 6451379, 6708744, 6987827, 7286420, 7599648, 7933488, 8297131, 8688611, 9102783, 9546844, 10032552, 10560213, 11126884, 11743268, 12425065, 13175193, 13993555, 14897054, 15910309, 17044931, 18310197, 19737084, 21369765, 23242968, 25394889, 27896700, 30844093, 34327254, 38434201, 43269792, 48937554, 55514360, 63081359]
55957F3081359Q689410R973609J1400634J2982452J4800918J6894189J9125073
55950A56947644K1194255K2761213K3602836K3819682K3887540K4149103K3908843
55943C20271116K1219670J4172718K784796j0474668k2196992l0095974l3779288
55936B61901378l4073515l2092552k8838577k5128971k1502607j8186371j5237481
55929H6841304j2689120j0549391q766849p279234o060025n082053m284373l613634
55921B8516625l059093k616150k252545j938627j675989j468586j295942j139292
55913A3070401j005616r02400q14597p27997o51100n93289n43735m91182m43456
55904F897029m08996l78636l43157l10475k88767k69897k45380k22301k08336
$$ y = [63081359, 71770769, 81744378, 93145012, 106127464, 120928382, 137822571, 156947644, 178141899, 200903112, 224505948, 248325630, 272213170, 296362273, 320271116, 341490786, 355663504, 358448300, 347973632, 325776640, 295680666, 261901378, 227827863, 195735311, 166896734, 141767763, 120265156, 102078785, 86841304, 74152184, 63602793, 54835944, 47556710, 41496685, 36414632, 32130259, 28516625, 25457532, 22841382, 20588837, 18650210, 16974221, 15505635, 14209693, 13070401, 12064785, 11162385, 10347788, 9619791, 8968691, 8375402, 7831667, 7340485, 6897029, 6488033, 6109397, 5766240, 5455765, 5166998, 4897101, 4651721, 4429420, 4221084]
55895D221084j96556j79657j64216j56772j50117j37155j24688j20054j17036
55886B874833j08117r8434r4730r2125q4200p5356p1267o7446n8794n0448m8152
55875B025764m7340m2314l7002l6443l6937l4656l4803m2020n0355n2670n1827
55864A559397n3006n3296m8568m2869m1218m0350l5914l1629l2167l3772l1090
55853A115518k6804k5667k5334k1904j8491j9512k2074k1369j9355j9984k1107
55842H73917j9040j6176j6321j7281j5454j3039j3491j4531j2723j0336j0776
55831G14749j1775r910p367p593q626p281n475o103p039n515l914n085o437m997
55817F17632l512n181o974m897j397p24j262O87L545L805L014M572O943O758N382
$$ y = [4221084, 4024528, 3844871, 3680655, 3523883, 3373766, 3236611, 3111923, 2991869, 2874833, 2766716, 2668282, 2573552, 2481427, 2397227, 2321871, 2250604, 2183158, 2124364, 2073916, 2025764, 1978424, 1936110, 1899108, 1862665, 1825728, 1791072, 1756269, 1714249, 1663894, 1611224, 1559397, 1506391, 1453095, 1404527, 1361658, 1320440, 1280090, 1244176, 1212547, 1180380, 1146608, 1115518, 1088714, 1063047, 1037713, 1015809, 997318, 977806, 955732, 934363, 915008, 895024, 873917, 854877, 838701, 822380, 805099, 789645, 776606, 763115, 748584, 735861, 725525, 714749, 702974, 693064, 685697, 678104, 669478, 662197, 656722, 650619, 643580, 638065, 634151, 629066, 622629, 617632, 614120, 608939, 601965, 597068, 595671, 594947, 593685, 594372, 597917, 601722, 604736, 609308, 616251, 623009, 628391]
55802F28391N952P046N627L190K691K461o06m834o903q158j1588j5416j5989j4360
55788E77504j3847j3633j0915o974n027m240j844J075J599O32Q38J248l34j886
55774E24196jL889N849O018P242R203R691R639J0944J1005N580m118j2761j8169
55760E68207k1869k3987k3221k0909j9661j8790j5965j2269j0624j0534r447p976
55748C72955q637j0583j0874r790r743j0028q033m618k946k803j411Q50J044n75
55734B94808q76L71L03j465k268j477j262k003j741m96n86k174k861k046j570
55719B74657j785j061N72J217Q18J230K501K871K402K893M256M712M416M999N743
55704C10441M276R84j282j937l027m971o001o003o673p586o389l363j641k111
$$ y = [628391, 634343, 641389, 647016, 650206, 652897, 655358, 654752, 649918, 643015, 634857, 623269, 607853, 591864, 577504, 563657, 550024, 539109, 532135, 527108, 522868, 521024, 522099, 523698, 524330, 525168, 526416, 526082, 524196, 524195, 528084, 533933, 539951, 547193, 556396, 566087, 575726, 586670, 597675, 603255, 599137, 586376, 568207, 546338, 522351, 499130, 478221, 458560, 439770, 423805, 411536, 400912, 390378, 380931, 372955, 364318, 353735, 342861, 333071, 323328, 313300, 305267, 300649, 297703, 294900, 293489, 294339, 295383, 294808, 293932, 294303, 294606, 293141, 290873, 289396, 288134, 286131, 284390, 283894, 283308, 281134, 278273, 276227, 274657, 272872, 271811, 272383, 273600, 274418, 275648, 278149, 281020, 283422, 286315, 290571, 295283, 299699, 304698, 310441, 314717, 315701, 314419, 312482, 309455, 304484, 298483, 292480, 285807, 278221, 271832, 268469, 266828, 264717]
55690B64717k147l24J476J730J441J475J077K30M63K136L614M019M297M900N005
55675B94109M463M064L534J821m63j512j366j717k675k598j250k25k7L94J125
55660B97677J112N99Q93J674J424N04P37J898J784l7j685k419l444n014n801n676
55644B84226o052p071p354o817o814p216o462m770m131m756m703l530k999l606
55630B07945l705k787k360k743k262n75L60l28j054q89j030k060k605j993j464
55615A82450j564j008N87J510P72l17o50r43j694j916j173o45r30r77k75O6n31
55598A72762j047r96j304k093j872j80J210J002K16R2J39l82r02p94n65p00p46
55581A63840m20j12K94J452K892L205K408K123K917L511L296L329M115M593M185
$$ y = [264717, 262570, 262246, 263722, 265452, 266893, 268368, 269445, 269675, 270138, 272274, 275888, 279907, 284204, 289104, 294109, 298572, 302636, 306170, 307991, 307528, 306016, 304650, 302933, 300258, 297660, 296410, 296185, 296158, 296552, 297677, 298789, 299388, 300281, 301955, 303379, 303883, 304620, 306518, 308302, 308265, 306580, 304161, 300717, 295703, 289902, 284226, 278174, 271103, 263749, 256932, 250118, 242902, 236440, 231670, 227539, 222783, 218080, 214550, 211551, 207945, 204240, 201453, 199093, 196350, 194088, 193513, 193873, 193545, 192491, 191602, 190572, 188512, 185907, 183914, 182450, 180886, 179878, 180465, 181975, 182747, 182430, 181780, 180837, 179143, 177227, 176054, 175409, 174479, 173502, 173227, 173293, 172762, 171715, 170719, 169415, 167322, 165450, 165270, 166480, 167482, 167698, 167790, 167929, 167547, 166645, 165851, 165286, 164586, 163840, 163420, 163308, 163602, 165054, 167946, 171151, 173559, 175682, 178599, 182110, 185406, 188735, 192850, 197443, 201628]
55566B01628L800L816L300K079J529K156K496J492R1o30j070j789k320k378k560
55551B11640l025l067k660k672k931k160m23M82r0n36J97R56O30J1P7L28J02j02
55533A96757J23P0p75j800k478l058l447l103k565l149m534m731l165j636j384
55518A61125j493j228j481k630l192k226j061j053j506j328r87j166j127o4J210
55503A41793J487Q81J19o83j428j498p65l9K68N81Q17K84n93m11O77Q13m20j007
55485A40876J73J458J268N06N09P16K40k24O8K43m59r54j80Q59P97J61P8J13o55
55466A45593j689j950j720j735j582o93J55N2l39L2O62M24m06o64j82K62L00R2
55448A36612k96o04k77N29P36Kn39p4N98N23M1j81k42j99M60J519J696O17l49
$$ y = [201628, 205428, 209244, 212544, 214623, 216152, 218308, 220804, 222296, 222387, 221757, 220687, 218898, 216578, 214200, 211640, 208615, 205548, 202888, 200216, 197285, 195125, 194702, 195184, 195094, 194558, 194755, 195711, 196341, 196352, 196429, 196757, 196859, 196757, 196880, 196950, 196175, 194375, 191897, 188839, 185392, 182289, 179724, 176575, 172041, 167310, 164145, 162509, 161125, 159632, 158404, 156923, 154293, 151101, 148875, 147814, 146761, 145255, 143927, 142940, 141774, 140647, 140583, 141793, 143280, 144161, 144280, 143597, 142169, 140671, 139906, 139867, 140135, 140716, 141533, 141817, 141224, 140813, 141490, 142303, 141883, 140876, 141049, 142507, 143775, 144281, 144790, 145506, 145746, 145522, 145590, 145833, 145374, 144420, 144240, 145099, 145896, 146057, 146135, 146248, 145593, 143904, 141954, 140234, 138499, 136917, 136224, 136379, 136431, 136092, 136124, 136786, 137210, 136804, 136140, 135958, 136220, 136520, 136612, 136316, 135712, 135435, 135964, 136700, 136702, 136163, 136089, 136687, 137210, 137251, 137070, 136828, 136629, 137089, 138608, 140304, 140921, 140572]
55429A40572k83q5m71n00N18J387R47Lk20p0k25j17O93J051M7j104q61K54Q62
55410A42398R92J256J095o6j144r06j37l25j185j437j084r13p12M9O49K34l54
55393A38410Q8Q63N00o05q72k08J49n5m7R1l56r52n49O02J070N31Q5L47P98R82
55373A40872R33M32p38j937k258j797j234o28K38Q69O99J90J03K59J49P7M06N37
55355A37172k9n04j11L03l19j203r56J9K40l01l44L07O72N32O17R69Q51J94m11
55336A37698r25j585j781q35M70P33K8m20k87j92j36L57Q49N13j92j25M97M49
55318A35116k51l74K86O03J30l18l60n58r99r58l28M1j95l92j25L01O59J013J048
55299A34339M35j64K51J370J850J221K97k70n62n51j0O71P15J39l51n02n64m56
$$ y = [140572, 140289, 140204, 139733, 139233, 139751, 141138, 142085, 142088, 141868, 141798, 141573, 141456, 142149, 143200, 143247, 142143, 141282, 141536, 142398, 143390, 144646, 145741, 145675, 144531, 143625, 143488, 143163, 141978, 140541, 139457, 138544, 137832, 137881, 138530, 138764, 138410, 138498, 139361, 139861, 139256, 138384, 138176, 138325, 138270, 138223, 138314, 137958, 137006, 136457, 137059, 138129, 138660, 138745, 139092, 139890, 140872, 141805, 142237, 141499, 139562, 137304, 135507, 134273, 133645, 133883, 134752, 135451, 135641, 135744, 136003, 136152, 136229, 136635, 137172, 137143, 136639, 136528, 136831, 136512, 135309, 134353, 134372, 134612, 134311, 133967, 134274, 134946, 135478, 136095, 137064, 137915, 138109, 137698, 136773, 135188, 133407, 132572, 133042, 133775, 133803, 133383, 133096, 132904, 132768, 133125, 133974, 134487, 134295, 134170, 134667, 135116, 134865, 134491, 134777, 135380, 135510, 135192, 134832, 134274, 133275, 132317, 131989, 132030, 131835, 131443, 131318, 131619, 132278, 133291, 134339, 134774, 134610, 134861, 136231, 138081, 139302, 139599, 139329, 138767, 138216, 138206, 138877, 139592, 139731, 139380, 138878, 138314, 137858]
55281A37858o0N5n64j136o62L18M65k54p44p77j019j355j024l10l15q85o54O07
55263A29544J466J099M03L25N55N74N78P55P13K40k13l09k28j29J02M60Q46J362
55245A38143J813J416l0j221q94K12L79n25j164j076j060j287q92K38J024Q37
55229A35913K75l6n7K89R90J165n2j776k106p31P26J175J171J316J255P79L69
55212A40665J63l07r36r52l65p4l10l04J72M06K12K86O95N51l65j091j085q80
55194A36481p86l80K43K55l83o40k17m3m51m40N59J641J952J869J902J743J135
55177A44440N11M4n93j109o12O44J121K53o96p81p03j062j001J22J254J208M28
55160A43468j15o04j525k207j758o20J34M36Q40J200J023N90M87M69k2o24m74
$$ y = [137858, 137798, 137853, 137289, 136153, 135491, 135809, 136274, 136020, 135276, 134499, 133480, 132125, 131101, 130791, 130476, 129591, 128937, 129544, 131010, 132109, 132512, 132837, 133392, 133966, 134544, 135299, 136012, 136252, 136039, 135730, 135502, 135373, 135475, 135935, 136781, 138143, 139956, 141372, 141342, 140121, 139227, 139439, 139818, 139293, 138129, 137053, 135993, 134706, 133814, 134052, 135076, 135913, 136188, 136152, 136095, 136384, 137374, 138539, 138487, 136711, 134605, 133874, 134600, 135775, 136946, 138262, 139517, 140296, 140665, 140828, 140521, 139585, 138633, 138268, 138194, 137884, 137580, 137752, 138158, 138370, 138656, 139351, 139902, 139537, 138446, 137361, 136481, 135695, 135315, 135558, 135813, 135430, 134790, 134573, 134530, 134079, 133639, 134198, 135839, 137791, 139660, 141562, 143305, 144440, 144951, 144995, 144402, 143293, 142681, 143325, 144446, 144699, 144003, 143222, 142519, 141457, 140456, 140578, 141832, 143040, 143468, 143353, 142749, 141224, 139017, 137259, 136639, 136773, 137209, 138049, 139249, 140272, 140862, 141349, 141818, 141796, 141172, 140698]
55143A40698L49Q15L50n45j015n77O67K035K617K116J118L20j73n37p38p02n47
55126A46251l84j77j5mQ0N50J176J416J269J159J074O74J55Q6L65L70J27J77L73
55107A54722M5n89n27L17R31R20R59J191Q65pk31N68J118M84n37q75o72m01J62
55088A58443J029J308N67k57k56J36J93J26K36M1o27p57L83J795K086J382P75
55071A66603N58K63j82m58o18q63j014r04p67o14p7N81L21j038k092j778r45q99
55053A56077j349j095k5R09J174Q97J97p18j221r90o16o67p84n20k73m24l80M02
55035A50594J170R00o0n98n45n72p87p01k92RJ76M87P82P63O74Q63J071R18P08
55016A55560P79O21l33j465j663q99j10K73O27J115J398J298R69M46k73q15p71
$$ y = [140698, 141047, 141862, 142212, 141667, 140652, 140075, 140742, 142777, 145394, 147510, 148628, 148948, 148775, 148238, 147500, 146798, 146251, 145867, 145690, 145675, 145671, 145751, 146301, 147477, 148893, 150162, 151321, 152395, 153069, 153224, 153310, 153675, 154045, 154172, 154349, 154722, 154767, 154178, 153651, 153968, 154899, 155819, 156778, 157969, 158834, 158827, 158596, 159164, 160282, 160766, 160229, 159354, 158682, 158281, 158443, 159472, 160780, 161347, 161090, 160834, 160970, 161163, 161289, 161525, 161566, 160939, 160182, 160565, 162360, 164446, 165828, 166603, 167161, 167424, 167242, 166784, 166166, 165303, 164289, 163385, 162618, 162004, 161927, 162508, 162829, 161791, 159699, 157921, 156976, 156077, 154728, 153633, 153608, 154517, 155691, 156588, 156785, 156067, 154846, 153856, 153240, 152573, 151789, 151269, 150996, 150572, 150192, 150594, 151764, 152664, 152604, 152006, 151461, 150889, 150102, 149401, 149109, 149118, 149294, 149781, 150563, 151326, 152000, 152863, 153934, 154852, 155560, 156339, 156960, 156627, 155162, 153499, 152600, 152490, 152763, 153390, 154505, 155903, 157201, 158170, 158616, 158343, 157528, 156757]
54999A56757l16N6K40M73Q36J209J430J186K69p87j030l95Q2j51l42J54P07N35
54981A60913N8J07N12N88L64L12M18M29M93P65R08P51P02Q24M91l09n23J93M97
54962A68493m73j318m27J280J634M62m84l61K5R3J39J21m23j071p79M13J335J513
54944A70172J589J804J576Q06L14N22R17J070J140J149Q85O83J267K511L428L608
54928A93441L700M268N097N876O598P124P168O874O646O310N315L742K166N39
54914B64864j797m779p320q544q528p701o401n184m683m815m819m217l230k224
54900A90622j365p99n44l10L1Q0l15l60O89K260L197L455L871M536M722M347M183
54883B18300M514M789M826N158N941O531O502O082N387M055J952n61l150n554
$$ y = [156757, 156441, 156497, 156737, 157210, 158046, 159255, 160685, 161871, 162140, 161353, 160323, 159928, 160010, 159859, 159517, 159671, 160378, 160913, 160971, 161078, 161590, 162178, 162542, 162854, 163272, 163701, 164194, 164959, 165867, 166618, 167320, 168144, 168635, 168326, 167803, 167996, 168493, 168020, 166702, 166275, 167555, 169189, 169651, 169167, 168806, 168831, 168924, 169063, 169184, 168761, 167690, 166911, 167324, 168659, 170172, 171761, 173565, 175141, 175947, 176261, 176783, 177700, 178770, 179910, 181059, 181944, 182627, 183894, 186405, 189833, 193441, 197141, 201409, 206506, 212382, 218980, 226104, 233272, 240146, 246792, 253102, 258417, 262159, 264325, 264864, 263067, 258288, 250968, 242424, 233896, 226195, 219794, 214610, 209927, 205112, 200293, 196076, 192846, 190622, 189257, 188458, 187914, 187604, 187635, 187715, 187400, 187040, 187729, 189989, 193186, 196641, 200512, 205048, 209770, 214117, 218300, 222814, 227603, 232429, 237587, 243528, 250059, 256561, 262643, 268030, 272085, 274037, 273476, 270326, 264772]
54869B64772p222p796p850q192q561q087o926o099n743m979l643k695k544k374
54855A82061j648j032j148j614j879k033k168j897j197p91j081j514j513j277
54841A61269j159j032q07p40p85l88N57J312J365J127J128J232J144R33O00j46
54825A65610j135j529r00P4M97L10qj16J50Q68J707K059J781J244N73l86j205
54808A69594r78K81J359J414R13N59K81kL17J513K602K446J316L90J80K63K28
54791A82676P3j57l81k81L21R96J169R02P88J199J951K550K603K217K102K861
54775B01589M075M707M541M542N430O629P243P282P286P240O660N497M153K799
54761B79673J268m35k135l848n640p184p925p757p169o652o204n509m426l216
$$ y = [264772, 257550, 249754, 241904, 233712, 225151, 217064, 210138, 204039, 198296, 193317, 189674, 186979, 184435, 182061, 180413, 179381, 178233, 176619, 174740, 172707, 170539, 168642, 167445, 166654, 165573, 164059, 162546, 161269, 160110, 159078, 158271, 157531, 156746, 156358, 156915, 158227, 159592, 160719, 161847, 163079, 164223, 165156, 165756, 165610, 164475, 162946, 162046, 162120, 162617, 162927, 162919, 162803, 162953, 163821, 165528, 167587, 169368, 170612, 171185, 170799, 169594, 168616, 168897, 170256, 171670, 172583, 173142, 173423, 173421, 173738, 175251, 177853, 180299, 181615, 182005, 182185, 182448, 182676, 182749, 182592, 182211, 181930, 182251, 183247, 184416, 185318, 186106, 187305, 189256, 191806, 194409, 196626, 198728, 201589, 205664, 210371, 214912, 219454, 224884, 231513, 238756, 246038, 253324, 260564, 267224, 272721, 276874, 279673, 280941, 280506, 278371, 274523, 268883, 261699, 253774, 246017, 238848, 232196, 225992, 220483, 216057, 212841]
54747B12841k357k164k515k964k993k288r70K74O74K04l19j88M80J241K015K867
54731B03838L526L826M223N131O125O562O582O673O529N465L771K479J790Q20
54717B67340r37k999m867o518p688p735o676n470m862m733m764m869m725l829
54703A96668k409j412j306j675k142k714l072k634j658j133j234j045k18M08L51
54688A74775L20P69R53L07m26m64k84n73q98o40k98o11j061o56L13O41J6o63p29
54669A70791m59l50n30q22r54o98k50j07l32m05j01J59K02N20J220J504R44L57
54651A70689N14Q33M47k34j97M16N28k27j194j768j828j370n84j08k95n69l05
54634A64748J03p7o19q11p37r70j303r92q1O72J025J301J353P09k79o21j33L82
$$ y = [212841, 210484, 208320, 205805, 202841, 199848, 197560, 196590, 196864, 197538, 197742, 197423, 197235, 197715, 198956, 200971, 203838, 207364, 211190, 215413, 220544, 226669, 233231, 239813, 246486, 253015, 258480, 262251, 264730, 266520, 267340, 266403, 263404, 258537, 252019, 244331, 236596, 229920, 224450, 219588, 214855, 210091, 205222, 200497, 196668, 194259, 192847, 191541, 189866, 187724, 185010, 181938, 179304, 177646, 176513, 175279, 174234, 174016, 174424, 174775, 175095, 175864, 176817, 177124, 176698, 176234, 175950, 175377, 174479, 173839, 173541, 172930, 171869, 171213, 171526, 172167, 172183, 171520, 170791, 170332, 169982, 169452, 168630, 167676, 166978, 166728, 166621, 166289, 165884, 165783, 165942, 166144, 166664, 167884, 169388, 170332, 170689, 171203, 172036, 172483, 172249, 172052, 172468, 172996, 172769, 171575, 169807, 167979, 166609, 166025, 165917, 165622, 165053, 164748, 164851, 164774, 164155, 163344, 162607, 161637, 160334, 159342, 159261, 159933, 160958, 162259, 163612, 164321, 164042, 163421, 163288, 163670]
54616A63670M61L80J84m53j163r73J31Q25K49p31p76K23J258J534J058L51P9N85
54598A66892J398J561P38l44q02n60j51M1jj85m27o15o46m33M0O03R24R17Q87
54579A69837R76P63j11j220j821j822j625j191j62J141J732J248M32Q0J80M27
54563A68864Q04J215J202O69L04P12J453J610J046M92M49O69P33O04M41K01j61
54546A81307l53O3J055J990K257J920J491J214R18N27K89K82J59k67n72l48J4
54529A91946k48j102j676j452r14p73r89j004o33k94l82p60j022j006q98q46p13
54512A77234k86L25P22O41K45o5j5K81M31J36l90n83k74K3j72n24l40L59Q92R66
54492A79606R23R00N41j88o01j96O27J217J475J564J329N82m13j220j681j686
$$ y = [163670, 164131, 164511, 164695, 164242, 163079, 162106, 162237, 163062, 163311, 162580, 161804, 162027, 163285, 164819, 165877, 166228, 166307, 166892, 168290, 169851, 170589, 170245, 169443, 168883, 168732, 168773, 168772, 168587, 168160, 167545, 166899, 166466, 166506, 167109, 168033, 168950, 169837, 170813, 171576, 171465, 170245, 168424, 166602, 164977, 163786, 163624, 164765, 166497, 167745, 168177, 168257, 168437, 168864, 169668, 170883, 172085, 172754, 173058, 173770, 175223, 176833, 177879, 178371, 178820, 179489, 180222, 180826, 181267, 181468, 181307, 180954, 181017, 182072, 184062, 186319, 188239, 189730, 190944, 191862, 192389, 192678, 192960, 193119, 192852, 192280, 191932, 191946, 191698, 190596, 188920, 187468, 186554, 185781, 184792, 183788, 183155, 182861, 182479, 181719, 180697, 179691, 178793, 177947, 177234, 176948, 177273, 177995, 178636, 178881, 178816, 178801, 179082, 179513, 179649, 179259, 178676, 178402, 178425, 178253, 177729, 177389, 177748, 178640, 179606, 180529, 181429, 181970, 181782, 181181, 180985, 181612, 182829, 184304, 185868, 187197, 187779, 187366, 186146, 184465, 182779]
54476A82779j010J39R32Q93N79P36J141J118P39O47Q95Q79M76L43Q84J612J774
54459A95556J243M76k6j28r0l04q52j378j537j374j060o15j46l5m20p98o51k07
54441A87654o8k58k63Q7M04M15L17L54M24L44J70J72N13J022J269R72M11J42L01
54422A94382N01N14M88M12ko14o51J91J081J040K32m36n27k84O0M61P42P44O29
54403A98963N86M84K51K56P90J464J704J411P26l52j507j855r71K96Q89R03J068
54386B05106J366J284R70R39Q73J6j249j595o49M75Q35P84J018J533J983K297
54370B15986K458K322K007J888K014K064K067K421L093L435L111K476J880J253
54356B48475O02K72K93J48n43j542k492l379m219m759m763m274l502k704k208
$$ y = [182779, 181769, 181908, 182840, 183733, 184312, 185048, 186189, 187307, 188046, 188693, 189588, 190467, 190943, 191286, 192170, 193782, 195556, 196799, 197275, 197249, 197121, 197031, 196727, 195875, 194497, 192960, 191586, 190526, 189911, 189765, 189730, 189310, 188512, 187861, 187654, 187586, 187328, 187065, 187152, 187556, 187971, 188288, 188642, 189066, 189410, 189580, 189752, 190265, 191287, 192556, 193528, 193939, 194081, 194382, 194883, 195397, 195885, 196297, 196295, 195681, 195030, 195221, 196302, 197342, 197574, 197138, 196611, 196327, 196387, 196848, 197590, 198334, 198963, 199549, 200033, 200284, 200540, 201330, 202794, 204498, 205909, 206635, 206283, 204776, 202921, 201950, 202246, 203135, 204038, 205106, 206472, 207756, 208726, 209665, 210538, 210554, 209305, 207710, 207061, 207536, 208371, 209155, 210173, 211706, 213689, 215986, 218444, 220766, 222773, 224661, 226675, 228739, 230806, 233227, 236320, 239755, 242866, 245342, 247222, 248475, 249077, 249349, 249642, 249790, 249247, 247705, 245213, 241834, 237615, 232856, 228093, 223819, 220317, 217613, 215405]
54341B15405k068j850j209n34m16o53n81k02q8k30m1M53N03q7n56m62k70l20k12
54322B06582K32L83j70q06q21m40j97m5K38L73Q1k89l43l83p75j090p22kJ54m48
54302B01512j080j178q91n61k55M8K92M82P35J002J046P05J36k69j77K86N42J81
54284B02556m20m94J05O94O81L00J78N79J256J760J730J187O27M54L69j52q19
54267B10591o91L86J331J241N49J95K48J26k07j82L72Q52P33K41QL23R24J364
54249B18404J475J363J065M19n15j163r75k35J51k86j097j575j456r13k98m1l58
54232B13965q53q52k43L97N90M55K92J90K36N88J113J440J523J666J820J458M67
54215B24252m62p20n31m39n53p25r72j232j172o78j75n5j62k50m53q42r84n61
$$ y = [215405, 213337, 211487, 210278, 209744, 209328, 208675, 208094, 207892, 207804, 207574, 207533, 207986, 208489, 208402, 207846, 207384, 207114, 206794, 206582, 206814, 207197, 207027, 206221, 205400, 204960, 204763, 204718, 204956, 205329, 205410, 205121, 204778, 204395, 203620, 202530, 201808, 201806, 201960, 201512, 200432, 199254, 198363, 197802, 197547, 197595, 197887, 198369, 199104, 200106, 201152, 201857, 201993, 201724, 201547, 201833, 202375, 202556, 202136, 201642, 201747, 202441, 203122, 203422, 203600, 204179, 205435, 207195, 208925, 210112, 210739, 211193, 211562, 211410, 210591, 209900, 210286, 211617, 212858, 213407, 213602, 213850, 213976, 213769, 213587, 213959, 214811, 215544, 215785, 215793, 216116, 217040, 218404, 219879, 221242, 222307, 222726, 222211, 221048, 220073, 219838, 219989, 219703, 218606, 217031, 215575, 214662, 214364, 214323, 213965, 213112, 212260, 212017, 212414, 213004, 213459, 213751, 213941, 214177, 214765, 215878, 217318, 218841, 220507, 222327, 223785, 224252, 223790, 223070, 222539, 222100, 221547, 220822, 219850, 218618, 217446, 216768, 216593, 216538, 216376, 216126, 215673, 214831, 213847, 213286]
54197B13286m6j09n94p62l32K73O34P05N54K53N6K09N95Q85J002J087J041O09
54179B19346o0l60M5O87P67K8r70j455j135l04N89J257J463J003L1p78p87r3N79
54160B19853O54K03l05n12n19q05j633k408k136p55M72N16r5j45M48P68M96K56
54142B14353L86L85o8n78p81q14p89n23j06R0J46N43J179J323Q60N71Q35R93N52
54123B18557L6K6K64L75O42J291J771J568J088R86J195J329J462J739J787J330
54107B35446Q83J013J408J403J053R10J169J719K610L706M366M229L927M204M738
54092B72784M654L801K620J147q38k872m103m479m782n347n663n301m561l857
54078B43203l107k012o01P30J578J892K062K547L251L584L239K564K044J789J804
$$ y = [213286, 213240, 213131, 212537, 211775, 211443, 211716, 212350, 213055, 213609, 213862, 213918, 214127, 214722, 215607, 216609, 217696, 218737, 219346, 219286, 218926, 218971, 219658, 220425, 220453, 219483, 218028, 216893, 216589, 217178, 218435, 219898, 220901, 220932, 220154, 219367, 219274, 219853, 220507, 220710, 220405, 219893, 219374, 218569, 216936, 214528, 212392, 211637, 212109, 212625, 212530, 212385, 212833, 213601, 214097, 214353, 214739, 215124, 215056, 214478, 213697, 212883, 212094, 211571, 211465, 211555, 211701, 212244, 213423, 214746, 215606, 216177, 217012, 218005, 218557, 218593, 218619, 218883, 219258, 219900, 221191, 222962, 224530, 225618, 226604, 227799, 229128, 230590, 232329, 234116, 235446, 236329, 237342, 238750, 240153, 241206, 242116, 243285, 245004, 247614, 251320, 255686, 259915, 263842, 268046, 272784, 277438, 281239, 283859, 285006, 284168, 281296, 277193, 272714, 267932, 262585, 256922, 251621, 247060, 243203, 240096, 238084, 237483, 238213, 239791, 241683, 243745, 246292, 249543, 253127, 256366, 258930, 260974, 262763, 264567]
54063B64567K146K574K505J749P63k7o25r52q01n72j070k048k126q76K18p8q15
54046B64532m13Q82J662J754K114K781K809K173K001K715L474L763M080M688N041
54031C04056M954N093N725O092N647M930M614M486M079L567L368L392L236K688
54017C65927J712L73r07j493j283r15j003j564k322l041l430l330l196l735m891
54002C36902n750n709n138m655m374m151l979l739l122k201j548j418j325q81
53988B88912n78j111k226k859k419j421q00q91j267j402j246j060r20o90m49m51
53972B69122n65k53N70J189J013L87n1k05j33N66K023L223L027J916J542K550
53956B85921L922M719N238O042O862P152P051P072P316P550P742P998Q173P870
$$ y = [264567, 266713, 269287, 271792, 273541, 274304, 274277, 273652, 272700, 271899, 271327, 270257, 268209, 266083, 265207, 265425, 265347, 264532, 264119, 265001, 266663, 268417, 270531, 273312, 276121, 278294, 280295, 283010, 286484, 290247, 294327, 299015, 304056, 309010, 314103, 319828, 325920, 331567, 336497, 341111, 345597, 349676, 353243, 356611, 360003, 363239, 365927, 367639, 368012, 367105, 365612, 364329, 363414, 362411, 360847, 358525, 355484, 352054, 348724, 345528, 341793, 336902, 331152, 325443, 320305, 315650, 311276, 307125, 303146, 299407, 296285, 294084, 292536, 291118, 289793, 288912, 288334, 287223, 284997, 282138, 279719, 278298, 277498, 276607, 275340, 273938, 272692, 271632, 270712, 270022, 269573, 269122, 268557, 268304, 268874, 270063, 271076, 271463, 271412, 271207, 271074, 271640, 273663, 276886, 279913, 281829, 283371, 285921, 289843, 294562, 299800, 305842, 312704, 319856, 326907, 333979, 341295, 348845, 356587, 364585, 372758, 380628]
53942C80628O750M734K103m86k379l333l488l072k460k222k573k970k801k300
53928C66131k112k191j814o81P70K127L306M102M305M325M875N875O493O429O244
53913D08184O271O112N703N872P148Q700R199Q284O644M998L599K448J450M31
53899D85043p19j963l190m205m610m183l361k967l343m103m811n453o176o948
53885D29011p552p684p143o231n697n844o069n820n520n742n962n232l839l057
53871C47619l268l573l395l228l556m121m543m684m263l154k162k269k960k789
53857B99654j739j404k352l114k650j950k096k352j703q48q98j297q11J84L37
53842B76961l50o45l14l53j046j377p26K09N39K05m08r86j179p73j53R4N7L10
$$ y = [380628, 387378, 392112, 394215, 393729, 391350, 388017, 384529, 381457, 378997, 376775, 374202, 371232, 368431, 366131, 364019, 361828, 360014, 359333, 360103, 362230, 365536, 369638, 373943, 378268, 383143, 389018, 395511, 401940, 408184, 414455, 420567, 426270, 432142, 439290, 447990, 457189, 465473, 472117, 477115, 480714, 483162, 484612, 485043, 484324, 482361, 479171, 474966, 470356, 466173, 462812, 459845, 456502, 452399, 447588, 442135, 435959, 429011, 421459, 413775, 406632, 400401, 394704, 388860, 382791, 376971, 371451, 365709, 359747, 354515, 350676, 347619, 344351, 340778, 337383, 334155, 330599, 326478, 321935, 317251, 312988, 309834, 307672, 305403, 302443, 299654, 297915, 296511, 294159, 291045, 288395, 286445, 284349, 281997, 280294, 279446, 278548, 277251, 276440, 276624, 276961, 276611, 275966, 275652, 275299, 274253, 272876, 272150, 272359, 272898, 273103, 272695, 271709, 270530, 269757, 269604, 269698, 269755, 270065]
53824B70065Q67J131R40P88R36J028Q07N83P16J190J798K365K724K887L136L560
53808B95521L654K927J784J185J572K607L775M662M805M089L208L055L663M385
53794C40892M964N604O062N637M326L098K671K721K657K463K300J868Q28m75j321
53779C84295j588j927k907m312n370n588n217m844m705m570m317m172m244m157
53765C26377l575k834k573k889l268l340l185k956k588k089j803k121k921l494
53751B86741l174k108j207j036j077n22L45M31m45j110p11O2J35l19l66J63O35
53734B76437P63Q47R64Q31M65K61M34Q74J483K021J873P64m87o95J77J067J329
53717B89408J371J671K039K160K159K277K458K469K135J354L10l55j23P17J443
$$ y = [270065, 270932, 272063, 273003, 273791, 274727, 275755, 276562, 277145, 277861, 279051, 280849, 283214, 285938, 288825, 291961, 295521, 299175, 302102, 303886, 305071, 306643, 309250, 313025, 317687, 322492, 326581, 329789, 332844, 336507, 340892, 345856, 351460, 357522, 363159, 367485, 370583, 373254, 375975, 378632, 381095, 383395, 385263, 386091, 385616, 384295, 382707, 380780, 377873, 373561, 368191, 362603, 357386, 352542, 347837, 343267, 338950, 334778, 330534, 326377, 322802, 319968, 317395, 314506, 311238, 307898, 304713, 301757, 299169, 297080, 295277, 293156, 290235, 286741, 283567, 281459, 280252, 279216, 278139, 277617, 277962, 278393, 277948, 276838, 276127, 276189, 276324, 276005, 275639, 275802, 276437, 277200, 278047, 279011, 279842, 280307, 280568, 281002, 281876, 283359, 285380, 287253, 288017, 287530, 286835, 287012, 288079, 289408, 290779, 292450, 294489, 296649, 298808, 301085, 303543, 306012, 308147, 309501, 309811, 309456, 309333, 310050, 311493]
53702C11493J952K721L818M664M935M936M903M603L896L072K389J819J438J432
53688C58071J525J118K45l16k40j68n43p21O5J334J792Q39q79k296k742k156j035
53671C53893j42R8p1j81r9K5J9l20j148k145k477j619o7J163J573J402J057O97
53653C51658K86k36q12j078n88N42J522J724J425J309J505J632J545J484J525
53638C63443J505J473J683J991J903J352J002J349K028K357K254K152K271K482
53624C89245K671K767K579K081J829K471L729M509M289L840M174N211O047O159
53610D41601N786N319M915M691M663M499L841K910K331K249K200J927J701J600
53596D90233J148J22q33r64m09J09K82L22K50k40j171k033k331k047j504r82o31
$$ y = [311493, 313445, 316166, 319984, 324648, 329583, 334519, 339422, 344025, 347921, 350993, 353382, 355201, 356639, 358071, 359596, 360714, 360959, 360643, 360403, 360235, 359692, 358971, 359036, 360370, 362162, 363001, 362122, 359826, 357084, 354928, 353893, 353751, 353849, 353778, 353597, 353498, 353523, 353542, 353222, 352074, 349929, 347452, 345833, 345766, 346929, 348502, 349904, 350961, 351658, 351944, 351708, 350896, 349818, 349230, 349772, 351294, 353018, 354443, 355752, 357257, 358889, 360434, 361918, 363443, 364948, 366421, 368104, 370095, 371998, 373350, 374352, 375701, 377729, 380086, 382340, 384492, 386763, 389245, 391916, 394683, 397262, 399343, 401172, 403643, 407372, 411881, 416170, 420010, 424184, 429395, 435442, 441601, 447387, 452706, 457621, 462312, 466975, 471474, 475315, 478225, 480556, 482805, 485005, 486932, 488633, 490233, 491381, 491503, 490670, 489706, 489297, 489406, 489688, 490010, 490260, 490020, 488849, 486816, 484485, 482438, 480934, 479952, 479321]
53579D79321n34p53j263j894k374k521k357j984j469j016r78j330j354n03N71
53564D59562O12n37j628j703j134n90Q7J222K294K572K215J838J425N84l80o42
53548D65797j8Q79J519J722J316M34j9P85K311L146K862K469K904M006N230O342
53532E01685P104P149O705O675P484Q520R139R569J0312J1257J2021J2668J3431
53519F23719J4134J4500J4723J5211J5966J6760J7712J9065K0541K1430K1508
53508H15269K1397K1860K2947K3977K4302K3962K3562K3520K3595K3262K2361
53497A070014K1145J9861J8659J7917J8079J9084K0150K0441J9763J8601J7653
53486A281367J7350J7610J8063J8498J8963J9262J8798J7333J5633J4726J4690
$$ y = [479321, 478787, 478034, 476771, 474877, 472503, 469982, 467625, 465641, 464172, 463156, 462178, 460848, 459494, 458991, 459562, 460174, 459637, 458009, 456306, 455172, 454582, 454669, 455891, 458185, 460757, 462972, 464810, 466235, 466819, 466439, 465797, 465779, 466658, 468177, 469899, 471215, 471649, 471630, 472415, 474726, 477872, 480734, 483203, 486107, 490113, 495343, 501685, 508789, 515938, 522643, 529318, 536802, 545322, 554461, 564030, 574342, 585599, 597620, 610288, 623719, 637853, 652353, 667076, 682287, 698253, 715013, 732725, 751790, 772331, 793761, 815269, 836666, 858526, 881473, 905450, 929752, 953714, 977276, 1000796, 1024391, 1047653, 1070014, 1091159, 1111020, 1129679, 1147596, 1165675, 1184759, 1204909, 1225350, 1245113, 1263714, 1281367, 1298717, 1316327, 1334390, 1352888, 1371851, 1391113, 1409911, 1427244, 1442877, 1457603, 1472293]
53475A472293J4725J4258J3264J1629R042N764K747O46p95k192l866n890q192
53462A523433j0350j1829j2629j3293j4123j4913j5486j5885j5899j5268j4570
53451A369188j5035j6954j9037j9938j9732j9348j9189j8973j8437j7447j5875
53440A169223j3985j2530j1815j1083r510p417n723m565l255j440N32K266L618
53427A094316M443M723M954N709O905Q067R232J0849J2855J4622J5879J6996J8209
53414A227759J9314K0340K1709K3412K4687K5130K5483K6779K8972L1100L2533
53403A507218L3560L4723L6174L7796L9554M1512M3664M5830M7708M9032M9886
53392A966657N0763N2067N3471N4094N3529N2474N1985N2194N2148N1075M9307
$$ y = [1472293, 1487018, 1501276, 1514540, 1526169, 1535211, 1540975, 1543722, 1544368, 1543573, 1541381, 1537515, 1531625, 1523433, 1513083, 1501254, 1488625, 1475332, 1461209, 1446296, 1430810, 1414925, 1399026, 1383758, 1369188, 1354153, 1337199, 1318162, 1298224, 1278492, 1259144, 1239955, 1220982, 1202545, 1185098, 1169223, 1155238, 1142708, 1130893, 1119810, 1110300, 1102883, 1097160, 1092595, 1089340, 1087900, 1088432, 1090698, 1094316, 1098759, 1103482, 1108436, 1114145, 1121050, 1129117, 1138349, 1149198, 1162053, 1176675, 1192554, 1209550, 1227759, 1247073, 1267413, 1289122, 1312534, 1337221, 1362351, 1387834, 1414613, 1443585, 1474685, 1507218, 1540778, 1575501, 1611675, 1649471, 1689025, 1730537, 1774201, 1820031, 1867739, 1916771, 1966657, 2017420, 2069487, 2122958, 2177052, 2230581, 2283055, 2335040, 2387234, 2439382, 2490457, 2539764]
53381B539764M7656M6162M4057M0903L7166L3515K9954K6029K1554J6760J1878
53370B895398O964K103k530o940j1387j6133k1207k6391l1413l6034m0110m3665
53358B668655m6839m9637n1686n2397n1597m9921m8426m7641m7271m6790m5992
53347B130458m4794m2996m0750l8923l8313l8520l8281l6971l5194l3675l2260
53336A709781l0417k8177k6059k4354k3003k1950k1107k0040j8269j5906j3643
53325A466856j1984j0800r836r324r794j1252j2914j3915j4105j3889j3386j2233
53313A323424j0387q648p874p883p628o351m160j554J021L126M396M992N604O725
53299A294803Q213R645J0810J1721J2510J3489J5034J7161J9399K1193K2312K2857
$$ y = [2539764, 2587420, 2633582, 2677639, 2718542, 2755708, 2789223, 2819177, 2845206, 2866760, 2883520, 2895398, 2902362, 2904465, 2901935, 2894995, 2883608, 2867475, 2846268, 2819877, 2788464, 2752430, 2712320, 2668655, 2621816, 2572179, 2520493, 2468096, 2416499, 2366578, 2318152, 2270511, 2223240, 2176450, 2130458, 2085664, 2042668, 2001918, 1962995, 1924682, 1886162, 1847881, 1810910, 1775716, 1742041, 1709781, 1679364, 1651187, 1625128, 1600774, 1577771, 1555821, 1534714, 1514674, 1496405, 1480499, 1466856, 1454872, 1444072, 1434236, 1424912, 1415118, 1403866, 1390952, 1377037, 1362932, 1349043, 1335657, 1323424, 1313037, 1304389, 1296515, 1288632, 1281004, 1274653, 1270493, 1268939, 1269960, 1273086, 1277482, 1282474, 1288078, 1294803, 1303016, 1312661, 1323471, 1335192, 1347702, 1361191, 1376225, 1393386, 1412785, 1433978, 1456290, 1479147]
53287A479147K3209K3838K4757K5150K4106K1769J9236J7178J5157J2603R823
53276A695973P490N622L561Q61k338n600q530j0919j2819j4467j6075j7733j9541
53263A605485k1543k3509k5156k6539k7869k8950k9307k8959k8525k8373k8237
53252A308518k7814k7181k6434k5556k4886k4959k5527k5486k4276k2733k1997
53241A031669k2166k2576k2818k2752k2085k0669j8908j7298j5889j4660j3788
53230H18060j3082j1831j0005q824r194j0154j0090r035q480r100j0005j0311
53218F97949j0244j0384j0919j1917j3413j4859j5349j4707j3693j2863j2028
53207E57573j1074j0437j0294j0044r193q080p230o571n896n561o046p110q004
$$ y = [1479147, 1502356, 1526194, 1550951, 1576101, 1600207, 1621976, 1641212, 1658390, 1673547, 1686150, 1695973, 1703463, 1709085, 1712646, 1713507, 1711169, 1705569, 1697039, 1686120, 1673301, 1658834, 1642759, 1625026, 1605485, 1583942, 1560433, 1535277, 1508738, 1480869, 1451919, 1422612, 1393653, 1365128, 1336755, 1308518, 1280704, 1253523, 1227089, 1201533, 1176647, 1151688, 1126161, 1100675, 1076399, 1053666, 1031669, 1009503, 986927, 964109, 941357, 919272, 898603, 879695, 862397, 846508, 831848, 818060, 804978, 793147, 783142, 774318, 765124, 754970, 744880, 735845, 727365, 718265, 708260, 697949, 687705, 677321, 666402, 654485, 641072, 626213, 610864, 596157, 582464, 569601, 557573, 546499, 536062, 525768, 515724, 506531, 498451, 491221, 484650, 478754, 473193, 467147, 460037, 452033]
53194D52033q343q298q096p805p513p293p017o479n703m943m468m398m575m521
53180C62581l874k993k752l414m117l854k706j627j214j226j244j247j350j424
53166C29539j318j194j303j610j837j834j617j182n77j31j60m19k72L13M92k75
53150C16615j244j296n66k72r30j718j820j496j311j151p23l50m36n91j63O63
53134C03211J144J188J402J981K374K219J874J789J897J897J723J497J295J104
53120C26595Q36M07k2n1L43N12n1q73j081o47k92k60j0O23R06K35r29j665j715
53101C22861j579j710k068k289k024j249l43J99K08j04m56o22l88J84N32J93m51
53084C10894n82j22Q8m79j271j440q80n5P59J519J995J822R79p4q33j146j205
$$ y = [452033, 443690, 435392, 427296, 419491, 411978, 404685, 397668, 391189, 385486, 380543, 376075, 371677, 367102, 362581, 358707, 355714, 352962, 349548, 345431, 341577, 338871, 337244, 336030, 334804, 333560, 332313, 330963, 329539, 328221, 327027, 325724, 324114, 322277, 320443, 318826, 317644, 317067, 316936, 316776, 316357, 316085, 316398, 316890, 316615, 315371, 314075, 313509, 313237, 312307, 310589, 308769, 307273, 305962, 304811, 304088, 303738, 303302, 302711, 302548, 303211, 304355, 305543, 306945, 308926, 311300, 313519, 315393, 317182, 319079, 320976, 322699, 324196, 325491, 326595, 327431, 327838, 327816, 327765, 328108, 328620, 328569, 327696, 326615, 325968, 325676, 325416, 325406, 326029, 326935, 327170, 326241, 324576, 322861, 321282, 319572, 317504, 315215, 313191, 311942, 311599, 311798, 312006, 311902, 311446, 310824, 310436, 310620, 311152, 311345, 310894, 310312, 310190, 310278, 309799, 308528, 307088, 306208, 306153, 306912, 308431, 310426, 312248, 313227, 313153, 312320, 311174, 309969]
53067C09969j267j335j200r00r28j651k604k872k190j239p05n35l24j1K03K95
53051B92706M39P45J212J806K308K357J813J027N16M48N70O07N40N22N63M54Q2
53034C08715k26j0N84P80K02n00n01jJ47k09l27K32R66J239J082Q42O03L44K57
53015C14219M92Q15Q81O90N24N67P38P81N19O7k07j51p3k38m01k06J30J61K2K13
52995C19543O20O31K52K05P33J182J151J128J463J596J052N15R63K187L005K836
52979C39062K249J992K131K255K075J647J218R24N95l6q87j555j818j777j408
52964C46667m85Q31J823J988J583J111O94K81n9m25j168k235k845k412j391o54
52948C43304l62j23M9k36r10j329j146p60p38j177j677j763j325q08q03j303j640
$$ y = [309969, 308702, 307367, 306167, 305267, 304339, 302688, 300084, 297212, 295022, 293783, 293078, 292543, 292219, 292208, 292411, 292706, 293145, 293890, 295102, 296908, 299216, 301573, 303386, 304413, 304929, 305377, 305947, 306554, 307094, 307616, 308179, 308633, 308715, 308489, 308479, 309063, 309843, 310045, 309545, 309044, 309043, 309190, 308981, 308654, 308886, 309852, 311091, 312173, 313015, 313618, 313962, 314219, 314711, 315526, 316407, 317097, 317621, 318188, 318926, 319707, 320226, 320293, 320086, 319935, 319862, 319624, 319223, 319017, 319147, 319308, 319330, 319543, 320163, 320794, 321046, 321251, 321984, 323166, 324317, 325445, 326908, 328504, 329556, 330071, 331034, 333221, 336226, 339062, 341311, 343303, 345434, 347689, 349764, 351411, 352629, 353553, 354148, 354112, 353225, 351670, 349852, 348075, 346667, 346182, 347013, 348836, 350824, 352407, 353518, 354212, 354493, 354434, 354009, 352841, 350606, 347761, 345349, 343958, 343304, 342942, 342819, 342868, 342632, 341722, 340393, 339247, 338487, 337749, 336572, 334895, 333132, 331807, 330999, 330196, 328893, 327253]
52931C27253j345p69n29o88r11j054j150j032n48qJ25j35l65k98N4O06J142J249
52913C21597P49Jn88j079j548j584q24K60Q84J013J180J422J260O94L51M66N30
52896C24784K26p5jK28K57J33K2j11k25o4L63N73K35l27o21o31o56p46o37r8Q66
52875C23495K020K934L223K938K504K203K017J954K105K233J790P24k07l39%m6
52859C49548p29j559k094k299k197j753j301j497k505l529l610k726j806j643
52845C20300k143k647k715k387j892j429j157j149j284j347j231r50m69J98P24
52830C00422O52N1l67j6Q32J403J340R02M16o2m97o99n38j43K42M65N24N85Q87
52811C06399J430J808J601J010P18J009J311Q56l88j700k386k359k007j751j758
$$ y = [327253, 325908, 325139, 324610, 323922, 323011, 321957, 320807, 319775, 319227, 319219, 319344, 319209, 318844, 318546, 318600, 319206, 320348, 321597, 322346, 322347, 321759, 320680, 319132, 317548, 316724, 316984, 317868, 318881, 320061, 321483, 322743, 323437, 323788, 324254, 324784, 325010, 324935, 324934, 325162, 325419, 325552, 325574, 325463, 325238, 325174, 325537, 326110, 326345, 326018, 325397, 324766, 324110, 323364, 322727, 322629, 323495, 325515, 328449, 331672, 334610, 337114, 339317, 341334, 343288, 345393, 347626, 349416, 350140, 349933, 349594, 349594, 349548, 348819, 347260, 345166, 342867, 340670, 338917, 337616, 336119, 333614, 330085, 326475, 323749, 321943, 320300, 318157, 315510, 312795, 310408, 308516, 307087, 305930, 304781, 303497, 302150, 300919, 299969, 299500, 299698, 300422, 301074, 301125, 300758, 300742, 301574, 302977, 304317, 305219, 305635, 305573, 305076, 304377, 303839, 303696, 303938, 304403, 304927, 305512, 306399, 307829, 309637, 311238, 312248, 312966, 313975, 315286, 316142, 315754, 314054, 311668, 309309, 307302, 305551, 303793]
52796C03793j884j826j418q25l47n3J99L91K46k76o11j28R43J592J257N62M77
52779C02092J004J227O06l42q21p41o24q47j259j416r69P4J258J989J979J374
52763C04584M83l81q67p84l99j56j5M37J130J322O83oJ70R78J381R90M82O01J283
52744C11916J958K219K042J647J282R97O34J93R3P21J817K654K830K550K119J516
52728C37188O33k99p61l87O28J562J699R46j99j279k258l073l300k646j545p52
52712C26157n07m77m43m85n57m22j43q1l09m05m3N63J078J496J976K441K587K173
52694C34599J176j64j306j636r75J51Q81P32n2p26p44k56J70K55J98N8m78j361
52676C30522j734r62J74K38q47j607j074q9R6l44l24K95M93k47j070r22Q2J018
$$ y = [303793, 301909, 300083, 298665, 297840, 297493, 297440, 297639, 298030, 298276, 298000, 297389, 297261, 298204, 299796, 301053, 301615, 302092, 303096, 304323, 304929, 304587, 303766, 303025, 302401, 301554, 300295, 298879, 297910, 297984, 299242, 301231, 303210, 304584, 305067, 304686, 303819, 303035, 302636, 302480, 302465, 302902, 304032, 305354, 306037, 306031, 306201, 307179, 308560, 309550, 310032, 310633, 311916, 313874, 316093, 318135, 319782, 321064, 322061, 322695, 322888, 322981, 323702, 325519, 328173, 331003, 333553, 335672, 337188, 337821, 337522, 336761, 336374, 337002, 338564, 340263, 341209, 341010, 339731, 337473, 334400, 331100, 328454, 326909, 326157, 325650, 325173, 324730, 324245, 323688, 323266, 323123, 323042, 322733, 322328, 322285, 322848, 323926, 325422, 327398, 329839, 332426, 334599, 335775, 335611, 334305, 332669, 331694, 331845, 332726, 333458, 333406, 332680, 331936, 331680, 331850, 332105, 332303, 332361, 331883, 330522, 328788, 327826, 328000, 328238, 327391, 325784, 324710, 324621, 324717, 324373, 324049, 324344, 324837, 324590, 323520, 322598, 322680, 323698]
52658C23698J361J345J327J329J274J236J334J610K115K836L371L042J616k11
52644C47283j422j731j690j820j996j811j178m00J00O5l47n12J08J166J611R21
52628C38347j40l67M85J487J589O15p33j550j547j214j133j200r22l99l23q21
52612C32174j116q10o32j169j619r03N73J432J347J256J591J620Q56l1l06j53
52596C34110k4J75O14R04O81K46K5j39n82j074j106o17R0Q66J539J668J043K76
52578C38695K07P86J111N69m77j203j160n95j86l65p52n27L84R00P7j495k281
52561C33688j710p38m22p03q81p38n97o14n87m14k96l87m66j97L82Q01O78K45
52543C27044J55O40J074O59m39j112n88O18J390J413J343J667J956J631R53P42
$$ y = [323698, 325059, 326404, 327731, 329060, 330334, 331570, 332904, 334514, 336629, 339465, 342836, 345878, 347494, 347283, 345861, 344130, 342440, 340620, 338624, 336813, 335635, 335235, 335335, 335400, 335053, 334541, 334649, 335815, 337426, 338347, 338207, 337840, 338325, 339812, 341401, 342016, 341283, 339733, 338186, 336972, 335839, 334639, 333717, 333318, 332995, 332174, 331058, 330248, 329616, 328447, 326828, 325925, 326498, 327930, 329277, 330533, 332124, 333744, 334600, 334569, 334263, 334110, 334086, 334261, 334875, 335779, 336460, 336706, 336731, 336592, 336010, 334936, 333830, 333213, 333303, 334169, 335708, 337376, 338419, 338695, 338902, 339688, 340799, 341368, 340891, 339688, 338528, 337933, 337747, 337382, 336630, 336103, 336487, 337387, 337464, 335969, 333688, 331978, 331240, 330818, 330115, 329234, 328496, 327899, 327285, 326698, 326284, 325988, 325601, 325135, 324938, 325320, 326121, 326799, 327044, 327199, 327839, 328913, 329572, 329133, 328021, 327433, 328051, 329441, 330854, 332197, 333864, 335820, 337451, 338404, 339146]
52527C39146J259J950K276K279K173J882J326Q00O77R14J175J318J509J895K423
52512C63002K846K833K258J526J298J649J829J224J67o58j260k147l273l957l922
52497C63415l642l555l459l017k284j445n30K94N23r4j034j439j061m32j79l53
52481C41708m63p2O92J260J255Q95O23N85P28J171K019K917L314L168K963K973
52465C65736L004K872K673K454K137J868J863J770Q24j016k695l330l265l405
52451C71490l888m126l912l720l830l837l211k040r05j96J96N14O27J37r39j880
52435C40480j984j447j103j296j466j010j00O21Q40P32N96O07P91R97J018Q25
52419C39101O28O37R18J482K240K839K928K615K452K806L510M186M615M762M738
$$ y = [339146, 340405, 342355, 344631, 346910, 349083, 350965, 352291, 353091, 353768, 354682, 355857, 357175, 358684, 360579, 363002, 365848, 368681, 370939, 372465, 373763, 375412, 377241, 378465, 378632, 377974, 376714, 374567, 371294, 367337, 363415, 359773, 356218, 352759, 349742, 347458, 346013, 345483, 345777, 346300, 346206, 345172, 343733, 342672, 342240, 342061, 341708, 341245, 341173, 341865, 343125, 344380, 345275, 345898, 346483, 347211, 348382, 350401, 353318, 356632, 359800, 362763, 365736, 368740, 371612, 374285, 376739, 378876, 380744, 382607, 384377, 385201, 384185, 381490, 378160, 374895, 371490, 367602, 363476, 359564, 355844, 352014, 348177, 344966, 342926, 342021, 341825, 342021, 342535, 343162, 343299, 342360, 340480, 338496, 337049, 335946, 334650, 333184, 332174, 332074, 332695, 333535, 334267, 334863, 335470, 336261, 337258, 338276, 339101, 339729, 340366, 341284, 342766, 345006, 347845, 350773, 353388, 355840, 358646, 362156, 366342, 370957, 375719, 380457]
52404C80457M843N286N851O173O278O343O060M824K680L87j573l363m933n717
52390D13596n594n378n700o008n369l845k323j315o00R0O17P11L87J17O50K285
52374C82321M170M972M510M033M477N200N106M274L528K931J819Q1j558k560k973
52359D20331k897k291j412o47M9R04J565J368M49k17q6L30M10K70L37N82P14Q43
52341D20602J460K760M237N072M974M541M598N188N658N798O240P322Q307Q433
52327D95190Q172Q495R334R881J0080J0639J1510J1726J1056J0560J0994J1712
52315F19349J1911J2015J2899J4345J5336J5574J5805J6693J8119J9613K0957
52304G92616K2100K2918K3195K2808K1956K1118K0624K0211J9309J7831J6275
$$ y = [380457, 385300, 390586, 396437, 402610, 408888, 415231, 421291, 426115, 428795, 429182, 427609, 424246, 419313, 413596, 408002, 402624, 396924, 390916, 385547, 381702, 379379, 378064, 377464, 377554, 378171, 378882, 379269, 379386, 380036, 382321, 386491, 391463, 395973, 400006, 404483, 409683, 414789, 419063, 422591, 425522, 427341, 427422, 425864, 423304, 420331, 417434, 415143, 413731, 413084, 413133, 414037, 415602, 416970, 417419, 417202, 417116, 417446, 417856, 418126, 418463, 419045, 419759, 420602, 422062, 424822, 429059, 434131, 439105, 443646, 448244, 453432, 459090, 464888, 471128, 478450, 486757, 495190, 503362, 511857, 521191, 531072, 541152, 551791, 563301, 575027, 586083, 596643, 607637, 619349, 631260, 643275, 656174, 670519, 685855, 701429, 717234, 733927, 752046, 771659, 792616, 814716, 837634, 860829, 883637, 905593, 926711, 947335, 967546, 986855, 1004686, 1020961]
52293A020961J4912J3420J1587R846Q594P441N818M025K919K619K239J171j45
52280A105407j008j525k260l131l346k560j529j265j768k092j619p67k61j10K47
52265A082413J003J706K029K335L209M681O194P324Q228R385J1021J2910J4605
52252A167043J5785J6360J6404J6068J5484J4553J2978J0703Q299O553N569M694
52240A310493L511K474K126K062J351k08j844k983l949n275o790p934q649r438
52226A274947j0534j1475j1668j1146j0521j0323j0570j0949j1185j1097j0514
52215A154965r427q167p194o637o128n221l859k478j644j493j469q96J01O28L80
52200A101461M05J831M158N811O257O405O786O706N792N053N377N910N141L014
$$ y = [1020961, 1035873, 1049293, 1060880, 1070726, 1079320, 1086761, 1092579, 1096604, 1099523, 1102142, 1104381, 1105552, 1105407, 1104399, 1102874, 1100614, 1097483, 1094137, 1091577, 1090048, 1088783, 1087015, 1084923, 1083304, 1082537, 1082276, 1082166, 1082413, 1083416, 1085122, 1087151, 1089486, 1092695, 1097376, 1103570, 1110894, 1119122, 1128507, 1139528, 1152438, 1167043, 1182828, 1199188, 1215592, 1231660, 1247144, 1261697, 1274675, 1285378, 1293677, 1300230, 1305799, 1310493, 1314004, 1316478, 1318604, 1320666, 1322017, 1321809, 1319965, 1316982, 1313033, 1307758, 1300968, 1293034, 1284385, 1274947, 1264413, 1252938, 1241270, 1230124, 1219603, 1209280, 1198710, 1187761, 1176576, 1165479, 1154965, 1145538, 1137371, 1130177, 1123540, 1117412, 1112191, 1108332, 1105854, 1104210, 1102717, 1101248, 1100352, 1100453, 1101081, 1101461, 1101866, 1103697, 1107855, 1113666, 1119923, 1126328, 1133114, 1139820, 1145612, 1150665, 1156042, 1161952, 1167093, 1170107]
52186A170107P69r18k367l809n007o011p144q166q438p983p524p335o971o210
52172A092993n354m429l145j856j529k241k646j598M14K071K829L071L191L270
52158A085041L341L326K865J786O00P9L58Q16Q43M99L29P12J444K060K506L206
52142A109811M287N102M942L933K776J839J111P78J047J549J822K348M145P162
$$ y = [1170107, 1170876, 1169958, 1167591, 1163782, 1158775, 1152764, 1145620, 1137454, 1129016, 1121033, 1113509, 1106174, 1099203, 1092993, 1087639, 1083210, 1080065, 1078209, 1076680, 1074439, 1071793, 1070195, 1070609, 1072680, 1075509, 1078580, 1081771, 1085041, 1088382, 1091708, 1094573, 1096359, 1096959, 1097038, 1097396, 1098212, 1099055, 1099554, 1099883, 1100595, 1102039, 1104099, 1106605, 1109811, 1114098, 1119200, 1124142, 1128075, 1130851, 1132690, 1133801, 1134579, 1135626, 1137175, 1138997, 1141345, 1145490, 1152652]
$$ [...]
##END NTUPLES=NMR SPECTRUM
##END=
