##TITLE=AC1647_HPIAH13380_8569902_iUEoGVkja9
##JCAMPDX= 6.0         $$ Bruker NMR JCAMP-DX V2.0
##DATA TYPE= NMR SPECTRUM
##DATA CLASS= NTUPLES
##ORIGIN= BRUKER
##OWNER= Administrator
$$ 1.72 TOPSPIN		Version 2.1
$$ 2014-04-10 18:20:32.610 -0700  Administrator@X
$$ Compression mode = diff/dup
##.OBSERVE FREQUENCY= 400.02188249412
##.OBSERVE NUCLEUS= ^1H
##.ACQUISITION MODE= SIMULTANEOUS (DQD)
##.ACQUISITION SCHEME= undefined
##.AVERAGES= 8
##.DIGITISER RES= 22
##SPECTROMETER/DATA SYSTEM= spect
##.PULSE SEQUENCE= zg30
##.SOLVENT NAME= COFFEE_meoh
##.SHIFT REFERENCE= INTERNAL, COFFEE_meoh, 1, 14.98509
##AUDIT TRAIL= $$ (NUMBER, WHEN, WHO, WHERE, PROCESS, VERSION, WHAT)
$$ ##TITLE= Audit trail, TOPSPIN		Version 2.1
$$ ##JCAMPDX= 5.01
$$ ##ORIGIN= Bruker BioSpin GmbH
$$ ##OWNER= Administrator
$$ $$ E:\/data/COFFEE/nmr/AC1647_HPIAH13380_8569902_iUEoGVkja9/10/pdata/1/auditp.txt
$$ ##AUDIT TRAIL=  $$ (NUMBER, WHEN, WHO, WHERE, PROCESS, VERSION, WHAT)
(   1,<2014-04-10 18:20:24.410 -0700>,<Administrator>,<X>,<go>,<TOPSPIN 2.1>,
      <created by zg
	started at 2014-04-10 18:19:18.379 -0700,
	POWCHK enabled, PULCHK disabled,
       configuration hash MD5:
       C8 4E 4E 5D D3 5C D8 9E 9F 52 82 E0 59 8A DE 15
       data hash MD5: 64K
       CC 39 1F E7 8B 16 31 BB 76 15 E6 E2 3D 47 1C 52>)
(   2,<2014-04-10 18:20:27.780 -0700>,<Administrator>,<X>,<proc1d>,<TOPSPIN 2.1>,
      <Start of raw data processing
       efp LB = 0 FT_mod = 6 PKNL = 1 PHC0 = 0 PHC1 = 0 SI = 32K 
       data hash MD5: 32K
       F5 2E 39 F7 ED 87 E7 4C BE 64 A0 0C 1F 96 49 48>)
(   3,<2014-04-10 18:20:28.227 -0700>,<Administrator>,<X>,<proc1d>,<TOPSPIN 2.1>,
      <pk PHC0 = 94.35608 PHC1 = 0 
       data hash MD5: 32K
       1A 1B 43 6C ED 3D C5 82 04 68 1B 55 D3 BF CF EF>)
(   4,<2014-04-10 18:20:28.468 -0700>,<Administrator>,<X>,<proc1d>,<TOPSPIN 2.1>,
      <abs ABSG = 1 
       data hash MD5: 32K
       69 05 B2 73 91 54 AA B0 42 A0 AC CD 90 0B D7 4E>)
(   5,<2014-04-10 18:20:28.588 -0700>,<Administrator>,<X>,<proc1d>,<TOPSPIN 2.1>,
      <abs ABSG = 2 
       data hash MD5: 32K
       F5 8E CC 0A 1E 3D C0 F0 DB DC 5C 87 D9 E9 B9 50>)
(   6,<2014-04-10 18:20:28.880 -0700>,<Administrator>,<X>,<proc1d>,<TOPSPIN 2.1>,
      <abs ABSG = 3 
       data hash MD5: 32K
       04 21 DD F0 31 7F 2B D9 D9 FD 57 36 CB B8 E8 9A>)
(   7,<2014-04-10 18:20:29.052 -0700>,<Administrator>,<X>,<proc1d>,<TOPSPIN 2.1>,
      <abs ABSG = 4 
       data hash MD5: 32K
       C4 D5 48 8B EB 14 36 19 BE A5 4F E5 1B BE 8C 79>)
(   8,<2014-04-10 18:20:29.138 -0700>,<Administrator>,<X>,<proc1d>,<TOPSPIN 2.1>,
      <abs ABSG = 5 
       data hash MD5: 32K
       55 E7 DC 60 91 C0 D1 9C A1 7B 40 AC BB CD F3 FD>)
$$ ##END=
$$ 
$$ $$ hash MD5
$$ $$ 30 A5 1D 97 14 F8 BE 71 8A 6A C4 48 78 09 EE 96
##$RELAX= 
##$RELAX= 
##$RELAX= 
##$RELAX= 
##$RELAX= 
##$RELAX= 
##$RELAX= 
$$ Bruker specific parameters
$$ --------------------------
##$DU= <E:\>
##$EXPNO= 10
##$NAME= <AC1647_HPIAH13380_8569902_iUEoGVkja9>
$$ [...]
##$TP= (0..7)
150 150 150 150 150 150 150 150
##$TP07= 0
##$TPNAME0= <>
##$TPNAME1= <>
##$TPNAME2= <>
##$TPNAME3= <>
##$TPNAME4= <>
##$TPNAME5= <>
##$TPNAME6= <>
##$TPNAME7= <>
##$TPOAL= (0..7)
0.5 0.5 0.5 0.5 0.5 0.5 0.5 0.5
##$TPOFFS= (0..7)
0 0 0 0 0 0 0 0
##$TUNHIN= 0
##$TUNHOUT= 0
##$TUNXOUT= 0
##$USERA1= <user>
##$USERA2= <user>
##$USERA3= <user>
##$USERA4= <user>
##$USERA5= <user>
##$V9= 5
##$VALIST= <valist>
##$VCLIST= <CCCCCCCCCCCCCCC>
##$VD= 0
##$VDLIST= <DDDDDDDDDDDDDDD>
##$VPLIST= <PPPPPPPPPPPPPPP>
##$VTLIST= <TTTTTTTTTTTTTTT>
##$WBST= 1024
##$WBSW= 4
##$XGAIN= (0..3)
0 0 0 0
##$XL= 0
##$YL= 0
##$YMAX_a= 620618
##$YMIN_a= -526685
##$ZGOPTNS= <>
##$ZL1= 120
##$ZL2= 120
##$ZL3= 120
##$ZL4= 120
##$ABSF1= 14.98509
##$ABSF2= -5.573092
##$ABSG= 5
##$ABSL= 3
##$ALPHA= 0
##$AQORDER= 0
##$ASSFAC= 0
##$ASSFACI= 0
##$ASSFACX= 0
##$ASSWID= 0
##$AUNMP= <proc_prof1d_extract_pilot.lims>
##$AXLEFT= 0
##$AXNAME= <>
##$AXNUC= <1H>
##$AXRIGHT= 0
##$AXTYPE= 0
##$AXUNIT= <>
##$AZFE= 0.1
##$AZFW= 0.1
##$BCFW= 0
##$BC_mod= 0
##$BYTORDP= 0
##$COROFFS= 0
##$CY= 15
##$DATMOD= 1
##$DC= 0
##$DFILT= <>
##$DTYPP= 0
##$F1P= 0
##$F2P= 0
##$FCOR= 0.5
##$FTSIZE= 32768
##$FT_mod= 6
##$GAMMA= 0
##$GB= 0
##$INTBC= 1
##$INTSCL= 1
##$ISEN= 128
##$LB= 0
##$LEV0= 0
##$LPBIN= 0
##$MAXI= 10000
##$MC2= 0
##$MEAN= 0
##$ME_mod= 0
##$MI= 0
##$NCOEF= 0
##$NC_proc= -8
##$NLEV= 6
##$NOISF1= 0
##$NOISF2= 0
##$NSP= 0
##$NTH_PI= 0
##$NZP= 0
##$OFFSET= 14.98509
##$PC= 1
##$PHC0= 94.35608
##$PHC1= 0
##$PH_mod= 1
##$PKNL= yes
##$PPARMOD= 0
##$PPDIAG= 0
##$PPIPTYP= 0
##$PPMPNUM= 2147483647
##$PPRESOL= 1
##$PSCAL= 4
##$PSIGN= 0
##$PYNMP= <proc.py>
##$REVERSE= no
##$SF= 400.02
##$SI= 32768
##$SIGF1= 0
##$SIGF2= 0
##$SINO= 400
##$SIOLD= 32768
##$SPECTYP= <>
##$SREGLST= <1H.CDCl3>
##$SSB= 0
##$STSI= 32768
##$STSR= 0
##$SW_p= 8223.68421052631
##$SYMM= 0
##$S_DEV= 0
##$TDeff= 65536
##$TDoff= 0
##$TI= <>
##$TILT= no
##$TM1= 0
##$TM2= 0
##$TOPLEV= 0
##$USERP1= <user>
##$USERP2= <user>
##$USERP3= <user>
##$USERP4= <user>
##$USERP5= <user>
##$WDW= 1
##$XDIM= 32768
##$YMAX_p= 453406086
##$YMIN_p= -678468
##$CURPLOT= <Network HP LaserJet P1505>
##$CURPRIN= <$Network HP LaserJet P1505>
##$DFORMAT= <normdp>
##$LAYOUT= <+/1D_H.xwp>
##$LFORMAT= <normlp>
##$PFORMAT= <normpl>
##$SURQMSG= 1
$$ End of Bruker specific parameters
$$ ---------------------------------
##NTUPLES= NMR SPECTRUM
##VAR_NAME=  FREQUENCY,     SPECTRUM/REAL,   SPECTRUM/IMAG
##SYMBOL=    X,             R,               I
##VAR_TYPE=  INDEPENDENT,   DEPENDENT,       DEPENDENT
##VAR_FORM=  AFFN,          ASDF,            ASDF
##VAR_DIM=   32768,         32768,           32768
##UNITS=     HZ,            ARBITRARY UNITS, ARBITRARY UNITS
##FACTOR=    0.250966925370066, 1,           1
##FIRST=     8223.43324360094, 104152,       40515
##LAST=      0,             240601,          -147015
##MIN=       0,             -678468,         0
##MAX=       8223.43324360094, 453406086,    0
$$ Real data points
##PAGE= N=1
##DATA TABLE= (X++(R..R)), XYDATA
$$ [...]
19528B51017c49779e2612a56o2362j58654j8565D3263J01578a29237B0156J7596
19517C7752a50826j61383a42264K2988b632k02364A40537a58882a15j47795c3421
19505D7150O895b02963A32678b84318A25038Q0920C3513c03499J19128E9242N897
19494F5139O6233L3907N5542b36492l3709F1008K5588j8206b9097G5149c48865
19482c5769k12265i6414G6966J4556a10977J0470a3436j02639G1500b5869A75539
19470d19403J39756N2853J05808E3285i8903p3041d8836k61336a06335j50583
19460b56918M4657A60430c7514k30775P9385B07906a03963A8777c90780J24916
19450b65864B71667b12613C13437A2417j061a05594k95078a17144B0696a74045
$$ y = [251017, -349779, -52612, -156, -62518, -221172, -239737, 43263, 144841, -129237, 20156, 37752, -150826, -312209, -142264, -119276, -2632, -204996, 140537, -158882, -115, -147910, -33421, 47150, 54045, -202963, 132678, -284318, 125038, 205958, 33513, -303499, -184371, 59242, 65139, 131372, 165279, 220821, -236492, -270201, 61008, 86596, 68390, -29097, 75149, -348865, -35769, -248034, -96414, 76966, 91522, -110977, -100507, -13436, -116075, 71500, -25869, 175539, -419403, -279647, -226794, -120986, 53285, -98903, -171944, -48836, -310172, -106335, -256918, -212261, 160430, -37514, -268289, -188904, 207906, -103963, 18777, -390780, -265864, 271667, -212613, 313437, 12417, 11356, -105594, -400672, -117144, 20696, -174045]
19439b6734f603A63933H1330Q5126D2571c16730F0829b95962q2770a17632B27465
19427b03148A14119C9759b63240B7856N9725n509A7879H917a6259k35673G1887
19415b01207C2102a73002c3280G3065B1387a21962m7723m27309E614b47661F9927
19403a04685B54330b42458B998J22884a44510D5308b96803d2919D4726g3027n3601
19392a26628d0416j3827A06707c41550J15666e6406a3174b891B0463Q029b27134
19380b02066g6913b5102k22616A86214b31206P7353P5470j33381A47630d6089
19369A23219f1879c0286k6529F1716R9024i18B12026b97661q2251B9413a17642
19357a79284c0360l98712J96500C0389M6688a77699n7654R1326O8105E0887h3367
$$ y = [-26734, -6603, 163933, 81330, 166456, 42571, -316730, 60829, -295962, -378732, -117632, 227465, -203148, 114119, 39759, -263240, 27856, 87581, 82072, 17879, 8917, -16259, -251932, 71887, -201207, 32102, -173002, -33280, 73065, 21387, -121962, -169685, -596994, 5614, -247661, 69927, -104685, 254330, -242458, 2998, 125882, -144510, 45308, -296803, -42919, 44726, -73027, -126628, -40416, -54243, 106707, -341550, -225884, -56406, -13174, -2891, 20463, 28492, -227134, -202066, -76913, -25102, -247718, 186214, -231206, -153853, -78383, -211764, 147630, -46089, 123219, -61879, -30286, -56815, 61716, 160740, -918, 212026, -297661, -379912, 29413, -117642, -179284, -30360, -429072, -232572, 30389, 77077, -177699, -235353, -144027, -75922, 50887, -83367]
19345B65443A06825a75819c380j62492A11870a34258K1410A41227a33921q6242
19335b20163e1645E9194c2897j88986A63509b06549k1969A98938I566i3233B07368
19323f6691a303k4192M141I4370J40673e6053l6350j17028j36045J71407n5276
19312b29345j05976d0388j73595A12345a69317n6612H3795b17425J08133F4182
19301H9923a04748B9782K09166r8995j5919e9600j7579A02726d6368a3007l0523
19290d3530K054c220r7060A25232a40569B01449A8314L05922a42553k7795e8187
19278I8567a38296o301b6353j37698j7684A96311c9058B34331c93881g0412A04177
19266i8608M6529K0022l39345f6689j50381F2733J38590m0285D184Q375J21899
$$ y = [265443, 106825, -175819, -3380, -165872, 111870, -134258, -112848, 141227, -133921, -220163, -51645, 59194, -32897, -221883, 163509, -206549, -228518, 198938, 9566, -93233, 207368, -66691, -1303, -25495, -21354, 94370, 235043, -56053, -92403, -209431, -345476, -174069, -229345, -335321, -40388, -213983, 112345, -169317, -225929, 83795, -217425, -109292, 64182, 89923, -104748, 29782, 238948, 139953, 124034, -59600, -77179, 102726, -46368, -13007, -43530, -41476, -3220, -100280, 125232, -140569, 201449, 18314, 324236, -142553, -170348, -58187, 98567, -138296, -144597, -26353, -164051, -181735, 196311, -39058, 234331, -393881, -70412, 104177, -98608, -52079, -32057, -371402, -66689, -217070, 62733, 201323, 161038, 4184, 12559, 134458]
19255A34458a42317d3004A23612b16824i3341m9717b7196k26456A21399P3335
19245A94734h038j69977E3993a24095B25290a31181j34575A46506a8826l45211
19235c64037a03788A55521b05229L3473B6232b21371a03650L8103A46095c90990
19224h3750F9670b19562h272r1600n2392p6135A21860i4164k52513F1379a23198
19212G3504a9242A19225E0575M2369c4849A07763a09395b5013O591j33475O5671
19201h6226J2910p9090I2621b21470n4540i7336j73297F5041a34339p0141K5462
19190a79018M3417k47335f3602o2726j50590F3610c04756a41620p9956K4986d6964
19178E2232a26118A02778e01A33996J50092h3035a1759m5632j22585j14201a24503
$$ y = [134458, -142317, -43004, 123612, -216824, -93341, -143058, -27196, -253652, 121399, 194734, -8038, -178015, 53993, -124095, 225290, -131181, -265756, 146506, -18826, -364037, -103788, 155521, -205229, -171756, 26232, -221371, -103650, -65547, 146095, -390990, -83750, 69670, -219562, -8272, -99872, -152264, -228399, 121860, -94164, -346677, 61379, -123198, 73504, -19242, 119225, 50575, 92944, -34849, 107763, -109395, -25013, -18422, -151897, -86226, -73316, -152406, 92621, -221470, -276010, -97336, -270633, 65041, -134339, -204480, -179018, -135601, -382936, -63602, -126328, -276918, 63610, -304756, -141620, -221576, -196590, -46964, 52232, -126118, 102778, -501, 133996, 284088, -83035, -11759, -57391, -179976, -294177, -124503]
19166b4520n9196b565j34150D00455c79370h3636j79269B3964J4730a50398e0902
19154H1054a75142j04432I320a18585q4345H1486B0080M4767h3513k07824F0705
19142a70359g1861p5765p9288N6366I4993d55658a03174D4911R2051m8994h5300
19130d05257a57289F600i4529L2949r3719m0264B0488b3685q5963A33067h3579
19118a06939h268k5475E7699M25292E3546K7324k329D073N2844b14896E4765b81004
19105h3433m32673a93824K1901m3470A47407d05684a83959j90283a3413p4486
19095h7899d2981k12251g4752j82301c8891k2286A42529c4486m2018G9616c215
19083a67888f7600B22046a04844a1431k6414j53506j4531Q7691N7016k50915d6907
$$ y = [-24520, -83716, -2565, -136715, 400455, -379370, -83636, -262905, 23964, 38694, -150398, -50902, 81054, -175142, -279574, 9320, -118585, -202930, 81486, 20080, 64847, -83513, -291337, 60705, -170359, -71861, -147626, -226914, -170548, 94993, -455658, -103174, 44911, 136962, 87968, -85300, -405257, -157289, 6600, -94529, -61580, -155299, -195563, 20488, -23685, -109648, 133067, -83579, -106939, -8268, -33743, 57699, 482991, 53546, 80870, 78541, 4073, 56917, -214896, 54765, -281004, -83433, -516106, -193824, -171923, -215393, 147407, -405684, -183959, -374242, -13413, -87899, -42981, -255232, -74752, -257053, -38891, -61177, 142529, -34486, -76504, 79616, -3215, -167888, -67600, 222046, -104844, -11431, -37845, -191351, -205882, -118191, -61175, -312090, -46907]
19071d8299A4873K14309a89411d6906I5690d32516a24759k0593O2823j33278B00515
19059D7547a87328K0666G7745a18140j07848J5648a170l8548o3217k21784a40044
19047a30336c6819A6095b26933R1701m5756A10522j7432K26325A43762J71686
19037C15448d8583j84286f6714A98793C306a41391e3690A15419J20214A16913
19026B14192b8255B4038d1843A52867a0631A41675a10013j2907j06105a13821
19015b03659M1623A09153b58940c6634G896L9730a27928G1464N9306c04974K7628
19004b77346A30615o5245a26568C1219A603a06050d286j92405B332b9904q314
18993c8218A07267a56813A54459c3172F5620J45417E0501h8478L2874E27922A72338
$$ y = [-48299, 14873, 229182, -189411, -46906, 95690, -432516, -124759, -145352, -82529, -215807, 200515, 47547, -187328, -166662, 77745, -118140, -225988, -210340, -1170, -39718, -102935, -324719, -140044, -130336, -36819, 16095, -226933, -135232, -180988, 110522, 93090, 319415, 143762, 315448, -48583, -232869, -66714, 198793, 3306, -141391, -53690, 115419, 235633, 116913, 214192, -28255, 24038, -41843, 152867, -10631, 141675, -110013, -122920, -229025, -113821, -203659, -162036, 109153, -258940, -36634, 7896, 47626, -127928, 71464, 130770, -304974, -277346, 130615, 65370, -126568, 31219, 1603, -106050, -4286, -196691, 2332, -29904, -38218, 107267, -156813, 154459, -33172, 65620, 211037, 50501, -88478, -55604, 527922, 172338]
18981a0226k08328I5473b46857d2877k56114i962k12416j55909a31675F0218g8409
18969F3586a6914A3042b82736A51792g535p4574B24538H5466M8894E4837c95455
18957B84809a88740B4959R1792h7242k35252a52114a8712k70552A14838a89763
18946d0811F8462M718c73062a53069e9621I409g7066A89148c30944A99125r3425
18935A05700J08372b64727a21367B43197c5546A49829m4997a28066I0323K29384
18925C19707a55818H6733j2572c12263A7860N7699i8683c3855k2171l0940k57542
18914c44508a17042F8679b6229A69768n0578K87097E0802L08199e0929k4115B3875
18902a40379f338j4674I070a88260A70935o7909a92397F4557c611E1873J53403
$$ y = [-10226, -218554, 95473, -246857, -42877, -298991, -9962, -222378, -378287, -131675, 60218, -78409, 63586, -16914, 13042, -282736, 151792, -7535, -82109, 224538, 85466, 134360, 54837, -395455, 284809, -188740, 24959, 116751, -87242, -322494, -152114, -18712, -289264, 114838, -189763, -40811, 68462, 73180, -373062, -153069, -59621, 9409, -77066, 189148, -330944, 199125, 105700, 214072, -264727, -121367, 243197, -35546, 149829, 104832, -128066, 90323, 319707, -155818, 86733, 74161, -312263, 17860, 75559, -98683, -33855, -56026, -86966, -344508, -117042, 68679, -26229, 169768, 119190, 406287, 50802, 359001, -50929, -75044, 23875, -140379, -6338, -21012, 9070, -188260, 170935, 103026, -192397, 64557, -3611, 51873, 205276]
18891B05276b41926f4841r8879g2342K2125n1991n4973e9038A25095b52383A48020
18879D5082a96598O5437e8023a6064B25475H6840b62419M7215B5098a32004G2815
18867a02640E3448M8577i9422j98450d4559B57173a05794B71163b16945q1834
18857b98779a27856D4174c43689a08269a2034B65125h5519A51883c33055b6249
18846E28061h5532A59019F1217J93211a89856p549M4564e6678k31128i8902b497
18834B04094a38939r767j0459h585m40955A65031A4668b34732A60389f4406E7216
18822g5384j67464B02029i7915c5536A29698m3068L12013b08416c244o2681k2450
18811h8375j01369b0081B14954r6163k6162i4105C23490c1490n665n7955j16744
$$ y = [205276, -241926, -64841, -163720, -72342, -50217, -102208, -157181, -59038, 125095, -252383, 148020, 45082, -196598, -131161, -58023, -16064, 225475, 86840, -262419, -215204, 25098, -132004, 72815, -102640, 53448, 102025, -99422, -297872, -44559, 257173, -105794, 271163, -216945, -298779, -127856, 44174, -343689, -108269, -12034, 265125, -85519, 151883, -333055, -26249, 528061, -85532, 159019, 61217, 254428, -189856, -197405, -152841, -56678, -287806, -98902, -2497, 204094, -138939, -148706, -159165, -8585, -449540, 165031, 14668, -234732, 160389, -64406, 57216, -75384, -242848, 202029, -97915, -35536, 129698, 86630, 398643, -208416, -3244, -65925, -88375, -189744, -20081, 214954, 118791, 92629, -94105, 323490, -31490, -37155, -95110, -211854]
18800b11854C42949c70698C91911a32026L8816B04093E5815g0205A13797b19043
18789a22711m4893p5265g8551B85414B9099R9475a93290h7055C19445E1324B4648
18777D3727J35180f2277o1442n3331j02046A7971d8755k66731C463a53298C1221
18765G9800a95863Q0958A59463a12089J3079F2454c0689k73275h0329A71963b65346
18753a63520c7000k11445a6549j58280Q2430A92313c8682k07058A10443I096g3376
18741b90791K7998D4382b79794Q9227o7032a16377k43644r9755h514r4281A01412
18729A64562k493b1471k4756j41693A19440b77999g1579p2646O0360F2000b87577
18717d38900R0578J2966n4226i1571J712k37399l1809C60269h8691k49005a64920
$$ y = [-211854, 342949, -370698, 391911, -132026, -93210, 204093, 55815, -70205, 113797, -219043, -122711, -167604, -242869, -78551, 285414, 29099, 128574, -193290, -87055, 319445, 51324, 24648, 43727, 178907, -62277, -123719, -177050, -279096, 17971, -48755, -315486, 3463, -153298, 31221, 79800, -195863, -114905, 159463, -112089, -99010, 62454, -30689, -303964, -80329, 171963, -265346, -163520, -37000, -248445, -16549, -174829, -92399, 192313, -38682, -245740, 110443, 9096, -73376, -290791, -262793, 44382, -279794, -190567, -257599, -116377, -360021, -459776, -8514, -102795, 101412, 164562, 162069, -21471, -46227, -187920, 119440, -277999, -71579, -144225, -83865, 62000, -287577, -438900, -348322, -335356, -389582, -91571, -89859, -327258, -359067, 360269, -88691, -337696, -164920]
18705b59133A69800b886j54317B9636O0343i3120j31660k4012c2403k58323a38746
18693a08690E4955N5865i4697k8552l60567f4350j03344q2952A74716E1675A3291
18681A81975q1918c64066B87937q8703a71405J67c4558E1713J20586i847r4784
18670a04631E9264c6200A1510L4076K080h0394E0736a42938A40555c29980a47853
18658e2177C74897i5551E3682N281f4438o7177b0985e93o1963k6605A17452K1003
18646A38455h4664C9269b13593I0248A0391a11654A35269c12283A56871p09c51015
18634i9607C26061b34369i2852A18194a49033C0153P2114a94501k4925b7531q544
18623c6075B97563a23559j29690l9283a28575D1140a27539a879A11241A2681J0359
$$ y = [-259133, 169800, -2886, -157203, 29636, 89979, -93120, -224780, -248792, -32403, -290726, -138746, -108690, 54955, 110820, -94697, -123249, -483816, -64350, -167694, -250646, 174716, 51675, 13291, 181975, 100057, -364066, 287937, 199234, -171405, -171238, -34558, 51713, 172299, -9847, -104631, 59264, -36200, 11510, 45586, 47666, -80394, 50736, -142938, 140555, -329980, -147853, -52177, 374897, -95551, 53682, 58963, -64438, -131615, -20985, -593, -62556, -89161, 117452, 138455, -84664, 39269, -213593, 90248, 10391, -111654, 135269, -312283, 156871, 156162, -351015, -99607, 326061, -234369, -92852, 118194, -149033, 30153, 102267, -194501, -219426, -27531, -36075, 297563, -123559, -253249, -292532, -128575, 41140, -127539, -1879, 111241, 12681, 23040]
18612B3040a97895C5064a16557I3120m2128L4926a89370R2068C7086i3415A47524
18600a6943k91793A21306K39955A13282g5855k24132A58484F6725J3682K64354
18590C44761j66073O7930e6456A25274m3389e5236l78983h2073l23493E5120O6762
18579A21882a94115b9519A07633m4305K2880N1368B6348i8594c3356B4991c16428
18567D1349J04788D389a60114D8260h5282D265d8561k51799C9067b93273f4539
18555e9846j08726G0456A257h7600I0498b06978k3972f3967m5750b1062D9360
18543I1482K58749H7684O8809a11070N4744A69257d4898d543A47689J56155D9836
18531b4457r1514q4743O2922B5393h2802j84438H5812a30080l71345b1019B93896
$$ y = [23040, -197895, 35064, -116557, 93120, 50992, 85918, -189370, -97302, 37086, -93415, 147524, -16943, -308736, 121306, 361261, 113282, -75855, -299987, 158484, 66725, 80407, 344761, 178688, 246618, -56456, 125274, 81885, -55236, -434219, -82073, -405566, 55120, 121882, -194115, -29519, 107633, 63328, 86208, 137576, 26348, -98594, -33356, 24991, -316428, 41349, 146137, 4389, -160114, 48260, -85282, 4265, -48561, -300360, 39067, -293273, -64539, -59846, -168572, 70456, 1257, -87600, 90498, -206978, -230950, -63967, -109717, -21062, 49360, 91482, 350231, 87684, 156493, -111070, -56326, 169257, -44898, -4543, 147689, 303844, 49836, -24457, -115971, -200714, -137792, 25393, -82802, -267240, 85812, -130080, -501425, -21019, 293896]
18519b59841J13071f8271j57377m2332Q6933L5701q3250A74744e9474D5489a11768
18507a3126K947A43663b13455d2811A79179c14831a23075A2762a13314K9511F1145
18495A17697L7105a25340H9419b53753R9564G0816a16302F4707K4038a65385M7321
18484a18064l4064C29586j25996F7844j4667a01705j12764O2136L5588A45037
18473i3314j1777J5226A34090b27319F7544g9424J2472F5251k8923b29461J3922
18462b15539q0554e2065C668b11575a9998n7886A03161a08737k37146c2286j17112
18451a49398B20108F9989c91936c8750A90000c6365j4978B92107e9202A76151
18440A15790c41512H7148b64774j12533J4279g331j28744B4013a08524D9775H034
$$ y = [-259841, -146770, -68271, -225648, -267980, -181047, -145346, -228596, 174744, -59474, 45489, -111768, -13126, -10179, 143663, -213455, -42811, 179179, -314831, -123075, 12762, -113314, -83803, 61145, 117697, 154802, -125340, 89419, -253753, -154189, 70816, -116302, 64707, 88745, -165385, -118064, -152128, 329586, 203590, 67844, 53177, -101705, -214469, -152333, -116745, 145037, -93314, -105091, -89865, 134090, -227319, 67544, -79424, -66952, 65251, 36328, -229461, -215539, -296093, -52065, 3668, -211575, -19998, -77884, 103161, -108737, -345883, -32286, -149398, 220108, 69989, -391936, -38750, 190000, -36365, -51343, 292107, -59202, 176151, 115790, -341512, 87148, -264774, -377307, -363028, -7331, -136075, 24013, -108524, 49775, 8034]
18428D8306J97605a21554j34654p5804c3799E201J88422a29106B35068b70669
18417C8388a94683A45878j3391K84451F2844M919a89379A42058h2758A19126L448
18406A22574b00135g7736k80218B17406o2985g8836b8930E23315a58107H203a62330
18394a60769j50428C4094O1449l0404L2478R4490c42261A02241b51830P2174E64
18382c58542a24280o7835g9708B17898j01024O9645a37902I4542a96429C3446
18371a69640F5666a86139m1333A02451N5208C3730O0714J88470a21383p9641R7214
18360a03810c6133c547j65688A91437d7830o4843a6552K133H1623f0555B30048
18348B85160a33038a9991G6775K77193o852i6023j60067j10194g196j10661n591
$$ y = [48306, 245911, -121554, -256208, -332012, -33799, 5201, 193623, -129106, 235068, -270669, 38388, -194683, 145878, 132487, 416938, 62844, 67763, -189379, 142058, -82758, 119126, 122574, -200135, -77736, -357954, 217406, 154421, -78836, -28930, 523315, -158107, 8203, -162330, -160769, -311197, 34094, 95543, 65139, 97617, 192107, -342261, 102241, -251830, -179656, 564, -358542, -124280, -192115, -79708, 217898, 116874, 186519, -137902, 94542, -196429, 33446, -169640, 65666, -186139, -227472, 102451, 157659, 33730, 94444, 282914, -121383, -201024, -103810, -36133, -3547, -169235, 191437, -47830, -112673, -16552, -14419, 81623, -60555, 230048, 285160, -133038, -19991, 76775, 353968, 347116, -96023, -256090, -366284, -7196, -117857, -123448]
18337a23448C6154a42741D7148d17147A18039A1260a67900G8238b00591j06173
18327c06764C2843a35619e4679C24899b45069B63099b80799q9024h1809m3382
18317a25191j0579I527d73228A91560b40974A70403g0327C6297c19543A03096
18306g2281k01526D6137i8650P922A50288a61497j02267M4708a1113k85892j002
18295b98007A97250b65733B93525C8442Q9770b51249A08249b681p9737I6311a6204
18283c33594D11189B8511b43111i2891A2636d83592h8909C21289A0150J0913a68633
18271e4176B5819J70347c727q1184A8942L3091L27438b730j53427a6705j10777
18260a27482e9417l06341A89153a09516J7880k46208K4689g4839B2768R2748P3803
$$ y = [-123448, 36154, -142741, 47148, -417147, 118039, 11260, -167900, 78238, -200591, -306764, 32843, -135619, -54679, 324899, -245069, 263099, -280799, -369823, -81809, -125191, -135770, 9527, -473228, 191560, -240974, 170403, -70327, 36297, -319543, 103096, -72281, -273807, 46137, -98650, -90728, 150288, -161497, -263764, -219056, -11113, -297005, -298007, 197250, -265733, 293525, 38442, 128212, -251249, 108249, -2681, -82418, 96311, -16204, -333594, 411189, 28511, -243111, -92891, 12636, -483592, -88909, 321289, 10150, 21063, -168633, -54176, 25819, 196166, -3727, -84911, 18942, 52033, 379471, -2730, -156157, -16705, -127482, -59417, -365758, 189153, -109516, -91636, -337844, -313155, -74839, 22768, 115516, 189319]
18249A89319a57354e8190A27322d9152k9664K614A72938l4212a83168d6825B68406
18237c2806j82317b5901j40618B99735j36475I863a40113j61092L8096B63089
18226B62146Q9117a53466j21396J00078H4658N9788A8319R2984b60606b6075Q827
18215a7248j28051A09087K5427B4993c31542g846C97171c48332A4874O4591f3021
18203a73074O2913j05160d0136H2927K28571b74169A69702a51810n3273L5250
18193a69833A04755n1746J49661b03847r0471N3774A43774a10292C63222c97172
18182b16525B30911a9589A56167a30493D46183b29278d0838p391e031k20210P6046
18171a49195A55065J05927I5571B6026b3790A09455b27258E0610N372b80690J03704
$$ y = [189319, -157354, -58190, 127322, -49152, -78816, -76202, 172938, 138726, -183168, -46825, 268406, -32806, -215123, -25901, -166519, 299735, 163260, 9863, -140113, -301205, -263109, 263089, 262146, 351263, -153466, -274862, -174784, 84658, 144446, 18319, 111303, -260606, -26075, -17248, -145299, 109087, 134514, 24993, -331542, -7846, 397171, -348332, 14874, 79465, -63021, -173074, -110161, -215321, -40136, 82927, 311498, -274169, 169702, -151810, -205083, -169833, 104755, 53009, 202670, -203847, -294318, -240544, 143774, -110292, 363222, -397172, -216525, 230911, -19589, 156167, -130493, 446183, -229278, -40838, -48229, -5031, -225241, -149195, 155065, 260992, 95571, 26026, -23790, 109455, -227258, 50610, 55982, -280690, -176986]
18160a76986c5365B74797h1869L0488H1275a67722C7728f5667D9846P7722b6676
18148a58574M7877A05893a4673j79134A09490L46210c157j17625B24219h0744
18137H4882d5483q5359l6370B01567i0386J4315H229J70978a04871E3078b71712
18125b63449A12850a27360a151B4590f6577r5295B52009b17580p5779D1392a80813
18113h3369o0399f3026A89105G1952k6440a34550F8054J44770f2523E8849J8279
18102G7128e5720A22736a72005J6215j46466C54854j03675a81224n3480I8607
18091H7240i2165B04789i1907A5243P0896H075K4643J26715o9364e5125j04168
18080a59293H8210b46664A56552a17178b3429h281r0369a4504j16917C5784f7867
$$ y = [-176986, -35365, 274797, -81869, -51381, 81275, -167722, 37728, -65667, 49846, 127568, -26676, -158574, -110697, 105893, -14673, -193807, 109490, 455700, -3157, -120782, 224219, -80744, 84882, -45483, -130842, -167212, 201567, -90386, -76071, 8229, 179207, -104871, 53078, -271712, -263449, 112850, -127360, -1151, 24590, -66577, -161872, 252009, -217580, -293359, 41392, -180813, -83369, -143768, -63026, 189105, 71952, 45512, -134550, 68054, 212824, -62523, 58849, 77128, -55720, 122736, -172005, -155790, -302256, 354854, 251179, -181224, -234704, 98607, 87240, -92165, 204789, -91907, 15243, 86139, 8075, 32718, 159433, 90069, -55125, -159293, 88210, -246664, 156552, -117178, -23429, -8281, -98650, -14504, -131421, 35784, -67867]
18068a3918j35168c7950a1214n8789C14042b31438m6676G2498e0092A15085j7066
18057I8019N5206D7512i2889A3701L535b36674L8649A04247J21317g9956F4981
18045A947i7785K0729b510A44106h7465j51667N3966E056K46991B9474c1107q2535
18033a13642j24296N7303I2566a90274f3719B84335i3537J0579j16038j36767
18023c35763f5257A20218a4054l7923r9525j48902J15399A44281c15436J09770
18013b05666l9812A37958b1493H2264J3167B202J67018c1535K005r1469B1013
18001A07532b15953a07813J0865l9937q8758c7757l42949A06870J20981I238c8763
17989a96769l4512E3289b09009e1434j39753A20172B4204b64607D7949a71056
$$ y = [-13918, -149086, -37950, -11214, -70003, 314042, -231438, -278114, 72498, -50092, 115085, 98019, 153225, 47512, -92889, 13701, 17236, -236674, -198025, 104247, 225564, -79956, 64981, 1947, -97785, -77056, -2510, 144106, -87465, -239132, -185166, 5056, 252047, 29474, -31107, -113642, -237938, -180635, 92566, -190274, -63719, 284335, -93537, -82958, -198996, -335763, -65257, 120218, -14054, -51977, -151502, -300404, -185005, 144281, -315436, -205666, -245478, 137958, -21493, 82264, 95431, 2202, 169220, -31535, -29530, -120999, 21013, 107532, -215953, -107813, -96948, -136885, -225643, -37757, -380706, 106870, 227851, 9238, -38763, -196769, -231281, 53289, -209009, -51434, -191187, 120172, 24204, -264607, 47949, -171056]
17978a77822c5109j43533A55997m9243g0771C68621A70874h4731a1840A67510
17967a11551j0703R4c0858F4922e9780K7112p028m9304B31719c9510D58602b38961
17954a03191k52213A52181o2524b38971E9749J06598a76082A28382P2079A8036
17943H0115L6172J1449C6282h7376l0069K9917B45618a35414e7356e56l18335
17932c18891F5796B0320b56624j75370a76765E6371b19777N2953A7518J64790
17922A82308a19520A09023D5276K11988a6061B35095b36074o7012E8921d8484
17911c06576b4421j61242Q6641k18886a49965a3532I6365O7420C2389J30295H0279
17899b4704E2083b55915A00821c3701j36241G6106a43607B14982a23209L1780
$$ y = [-177822, -35109, -178642, 155997, 106754, -70771, 368621, 170874, -84731, -11840, 167510, -111551, -122254, -122160, -30858, 64922, -59780, -32668, -39696, -89000, 231719, -39510, 458602, -238961, -103191, -355404, 152181, 89657, -238971, 59749, 166347, -176082, 128382, 200461, 18036, 80115, 116287, 127736, 36282, -87376, -117445, -87528, 245618, -135414, -57356, -556, -318891, 65796, 20320, -256624, -431994, -176765, 56371, -219777, -166824, 17518, 182308, -119520, 109023, 45276, 257264, -16061, 235095, -236074, -303086, 58921, -48484, -306576, -24421, -185663, -99022, -317908, -149965, -13532, 96365, 163785, 32389, 162684, 80279, -24704, 52083, -255915, 100821, -33701, -169942, 76106, -143607, 214982, -123209, -91429]
17889i1429k06408I0591c1286j91260f3359G476K31675h9602C24981H9557a50822
17877B93679b0269n5357G2289b31397L6679c6522r4532K3574j24743e5370j19280
17866a74650j50186d839G3134J43475O815B3974K14889c5074k39622a17488d0585
17854i6162A10759J23332K13884b72153B0510J66576h5839A44629N6008K54508
17844D55145B08208q8396a15940D5145J35796I987O3645C6663a31803E1791O6953
17833A18744B631a59099B75727j09270A7348K3645P3153f9542k66556B12313a16365
17821A18598k5225e6575j5086b0849A07116b61721l01745a12819A30292b71913
17810A38189a22786C52670j58034D057a95327j00480I4146O052i5527l436M3119
$$ y = [-91429, -297837, 90591, -31286, -222546, -63359, 7476, 239151, -89602, 324981, 89557, -150822, 293679, -20269, -75626, 72289, -231397, -194718, -36522, -131054, -107480, -232223, -55370, -174650, -324836, -4839, 73134, 216609, 223424, 23974, 238863, -35074, -274696, -117488, -40585, -96162, 110759, 234091, 447975, -272153, 20510, 187086, -85839, 144629, 200637, 455145, 208208, 119812, -115940, 45145, 180941, 9987, 73632, 36663, -131803, 51791, 118744, 2631, -159099, 275727, 166457, 17348, 40993, 114146, -69542, -336098, 212313, -116365, 118598, 93373, -56575, -71661, -20849, 107116, -261721, -563466, -112819, 130292, -271913, 138189, -122786, 352670, 194636, 4057, -195327, -295807, 94146, 100198, -95527, -98963, -55844]
17799e5844H7267d1878A35443K69764C1610g8122j58066B08155M6069I0143g000
17787e3848A32769b0339j90333e8414C42891a87872D6753c4451j44576F7042g6051
17775H6140K53220b19964F1371A1000Q670K3581P7001j1874a85907d8551B75469
17763E5721J2324i0699k11403A35016J9797a22129C3528c00547B28964H9980i0759
17751A21103h2380F4709a9222j92498A34242k8104d0935B13308d3198B37026a94263
17739A16183a41465a0209B36127c0725m2558j24473f2794j4973D6435a0217A27261
17727b60340J16716G3839b6475D8358b42556A22059a99758j26415a37452G5864
17716a07832k47739J12267J20810C74680j49454L1922a19113M4944j66441a3369
$$ y = [-55844, 87267, -41878, 135443, 405207, 31610, -78122, -236188, 208155, 254224, 90143, -7000, -53848, 132769, -20339, -210672, -58414, 342891, -187872, 46753, -34451, -179027, 67042, -76051, 86140, 339360, -219964, 61371, 11000, 19670, 43251, 120252, 108378, -185907, -48551, 275469, 55721, 68045, -90699, -302102, 135016, 154813, -122129, 33528, -300547, 228964, 89980, -90759, 121103, -82380, 64709, -19222, -211720, 134242, 106138, -40935, 213308, -43198, 237026, -194263, 116183, -141465, -10209, 236127, -30725, -73283, -197756, -62794, -77767, 46435, -10217, 127261, -260340, -143624, 73839, -26475, 48358, -242556, 122059, -199758, -326173, -137452, 75864, -107832, -355571, -243304, -122494, 374680, 225226, 257148, -119113, -74169, -240610, -13369]
17705B5940O7157D1162j9596M18845a13517C97094A18197a57064D4902a7186A49451
17693A18746k9082a11109m6766A25327a82941A15053L44580j27752i7938A73026
17682b90544j25611E9322Q0317J14950n9618Q0674c28719J12093a2192l1778A46592
17670b21404R1551j38129f1734G6137P9516L3739d0112A06551j5697C1853j5676
17659A6177J51118l4107i0060j38246A56235b94174L4818d4630A80603j5177G7530
17647A34590n9809a36170j12111A68233a07998L1884j30888A56214a30298B2091
17636c93820b3502k515B85435A30067a89487e5514D66015a14817K5908A27323
17625a64417B03259b0287o1920G6927J78587F1350d8013r5181C59918a09103C81080
$$ y = [25940, 93097, 41162, 21566, 440411, -113517, 397094, 118197, -157064, 44902, -17186, 149451, 118746, 89664, -111109, -157875, 125327, -182941, 115053, 459633, 331881, -97938, 173026, -290544, -416155, 59322, 139639, 254589, 194971, 275645, -328719, -216626, -12192, -43970, 146592, -221404, -129853, -267982, -61734, 76137, 155653, 189392, -40112, 106551, 90854, 31853, 16177, 167295, 133188, -90060, -228306, 156235, -294174, -259356, -44630, 180603, 165426, 77530, 134590, 74781, -136170, -248281, 168233, -107998, -76114, -207002, 156214, -130298, 22091, -393820, -23502, -26017, 285435, 130067, -189487, -55514, 466015, -114817, -88909, 127323, -164417, 203259, -20287, -82207, 76927, 255514, 61350, -48013, -143194, 359918, -109103, 381080]
17613a46682C7290a56301P643G9624i2322B57853q1749b748B00417D6133Q2327
17602A28460M806b68163B9708L31888p6499n3298J3176Q4369a51474n8830D7998
17590C3480i2898I0917a47581P2245B05088E093J18385B3962c1753C4190r449
17579B4741b60324a02386C1368R6089e8600j24476A75417E5483Q8093N3700c8175
17567B19999a14612B42483b2308j07067A20419N1240l2594P2074H7604d9226a8155
17555C07944D3208j8538R9300L5540c9119A59160b45425A05363J28578A590K08394
17544B09984e5937b3102C0252b64520a5820k17568B96849D4642J28287M3319c20743
17532E78963k88603a17365A44672i7823I3149K26966F3003Q2770k561J44022b77765
$$ y = [-146682, 37290, -156301, -148658, 79624, -92322, 257853, 176104, -2748, 200417, 46133, 128460, 133266, -268163, 29708, 361596, 285097, 231799, 244975, 329344, -151474, -210304, 47998, 33480, -92898, 90917, -147581, -75336, 205088, 5093, 123478, 23962, -31753, 34190, 24741, -260324, -102386, 31368, 127457, -58600, -183076, 175417, 55483, 143576, 197276, -38175, 219999, -114612, 242483, -22308, -129375, 120419, 171659, 139065, 211139, 87604, -49226, -18155, 307944, 43208, 24670, 123970, 159510, -39119, 159160, -245425, 105363, 233941, 1590, 209984, -55937, -23102, 30252, -264520, -15820, -233388, 296849, 44642, 172929, 216248, -320743, 578963, 290360, -117365, 144672, -97823, 93149, 320115, 63003, 145773, 143212, 287234, -277765]
17520C968b14737e163C14819A18946k7623Q3328C1960J21224k8841J23990j19460
17509A28873K19204K62705B23647p7892a56935A04203K94586I9799J0266J86698
17499B96763a04059C09385i9792A079O8219P2766a2820A68396Q1615h0380B11245
17487A32906R0371H167J12993b73296A17221C6531l747d4353I6186r79d997I5853
17474I0439b03244A8375O2326M19934b67313G8134J29683k8916H6641L8731n3155
17463G2217H351N5334g5596B09465A2519M6570P1991J69793A39111J72139J02826
17452D14076j04933H561J43070b4422A56763L3586K07144j33881F0834a51029
17441C60366A6246L08041L968P9559B03619L32523B05954p0764a99482E7013J16405
$$ y = [3968, -214737, -5163, 314819, 118946, 91323, 174651, 31960, 153184, 124343, 248333, 128873, 348077, 610782, 223647, 145755, -156935, 104203, 398789, 99799, 110065, 296763, -104059, 309385, -99792, 1079, 69298, 142064, -12820, 168396, 250011, -80380, 211245, 132906, 223277, 8167, 121160, -273296, 117221, 36531, 32784, -44353, 96186, 95207, -4997, 95853, 90439, -203244, 18375, 80701, 500635, -267313, 78134, 207817, 178901, 86641, 125372, 72217, 8351, 63685, -75596, 209465, 12519, 59089, 131080, 300873, 139111, 311250, 414076, 309143, 8561, 151631, -24422, 156763, 190349, 397493, 263612, 60834, -151029, 360366, 16246, 324287, 328255, 407814, 203619, 536142, 205954, 135190, -199482, 57013, 173418]
17430A73418J2575L88182G9410J21671k6002o7602L92121A3319J58774L25027
17420D97120a23121B42314J41766K1314B00302r6285R1945K46324j299A69539
17409D63648B02026m5882L3434K82810d9655A09164J48871J90592j6459j88346
17399B43822G1283J09274R7411A9148N57220B07093q3531C8173J85994Q6937j30943
17388A80161a17319d4064C87679F4747a15283A23592J12547m0683q4125J35339
17378B46670m7101J22538j44356C5499J42721L1089q5485a81847A09398M24133
17368E33531n1637i099A56163B0205J83265b09538b5534B22378j3574d5652r9530
17357a45182B50341k9110k5235a93757I4022c58728c6259N359B32247a44827A42218
$$ y = [173418, 185993, 574175, 79410, 201081, 175079, 107477, 499598, 13319, 172093, 497120, -123121, 242314, 384080, 405394, 200302, 104017, 195962, 442286, 440987, 169539, 463648, 202026, 156144, 189578, 472388, -49655, 109164, 258035, 448627, 432168, 243822, 71283, 180557, 277968, 19148, 576368, 207093, 123562, 38173, 224167, 311104, 180161, -117319, -44064, 387679, 64747, -115283, 123592, 236139, 195456, 111331, 246670, 199569, 322107, 177751, 35499, 178220, 209309, 123824, -181847, 109398, 533531, 481894, -9099, 156163, 20205, 203470, -209538, -25534, 222378, 208804, -45652, -145182, 250341, 221231, 195996, -193757, 94022, -358728, -36259, -30900, 232247, -144827, 142218]
17345A57457J11101j22312h8376k14122B775K52482A19170K16582A55932O9359
17335B25291j07959g2563D4753K6047K49998a80646A67362b5570B09266A01725
17324D38754A48474a36376C66547j01861J4569c907E10102A4574R1772M8562J55172
17313C10080J58214A83974a35864C81795I9513a1542C51397P9104A02771K49707
17303C52478j09370E8366J63307M183K21920C151a89193A72195k6345a44787j4059
17292a58846F7545L17413j35707J04693J1331A30624A6722J25498J31211Q6085
17282C59516A1921K38743a43602A38219R9211j03165P1002H8862L9863o1459N5807
17271A23073K45766j73195J44734I2802N0384K85637A8033b2880A55541r6K35097
$$ y = [157457, 268558, 146246, -88376, -302498, 2775, 255257, 119170, 335752, 155932, 225291, 117332, -72563, 44753, 70800, 320798, -180646, 167362, -25570, 209266, 101725, 438754, 148474, -136376, 366547, 264686, 279255, -3907, 510102, 14574, 106346, 154908, 310080, 468294, 183974, -135864, 381795, 99513, -11542, 351397, 430501, 102771, 352478, 243108, 58366, 221673, 225856, 447776, 3151, -189193, 172195, 145850, -144787, -158846, 67545, 384958, 249251, 353944, 365275, 130624, 16722, 142220, 273431, 359516, 11921, 250664, -143602, 138219, 237430, 134265, 205267, 88862, 128725, 67266, 123073, 368839, 195644, 340378, 92802, 143186, 428823, 18033, -22880, 155541, 155445, 390542]
17260C90542I2665c654C69072D0905K00607J4974b6228j01206B11112O1846P7646
17249C50604g8417A38079g7552B32130o1577L92009a81139h5896D3291J08701
17239A51992P4524H4483K5081m8989L38566A12201J86960A02566K18753r6691
17229B24628o7496l3733o1357Q0013L7789K32927j29736D6003M8890K37372m6531
17218B85734n2224J82743j50831m0175K7777P9092j42576J42739l6815C8340J90029
17207B28369A06404A9722K77660o5116J50530L00446k66866R8948j64436R091
17197C59979r7105K31810A09177M4835K25771E6314M28014m3336A49857K51779
17187D01636M4262q0960O2464j44891K03563k04176j6900Q1558A13848J59616
$$ y = [390542, 92665, -3654, 369072, 40905, 241512, 256486, -26228, -127434, 211112, 272958, 350604, -78417, 138079, -77552, 232130, 170553, 562562, -181139, -85896, 43291, 151992, 226516, 84483, 109564, 60575, 399141, 112201, 299161, 102566, 321319, 224628, 157132, 123399, 62042, 142055, 179844, 412771, 283035, 46003, 94893, 332265, 285734, 233510, 416253, 265422, 225247, 253024, 332116, 189540, 332279, 295464, 38340, 228369, 106404, 19722, 297382, 232266, 382796, 683242, 416376, 515324, 350888, 359979, 262874, 494684, 109177, 154012, 379783, 56314, 484328, 440992, 149857, 401636, 445898, 364938, 427402, 282511, 486074, 281898, 264998, 346556, 113848, 273464]
17177B73464C9357J19443J74968J59839k37668J3193J60531q8595Q455L3348A49655
17165B54611g9540E07114A42648k5183N26321C14835j20877M6955J61288o5530
17155C36671H8392k2913L13513q7213J34447m3953J02532j17858D2043L01145
17145C43188J85934F9399L74915j6893j45301J96641j6597k2622J8034B18207
17134B06913o5175n882L67865J18990A84498J60422A46869K30768H7472K21755
17124C09227L474H0446L26809M9923A05836O318J90398q4573K31902p131A79276
17112D67464k3883k05669i8903D23668B05401k1556K8895J10386M02439I5428
17101C79567l3982n200j66069J01297L67062j14899q1843j225j2531j3035J77793
$$ y = [273464, 39357, 158800, 333768, 493607, 255939, 269132, 429663, 341068, 349523, 382871, 149655, 254611, -79540, 507114, 142648, 117465, 643786, 314835, 193958, 240913, 402201, 336671, 88392, 65479, 378992, 291779, 426226, 382273, 484805, 366947, 42043, 343188, 529122, 69399, 444314, 427421, 282120, 478761, 462164, 439542, 457576, 218207, 206913, 141738, 135856, 503721, 622711, 184498, 344920, 146869, 377637, 87472, 309227, 312701, 80446, 407255, 457178, 105836, 112154, 302552, 217979, 449881, 442750, 179276, 467464, 443581, 237912, -98903, 423668, 205401, 183845, 212740, 323126, 725565, 95428, 379567, 345585, 340385, 174316, 275613, 642675, 527776, 445933, 444708, 432177, 419142, 596935]
17090E96935m6513B45288J68776p4716K10084A71127K21321J34307J47617B27317
17079E74720N3114J3536j8073k93564k3018J27944J49025n5124m9724k12503J45402
17068D11735P2737n2259q5625K13463k8515j70276K9660o614m4520r565K32309
17057E62530N0867p2548k13030J70919j16552K64723l17305J98799k15910K74014
17047E86507r5001J88424j99566j51371J09558J02808J7416J10434J9382j88382
17037E00209Q623O5516N4142o9108J72009K2206q9748k3347B10609N89551m4929
17026G55231k5084k94984L6548K07509k94834K40844p8250K11023j80954r8879
17016D78170L25135j97332M2536J23206C60216M76700j12705J92678l89783j77186
$$ y = [596935, 550422, 245288, 414064, 339348, 549432, 171127, 392448, 526755, 674372, 227317, 574720, 627834, 641370, 623297, 329733, 306715, 434659, 583684, 528560, 478836, 266333, 411735, 484472, 432213, 346588, 560051, 531536, 361260, 390920, 384306, 339786, 330221, 562530, 613397, 540849, 327819, 498738, 382186, 646909, 329604, 528403, 312493, 586507, 491506, 679930, 480364, 328993, 438551, 541359, 558775, 669209, 688591, 500209, 508832, 574348, 628490, 559382, 731391, 753597, 663849, 640502, 210609, 800160, 755231, 730147, 435163, 471711, 679220, 384386, 625230, 546980, 758003, 577049, 478170, 803305, 605973, 648509, 771715, 360216, 836916, 724211, 916889, 527106, 349920]
17006C49920L48228J94408k75100p3638K16783r4571L07146j18346p812r5670
16996G51348J90810B42113O66010j23640k66880L14622j12117j55945J52565J49428
16986H66156L7031l29666j09166K16240P38515l51581l86807L65764P9316l89446
16976G36356J10161Q4300k08544K14955k87421L41190r6859J20260l5641J23824
16966A102581j74358R8742j40367J23666L22605n32950J11251L53194l91567K65119
16956A137916k17861M53105o75596O12987j55870J68393k6358R6370o46119Q26683
16946A573650k88921k70704L89320j43386j53716J7993r867K69469l32112J71331
16936A223057j41497J2374R4450m7209M79702l87251L00887j18714K12115k20795
$$ y = [349920, 698148, 892556, 617456, 543818, 760601, 666030, 973176, 854830, 847018, 751348, 942158, 242113, 908123, 784483, 517603, 832225, 720108, 564163, 716728, 866156, 903187, 573521, 464355, 680595, 1419110, 1067529, 680722, 1046486, 1125802, 736356, 846517, 930817, 722273, 937228, 649807, 990997, 894138, 1014398, 978757, 1102581, 928223, 1026965, 886598, 1010264, 1332869, 799919, 911170, 1264364, 872797, 1137916, 920055, 1373160, 697564, 1310551, 1154681, 1323074, 1296716, 1393086, 746967, 1573650, 1284729, 1014025, 1403345, 1259959, 1106243, 1124236, 1114369, 1383838, 1051726, 1223057, 1081560, 1093934, 1188384, 1141175, 1620877, 1233626, 1534513, 1415799, 1627914, 1407119]
16926A407119k61237j3779K39000K8503j97208J17355O1163j56126J91981m23620
16916I93151L94727J3322J85946o6145o6376Q2328J80375J6671j08529P8589J12618
16905A816677j37490J05787n435M1641K0313k9177J6397q8817N6679q318m97382
16894A290875M50909K0047K59209J64250k02320l80852M96425j55349J68382j10817
16884B000759j44236K42530K66749R1517r1413j11904L02511k24492j55455O7462
16874B244028K73187J19141l78176K56711L2879N887J7608J24227k84495L80077
16864B791074m7543j84418J71946j1072K33133K15107j45102k13039J66324j30732
16854B845678J69765L15746k37732N42008k17628m11495M56891j56286M90563
$$ y = [1407119, 1145882, 1132103, 1371103, 1399606, 1202398, 1319753, 1380916, 1224790, 1416771, 993151, 1387878, 1401200, 1587146, 1521001, 1454625, 1536953, 1717328, 1733999, 1625470, 1704059, 1816677, 1679187, 1784974, 1779539, 1821180, 1841493, 1812316, 1828713, 1739896, 1796575, 1788257, 1290875, 1741784, 1761831, 2021040, 2185290, 1982970, 1602118, 2098543, 1943194, 2111576, 2000759, 1856523, 2099053, 2365802, 2457319, 2365906, 2254002, 2556513, 2332021, 2176566, 2244028, 2517215, 2636356, 2258180, 2514891, 2547770, 2553657, 2571265, 2695492, 2410997, 2791074, 2743531, 2559113, 2731059, 2719987, 2953120, 3168227, 3023125, 2810086, 2976410, 2845678, 3015443, 3331189, 3093457, 3635465, 3417837, 3006342, 3463233, 3306947, 3797510]
16845C797510k33448o8192K30275K27903M6356L242o57K0104P1510K02481j55463
16834D141621l59526L37633L20416J13272k03161J9214L82640n7149J11262j71196
16824D635026K03610N99015o17876K34414L01557P1708q1554K19193J83836L41350
16814F090279l71154L9898N27187J35341R8611L36313p8871P2173K28942O29352
16804G708071n66755M35629j30648K81313L85563r4041K83648J60167K95877K37909
16794H996733j49098M68737K71717P06485j6636O2507K96527J80018l6869R70694
16784A1750815K03129L26833L48532o4748O89965M81780K18423L73736K77869
16775A4606334O51775L29388N15952P19653K17775R36611N85378L90057P99670
$$ y = [3797510, 3564062, 3495870, 3726145, 3954048, 4000404, 4003646, 4002989, 4023093, 4094603, 4297084, 4141621, 3782095, 4119728, 4440144, 4553416, 4350255, 4369469, 4752109, 4694960, 4806222, 4635026, 4838636, 5437651, 4819775, 5054189, 5355746, 5427454, 5345900, 5565093, 5748929, 6090279, 5719125, 5759023, 6286210, 6421551, 6520162, 6856475, 6777604, 6849777, 7078719, 7708071, 7141316, 7576945, 7446297, 7727610, 8113173, 8019132, 8302780, 8462947, 8758824, 8996733, 8847635, 9316372, 9588089, 10294574, 10277938, 10340445, 10636972, 10816990, 10780121, 11750815, 11953944, 12280777, 12629309, 12564561, 13254526, 13736306, 13954729, 14328465, 14606334, 15258109, 15587497, 16103449, 16823102, 17040877, 17977488, 18562866, 18952923, 19752593]
16766A9752593L62874R32502O44907J020733Q63445P74423P11280J098561R45022
16757B7106340R82170J165534J356873J540024Q85646J472503J734721J833860
16749C8077671J583412J715600K083463J823184K178649K494978K668418K544772
16741E5170147K825268K967451L277699L417519L471671M015165M149266M424281
16733H3718467N177868M371727N494132N149525N861213N974088N767762O111495
16725A27626277O348773O447742N971747O076712N768783M810309M452500L696424
16717A71199267L059155J672194R52220j47876j121518k224351l349268l948854
16709A66090969m840429n330675n823916n999666o361738o519514o390052o662171
$$ y = [19752593, 20115467, 21047969, 21692876, 22713609, 23577054, 24351477, 25062757, 26161318, 27106340, 28088510, 29254044, 30610917, 32150941, 33036587, 34509090, 36243811, 38077671, 39661083, 41376683, 43460146, 45283330, 47461979, 49956957, 52625375, 55170147, 57995415, 60962866, 64240565, 67658084, 71129755, 75144920, 79294186, 83718467, 88896335, 93268062, 98762194, 103911719, 109772932, 115747020, 121514782, 127626277, 133975050, 140422792, 146394539, 152471251, 158240034, 163050343, 167502843, 171199267, 174258422, 175930616, 176882836, 176734960, 175613442, 173389091, 170039823, 166090969, 161250540, 155919865, 150095949, 144096283, 137734545, 131215031, 124824979, 118162808]
16701A18162808o168567o424200n454548n452208n403400m962112m950080m296471
16693G5051222m144530l877482l659967l349316l340585k910671k668711k806401
16685D8293559j908618k463017k109045k376547j662982j583599j497914j772690
16677C2919147j332070j594133j209565r64624j291056j269853q92906j140525
16669B3224415p11898q52636q67923p90490n71910n91031j116569k95493p67389
16660A6659076m06543n84077n10184n59900n06643l08803m62699l93975m80772
16651A2445480q5723j021887K5304k86580l54853n06250k22635K1907m45035l96691
16641I173037k0182k49899l31343j32212l58010j73057k4705k75226j69049J06540
$$ y = [118162808, 111994241, 105570041, 100115493, 94663285, 89259885, 84297773, 79347693, 75051222, 70906692, 67029210, 63369243, 60019927, 56679342, 53768671, 51099960, 48293559, 46384941, 43921924, 41812879, 39436332, 37773350, 36189751, 34691837, 32919147, 31587077, 29992944, 28783379, 27818755, 26527699, 25257846, 24364940, 23224415, 22512517, 21659881, 20791958, 20001468, 19429558, 18838527, 17721958, 17426465, 16659076, 16252533, 15668456, 15158272, 14598372, 14091729, 13782926, 13320227, 12926252, 12445480, 12359757, 11337870, 11363174, 11076594, 10721741, 10215491, 9992856, 10014763, 9569728, 9173037, 9152855, 8902956, 8571613, 8439401, 8081391, 7908334, 7883629, 7608403, 7439354, 7545894]
16631G545894l59526l59451j89519M62m233k74844j32629O562l63793k44711P8011
16620E702223l42864q5929M803k80643j73590m9465J18144n66375J90471L59275
16610D876050J05095o94333M07284k39255k01475k04661p5839l17130J60631M765
16600C821132j22293M9052j72301M317l95237K32813k55619n6890k3391J53081
16590C234664k69662R2590J04705j85991J5406m4425n3514j2353P2169j72221
16580B781368N8255l93664l1483J04459o293j28253j07904L67348l77364k14657
16570B051812K82919k52450J46061j43960L60088k01022Q7083l29724N2109N7940
16560B110856J30347j89166r5121J81317k47532j5516R7251j65740j36149J78434
$$ y = [7545894, 7186368, 6826917, 6637398, 6637860, 6633627, 6358783, 6226154, 6232716, 5868923, 5624212, 5702223, 5359359, 5273430, 5278233, 4997590, 4824000, 4774535, 4892679, 4326304, 4516775, 4876050, 4981145, 4286812, 4694096, 4454841, 4253366, 4048705, 3972866, 3655736, 3816367, 3821132, 3698839, 3747891, 3575590, 3579907, 3184670, 3417483, 3161864, 3104974, 3081583, 3234664, 2965002, 3057592, 3162297, 2976306, 2991712, 2947287, 2893773, 2881420, 2953589, 2781368, 2839623, 2445959, 2414476, 2518935, 2512642, 2384389, 2276485, 2643833, 2266469, 2051812, 2334731, 2082281, 2228342, 2084382, 2444470, 2243448, 2330531, 2000807, 2052916, 2110856, 2241203, 2052037, 1956916, 2138233, 1890701, 1875185, 1972436, 1806696, 1670547, 1848981]
16550A848981k03849N1627k94381K82083M6694m01974Q7575J23282K8703J89813
16540A758554k34426n9753K22797p5178o8634K67834o01606J79945k66291L83143
16530A506385l11734L4090l0191L94619o50890M50091k10790k99963L21143J01485
16520A304245j02233N1820k15741J93236j38053L2260k06723L60118o0125l12645
16510I06159K48596k06329k4182K77954j70985Q4487j06884j11093J48206k32424
16500H13505M28862l91793J48938L20489j54415j63952k16608n0563l467p3688
16490F57308J02808J59417p6469J42331j45215L06710m18456q5869L22559l40873
16480F24251K9523K0827J128j15643M01739J4326j24027J10719k88977j3205K47631
$$ y = [1848981, 1645132, 1696759, 1402378, 1684461, 1731155, 1329181, 1416756, 1540038, 1568741, 1758554, 1524128, 1464375, 1687172, 1611994, 1543360, 1811194, 1209588, 1389533, 1123242, 1506385, 1194651, 1228741, 1198550, 1593169, 942279, 1392370, 1181580, 881617, 1202760, 1304245, 1202012, 1253832, 1038091, 1231327, 1093274, 1125534, 918811, 1278929, 1218804, 906159, 1154755, 948426, 924244, 1202198, 1031213, 1115700, 1008816, 897723, 1045929, 813505, 1242367, 850574, 999512, 1320001, 1165586, 1001634, 785026, 734463, 730996, 657308, 760116, 919533, 843064, 985395, 840180, 1146890, 728434, 642565, 965124, 624251, 653774, 674601, 675729, 560086, 961825, 976151, 852124, 962843, 673866, 660661, 908292]
16469I08292C89347L31609k11813N55226D08267n0937M48871k01290L15783k25009
16459F95685J03578l35171M18084l30008L40660k46249K7577j29963I4157P96971
16449H91128D45420J22526j06802n213j24155J74173m9424L69403l61539Q7163
16439E51552L62590D03334K9199K8779n5329R2203M372j33045r3229L27383j28462
16428D75205J00217J02075r2419j90721K89021C10164K7176J90959K3261m4787
16418E06773J28897g5754E51561N0108j79998J15164A11608M55080j59655j84963
16408B22070K50749o2207M8830O9994B9357K58132P9443Q3863J5537j91100j37357
16397A37875L96967k11155j36407J41929r5714J48131k0029l6498K20656j95316
$$ y = [908292, 389347, 720956, 509143, 1064369, 408267, 357330, 806201, 604911, 920694, 695685, 799263, 464092, 882176, 552168, 892828, 646579, 674156, 544193, 94157, 891128, 445420, 567946, 461144, 455931, 331776, 505949, 456525, 825928, 464389, 551552, 914142, 403334, 432533, 461312, 405983, 498186, 502558, 369513, 276284, 603667, 475205, 575422, 677497, 585078, 394357, 683378, 310164, 337340, 528299, 551560, 506773, 635670, -75754, 551561, 601669, 421671, 536835, 111608, 566688, 407033, 222070, 472819, 410612, 459442, 529436, 29357, 287489, 366932, 450795, 466332, 275232, 137875, 534842, 323687, 187280, 329209, 233495, 381626, 361597, 325099, 545755, 350439]
16387C50439G6856M22445k04276r6934K68301A84978R7879l670L57205B85781
16376B31895H3116J15150k1982A1758M17208N0726B22622r550K05424I6238L78683
16365D74921j74624n0501o3639q5163K63485j68072P6148J45541J31830j07496
16355D42430j5998A75207l4359K5518k1889L08929D0855O631M89280k51465o5285
16344B20016Q1342Q4535j87569K73295j8216J56917k84202O8475j12273L60989
16334F43309A84342K79K10774A61331n6634D2471J14087J76899j4824j48458J73419
16323C43594c17260e9967o7352A39196d107D09553a78672c4321B8957e3905H1337
16311B94464J69439k29743o7084n6668J08362J03874k027j2830K96329A73635
$$ y = [350439, 76856, 499301, 295025, 198091, 466392, 184978, 282857, 279187, 636392, 285781, 231895, 83116, 198266, 176284, 11758, 428966, 479692, 222622, 213072, 418496, 96238, 474921, 300297, 249796, 186157, 100994, 364479, 196407, 272555, 418096, 549926, 442430, 426432, 175207, 140848, 166366, 144477, 453406, 40855, 47486, 536766, 285301, 220016, 301358, 385893, 198324, 471619, 453403, 610320, 326118, 394593, 282320, 643309, 184342, 184621, 395395, 161331, 104697, 42471, 156558, 333457, 318633, 170175, 343594, -317260, -59967, -127319, 139196, -4107, 409553, -178672, -34321, 28957, -53905, 81337, 294464, 463903, 234160, 167076, 110408, 218770, 322644, 320617, 307787, 604116, 173635]
16300D56495B03018J09665I7098N3961a9797A40629l9999d4592A81565l7058L24501
16289D69008m8144b72421B30430B1104D401p41M4959M06150j38945A06409K02666
16278C09075e0078A24663B1703B616J47292J74237j59880M15026k71671J657B8170
16266a02277A38374a42999I0496Q5499J83059b82661G2124P489g1780L4081l1353
16255f9052A7265J78260c7857j66022b7080A50490j1801K3740F7568L20831H1679
16243A36113b33166B89128a35988G7918K67531j43150G5172J09673p3362b81815
16232E979a43877I7791j8586J14033a904D00053a37273A92973b40059a03891q9742
16221a93633o0701D5605j723K06882b07749A87960J02333c4281H8517O2002Q132
$$ y = [456495, 203018, 312683, 97098, 151059, -19797, 140629, 100630, -44592, 181565, 144507, 469008, 420864, -272421, 230430, 21104, 4401, 3660, 48619, 454769, 315824, 106409, 309075, -50078, 124663, 21703, 2616, 149908, 324145, 164265, 579291, 307620, 309277, 28170, -102277, 138374, -142999, 90496, 175995, 359054, -282661, 72124, 79613, -71780, -37699, -69052, 17265, 195525, -37857, -203879, -27080, 150490, 138689, 162429, 67568, 388399, 81679, 136113, -233166, 289128, -135988, 77918, 345449, 202299, 75172, 184845, 111483, -281815, 5979, -143877, 97791, 79205, 193238, -1904, 400053, -137273, 192973, -240059, -103891, -193633, -254334, 45605, 43882, 250764, -207749, 187960, 290293, -34281, 88517, 150519, 158651]
16210A58651g1817A8690g6308b3524j2175n5409A26857c1013k60787i480k09446
16199b18926F9955c3651A90657a98434C2279a98437j75579h1733E10118j46946
16189C63172j64879P9818j9218a66228A31045c17024h5972A01988o12a17456K3801
16178i3655k9946B54756j06862N1004b86748e1828k2639A49842b36770A42870
16167H6186B2234O3098a59055I0727J76276a55188A38410J80719b39795A68131
16156C01394F517a13046d4928B84290b44445a11752k4530C61690A68467J44620
16146C13087f9554A08659M2535b06461A63378p7539a49775d2722B15863k3270
16136A92593p2326h8579p7277j18127d1127A06404J29802p0869g5570q3377G6870
$$ y = [158651, -71817, 18690, -76308, -23524, -35699, -91108, 126857, -31013, -291800, -9480, -218926, 69955, -33651, 190657, -198434, 32279, -198437, -374016, -81733, 510118, 363172, 198293, 278111, 258893, -166228, 131045, -317024, -85972, 101988, 101376, -117456, -93655, -123601, 254756, 147894, 198898, -286748, -51828, -74467, 149842, -236770, 142870, 86186, 22234, 85332, -159055, 90727, 267003, -155188, 138410, 319129, -239795, 168131, 301394, 6517, -113046, -44928, 284290, -244445, -111752, -136282, 361690, 168467, 313087, -69554, 108659, 151194, -206461, 163378, 85839, -149775, -42722, 215863, 192593, 120267, -88579, -165856, -283983, -41127, 106404, 236206, 165337, -75570, -158947, 76870]
16124I7171l9322F823a19012B00943O7974C4756a7981A03369A9430g9673G2698
16112B66495G2835J59062b66610b3607l5768r7878A42139B1504c49500A09712
16101B5312N49881F2309a80117h1986c5241D38868l3687e498A2909J74184b37226
16089F6500k4235i0785K8874G6428N1777b8677n7662C00294A2320a99833b2189
16077A71803j0092b17550a06216B95265a73663f5015K2486A26817b72250C5937
16066A68786b87253B11966q0055b29113B8185K79753E701A735e392j33266K5851
16055a12807E83844G6567b80384B11556b17645F4124P6101E7446g475l07046A52771
16043f5468a1544D9562L1002J83516a38076j78220B4591M03770a31667G1256J45137
$$ y = [97171, 57849, 6823, -119012, 200943, 268917, 34756, -17981, 103369, 19430, -79673, 72698, 266495, 72835, 231897, -266610, -23607, -59375, -157253, 142139, 21504, -349500, 109712, 25312, 575193, 62309, -180117, -81986, -35241, 438868, 405181, -5498, 12909, 187093, -237226, 66500, 42265, -90785, -61911, 76428, 128205, -28677, -86339, 300294, 12320, -199833, -22189, 171803, 161711, -217550, -106216, 295265, -173663, -65015, -42529, 126817, -272250, 35937, 168786, -287253, 211966, 131911, -229113, 28185, 307938, 5701, 1735, -5392, -138658, -112807, 583844, 76567, -280384, 211556, -217645, 64124, 140225, 57446, -7475, -314521, 152771, -65468, -11544, 49562, 80564, 264080, -138076, -316296, 24591, 428361, -131667, 71256, 216393]
16032B16393c4607Q650j03820A06142a05463H1372R8293M3572J8367F7256c71365
16020A54865a51240P4387l9815A07322a37279j08351a13933b6212A04298J11291
16010B15589I6183a89799j13081J6587a07146j19279R1661M7860D42042a04749
15999A0674J16725K6372i2132L6833C23371b76633P9823H0785K14265a49260F4112
15987a99633C18212j42698j8062J15033a67284B36565M91381l53897A14588b5134
15976I214K46780c11571F4605M4825a00557j56833e4996q8861J9564e2607j60314
15965b12921K7821F5631b07306J9810j11119B7109J53797l3775l3898b4219A16601
15953f3340C5468J09283d990l08644J31386A55326j5894D6438a59710k02665a22776
$$ y = [216393, -34607, -25957, -129777, 106142, -105463, 81372, 179665, 223237, 241604, 67256, -371365, 154865, -151240, -76853, -116668, 107322, -137279, -245630, -113933, -26212, 104298, 215589, 96183, -189799, -302880, -286293, -107146, -226425, -134764, -86904, 442042, -104749, 10674, 127399, 153771, -92132, -55299, 323371, -276633, -196810, 80785, 295050, -149260, 64112, -199633, 318212, 175514, 157452, 272485, -167284, 236565, 727946, 374049, 114588, -25134, 9214, 255994, -311571, 64605, 109430, -100557, -257390, -54996, -143857, -124293, -52607, -212921, -185100, 65631, -207306, -187496, -298615, 27109, 180906, 147131, 113233, -24219, 116601, -63340, 35468, 144751, -4990, -313634, -182248, 155326, 139432, 46438, -159710, -362375, -122776]
15941B3989c34911A02608C8026A2560J67604c06659B73696D3350c52530J1814
15931c40716b4586l6819j57937p0686d5481C0841c23441c3233B32354C7454Q037
15920D5491a95499f6645c2515j39394e8431C8472h0297j11551D6961b1397H7655
15908C0904K43437k1766p9228f2468E9746F136J36916i2644A23955b46979C4878
15896e4046F788J69850P9298e0556m26585a42342j3944M3041M8325j63082N8120
15885a69882B0525J0823b27304A60538o3927C0739P7000a27024A08369J03122
15875B11491c20144B33145c1794l9803k10870f5940j70715P8090m11299b8114
15864c26791a4413B6685a60163M9782k19535d6993k93498A72007E2882a16964
$$ y = [23989, -334911, 102608, 38026, 12560, 180164, -306659, 273696, 43350, -352530, -340716, -24586, -61405, -219342, -290028, -45481, 30841, -323441, -33233, 232354, 37454, 45491, -195499, -66645, -32515, -171909, -58431, 38472, -80297, -191848, 46961, -21397, 87655, 30904, 274341, 252575, 173347, -62468, 59746, 6136, 143052, -92644, 123955, -246979, 34878, -54046, 6788, 176638, 255936, -50556, -477141, -142342, -156286, -113245, -64920, -228002, -169882, 20525, 31348, -227304, 160538, 96611, 30739, 107739, -127024, 108369, 211491, -320144, 233145, -31794, -71597, -282467, -65940, -236655, -158565, -569864, -28114, -326791, -14413, 26685, -160163, -110381, -329916, -46993, -340491, 172007, 52882, -116964]
15853B04762i1301c033A48300A0259a56079A13162a73098N0206j9451a7255G2922
15841a11680E9112b5343k75246c1049C05185A34856a33351C48624n8913a95384
15830A62659h292A07302j4303C9971a36696G6842k3417c5911a1979j83732B00385
15818C9820n440O038a71991A9181b00054B08580G5726g7598k26394a22158a091
15806e9428B11533a91213j68737A10643c1054B44113d01965g0182A34840b06872
15795A93336a18947B2334b23685A52637b08192B9453a83976b4972c368p13q6886
15784i0967j05763d8332D5252c02201f2940H5009N7700a03180j91037a01079j20590
15773b21669C19931b07293A40454J36452a12112d4205o1739K5655c649k03564
$$ y = [204762, -91301, -3033, 148300, 10259, -156079, 113162, -173098, -122892, -142343, -17255, 72922, -111680, 59112, -25343, -300589, -31049, 305185, 134856, -133351, 348624, 289711, -195384, 162659, -8292, 107302, 92999, 39971, -136696, 76842, 53425, -35911, -11979, -195711, 200385, 39820, 34380, 40418, -171991, 19181, -200054, 208580, 75726, -77598, -303992, -122158, -1091, -59428, 211533, -191213, -359950, 110643, -31054, 244113, -401965, -70182, 134840, -206872, 193336, -118947, 22334, -223685, 152637, -208192, 29453, -183976, -24972, -3368, -4081, -90967, -196730, -48332, 45252, -302201, -62940, 85009, 142709, -103180, -294217, -101079, -221669, 319931, -207293, 140454, 276906, -112112, -44205, -105944, -80289, -3649, -207213]
15763b07213A57419J65043A13850a10845n1801j0153f0731D31868c4592C32047
15752a06315C06568b89045e1458C53109D8233a17386K7949B18752d0247B66366
15741A46331a04221l5888B1485d6884k42564e1324A13247C371L15385F2599B8387
15729E44161b46243c7692I7344a00489A13287J31727I5104B6403a06075k96421
15719d02496J61070p2860l3547e9982k02629b7472l35230J25009h2306B90300
15708E3666a62793q3015n8091B58556H0932R5404b45196A00395A8272a92855D76719
15696a5357D3472K14475l9215a28004R337E9526R8915P0376C4199c4183B00514
15684a69114k2842b3515m6946H6157f3330n6634A89626O2923A3175O5048K8560
$$ y = [-207213, 157419, 322462, 113850, -110845, -162646, -172799, -60731, 431868, -34592, 332047, -106315, 306568, -289045, -51458, 353109, 48233, -117386, -89437, 218752, -40247, 266366, 146331, -104221, -140109, 21485, -46884, -289448, -51324, 113247, 3371, 318756, 62599, 28387, 544161, -246243, -37692, 97344, -100489, 113287, 245014, 95104, 26403, -106075, -402496, -241426, -314286, -347833, -59982, -262611, -27472, -362702, -237693, -82306, 290300, 53666, -162793, -245808, -303899, 258556, 80932, 176336, -245196, 100395, 18272, -192855, 476719, -15357, 43472, 257947, 218732, -128004, -118667, 59526, 158441, 228817, 34199, -34183, 200514, -169114, -191956, -23515, -70461, 86157, -63330, -119964, 189626, 252549, 13175, 78223, 106783]
15673A06783J74101b67785b6268n9398C48550j63403i4552G6372i9075a7700j62838
15662a80538a1566k55808J3474J19012A57343H746O2500a65416a554E9702J37324
15651A97026a01441B76968a6177j22853j05721J11391D7441L359c45023J22006
15641b23017n4112A00897a93204A62496A9008K07396a25969N1187A68434h9795
15630c06726C8638b2913l5320A03337M3072K85709A06609M5438a16634A40146
15619c8002H9499c72147a51894N0941F2468B4108b5555I4453C9819a94869l7783
15608b32652A38140A8328J09127K32926A51013N5875c59830B36881j09962a01933
15597b93571B32029b23183j58303a79083J1067r9030C5329J09004i0759A75131
$$ y = [106783, 280884, -267785, -26268, -85666, 348550, 185147, -94552, 76372, -99075, -17700, -180538, -11566, -267374, -253900, -134888, 157343, 8746, 71246, -165416, -1554, 59702, 197026, -101441, 276968, -16177, -139030, -244751, -133360, 47441, 50800, -345023, -223017, -277129, 100897, -193204, 162496, 19008, 226404, -125969, -74782, 168434, -89795, -306726, 38638, -22913, -58233, 103337, 146409, 432118, 106609, 152047, -116634, 140146, -38002, 89499, -372147, -151894, -100953, 62468, 24108, -25555, 94453, 39819, -194869, -232652, 138140, 18328, 127455, 360381, 151013, 206888, -359830, 236881, 126919, -101933, -293571, 232029, -223183, -381486, -179083, -168016, -267046, 35329, 144333, -90759, 175131]
15586E7769J04622a92011L3478K8657B63922b96103C7999b82868B85389c7703
15575a9538p0385I5422p003b28063P6120B5800b6712B8551c1329j08747k54285
15564c94361A71426a40080I8212f4581E6349i641l57785J1351B19360a42166A10090
15552A33100B1679O2170e2664B16186K89148h4740A76130a92959M0878B55609
15541a48686B62799G4965K21162E1111c2715A66022J24978e5333A84517Q2218
15531B66735O5162D2127I577e490j59932B25682q1859k7793B2743b05160l6618
15520b41778A1334b74483a29512A59741a37470e9924d487C8493h4469b7589r6606
15509a24195j20529j24531F6848c56339J13767D6606b6584j41619j59430G8274
$$ y = [57769, 162391, -192011, -158533, -129876, 263922, -296103, 37999, -282868, 285389, -37703, -19538, -89923, 95422, 88419, -228063, -151943, 25800, -26712, 28551, -31329, -140076, -394361, 171426, -140080, 98212, -64581, 56349, -9641, -367426, -356075, 219360, -142166, 110090, 133100, 21679, 83849, -52664, 216186, 505334, -84740, 176130, -192959, -152081, 255609, -148686, 262799, 74965, 296127, 51111, -32715, 166022, 291000, -55333, 184517, 266735, 331897, 42127, 9577, -5490, -165422, 225682, 143823, 116030, 22743, -205160, -241778, 11334, -274483, -129512, 159741, -137470, -59924, -4487, 38493, -84469, -27589, -124195, -244724, -369255, 66848, -356339, -242572, 46606, -26584, -168203, -327633, 78274]
15498a32945q6114I2514d3702C6502g6074K2424l9037p9438E8551I032e7874j66212
15486b24086d9560B29712r9888b73441R1749K6226A88891h122G1966e3885B38780
15474A17254P4448a72639D7217F251a20526n1451J5401d0885a6552E6769h9908
15462b6704j60749E5812d0303k930C32903a46101d1887k43105I2350b81607d1867
15450D00503j06547H332c4990l1039B4429b23531B03269m2371m916k3742d3026
15438A92423J79445p5453G7304M0853c00355J18803N6716l5242I9918F80R8334
15427I9014N169G345M50662E4185i7917p3833H6934l6490M74667j87409a02800
15415g6277k99598C01512a12212d1380j66605j20036A85232h8997k33027D2637
$$ y = [-132945, -219059, 92514, -43702, 36502, -76074, -53650, -92687, -172125, 58551, 9032, -57874, -224086, -49560, 229712, 129824, -273441, -181692, -155466, 188891, -8122, 71966, -53885, 238780, 117254, 191702, -172639, 47217, 6251, -120526, -171977, -156576, -40885, -16552, 56769, -89908, -26704, -187453, 55812, -40303, -43233, 332903, -146101, -41887, -284992, 92350, -281607, -41867, 400503, 293956, 8332, -34990, -66029, 24429, -223531, 203269, 160898, 155982, 132240, -43026, 192423, 371868, 296415, 77304, 118157, -300355, -181552, -124836, -160078, 99918, 680, 99014, 104183, 7345, 458007, 54185, -97917, -171750, 86934, 50444, 525111, 337702, -102800, -76277, -375875, 301512, -112212, -41380, -207985, -328021, 185232, -88997, -322024, 42637]
15404e0462C2495a57441F0230J79361B7167J07188a38072D656J00771c47949E56385
15392b9201E1796h456E0445i1214b8709H4557a97702I5215a88640B0816a75799
15380h4706A51537b14099A31188K36476b13742D5964b33384A5278K6198J22011
15370A63487n6224d1448e843A37798b37391J16932j38032J12000M2043k8967M3671
15359h9744A32589c7944D2261c5590j33141D68392b49739f2889A15982a70405
15348A35469B391F9J53307D1072d99171B69417m9267C6091a3456j1057B9213A0619
15335h7729J561J6130C2772i6831k20730A42707j355a41195e029n9711G6052K12689
15323B88741A1121J33210A8897M4779J80278I0261j3639c65029F0497B2271g7042
$$ y = [-50462, 32495, -157441, 60230, 239591, 27167, 134355, -138072, 4656, 105427, -347949, 556385, -29201, 51796, -8456, 50445, -91214, -28709, 84557, -197702, 95215, -188640, 20816, -175799, -84706, 151537, -214099, 131188, 367664, -213742, 45964, -233384, 15278, 41476, 163487, 107263, -41448, -5843, 137798, -237391, -120459, -258491, -146491, -104448, -133415, -89744, 132589, -37944, 42261, -35590, -168731, 468392, -249739, -62889, 115982, -170405, 135469, 2391, 69, 153376, 41072, -499171, 269417, 220150, 36091, -13456, -24513, 29213, 10619, -87729, -86168, -70038, 32772, -96831, -317561, 142707, 141352, -141195, -5029, -64740, 76052, 288741, 11121, 144331, 18897, 63676, 243954, 90261, 76622, -365029, 60497, 22271, -77042]
15311A01309d4365A01763J88421C8578j9273K1355a00639C26539b86739H7951
15300G0497J00337B6263K23370d4841b0939j7685j24121C47942b85793J35815
15290a49978B09695i472H4242J57693G7224i8400B08647F8870J75311A03804a08910
15278B33577J4167b7594j73100f1547n581A84036b07824A02760K4677k10l4998
15267I2229k9108A1603J29379J00346a41924C53596D3410J20920m8222e3299D00676
15255B33731A13759J60481A24161L34648A16187n7379M39722k38411J301881l4457
15245A527543j78965L63568n49880n39997k68584I5328g5171D4552L39688h3780
15234c2619H6910a79123d249l44659a25532j17815c6575B4241J7058K96636a20519
$$ y = [101309, -44365, 101763, 290184, 38578, 19305, 40660, -100639, 326539, -286739, 87951, 70497, 170834, 26263, 249633, -44841, -20939, -38624, -162745, 347942, -285793, -149978, 209695, -9472, 84242, 241935, 77224, -98400, 208647, 68870, 244181, 103804, -108910, 233577, 247744, -27594, -200694, -61547, -67128, 184036, -207824, 102760, 127437, 127227, 92229, 63121, 11603, 140982, 241328, -141924, 353596, 43410, 164330, 116108, -53299, 400676, 233731, 113759, 274240, 124161, 458809, 116187, 58808, 498530, 260119, 1562000, 1527543, 1348578, 1712146, 1162266, 622269, 353685, 95328, -75171, 44552, 384240, -83780, -32619, 86910, -179123, -4249, -348908, -125532, -243347, -36575, 24241, 41299, 337935, -120519]
15222i7221A07121c4748o1752j13555F9376O7703R102a31062C79563n1048k3330
15211C05185b00989B26350i2989J0172B0675a56510P1212C39829A18691c0202
15200A80979A6659L6038b96434B04379m5250L485Q6838C1818L23372A51444a70776
15188A88773H6179i585A67950o8748b74531N4781k6503B96278j03098m317h1587
15176d4831E1185b66008A36103K40472b4712l97022F5507a27025a5955k1699C32538
15164A11076J92039o8265l8547J80815G3393J55843O7827D8153K6982b31223a04455
15152c41568f9503A57035m7164A5370O6885Q4677a13996C5839Q0801d9003F1809
15140a13914m3453C9287j2518J58297N5106j14062J37044j5973n9114g8266L6380
$$ y = [-97221, 107121, -34748, -96500, -210055, 69376, 137079, 146181, -131062, 379563, 328515, 305185, -200989, 226350, -92989, -82817, 20675, -156510, -85298, 339829, 118691, -30202, 180979, 16659, 52697, -296434, 204379, 159129, 162614, 249452, 31818, 355190, 151444, -170776, 188773, 86179, -9585, 167950, 99202, -274531, -219750, -246253, 296278, 193180, 188863, -81587, -44831, 51185, -266008, 136103, 376575, -24712, -421734, 65507, -127025, -15955, -37654, 332538, 111076, 303115, 234850, 196303, 377118, 73393, 229236, 297063, 48153, 75135, -231223, -104455, -341568, -69503, 157035, 109871, 15370, 82255, 166932, -113996, 35839, 116640, -49003, 61809, -113914, -157367, 39287, 26769, 185066, 240172, 126110, 263154, 247181, 188067, -78266, -41886]
15129d1886A85658L0896c119A38600O9534N9867e6435B96093j44563J49265A44210
15117A9558a04721j69001A24296a0628B3767Q9016Q7280c26418B2751K34556A07318
15105A88316N0416J6677I1703j3327O0133D9373K11221k7402J47133j88608p1331
15094A20386h7414B19016A4015J72736q2309J87194E2012d6614B6318e1452A97964
15082G0926b31993A38480b37052A12153N2899M7961J62181a33937C55760I2179
15071A68078h462C43630a71148F9748K30580d2544B11299E0357f2184B90840E5942
15059I3230I128R4265R9375A4702K29497A5535J43111i7080C48517A30085L21128
15048D51213F4303P1875m6748Q7242p935M34b0824B9300J87792M6034j7783A19896
$$ y = [-41886, 185658, 216554, -3119, 138600, 208134, 268001, -56435, 296093, 151530, 300795, 144210, 19558, -104721, -273722, 124296, -10628, 23767, 112783, 200063, -326418, 22751, 257307, 107318, 188316, 238732, 255409, 91703, 78376, 138509, 49373, 260594, 233192, 380325, 191717, 120386, -87414, 219016, 14015, 186751, 104442, 291636, 52012, -46614, 26318, -51452, 197964, 70926, -231993, 138480, -237052, 112153, 165052, 213013, 375194, -133937, 355760, 92179, 168078, -8462, 343630, -171148, 69748, 300328, -42544, 211299, 50357, -62184, 290840, 55942, 93230, 9128, 103393, 202768, 14702, 244199, 15535, 158646, -97080, 348517, 130085, 451213, 64303, 136178, 89430, 176672, 168737, 169171, -20824, 29300, 217092, 263126, 245343, 119896]
15035I2843d85A9121N4059J91577h879A61847J82207p0333B43K77025q8474p3157
15023A15637M5565k9126K91906o4051c761B22868b5360D40774A11148B0811E263
15011c693n0927B91205a65812B23321M4891A17230E7617J79631A08345J28844
15001B37189m3739h3722n7487B3248L97725m347B8134Q8985J83911r6975j6815
14990A87240Q1604j02960a30172D75785I3777K5170N4789J11265M9246I2238J11552
14979B03790J79321A63707J524K42853a59689B59958h2531F28668A97997J65404
14969C63401A16050Q2036a9537B62232c8667A94873P3210r9866j1145N6245J87007
14958D00324n4558A17453L41228A03471J57387A21009J18414G9871j0860J81907
$$ y = [92843, -485, 19121, 73180, 264757, -8879, 161847, 344054, 273721, 243, 277268, 188794, 115637, 161202, 132076, 423982, 359931, -3761, 222868, -25360, 440774, 111148, 20811, 5263, -3693, -54620, 291205, -165812, 223321, 268212, 117230, 57617, 237248, 108345, 237189, 193450, -83722, -141209, 23248, 420973, 416626, 28134, 117119, 301030, 204055, 187240, 268844, 165884, -130172, 475785, 93777, 118947, 173736, 285001, 334247, 92238, 203790, 383111, 163707, 165231, 408084, -159689, 259958, -82531, 628668, 197997, 363401, 116050, 198086, -19537, 262232, -38667, 194873, 268083, 168217, 157072, 213317, 400324, 345766, 117453, 458681, 103471, 260858, 121009, 239423, 79871, 69011, 250918]
14948B50918A802M73616k02292A19700a55736A00923M47109A55333K18517L8904
14938D12754q4643n5147J06436j75621q3985P6472L20932j56760O9458A28133
14927C69911c273D16376j40482A06368J32703J18704m6574R1476A52678J5546
14917A68224L25869r0625E8271b583D95342A43518J15707J79422P245j39065K3053
14906C29880J22230K6222J40745j19479k3040n167j08080n651R9603j84434J27852
14895D00681l744M9606A15066J07085K1753N5508o391P1553A4515J47358O9173
14884B31046J40278J25436p5818m5693F4859R3270K3537j8889K18458A33181J354
14873A34535K97214L0006Q3991A39324K16972H8485L30371j54686K30004j5388
$$ y = [250918, 1802, 475418, 273126, 119700, -155736, 100923, 548032, 155333, 373850, 412754, 328111, 272964, 379400, 203779, 119794, 196266, 517198, 360438, 429896, 128133, 369911, -3273, 416376, 275894, 106368, 239071, 357775, 311201, 402677, 152678, 168224, 494093, 403468, 58271, -2583, 495342, 143518, 259225, 438647, 445892, 306827, 329880, 452110, 478332, 619077, 499598, 476558, 471391, 363311, 357660, 457263, 272829, 400681, 396937, 446543, 115066, 222151, 243904, 299412, 293021, 364574, 14515, 161873, 231046, 371324, 496760, 420942, 375249, 64859, 158129, 181666, 162777, 381235, 133181, 134535, 431749, 461755, 545746, 139324, 356296, 88485, 418856, 264170, 494174, 478786]
14863D78786k33389L6075J4562j10038K11340k5586n3364D2409L30453m4617K68378
14852E96623B85123K6811L1733o6528m6262J43473m5064J18625R1810P4036O1201
14841F74958C30569B3675L32548r6148j19857L85452d378F38056B50251M26890
14831F77141C31632J1139J16412l3156N2445j21289j67651L79148J1846j83323
14821C97203Q5225r8081J10762A50832J96706J34449J88462B52139L21688Q2562
14811F56389k04845j90374L58137k89648Q8335R3434J89862k98897H6820O41190
14801G28010B28029J61996J2960A74460K33583o7504K54508j91764j2237N8020
14791D49066J91961j26999k07508K41511J10937B41472M27431B78789K10481P2240
$$ y = [478786, 245397, 281472, 296034, 185996, 397336, 371750, 318386, 42409, 372862, 328245, 596623, 285123, 311934, 343667, 277139, 230877, 374350, 329286, 447911, 539721, 613757, 674958, 330569, 23675, 356223, 260075, 140218, 525670, -4378, 638056, 250251, 677141, 331632, 342771, 459183, 426027, 478472, 357183, 189532, 568680, 580526, 397203, 482428, 384347, 495109, 150832, 347538, 481987, 670449, 252139, 573827, 656389, 451544, 261170, 619307, 329659, 417994, 511428, 701290, 402393, 86820, 728010, 228029, 390025, 402985, 174460, 408043, 340539, 595047, 403283, 391046, 449066, 641027, 514028, 306520, 548031, 658968, 241472, 668903, 278789, 489270, 561510]
14781E61510k11687J27480p6241J22748J81532A57483O08038B90565P6066M95041
14771H61672K11651m68383j81891A99778N60443r5767J71769n8320C71828K41068
14761F12896k83549K82287m2424q8420l9098R8448J65051J31284l20822Q7885
14751F03538O4452R3004l52564K18189P9792l28295O02413k01015O5590l76597
14741D68507J27573K73543o8933k95670O02946k7534m93845L17756k44928M3727
14731G03142B59072O87702D12902M20846R7058M888k88308l01662M43458B91223
14720D89257P8137K86990l46526J5815N08214j31957j69127K0406p0993J78529
14710H58745l31506L43369l26400K8463j05770L08989k10172O27364m25808K06430
$$ y = [561510, 349823, 477303, 401062, 523810, 705342, 157483, 765521, 290565, 366631, 861672, 1073323, 604940, 423049, 199778, 760221, 664454, 836223, 777903, 371828, 612896, 329347, 611634, 569210, 480790, 441692, 540140, 705191, 836475, 515653, 603538, 667990, 760994, 408430, 626619, 706411, 378116, 980529, 779514, 845104, 468507, 596080, 869623, 800690, 505020, 1107966, 1080432, 586587, 904343, 659415, 703142, 259072, 946774, 412902, 833748, 930806, 935694, 647386, 345724, 789182, 291223, 489257, 567394, 854384, 507858, 523673, 1031887, 899930, 730803, 751209, 680216, 858745, 527239, 870608, 544208, 572671, 466901, 775890, 565718, 1193082, 767274, 973704]
14700I73704j25734n0155J58634J15009r2322q5507n9675L53273n04390J85763
14690H68600L69644F16238J48743O1004l0143J34588k67348L91043j02829O310
14680I57606L2592l58013M00034m95937M42971L06664n43193M37580k55638o0006
14670H64660k09085M99888M2068K4630l34479r7827J35580J67153j58270j95708
14660G38610N6167J48158R3771L3605n1819K92304j14058M7539J8538k47999J85058
14649A199874o5003l23605M13327J35726k87296K2931k8955o591j50473r7950
14639H11985N20588j44274J6129J10546q9556k02296N25739j98057K3407l29071
14629A045140N2054M25550l93256q1620K74636J23186k55250o4870N14265k35739
$$ y = [973704, 847970, 797815, 956449, 1071458, 979136, 893629, 833954, 1187227, 682837, 868600, 1238244, 616238, 764981, 825985, 795842, 930430, 663082, 1054125, 951296, 957606, 990198, 632185, 1032219, 536282, 979253, 1285917, 742724, 1180304, 924666, 864660, 655575, 1155463, 1197531, 1222161, 887682, 789855, 925435, 1092588, 934318, 738610, 794777, 942935, 1036706, 1070311, 1018492, 1310796, 1196738, 1244277, 1262815, 1014816, 1199874, 1134871, 811266, 1224593, 1360319, 1073023, 1095954, 1066999, 1060408, 909935, 811985, 1332573, 1188299, 1204428, 1314974, 1225418, 1023122, 1548861, 1350804, 1374211, 1045140, 1097194, 1522744, 1129488, 1047868, 1322504, 1445690, 1190440, 1125570, 1639835, 1404096]
14619A404096j40937J60962l70933K43193R0294j58041J29618J74536l15276J40706
14609A358218J6941R5200l29380L35585J35781j64571j0564L52224j2634l07246
14599A469554L21438n26537M48384k5442l7202j19714J56923j93402J59392J81572
14589A834966j9067N9263r6391k77938K39101n1582j11451R9396J76700M9733
14579A902730m9681j6375M1652K57253o7011K5703k30239M39851l06467N5667
14569B053083K08069l2713O9186K14932k26450p5033Q4886m4091L95713o5601
14559B581981J92340O5387P1311l14117M33325Q2722O93420N0515N97709Q63022
14549E317615K002770L407433P589173K0895637l602729j1674280j0195806n833809
$$ y = [1404096, 1263159, 1424121, 1053188, 1296381, 1386675, 1228634, 1358252, 1532788, 1217512, 1358218, 1375159, 1470359, 1140979, 1476564, 1612345, 1447774, 1437210, 1789434, 1776800, 1469554, 1790992, 1264455, 1712839, 1687397, 1650195, 1530481, 1687404, 1494002, 1653394, 1834966, 1815899, 1875162, 1778771, 1500833, 1739934, 1688352, 1576901, 1676297, 1852997, 1902730, 1853049, 1836674, 1878326, 2135579, 2068568, 2094271, 1864032, 2303883, 1997416, 2053083, 2261152, 2228439, 2297625, 2512557, 2286107, 2211074, 2295960, 2251869, 2647582, 2581981, 2774321, 2839708, 2911019, 2596902, 3030227, 3112949, 3806369, 3856884, 4454593, 5317615, 7320385, 10727818, 18316991, 39212628, 35609899, 23935619, 13739813, 7906004]
14541G906004l668095j468687q21213k67748O1684J63811L2458l42663L68935
14532A964486n1321J43166k0869k25878K18199J61416R8662l6294k40773p6185
14522A934609J86836J75735j88925M87739j93995r3818J00382L42715l61614K22731
14512B612395k78561M21352j41580q2835o0925N36658m73561L81812j1910l12676
14502B590169M24270l02230L15285N9950o902K88370k85974K24184l0396K5733
14492C302459j04931L10812m05930J89242o8435L09096J28360l43179L93005l15909
14482C394590M21552m79006M72875j15093l2080k6810m6690P2457J55742J29772
14472C947309J2126J67828K55725l79848L39144P0760j05685k39019K59855k27048
$$ y = [7906004, 4237909, 2769222, 1948009, 1680261, 1741945, 1905756, 1938214, 1595551, 1964486, 1913165, 2056331, 2035462, 1809584, 2027783, 2189199, 2287861, 2251567, 2010794, 1934609, 2121445, 2297180, 2108255, 2595994, 2401999, 2308181, 2408563, 2751278, 2389664, 2612395, 2333834, 2755186, 2613606, 2530771, 2469846, 3006504, 2532943, 2914755, 2902845, 2590169, 3014439, 2712209, 3027494, 3087444, 3080542, 3368912, 3082938, 3307122, 3276726, 3302459, 3197528, 3508340, 3102410, 3291652, 3223217, 3532313, 3660673, 3317494, 3710499, 3394590, 3816142, 3337136, 3810011, 3694918, 3662838, 3636028, 3589338, 3661795, 3817537, 3947309, 3959435, 4127263, 4382988, 4003140, 4342284, 4413044, 4307359, 4068340, 4328195, 4101147]
14462D101147M92565K97491l83415o5528k1854M08948n8964r692r29L85357j25048
14451E020078M54785p06722P56683m80146K26235K4625J94699k52286K78024j01959
14441E414016J84656K62434J25642j68726R2703J46339J73601N7268q3565M40964
14431F645332l74525K29151m5854R0024L70724k53507L9214J30304K45074K49658
14421G325595j52638L78745n4749K80562M847J32805J71658j03189M37130r9220
14411H321546p0564M79179J88023J75976j30776M99566J67024Q6103m65604L12773
14401I563246L55048J42382J17722K61388J37342J75066j98301P22304l62728
14392A0913469P44685K41410o0279M72686j5294K18869n9107O60296J03736L67453
$$ y = [4101147, 4593712, 4891203, 4507788, 4442260, 4420406, 4829354, 4770390, 4760698, 4759769, 5145126, 5020078, 5474863, 4768141, 5524824, 5044678, 5270913, 5295538, 5490237, 5237951, 5515975, 5414016, 5598672, 5861106, 5986748, 5818022, 5910725, 6057064, 6230665, 6287933, 6204368, 6645332, 6270807, 6499958, 6454104, 6544128, 6914852, 6661345, 6700559, 6830863, 7075937, 7325595, 7172957, 7551702, 7496953, 7777515, 7782362, 7915167, 8086825, 7983636, 8420766, 8321546, 8250982, 8730161, 8918184, 9094160, 8963384, 9462950, 9629974, 9716077, 9250473, 9563246, 9918294, 10060676, 10178398, 10439786, 10577128, 10752194, 10553893, 11276197, 10913469, 11658154, 11899564, 11839285, 12311971, 12296677, 12515546, 12456439, 13116735, 13220471, 13587924]
14382A3587924k54416O82811J87313L71646J72025J23356L01694N45666K85425
14373A6003444J42871L91023M63818P9563L83650L31288M34756L80942L56114
14364A8967469K64761L01902O66694O94560K74560j0246O90647M49352P32370
14355B3032069N47626O06924P77283K71257Q63532M75501M83356R36037O23142
14346B8616727Q70761O83998R48315N42512R11341Q19039P63194R94757J118056
14337C6268700J008253Q69567J089806J465795J012689J652782J117744J154493
14329D5639829J198510J513048J843669J774198J547053J857545J760530K053384
14321E9187766K046759K448460J908882K417582K588436K268154K994809K891498
$$ y = [13587924, 13333508, 14016319, 14203632, 14575278, 14747303, 14870659, 15172353, 15718019, 16003444, 16146315, 16537338, 17001156, 17080719, 17464369, 17795657, 18230413, 18611355, 18967469, 19232230, 19534132, 20200826, 20895386, 21169946, 21159700, 21850347, 22299699, 23032069, 23579695, 24186619, 24963902, 25235159, 26098691, 26574192, 27057548, 27993585, 28616727, 29487488, 30171486, 31119801, 31662313, 32573654, 33392693, 34155887, 35150644, 36268700, 37276953, 38146520, 39236326, 40702121, 41714810, 43367592, 44485336, 45639829, 46838339, 48351387, 50195056, 51969254, 53516307, 55373852, 57134382, 59187766, 61234525, 63682985, 65591867, 68009449, 70597885, 72866039, 75860848, 78752346]
14313G8752346L163187L267350L472912L439902M028677L727743M240039M661331
14305A08753487M981276M706495N465931N996801N776121O801976O339722P445563
14297A56267372P406577Q136890Q394634R226255R527145J0085184J0440533J1572165
14289B31056755J1398143J2221465J2928316J3083550J3500630J4159188J4743976
14282C23092023J4622332J5408929J4900369J4902063J4674299J3861168J2872637
14275D24333820J1900758R073509L683100K620643J794256j214152p979845J943157
14267D46155246l226378l189857m795503r855556j3229906j4600335j5518073
14260C81739638j6035572j5980351j6166102j6167885j5807409j4754865j4784025
$$ y = [78752346, 81915533, 85182883, 88655795, 92095697, 96124374, 99852117, 104092156, 108753487, 113734763, 118441258, 123907189, 129903990, 135680111, 142482087, 148821809, 156267372, 163673949, 171810839, 180205473, 189431728, 198958873, 209044057, 219484590, 231056755, 242454898, 254676363, 267604679, 280688229, 294188859, 308348047, 323092023, 337714355, 353123284, 368023653, 382925716, 397600015, 411461183, 424333820, 436234578, 445308087, 448991187, 451611830, 453406086, 452191934, 444212089, 446155246, 442928868, 439739011, 434943508, 425087952, 411858046, 397257711, 381739638, 365704066, 349723715, 333557613, 317389728, 301582319, 286827454, 272043429]
14253B72043429j3113000j2545948j2809436j2048010j1339151j1042487r988121
14246A89157276r344583r021954q014959p825069p245019p108537o809931o120116
14238A27667108n238362n482236n330814m861773m646298m220003l966047l362655
14230I0558920l828047l315245l388489k972259l072018k461048k871396k603792
14222F6046626k306672k274081k061430k074370j623257k261925j460207j852154
14214E0132530j465390j180684j620692j444006j530197j244068p65264q51561
14206D0030668p71866j562516q51076j688465q88291m14509q89289q73517j319951
14197C0771188m42323p97688n41260p82816j019165j38029j104971n25897p44086
$$ y = [272043429, 258930429, 246384481, 233575045, 221527035, 210187884, 199145397, 189157276, 179812693, 170790739, 162775780, 154950711, 147705692, 140597155, 133787224, 127667108, 122428746, 116946510, 111615696, 106753923, 102107625, 97887622, 93921575, 90558920, 86730873, 83415628, 80027139, 77054880, 73982862, 71521814, 68650418, 66046626, 63739954, 61465873, 59404443, 57330073, 55706816, 53444891, 51984684, 50132530, 48667140, 47486456, 45865764, 44421758, 42891561, 41647493, 40882229, 40030668, 39258802, 37696286, 36845210, 35156745, 34268454, 33853945, 32964656, 32091139, 30771188, 30328865, 29531177, 28989917, 28207101, 27187936, 27049907, 25944936, 25419039, 24674953]
14188B4674953p06249k65037o94740l98828p73587l17804o00161j74925m54886
14179B0288736m24466n58344o0443l56166n65516n29140n05972q2903j83993p54876
14169A6266917K26964l10889m14215m51164j93222o5167m69654l65649j13331
14160A4110590j84915m40008k63097K97284p15503l58623N3314n91571O7970j58150
14150A1817291k1962m80603j36515j40529K41133m67975j97830j33340k17475
14141A0262195k19576j24941O3768k97429l57865J74984k88929m65323N0934J46746
14131H944564j34398j17616k57433j07705j78235j14854j24270K64085n55894
14122G618244J82576k32981j38805p4996n0683n2967J18909l88684q9304O7972
$$ y = [24674953, 23968704, 23703667, 23008927, 22610099, 21836512, 21518708, 20918547, 20743622, 20288736, 19864270, 19305926, 19245483, 18889317, 18323801, 17794661, 17288689, 17205786, 17021793, 16266917, 16493881, 16182992, 15768777, 15317613, 15124391, 15059224, 14589570, 14223921, 14110590, 13925675, 13485667, 13222570, 13519854, 12804351, 12445728, 12499042, 11907471, 11975441, 11817291, 11795329, 11314726, 11178211, 11037682, 11278815, 10810840, 10613010, 10479670, 10262195, 10042619, 9917678, 9981446, 9684017, 9326152, 9501136, 9212207, 8746884, 8797818, 8944564, 8810166, 8692550, 8435117, 8327412, 8149177, 8034323, 7910053, 8174138, 7618244, 7800820, 7567839, 7429034, 7354038, 7303355, 7250388, 7369297, 6980613, 6891309, 6959281]
14112F959281l15623L8193O6679P040j84781o4778n40822K57156l11339J77675
14102F088681L00887p42579Q0445m4279m8825K7365k78299J91551k95857K51679
14092E530769L1900n1994p1410k83945p7576L32884l11751K53582j57338m18629
14082D776492K18342j530k98871o0131p8256R349N2851R5727k37053J54093j40454
14071D490559J37993l99628L02588l93117L71234k65042q6399L031l31206k82120
14061C547893K96724K37627k11109k08094O09005r83044M45009J53477k19668
14052C667820k09718O5082k1081L33348m09827R9266j56345M9823M879j88689
14042C234558K16430m59327J26036J13145l34413K56069n327j22457P2675l15785
$$ y = [6959281, 6643658, 6681851, 6748530, 6755570, 6570789, 6506011, 5965189, 6222345, 5911006, 6088681, 6389568, 5646989, 5727434, 5683155, 5634330, 5661695, 5383396, 5574947, 5279090, 5530769, 5562669, 5510675, 5439265, 5155320, 5077744, 5410628, 5098877, 5352459, 5195121, 4776492, 4994834, 4993304, 4694433, 4634302, 4556046, 4565395, 4618246, 4713973, 4476920, 4631013, 4490559, 4628552, 4228924, 4531512, 4138395, 4509629, 4244587, 4158188, 4161219, 3830013, 3547893, 3844617, 4082244, 3871135, 3663041, 4272046, 3289002, 3734011, 3887488, 3667820, 3458102, 3523184, 3502103, 3835451, 3425624, 3524890, 3368545, 3418368, 3423247, 3234558, 3450988, 2991661, 3117697, 3230842, 2896429, 3152498, 3147171, 3024714, 3097389, 2781604]
14032B781604J66456j7279j15801M05582L073o24906J88274J96684j61482R0132
14022B912337k14747N094m9102J09455j6344k61742j70301R9574J97304j34987
14012B476541j39369j7671K12382L419j08245O9195l84007J69589j60886j46643
14002A974305L75079M8548j68513j21332m0035j16205j43844M69922k49534L08859
13992B337250j76662O710L26307J131478K494751N570588K0057691N520951r226840
13983B8042224j1710357o537354l821071j192127j175484P9894n12618j19793
13975C053314l77036K15671n80704N1299j86698K01390J48549k46319n0911k11315
13965B017240j59787N67849l03211M576K03960k87653Q3597Q4589l46381J25336
$$ y = [2781604, 2948060, 2930781, 2814980, 3220562, 3223635, 2598729, 2787003, 2983687, 2822205, 2912337, 2697590, 2702684, 2653582, 2763037, 2746693, 2484951, 2314650, 2414224, 2611528, 2476541, 2337172, 2319501, 2531883, 2535302, 2427057, 2496252, 2112245, 2281834, 2120948, 1974305, 2349384, 2397932, 2229419, 2108087, 2068052, 1951847, 1808003, 2277925, 2028391, 2337250, 2160588, 2167298, 2493605, 3625083, 6119834, 11690422, 31748113, 37269064, 28042224, 16331867, 9794513, 5973442, 4781315, 3605831, 3685725, 3173107, 3053314, 2676278, 2891949, 2311245, 2362544, 2175846, 2377236, 2525785, 2279466, 2228555, 2017240, 1857453, 2425302, 2122091, 2126667, 2330627, 2042974, 2126571, 2211160, 1864779, 1990115]
13955A990115J19214p8997M9358k53460l2342j55511J50476m8749j95946L39904
13945A884062j34482m8736K05251K82520p60467K08913j80375K12542J13080k63082
13935A519226l3102j46631J42392J34104o3474r7156J43848Q113r2190J18188
13925A633318J24171l30159K5556R2826Q6752k88770K3150R362O7141k63772K79275
13914A458850M09803m19901j65352l000K1596J39071j12941k25578L34543J53974
13904A591065k02623O6380k18240J91932k7161j29696o4314K5950l17619M60578
13894A376252K86821m42536J59089j07862Q7931k84032J12733M7702l45247J46047
13884A036898J02511L20355j87011R8610j54199J45992j92830j60467n3570M70556
$$ y = [1990115, 2109329, 2030332, 2079690, 1826230, 1793888, 1638377, 1788853, 1740104, 1544158, 1884062, 1749580, 1700844, 1906095, 2188615, 1428148, 1637061, 1456686, 1669228, 1782308, 1519226, 1486124, 1339493, 1481885, 1615989, 1552515, 1455359, 1599207, 1607320, 1515130, 1633318, 1757489, 1427330, 1452886, 1545712, 1632464, 1343694, 1366844, 1376206, 1443347, 1179575, 1458850, 1868653, 1448752, 1283400, 1280400, 1301996, 1441067, 1328126, 1102548, 1437091, 1591065, 1388442, 1454822, 1236582, 1428514, 1401353, 1271657, 1207343, 1233293, 915674, 1376252, 1663073, 1220537, 1379626, 1271764, 1359695, 1075663, 1188396, 1236098, 890851, 1036898, 1139409, 1459764, 1272753, 1371363, 1217164, 1363156, 1170326, 1009859, 956289, 1426845]
13874A426845k18969j02723J38805q5033n0159j45074J79289o3291p0303J49573
13864A158960k76069J17991K79822k60433j04067P2870n549L18547k39590L0394
13854A092876l961L37605l99447j52449K40966l33445j9901M81923k78355L82201
13844A348013k67429j6779j0127q421q0880R8809J80904j08334j04467J77035
13834A208324E51270M00935r7237O1753k52014K59086J4216j14357J67613k41293
13824G49972O7439j6912M0645k05635k937J02455J03549j75362P5176J81530k62206
13813F57714J6877M28402m57551K12519j13056P8293j00821K38995J30673o6488
13803A025557j13389k12080n4458J87555J79657l29505J86639K04079m12770M7473
$$ y = [1426845, 1207876, 1105153, 1243958, 1158925, 1108766, 963692, 1142981, 1079690, 1009387, 1158960, 882891, 1000882, 1280704, 1020271, 916204, 989074, 983525, 1302072, 1062482, 1092876, 1088915, 1426520, 1027073, 874624, 1115590, 782145, 762244, 1244167, 965812, 1348013, 1080584, 1063805, 1053678, 1045257, 964377, 1063186, 1244090, 1135756, 1031289, 1208324, 551270, 952205, 854968, 916721, 664707, 923793, 938009, 823652, 991265, 749972, 817411, 800499, 841144, 635509, 632572, 735027, 838576, 663214, 738390, 919920, 657714, 674591, 1102993, 645442, 857961, 744905, 823198, 722377, 961372, 1092045, 1025557, 912168, 700088, 645630, 833185, 1012842, 683337, 869976, 1074055, 661285, 708758]
13793G08758k99786K75557J81688l27734n3265J56511R131J56601K22288n04643
13783E25106K38556C55456M86156j10805k29686Q1858J83596l9295m0953N5207
13773G41534K77207k54054j29286K94282l17116Q8313r243J44556k03884m3427
13763E88882N8833l5386J11790J42237l69953L18925C47105K97346J5880j65325
13753D95006J90913j8861k06117J84783M6525k11970J52755j72056J40397K97696
13743H99071j40819j04856J19190p8779k61959K19532k33142N4694J84572j86898
13733D70606N4783O2728K62431j46966J22572r7951Q4134k97082k74M21196k46658
13722F89519r6717J61346A74591N03754o8288k72606K62323j4850q1916M8850
$$ y = [708758, 408972, 684529, 866217, 538483, 485218, 641729, 650860, 807461, 1029749, 525106, 763662, 355456, 841612, 730807, 501121, 582979, 766575, 727280, 686327, 741534, 1018741, 764687, 635401, 929683, 612567, 700880, 691637, 836193, 632309, 588882, 647715, 612329, 724119, 866356, 496403, 815328, 347105, 644451, 660331, 495006, 685919, 667058, 460941, 645724, 692249, 480279, 633034, 460978, 601375, 899071, 758252, 653396, 772586, 693807, 431848, 651380, 418238, 472932, 657504, 470606, 525389, 588117, 850548, 703582, 826154, 728203, 812337, 515255, 514981, 936177, 689519, 592802, 754148, 174591, 678345, 610057, 337451, 599774, 584924, 503008, 551858]
13712E51858k18397J13364j58639L34964R7337C28169J90904l2276j15820j55823
13702B15154M62861C4849O55694j45767j86858K61975j25235K62473C66079K49870
13692F15949B72875K41550n7229J58151k14309j96199N01218j33024j66218K61279
13682F68094l12145J55971p5424K29515B44936k7324Q9499J35750q3516K79546
13672F38891M7680B40470L19604J16102Q2959k03237l4940A82216M97703f3524
13661G60612B10180M51057J12308C76272Q3261j07099L5329J54764J26837B47636
13650E79789B51893L36603m5542P4384k63877n4726m3499J87134k16686L04890
13640E30574j08186A65378L74050B51240J03721J58362k00633j21149O9527J52876
$$ y = [551858, 333461, 446825, 288186, 623150, 720487, 328169, 519073, 486797, 370977, 215154, 678015, 34849, 690543, 544776, 357918, 619893, 494658, 757131, 366079, 615949, 272875, 514425, 457196, 615347, 401038, 204839, 706057, 573033, 406815, 668094, 355949, 511920, 436496, 666011, 244936, 217612, 307111, 442861, 359345, 638891, 686571, 240470, 560074, 676176, 759135, 555898, 520958, 182216, 679919, -63524, 760612, 210180, 661237, 773545, 376272, 459533, 352434, 387763, 542527, 669364, 247636, 579789, 251893, 588496, 542954, 617338, 353461, 298735, 255236, 442370, 225684, 530574, 422388, 165378, 539428, 251240, 354961, 513323, 312690, 191541, 261068, 413944]
13630D13944q9660q8254J87726H4400N46049B62159J36271J71742G8819J99033
13620B77852J86045A97969J96985J46188K1525R0763K21728C79408j71005K38743
13610D47146P0158k55650r5286K81903A43527J48786J20519L52631l25265K2810
13600D63008p145k643j72273P2630p888l5213J01933Q608K89188k41506A44397
13588B29370L19898A68667K70754A9556M36758N1551A13994J93905J0397K60639
13578E78935k27790q1464R1058J50770A3163J43737M2169J68484O5105j89727
13568B42931q4454J10261a6582B25898b6727B09203L0521q0146J41620J52468
13558D53666K57361B22514c8365D40381j36332r0322e4623C50240A52650m0333
$$ y = [413944, 324284, 236030, 423756, 84400, 630449, 262159, 398430, 570172, 78819, 277852, 463897, 197969, 394954, 541142, 562667, 653430, 875158, 379408, 208403, 447146, 517304, 261654, 166368, 448271, 143527, 292313, 412832, 765463, 440198, 463008, 455863, 453220, 280947, 353577, 345689, 310476, 412409, 421017, 710205, 468699, 144397, 229370, 549268, 168667, 439421, 19556, 456314, 507865, 113994, 307899, 318296, 578935, 351145, 269681, 360739, 511509, 13163, 156900, 199069, 367553, 432658, 242931, 158477, 268738, -16582, 225898, -26727, 209203, 239724, 159578, 301198, 453666, 711027, 222514, -38365, 440381, 304049, 213727, -54623, 350240, 152650, 112317]
13548A12317J17997J08693J33632o2373p9969p7494b5248D61043j82207C3427
13537C43331p0423A24169M77659B94155L57535B17697o951m8168o5494L28671
13527D25755A90246j9749L0664K15865J29258L5110A95917J0446k49P4898l5917
13516B45095O174N1692l2339P4143j26191m8843P1008J0032n2455K55672I0756
13504B58873N72q6156F0081K49368a8284E08687O5520h8352C34184J4864j16877
13493B32171R70N7000A40583M49686j76659L520j90224L2643G2819J75947R344
13482B58110O2234j655J63202A29983L10632j42347J2682J40512B03723q5470
13472A18253D0663J67485j002M7798j4500K58226B38631L22088o0178r4779A48776
$$ y = [112317, 230314, 339007, 472639, 410266, 330297, 252803, -25248, 461043, 278836, 33427, 343331, 272908, 124169, 601828, 294155, 651690, 217697, 210746, 162578, 97084, 425755, 190246, 170497, 201161, 417026, 546284, 581394, 195917, 206363, 206114, 281012, 245095, 251269, 302961, 270622, 344765, 218574, 169731, 240739, 250771, 198316, 453988, 90756, 258873, 259445, 173289, 60081, 309449, -18284, 508687, 574207, -88352, 334184, 349048, 232171, 233141, 290141, 140583, 590269, 413610, 417130, 226906, 259549, 72819, 248766, 258110, 320344, 318689, 481891, 129983, 440615, 298268, 310950, 451462, 203723, 118253, 40663, 208148, 207146, 254944, 240444, 498670, 238631, 560719, 500541, 405762, 148776]
13460A49669j4674N0951L05387A62123g6625c4071B87063D268K48298J50055k00040
13449B02581J42768j07678N3372O5181A15264K08726j18389a22293H2518K2639
13439A05157K49894j43869R3141J63380B04039e9704I3577J22522R5939d7170
13428C93778E7882K3724K7013M10565C1308J87947h7651B11274J70774A07496
13417a98531E01885A46899K7277H4777M41966k56392J18L3732j30530D5610L551
13406D9161J7774L83893j41317D1777J29548a28015A14077J82887p5538O7885
13396B89311E9835G702K68856r8230c2698D9099M4441j453J41802j9475J1768
13385B26182m6174J10907g6377k968D36328K11867B92849K01022A61638R2647
$$ y = [149669, 134995, 185946, 491333, 162123, -76625, -34071, 287063, 4268, 252566, 402621, 202581, 345349, 237671, 291043, 356224, 115264, 323990, 205601, -122293, 82518, 105157, 355051, 211182, 304323, 467703, 204039, -59704, 93577, 216099, 312038, -47170, 393778, 57882, 81606, 108619, 519184, 31308, 219255, -87651, 211274, 382048, 107496, -198531, 501885, 146899, 174176, 84777, 526743, 270351, 270469, 304201, 173671, 45610, 49161, 66935, 450828, 309511, 41777, 171325, -128015, 114077, 296964, 221426, 289311, 59835, 7702, 276558, 178328, -32698, 49099, 93540, 92087, 233889, 214414, 226182, 180008, 290915, -76377, -79345, 436328, 648195, 292849, 493871, 161638, 254285]
13375B54285R2477J51996f2660C02419O705J09231j31550L0783A26569j9322J51016
13364B58263J08111O4341A18069j0798a17006M6803A74480R909j2004e7888A02946
13352C6992L90288j23673A39606P70880B67732K5122P9861O2840A31990J58487
13342B90477N5993L9211G0683E788Q7934K62241A387K61158q7291P5060k4000
13331B26314q0817L21515A45888A7845L76312A25647c9099B12274J13942B2469
13320C40951E5623J63993F7617M24338k04444j34414E1386M14038j76498I6036
13309D62907D3530J69232J69507G1933q691R493J89461Q1403J21027I4493J29163
13298B23656F1874P4798L51996l6277A38389a96423A77574N8977R8275J39241
$$ y = [254285, 346762, 498758, -62660, 302419, 309124, 418355, 286805, 317588, 126569, 107247, 258263, 366374, 430715, 118069, 107271, -117006, -70203, 174480, 184389, 172385, -57888, 102946, 36992, 427280, 303607, 139606, 910486, 267732, 292854, 372715, 435555, 131990, 290477, 346470, 385681, 70683, 5788, 93722, 355963, 1387, 262545, 175254, 250314, 226314, 145497, 467012, 145888, 17845, 394157, 125647, -39099, 212274, 326216, 22469, 340951, 55623, 219616, 67617, 491955, 287511, 153097, 51386, 465424, 288926, 96036, 462907, 43530, 212762, 382269, 71933, 63242, 72735, 262196, 343599, 464626, 94493, 223656, 61874, 136672, 488668, 452391, 138389, -196423, 177574, 236551, 334826, 474067]
13288D74067G9811K29947o2024a3493H5871L5664a71249B22766r5095j8534e1240
13276G7257K77217i3862H7054K723k0061J36524A3899J44994J63212A21852L81226
13265E03078A63417m2446J1525o3754J71510A05714J35096a01686A54806a10447
13254D01689L749H2921j5799K27570g7383A1607a60012B97834E8512K54490I1236
13242a70453A67491A4783P0406B2403H416L49478A00541j6102a93423C20051f7265
13230A11842b753A18715J05932A05681M2086m6036f5204B90960L12962F2619N3039
13219A15658e0329C58483j65133m5379K65440k06426I8086a13933B8392K67690
13209B96082i2651I3496Q2506J14852a46059A39091o0739J13814L24316B55266
$$ y = [474067, 79811, 309758, 247734, -13493, 85871, 121535, -171249, 222766, 127671, 109137, -51240, 77257, 354474, -93862, 87054, 89777, 69716, 206240, 13899, 158893, 322105, 121852, 503078, 163417, 120971, 132496, 68742, 240252, 105714, 240810, -101686, 154806, -110447, 401689, 405438, 82921, 67122, 294692, -77383, 11607, -160012, 297834, 58512, 313002, 91236, -170453, 167491, 14783, 85189, 22403, 8416, 357894, 100541, 84439, -193423, 320051, -67265, 111842, -2753, 118715, 224647, 105681, 147767, 101731, -65204, 290960, 603922, 62619, 115658, -50329, 358483, 193350, 147971, 413411, 206985, 98086, -113933, 28392, 296082, -92651, 93496, 176002, 290854, -146059, 139091, 78352, 192166, 516482, 255266]
13198a23981J2574C0374b09986M7980B56790K26398a00920B15330b05869A68700
13187a06565l259E7524a32955j55588B86676O9107E2133F41K37935o6811K4746
13176A96511F5917L2575M0765p991O1460K1621J26878F4457K5724R5189q3674
13165A01696D4148R8573o1385A9874J5098J08341E442J80759e0132l8156D55958
13153B56776d8515B25974a77291B54140D050J44859r283e4356B48061a13116j35626
13142b48742o2366A24944h0844c6799B05050a48627G0155R0928j8356h8953n4103
13131a43056B70110b52964D12562j61151F4860B0840K13614b39172b6773A43626
13120A06161J22310c781k17979A95433J04439b7253B91352F0775a03896n0750
$$ y = [-123981, -111407, 30374, -209986, -162006, 256790, 483188, -100920, 215330, -205869, 168700, -106565, -109824, 57524, -132955, -288543, 286676, 355783, 52133, 641, 238576, 171765, 196511, 65917, 98492, 139257, 131266, 192726, 214347, 341225, 64457, 90181, 185370, 101696, 44148, 142721, 81336, 19874, 34972, 143313, 5442, 186201, -50132, -88288, 455958, 256776, -48515, 225974, -177291, 254140, 4050, 148909, 139626, -54356, 248061, -113116, -248742, -311108, 124944, -80844, -36799, 205050, -148627, 70155, 161083, 142727, -88953, -143056, 270110, -252964, 412562, 251411, 64860, 20840, 234454, -239172, -26773, 143626, 106161, 228471, -3781, -221760, 195433, 299872, -27253, 291352, 60775, -103896, -154646]
13110a54646D6974a45484A09662o782J333m1471J10407a10387B04049J3312L00608
13099E17969e1872A04540K36094b68881E89641B50833M8835d2386A07366a08306
13088g2864j2939q914B02655c0548D4250R3085q903K59372j11905m019F7125p788
13076E9337a29808A03323l1535J61190J43233A45407a1641C9002J35530a28503
13065G8995a63191g8729j44113E1168a0560o2821C81862j85983a7446B59664e7157
13053C23591j45869E272N4949R9549a9896k35755N2853C16703c24960I6100q123
13042H7977A3991d2662A0307J70157e3714B58730F9881C4500Q4504a4177G8545
13030F1884b3903l1270H4853K007M0450J1104N11565A28899P037J30613h2882
$$ y = [-154646, 46974, -145484, 109662, 102880, 104213, 62742, 173149, -110387, 204049, 217361, 517969, -51872, 104540, 340634, -268881, 589641, 250833, 299668, -42386, 107366, -108306, -72864, -85803, -94717, 202655, -30548, 44250, 137335, 128432, 387804, 275899, 271880, 67125, 59337, -129808, 103323, 71788, 232978, 376211, 145407, -11641, 39002, 174532, -128503, 78995, -163191, -78729, -222842, 51168, -10560, -73381, 381862, 195879, -17446, 259664, -57157, 323591, 177722, 5272, 60221, 159770, -19896, -255651, -202798, 316703, -324960, 96100, 87977, 13991, -42662, 10307, 180464, -53714, 258730, 69881, 34500, 119004, -14177, 78545, 61884, -23903, -55173, 84853, 86860, 127310, 138414, 649979, 128899, 135936, 266549, -82882]
13018I7280M69272G6073L1962J48307h2592j25064B11047n0555K27556b27137
13007C6876K94077j49165G0626f7365C07384j17285J74144I1499K76143a13876
12996H8049L0004J72857j00129C312a97253F7632O2352K50987b22928A38417b8083
12984a67197h2518H7352e3294A54879J60109B5342M3795a82355A62174n0358L8094
12973A49910J94679j40581N2794a8324G7513L3064e9704k41203A5217L36588c81546
12961d329B45000a12173E2558J04369l7733J41534a76827l7117b950C6680L5800
12950G2480M26165i8432l694B74832B091K58912I4497g0743A88333M590J29778
12939C22701a04804B9278c1673A21487N4963a81738A48550J03541a35260N0578
$$ y = [97280, 566552, 76073, 108035, 256342, -82592, -207656, 211047, 160492, 388048, -227137, 36876, 330953, 181788, 70626, -67365, 307384, 190099, 364243, 91499, 367642, -113876, 88049, 118053, 290910, 190781, 3312, -197253, 67632, 129984, 380971, -222928, 138417, -28083, -167197, -82518, 87352, -53294, 154879, 314988, 25342, 69137, -182355, 162174, 111816, 149910, 344589, 204008, 256802, -18324, 77513, 110577, -59704, -300907, 15217, 351805, -381546, -4329, 245000, -112173, 52558, 156927, 119194, 260728, -176827, -213944, -2950, 36680, 72480, 498645, -98432, -102126, 274832, 2091, 261003, 94497, -70743, 188333, 192923, 322701, -104804, 29278, -31673, 121487, 176450, -181738, 148550, 252091, -135260, -84682]
12929h4682o6781E8812N2414b26005A84577N3749d5694r9958E7292A4829a09562
12917A83511k8458E8810g1005j67996i6083B58286H3107g6926A76139C9353b0883
12905i3662j34473B66048K6037k9020b9940f73k19761A02570c3440B80377n2131
12894B28246a47259B38717p0910A9867M13284g7326G3325a02174C34260A49221
12883F2062b33320I2902R7739c9766B10927h3672l94163i4415j37967A35110c74002
12871B47936i7780F1859b02263D08648j96136n9569G2860A2262R6785N5878I603
12859a63472c1823A63764D9297K135J87092B7068a40618M1465G2975e3183C00721
12847f3421A60283g7251A44111l0174D4382b59532I1307O501h1279C06655m6776
$$ y = [-84682, -151463, 58812, 111226, -226005, 184577, 238326, -45694, -145652, 57292, 14829, -109562, 183511, 155053, 58810, -71005, -239001, -96083, 258286, 83107, -76926, 176139, 39353, -20883, -93662, -228135, 266048, 292085, 263065, -29940, -673, -220434, 102570, -33440, 280377, 228246, -147259, 238717, 167807, 19867, 433151, -77326, 73325, -102174, 334260, 149221, 62062, -233320, 92902, 190641, -39766, 210927, -83672, -477835, -94415, -232382, 135110, -374002, 247936, -97780, 61859, -202263, 408648, 212512, 152943, 72860, 12262, 109047, 164925, 9603, -163472, -31823, 163764, 49297, 51432, 238524, 27068, -140618, -99153, 72975, -53183, 300721, -63421, 160283, -77251, 144111, 113937, 44382, -259532, 91307, 97808, -81279, 306655, 259879]
12836B59879F0016R3028j7223K86715b13030N2853A95003f108j42865H5247b14513
12824A47870h723A62946c0213F6455f0236A05068k807B2335d9801A42254B5142
12812A98743e2643H4454B9177J72279a2880B90521D1719j5308a6345n8227B8565
12800E4770a11945C8143K73971a30886C41315b410q4113D9470J96130j14403a07451
12788A30251b01344b7556n4148C3821K16426a56336E7302K6760M4742K63783j37631
12777B54956f7755C31419K5867G6272f6669J0650j09679A72831Q1389b71814O2490
12766b09324A48975a02018A51698g2575L1543B51399l7845E0932e9270B7341a28615
12754d6788C70111a33082f531l31882K2438F593b001A6222J03937B0663D06J38486
$$ y = [259879, 60016, 153044, 135821, 422536, -213030, -160177, 195003, -6108, -148973, 85247, -214513, 147870, -8723, 162946, -30213, 66455, -60236, 105068, 102261, 22335, -49801, 142254, 25142, 198743, -52643, 84454, 29177, 201456, -12880, 290521, 41719, 26411, -16345, -74572, 28565, 54770, -111945, 38143, 312114, -130886, 341315, -2410, -86523, 49470, 245600, 131197, -107451, 130251, -201344, -27556, -81704, 33821, 250247, -156336, 57302, 84062, 128804, 392587, 254956, -67755, 331419, 357286, 76272, -66669, -56019, -165698, 172831, 254220, -271814, -209324, 148975, -102018, 151698, -72575, -41032, 251399, 213554, 50932, -59270, 27341, -128615, -46788, 370111, -133082, -6531, -338413, -315975, 6593, -2001, 16222, 120159, 20663, 406, 138892]
12742A38892M0500J20275e0812j89012B0592a18117A67975a5788H4810K64979
12732C49789J190D1378J97645c0032j26793A39554m1395C2480J23493O1249g8646
12720a63471J0326O2494n896E8701Q0645a9901D47927j71271A37434c7575B17940
12708A72226J37469J54588A02611m510K79295j38474m6820a3102C61336H1772
12697B52457p708J0546F118L08649a65272B51856A19406J46157h4726l5530M1139
12686g9117o3874c936A97096a99808F2546R7193A5120a9660A35709J40302j20823
12675A55188p1849c61317C4019a79909C09982a6722A38441b65624A42000J39287
12665B81287a23001G2073K08665b3974A47738E8129N1261D6481h7092C14884q3555
$$ y = [138892, 179392, 299667, -50812, -239824, 20592, -118117, 167975, -15788, 84810, 349789, 350979, 41378, 239023, -30032, -156825, 139554, 98159, 32480, 155973, 217222, -78646, -163471, -153145, -90651, -96547, 58701, 139346, -19901, 447927, 276656, 137434, -37575, 217940, 172226, 309695, 464283, 102611, 98101, 377396, 238922, 192102, -13102, 361336, 81772, 252457, 244749, 255295, 6118, 314767, -165272, 251856, 119406, 265563, -84726, -120256, -79117, -142991, -3936, 197096, -199808, 62546, 159739, 15120, -19660, 135709, 276011, 155188, 83339, -361317, 34019, -179909, 309982, -16722, 138441, -265624, 142000, 281287, -123001, 72073, 280738, -23974, 147738, 58129, 109390, 46481, -87092, 314884, 231329]
12654B31329n4372l8556c00983C5861e7824C24544a51158C73119A30024J46189
12644B76213a23296C07017A216R575L5096i628C7016A7163K5917e9701a2650A91793
12631d9471a080p619A13414k9544J57467M29692B01117p7550P6607a57381b5534
12619a61284A80743p9720O3565o2144a00953F964h305l60798B88201A23714B1548
12607b40140g2419E4242K932A3300a6476F43L80967q2061b71407g4731D6182b8064
12594A76381E8059L9887m7760M3690J44031a33861E5381J6183a88738A58672R929
12583A68601p3721C0559i2175A86316Q2637E4109a19480j65443b5622p747B14822
12571A5439a28665F293b7849j0204E735e2472B49583a91194A62141c00082D56981
$$ y = [231329, 176957, 138401, -300983, 35861, -57824, 324544, -151158, 373119, 130024, 276213, -123296, 307017, 1216, 10791, 45887, -9628, 37016, 17163, 43080, -59701, -12650, 191793, -49471, -1080, -8699, 113414, 83870, 241337, 671029, 201117, 123567, 200174, -157381, -25534, -161284, 180743, 101023, 164588, 102444, -100953, 6964, -8305, -369103, 288201, 123714, 21548, -240140, -72419, 54242, 57174, 13300, -16476, 643, 381610, 299549, -271407, -74731, 46182, -28064, 176381, 58059, 97946, 50186, 93876, 237907, -133861, 55381, 71564, -188738, 158672, 168601, 94880, 30559, -92175, 186316, 268953, 54109, -119480, -284923, -25622, -33369, 214822, 15439, -128665, 6293, -27849, -38053, 5735, -52472, 249583, -191194, 162141, -300082, 456981]
12559b1810n5350B37561k3674Q0249B5354b75723I356K9128M4919O1540J69655
12548C14598d2104B86564a04195A85806q4766a93574b7120Q522r571A06468m081
12537A02387J54927a18046C549g1659i69C82172b19523D4181c97548D6463K69065
12526C15528j27293b41010k26712B04200B5992a21142K9094R870A37873E3936
12515D47023a88400A50607o0913J13498c67566a08297q9905c8110a3951C9915
12504b50789A68953a22044I9232D0368K916M53659B6182O9777c8599A75569d0254
12492E8288j5339c2735B00739d8040B99215c849j24453H2357K00444d8674A61084
12480f6983F5307i0623O470m5585A10582a42636G2573b79844d4060B46843a21545
$$ y = [-21810, -77160, 237561, 213887, 294136, 25354, -275723, 9356, 38484, 83403, 144943, 314598, -42104, 286564, -104195, 185806, 101040, -193574, -27120, -18598, -28169, 106468, 102387, 257314, -118046, 3549, -71659, -969, 382172, -219523, 44181, -397548, 46463, 315528, 188235, -241010, -467722, 204200, 25992, -121142, -92048, -82178, 137873, 53936, 447023, -188400, 150607, 89694, 203192, -367566, -108297, -198202, -38110, -13951, 39915, -250789, 168953, -122044, 99232, 40368, 43284, 496943, 26182, 95959, -38599, 175569, -40254, 58288, 42949, -32735, 200739, -48040, 299215, -3849, -128302, 82357, 282801, -48674, 161084, -66983, 65307, -90623, -84153, -129738, 110582, -142636, 72573, -279844, -44060, 246843, -121545]
12468B05858a11142L8469L4374H2215O4545M0009I2998c45651D0786a50475M1970
12457a08505E0623q46a42334B76676a76105r3496A58303a40245M7794j27638O0193
12446a59896k88354a5466k33193d8555B64659E7331h6012A03397L0983b01882
12435G5831k9013Q2698e2676j76224L8711l4045Q7164L4686E0688R8897f5147
12423i4264q2589A06175i107A40025a54485P52L9581c4754G6501a7073k54836
12412b71909E8506R3487N0689b14178e0607B20987G8496L9850a4967F0575f5373
12400b21439B8535e8940M43A95650h8618N065h592j1117o7144F5622d9115r8789
12388a47904D6130b76424A89972P3857b06922J0349O9426G4777a03699E8548d7383
$$ y = [205858, -111142, -72673, -38299, 82215, 146760, 186769, 92998, -345651, 40786, -150475, -108505, 50623, 49777, -142334, 276676, -176105, -269601, 158303, -140245, -92451, -220089, -159896, -448250, -15466, -248659, -48555, 264659, 57331, -86012, 103397, 134380, -201882, 75831, 46818, 129516, -52676, -228900, -190189, -224234, -137070, -102384, 50688, 149585, -65147, -94264, -176853, 106175, -9107, 140025, -154485, -153733, -114152, -34754, 76501, -17073, -271909, 58506, 151993, 202682, -214178, -50607, 220987, 78496, 118346, -14967, 60575, -65373, -221439, 28535, -58940, -58497, 195650, -88618, -83553, -8592, -19709, -86853, 65622, -49115, -147904, 46130, -276424, 189972, 263829, -206922, -196573, -127147, 74777, -103699, 58548, -47383]
12376f525A24291K82680j61311h0026m8895A29040b62855D9167J53270i411B95402
12364A57996d7194B66382a53253C90769j86578d0331F3751a402A21879b69961
12353e1097A71789a22706o7291A57695a37122I0742M1224h1081c9402H4228J23780
12342B08008r830l1923a21133A21300a93132H4523a52278b55A40381L2243L1369
12331B03993a27746c7972B39292a64552A29720A1961O6768a21077M8397f558j85681
12320a92239A54099B5288O4767b07077J2822B10991C4513R2829g0561J798C0447
12308d4106G9001f2071p6340L237l4484A81179a65048m666B12798c09902a10190
12296d399B6550f88D4183R3638C1138d58333C28206e7891J2882A36155n0759J47854
$$ y = [-6525, 124291, 406971, 245660, -80026, -128921, 129040, -262855, 49167, 202437, -9411, 295402, 157996, -47194, 266382, -153253, 390769, 204191, -40331, 63751, -1402, 121879, -269961, -51097, 171789, -122706, -189997, 157695, -137122, 90742, 131966, -81081, -39402, 84228, 208008, 198178, 166255, -121133, 121300, -193132, 84523, -152278, -255, 140381, 172624, 203993, -127746, -37972, 239292, -164552, 129720, 11961, 78729, -121077, -72680, -6558, -192239, 154099, 25288, 90055, -207077, -194255, 210991, 34513, 127342, -70561, -68763, 30447, -44106, 79001, -62071, -138411, -135174, -169658, 181179, -165048, -169714, 212798, -309902, -110190, -4399, 26550, -688, 44183, 137821, 31138, -458333, 328206, -57891, -45009, 136155, 85396, 233250]
12284B33250I2784L6076d0016k6166b6058p3538A12605J05604J24571m0612K8814
12273C30982I9085K81947A42111J60869a89546A39336n6443J07640H3376m318
12263G9058i5389A73409H564L59430a56165c8689B1620a78205A26807d6791C13027
12251A05939d4077B01753d0698I0527j2256K43768A23057h9191A43925J58213
12241C02138A09633C626a05777L2296l0238A49936m1240D7737J83657l9848j2589
12230A78957R7207o1578a57023C26804A39335e3166E68435k56282p4956L3914
12220B71111j02134Q8190A20129a23528A86646J58468p8213M3801a6106j82867
12210a98973B5642O2982K71392j54344I0309J89030a03746a6021B58807j08578
$$ y = [233250, 92784, 128860, -40016, -66182, -26058, -99596, 112605, 218209, 342780, 302168, 330982, 99085, 381032, 142111, 302980, -189546, 139336, 82893, 190533, 83376, 79058, -95389, 173409, 8564, 367994, -156165, -38689, 21620, -178205, 126807, -46791, 313027, 105939, -44077, 201753, -40698, 90527, 78271, 322039, 123057, -89191, 143925, 302138, 109633, 3626, -105777, -73481, -103719, 149936, 108696, 47737, 231394, 191546, 178957, 276164, 214586, -157023, 326804, 139335, -53166, 568435, 312153, 237197, 271111, 168977, 257167, 120129, -123528, 186646, 345114, 266901, 310702, -16106, -198973, 25642, 88624, 360016, 205672, 90309, 279339, -103746, -16021, 258807, 150229]
12200A50229N377L93950k31132D1622b42324C27285l9260e2500C45518j25062
12190B20456c423B94616A13851J89097j3708h6941m7425B91726b45335E03967
12179B05874r6038a76863Q1710K7076m9876E87381F9621J36442h4752r8598D22784
12167A77602K715J21637l4595a6278C04192q6096R8922O812K6423D2057c7199
12155B41248C7306R7585K14334a73101j65232g815A55161E0475J88419A05822
12144A58740B8922J55422B6617N6287K18848a58013D5361l703j2102Q4879f4243
12132G7042b3866q3935k79050D6319J13847m7458M4172d936j0310G3083A3338
12120b06478B09984b96179D2015J19621C7673J57840h3184p3220l1682H6268a77333
$$ y = [150229, 155606, 549556, 318424, 41622, -242324, 327285, 288025, -52500, 345518, 220456, -3423, 294616, 113851, 302948, 289240, -86941, -134366, 291726, -245335, 503967, 205874, 109836, -176863, -95153, -68077, -117953, 587381, 69621, 206063, -84752, -183350, 422784, 177602, 180317, 301954, 267359, -16278, 304192, 218096, 317018, 323830, 350253, 42057, -37199, 241248, 37306, 134891, 349225, -173101, -338333, -7815, 155161, 50475, 238894, 105822, 158740, 28922, 184344, 26617, 82904, 301752, -158013, 45361, 41658, 29556, 114435, -64243, 77042, -23866, -107801, -386851, 46319, 160166, 112708, 156880, -4936, -15246, 73083, 13338, -206478, 209984, -296179, 42015, 161636, 37673, 195513, -83184, -156404, -188086, 86268, -177333]
12108G7277j5716K80946E7682b4118m3870A25487a85044A88610c19500g0876o5432
12097a36308N8708j0101B20997i4603E1065n306Q1460B4647a25212j76572f8955
12085a98981A46596a25354L656A40177A1706Q3370P7691g3630B49653a04004k2607
12074a26611E00484K12618J348014l87515o80844j78592C63553p2894a3686C40104
12063A80d0956j78356H6968P7712b3550A10708a10057C09424j44069a27275k16881
12052c44156A08581o775J60747p619A03438K3116f5791k00933J26092f637j0044
12041a6681A12865c568k39854a20886o3333b6707A34556n6958B1862c24859O2269
12030b62590A4076a30442d8659k17105M6778L1338B59358E2329c8536p7097A24475
$$ y = [77277, 61561, 342507, 57682, -24118, -67988, 125487, -185044, 188610, -319500, -70876, -136308, -77600, -87701, 220997, -94603, 51065, 45759, 127219, 24647, -125212, -301784, -68955, -198981, 146596, -125354, -121698, 140177, 11706, 95076, 172767, -73630, 249653, -104004, -126611, 500484, 713102, 2061116, 1673601, 992757, 814165, 363553, 290659, -13686, 340104, 180, -40956, -219312, 86968, 164680, -23550, 110708, -110057, 309424, 165355, -127275, -344156, 108581, 101806, 262553, 254934, 103438, 126554, -65791, -266724, -140632, -6637, -16681, 112865, -3568, -243422, -120886, -184219, -26707, 134556, 77598, 21862, -324859, -262590, 14076, -130442, -48659, -265764, -218986, -187648, 259358, 52329, -38536, -115633, 124475]
12018b26886B52337e5992C30068c8482k78549A6856M6960a19132I0612R7544n6033
12007A32123b67253A81693h2441a1112j88436A5463L32312j70623a25582A1063
11996a16891D4360J06262b70804c253B56941f8362r424C7732J69657H5395b53519
11984A53478a99751D64297A98541D6407a30347A21297H396i1566B89164l3400
11974B55764K884b57752k9387Q3034h7477A69082A2939a26478A95470A9743J66771
11963A86514b3577G0336K8986d34343b6884l3934l7634b6778P681r3083L5810
11952g6370A7652i361k21213D5138c8689C5965b37282C1554b4170j2760O975j41165
11940a71120A5095d12254C49675j60511b86005A51745c92683E7374c3801B44059
$$ y = [-226886, 252337, -55992, 330068, -38482, -317031, 16856, 63816, -119132, 90612, 188156, 132123, -267253, 181693, -82441, -11112, -199548, 15463, 347775, 177152, -125582, 11063, -116891, 44360, 150622, -270804, -3253, 256941, -68362, -77786, 37732, 207389, 85395, -253519, 153478, -199751, 464297, 198541, 46407, -130347, 121297, 8396, -91566, 289164, 255764, 258648, -257752, -287139, -204105, -87477, 169082, 12939, -126478, 195470, 19743, 186514, -23577, 70336, 99322, -434343, -26884, -60818, -98452, -26778, -19097, -112180, -76370, 17652, -9361, -230574, 45138, -38689, 35965, -237282, 31554, -24170, -36930, -29955, -171120, 15095, -412254, 349675, 189164, -286005, 151745, -392683, 57374, -33801, 244059]
11929a8609p1231D10066H1764a5271j11655j24046g4478q439A53398G2083P3870
11918A45953R8887b39030a13006G6045c24556B54276d2411j27233J3581C16210
11907a7782A00846a516A61163a9801j91924Q7116A51033b55041J17314k1873F5930
11895d52465a21925k06448J37067o3875G2674G897J31575c21932D596a84265D0242
11883f8525m7254n0098G5072g3131l84118b24300J4196f2635I3776K07718G6264
11871B8915a29435j71849A49890J99141b43147E0638a46899A38027E7842b0888
11860B32817F3898a11187A29858g5902n2740B17043L81512b6282j46283k2124
11850a94689B08891b0716n0171l6890D2691h2822L6682I424d3393d886j3301B21931
$$ y = [-18609, -89840, 410066, 81764, -15271, -126926, -250972, -74478, -82917, 153398, 72083, 145953, 244840, -239030, -113006, 76045, -324556, 254276, -42411, -169644, -156063, 316210, -17782, 100846, -1516, 161163, -19801, -211725, -124609, 151033, -255041, -137727, -159600, 65930, -452465, -121925, -328373, -191306, -255181, 72674, 7897, 139472, -321932, 4596, -184265, 40242, -68525, -115779, -165877, 75072, -73131, -457249, -224300, -210104, -62635, 93776, 301494, 76264, 28915, -129435, -301284, 149890, 349031, -243147, 50638, -146899, 138027, 57842, -20888, 232817, 63898, -111187, 129858, -75902, -128642, 217043, 598555, -26282, -172565, -194689, 208891, -20716, -70887, -107777, 42691, -82822, -46140, 9424, -43393, -4886, -18187, 221931]
11837f1906m01040b01394N3433E3160A7927Q999J9229K89598d9126A7264i7018
11825f3440n4823G290g6495A40469E3191a74224A92015b74942d0881n56934B28358
11813C7520c0862C09717b27554a05764L9855I368f4977i000A17003h9398L317
11802h6081r0599A30072a03386j28678A28661J12555e2215A80335O515D2960R6968
11791A39928a85303B6891J41265C0057K5000a06849j10771h2687B42164B3323
11780f5272k2305j97295E6385a33027C1525J18063H976b4912B76231c0446D1778
11768g4804k74674i9602A66278a64725B53084b73629h8457C9236a30271K2704
11758a07567A95170a23189a8963A68800c19282a02010H4413b8221o2380G5911
$$ y = [-61906, -462946, -201394, -147961, 53160, 17927, 26926, 46155, 335753, -49126, 17264, -97018, -63440, -118263, 7290, -76495, 140469, 53191, -174224, 192015, -274942, -40881, -597815, 228358, 37520, -30862, 309717, -227554, -105764, -65909, 9368, -64977, -9000, 117003, -89398, -86081, -176680, 130072, -103386, -232064, 128661, 241216, -52215, 180335, 186850, 42960, 139928, -185303, 26891, 168156, 30057, 55057, -106849, -217620, -82687, 242164, 23323, -65272, -87577, -284872, 56385, -133027, 31525, 149588, 8976, -24912, 276231, -30446, 41778, -74804, -349478, -99602, 166278, -164725, 253084, -273629, -88457, 39236, -130271, -107567, 195170, -123189, -18963, 168800, -319282, -102010, 84413, -28221, -90601, 75911]
11747B97803a19256e4711b5051A52735o5504a1305A16868b54771B12456c48367
11736A84614o8217E0213J87101F1423g9653B23619r3593d8476j26666A06397k5608
11725H0789J04903B9670h3576o6590a7948A4361J65117J70973r5856P95e262H7691
11712c43551A10887d1349I8901j1919l2273K4240K06852a96253O9466E0900J22407
11701A73307f8511E1750h934A41745B8675j050L29225b56480c8687F9459f1491
11689A68097A256a36008F9065R4983n1886J36056d4217j89286B80012r471E8891
11677d53053A01435a3230G6116b7645j51175g9020C1647K34495E727a41854C39175
11665e9541e813A29528d2057B35220k3040b1244C02430a55049b0792j53215I6772
$$ y = [297803, -119256, -54711, -25051, 152735, 87231, -11305, 116868, -254771, 212456, -348367, 184614, 116397, 50213, 237314, 61423, -79653, 223619, 130026, -48476, -175142, 106397, 80789, 185692, 29670, -83576, -150166, -17948, 14361, 179478, 350451, 254595, 255390, -5262, 87691, -343551, 110887, -41349, 98901, 86982, 54709, 78949, 285801, -196253, -126787, 50900, 173307, -68511, 51750, -8934, 141745, 28675, 27625, 356850, -256480, -38687, 69459, -61491, 168097, 1256, -136008, 69065, 164048, 112162, 248218, -44217, -233503, 280012, 270541, 58891, -453053, 101435, -13230, 76116, -27645, -178820, -79020, 31647, 266142, 5727, -141854, 339175, -59541, -5813, 129528, -42057, 235220, 212180, -21244, 302430, -155049, -20792, -174007, 96772]
11653G8161k8418K884J82870n7734H4436A5101O8964P9258a41501G798d1475H0025
11640G1139B5192h9842K5568m5063k3484H709K31337a14494B64677A8853K84241
11629C03094D7343R1562k5477L72263b5020a0839A49915D0897g3030n9696A35844
11617h7409k8296c8498m3214B75952I6875C1319c1457D1741M18335i38A64176
11605b28186a2170p8119k20399g1744A88365O6222j05366D5837M11288b2317j71013
11594a93330J9234f5452E8305b32493H0806f4984C21786e3433B98742K810j27945
11583A73607N9956a83087A77579b22826I3205O3554G2086k2301P9820L1297A4312
11571A41013K9912G2830a50120g3306C43627A35542a75614I4008e9559e891m53323
$$ y = [78161, 49743, 52627, 235497, 177763, 84436, 15101, 84065, 163323, -141501, 7798, -41475, 80025, 71139, 25192, -89842, -64274, -109337, -132821, 8709, 240046, -114494, 264677, 18853, 303094, 47343, 138905, 113428, 485691, -25020, -10839, 149915, 40897, -73030, -132726, 135844, -87409, -115705, -38498, -81712, 275952, 96875, 31319, -31457, 41741, 460076, -938, 164176, -228186, -12170, -90289, -310688, -71744, 188365, 254587, 149221, 45837, 457125, -22317, -193330, -174096, -65452, 58305, -232493, 80806, -64984, 321786, -53433, 298742, 301552, 173607, 233563, -183087, 177579, -222826, 93205, 156759, 72086, 49785, 129605, 160902, 14312, 141013, 170925, 72830, -150120, -73306, 343627, 135542, -175614, 94008, -59559, -5891, -459214]
11560d59214a01468j4670H5499J66019I7530B6397e6698l5382A65837F569J69210
11549A75779H2054M9850k2915J65919E1246K43888h8334F16683G7615J26004e2274
11537F3171L54507A25906a25821C52137b28478R6134B07874r1776K52636P1288
11527D40022a1866C19778o5104l3590N2437c43265J17303B11616a59593F4188
11516g1762A7497K73455H4412a5912k99241R5203C10397p0398E1068L11315a98035
11504B84097a83654d105B98812a88552A14717E2105M38679A3668b57139A27476
11493c04191G8415J66943P4855H6551g7397H5578i8760j8035D89911k42265K6152
11482B73798A550h9082J3629F6178c025H5290L56942j86979a076B00947a90189
$$ y = [-459214, -101468, -116138, 85499, 251518, 97530, 26397, -56698, -92080, 165837, 6569, 175779, 82054, 131904, 108989, 274908, 51246, 295134, -88334, 616683, 77615, 203619, -52274, 63171, 417678, 125906, -125821, 352137, -228478, -132344, 207874, 116098, 368734, 440022, -11866, 319778, 254674, 221084, 273521, -343265, -225962, 211616, -159593, 64188, -71762, 17497, 290952, 84412, -15912, -315153, -219950, 310397, 239999, 51068, 362383, -198035, 284097, -183654, -4105, 298812, -188552, 114717, 52105, 490784, 13668, -257139, 127476, -304191, 78415, 245358, 320213, 86551, -77397, 85578, -98760, -116795, 489911, 247646, 273798, 1550, -89082, -75453, 66178, -3025, 85290, 442232, 255253, -1076, 200947, -190189]
11470E1528f3435O453A22790J50643r09K1392J06170A37281l4151P497a36374
11458C97131A28466l1317c5686D68643c89253A06951K10236A34050c9395H2683
11447c63786A14293P7623n5833J3405J71864j26547B5594J78805l9618n4007c69557
11435A04213c4331B98606G7487J65575h421k22013F9286b74274J07323E7668J77120
11424B34788H2170b17269a5935j47668h803j30286b7264k42864i0040A53360J10611
11413B63971b98305J7326h2647b284I1831K96750j04976A36449D1719b30565B64537
11401D6096h5480F3044h0172C34042A18712a22965K4705k9255p872c3838a1714
11389D44504b39461L7470q3437c0047j9749j75744a06067A92778a46735O5387
$$ y = [51528, -63435, -56982, 122790, 273433, 272524, 293916, 400086, 137281, 103130, 110627, -136374, 397131, 128466, 97149, -35686, 468643, -389253, 106951, 317187, 134050, -39395, 82683, -363786, 114293, 191916, 136083, 149488, 321352, 194805, 25594, 204399, 164781, 110774, -369557, 104213, -34331, 298606, 77487, 243062, -8421, -230434, 69286, -274274, -166951, 57668, 234788, 82170, -217269, -15935, -163603, -8803, -139089, -27264, -270128, -90040, 153360, 263971, -298305, -280979, -82647, -2284, 91831, 388581, 283605, 136449, 41719, -230565, 264537, 46096, -85480, 63044, -80172, 334042, 118712, -122965, -98260, -127515, -135387, -33838, -11714, 444504, -239461, -201991, -285428, -30047, -49796, -225540, -106067, 192778, -146735, -81348]
11379h1348k9370n8559F8889j6540a73137b9398G8752M5147g8068C57050F8567
11367I6037i3817A04737a98203H7585c40593J43650E6863d42620B61253h7688
11356B39771F7035l0886K49001F7349C739a64053q8281e4842A64892a38545B26886
11344B9246a88763C13361A18230J51860A24033c53226B3557P5678e4095k24665
11334b78760c296p8833l33695I6264d8987D1304g6456A40446i0031j5227A68765
11322H605c2034k42425a25620B5939J34960a40247B78535b27038A79211n9800
11312A19411M8727D9369e3794B67895F1977c45911J56890J744L5741N7843A54369
11300A91378o1026J56248J6956A4652J47024F6548d3684G38J03103i9200H7532
$$ y = [-81348, -110718, -169277, 68889, 52349, -173137, -29398, 78752, 123899, -78068, 357050, 68567, 96037, -93817, 104737, -198203, 87585, -340593, -196943, 56863, -442620, 261253, -87688, 239771, 67035, 36149, 285150, 67349, 3739, -164053, -252334, -54842, 164892, -138545, 226886, 29246, -188763, 313361, 118230, 270090, 124033, -353226, 23557, 99235, -54095, -278760, -3296, -82129, -415824, 96264, -48987, 41304, -76456, 140446, -90031, -105258, 168765, 8605, -32034, -274459, -125620, 25939, 160899, -140247, 278535, -227038, 179211, 119411, 168138, 49369, -53794, 267895, 61977, -345911, -189021, -187277, -151536, -93693, 154369, 191378, 130352, 286600, 303556, 14652, 161676, 66548, -43684, 738, 103841, -99200, 87532]
11288d4064j39136M8958k69581H6537a05106i438m1444j40509j77401A22314a01642
11276b9455k18971h3446m3821j07778P6305G5697a69465B44704g0094a7429B67381
11264a82562E41a11359r266N6155k33552g8594b9252j73343E0820f2765C15667
11252B11437a71822P2507c605j03144A58041E1656a67567g2818k2709B01665a02045
11240f0943k6907j99209a2569m57088A30318K45171b1377A1615O593J21836K12832
11229C52876A3627Q3625a65444M7995F5797J80110h8991n3569B6853J15781a29319
11217E2281M7573k2114a86696f172D4669a07101I4387a10308j42986A21107r30
11206A20177D0664J45667a40281F124a52842A49723b20591H1280a48056f7046
$$ y = [-44064, -183200, -134242, -403823, 86537, -105106, -9438, -50882, -191391, -368792, 122314, -101642, -29455, -248426, -83446, -127267, -235045, -158740, 75697, -169465, 244704, -70094, -17429, 267381, -182562, 541, -111359, -120625, -64470, -298022, -78594, -29252, -202595, 50820, -62765, 315667, 211437, -171822, -99315, -3605, -106749, 158041, 51656, -167567, -72818, -95527, 201665, -102045, -60943, -87850, -287059, -12569, -469657, 130318, 375489, -21377, 11615, 18208, 140044, 352876, 13627, 97252, -165444, -117449, 65797, 245907, -88991, -142560, 26853, 142634, -129319, 52281, 99854, 77740, -186696, -6172, 44669, -107101, 94387, -110308, -253294, 121107, 120177, 40664, 186331, -140281, 6124, -152842, 149723, -220591, 81280, -148056, -67046]
11195g0835L1098J1859A52729k9777C3232f9508J3140n2917J2865m0043D46227
11183f152q8155p6289F9734k7770a34115B70476j31677a9518R29j41181F5368
11171a30186H8786J95464b12253B28026c1696E361R8842i2693A87506c2277B0395
11159B77805A35625e7687A21384J19798J35684b96564H2852g9009j06208B06502
11148G1658a02093m9694B22095b92982G716g1867b648j2992j85263d3966k96897
11137c40863a37664B1280Q5622a98751B9149Q9768n007J68057f4654C08093r2194
11126B15899a25930a8759A68657c81667B906K45041b9706A4806d2321B91434b35708
11114C64804i9074B09693a69707A31432P8258a26598C02412E175f9840H9063h1082
$$ y = [-70835, -39737, -27878, 152729, 122952, 33232, -69508, -56368, -109285, -96420, -136463, 446227, -6152, -94307, -170596, 69734, 41964, -134115, 270476, 138799, -19518, -18589, -159770, 65368, -130186, 88786, 284250, -212253, 228026, -31696, 5361, 104203, -92693, 187506, -32277, 20395, 277805, 135625, -57687, 121384, 241182, 376866, -296564, 82852, -79009, -185217, 206502, 71658, -102093, -151787, 222095, -292982, 7716, -71867, -2648, -15640, -200903, -43966, -340863, -137664, 21280, 106902, -198751, 29149, 118917, 113910, 281967, -64654, 308093, 215899, -125930, -18759, 168657, -381667, 2906, 247947, -29706, 14806, -42321, 291434, -235708, 364804, -99074, 209693, -169707, 131432, 209690, -126598, 302412, 5175, -69840, 89063, -81082]
11102C78877a43505B23421B0199L65052b69823C14387F9232B9467Q5056a17887
11091A60555a14399E3039K7514g5256B89249A24444J52582j29128e8918j5965
11081g4883B07356J24644L3065B2868L89217A93239J40379a246A82455g3868B31273
11069E09426j37017j01700l9393J45580J40865j9576j74471J28492J27128j44050
11059D35284j31302L83121l37083J88170j9506O3765M20041m87834L24316Q5122
11049I24094r1835B78997K3608K40005J04029J44672k3180R624k07106N33220
11039A103869j80222M9270l80906j36727J61898M3156o4565J17091n4790k457
11029F55617J7842n6877N2714n083J26560j98349J11730j16681J25087k33746
$$ y = [378877, -143505, 223421, 20199, 385251, -269823, 314387, 69232, 29467, 114523, -117887, 160555, -114399, 53039, 80553, -75256, 289249, 124444, 277026, 147898, -58918, -74883, 207356, 332000, 365065, 22868, 412085, 193239, 333618, -1246, 182455, -73868, 231273, 509426, 372409, 270709, 231316, 376896, 517761, 498185, 323714, 452206, 579334, 435284, 303982, 687103, 350020, 538190, 518684, 582449, 1002490, 514656, 838972, 924094, 832259, 278997, 302605, 542610, 646639, 791311, 768131, 777755, 570649, 1103869, 923647, 972917, 592011, 455284, 617182, 660338, 595773, 712864, 658074, 655617, 673459, 616582, 669296, 664213, 790773, 592424, 704154, 587473, 712560, 478814]
11019D78814J30291K04013k84006J27794q9326M09971B97808J08878J57409K30500
11009G94595l8138j07645r8277L4303k8870J93244q504k49919K32892l6916j27127
10998E59638K7723R3971J33305p2545R9835k41084L7254K1822r1724j01456K89426
10987G56165j11915P0024L76313k05945K26641l86085M35442r1385J44659M67521
10977A681435l8083j34272L86656L44247m535M61449m4293L7313J24319j6100
10967B798136k22712l43887j78523m30831R0810k02730J07751j29320K75409K15804
10957A979907j28787j18679n1687j20307j51468J46872n02379j8027D56532r3815
10947C62717L8938J77796l0059O3271B44272G3561K7823a28227C20140j54624
$$ y = [478814, 609105, 813118, 529112, 656906, 567580, 977551, 297808, 406686, 564095, 794595, 756457, 648812, 550535, 584838, 555968, 749212, 740708, 490789, 723681, 686765, 559638, 587361, 681332, 814637, 742092, 841927, 600843, 638097, 659919, 568195, 466739, 756165, 644250, 714274, 1090587, 884642, 1111283, 725198, 1160640, 1069255, 1213914, 1681435, 1643352, 1509080, 1895736, 2239983, 2235448, 2696897, 2652604, 2689917, 2814236, 2798136, 2575424, 2231537, 2053014, 1622183, 1712993, 1510263, 1618014, 1488694, 1764103, 1979907, 1851120, 1732441, 1680754, 1560447, 1408979, 1555851, 1053472, 1035445, 456532, 362717, 401655, 579451, 549392, 612663, 244272, 73561, 101384, -128227, 320140, 165516]
10937A65516b22658B15253L674c6843J4496j99060C79395H5815l1096J61730a52007
10925D03470G9518O3524a1995B25733a27614o1617O3700A96095b39371e6599A66801
10913A07403m9167J57781d71886c5066A3477b40028A4195f6400H7652K52492e3654
10901A96617e8070j05172A30433e520o5466B03664R6757r9416c5945B05280h4869
10889A28037b63103b8708B13209B4962M1192C0768b3022j0764D4910K81147a23473
10877a02316M3356o19508a34112d7321B34969I5022C7064a87811Q6103G0801R6851
10866A67652f14j13528p5891l4843k9769a13180o2381B26700c13000C08478A33665
10854B14410c1961I699N3565a45025c5269k67638L0969B18034f2339A68666a67206
$$ y = [165516, -222658, 215253, 218927, -36843, -22347, -221407, 379395, 85815, 54719, 216449, -152007, 403470, 79518, 143042, -11995, 225733, -127614, -189231, -125531, 196095, -239371, -56599, 166801, 107403, 58236, 216017, -471886, -35066, 13477, -240028, 14195, -66400, 87652, 340144, -53654, 196617, -58070, -163242, 130433, -5520, -70986, 203664, 300421, 201005, -35945, 205280, -84869, 128037, -263103, -28708, 213209, 24962, 66154, 30768, -23022, -33786, 44910, 326057, -123473, -102316, -58960, -678468, -134112, -47321, 234969, 95022, 37064, -187811, -101708, 70801, 167652, -614, -114142, -190033, -224876, -254645, -113180, -175561, 226700, -313000, 308478, 133665, 214410, -31961, 9699, 63264, -145025, -35269, -302907, -271938, 218034, -62339, 168666, -167206]
10842A84132a54589B03719a10038L9702G6925a15767j06357i0B4681a08494M8255
10831f0239A76591n6829b83223J03527L1057k20290e7434E5469g2904q2730E3302
10819I931K76640F1222A2d7972g077E0023b29219i3334A10139b18483G6850e146
10806B4952P3870a5556k339B26071c14604g4462a6598C12032b4395H2384m0302
10795D2082b92856A2214K46953H5849a93414B8392J78605F13L5759a65918B34427
10783b04045G5058b8257k33868J30834G8860d26761B35861d9446b0184r5651A08739
10771a31107A445a41413F9159i1271p7059Q0817A36406a41282f4281I8905c27002
10759d9777k09533A40223J31150o0209C6320a12402C44663b38279H4307j11i515
$$ y = [184132, -154589, 203719, -110038, -70336, 76925, -115767, -222124, -90, 24681, -108494, -60239, 176591, 119762, -283223, -179696, -148639, -368929, -57434, 55469, -72904, -155634, 53302, 9931, 286571, 61222, 12, -47972, -7077, 50023, -229219, -93334, 110139, -218483, 76850, -5146, 24952, 98822, -15556, -17895, 226071, -314604, -74462, -16598, 312032, -24395, 82384, 42082, -292856, 12214, 259167, 85849, -193414, 28392, 206997, 613, 36372, -165918, 234427, -204045, 75058, -28257, -262125, -131291, 78860, -426761, 235861, -49446, -20184, -115835, 108739, -131107, 1445, -141413, 69159, -91271, -168330, -87513, 136406, -141282, -64281, 98905, -327002, -49777, -259310, 140223, 271373, 211164, 36320, -112402, 344663, -238279, 84307, 84196, -9515]
10747a64122b0402j20204A84457a43323L998A56226c07229a0716G1374L21284
10737C92658a85728a1655G4370j7296c09248a14908b2076A10404d2329F0572Q8625
10726A49197g6627b3544L00k4619j2285l0493d448l8360j49982h1039j61159b8599
10713A14368b80487e2073i564k23692A67634n9497l5523M9806a72552j52340h8781
10701b13355B30673m8332b31829A16261b16342B28221b5246B20546i7567A75749
10690a56575G3740a90950D2554L28574B6896b50254B9244d42693D4088N2182K83919
10679C80189A02430J12051b24537a0030B7062L57818c27405d9660A62859e5266
10668a03973Q528B66233a67548k13646q3462d9699F1597a06305c468j26185M0659
$$ y = [-164122, -20402, -140606, 184457, -143323, -139325, 156226, -307229, -10716, 71374, 392658, -185728, -11655, 74370, 57074, -309248, -114908, -22076, 110404, -42329, 60572, 149197, -76627, -23544, -23244, -47863, -60148, -90641, -4448, -42808, -192790, -81039, -242198, -28599, 114368, -280487, -52073, -9564, -233256, 167634, 108137, 72614, 122420, -172552, -324892, -88781, -213355, 230673, 182341, -231829, 116261, -216342, 228221, -25246, 220546, -97567, 175749, -156575, 73740, -190950, 42554, 371128, 26896, -250254, 29244, -442693, 44088, 96270, 380189, 102430, 214481, -224537, -10030, 27062, 384880, -327405, -49660, 162859, -55266, -103973, -95445, 266233, -167548, -381194, -464656, -49699, 61597, -106305, -3468, -129653, -88994]
10657h8994K2122j43167A37474f3653I7285b35185A65915a20072L0697A31967
10646a34255j41352i5265a1021k03824A93314E2509J04450a81856b8711B35998
10635A06646c47249d5564k85331i5812b6300A69432D6122d61993a43299C9107
10624a87143q1691E297K32074e3437p0449n319H3767a67060C9693J04630F8466
10612c22622J18323k2362h9411p8514E5389i182m6602J5529k27900B32792a36966
10600g9361j0293F9263i4675b7688m68338K06818B08015d3736G8278c45989F4620
10588b07593A55365a43564k2726j02959g3572A27376a38684B7385b21707h3989
10577A25911B7681E145K61993b39910I9020b54548a19737I3042N8778h9011j05441
$$ y = [-88994, -66872, -210039, 137474, -63653, 97285, -235185, 165915, -120072, -89375, 131967, -134255, -275607, -95265, -11021, -214845, 193314, 52509, 156959, -181856, -28711, 235998, 106646, -347249, -45564, -330895, -95812, -26300, 169432, 46122, -461993, -143299, 39107, -187143, -268834, 5297, 237371, -53437, -123886, -129205, 83767, -167060, 39693, 144323, 68466, -322622, -204299, -226661, -89411, -167925, 55389, -9182, -55784, -40255, -268155, 232792, -136966, -79361, -89654, 69263, -94675, -27688, -496026, -289208, 208015, -43736, 78278, -345989, 64620, -207593, 155365, -143564, -166290, -269249, -73572, 127376, -138684, 27385, -221707, -83989, 125911, 27681, 5145, 267138, -239910, 99020, -254548, -119737, 93042, 151820, -89011, -194452]
10566a94452e748j0065A79017L5974A9670O705f1981E9693c8089n0464m2734H8906
10553h1970k1594A44912b70901J8042R1796e1937j8899j34337A03834h7921A7004
10541A45643o4295b1130j37333C6492A5487b41859A36297e46478f1403n7891k6061
10530a45355k38505E1677a47801n5000A4218h6455C18734a50728D1162J91469
10520B32631b66848c157k30560H4282g9573H9667d8164J7298I7344j6332a01668
10508A64246b77778a37248g655A17560b1688k56760i584o3284b5357A47331g2103
10496b21405d179k40538J07797H4687G076J57473a06449k5757A65266n8757b0179
10484A33758A1813B492K18036j03118P41549A70130O5907b9020k0743l2894b7470
$$ y = [-194452, -5748, -15813, 179017, 214991, 19670, 26375, -61981, 59693, -38089, -88553, -131287, 88906, -81970, -103564, 144912, -270901, -252859, -161063, -51937, -70836, -205173, 103834, -87921, 17004, 145643, 81348, -21130, -158463, 36492, 15487, -241859, 136297, -546478, -61403, -119294, -145355, -383860, 51677, -147801, -202801, 14218, -86455, 318734, -150728, 41162, 232631, -266848, -3157, -233717, 84282, -79573, 89667, -48164, -30866, 97344, 81012, -101668, 164246, -277778, -137248, -7655, 117560, -21688, -278448, -9584, -72868, -25357, 147331, -72103, -221405, -4179, -244717, -136920, 84687, 7076, 164549, -106449, -132206, 165266, 106509, -20179, 133758, 11813, 2492, 220528, 117410, 858959, 170130, 236037, -29020, -49763, -82657, -27470]
10472a06690l3498E0567K526K93282d130F4708J16080o8533L5228n2503R8603
10461A93583b76340A51532d4644j78668J10542J7412k39783A34428e8197k0088
10451g8285K2206A38525b12480p1278J14323f9618A06834i5313L0678A83123a01407
10439d3491H5594b76231o1695B60291J3497e1371A01623b33395e0046A57644C4026
10427c2663q755D1005i4954A73015h8066A28311J45527G4402b55026e0921j03594
10416a54515q7591B56669K11062a49921A24294a40904l4905B35792J13621b10740
10405A10333c12402a37444l6095p7635R2680B43430c39484Q9309a24599c6842
10394B30543d9372A47271J06247O8511p3778G0067O1387B1249P3230J07879b5765
$$ y = [-106690, -140188, 50567, 53093, 346375, -4130, 64708, 180788, 112255, 147483, 94980, 193583, -276340, 151532, -44644, -223312, -112770, -95358, -335141, 134428, -58197, -78285, -56079, 138525, -212480, -283758, -169435, -69618, 106834, -95313, -64635, 183123, -101407, -43491, 85594, -276231, -337926, 260291, 273788, -51371, 101623, -233395, -50046, 157644, 34026, -32663, -41418, 41005, -94954, 173015, -88066, 128311, 273838, 74402, -255026, -50921, -154515, -242106, 256669, 467731, -149921, 124294, -140904, -175809, 235792, 349413, -210740, 110333, -312402, -137444, -173539, -251174, -158494, 243430, -339484, -250175, -124599, -36842, 230543, -49372, 147271, 253518, 322029, 248251, 70067, 131454, 21249, 94479, 202358, -25765]
10382B26102F4433a31121D4150e1564A08606J55290M0637J12423a50962H8473
10371g1272D4416L50251A41640J78195q8755Q5783r3525M30611L4767A05757K03914
10360C09671K9347N3524Q2456j48835C9041b43682A18219J0191K72299K43250
10350F43959j69187K4767R1340B13028L73029G8727L23805j97897K21716j13005
10340C13346I7809K31929m4355B4931L00441K78299A70391i8747L1566F418K61229
10329B67647C6931d0737B80195l1482J7288l6296m0298B9948Q2496J74332r1604
10318A95172d3924I7667J52618j02499k8452C5433Q0484b868A02779b78361B39849
10306C9527d77118K04617A51354c5018j17402K2178B81946A10714a74485E022
$$ y = [226102, 64433, -131121, 44150, -51564, 108606, 263896, 304533, 416956, -150962, 88473, -71272, 44416, 394667, 141640, 319835, 231080, 316863, 223338, 653949, 688716, 105757, 309671, 339018, 392542, 474998, 326163, 39041, -243682, 118219, 128410, 400709, 643959, 474772, 499539, 590879, 213028, 586057, 78727, 402532, 204635, 426351, 313346, 97809, 329738, 285383, 24931, 325372, 603671, 170391, -98747, -67181, 6418, 267647, 36931, -40737, 280195, 248713, 266001, 229705, 189407, 29948, 112444, 286776, 195172, -43924, 97667, 250285, 147786, 119334, 35433, 115917, -2868, 102779, -278361, 239849, 39527, -477118, -272501, 151354, -35018, -152420, -130242, 281946, 110714, -174485, 5022]
10295g4392D1632K8048b70854E2732K30192d19541E4494a6041j23969B44396B1771
10283d6216B53123J4241j12240f7197m9699A4405P6530g0831A37839a24281A6018
10271a22817M177C47975f0496I1141a343l8227k06531A77577E8075J27930C2952
10259D48705I3494M27435E7886L63101K47219I0300p993k9428J39721N8055C6838
10247d1099j02643g0066B9186a22515F5680J49540Q165m2475G9934a78439A92210
10235a66526d0406A68812E1387K1926Q9517d32373I8014i5796j49248l0985A1346
10223a34977r3883J5209g4380b8519l1507n26515A24490c07374J49068B9835h8056
10211F8563g01E5982j7979Q7348A2456J2359J19948c34149B8664N285c23970a25328
$$ y = [-74392, 41632, 69680, -270854, 52732, 282924, -419541, 54494, -16041, -140010, 244396, 21771, -46216, 253123, 267364, 155124, -67197, -116896, 14405, 90935, -70831, 137839, -124281, 16018, -122817, -118640, 347975, -60496, 91141, -1343, -39570, -246101, 177577, 58075, 186005, 32952, 448705, 93494, 520929, 57886, 420987, 668206, 90300, 82307, 52879, 192600, 250655, 36838, -41099, -143742, -70066, 29186, -122515, 65680, 215220, 223385, 180910, 79934, -178439, 192210, -166526, -40406, 168812, 51387, 73313, 162830, -432373, 98014, -95796, -245044, -276029, 11346, -134977, -228860, -213651, -74380, -28519, -60026, -586541, 124490, -307374, -158306, 29835, -88056, 68563, -701, 55982, 38003, 125351, 12456, 24815, 144763, -334149, 28664, 33949, -323970, -125328]
10198A96676J8583a51920c7467n275k54241P1171d8273j53988a1873r6710F5884
10186A39854a897B3556b25612j89799a96314P767K9472e4307q5823B02160b47405
10174A09193a57392D2512b68184J02766A59095i7976j00706K8968c7008j57056
10164a94064F2166a03496k0915j53780G6548e7517k10012L389a03141j1648e3736
10152c6421L922I881b80953A17500n3285a2310r7982o1719A99876C8626b84366
10140A13a46411A16886K4627a83255O8769J9833B8162e2323p5219K089b5856k17513
10128b43369B4781I404J101a4282F943a63001j84958A02379a19655i005B0107
10116a99373K2021K504A22985E3921a2538l874A16372b292k79178I2589b33391
$$ y = [196676, 215259, -151920, -37467, -42742, -296983, -225812, -48273, -202261, -11873, -108583, 65884, 139854, -1897, 23556, -225612, -415411, -196314, -188547, -159075, -54307, -140130, 202160, -247405, 109193, -157392, 42512, -268184, -165418, 159095, -97976, -198682, -169714, -37008, -194064, 62166, -103496, -124411, -278191, 76548, -57517, -267529, -264140, -103141, -114789, -53736, -36421, -32499, 9881, -280953, 117500, 64215, -12310, -110292, -172011, 199876, 38626, -284366, 113, -146411, 116886, 141513, -183255, -114486, -94653, 28162, -52323, -127542, -125453, -25856, -243369, 24781, 9404, 10505, -14282, 6943, -163001, -347959, 102379, -119655, -9005, 20107, -199373, -177352, -174848, 122985, 53921, -12538, -16412, 116372, -2292, -281470, 92589, -233391]
10104a58518A5999a09832A6323c14192c2232n3075k24478a03127B1810c15641
10093a63743m0704h4520D4299b16313C16108A27273b32890A69704K00425b80259
10082b86235e7076k31048R8136B87273A9278d41913C8315c39119G8594M5792D5634
10070b86808B98587b57822i1052H2225b96000B8656b93226a39737B17160G0289
10059E0484a13627d3200C6948A774N2738N2073d815k47749G7360j7233K6940J6331
10047A03398L409M9048d5034m5785i403B38069a16201E0496a56853B2028g1352
10035F9837J97603A2696i1371M170o4085j11183E3297a64782M6382A3351a18309
10023b62089E938J1591a24066j36019j1952i4482d3380j53490E6317a84918F2955
$$ y = [-158518, 15999, -109832, 16323, -314192, -32232, -85307, -309785, -103127, 21810, -315641, -163743, -204447, -84520, 44299, -216313, 316108, 127273, -232890, 169704, 370129, -280259, -286235, -57076, -288124, -189988, 287273, 19278, -441913, 38315, -339119, 78594, 124386, 45634, -286808, 298587, -257822, -91052, 82225, -296000, 28656, -293226, -139737, 217160, 70289, 50484, -113627, -43200, 36948, 1774, 54512, 106585, -4815, -252564, 77360, 60127, 87067, 103398, 106807, 155855, -45034, -90819, -9403, 238069, -116201, 50496, -156853, 22028, -71352, 69837, 267440, 12696, -91371, -87201, -151286, -262469, 53297, -164782, -118400, 13351, -118309, -262089, 5938, 17529, -124066, -260085, -272037, -94482, -43380, -196870, 56317, -184918, 62955]
10011A3132a05597r3224E9424a03181p1335A9544d0459k70566A47453A5613M3821
10000E9434J54246h7747G7684C1935a41368j18620a09483k45306P6584k9352A22556
9988c14095B5335b54897A4633J26619J2950a3651p163J431j41840O3018B40712
9976F3762A4136f7741D00277a89514e5661o3638H8559J3687c79981a73248F9437
9964D3730k1618a98560c2538j39269G8055c7459m3357o5792G7354a35670A65189
9952c03006i6096A77712C4951K1462J60622a69702i477k73202J6273G094J993
9941I087L9837K2636b73710A89803B3948G052c0502k93074P8879c2834j70271
9930b03105d2609k1715k09860e4272R214k4864k05485A151i8463k5978M1113G5468
$$ y = [13132, -105597, -198821, 59424, -103181, -174516, 19544, -40459, -311025, 147453, 15613, 59434, 213680, -87747, 77684, 31935, -141368, -259988, -109483, -354789, -278205, -307557, 122556, -314095, 25335, -254897, 14633, 141252, 154202, -13651, -20814, -19383, -161223, -98205, 240712, 63762, 14136, -67741, 400277, -189514, -55661, -119299, 88559, 102246, -379981, -173248, 69437, 43730, 22112, -198560, -32538, -171807, 78055, -37459, -80816, -146608, 77354, -135670, 165189, -303006, -96096, 177712, 34951, 56413, 217035, -169702, -9477, -282679, -266406, 7094, 9087, 48924, 71560, -273710, 189803, 23948, 7052, -30502, -323576, -244697, -32834, -203105, -42609, -64324, -274184, -54272, -45058, -69922, -275407, 1151, -98463, -124441, -83328, 75468]
9917b16705d3666a7905j65338A24048b74796J8145J9060A28955a68179E4901M5769
9906A00670J3592c8549j08402B37752b12597A38448b79331J10562O9924j88835
9896b87680F6133B1265a7977p5222A7644a25754B26699c62532A10758g3771H1814
9884a12512B29789D0474b34444C0664a29888m370A18273m4476J10521g9788g428
9872C68205m4804a56689K1741A75995a16341B64244c53600a5116F7231d67752
9861C80343c9406j22952c9725B3857d54580a81976Q0371A81557b27744A33577
9850A94389c27809a3931A97486D597M7426g331j92050A0134O6472a56563j38485
9839b95048e1451k3946E7814J01399f3113n9620A6260a99367e4252H9998f6527
$$ y = [-216705, -43666, -17905, -183243, 124048, -274796, -256651, -237591, 128955, -168179, 54901, 100670, 114262, -38549, -146951, 237752, -212597, 138448, -279331, -168769, -98845, -287680, 66133, 21265, -17977, -93199, 17644, -125754, 226699, -362532, 110758, -73771, 81814, -112512, 229789, 40474, -234444, 30664, -129888, -134258, 118273, 73797, 184318, -79788, -7428, 368205, 323401, -156689, -134948, 175995, -116341, 264244, -353600, -15116, 67231, -467752, 380343, -39406, -162358, -39725, 23857, -454580, -181976, -101605, 181557, -227744, 133577, 194389, -327809, -13931, 197486, 4597, 52023, -7331, -199381, 10134, 76606, -156563, -295048, -51451, -75397, 57814, 159213, -63113, -122733, 16260, -199367, -54252, 89998, -66527]
9827h1171o4875B07755d01302d4305k69646e6012j57243A86962G105J57291i8898
9815g5803r1330D289b6107l25152O6096J383F9415A7805f5513j41392i399l44488
9803c53887G0973m752K76886f40982a29589j63407L6664C36724b80924a06792
9792c69634e5325A59605a26402n3571f5515A38639e7718j04416c1416m8088k38145
9781c17649A00982e6460A30410d7331H4609L490a73060B61594A22260E772J79579
9770A85351b22107j46395a78105A45398m9135Q1492l7783A4653b79270B95588
9759A68134c4005k72653a05027G2720k2244e0180q0554j95410i4554j17450j07784
9748c19788A44808g0889B64500J4612b64577c5018A39044c46049P6737K8190r6812
$$ y = [-81171, -146046, 207755, -401302, -44305, -313951, -56012, -213255, 186962, 7105, 164396, -98898, -75803, -167133, 4289, -26107, -351259, -285163, -283780, 69415, 17805, -65513, -206905, -9399, -353887, 70973, 66221, 343107, -640982, -129589, -292996, -256332, 336724, -280924, -106792, -369634, -55325, 159605, -126402, -179973, -65515, 138639, -57718, -162134, -31416, -79504, -317649, 100982, -56460, 130410, -47331, 84609, 88099, -173060, 261594, 122260, 5772, 185351, -222107, -368502, -178105, 145398, 96263, 177755, 139972, 14653, -279270, 295588, 168134, -34005, -306658, -105027, 72720, 50476, -50180, -130734, -326144, -94554, -212004, -319788, 144808, -70889, 264500, 279112, -264577, -35018, 139044, -346049, -269312, -241122, -337934]
9737c37934A47911N9968a89562j89900a38463A06366e7307b3177n7092n7082F6272
9725A39961f8230A14345a53847d1526E9102b16757K2891a5729A25194a6662b289
9713g8205p1702c7208j17166C742a8941A09579b26557e6263K4056A73001a72006
9701B0690L1182I654Q2386J50325i4040l1278k05421a24790g289p0661l61973
9690d39923J28073n2813B91953j40140o9104a33035B2819d1749A61143i9149d1528
9678C52956c5327A9544a44563C05064d88016P3697f7689G8858g6041R421j90630
9667b57250c6025B62109b85027a03214a6797l0510k19385A3546H15K76149c091
9655A38792f5120p8004d0563r4813r5270H9348a52168B42967A7142h7093k61099
$$ y = [-337934, 147911, 207879, -189562, -379462, -138463, 106366, -57307, -23177, -80269, -137351, 66272, 139961, -68230, 114345, -153847, -41526, 59102, -216757, -193866, -15729, 125194, -16662, -2289, -78205, -149907, -37208, -154374, 3742, -18941, 109579, -226557, -56263, -32207, 173001, -172006, 20690, 51872, 9654, 92040, 242365, -94040, -125318, -330739, -124790, -7289, -77950, -439923, -311850, -364663, 291953, 151813, 82709, -133035, 22819, -41749, 161143, -99149, -41528, 352956, -35327, 19544, -144563, 305064, -488016, -414319, -67689, 78858, -76041, -66620, -257250, -36025, 262109, -285027, -103214, -16797, -47307, -266692, 13546, 815, 276964, -3091, 138792, -65120, -143124, -40563, -135376, -230646, 89348, -152168, 242967, 17142, -87093, -348192]
9644c48192a19690e5260m1497j43G3783K9495l7471a47030F2969g1391F1026a45462
9631a39381d9470k89228A29197a82728D1617K35390b2213r0507C9732a19610J8729
9620a00881j9343r3243l1048j350B91328C2642a40926d4206k43041L0128G3182
9608C5508A3213b97957J48325f0929k16380G3639P1229b19436I2843c49467J63191
9597a86276A70114J4128a15006n0984j92709I5545b04103A35728a87886b6986
9586a6390j11029k4158I0092k9124k8940N804M3428f2889c116H3104K6111a28342
9573B50715A17705J4775K36810p2203H4159a08093A30144i802c697A33250a68674
9561F6967R2656c38764r1857K09240R4221A83059a31761B56735f74j93262A3336
$$ y = [-348192, -119690, -55260, -96757, -96900, 73783, 103278, 65807, -147030, 62969, -71391, 61026, -145462, -139381, -49470, -338698, 129197, -182728, 41617, 277007, -22213, -112720, 39732, -119610, -100881, -120224, -213467, -244515, -245865, 291328, 32642, -140926, -44206, -287247, -257119, 73182, 35508, 13213, -297957, -149632, -60929, -277309, 73639, 144868, -219436, 92843, -349467, -186276, 170114, 184242, -115006, -165990, -358699, 95545, -204103, 135728, -187886, -26986, -16390, -127419, -151577, 90092, 60968, 32028, 37832, 81260, -62889, -3116, 83104, 109215, -128342, 250715, 117705, 132480, 369290, 297087, 84159, -108093, 130144, -9802, -3697, 133250, -168674, 66967, 159623, -338764, -430621, -221381, -127160, 183059, -131761, 256735, -674, -193936, 13336]
9549a58871N6320K9422p0829A88420k7679a07974A42728a45987A09069a14214
9538C8482R9284A3436O1158a07525K8658j36881c4768q5982k90603a67644l8629
9527b06273j36510e0408j82565A50651o4756k1483a14208L1780l6599j8481k54136
9516c91644a68162l2922k0414Q1461j16416B67202c13284e6808A74683R0383b92988
9504b33593a01031F7893b24282P6567e0823j48482P1048j69733F9785l0980A6837
9492d2303a8640D6515J34036f8158D23702c77948a3563D6005e8245l57478h2660
9480A21501J59424a15867n259K7559k51150a41236F3624J83048g2415A94945a00135
9468b81801l6674C79071B3929b47268m2372A3375c95973I7110c46975A24463b53527
$$ y = [-158871, -102551, -73129, -143958, 188420, 160741, -107974, 142728, -145987, 109069, -114214, 38482, 137766, 13436, 74594, -107525, -78867, -215748, -34768, -120750, -411353, -167644, -206273, -342783, -50408, -232973, 150651, 85895, 64412, -114208, -82428, -119027, -137508, -391644, -168162, -201084, -221498, -140037, -256453, 267202, -313284, -56808, 174683, 265066, -292988, -233593, -101031, 67893, -224282, -147715, -50823, -199305, -128257, -297990, 69785, 38805, 16837, -42303, -18640, 46515, 180551, -68158, 423702, -377948, -13563, 46005, -58245, -415723, -82660, 121501, 280925, -115867, -121126, -93567, -344717, -141236, 63624, 246672, -72415, 194945, -100135, -281801, -318475, 379071, 23929, -247268, -289640, 13375, -395973, 97110, -346975, 124463, -253527]
9456G271M5239a2901j68042k06599i0562A8908c09550g4801C91101b50378f9545
9444a51680k33972H1875J82487a47515N9949A69749b75856A91029b56967m6511
9434c03478K5508E5656J332d3024A61895m8199l9710a51161H1540D0089J14693
9423A54782b15110D8117N4361c42395C9935A5144c5574D0194i6011r3170B14801
9411c4091j46111B16526p3868J56017b07436B1948N8018L4896b980H2704a03572
9399a88175l05642D3647c1262M771C24069a88518D5414R3211a28363C4084a27033
9387a379j70089b0966r1993H3339a43816f1533B0865a74468A05026a6020j43169
9376a59189k45299d5108C98108b19997A57766b04345g0272C34919a80307e6883
$$ y = [7271, 52510, -12901, -180943, -387542, -90562, 18908, -309550, -74801, 391101, -250378, -69545, -151680, -385652, 81875, 264362, -147515, -87566, 169749, -275856, 191029, -256967, -303478, -277970, 55656, 56988, -43024, 161895, 113696, 73986, -151161, 81540, 40089, 154782, -215110, 48117, 102478, -342395, 39935, 15144, -35574, 40194, -96011, -189181, 214801, -34091, -180202, 216526, 142658, 298675, -207436, 21948, 79966, 114862, -2980, 82704, -103572, -188175, -493817, 43647, -31262, -26491, 324069, -188518, 45414, 138625, -128363, 34084, -127033, -1379, -171468, -20966, -112959, 83339, -143816, -61533, 20865, -174468, 105026, -16020, -159189, -404488, -45108, 398108, -219997, 157766, -204345, -70272, 334919, -180307, -56883]
9365c43409J21353p3085f8531p7353e6225r6806A89645a16803A62106b76025H6355
9353a0001E1432F479J88665e2549a5043a273m8183I1842b81800D7909j5551h053
9340g7374J5144G3934P7959b38299d0940l3038k26218j5437c9013o1070A09023
9328b6813j61642K3508j27667B8254f357A36734a20459j76457F6872k2092L4138
9317G8918k7442L9353a26389A78004a86351I5331f1367b7772E5337L3342b28449
9305h7700k58103A74572n7323a45540d378m1529G5726M453K3483b14616g9646
9293a46098J6928I4176a95932j35010h15m3094H3039a38407N9852l62034A35501
9281a82396a7566k40410H8220b16432o2208J26725d577j99647A34637f939j09549
$$ y = [-343409, -222056, -295141, -68531, -145884, -56225, -153031, 189645, -116803, 162106, -276025, 86355, -10001, 51432, 6479, 195144, -52549, -15043, -1273, -49456, 91842, -281800, 47909, 32358, -8053, -77374, -62230, 73934, 151893, -238299, -40940, -73978, -300196, -315633, -39013, -100083, 109023, -26813, -188455, -164947, -292614, 28254, -6357, 136734, -120459, -296916, 66872, 44780, 78918, 51476, 90829, -126389, 178004, -186351, 95331, -61367, -27772, 55337, 88679, -228449, -87700, -345803, 174572, 117249, -145540, -4378, -45907, 75726, 80179, 103662, -214616, -79646, -146098, -129170, 94176, -195932, -330942, -815, -43909, 83039, -138407, -78555, -440589, 135501, -182396, -17566, -257976, 88220, -216432, -278640, -151915, -4577, -204224, 134637, -6939, -116488]
9270a16488D4676a19814j72277A32494e6517N147A3984P8668k5826b28968K515
9259b26453A78110c60227K2968a19890A26024d22694d2414j9514I2145a13214
9248a2936j05724B77875a67477P2885k63053a02390F8528J49614c21876J03628
9238b18248A71658c31358B2429i3669q1068D99096c99744F9733J20713E6719c82217
9226A4437O8927N5682a22501a805A19041b18262D08709b49507F575a42111a9596
9214b2866j9306D8250i0383C4023b58637A64909b51648A75990b48012B68917a71717
9202b50787a01619A51988C0291P2972L077a66208B35019a26583f3108B06172a51173
9190a78521a1905D77355B03865C988g738q138A21723k2841B6568M2115A3735c58910
$$ y = [-116488, 44676, -119814, -292091, 132494, -56517, -51370, 13984, 92652, 66826, -228968, -226453, 178110, -360227, -337259, -119890, 126024, -422694, -42414, -61928, 92145, -113214, -12936, -118660, 277875, -167477, -94592, -357645, -102390, 68528, 218142, -321876, -218248, 171658, -331358, 22429, -93669, -174737, 499096, -399744, 69733, 190446, 56719, -382217, 14437, 83364, 139046, -122501, -1805, 119041, -218262, 408709, -249507, 6575, -142111, -19596, -22866, -42172, 48250, -90383, 34023, -258637, 164909, -251648, 175990, -248012, 268917, -171717, -250787, -101619, 151988, 30291, 103263, 106340, -166208, 235019, -126583, -63108, 206172, -151173, -178521, -11905, 477355, 203865, 3988, -7738, -15876, 121723, 98882, 26568, 68683, 13735, -358910]
9177a28687A53682K1039g2723c1070j19505D21975i6460j55374O6766M2653a451
9165i5419d230m1419B04445a44376K1812j89779J50519I0308b6129H1438k6358
9154E5080i7934k98195A0544b57610F4738a13879c6504H2679a28579j61335Q850
9143b81064b7508l21143L9501D78058e3807j13615B2598Q8094b0445m5462B52432
9131A79323f13586a13499l3584G6279b05675q845a0089B78213b13183c4215M150
9120c0065n4139k06390B29668E2173a65544j68503b6972j333B83228b28684D4701
9108A47189b990j79710A85734b4892B10231b96832n4403a69787G443N5570a09647
9096D1260J41926k7879E5370J63924l5121H3811a13501L1536H5752h7063I2802
$$ y = [-128687, 153682, 174721, -72723, -31070, -150575, 421975, -96460, -251834, -185068, -142415, -1451, -95419, -4230, -45649, 204445, -144376, -122564, -312343, -161824, 90308, -26129, 81438, 55080, -97934, -396129, 10544, -257610, 64738, -113879, -36504, 82679, -128579, -289914, -281064, -27508, -348651, -309150, 478058, -53807, -167422, 22598, 110692, -20445, -65907, 252432, 179323, -613586, -113499, -147083, 76279, -205675, -214520, -10089, 278213, -213183, -34215, -30065, -84204, -290594, 229668, 52173, -165544, -334047, -26972, -28305, 283228, -228684, 44701, 147189, -2990, -182700, 185734, -24892, 210231, -296832, -351235, -169787, 7443, 63013, -109647, 41260, 183186, 155307, 55370, 219294, 184173, 83811, -113501, -81965, 85752, -87063, 92802]
9084a71233H8412b9221o7819A94929a2418q7501j28027E9225Q1445b34763i7615
9072A7196a23038j38176A1777a0761k90218G0190i3864d893j5596j65723i2346
9060a35171A38147B3764c31595a61246l690e8389n3477p6421B40813l0777i9537
9048C02755a35079B05024a83231b7681A7766J37172a42776F7551j4270b07002
9037b87771g7877L189j56799l2166M969a5767B8127a8516j33420B10996Q702a55897
9024c6568j3829A39949f0573A87425H7155N5859F2982J70097a70056j05813B52701
9012f82A10785a27987k17135L080p6734J28490g6832G221a67054n0192j09086
9001c26332A02379a55967d4406F8178A9816a45875C30921e4430k26432M3788A45649
$$ y = [-171233, 88412, -29221, -97040, 194929, -12418, -99919, -227946, 59225, 140670, -234763, -97615, 17196, -123038, -261214, 11777, -10761, -300979, 70190, -93864, -4893, -20489, -186212, -92346, -135171, 138147, 23764, -331595, -161246, -164936, -58389, -111866, -188287, 240813, 210036, -99537, 302755, -135079, 205024, -183231, -27681, 17766, 154938, -142776, 67551, 53281, -207002, -287771, -77877, -74688, -231487, -263653, -258684, -15767, 28127, -18516, -151936, 210996, 219698, -155897, -36568, -50397, 139949, -60573, 187425, 87155, 143014, 62982, 233079, -170056, -275869, 252701, -682, 110785, -127987, -345122, -342042, -418776, -290286, -76832, 7221, -167054, -217246, -326332, 102379, -155967, -44406, 68178, 19816, -145875, 330921, -54430, -280862, -237074, 145649]
8989B33190B1014a31548A24305a75855i773b046j74615e6126C28830h7263A88430
8977a82079P242A68672j4077a86339j11282C6297b56439A33204b21623B69288
8966C9598L27229A55085a30013l24964d3989D5818b6552k47787n3714A89308B307
8954B39714d546m2609C6095K90162A456P1056b87316c9185A06440L4857j4163
8943A27134l348a30064L9367o3837E7283a88321i651j47112E3856j4248o35Q3201
8931A22174K21067E3217J90190G1506a34042G7181J11554M94721M74521L286731
8921D444708K99415j489944j613273E86766A61071a54943A57082L543j6101b31617
8910a31267p3517B79891J77203a4556A56019b9507B90020A20296J3707a24915
$$ y = [233190, 21014, -131548, 124305, -175855, -9773, -2046, -176661, -56126, 328830, -87263, 188430, -182079, -174837, 168672, 154595, -186339, -297621, 36297, -256439, 133204, -221623, 269288, 39598, 366827, 155085, -130013, -454977, -43989, 45818, -26552, -274339, -328053, 189308, 2307, 239714, -4546, -47155, 36095, 326257, 1456, 72512, -287316, -39185, 106440, 141297, 127134, 123786, -130064, -90697, -154534, 57283, -188321, -9651, -156763, 53856, 39608, 38973, 122174, 343241, 53217, 243407, 71506, -134042, 77181, 188735, 683456, 1157977, 4444708, 4744123, 3254179, 1640906, 586766, 161071, -154943, 157082, 160625, 144524, -231617, -131267, -204784, 279891, 457094, -14556, 156019, -29507, 290020, 120296, 134003, -124915]
8899a85646J0949A66337f7909A09971J41843c12480l9175f1497F0856B8291L2394
8888F0685a14813j8547j3363C61883a54747b5455B15487F1904c57435A89478b04484
8876c5815B74175a31794o2165e9575l33143g9802k05277C11813A21215a10643
8865A52227E379a62122B8112K55742h3009E3466J6717K0667c94232O7640J07204
8854b19388j9137c592k55459O8989R4743C82839p5400A7661a73641m6824a06393
$$ y = [-185646, -174697, 166337, -67909, 109971, 251814, -312480, -351655, -61497, 60856, 28291, 60685, -114813, -133360, -146723, 361883, -154747, -25455, 215487, 61904, -357435, 189478, -204484, -35815, 274175, -131794, -193959, -59575, -392718, -79802, -285079, 311813, 121215, -110643, 152227, 5379, -162122, 28112, 283854, -83009, 53466, 70183, 90850, -394232, -326592, -219388, -238525, -3592, -259051, -190062, -95319, 382839, 307439, 17661, -173641, -220465, -106393]
$$ [...]
##END NTUPLES=NMR SPECTRUM
##END=
