##TITLE=AC1647_HPIAH13380_8569902_iUEoGVkja9
##JCAMPDX= 6.0         $$ Bruker NMR JCAMP-DX V2.0
##DATA TYPE= NMR SPECTRUM
##DATA CLASS= NTUPLES
##ORIGIN= BRUKER
##OWNER= Administrator
$$ 1.72 TOPSPIN		Version 2.1
$$ 2014-04-10 18:33:33.742 -0700  Administrator@X
$$ Compression mode = diff/dup
##.OBSERVE FREQUENCY= 400.02188249412
##.OBSERVE NUCLEUS= ^1H
##.ACQUISITION MODE= SIMULTANEOUS (DQD)
##.ACQUISITION SCHEME= undefined
##.AVERAGES= 64
##.DIGITISER RES= 22
##SPECTROMETER/DATA SYSTEM= spect
##.PULSE SEQUENCE= noesygpps1d.comp
##.SOLVENT NAME= COFFEE_meoh
##.SHIFT REFERENCE= INTERNAL, COFFEE_meoh, 1, 14.96108
##AUDIT TRAIL= $$ (NUMBER, WHEN, WHO, WHERE, PROCESS, VERSION, WHAT)
$$ ##TITLE= Audit trail, TOPSPIN		Version 2.1
$$ ##JCAMPDX= 5.01
$$ ##ORIGIN= Bruker BioSpin GmbH
$$ ##OWNER= Administrator
$$ $$ E:\/data/COFFEE/nmr/AC1647_HPIAH13380_8569902_iUEoGVkja9/12/pdata/1/auditp.txt
$$ ##AUDIT TRAIL=  $$ (NUMBER, WHEN, WHO, WHERE, PROCESS, VERSION, WHAT)
(   1,<2014-04-10 18:33:27.195 -0700>,<Administrator>,<X>,<go>,<TOPSPIN 2.1>,
      <created by zg
	started at 2014-04-10 18:21:57.396 -0700,
	POWCHK enabled, PULCHK disabled,
       configuration hash MD5:
       C8 4E 4E 5D D3 5C D8 9E 9F 52 82 E0 59 8A DE 15
       data hash MD5: 64K
       4C B3 FB 16 34 2E E5 E4 67 FC 93 92 A4 0E 3E 9B>)
(   2,<2014-04-10 18:33:30.632 -0700>,<Administrator>,<X>,<proc1d>,<TOPSPIN 2.1>,
      <Start of raw data processing
       efp LB = 0.3 FT_mod = 6 PKNL = 1 PHC0 = 0 PHC1 = 0 SI = 128K 
       data hash MD5: 128K
       D6 FC CF 39 44 56 CF 71 46 F0 4B B7 9B 58 FD 22>)
(   3,<2014-04-10 18:33:31.913 -0700>,<Administrator>,<X>,<proc1d>,<TOPSPIN 2.1>,
      <pk PHC0 = -83.36426 PHC1 = 0 
       data hash MD5: 128K
       FA D7 36 73 F6 3B 1E A6 90 2A 35 0C 5B E0 C3 93>)
(   4,<2014-04-10 18:33:32.726 -0700>,<Administrator>,<X>,<proc1d>,<TOPSPIN 2.1>,
      <abs ABSG = 1 
       data hash MD5: 128K
       EA 61 3D 40 9B 89 B0 DD 9A EB 66 2A 08 D3 06 9D>)
(   5,<2014-04-10 18:33:32.867 -0700>,<Administrator>,<X>,<proc1d>,<TOPSPIN 2.1>,
      <abs ABSG = 2 
       data hash MD5: 128K
       50 D3 1D 9C B7 F0 8D 78 50 0C 36 42 A7 71 94 7F>)
(   6,<2014-04-10 18:33:32.992 -0700>,<Administrator>,<X>,<proc1d>,<TOPSPIN 2.1>,
      <abs ABSG = 3 
       data hash MD5: 128K
       CC E8 82 34 B7 C4 88 D8 B7 5E 75 18 92 76 9B 90>)
(   7,<2014-04-10 18:33:33.179 -0700>,<Administrator>,<X>,<proc1d>,<TOPSPIN 2.1>,
      <abs ABSG = 4 
       data hash MD5: 128K
       67 69 F8 1F A9 E3 7F BC C5 85 3B 56 6C F2 5B 5E>)
(   8,<2014-04-10 18:33:33.382 -0700>,<Administrator>,<X>,<proc1d>,<TOPSPIN 2.1>,
      <abs ABSG = 5 
       data hash MD5: 128K
       48 51 B5 24 8F B8 39 55 1B 58 F7 FD 5F 2E 29 46>)
$$ ##END=
$$ 
$$ $$ hash MD5
$$ $$ E7 14 E4 0D BD A1 C6 C6 C0 3A B2 D4 95 C0 71 E5
##$RELAX= 
##$RELAX= 
##$RELAX= 
##$RELAX= 
##$RELAX= 
##$RELAX= 
##$RELAX= 
##$RELAX= 
$$ Bruker specific parameters
$$ --------------------------
##$DU= <E:\>
##$EXPNO= 12
$$ [...]
##$TP07= 0
##$TPNAME0= <>
##$TPNAME1= <>
##$TPNAME2= <>
##$TPNAME3= <>
##$TPNAME4= <>
##$TPNAME5= <>
##$TPNAME6= <>
##$TPNAME7= <>
##$TPOAL= (0..7)
0.5 0.5 0.5 0.5 0.5 0.5 0.5 0.5
##$TPOFFS= (0..7)
0 0 0 0 0 0 0 0
##$TUNHIN= 0
##$TUNHOUT= 0
##$TUNXOUT= 0
##$USERA1= <user>
##$USERA2= <user>
##$USERA3= <user>
##$USERA4= <user>
##$USERA5= <user>
##$V9= 5
##$VALIST= <valist>
##$VCLIST= <CCCCCCCCCCCCCCC>
##$VD= 0
##$VDLIST= <DDDDDDDDDDDDDDD>
##$VPLIST= <PPPPPPPPPPPPPPP>
##$VTLIST= <TTTTTTTTTTTTTTT>
##$WBST= 1024
##$WBSW= 4
##$XGAIN= (0..3)
0 0 0 0
##$XL= 0
##$YL= 0
##$YMAX_a= 6323320
##$YMIN_a= -13591978
##$ZGOPTNS= <>
##$ZL1= 120
##$ZL2= 120
##$ZL3= 120
##$ZL4= 120
##$ABSF1= 14.96108
##$ABSF2= -5.597102
##$ABSG= 5
##$ABSL= 3
##$ALPHA= 0
##$AQORDER= 0
##$ASSFAC= 0
##$ASSFACI= 0
##$ASSFACX= 0
##$ASSWID= 0
##$AUNMP= <proc_prof1d_extract.lims>
##$AXLEFT= 0
##$AXNAME= <>
##$AXNUC= <1H>
##$AXRIGHT= 0
##$AXTYPE= 0
##$AXUNIT= <>
##$AZFE= 0.1
##$AZFW= 0.1
##$BCFW= 0
##$BC_mod= 0
##$BYTORDP= 0
##$COROFFS= 0
##$CY= 15
##$DATMOD= 1
##$DC= 0
##$DFILT= <>
##$DTYPP= 0
##$F1P= 0
##$F2P= 0
##$FCOR= 0.5
##$FTSIZE= 131072
##$FT_mod= 6
##$GAMMA= 0
##$GB= 0
##$INTBC= 1
##$INTSCL= 1
##$ISEN= 128
##$LB= 0.3
##$LEV0= 0
##$LPBIN= 0
##$MAXI= 10000
##$MC2= 0
##$MEAN= 0
##$ME_mod= 0
##$MI= 0
##$NCOEF= 0
##$NC_proc= -2
##$NLEV= 6
##$NOISF1= 0
##$NOISF2= 0
##$NSP= 0
##$NTH_PI= 0
##$NZP= 0
##$OFFSET= 14.96108
##$PC= 1
##$PHC0= -83.36426
##$PHC1= 0
##$PH_mod= 1
##$PKNL= yes
##$PPARMOD= 0
##$PPDIAG= 0
##$PPIPTYP= 0
##$PPMPNUM= 2147483647
##$PPRESOL= 1
##$PSCAL= 4
##$PSIGN= 0
##$PYNMP= <proc.py>
##$REVERSE= no
##$SF= 400.020009604383
##$SI= 131072
##$SIGF1= 0
##$SIGF2= 0
##$SINO= 400
##$SIOLD= 131072
##$SPECTYP= <>
##$SREGLST= <1H.CDCl3>
##$SSB= 0
##$STSI= 131072
##$STSR= 0
##$SW_p= 8223.68421052631
##$SYMM= 0
##$S_DEV= 0
##$TDeff= 65536
##$TDoff= 0
##$TI= <>
##$TILT= no
##$TM1= 0
##$TM2= 0
##$TOPLEV= 0
##$USERP1= <user>
##$USERP2= <user>
##$USERP3= <user>
##$USERP4= <user>
##$USERP5= <user>
##$WDW= 1
##$XDIM= 131072
##$YMAX_p= 379319813
##$YMIN_p= -12355
##$CURPLOT= <Network HP LaserJet P1505>
##$CURPRIN= <$Network HP LaserJet P1505>
##$DFORMAT= <normdp>
##$LAYOUT= <+/1D_H.xwp>
##$LFORMAT= <normlp>
##$PFORMAT= <normpl>
##$SURQMSG= 1
$$ End of Bruker specific parameters
$$ ---------------------------------
##NTUPLES= NMR SPECTRUM
##VAR_NAME=  FREQUENCY,     SPECTRUM/REAL,   SPECTRUM/IMAG
##SYMBOL=    X,             R,               I
##VAR_TYPE=  INDEPENDENT,   DEPENDENT,       DEPENDENT
##VAR_FORM=  AFFN,          ASDF,            ASDF
##VAR_DIM=   131072,        131072,          131072
##UNITS=     HZ,            ARBITRARY UNITS, ARBITRARY UNITS
##FACTOR=    0.0627417313425164, 1,          1
##FIRST=     8223.62146879497, 3257,         -62148
##LAST=      0,             5669,            -61321
##MIN=       0,             -12355,          0
##MAX=       8223.62146879497, 379319813,    0
$$ Real data points
##PAGE= N=1
##DATA TABLE= (X++(R..R)), XYDATA
$$ [...]
67712 93998 93074 91206 89311 88233 88217 89040 90301 91574 92454 92649 92077 90936 89650 88733 88619 89438 90766
67695 90766 91704 91593 90737 90089 90072 90096 89540 88770 88664 89351 90075 90296 90336 90800 91782 92895 93751 94245 94658 95662
67675 95662 97848 100933 103669 104938 104925 104880 105674 106845 107210 106272 104807 104037 104345 105009 105114 104474 103567 102851
67657 102851 102458 102389 102656 103187 103832 104548 105357 106144 106690 106929 106881 106348 105052 103206 101595 100798 100616 100530 100454
67638 100454 100610 100886 100863 100588 100735 101744 103127 104030 104322 104704 105722 107049 107916 108091 108137 108743 109964 111233
67620 111233 112090 112752 113857 115654 117643 119228 120582 122476 125111 127463 128172 126986 125050 123811 123871
67605 123871 124815 125717 125726 124536 122556 120472 118564 116683 114898 113722 113427 113525 113283 112454 111172 109488 107564
67588 107564 106010 105347 105180 104612 103482 102491 101994 101508 100785 100551 101412 102598 102729 101647 100583 100449 100806
67571 100806 100824 100504 100359 100394 100139 99585 99398 99996 100863 101123 100596 99955 99900 100466 101206 101819 102377 102988 103451 103431
67551 103431 102985 102755 103403 104759 105744 105430 104116 103045 102954 103319 103239 102677 102271 102175 101771 100720 99658 99434
67533 99434 100063 100868 101438 101919 102453 102894 103176 103520 103963 104031 103220 101728 100351 99653 99492 99401 99169 98834 98284
67514 98284 97262 95873 94841 95022 96642 99067 101226 102254 102022 101321 101389 102825 104931 106385 106656 106437
67498 106437 106654 107493 108628 109938 111432 112700 113034 112258 110982 109922 109310 109180 109815 111421 113453 114757
67482 114757 114633 113557 112640 112488 112849 113265 113709 114357 115075 115500 115589 115659 115839 115791 115157 114030 112851 112052 111926
67463 111926 112543 113537 114227 114259 114031 114242 115147 116435 117629 118308 118178 117351 116509 116397 117194 118636 120571 122884
67445 122884 125045 126358 126769 126859 126908 126579 125759 125070 125092 125550 125784 125689 125691 126053 126716 127594 128454 128608 127332 124710
67425 124710 121689 119235 117712 117027 116869 116781 116437 116044 116122 116724 117246 117251 117156 117773 119309 121129 122406 122792
67407 122792 122520 122065 121762 121603 121370 120956 120481 120102 119818 119647 119873 120925 122855 125015 126426 126553 125740
67390 125740 124818 124337 124338 124780 125810 127364 128865 129722 130032 130344 130808 131028 130819 130583 130678 130844 130622 130098 129868
67371 129868 130444 131906 133954 136006 137447 138130 138534 139126 139747 139923 139667 139456 139484 139387 138853 138089 137530 137380
67353 137380 137612 138117 138679 139019 139010 138679 137968 136827 135649 135148 135538 136199 136555 136964 138211 140290 142276 143476
67335 143476 144215 145372 147482 150407 153506 155958 157252 157662 158038 158923 160027 160798 161254 161897 162894 163748
67319 163748 163896 163414 162932 162953 163366 163633 163397 162820 162298 161950 161570 161082 160797 161061 161814 162626 163127 163243 163097
67300 163097 162878 162776 162908 163297 163964 165000 166467 168298 170332 172327 173849 174419 173981 173075 172279 171638 170955
67283 170955 170421 170434 170791 170673 169656 168344 167712 168191 169660 171899 174574 177026 178630 179446 180141 181191
67267 181191 182405 183212 183193 182355 181203 180508 180769 181786 182968 184002 184949 185756 186099 185901 185625 185763 186263
67250 186263 186736 187052 187419 187947 188452 188705 188640 188275 187640 186846 186074 185476 185202 185481 186444 187771 188836 189426
67232 189426 190076 191390 193144 194459 194862 194774 194784 194854 194599 194028 193515 193157 192705 192212 192232 193111 194441 195541
67214 195541 196204 196662 197048 197262 197254 197068 196715 196332 196397 197380 199142 201022 202567 203861 205115 206331 207528
67197 207528 208929 210612 212204 213193 213416 213080 212466 211849 211549 211789 212471 213267 213936 214498 215126 215948 216858 217508
67179 217508 217641 217535 217901 219144 220859 222258 223026 223525 224241 225254 226246 226832 226847 226530 226408 226880 227850 228931
67161 228931 229965 231130 232488 233713 234454 234899 235679 237182 239031 240351 240547 239788 238777 238160 238184 238806
67145 238806 239877 241167 242328 243020 243109 242767 242443 242677 243724 245266 246652 247524 248080 248656 249310 249996 250899
67128 250899 252247 253885 255433 256813 258225 259576 260388 260515 260601 261465 263220 265313 267282 269080 270690
67113 270690 271886 272598 273220 274238 275621 276859 277618 278123 278785 279638 280374 280831 281221 281781 282404 282772 282781 282687
67095 282687 282857 283463 284418 285534 286680 287835 289039 290318 291672 293040 294227 294940 295096 295089 295509 296576
67079 296576 298052 299756 301740 303772 305038 304941 303965 303253 303367 304086 305384 307830 311591 315651 318679 320417
67063 320417 321707 323342 325423 327721 330016 332026 333521 334705 336053 337594 338834 339603 340497 342141 344443
67048 344443 347034 350037 353758 357795 361206 363635 365651 367777 369783 371285 372543 374199 376466 379027
67034 379027 381542 383874 386022 388192 390764 393783 396584 398400 399304 400066 401177 402586 404401 407108 410757
67019 410757 414574 417896 421065 424728 428593 431599 433382 434947 437627 441706 446269 450194 453116 455544
67005 455544 458256 461628 465490 469545 473695 477941 482220 486504 490848 495154 499133 502756 506466 510589
66991 510589 514821 518790 522914 528087 534443 541056 547001 552238 557272 562471 567956 573697 579394 584637
66977 584637 589456 594367 599604 604781 609686 614943 621304 628550 635738 642394 648883 655683 662869 670366
66963 670366 678150 686065 693869 701647 709820 718619 727919 737690 748192 759464 771009 782273 793185
66950 793185 803986 814832 825845 837260 849117 860957 872289 883349 895023 908007 922293
66939 922293 937478 953150 968869 984140 998787 1013281 1028439 1044710 1061824 1079163 1096476
66928 1096476 1114174 1132898 1152767 1173196 1193558 1213920 1234889 1256824 1279509 1302638 1326203
66917 1326203 1350168 1374124 1397727 1421398 1446058 1472157 1499297 1526944 1555106 1584056 1613729
66906 1613729 1643748 1673898 1704281 1735041 1766221 1797843 1829950 1862600 1896005 1930551 1966400
66895 1966400 2003141 2040107 2076938 2113516 2149531 2184738 2219722 2255724 2293281 2331477 2368981
66884 2368981 2405419 2441236 2476588 2511157 2544901 2578164 2610860 2642220 2671675 2699464 2726042
66873 2726042 2751343 2775041 2797114 2817663 2836498 2853404 2868599 2882311 2894016 2902727 2908177 2911155
66861 2911155 2912496 2912190 2909742 2904933 2897878 2888674 2877466 2864571 2850098 2833535 2814252 2792344 2768587
66848 2768587 2743495 2716877 2688437 2658356 2627040 2594648 2561224 2527012 2492233 2456683 2419995
66837 2419995 2382320 2344353 2306557 2268665 2230179 2191141 2152147 2113666 2075558 2037321 1998718
66826 1998718 1960077 1921992 1884743 1848072 1811548 1775080 1738943 1703330 1668135 1633283 1599095
66815 1599095 1566043 1534226 1503296 1472962 1443274 1414316 1385874 1357722 1330109 1303619 1278469
66804 1278469 1254238 1230403 1206838 1183603 1160530 1137430 1114547 1092333 1070733 1049182 1027465
66793 1027465 1006146 985816 966299 947003 927822 909147 891137 873579 856554 840654 826205
66782 826205 812657 799124 785316 771584 758186 744919 731530 718180 705276 692956 680910
66771 680910 668778 656656 645126 634738 625522 617072 608962 600896 592504 583359 573363 562927 552635
66758 552635 542906 534037 526212 519169 512152 504651 497120 490505 485008 479761 473831 467123 460068 452836
66744 452836 445361 437972 431339 425654 420251 414399 408265 402777 398533 395114 391565 387327 382532 377606
66730 377606 372859 368448 364378 360360 355894 350796 345573 340988 337177 333473 329234 324677 320627 317530
66716 317530 314955 312155 308888 305487 302257 299063 295630 292062 288804 286028 283308 280101 276477 273088
66702 273088 270346 267905 265202 262301 259811 257976 256300 254254 251953 249768 247524 244646 241158 238001
66688 238001 236053 235122 234237 232770 230940 229251 227805 226306 224556 222657 220721 218568 215959 213075 210534
66673 210534 208738 207334 205585 203207 200636 198498 197072 196194 195344 193846 191443 188854 187242 186860 186659
66658 186659 185577 183746 181958 180383 178597 176631 175137 174413 174003 173508 173208 173508 174194 174596 174241 173110
66642 173110 171486 169737 168035 166186 163987 161746 160064 158999 157891 156243 154382 152949 152126 151678 151449
66627 151449 151442 151572 151618 151292 150250 148338 145993 144021 142692 141468 139928 138490 137764 137603 137440 137280 137648
66610 137648 138587 139358 139247 138213 136657 134966 133433 132252 131435 130896 130616 130550 130462 130114 129525 128826 127907 126564
66592 126564 124899 123324 122204 121686 121670 121647 120876 119214 117571 116946 117129 116985 116037 114996 114560 114391 113737
66575 113737 112599 111784 111996 113184 114630 115440 115134 113954 112542 111354 110520 110160 110383 110907 111142 110803 110139
66558 110139 109451 108781 108183 107885 107903 107898 107662 107385 107219 106954 106437 105924 105642 105294 104416 102995 101420 100030 99090
66539 99090 98962 99798 101135 102171 102461 102139 101641 101476 102084 103420 104712 105001 104013 102364 100895 100033 99679
66522 99679 99431 98891 98021 97234 96985 97270 97677 97862 97776 97446 96779 95669 94239 92881 92050 91872 91975 91932 91902
66503 91902 92478 93710 94640 94252 92647 90871 89659 88876 88141 87481 87119 86975 86659 85898 84826 83887 83464
66486 83464 83545 83812 84146 84820 85969 87060 87296 86544 85479 84746 84403 84289 84493 85082 85663 85622 84777 83542
66468 83542 82501 82048 82370 83467 85044 86521 87330 87259 86616 86059 86135 86766 87232 86871 85860 85103 85257 86041
66450 86041 86705 86932 86952 86857 86309 85110 83715 82846 82784 83293 84046 84779 85148 84840 83884 82611 81340 80315
66432 80315 79852 80136 80901 81648 82145 82376 82089 81039 79726 79180 79701 80403 80435 80115 80305 81185 82263 83241
66414 83241 84080 84366 83448 81318 78804 76748 75442 74862 74887 75167 75304 75426 76122 77577 79177 80261 80822
66397 80822 81136 81062 80290 79093 78294 78398 79140 79978 80682 81253 81574 81493 81159 80929 80886 80756 80399 80075 80045 80178
66377 80178 80325 80772 81780 82879 83336 83403 84270 86454 88906 90247 90298 89763 88909 87489 85677 84156 83220
66360 83220 82559 82018 81861 82136 82480 82799 83529 84830 86108 86737 86829 86843 86736 86026 84573 82887 81628 81006
66342 81006 80715 80374 80006 80016 80622 81499 82202 82739 83263 83384 82468 80693 79151 78653 78962 79464 79967 80467 80715
66323 80715 80628 80714 81475 82673 83745 84667 85743 86692 86658 85280 83221 81521 80769 80955 81738 82651 83287 83427
66305 83427 82936 81735 80152 79072 79211 80178 80795 80469 79828 79741 80212 80631 80804 81145 81883 82609 82866 82846 83174
66286 83174 84016 84737 84580 83512 82213 81302 80817 80513 80414 80848 81943 83217 83774 83039 81404 80070 80044 81251
66268 81251 82791 84020 85094 86395 87766 88642 88737 88341 87985 87986 88226 88275 87789 86873 85892 84955 83896 82850
66250 82850 82343 82469 82463 81694 80829 81280 83511 86476 88795 89910 89939 89093 87696 86372 85660 85532 85582 85600 85691
66231 85691 85971 86429 87017 87613 87930 87706 87030 86336 85987 85913 85718 85140 84396 84046 84393 85115 85581 85508 85095 84610
66211 84610 84166 83941 84198 84824 85232 85061 84738 84910 85470 85630 84965 83943 83305 83288 83623 83969 84120 84046 83951 84153
66191 84153 84726 85380 85857 86259 86804 87485 88210 89105 90312 91594 92507 92971 93306 93675 93831 93548 93003 92585
66173 92585 92535 92938 93751 94624 94924 94304 93168 92321 92197 92542 92762 92400 91438 90412 90127 90944 92336 93386
66155 93386 93747 93850 94187 94672 94809 94281 93184 91855 90679 90003 90073 90903 92154 93211 93582 93345 93149 93599
66137 93599 94693 95867 96468 96154 95130 94120 93822 94125 94157 93468 92787 93073 94135 94945 95202 95697 96980
66120 96980 98494 99452 99859 100168 100475 100594 100510 100223 99527 98518 97929 98299 99104 99440 99361 99731 100746 101494 101288
66101 101288 100685 100717 101532 102385 102767 103003 103669 104792 105815 106288 106374 106630 107372 108416 109403 110150 110610 110770
66083 110770 110728 110650 110465 109848 108766 107803 107638 108321 109317 110075 110269 109757 108767 107954 107837 108213 108514 108604 108776
66064 108776 109105 109387 109656 110133 110642 110776 110849 111897 114264 116744 117702 116814 115226 114233 114249 114878 115497 115742
66046 115742 115725 115876 116439 117233 117992 118800 119966 121611 123477 125034 125727 125329 124215 123065 122206 121521 121067
66029 121067 121245 122050 122661 122353 121533 121264 121939 123097 124496 126603 129690 133032 135505 136748 137372 138155
66013 138155 139372 140907 142688 144776 147100 149324 151158 152726 154424 156367 158249 159943 161963 165002
65999 165002 169178 174081 179368 184838 189971 193985 196576 198127 198968 198891 197797 196379 195547 195252 194441 192228
65983 192228 188719 184593 180360 176289 172748 170107 168251 166476 164018 160630 156625 152507 148718 145706
65969 145706 143931 143523 143964 144394 144389 144249 144383 144642 144608 144361 144503 145304 146291 146908 147260 147838 148767 149752 150650
65950 150650 151679 153057 154819 157073 160026 163589 167225 170424 173052 175141 176655 177756 178995 180814
65936 180814 182977 184851 186174 187227 188284 189348 190473 191916 193796 195890 198009 200422 203682 208140
65922 208140 213696 219832 225741 230680 234483 237719 241147 245046 249146 253005 256300 258855 260698 262083
65908 262083 263265 264246 264908 265340 265779 266172 266069 265075 263314 261308 259507 257959 256334 254119 250935 246809
65892 246809 242150 237345 232428 227190 221577 215858 210473 205799 201998 198898 196019 192862 189278 185517
65878 185517 181975 178961 176672 175165 174263 173637 173105 172718 172471 172071 171127 169510 167411 165179 163248 162031
65862 162031 161595 161474 161095 160454 160144 160636 161718 162756 163348 163556 163577 163397 162900 162293 162262 163355 165218 166753
65844 166753 167330 167524 168243 169406 170123 170090 170007 170424 170957 171206 171843 174022 177924 182525 186775 190518 194305
65827 194305 198764 204185 210250 216077 220898 224801 228568 232724 237022 240837 243693 245343 245619 244460
65813 244460 241997 238596 234895 231607 229010 226635 223721 219962 215599 210960 206326 202235 199410 198133
65799 198133 197847 197498 196217 193892 191367 189912 190026 190874 191392 191834 193520 197002 201275 205111 208465 212129
65783 212129 216654 222281 229324 237805 246878 255389 262978 270094 276970 283206 288359 292292 294719 294955
65769 294955 292532 287813 281704 274921 267776 260511 253546 247304 242019 237844 235173 234647 236656 240842
65755 240842 246319 252550 259858 268910 279813 291905 304356 316778 329254 341937 354694 367058
65743 367058 378492 388618 397056 403140 406090 405595 402011 395801 387050 375775 362492 348132 333413
65730 333413 318564 303634 288870 274745 261798 250367 240295 230936 221667 212450 203815 196306
65718 196306 190077 184933 180593 176874 173714 171042 168655 166355 164241 162620 161572 160787 159986 159253 158778
65703 158778 158556 158610 159211 160436 161652 161926 160981 159436 158161 157748 158519 160515 163281 166071 168500 170810
65687 170810 173351 176085 178791 181543 184784 189046 194634 201442 208963 216702 224737 233698 244114 255975
65673 255975 269065 283442 299238 316147 333495 350966 368878 387476 406017 422922 436975
65662 436975 448192 457283 464463 469285 471687 472673 473486 474439 475086 475391 476064 477581 479469 480921 481747 482270
65646 482270 482477 481775 479519 475341 468887 459631 447277 432206 415265 397146 378149 358526 338796
65633 338796 319588 301329 284264 268687 254841 242589 231439 221016 211365 202710 195158 188788
65621 188788 183801 180238 177624 175155 172265 168941 165540 162506 160161 158506 157198 155896 154629 153665
65607 153665 153059 152549 151922 151269 150827 150732 150957 151350 151666 151734 151655 151728 152150 152909 154037 155826 158617 162378 166551
65588 166551 170490 174122 178102 183114 189042 195158 201243 208154 216942 227705 239759 252752 267072
65575 267072 283006 300031 317221 334077 350612 366659 381342 393421 402185 407956 411523 413016
65563 413016 411620 406602 398316 387820 375669 361620 345558 328194 310642 293627 277322 261731
65551 261731 247033 233642 222006 212222 203881 196519 190170 185203 181637 178975 176815 175275 174722 175312
65537 175312 176865 178901 180769 182121 183335 185071 187261 188923 189191 188124 186301 184049 181404 178449
65523 178449 175298 171962 168615 165733 163611 161944 160229 158372 156508 154541 152378 150533 149840 150429 151388
65508 151388 151625 150846 149582 148574 148258 148623 149323 149988 150516 151033 151586 152042 152449 153360 155630 159671 164904
65491 164904 170099 174400 177942 181343 184836 188198 191373 194633 198046 201272 204054 206402 208086 208511
65477 208511 207546 206004 204695 203349 201155 198071 194863 191866 188502 184168 178963 173359 167774 162780
65463 162780 159161 157221 156333 155578 154658 153886 153500 153389 153364 153300 153005 152295 151261 150263 149610 149419 149797 150971
65445 150971 153035 155620 157982 159535 160382 161248 162809 165010 167160 168750 170119 172165 175354 179169 182594
65430 182594 185097 186907 188372 189340 189421 188646 187487 186257 184892 183387 181954 180522 178544 175768 172894
65415 172894 170944 170127 169832 169580 169418 169351 169127 168776 168812 169541 170613 171614 172691 174160 175894 177634 179651
65398 179651 182486 186112 189926 193578 197212 200721 203337 204337 203877 202811 201875 201231 200597 199499 197608
65383 197608 195074 192420 189904 187276 184502 182462 182280 183893 185856 186816 186792 186757 187366 188540 190003 191644
65367 191644 193323 194814 196165 197844 200324 203689 207781 212610 218408 225302 233119 241578 250630 260472
65353 260472 271133 282113 292557 301786 309526 315657 320020 322608 323640 323180 320929 316659 310799 304320
65339 304320 298079 292440 287278 282031 275904 268463 260099 251623 243466 235597 228119 221515 216223 212277
65325 212277 209357 206919 204436 201881 199838 198618 197409 194988 191308 187610 184851 182754 180640 178393
65311 178393 176212 174163 172471 171597 171513 171539 171447 171965 173494 175117 175832 176153 177347 179538 181843 184194 187651
65294 187651 192626 197939 202080 204600 205870 206233 205897 205143 204208 203246 202468 201899 201032 199371 197342 195907
65278 195907 195123 193975 191908 189653 188091 187080 186053 185051 184418 184001 183443 182908 182827 183199 183771 184610 185840
65261 185840 187008 187461 187310 187395 188272 189687 191081 192124 192730 192907 192675 191926 190419 188162 185589 183039
65245 183039 180270 176955 173503 170830 169309 168417 167501 166513 165874 165988 166956 168509 170048 170990 171161 170853
65229 170853 170546 170676 171380 172177 172164 170956 169303 168302 168111 167972 167419 166819 166608 166646 166608 166520 166560 166695 166873
65210 166873 167304 168222 169527 170946 172323 173570 174533 175148 175570 175945 176255 176550 177016 177551 177584 176743 175543
65193 175543 174890 174997 175214 175041 174825 175208 176218 177241 177744 177783 177803 178145 178746 179195 179109 178553 178125 178471 179688
65174 179688 181264 182632 183675 184571 185318 185703 185728 185819 186403 187475 188792 190360 192409 194932 197553 199975
65158 199975 202306 204839 207736 211081 214954 219198 223324 227008 230631 234989 240508 247099 254834 264271
65144 264271 275843 289254 303834 319264 335487 352025 367939 382644 396489 410334 424774
65133 424774 439751 454492 467635 477924 485287 490974 496186 500715 503368 503523 501594 498048 492803
65120 492803 485885 477887 469131 458860 445962 430311 412833 394484 375869 357760 341097 326109
65108 326109 312076 298411 285553 274304 264604 255589 246798 238744 232143 227010 222727 218712 214722
65095 214722 210783 207191 204492 203019 202358 201598 200331 199161 198943 199751 200888 201776 202351 202622 202392 201658
65079 201658 200847 200255 199527 198139 196272 194812 194454 195132 196292 197401 198144 198493 198745 199223 199816 200011 199582
65062 199582 199005 198984 199676 200621 201397 202095 203032 204121 204757 204455 203483 202613 202190 201733 200651 199086 197736 197013
65044 197013 196797 196903 197256 197548 197214 196008 194206 192054 189453 186442 183567 181282 179284 176935 174139
65029 174139 171363 168916 166795 165168 164440 164710 165616 166874 168546 170611 172709 174536 176120 177474 178315
65014 178315 178483 178378 178610 179474 181050 183530 186916 190578 193672 196069 198461 201459 204999 208667 212126
64999 212126 215042 217080 218331 219394 220687 221909 222559 222717 222867 223139 223348 223768 225229 228120 231791 235304
64983 235304 238418 241405 244145 245997 246596 246290 245554 244348 242356 239668 236871 234395 232056 229343 226062
64968 226062 222573 219369 216545 213799 210966 208426 206789 206134 205792 205010 203696 202272 200906 199258 197054
64953 197054 194593 192432 190764 189419 188364 187890 188209 189102 190040 190517 190218 189157 187808 186955 187196 188505
64937 188505 190305 191900 192898 193404 193893 194707 195599 195952 195526 194745 194084 193442 192427 190995 189484 188132 187028
64920 187028 186477 186962 188623 191091 193933 196913 199742 201940 203216 203751 204004 204522 206033 209233 214111
64905 214111 219787 225410 231058 237407 244744 252704 260834 268915 276750 284183 291457 299145 307448 315789
64891 315789 323259 329295 333835 337068 339250 340619 341228 340888 339332 336414 332151 326723 320487 313859 307121
64876 307121 300447 294129 288583 284065 280546 277948 276230 275126 274032 272432 270344 268195 266319 264733
64862 264733 263203 261304 258549 254782 250425 246107 242042 238007 233841 229662 225571 221477 217391 213649
64848 213649 210618 208368 206787 205833 205487 205554 205703 205643 205167 204156 202746 201386 200531 200277 200421 200745 201117
64831 201117 201447 201827 202622 204151 206323 208820 211601 214898 218737 222817 226978 231450 236505 242121 248137
64816 248137 254529 261402 268957 277538 287364 298086 308940 319437 329456 338429 344989 347997 347588
64803 347588 344689 339838 333131 325117 316951 309548 303064 297169 291313 284785 277251 269416 262626 257619
64789 257619 254151 251872 250787 250598 250375 249508 248464 248133 248808 250340 252791 256260 260350 264460 268514
64774 268514 272909 277948 283861 291166 300263 310610 320916 330355 339208 348241 357758 367385 376456 384501
64760 384501 391619 398364 405060 411322 416548 420745 424425 427746 430212 431275 430804 428819 425242 420078
64746 420078 413478 405436 395796 384812 373324 362055 350935 339500 327911 317301 309008 303545
64734 303545 300286 298097 296196 294373 292569 290677 288951 288196 288995 290868 292698 294039 295562 298182 302162
64719 302162 307171 312762 318564 324298 329795 334745 338475 340376 340656 340187 339425 337857 334692 329648 322833
64704 322833 314458 305116 295944 287906 281049 274803 268809 263123 257888 253261 249510 246730 244648 243101
64690 243101 242533 243488 245677 248123 250342 252959 256886 262193 267988 273366 278406 284275 292225 302350
64676 302350 313470 324396 335006 345745 356282 365260 371420 374483 374847 372892 368889 363270 356632
64663 356632 349515 342285 335166 328275 321768 316005 311377 307912 305254 303164 301854 301690 302675 304441 306684
64648 306684 309430 312887 317182 322355 328542 335943 344534 353931 363857 374668 387013 400726 414471
64635 414471 426907 437900 448009 456962 463434 466570 466981 465750 462937 457707 449694 439553 428228
64622 428228 416242 403856 391392 379098 367020 355298 344358 334508 325536 317020 308996 301978
64610 301978 296352 292033 288749 286307 284437 282747 281132 280016 279820 280415 281477 283295 286611 291560 297281
64595 297281 302857 308257 314002 320289 326940 333983 341666 349927 358353 366751 375357 384339 393463 402332
64581 402332 410567 417678 423190 427244 430620 433695 435583 434812 430818 424525 417458 410569 403802 396361
64567 396361 387332 376390 364134 351622 339587 328237 317660 308000 299159 290849 283215 277051 272954
64554 272954 270507 268647 266693 264589 262293 259566 256547 254070 253019 253552 255087 256885 258511 260011
64540 260011 261840 264358 267189 269341 270237 270304 270203 269789 268410 266084 263696 261886 260349 258548 256670
64525 256670 255452 255305 255999 257063 258161 259131 260011 261083 262722 265081 267935 270831 273430 275820 278487
64510 278487 281874 286014 290829 296704 304311 313653 323719 333492 343071 353285 364251 374761 383183
64497 383183 388654 391251 391356 389204 385045 379428 373068 366417 359562 352707 346582 342059 339296 337571
64483 337571 336107 334831 334141 334139 334335 333998 332594 329993 326424 322223 317597 312794 308409 305122 302977 301377
64467 301377 300024 299416 300050 301607 303465 305583 308134 310530 311711 311459 310709 310340 310254 309844 308796 307159
64451 307159 305154 303252 302034 301653 301724 301992 302713 304147 306105 308343 311035 314476 318643 323452 329199
64436 329199 336273 344627 353986 364509 376813 391350 408123 427022 448144 471700 497935 527289
64424 527289 560569 598925 643774 696662 758985 831684 915133 1009196 1113114 1225098 1342018
64413 1342018 1459808 1574746 1684669 1788711 1885597 1972522 2046146 2104359 2146437 2171801
64403 2171801 2179765 2170726 2146388 2108051 2055440 1988031 1906936 1814595 1713108 1604026 1489632
64392 1489632 1373408 1258999 1149340 1046723 952750 867981 792269 725701 668582 620372
64382 620372 579430 544252 514364 489618 469192 451797 436479 422781 410465 399555 390354 382885
64370 382885 376405 369768 362224 353799 345226 337634 331758 327110 322335 316775 311209 306679 303213 300400
64356 300400 298596 298504 299842 301608 303791 307650 313816 321050 327532 332670 336878 340110 341590 340937 338707
64341 338707 335679 332163 328219 324052 319834 315441 310760 306168 302402 299907 298440 297405 296488 295941 296267
64326 296267 297741 300212 303301 306696 310233 313794 317166 320030 322083 323220 323599 323508 323186 322764 322235 321346
64310 321346 319574 316449 311994 306742 301277 295833 290357 284769 279083 273453 268176 263590 259836 256846
64296 256846 254614 253240 252567 251969 250896 249599 249002 249738 251570 253869 256463 259730 263970 269024 274664
64281 274664 281147 289040 298410 308402 317880 326497 334914 343874 353200 361822 368673 373410 376407 378290
64267 378290 379529 380284 380455 379906 378747 377466 376744 376949 377680 377892 376749 374323 371202 367422 362241 355265
64251 355265 347305 339570 332223 324388 315608 306673 298744 292244 286905 282463 278789 275636 272833 270699
64237 270699 269788 270094 270862 271306 271352 271586 272597 274428 276523 278142 278915 279027 278859 278476 277620 276216 274750
64220 274750 274011 274354 275174 275272 273906 271446 268807 266338 263694 260796 258323 256903 256307 255938 255753 256011
64204 256011 256401 256234 255610 255615 257123 260002 263752 268333 273914 280320 287315 295158 304343 314946 326652
64189 326652 339289 352870 367224 381916 396464 410189 421955 430510 435191 436086 433631 428433 421309
64176 421309 412890 403127 391709 379069 366422 354563 343166 331689 320511 310626 302450 295489
64164 295489 289149 283420 278691 275207 272816 271044 269385 267698 266344 265819 266327 267872 270537 274327 278796
64149 278796 283267 287493 291801 296446 301141 305363 308810 311338 312681 312609 311225 308920 306077 303065 300384
64134 300384 298497 297487 297083 297074 297490 298306 299215 299912 300588 301958 304657 308647 313328 318265 323661 329987
64118 329987 337245 344970 352928 361460 370886 380894 390809 400244 409078 416925 423145 427546 430729 433540
64104 433540 436395 439233 441920 444498 447145 450079 453462 457303 461401 465342 468537 470374 470558 469213
64090 469213 466572 462728 457936 452851 447937 442734 436320 428657 420862 413895 407564 401285 395251 390164
64076 390164 386075 382210 377964 373555 369643 366740 364954 363909 362852 361241 359283 357607 356444 355503
64062 355503 354594 353861 353341 352839 352458 352721 353857 355375 356763 358342 360995 365215 370740 377113 384215 392219
64046 392219 401213 410974 421133 431634 442978 455743 469714 483714 496462 507441 516795 524630
64034 524630 530759 535013 537496 538479 538225 536910 534676 531792 528824 526447 524919 523827 522464 520331 517182
64019 517182 512897 507629 501868 495979 489742 482709 475007 467368 460263 453359 446076 438440 431114 424722
64005 424722 419313 414481 409852 405472 401797 399252 397777 396857 396133 395910 396947 399709 403885 408611 413109
63990 413109 417121 420858 424664 428780 433338 438465 444264 450743 457777 465226 473104 481603 490889 500860
63976 500860 511207 521825 533100 545602 559398 573793 587955 601824 616323 632608 651174
63965 651174 671781 694149 718474 745128 774080 805015 838098 874311 914880 960648 1012295
63954 1012295 1070899 1137873 1214455 1301726 1401192 1514851 1644496 1791266 1955996 2139517
63944 2139517 2342163 2563216 2801243 3054818 3322442 3601689 3888772 4179024 4467509
63935 4467509 4749027 5017826 5267788 5493076 5688648 5850290 5974520 6058691 6101129 6100931
63925 6100931 6057690 5971760 5845025 5681125 5484696 5260572 5013963 4750902 4477696 4199719
63915 4199719 3921189 3646021 3378182 3120954 2876594 2647117 2434777 2241155 2066230
63906 2066230 1909069 1769055 1645718 1537690 1442834 1359518 1286925 1223969 1168757 1119557
63896 1119557 1075612 1036439 1000852 967409 935659 906331 880175 856980 835780 815751 796828
63885 796828 779611 764683 751977 740856 730972 722915 717785 716127 717500 721212 727276 736416 749134
63872 749134 765025 783171 803107 825157 849817 877069 906466 937624 970332 1004229 1038702
63861 1038702 1073119 1106948 1139621 1170486 1198916 1224365 1246323 1264475 1278866 1289655 1296707
63850 1296707 1299642 1298248 1292431 1281735 1265489 1243772 1217806 1188900 1157252 1122384 1084671 1045692
63838 1045692 1006788 967784 927691 886409 845224 805624 768133 732526 698707 666966 637505
63827 637505 610221 584984 561779 540491 520871 502851 486501 471497 457059 442889 429833
63816 429833 419050 410578 403270 396146 389229 382921 377183 371784 366959 363222 360595 358410 355963 353059
63802 353059 349843 346327 342302 337752 333143 329077 325534 321752 317168 312385 308710 306552 304749 301890
63788 301890 298043 294700 293029 292663 292346 291370 290033 288850 287808 286546 285048 283807 283243 283187 283042 282392
63772 282392 281309 280154 279240 278670 278399 278377 278647 279213 279852 280246 280318 280208 279819 278810 277331 276300 276410 277146
63754 277146 277474 277350 277685 278767 279632 279421 278594 278220 278665 279580 280776 282371 284349 286578 289132 292074
63738 292074 295115 297962 300744 303530 305801 307142 308240 310251 313201 316024 318335 321129 325263 330179
63724 330179 334841 339203 343906 349020 354046 358898 363990 369278 373984 377421 379557 380680 381007 380769 380162
63709 380162 379024 376990 374168 371284 368940 367083 365449 364127 363365 363108 363092 363233 363627 364351 365524 367345
63693 367345 369722 372067 373866 375308 376982 379017 380952 382381 383282 383719 383716 383580 383846 384640 385418 385589 385149
63676 385149 384554 384271 384591 385518 386582 387129 387088 387155 387910 389127 390326 391604 393354 395431 397192 398203 398309
63659 398309 397160 394427 390487 386227 382010 377506 372725 368448 365260 362805 360492 358379 356753 355277
63645 355277 353332 351086 349525 349373 350430 351996 353518 354830 356209 358338 361861 366770 372353 377782
63631 377782 382679 387191 391766 396862 402630 408850 415263 421909 429018 436780 445507 455796 468064 481917
63617 481917 496429 511154 526494 543047 561073 580839 602963 627839 654863 682778 710817
63606 710817 739068 767459 794745 818983 838963 854766 866765 874568 877509 876025 871836 866560
63594 866560 860626 853820 846196 837804 827957 815753 801330 785818 769885 753011 734493 714510
63582 714510 693838 673127 653000 634303 617578 602574 588959 577281 568516 562701 558728 555570
63570 555570 553118 551708 551432 552227 554077 556719 559570 562406 565844 570709 577081 584306 591816 599609 608078
63555 608078 617820 629586 644069 661627 682413 706622 734342 765256 798798 834492 871612 908476
63543 908476 942603 971864 995233 1012373 1023032 1027264 1025884 1020256 1011730 1001537 990927 980900
63531 980900 971789 963306 954857 945531 934077 919434 901279 879774 855000 827232 797662 768061
63519 768061 739406 711356 683374 655853 629781 605728 583703 563654 545555 529128 514025
63508 514025 500296 488275 478024 469228 461602 454918 448648 442111 435270 428966 424042 420414 417297
63495 417297 414126 410971 408220 406215 405101 404644 404192 403215 402040 401674 402684 404555 406500 408594 411582
63480 411582 415678 420179 424446 428668 433281 438059 442255 445443 447692 449001 449111 447962 445921 443378
63466 443378 440413 437015 433397 429906 426792 424166 422086 420576 419646 419194 418841 418089 416962 416342 417173 419369
63450 419369 421978 424448 427243 431068 436085 442148 449250 457361 466256 475933 486839 499340 513441
63437 513441 529514 548757 572161 599130 627699 655928 682581 706816 728217 747174 764308
63426 764308 779206 790533 797905 803171 809275 818154 830154 845059 863013 884438 909538 937943
63414 937943 968479 999195 1027904 1052910 1073175 1087903 1096392 1098575 1095531 1089115 1080940 1071833 1062107
63401 1062107 1051939 1041209 1029233 1015041 997943 977643 954074 927546 899044 869803 840436
63390 840436 810909 781515 753275 727032 702641 679552 657798 637879 620005 604090 590338
63379 590338 579148 570515 564079 559794 557918 558278 560095 562764 566378 571386 578115 586749 597360 609780
63365 609780 623779 639446 657083 676714 698197 721847 748346 777749 809139 841551 874732
63354 874732 908552 942068 973671 1001938 1025955 1045074 1058894 1067451 1071117 1070408 1066071 1059115 1050356
63341 1050356 1040033 1028198 1015214 1001407 986348 969123 949481 928139 905642 881388 854438
63330 854438 825176 795558 767515 741558 717373 695350 676838 662864 653229 647033 643335 640804
63318 640804 637375 631287 622412 611836 600126 586691 571010 553771 536456 520266 505699 492670
63306 492670 480640 469046 457970 448102 439844 432856 426710 421518 417480 414232 411161 408062 405067
63293 405067 402210 399548 397384 395781 394043 391271 387465 383576 380468 378275 376786 375944 375796 376262 377092
63278 377092 377932 378376 378190 377501 376651 375896 375382 375279 375690 376520 377627 378975 380491 381997 383521 385387 387657
63261 387657 389765 391237 392520 394511 397314 400120 402439 404816 408037 412070 416198 419945 423550 427629
63247 427629 432546 438071 443660 449135 455022 461996 470183 479347 489650 501614 515180 529381 543321
63234 543321 557167 571848 588096 606028 625441 646053 667563 689769 712551 735543 758001
63223 758001 779361 799873 820371 841338 862421 882895 902399 921222 940042 959456 979517
63212 979517 999569 1018564 1035614 1050121 1061429 1068660 1071150 1068980 1062767 1052901 1039266 1021809
63200 1021809 1001085 978018 953357 927750 902239 878082 855937 835601 816887 800399 787090
63189 787090 777304 770715 767133 766866 770196 776876 786333 798116 811922 827378 844034 861563 879850
63176 879850 898824 918270 937867 957408 976870 996076 1014371 1031008 1045995 1060198 1074216
63165 1074216 1087393 1098303 1106040 1110563 1111876 1109525 1103038 1092366 1077662 1058978 1036459 1010512
63153 1010512 981622 950366 917829 885531 854487 824641 795660 768035 742793 720243 699727
63142 699727 680744 663703 649176 636904 626102 616500 608482 602186 597007 592255 587913 584406 581844
63129 581844 579955 578684 578421 579479 581646 584435 587571 591060 594973 599418 604564 610436 616732 623054
63115 623054 629189 634910 639663 642890 644767 646278 648342 651040 653784 655974 657286 657585 656911 655575 654044
63100 654044 652649 651456 650372 649264 648004 646542 644941 643301 641684 640208 639166 638865 639292 640086 640958
63085 640958 642015 643450 644967 645835 645717 645276 645695 647630 650835 654710 658833 662914 666670 670110 673748
63070 673748 678222 683841 690731 699228 709699 721962 735291 749157 763690 779353 796495 815434
63058 815434 836726 860967 888306 918339 950513 984538 1020441 1058413 1098762 1141961 1188539
63047 1188539 1238724 1292141 1347866 1404709 1461450 1517028 1570973 1623669 1675828 1727480 1777781
63036 1777781 1826145 1873121 1919644 1965626 2009972 2051938 2091682 2129142 2162995 2191310 2212858
63025 2212858 2227194 2233701 2231318 2219356 2198015 2167854 2129218 2082630 2029496 1971911 1911811 1850609
63013 1850609 1789585 1730142 1673474 1620366 1571623 1528402 1491756 1462018 1439018 1422794 1413662
63002 1413662 1411622 1416101 1426389 1441899 1461887 1485325 1511374 1539780 1570648 1603983 1639457 1676253
62990 1676253 1713128 1749088 1784147 1818953 1853491 1886755 1917895 1946840 1973189 1995247 2011038
62979 2011038 2019818 2021729 2016446 2003269 1982348 1954591 1920255 1878754 1830190 1776158 1718625 1658858
62967 1658858 1597837 1536828 1476878 1418322 1361392 1306800 1255179 1206442 1160274 1116904 1076798
62956 1076798 1039949 1005978 974607 945459 917716 890678 864556 840174 817970 797650 778618
62945 778618 760282 742145 724172 707040 691562 677922 665853 655365 646685 639541 633098 626744
62933 626744 620473 614417 608513 602822 597720 593467 589879 586690 583963 581825 579996 577904 575255 572242
62919 572242 569159 565999 562594 559073 555926 553491 551487 549302 546733 544196 542115 540428 538822 537206
62905 537206 535628 533971 532086 530185 528731 527817 526881 525243 522946 520913 520133 520580 521140 520834 519962 519653
62889 519653 520348 521267 521513 521124 520682 520402 520173 520115 520470 521086 521576 521971 522696 523875 525077 525862 526195 526223 525976
62870 525976 525391 524373 522754 520421 517612 514891 512713 511124 509860 508683 507646 507141 507596 509028 510988
62855 510988 513041 515083 517092 518860 520223 521326 522404 523456 524410 525301 526024 526194 525639 524791 524156 523671
62839 523671 523029 522350 521965 521738 521251 520566 520134 519976 519596 518799 517978 517506 517395 517675 518527 519922 521608 523586
62821 523586 526067 528900 531629 534293 537509 541505 545652 549295 552509 555759 559316 563357 568116 573485
62807 573485 578902 584023 589131 594534 600064 605556 611340 617738 624456 631037 637655 644941 653224 662371
62793 662371 672225 682854 694598 708152 724272 743082 764091 787285 813720 844552 879981 919717
62781 919717 963996 1013291 1067384 1125641 1187951 1254476 1324553 1396798 1470416 1545514 1621978
62770 1621978 1698787 1774536 1847610 1915566 1975339 2024791 2063441 2091186 2106985 2109505 2098505
62759 2098505 2074804 2039301 1992902 1937175 1874152 1805362 1731733 1654602 1576154 1498515 1422827
62748 1422827 1349536 1279198 1212560 1150024 1091465 1036723 986026 939763 897987 860325 826375
62737 826375 796027 769299 745996 725628 707564 691163 675973 662037 649846 639650 630956 623139
62725 623139 616495 612037 610069 609550 609285 609238 610144 612242 615125 618735 623785 631025 640525 651825 664409
62710 664409 678011 692866 709830 729812 752948 778689 806810 837869 872442 910412 951427
62699 951427 995638 1043462 1094867 1149536 1207617 1269670 1335772 1405153 1476831 1550025 1623642
62688 1623642 1695741 1763894 1825928 1880119 1924954 1959106 1981545 1991372 1987733 1970306 1939968 1898627
62676 1898627 1848241 1790164 1725468 1655594 1582421 1507810 1433265 1360036 1289288 1222013 1158728
62665 1158728 1099376 1043609 991257 942560 897965 857715 821600 789021 759294 732034 707313
62654 707313 685346 666035 648952 633793 620467 608549 597021 585112 573244 562602 553689 545905
62642 545905 538750 532799 528968 527223 526630 526518 526895 527677 528160 527600 525980 523878 521831 520024 518381 516618
62626 516618 514345 511475 508546 506312 504950 503883 502543 501133 500447 501043 502766 505041 507412 509767 512224
62611 512224 515023 518452 522689 527678 533294 539562 546596 554304 562493 571351 581589 593799 607866
62598 607866 623312 640177 659135 680732 704957 731757 761530 794602 830351 867353 904510
62587 904510 941680 979023 1015945 1050941 1082384 1109235 1131042 1147478 1158074 1162374 1160227 1151864
62575 1151864 1137661 1117927 1093047 1063849 1031659 997864 963377 928558 893575 858795 824900
62564 824900 792710 762854 735524 710545 687771 667317 649274 633239 618403 604241 590969
62553 590969 579205 569284 561046 554130 548190 542840 537737 532976 529259 527347 527150 527461 526821 524807 522479
62538 522479 521412 522241 524163 525844 526586 526534 526094 525596 525478 526332 528489 531840 536277 542083 549584 558691
62522 558691 569242 581676 596814 614774 634568 655078 676188 698742 723684 751627 783032
62511 783032 818188 856863 898280 941651 986509 1032450 1078819 1124765 1169377 1211509 1249716
62500 1249716 1282763 1310223 1332303 1349085 1360314 1366203 1368216 1368613 1369064 1369933 1371074 1373099 1377499
62487 1377499 1385558 1397579 1413386 1433163 1457172 1484659 1513528 1541323 1566349 1587724 1604717
62476 1604717 1616361 1621499 1618892 1607373 1586290 1555929 1517428 1472238 1421620 1366462 1307355 1244938
62464 1244938 1180348 1115287 1051578 990717 933865 881894 835106 793102 755249 721270 691190
62453 691190 664956 642461 623718 608545 596224 586006 577921 572487 569617 568408 568094 568586 569844
62440 569844 571531 573716 577215 582469 588473 593567 597074 599459 601027 601343 600122 597920 595429 592444
62426 592444 588081 581911 574559 567120 560220 553750 547381 541035 534782 528486 521942 515309 509104 503651
62412 503651 498824 494456 490701 487768 485556 483788 482283 480864 479257 477330 475242 473202 471349 470107
62398 470107 470266 472288 475744 479790 483925 487901 491315 493951 496334 499262 502754 506050 508692 511130
62384 511130 514196 518478 524234 531425 539652 548407 557410 566436 575006 582797 590265 598252 607013 616252
62370 616252 626066 636988 648968 661233 673572 687006 702700 720919 741615 765375 792982 824439
62358 824439 859204 897158 938656 983749 1031890 1082222 1133545 1184068 1231828 1275447 1314107
62347 1314107 1346877 1372640 1390864 1402025 1407040 1406510 1400603 1389459 1373479 1353252 1329262 1301732
62335 1301732 1270911 1237561 1202935 1168160 1133807 1100197 1067828 1037226 1008529 981460 955626
62324 955626 930705 906552 883263 860888 838917 816447 793174 769897 747761 727271 708376
62313 708376 691045 675197 660419 646412 633605 622665 613445 605070 597119 590127 584791 581179 578885
62300 578885 577448 576456 575632 575100 575230 576085 577298 578609 580132 581985 584107 586589 589750 593495 597005
62285 597005 599509 601199 603018 605613 608758 611707 613829 614967 615515 616175 617464 619354 621433 623401 625370
62270 625370 627805 631374 636848 644951 656070 670089 686538 705034 725647 748946 775700 806522
62258 806522 841640 880878 923930 970797 1021831 1076977 1134834 1192749 1247998 1298815 1344308
62247 1344308 1383982 1417648 1445368 1466898 1481377 1488004 1486865 1478652 1463845 1442815 1416488 1386073
62235 1386073 1352035 1314183 1273116 1230834 1189377 1149391 1110546 1072883 1037002 1003261 971549
62224 971549 941874 914487 889232 865324 842104 819728 798797 779476 761298 743788 727005
62213 727005 711346 697015 683916 672013 661484 652350 644216 636703 629970 624424 619965 615999 612349
62200 612349 609690 608803 609738 612007 615320 619682 625008 631174 638370 646860 656313 665882 675167 684663 694915
62185 694915 705537 715560 724633 733365 742437 751763 760808 769331 777425 784955 791482 796887 801815 807361
62171 807361 814556 824301 837524 855017 877050 903262 932888 965002 998730 1033507 1069107 1105181
62159 1105181 1140675 1173911 1203257 1227676 1246688 1260072 1267780 1269978 1266987 1259148 1246755 1230082
62147 1230082 1209447 1185260 1158062 1128586 1097782 1066676 1036027 1006123 977185 949959 925592
62136 925592 904724 886994 871658 858411 847236 837719 829087 820972 813790 808203 804418 802010 800227
62123 800227 798530 797123 796956 798924 803017 808447 814526 821202 828858 837959 848846 861422 874894 888052
62109 888052 899826 909438 916216 919804 920555 919344 916973 914154 911889 911088 911639 912470 912786 912697 912399 911477
62093 911477 909596 907361 905846 905560 906447 908648 912616 918539 926096 934803 944276 954231 964593 975575
62079 975575 987393 1000046 1013640 1028671 1045547 1063931 1082986 1102294 1122141 1142815 1163976
62068 1163976 1184808 1204695 1223755 1242864 1262971 1284145 1305394 1325670 1344794 1363002 1379703
62057 1379703 1393286 1402308 1406477 1406376 1402630 1395597 1385558 1372755 1357248 1338903 1317529 1292968
62045 1292968 1265102 1233971 1199985 1164031 1127219 1090351 1053631 1016969 980520 944770 910186
62034 910186 877129 846089 817531 791321 766705 743227 721332 701723 684473 669206 655841
62023 655841 644504 634753 625542 616095 606426 596974 588170 580357 573652 567677 561847 556145 551304 548064
62009 548064 546535 546498 547923 550892 555213 560446 566285 572744 579983 588045 596670 605354 613661 621493 628909
61994 628909 635780 641805 646821 650728 653108 653290 650986 646658 641083 634767 627790 620010 611262 601634
61980 601634 591669 582121 573407 565542 558575 552631 547345 541793 535365 528471 522049 516680 512527 509712
61966 509712 508145 507100 505634 503521 501319 499482 497889 496423 495461 495441 496229 497316 498514 500205 502978
61951 502978 507199 512865 519662 527150 535025 543243 551962 561479 572235 584663 598830 614327 630614
61938 630614 647405 664591 681908 698910 715294 731095 746532 761687 776299 789802 801611
61927 801611 811412 819109 824525 827391 827792 826339 823694 820117 815800 811336 807302 803482 799194 794543
61913 794543 790720 788771 788671 790053 793305 799218 807856 818454 830237 842597 854500 864606 872217
61900 872217 877591 881090 882585 881902 879181 874390 867070 857195 845886 834568 823495 811710 798514
61887 798514 784524 771163 759419 749247 739950 730979 722320 714098 705925 696994 687020 676730 667123
61874 667123 658480 650498 643196 637094 632536 629360 627397 626849 627918 630406 633999 638787 645225 653614
61860 653614 663833 675494 688228 701855 716560 733008 752077 774129 798435 823589 848778
61849 848778 874557 902062 931488 961692 991282 1019576 1046246 1070503 1091168 1107328 1118500
61838 1118500 1124421 1125268 1122068 1116259 1108644 1099115 1087652 1075313 1064031 1055535 1050495 1048575 1049167 1052088
61824 1052088 1057452 1064824 1072771 1079579 1084326 1086920 1087229 1084560 1078053 1067195 1051945 1032668 1010065
61811 1010065 984867 957587 928822 899708 871599 845159 820181 796416 774092 753418 734114
61800 734114 715855 698928 683940 671018 659703 649602 640820 633714 628385 624431 621079 617608 613778
61787 613778 609856 606246 603182 600701 598662 596693 594411 591901 589751 588432 587751 587154 586435 585879 585794 586129
61771 586129 586590 586999 587434 588092 589056 590256 591681 593475 595676 597971 600012 601960 604412 607698 611554
61756 611554 615579 619681 623849 627711 630628 632121 632083 630697 628338 625440 622311 619055 615675 612083 608076
61741 608076 603592 599024 594952 591462 588075 584520 581169 578485 576467 575004 574380 574876 576082 577169 577843
61726 577843 578549 579728 581253 582689 583813 584800 586106 588165 590933 593789 596152 598134 600230 602418 604050
61711 604050 604744 604955 605324 605741 605428 603872 601336 598437 595477 592317 588800 585038 581228 577367 573398
61696 573398 569562 566268 563542 560906 558027 555167 552677 550322 547618 544685 542125 539974 537357 533585
61682 533585 529121 525071 521918 519243 516554 513867 511374 509017 506680 504510 502660 500831 498503 495727
61668 495727 493307 491869 490969 489518 487103 484510 482786 482081 481667 480965 480250 480345 481804 484365 487115 489206
61652 489206 490510 491598 493050 494830 496408 497387 497957 498785 500508 503235 506475 509628 512457 514950 516813
61637 516813 517552 517149 516236 515307 514124 512307 510196 508558 507539 506460 504672 502155 499114 495474 491117
61622 491117 486383 482000 478526 475992 474033 472292 470675 469298 468156 466959 465310 462947 459785 455916
61608 455916 451692 447519 443302 438383 432432 426221 421034 417293 414201 410744 406610 402125 397818 394165
61594 394165 391344 388997 386595 384175 382301 381117 379920 378027 375615 373358 371517 369882 368336 367038
61580 367038 366089 365342 364462 363062 360992 358734 357177 356678 356660 356493 356367 356737 357302 357358 357045 357347 358666 360163
61562 360163 360847 360705 360384 360313 360641 361538 362981 364514 365787 367130 369034 371200 372725 373289 373560 374239 375232
61545 375232 376095 376851 377873 379100 379947 380155 380333 381348 383280 385341 386909 388405 390863 394677 399019
61530 399019 402552 404535 405153 405036 404640 403981 402707 400535 397746 395136 393200 391532 389380 386717 384313
61515 384313 382699 381590 380560 379801 379773 380391 381076 381455 381550 381358 380723 379680 378487 377260 376010 375183 375662
61498 375662 377813 380815 383336 384795 385670 386707 388116 389499 390279 390192 389550 389027 389039 389362 389504 389354 389239
61481 389239 389447 390010 390973 392552 394878 397740 400686 403230 404966 405687 405528 404829 403866 402892 402405 402906 404179
61464 404179 405157 404940 403758 402580 401862 401173 400050 398728 397748 397267 397107 397344 398373 400330 402756 405019
61448 405019 406954 408925 411271 413838 416121 417820 419155 420560 422164 423787 425422 427467 430334 433928
61434 433928 437781 441586 445351 449016 452213 454547 455988 456894 457765 459054 460936 463109 464973 466312 467694
61419 467694 469897 472934 475866 477647 477990 477429 476750 476409 476307 475983 475125 473969 473025 472410 471698 470494 468919
61402 468919 467280 465565 463566 461410 459545 458106 456577 454327 451372 448422 446178 444727 443665 442705
61388 442705 441990 441775 441980 442189 442067 441584 440917 440363 440410 441512 443581 445873 447677 449008 450454 452424 454816
61371 454816 457346 459872 462374 464917 467709 470966 474540 477872 480484 482422 484133 486061 488471 491479
61357 491479 494996 498724 502546 507037 513304 522018 532610 543623 553942 563545 573025 582618 591913
61344 591913 600346 607646 613760 618716 622695 625982 628645 630445 631268 631434 631321 630886 629863 628267 626284
61329 626284 623723 620119 615559 610981 607296 604460 601743 598866 596521 595653 596433 598094 599791 601462 603725
61314 603725 607009 611125 615832 621486 628705 637507 647367 658164 670506 684756 700115 715097 728704
61301 728704 740728 751074 759264 764679 766938 765960 761946 755457 747319 738241 728555 718285 707397
61288 707397 696022 684642 674066 664986 657416 650705 644225 637983 632482 628140 625061 623304 623143 624841
61274 624841 628190 632458 636971 641703 647139 653482 660213 666603 672572 678804 686027 694439 703865 714230
61260 714230 725679 738293 751867 765860 779508 792008 802722 811262 817411 821039 822157 820953
61248 820953 817770 813088 807541 801799 796284 791041 785891 780657 775203 769452 763574 758015 753183 749150
61234 749150 745808 743272 741834 741516 741870 742349 742781 743431 744792 747332 751282 756421 762155 767905 773459
61219 773459 778923 784429 790004 795622 801248 806815 812240 817435 822239 826398 829734 832365 834680 837027
61205 837027 839443 841726 843852 846317 850064 856001 864619 876083 890497 907806 927482 948608 970461
61192 970461 992832 1015623 1038210 1059372 1077808 1092673 1103834 1111820 1117449 1121252 1123214 1123138 1121124
61179 1121124 1117546 1112710 1106726 1099612 1091260 1081367 1069632 1056083 1041043 1024848 1007764 990081
61167 990081 972030 953629 934890 916186 898070 880695 863684 846710 829947 813892 799020
61156 799020 785773 774688 766251 760662 757751 757025 757864 759887 763121 767514 772243 775864 777267 776229
61142 776229 773009 767861 761224 753924 746813 740337 734744 730441 727777 726698 727040 729013 733026 739099
61128 739099 746902 756339 767759 781512 797666 816174 836952 859718 884066 909875 937344 966469
61116 966469 996680 1027194 1057559 1087704 1117611 1147150 1176143 1204304 1231093 1255821 1277973
61105 1277973 1297369 1313947 1327480 1337631 1344186 1347029 1345778 1339672 1328117 1311323 1290250 1265914
61093 1265914 1238969 1209918 1179386 1148044 1116410 1084859 1053617 1022713 992256 962827 935286
61082 935286 909977 886476 864406 844109 826134 810424 796624 784949 775943 769296 763723 758364
61070 758364 753784 751036 750084 749760 749142 748432 748404 749482 751592 754576 758380 762940 768252 774564 782286 791673
61054 791673 802789 815765 830752 847467 865202 883572 903065 924475 947979 973169 999779
61043 999779 1027809 1056952 1086535 1116236 1146334 1177079 1208273 1239726 1271567 1303703 1335459
61032 1335459 1366244 1396290 1426240 1456300 1486370 1516763 1548185 1580983 1614989 1650222 1687261
61021 1687261 1726665 1768255 1811299 1855406 1901168 1949918 2003007 2061616 2127294 2202255 2288638
61010 2288638 2387717 2500563 2629545 2778702 2952707 3156215 3394253 3672451 3996865 4374712
61000 4374712 4815783 5332876 5941839 6663707 7527567 8569322 9826003 11329893 13099327
60991 13099327 15115400 17289510 19455462 21416013 23022796 24226347 25059943 25591036
60983 25591036 25898760 26083271 26256586 26485814 26732974 26860789 26711185 26187464 25274299
60974 25274299 24002841 22419155 20588353 18609936 16607106 14691009 12932250 11359658
60966 11359658 9975810 8770492 7727225 6827752 6055638 5396667 4837245 4364244 3966129
60957 3966129 3632865 3354727 3122171 2926772 2761603 2621008 2500774 2398263 2311558 2238461
60947 2238461 2176572 2123855 2078480 2038558 2002611 1969923 1939737 1910669 1881625 1852896 1825470
60936 1825470 1799608 1774889 1751248 1728959 1707706 1686686 1665655 1645024 1624848 1604503 1583503
60925 1583503 1561937 1539913 1517221 1493740 1469667 1445107 1419808 1393528 1366418 1339065 1312282
60914 1312282 1286650 1261956 1237370 1212584 1188456 1166036 1145313 1125562 1106596 1088820 1072187
60903 1072187 1056001 1039830 1023858 1008178 992473 976630 961093 946307 932233 918566 905061
60892 905061 891621 878483 866317 855601 845891 836191 826094 816027 806461 797486 789214 781881 775314
60879 775314 768869 762124 755120 747841 740051 731857 723825 716255 708817 701207 693671 686633 680268 674671
60865 674671 669961 665908 661939 657849 654039 650773 647650 644253 640881 638146 636086 634151 631885 629281
60851 629281 626573 624012 621764 619809 617973 616149 614391 612744 611176 609687 608160 606123 603001 598673
60837 598673 593448 587484 580741 573609 566993 561457 556770 552615 549252 547091 546022 545648 545842 546577 547495
60822 547495 548204 548903 550166 552092 554112 555638 556619 557327 557920 558346 558552 558601 558520 558092 556947 555046 552976
60805 552976 551493 550770 550289 549425 547828 545378 542253 539151 536874 535426 533898 531450 528059 524117 519823
60790 519823 515303 510861 506585 502071 496974 491599 486484 481704 477059 472672 468796 465125 461010 456385
60776 456385 451997 448571 446179 444563 443674 443607 444259 445240 446110 446684 447261 448507 450890 454176 457626 460692
60760 460692 463432 466308 469856 474436 480004 485962 491471 496039 499758 502997 505990 508684 510821 512178
60746 512178 512885 513442 514215 514923 514894 513804 511859 509196 505527 500605 494753 488584 482364 475978 469383 462751
60730 462751 456230 450013 444567 440345 437099 433962 430471 427120 424590 422776 421037 419064 416937 414609
60716 414609 412058 409876 408912 409170 409765 410148 410632 411337 411443 410180 408058 406392 405912 406445 407568 408876
60700 408876 409833 410145 410248 410842 412026 413453 415157 417483 420284 422954 425374 428092 431458 435195 439019
60685 439019 443079 447554 452366 457438 462746 467963 472634 476894 481441 486639 492210 497921 503894 509935
60671 509935 515287 519438 522560 524755 525525 524567 522525 520302 518055 515377 512092 508295 503963 499172 494449
60656 494449 490346 486820 483521 480475 477968 475938 474004 472032 470216 468719 467626 467168 467497 468266 468743
60641 468743 468337 466787 464063 460491 456881 454032 452040 450321 448343 446123 444067 442559 441679 441154 440561
60626 440561 439672 438606 437705 437443 438295 440276 442608 444271 445011 445345 445539 445254 444458 443947 444361 445241 445696
60609 445696 445634 445683 446181 446844 447229 447037 446220 445302 445223 446261 447344 447173 445879 444900 445318 446983 449172 451409
60591 451409 453506 455460 457474 459670 461670 462891 463329 463687 464654 466378 468565 470673 472088 472595 472725
60576 472725 473230 474241 475365 476578 478474 481607 486043 491625 498189 505425 512997 521012 530063 540661
60562 540661 552797 565990 579435 592213 603751 614032 622957 629648 632955 632646 629545 624583 618415
60549 618415 612018 606770 603416 601451 600010 598968 598801 599782 601851 605050 609619 615723 623429 632902 644403
60534 644403 658060 673741 690998 708997 726646 742985 757379 769301 778096 783193 784586 782982
60522 782982 779374 774362 767905 759865 750818 741988 734195 727226 720583 714493 709628 705978 702726 699366
60508 699366 696460 695052 695728 698366 702416 707309 713017 720475 731111 745719 764018 785461 810161
60495 810161 838830 872174 910579 954034 1001866 1052659 1104795 1157052 1208433 1257467 1302008
60484 1302008 1339882 1369534 1389999 1400429 1399977 1388245 1365659 1333362 1292944 1246425 1196139 1144074
60472 1144074 1091338 1038729 987770 940406 897457 858090 821332 787411 756979 729666 704416
60461 704416 680960 659966 641759 625799 611535 598895 587670 577215 567107 557608 549113 541631
60449 541631 535062 529537 525081 521290 517629 513913 510411 507714 506354 506108 505739 504043 501255 498878 498006
60434 498006 498418 499376 500513 501515 501625 500143 497194 493586 490178 487573 486001 485164 484588 484435 485548 488360
60418 488360 492189 495989 499356 502313 504591 505801 506067 505843 505242 504117 502789 502046 502304 503220 504298 505522
60402 505522 507212 509507 512238 515163 518120 520990 523714 526410 529309 532377 535115 537068 538590 540686
60388 540686 543819 547228 549877 551722 553495 555519 557557 559779 562966 567460 572581 577425 581664 585272
60374 585272 588069 590061 591766 593683 595764 597771 599798 602016 604208 606047 607591 609138 610783 612425
60360 612425 614012 615509 616884 618432 620786 624296 628674 633586 639275 646203 654431 663772 674304 686140
60346 686140 698804 711311 722869 733190 742119 749287 754092 755938 754624 750683 745094 738445 730604
60333 730604 721397 711300 701198 691765 683327 675916 669028 661751 653677 645499 638223 632026 626386 621100
60319 621100 616535 612958 610264 608457 607822 608458 610069 612441 615835 620679 627059 634701 643349 653125 664612
60304 664612 678584 695570 715592 738239 762755 787982 812435 834673 853521 867920 876782 879277
60292 879277 875183 865009 849970 831791 812126 791965 771834 752498 734895 719233 704793 690999
60280 690999 678105 666442 655623 645134 635208 626392 618584 611248 604355 598326 593183 588531 584373
60267 584373 581204 579141 577544 575698 573438 570986 568613 566583 565078 564032 563351 563283 564197 565929 567730
60252 567730 568963 569579 569866 570074 570358 570790 571244 571439 571151 570325 569086 567757 566721 566072 565621 565360 565606
60235 565606 566435 567413 568342 569829 572489 575926 579284 582628 586872 592282 597930 602960 607704 613113 619515
60220 619515 626394 633080 639302 645188 651045 657171 663865 671587 680818 691450 702508 712939 722589
60207 722589 732065 741736 751360 760540 768936 776043 781442 785427 788845 792125 795033 797473 799793 801922
60193 801922 802834 801478 797952 793300 788385 783322 777832 771737 765154 758447 751990 745836 739788 733825
60179 733825 728211 723072 718176 713315 708627 704339 700488 697175 694804 693666 693366 692954 691679 689495 686944
60164 686944 684740 683393 683026 683409 684142 684805 685119 685198 685584 686711 688241 689233 689170 688614 688700 690146 692874 696399
60146 696399 700354 704706 709634 715268 721422 727588 733239 738196 742779 747624 753193 759449 766062 772955
60132 772955 780382 788385 796471 803980 810506 815767 819509 821948 823959 826262 828702 830852 832992 835668
60118 835668 838555 840713 842056 843533 845547 847143 847355 846551 845689 844808 843112 840183 836290 831638 826083
60103 826083 819747 813345 807697 803169 799611 796555 793436 789946 786292 782980 780403 778746 778080 778257 778867
60088 778867 779635 780800 782746 785281 787744 789867 792076 794695 797161 798406 797889 795942 793163 789771 785548
60073 785548 780127 773208 764743 755136 745216 735779 727126 719063 711290 703659 696210 689186 682965 677743
60059 677743 673215 668888 664773 661541 659813 659466 659762 659955 659691 659067 658560 658792 660201 663019 667481 673660
60043 673660 680988 688426 695436 702360 709476 716086 721124 724400 726602 728232 729066 728624 726598 722857 717571
60028 717571 711360 704832 697923 690161 681586 672882 664520 656297 647909 639513 631517 624188 617632 611810
60014 611810 606448 601222 596176 591581 587360 583068 578570 574305 570724 567872 565717 564419 563966 563843 563466
59999 563466 562836 562518 563103 564770 567211 569913 572682 575899 580028 584941 590030 594929 599719 604381 608542
59984 608542 611942 614720 617028 618649 619204 618431 616184 612538 608093 603799 600157 596755 592840 588209 583420
59969 583420 579231 575913 573069 570250 567795 566766 567707 569769 571572 572693 573686 574924 576274 577898 580348
59954 580348 583547 586521 588570 590097 591851 593993 596298 598721 601197 603325 604697 605254 604993 603685 601239
59939 601239 597936 594067 589838 585816 582912 581522 581205 581582 582861 585119 587774 590427 593619 597987 603136
59924 603136 608113 612651 617270 622446 628386 635288 643051 650940 658246 665184 672432 679937 686849 692542
59910 692542 696947 699901 700987 700324 698915 697854 697375 696829 695349 692483 688439 683852 679301 675176 671937
59895 671937 670083 669618 669979 670850 672683 676021 680695 686208 692461 699444 706470 712539 717492 722244 727813
59880 727813 734528 742102 749901 757169 763437 768822 773638 777838 781123 783344 784283 783274 779667 773674
59866 773674 766299 758506 750818 743528 736666 729847 722728 715616 709154 703533 698550 694246 690818 687992
59852 687992 685245 682667 680889 680074 679755 679887 681313 684889 690669 698198 707048 716843 727259 738145
59838 738145 749096 758822 765799 769959 773021 776740 781434 786653 792373 798596 804269 807748 808316 806529
59824 806529 803106 798178 791677 783771 774720 764845 754854 745695 737800 730744 723894 717088 710502 704216
59810 704216 698277 692941 688475 684769 681473 678420 675579 672686 669337 665591 662074 659254 656858 654304
59796 654304 651475 648737 646343 644127 641801 639273 636676 634291 632352 630742 629023 627002 625107 623899
59782 623899 623374 623144 623087 623290 623531 623480 623353 623648 624174 624147 623489 623275 624469 626879 629738 632637 635405 637748
59764 637748 639715 642024 645232 648925 652320 655291 658235 661335 664633 668474 673147 678348 683671 689324
59750 689324 695651 702165 707826 712182 715586 718478 721199 724319 728278 732578 736080 738220 739373 740046
59736 740046 740384 740508 740635 740697 740393 739715 738929 738051 736936 735967 735929 737005 738452 739488 740029 740427 740961 741750
59718 741750 742738 743569 743857 743649 743299 742948 742584 742532 743258 744662 746167 747620 749531 752305 755696 759171 762337
59701 762337 764972 767153 769415 772259 775487 778555 781520 784933 788806 792482 795597 798290 800233 800513
59687 800513 799038 797204 796410 796425 795927 794249 791856 789340 786642 783304 779063 774073 768707 763160 757295
59672 757295 751030 744779 739116 734010 728812 723133 717382 712334 708470 705765 703743 701781 699761 698441
59658 698441 698708 700572 703344 706655 710660 715378 720618 726472 732919 738928 742974 744731 745241 745151 743807
59643 743807 740542 735803 730354 724353 717878 711483 705407 699048 692158 685840 681344 678457 676021 673533
59629 673533 671205 668864 665928 662362 658663 654922 650740 646071 641423 637209 633491 630248 627263 623896
59615 623896 619690 615163 611391 608856 607353 606893 607942 610628 614314 618160 621676 624707 627362 629998
59601 629998 632813 635385 637004 637463 637252 637029 637241 638062 639173 639732 639068 637417 635564 633902 632255 630451
59585 630451 628470 626199 623694 621644 620861 621148 621283 620233 617920 614739 611000 607087 603574 600799 598612
59570 598612 596778 595278 594063 592913 591814 591138 591193 591841 592768 593851 595081 596349 597547 598700 599875
59555 599875 601181 602930 605485 608715 611847 614079 615293 616052 617094 618946 621794 625443 629474 633691
59541 633691 638470 644636 653074 664419 678816 695577 712970 728735 741266 750497 757470 762939 766569
59528 766569 767747 766934 765764 765715 767070 769277 771835 774448 776677 778013 778296 777658 776011 772866 767728
59513 767728 760509 751491 741093 729747 717932 706234 695239 685252 676128 667569 659529 652121 645257
59500 645257 638832 633272 629330 627095 625688 624343 623287 623079 623490 623709 623461 623291 623786 625114 627244 630096
59484 630096 633383 636783 640384 644554 649336 654400 659650 665354 671542 677743 683579 689224 694967 700611
59470 700611 705607 709564 712357 714049 715121 716541 719051 722303 725140 726989 728632 731386 735796 741529
59456 741529 748326 756428 765926 776243 786718 797356 808513 819972 830794 840075 847429 852692 855548
59443 855548 855574 852359 845620 835595 823411 810670 798453 786999 776400 767183 759942 754607 750322
59430 750322 746011 741185 736532 733603 733561 736224 740702 746748 754864 765212 777366 791259 807435 825929
59416 825929 845752 866044 887076 909452 932827 955884 976902 993730 1003987 1006403 1001799 992084
59404 992084 978666 962581 945749 930959 920412 914730 913200 914168 915256 914055 909054 899800 886444
59391 886444 869683 850916 831774 813383 796442 781778 770113 761311 754525 749211 745507 743548
59379 743548 742956 743188 744034 745558 747779 750491 753379 756385 760021 764969 771168 777683 783709 789266 794588
59364 794588 799542 804253 809614 816321 823836 831240 838769 847464 857465 867786 877832 888155 899537
59351 899537 912230 926397 942437 960401 979612 999169 1018482 1037247 1055369 1072978 1089961
59340 1089961 1105377 1117852 1126622 1131741 1133352 1131391 1125982 1117422 1105681 1090569 1072546 1052759
59328 1052759 1032196 1011449 991292 972713 956015 940531 925541 911023 897382 884974 874010
59317 874010 864412 855654 847232 839291 832234 825816 819407 813127 807740 803273 798682 793215 787232 781401
59303 781401 775988 771372 768223 766530 765293 763974 763582 765533 770028 776357 784342 794480 806752 820003
59289 820003 832523 842758 849571 852342 851007 845923 837828 827991 818046 809336 802519 797799 795251 794929
59275 794929 797147 802677 812061 824518 838135 851486 864587 877999 891613 904700 916578 926667
59263 926667 934309 939072 940969 940082 936260 929555 920531 909889 898141 885901 873959 862649 851590
59250 851590 840447 829583 819651 811040 804108 799416 797182 796836 797567 799065 801483 805113 810335 817279
59236 817279 825184 832729 839432 846072 853214 859991 865060 868029 869162 868350 865469 861331 857051 852557
59222 852557 846769 839347 831318 823787 816868 810160 803626 797600 792314 787662 783235 778526 773368 768121
59208 768121 763130 758159 752808 747409 742937 739957 737999 736042 733334 729830 726175 723267 721567 720798
59194 720798 720463 720444 720799 721329 721833 722628 724278 726870 729993 733416 737283 741634 746164 750567 754776 758804
59178 758804 762661 766477 770517 775030 780244 786389 793542 801560 810414 820346 831424 843180 855043
59165 855043 866924 878922 890602 901012 909327 915060 917845 917599 914867 910423 904415 896342 885972
59152 885972 873822 860612 846684 832181 817399 802689 788278 774429 761562 749955 739436
59141 739436 729618 720417 712159 705085 698851 692685 686146 679660 674145 670123 667361 665330 663683 662281
59127 662281 661175 660772 661691 664164 667853 672537 678631 686681 696583 707660 719322 731287 743401 755731
59113 755731 768757 783041 798594 814719 830401 844708 857083 867580 876718 884813 891613 896784
59101 896784 900445 902829 903673 902470 899269 894765 889625 884074 878165 872144 866526 861976 858971 857292
59087 857292 855982 854100 851390 847945 843565 837937 831257 824074 816541 808367 799563 790682 782144 773789
59073 773789 765366 757077 749375 742433 736131 730460 725643 721763 718371 714593 709844 704502 699699 696241
59059 696241 693808 691345 688123 684253 680331 676894 674151 671961 669971 667897 665762 663863 662535 661943
59045 661943 661937 662096 662042 661755 661466 661296 661230 661344 661719 662145 662368 662674 663703 665562 667687 669845 672747 677281
59027 677281 683593 691296 700160 710174 721349 733852 747916 763094 778002 791306 802639 812020
59015 812020 818877 822454 822982 821693 819634 817074 814068 810994 808389 806636 805975 806517 808242 811148 815327
59000 815327 820743 827123 834208 841792 849310 855897 861253 866116 871364 876922 881905 885490 887224 886967
58986 886967 885091 882395 879294 875437 870690 865988 862508 860374 859016 858473 859484 862476 867302 873835
58972 873835 881950 891065 900588 910812 922508 935605 949116 962420 975768 989397 1002947 1015950
58960 1015950 1028103 1038854 1047322 1052828 1054949 1053106 1046881 1036852 1024276 1009749 992912 973622
58948 973622 952601 930761 908793 887689 868678 852103 837160 823333 811268 801581 793568 786033
58936 786033 778928 773198 769196 766153 763300 760826 759378 758994 758826 757888 755957 753632 751505 749447 746935
58921 746935 743941 741079 738942 737696 737336 737770 738519 738885 738783 739044 740539 743280 746699 750627 755625 762413
58905 762413 771184 781517 792904 805293 819026 834202 850402 867254 884994 903973 923773 943363
58893 943363 962233 980970 1000699 1022316 1046267 1072526 1100564 1129550 1158695 1187160 1213707
58882 1213707 1236847 1255512 1269394 1278621 1283294 1283337 1278572 1268979 1255012 1237508 1217161 1194427 1170133
58869 1170133 1145676 1122173 1099855 1078743 1059423 1042390 1027132 1012678 998716 985285 971754
58858 971754 957297 942245 927802 914329 901043 887591 874775 863297 852863 843037 834007 825851
58846 825851 817791 808900 799092 788901 778806 769149 760177 751643 742852 733571 724539 716672 710158 704665
58832 704665 700007 696204 693228 691077 689842 689468 689725 690528 691945 693803 695775 697983 701013 705154 710065
58817 710065 715286 720517 725266 728900 731323 733073 734532 735533 735907 735785 735155 733779 731851 730079 728751
58802 728751 727299 725136 722386 719450 716321 712674 708268 703091 697584 692787 689567 687533 685445 682948
58788 682948 681134 681036 682398 684411 686983 690672 695849 702403 709806 717141 723587 729231 734921 741034 746935
58773 746935 751771 755013 755987 753853 748646 741656 734245 726888 719670 712943 706906 701333 696269 692275
58759 692275 689488 687210 684982 683283 682591 682591 682963 684072 686140 688627 691240 694676 699429 704741 709810
58744 709810 715224 721965 729673 737181 744274 751572 759077 766280 773530 781872 791437 801184 810378 819227
58730 819227 827917 836102 843642 850877 857814 863858 868721 872898 876925 880751 884156 887218 890024 892404
58716 892404 894287 896060 898258 901106 904426 907720 910199 910964 909392 905377 899303 891818 883402 873958
58702 873958 862969 850102 835438 819112 801202 782160 762828 743749 724954 706772 690201
58691 690201 675976 663745 652795 643066 634808 627621 620695 613846 607579 602170 597260 592420 587710
58678 587710 583665 580954 579852 579796 579754 579368 579415 580864 583859 588024 593340 600263 609265 620627 634264
58663 634264 649319 664281 678001 690238 700817 708749 712791 712568 708721 702301 694408 685899 676916
58650 676916 667088 656602 646574 637920 630533 624078 618873 615269 612779 610737 609319 609116 610148 612093
58636 612093 615021 618978 623244 626874 629614 631495 632041 630882 628867 627439 627026 626937 626708 626686 627288 628602
58620 628602 630729 633859 637998 643195 649853 658140 667304 676273 684812 693413 702151 710276 716829 721228
58606 721228 723457 724149 724176 723717 722145 719205 715637 712088 708255 703894 699805 696785 694347 691802 689937
58591 689937 690233 692850 696878 702321 710239 720838 732883 745292 758078 771437 785009 798419 811599
58578 811599 824210 835505 845108 853334 860670 867571 874775 883038 892482 902846 914463 928407 945747
58565 945747 967095 992493 1021075 1051205 1081780 1112978 1144831 1175513 1202201 1223373 1239143
58554 1239143 1249715 1254969 1255548 1252920 1248014 1240887 1231989 1222719 1214318 1206906 1199682 1191362 1180512 1166398
58540 1166398 1149527 1130591 1109102 1084135 1056251 1027473 999328 972070 945940 921954 901048
58529 901048 883379 868740 856822 846901 838133 830431 824372 820260 817960 817442 818544 820398 822084 823678
58515 823678 825577 827031 826676 824463 821718 819272 816842 814301 812057 809846 806615 802133 797567 793944
58501 793944 791067 788332 785603 782890 780137 777680 776069 775172 774366 773778 774291 776143 778623 781419 785229
58486 785229 790702 797762 806292 816593 828896 843227 859875 879114 900381 922522 944673 965919
58474 965919 984353 997834 1005662 1008401 1006312 999459 989158 977535 965421 952297 938572 926215
58462 926215 916716 909964 905599 903961 905260 909256 916226 926796 940379 955175 969980 984479 997475
58449 997475 1006747 1011271 1011927 1009409 1003159 993034 980288 966080 950680 935004 921159 910407 902056
58436 902056 895307 890630 888374 887689 887947 889736 893349 897930 903332 911212 922752 936558 950280 963111
58422 963111 975267 986146 994620 1000315 1003282 1003128 999746 994175 987632 980256 971687 962098 951813 940846
58408 940846 929566 918856 908832 898572 887929 878382 871122 865569 860887 857601 856456 856808 857623
58395 857623 859098 861862 865324 868229 870352 872541 875490 879277 883530 887351 889752 890762 891316 891679 891079
58380 891079 889373 887725 886905 886364 885826 886431 889240 893883 899653 906696 915169 924510 934588 946220 959601
58365 959601 973574 987541 1002666 1020007 1038817 1057858 1076967 1096015 1113670 1128559 1140515
58354 1140515 1149555 1154993 1156833 1156697 1156049 1154784 1152797 1151431 1151963 1153969 1156594 1160147 1165142 1171148 1178004
58339 1178004 1186802 1198303 1211714 1226349 1242978 1262120 1282537 1302860 1323154 1343382 1361958
58328 1361958 1377446 1390137 1400408 1407246 1410173 1410912 1411257 1410967 1409625 1408783 1410045 1412550 1414689 1417009
58314 1417009 1421224 1427567 1435197 1444114 1454715 1466565 1479388 1493985 1510483 1527202 1543015 1559128
58302 1559128 1576678 1594487 1611364 1628672 1648174 1669039 1689556 1710147 1732106 1754941 1777684
58291 1777684 1801393 1827610 1855595 1883684 1912246 1942817 1975554 2009871 2046214 2084879 2124561
58280 2124561 2164322 2205282 2247936 2289733 2327991 2363384 2397887 2431320 2462970 2494568 2528341
58269 2528341 2563796 2599695 2637542 2679878 2726687 2776631 2830015 2887312 2946591 3005861 3066226
58258 3066226 3129318 3193479 3255987 3317232 3379245 3442025 3504955 3569785 3638544 3710558 3785132
58247 3785132 3864783 3951866 4044556 4140380 4241141 4349905 4465836 4586766 4714231 4850903
58237 4850903 4995580 5145910 5303640 5472006 5650497 5837494 6035304 6246988 6471185
58228 6471185 6705952 6954715 7222380 7508845 7812843 8138610 8491681 8871637 9276659
58219 9276659 9711848 10185175 10698782 11252767 11854128 12513192 13234953 14023553 14892061
58210 14892061 15858582 16937006 18142471 19502863 21055913 22842106 24914824 27353625
58202 27353625 30252380 33694342 37748585 42486805 47994544 54377149 61775512 70382844
58194 70382844 80456395 92347960 106546157 123660920 144322071 169051241 198084708
58187 198084708 230978179 266030230 300069072 329184651 350150139 361442945 363108558
58180 363108558 355928820 340945947 319672230 294340300 267565120 241583707 217695871
58173 217695871 196236725 176931994 159327533 143075296 127994390 113980173 100937967
58166 100937967 88830136 77734057 67786506 59061907 51522116 45060963 39553222 34864217
58158 34864217 30858469 27423651 24476431 21944473 19760115 17872482 16246845 14847052
58150 14847052 13631642 12568363 11637856 10820200 10090537 9430681 8833334 8291918 7796166
58141 7796166 7339697 6922063 6540802 6189741 5866522 5573437 5309331 5068217 4846720
58132 4846720 4645170 4460526 4285938 4118497 3960337 3811122 3666439 3524702 3388948
58123 3388948 3260672 3138086 3021327 2913142 2813384 2718665 2628261 2544596 2467220 2392241
58113 2392241 2318642 2249479 2185773 2124734 2065119 2008935 1956560 1905259 1853858 1804210 1756941
58102 1756941 1710357 1664521 1621786 1582234 1543040 1503291 1464944 1428125 1390170 1350588 1312633
58091 1312633 1278645 1248032 1221036 1200162 1186170 1176452 1168839 1163389 1159186 1153248 1144266 1134025
58079 1134025 1123667 1111875 1098054 1083947 1070561 1056620 1041489 1026659 1012946 999097 984445
58068 984445 970194 956870 943310 929334 916665 906032 896041 885978 876957 869165 860830 851261
58056 851261 842325 835428 829380 822509 814713 806335 797260 788181 780571 774369 767878 760696 754438 749707
58042 749707 744909 739086 733446 728864 724178 718261 711704 705232 698470 691392 684990 679401 673276 666068
58028 666068 659035 652960 646840 639886 632957 626921 621319 615629 610168 604835 598703 591758 585431 580612
58014 580612 576713 573289 570794 569120 567312 565396 564649 565307 565881 565415 564640 564336 564421 565165 567215 569854
57998 569854 571385 571823 572973 575205 576613 576213 575400 575144 574263 571869 569112 566960 564425 560632 556613
57983 556613 553415 550298 546414 542508 539369 536291 532617 529181 526663 524138 520779 517484 515250 513573
57969 513573 511938 511293 512305 513669 513880 513449 513699 514640 515644 516970 518880 520387 520578 520214 520449 520954
57953 520954 520805 520243 519957 519570 518415 517082 516705 517363 518509 520286 523170 527031 531725 537862 545876 555091
57937 555091 564790 575359 587297 599986 612535 624959 637417 649110 658998 666777 672257 674840
57925 674840 674637 673019 670928 667708 662637 656414 649890 642604 634035 625215 617520 610760 603980 597363
57911 597363 591887 587792 584736 582742 581686 580542 578465 575931 573621 571020 567369 563172 559393 555905
57897 555905 552099 548272 545069 542311 539717 537990 537793 538476 539270 540853 544088 547985 550676 551844 552449
57882 552449 552684 552110 551412 551963 553584 554520 553824 552235 550502 548381 545637 542874 540896 540088 540562 542171
57866 542171 544385 546844 549904 553953 558548 562988 567334 572021 576918 581647 586404 591455 596250 599997
57852 599997 602678 604594 605436 604830 603290 601539 599324 595938 591455 586392 580715 574247 567510 561053 554562
57837 554562 547781 541614 537017 533469 529969 526883 525276 524949 524801 524692 525229 526052 526195 525970 526693 528518
57821 528518 530295 531614 533164 534844 535337 534118 532327 531070 530138 528953 527589 526333 525311 524911 525515
57806 525515 526415 526095 524004 521075 518155 514968 511081 506964 503522 501276 500366 500802 502397 504885 508099
57791 508099 511685 515049 518282 522592 528791 535835 542076 547509 553337 559671 565398 570300 575518 581629
57777 581629 587885 593786 599690 605333 609293 610769 610603 609776 608118 605240 601529 597338 592219 585878 578967
57762 578967 572181 565367 558370 551854 546429 541692 537007 532651 529329 527022 525161 523631 522920 523496 525470
57747 525470 528636 532499 536527 540558 544672 548657 552155 555342 558732 562209 565025 566931 568513 570150
57733 570150 571456 572032 571996 571478 570407 569047 567905 566778 564793 561799 558818 556726 555364 554415 554120 554546
57717 554546 555039 555128 555155 555285 554704 552674 549759 547165 545340 543917 542561 541133 539428 537449 535674 534526
57701 534526 533896 533584 533708 534262 534789 534986 535139 535506 535806 535770 535611 535458 534935 533913 533058 532996 533534 534373 536048
57682 536048 539390 544520 551135 559318 569333 581103 594849 611936 634114 662009 695202 733770
57670 733770 778923 832104 894030 964379 1041162 1119691 1192626 1251843 1290898 1306466 1298428 1269097
57658 1269097 1222323 1162979 1096749 1029493 965940 908642 858128 813938 775510 742485 714576
57647 714576 691220 671428 654265 639504 627448 618033 610510 604228 599200 595572 592945 590732 588879
57634 588879 587795 587608 587857 587897 587456 586865 586788 587599 588963 590271 591402 592712 594329 595900 597065 597695 597633
57617 597633 596805 595713 595188 595394 595671 595608 595648 596270 597238 598152 599206 600804 602810 604724 606336 607789 609258
57600 609258 610955 613192 615969 618652 620372 620680 619805 618582 618173 619286 621386 623121 623757 623757 623828 624086 624459
57583 624459 625175 626276 627207 627506 627521 627889 628662 629447 630070 630592 630971 631228 631729 632853 634514 636232 637450
57566 637450 637725 637121 636622 637543 640178 643624 647185 651212 656003 660737 664331 666860 669359 672568 676534
57551 676534 681060 685852 690510 694999 699802 705101 710280 714813 719125 723785 728406 732273 735714 739800
57537 739800 744819 749990 754689 759085 763491 767768 771566 774694 777213 779533 782262 785580 789035 792335
57523 792335 795873 799889 803731 806779 809685 813606 818548 823556 828389 833782 839947 846050 851578 857173
57509 857173 863564 870438 876945 882712 887894 892739 897639 903185 909643 916558 923179 929144 934547 939541
57495 939541 944081 947974 951173 954108 957594 962100 967324 972749 978361 984284 990003 994724 998550 1002583
57481 1002583 1007651 1013538 1019654 1025885 1032412 1039165 1045796 1051987 1057587 1062709 1067817 1073423 1079594 1086003
57467 1086003 1092447 1099018 1105753 1112535 1119392 1126499 1133794 1140993 1148074 1155343 1162886 1170411 1177821 1185522
57453 1185522 1193871 1202605 1211091 1219007 1226576 1234239 1242300 1250852 1259925 1269596 1279782 1289946 1299392
57440 1299392 1308126 1317134 1327415 1338876 1350567 1361806 1372662 1383544 1394828 1406752 1419119 1431147
57428 1431147 1442204 1452657 1463398 1474549 1485309 1495244 1504948 1515104 1525503 1535560 1545377 1555655
57416 1555655 1566676 1577880 1588605 1598947 1609719 1621564 1634262 1647064 1659696 1672745 1686855
57405 1686855 1701819 1716827 1731403 1745690 1759911 1773994 1787813 1801451 1815118 1828990 1843126
57394 1843126 1857413 1871711 1886252 1901679 1918381 1935936 1953600 1971184 1989111 2007734 2026972
57383 2026972 2046551 2066188 2085629 2104833 2124031 2143305 2162233 2180349 2197795 2215211 2233060
57372 2233060 2251352 2269795 2287883 2305168 2321810 2338567 2355899 2373520 2391204 2409389 2428301
57361 2428301 2447212 2465551 2484129 2504069 2524955 2545452 2565517 2586501 2608970 2632044 2655257
57350 2655257 2679489 2705329 2731756 2757387 2782108 2806666 2831457 2856544 2882091 2907942 2933419
57339 2933419 2958301 2983421 3009496 3035972 3061916 3087533 3113849 3141229 3169171 3197359 3225994
57328 3225994 3255124 3284418 3313751 3343385 3373423 3403543 3433388 3462903 3492282 3521862 3552033
57317 3552033 3583009 3614622 3646440 3678037 3709172 3740015 3771271 3803719 3837455 3871869 3906421
57306 3906421 3941002 3975440 4009363 4042899 4076945 4112238 4148637 4185754 4223785 4263008 4302833
57295 4302833 4342111 4380337 4418083 4456324 4495733 4536450 4578054 4619849 4661515 4703418 4745993
57284 4745993 4789053 4832011 4874587 4916921 4959153 5001228 5042994 5084231 5124769 5164805 5204878
57273 5204878 5245355 5286230 5327613 5369920 5413183 5456629 5499490 5541909 5584600 5627892 5671653
57262 5671653 5715814 5760300 5804644 5848357 5891690 5935465 5980063 6025037 6069733 6113904 6157706
57251 6157706 6201515 6245788 6290802 6336437 6382445 6428840 6475750 6523034 6570439 6618091 6666425
57240 6666425 6715518 6764771 6813376 6860926 6907535 6953541 6999168 7044361 7088845 7132252 7174159
57229 7174159 7214132 7251957 7287772 7321819 7354280 7385661 7417023 7449149 7481590 7513377 7544834
57218 7544834 7577777 7613506 7651384 7689914 7728461 7767318 7806811 7847268 7889420 7933821 7980027
57207 7980027 8027118 8074889 8123856 8174130 8224981 8275506 8325220 8374016 8422025 8469484 8516297
57196 8516297 8561827 8605450 8647153 8687192 8725471 8761672 8795752 8827821 8857847 8886057 8913359
57185 8913359 8940688 8968027 8994633 9020117 9044766 9068948 9092720 9115915 9138162 9159008 9178410
57174 9178410 9196785 9214148 9229623 9242422 9252802 9261275 9267212 9269066 9265704 9256659 9241475 9219969
57162 9219969 9193062 9162257 9128092 9089925 9047199 9000072 8948836 8893850 8836196 8777390 8718204
57151 8718204 8658641 8599283 8541705 8487247 8436304 8389120 8346340 8308330 8274827 8245659 8220919
57140 8220919 8199874 8180454 8160331 8137805 8111153 8078023 8036412 7985884 7927287 7861704 7790299
57129 7790299 7714904 7638174 7563163 7492766 7429124 7373285 7325619 7286292 7254735 7228855 7205849
57118 7205849 7184120 7163813 7145639 7130380 7119808 7116716 7123318 7140505 7169166 7211347 7269716 7347230
57106 7347230 7448362 7579948 7750186 7967675 8242140 8585495 9012167 9540072 10192505
57097 10192505 10998407 11990385 13203449 14675612 16447478 18560173 21054832 23973626
57089 23973626 27357009 31234290 35607168 40420214 45517916 50621691 55382255 59512898
57081 59512898 62914876 65684082 67990841 69944108 71546868 72737213 73436027 73561004
57073 73561004 73035127 71817137 69933197 67475208 64566666 61325530 57844817 54190804
57065 54190804 50410985 46544003 42624659 38684303 34755696 30886042 27145911 23620063
57057 23620063 20384638 17489078 14952614 12769482 10915088 9352712 8041657 6943500
57049 6943500 6023824 5251930 4601451 4051013 3583399 3184364 2842452 2548798 2295987
57040 2295987 2077189 1886607 1719957 1573851 1445100 1330988 1229704 1139988 1060682 990943
57030 990943 930440 878935 835913 800958 774260 756636 749216 753243 770056 801588 850845 920237
57018 920237 1006996 1099824 1182172 1240636 1270222 1271655 1245779 1192437 1113898 1017000 911176
57007 911176 805068 704713 613330 531727 459221 394825 337957 288485 246564 212273 185073
56996 185073 163758 147295 135430 128154 125021 125601 130296 139957 154722 173711 195733 219797 245150
56983 245150 271380 298252 324777 348553 366751 377783 381607 378733 369818 356110 339339 320851
56971 320851 301477 282324 264985 250566 239026 229684 222081 216261 212775 212546 216318 224191 236037
56958 236037 252126 272494 295475 317607 335334 346489 350216 346393 335613 319125 298288 274382
56946 274382 249170 224987 203688 185813 171131 159674 151820 147699 147101 149949 156598 167677 183830
56933 183830 205483 232575 264311 298859 333162 363360 385989 399005 401663 393917 376544 351608
56921 351608 322000 290285 258334 227783 199934 175130 153003 133497 116896 102759 89849
56910 89849 77581 66714 58045 51173 45205 40044 36234 33909 32639 32062 32178 33220 35663 40039
56896 40039 46363 54040 62650 72449 83771 96535 110886 127856 148690 173728 202320 233240
56884 233240 264423 292724 315044 329890 337461 338378 333093 322541 308588 293428 278834 266065
56872 266065 256109 249691 247105 248209 252741 260863 273483 291835 316720 348520 387989 436344 493789
56859 493789 557923 623784 685297 736785 773943 794443 797971 785669 759806 724014 683117 641825
56847 641825 603446 569920 542577 522327 509484 504188 507061 519129 541319 574692 620990 682182
56835 682182 759058 850193 951691 1057027 1157091 1241617 1301980 1333517 1335736 1310871 1262482
56824 1262482 1195094 1114526 1027798 941978 862487 792179 731876 681613 641514 611901 593063
56813 593063 585218 588847 605068 635306 680190 738619 807568 881896 953860 1014068 1054854 1073279
56801 1073279 1070173 1046646 1003262 942831 871872 797727 725081 656303 593766 539899 495399
56790 495399 459222 430580 409751 396925 391513 392996 401621 417984 442414 474434 511711 549347
56778 549347 581289 603140 613375 612030 599206 575285 541851 501749 458293 414451 372296 332890
56766 332890 296773 264478 236349 212027 190637 171452 154093 138298 123992 111493 101146
56755 101146 92855 86337 81539 78206 75352 71949 68113 64872 62798 61536 60575 59698 58610 56960 54941
56740 54941 53224 52048 50960 49589 48144 46961 46085 45470 45198 45398 46348 48486 51740 54970 56837 57307
56724 57307 57657 58927 61032 63397 65721 67868 69733 71513 73548 75730 77571 78931 80105 81182 82000
56709 82000 82721 83666 84540 84758 84664 85406 87223 88872 89281 88880 88644 88670 88482 88092 87904 87959 88005 88013 88107 88247 88525
56688 88525 89347 90818 92297 93085 93280 93426 93643 93721 93828 94476 95823 97483 99028 100356 101568 102777 103968
56671 103968 104871 105097 104601 103871 103547 103982 105242 107190 109464 111676 113832 116262 119007 121628 123805 125708
56655 125708 127572 129311 130833 132343 133985 135486 136530 137292 138286 139801 141670 143442 144625 144967 144647
56640 144647 144073 143467 142820 142165 141557 140820 139750 138546 137623 136982 136220 135087 133552 131435 128737 126275
56624 126275 125088 125014 124710 123439 121906 120901 120032 118592 116935 116044 116108 116405 116413 116319 116414 116657 116920 117215 117450
56605 117450 117226 116119 114263 112585 112115 112816 113521 113455 113434 114740 117138 119074 119831 120227 120930 121384 121090
56588 121090 120808 121555 123191 124941 126660 128611 130500 131721 132343 133004 133974 134998 135937 136995 138404 140352
56572 140352 143015 146267 149637 152910 156455 160635 165297 170200 175464 181252 187659 195338 205496 218511
56558 218511 233072 247331 260321 271637 280553 286581 290428 293266 295189 295369 293587 290741 287869
56545 287869 285422 283385 281358 278639 274937 270959 267643 264989 262264 259061 255394 250997 245502 239265
56531 239265 233171 227596 222286 217194 212605 208465 204466 200861 198283 196584 194715 192103 189396 187488
56517 187488 186461 185908 185645 185532 185017 183492 181021 178340 176094 174275 172430 170368 168525 167511 167316
56502 167316 167274 166895 166342 165914 165539 165121 164883 164871 164552 163533 162307 161656 161612 161717 161991 162781 163732 163890 163035
56483 163035 162198 162518 164060 165958 167339 167938 168128 168514 169339 170240 170770 170943 171019 171033 170916 170912 171395 172416 173794
56464 173794 175423 177098 178284 178611 178430 178378 178514 178398 177870 177246 176841 176817 177355 178447 179566 180037 179766 179266
56446 179266 179064 179358 180021 180590 180526 179899 179484 179820 180540 181088 181606 182502 183592 184395 184945 185498 185780 185361 184590
56427 184590 184302 184625 184801 184185 182860 181377 180477 180823 182392 184260 185577 186502 187652 189065 190407 191792
56411 191792 193501 195240 196472 197157 197381 196744 195136 193658 193560 194551 195390 195887 196942 198762 200511 201871
56395 201871 203440 205329 206709 207275 207924 209449 211603 213963 216683 219790 222630 224641 225923 226641 226656
56380 226656 226254 226385 227558 229098 230053 230294 230289 230354 230573 231002 231542 231956 232244 232654 233297 234206 235667 237798
56362 237798 239829 240649 240180 239450 239211 239298 239433 239758 240336 240999 241957 243745 246284 248762 250694 252352 253997
56345 253997 255513 256971 258734 260706 262348 263549 264681 265676 266153 266584 268219 271435 275284 279060 283161
56330 283161 287862 292448 296335 300059 304263 308550 312161 315181 318282 321681 324958 327491 328767 328806 328556
56315 328556 329143 330471 331333 331146 330616 330375 330120 329754 330234 332344 335418 338227 340618 343418 347177 351704
56299 351704 356522 361275 365930 370912 376587 382482 387611 391760 395703 400041 404704 409805 415879 422827
56285 422827 429713 436153 442903 450472 458179 465295 472155 479389 486947 494754 503551 514204 526710 540458
56271 540458 554829 569125 582869 596799 612655 631294 651870 673574 697159 723927 754147
56260 754147 787433 823847 863701 907170 955113 1009451 1071631 1141283 1217431 1300359 1391199
56249 1391199 1490245 1596785 1710152 1829776 1954426 2082324 2211866 2341490 2469014 2591647
56239 2591647 2706427 2810267 2900128 2973649 3029163 3064865 3078911 3070965 3042852 2997031 2935173
56228 2935173 2858812 2770369 2672563 2567535 2457366 2344691 2231873 2120157 2010368 1903747
56218 1903747 1801357 1703470 1610383 1523064 1442155 1367085 1297021 1231947 1171955 1116355 1064414
56207 1064414 1016221 971945 931042 893094 858576 827859 800310 775282 753098 734075 717535
56196 717535 702785 690019 679152 668885 658301 648396 640587 634549 629016 623853 619759 616574 613504
56183 613504 610572 608374 606815 605487 604882 605850 608177 610881 613516 616075 618252 620076 622679 627102 632797
56168 632797 638526 644103 650057 656407 663245 671706 682661 694972 706761 718009 730275 744304 759668
56155 759668 776467 795581 817241 841002 867162 896738 930012 966453 1006242 1050680 1101120
56144 1101120 1158581 1224286 1299528 1385113 1481820 1590968 1713330 1847647 1990893 2139259
56134 2139259 2287893 2430815 2563044 2682772 2790570 2887250 2973697 3051589 3122080 3184006
56124 3184006 3234939 3273635 3300024 3313591 3313751 3301493 3278692 3245697 3201025 3143158 3071120 2983637
56112 2983637 2879562 2759410 2625560 2481474 2331949 2183277 2041234 1908950 1787795
56103 1787795 1679387 1584970 1503638 1433219 1372635 1321664 1279078 1243024 1212923 1189090 1170851
56092 1170851 1156823 1146621 1140410 1137206 1135525 1135303 1137281 1140930 1144954 1149300 1154660 1160501 1165792 1171237
56078 1171237 1178562 1187812 1197479 1207037 1217328 1228792 1241400 1255895 1272979 1291629 1310279 1329102
56066 1329102 1349023 1369278 1388352 1406629 1425495 1444439 1461709 1477350 1492812 1508058 1521937
56055 1521937 1535047 1549365 1565287 1581868 1599636 1620208 1643363 1667453 1692489 1719864 1749315
56044 1749315 1779292 1810069 1843357 1879015 1915297 1952030 1990209 2028735 2065116 2099313 2133414
56033 2133414 2167559 2199876 2230453 2261666 2294494 2328171 2363598 2403265 2447491 2494302 2543093
56022 2543093 2594731 2648262 2701673 2755929 2814095 2876436 2940657 3006895 3077741 3153221 3230708
56011 3230708 3310166 3394454 3483907 3575788 3669878 3769308 3874891 3983888 4095593 4213015
56001 4213015 4337766 4468334 4604572 4748800 4901307 5059949 5225245 5400665 5587030
55992 5587030 5782177 5986862 6205044 6437494 6681499 6937908 7211909 7505768 7817687
55983 7817687 8149058 8505713 8890570 9302452 9743699 10221523 10740489 11301544 11909840
55974 11909840 12575342 13304703 14101682 14977070 15949114 17033662 18244921 19607769 21159478
55965 21159478 22940725 25000639 27413933 30277820 33685653 37714078 42438338 47949258
55957 47949258 54359182 61813639 70508707 80698768 92711834 106990307 124106307
55950 124106307 144693815 169334116 198413237 231790526 268180081 304667870 337118520
55943 337118520 361593250 375785644 379319813 372936667 357693942 334960452 306782910
55936 306782910 275782256 244479914 214679555 187349620 162854357 141201400 122206828
55929 122206828 105621543 91206694 78737698 67992458 58770510 50907596 44252315
55922 44252315 38642742 33919102 29943344 26593523 23754753 21330331 19250971 17461759
55914 17461759 15909249 14548958 13353304 12301401 11368912 10534981 9789366 9124067 8525330
55905 8525330 7980610 7485582 7037261 6627241 6248041 5899290 5581366 5288944 5016510
55896 5016510 4764279 4533166 4319370 4119063 3933126 3762326 3602855 3451328 3309434
55887 3309434 3179200 3058222 2943728 2836830 2738632 2646501 2558212 2475761 2401415 2334076
55877 2334076 2272916 2220152 2176169 2135763 2093057 2046781 1997567 1944030 1885248 1823561 1761192
55866 1761192 1697253 1631417 1567227 1508198 1453526 1400913 1350707 1303940 1259031 1213826 1168631
55855 1168631 1124390 1080253 1035754 993075 954446 919589 888040 861450 840950 824623 810065
55844 810065 797219 786419 776167 765289 754955 746185 737673 728280 719188 711287 702979 693008 682960
55831 682960 674446 666273 657034 648041 640898 634427 626940 619490 613906 609401 604012 597777 591705 585115
55817 585115 576830 567765 559737 552818 546244 540753 537695 536832 537156 538797 542158 546391 550692 555890 562868
55802 562868 570594 577548 583799 589857 594849 597651 598469 597485 593422 585424 574945 563848 552033 538883
55788 538883 525537 513621 503122 493578 485961 481091 477428 472755 467020 461460 456084 450270 444855
55775 444855 441302 439606 439148 440733 445635 453302 462006 470948 479706 486434 488925 486986 481880 474023
55761 474023 463226 450599 438069 426274 414646 403209 392576 382528 372262 361729 351276
55750 351276 340520 329043 317632 307270 297499 287331 277211 268510 261616 256007 251578 248392 245763
55737 245763 243179 241513 241724 242971 243627 243563 243811 244451 244536 243652 242001 239374 235607 231628 228582 226289
55721 226289 223918 221569 219821 218413 216932 216038 216355 216848 216230 215437 216757 220786 226026 231230 236320
55706 236320 241149 245113 248050 250064 250542 248777 245338 241489 237558 233240 229021 225620 222459 218456
55692 218456 214133 211102 209628 208462 207031 206015 205676 205453 205520 207064 210525 214900 219207 223433 227783
55677 227783 232099 236330 240532 244272 246927 248612 249922 250916 251271 251166 250992 250529 249507 248546 248365 248559
55661 248559 248451 248608 249919 251737 252737 253324 255217 258582 261497 262500 261992 260804 259098 257053 255066
55646 255066 252664 248582 242495 235554 228837 222412 216130 210064 203829 196762 189269 182856 178380 175256
55632 175256 172670 170506 168796 167309 166015 165026 163891 161938 159430 157332 155848 154348 152749 151682
55618 151682 151140 150299 149031 148261 148384 148498 147697 146054 144008 141822 140017 139187 138927 138005 136025 133918
55602 133918 132429 131199 129728 128179 126764 125304 123873 122939 122487 121888 121003 120470 120606 121003 121491 122443
55586 122443 123781 124797 125347 126102 127200 127846 127810 128108 129510 131459 133282 135410 138454 141935 144965 147584
55570 147584 150599 154578 159745 166385 174515 183333 191519 197947 201978 203462 202799 200621 197307 193157
55556 193157 188896 185253 181995 178216 173766 169573 166341 163807 161541 159621 158116 156696 155156 153680
55542 153680 152291 150733 149154 148263 148532 149791 151631 153495 154465 153910 152441 151245 150501 149469 148089
55527 148089 147056 146146 144093 140670 137357 135116 132851 129097 124105 119225 115166 111927 109659 108482
55513 108482 107966 107631 107462 107290 106380 104381 102105 100611 99999 99725 99510 99339 99146 99083 99512 100241 100442 99791
55495 99791 98915 98292 97707 97354 98292 100850 103588 104929 104974 104655 103979 102502 100861 100263 100687 100978 100685 100582
55477 100582 101259 102253 102808 102694 102120 101493 101386 102141 103352 104134 103960 102928 101366 99626 98110 97116 96638
55460 96638 96516 96596 96646 96454 96243 96508 97252 97915 98232 98494 98632 97947 96351 95100 95444 97075 98659 99409
55442 99409 99361 98651 97484 96511 96336 96728 96958 96755 96347 95828 95170 94668 94751 95470 96592 98002 99559 100902
55424 100902 101827 102561 103233 103504 103202 102809 102794 103005 103273 103982 105322 106569 107002 107023 107434 108093 108289 108073 108135
55405 108135 108578 108869 108854 108810 108568 107633 106198 105106 104733 104754 104904 105098 104841 103649 102134 101613 102339 103148
55387 103148 103202 103045 103447 104125 104301 103841 103095 102170 101055 100105 99719 99808 100136 100888 102288 103762 104175 103068
55369 103068 101184 99606 98691 98108 97566 97088 96670 96170 95720 95831 96735 97902 98675 99144 99802 100423 100111 98679
55351 98679 97238 96969 97822 98930 99764 100330 100640 100613 100301 99719 98743 97551 96813 96856 97029 96552 95713 95526 96388
55332 96388 97816 99360 100968 102377 102980 102616 101924 101586 101595 101559 101417 101523 102090 102756 102818 101997 100941 100657 101336
55313 101336 102090 102101 101596 101304 101360 101280 100806 100177 99681 99427 99508 99971 100613 101129 101412 101478 101323 101117 101264 101877
55293 101877 102501 102757 102996 103790 105049 106186 106937 107456 107776 107765 107530 107266 106804 105890 104819 104218 104206 104331
55275 104331 104324 104398 104727 105106 105253 105141 104991 105188 106045 107321 108233 108305 107928 107661 107370 106693 105963 105805 106007 105771
55255 105771 105067 104791 105356 106013 105924 105181 104349 103617 102928 102481 102578 103163 103855 104292 104278 103798 103009 102100 101111 100083
55235 100083 99309 99089 99294 99509 99638 99986 100724 101670 102622 103514 104184 104335 103858 102965 102017 101447 101692 102790
55217 102790 104081 104790 104879 104947 105251 105314 104628 103343 102118 101552 101857 102888 104406 106365 108775 111174 112680
55200 112680 112966 112824 113181 113809 113649 112300 110521 109294 108999 109482 110325 110959 111060 110922 111015 111231 111084 110602
55182 110602 110393 110787 111492 112133 112567 112616 112054 110973 109743 108618 107792 107645 108279 109003 108988 108376 108005 108145
55164 108145 108365 108567 109135 110000 110576 110830 111392 112366 113089 113393 113966 114936 115274 114370 113164 112795 112992 112856
55146 112856 112518 112818 113731 114319 114088 113448 112841 112290 111906 112090 112974 114107 114842 114831 114225 113639 113731 114498 115208
55127 115208 115329 115233 115576 116315 116807 116689 116163 115606 115325 115567 116289 116991 117208 117068 117048 117305 117622 117853 118067
55108 118067 118406 119144 120695 123069 125443 126743 126673 125851 125012 124448 124161 124082 124055 123932 123750 123599 123359 122890
55090 122890 122438 122559 123545 125119 126714 127863 128395 128476 128449 128434 128154 127362 126388 125976 126550 127796 128987 129526
55072 129526 129210 128231 127046 126109 125588 125329 125132 125001 125096 125406 125586 125246 124399 123444 122673 122083 121820 122336 123674
55053 123674 124937 125047 123958 122464 120969 119223 117307 115974 115623 115702 115618 115585 116004 116591 116816 116758 116797 116835
55035 116835 116587 116389 116843 117735 118105 117562 116799 116554 116689 116740 116872 117714 119376 121119 122122 122306 122232 122311 122425
55016 122425 122376 122385 122835 123652 124409 125033 125906 127124 128148 128550 128714 129345 130541 131736 132468 132848 133298 134118
54998 134118 135273 136411 137153 137432 137392 136958 135885 134384 133251 133011 133308 133539 133729 134292 135172 135823 135967
54981 135967 135875 135909 136179 136619 137031 137105 136722 136204 135929 135815 135614 135574 136325 138031 140072 141704 142710 143349 143960
54962 143960 144741 145673 146606 147549 148741 150172 151113 150642 148732 146495 145183 145155 145816 146300 146105 145334 144484
54945 144484 143926 143606 143307 143035 142891 142820 142872 143539 145310 147899 150511 152898 155518 158467 161046 162904 165010
54928 165010 168686 173996 179849 185628 191926 199524 208324 217603 226739 235186 242142 246828 249008 248853
54914 248853 246447 241865 235602 228366 220471 211998 203594 196371 190640 185411 179731 174038 169502 166375
54900 166375 163797 161157 158808 157295 156576 156315 156407 156869 157576 158429 159502 160830 162391 164432 167504 171901
54884 171901 177374 183537 190277 197559 205148 212734 220086 226933 232934 237881 241568 243437 242847 239849
54870 239849 235175 229209 221605 212305 202401 193402 185970 179829 174541 169856 165583 161697 158465 156087
54856 156087 154401 153257 152818 153033 153132 152233 150284 147959 145834 144127 142973 142344 141794 140869 139699 138799
54840 138799 138371 138205 138036 137511 136085 133645 131056 129441 128987 129072 129426 130351 131815 133167 134016 134689 135558
54823 135558 136518 137364 138134 138738 138794 138158 137203 136324 135625 135337 135979 137642 139592 141083 142198 143373 144390
54806 144390 144538 143695 142675 142326 142664 143107 143291 143408 143843 144686 145698 146649 147544 148424 149097 149263 148920 148495
54788 148495 148470 148932 149548 149950 150163 150686 152079 154400 157139 159765 162249 164976 168256 172057 176128 180279
54772 180279 184657 189801 196274 204118 212823 221851 230891 239477 246771 252072 255302 256699 256320 254139
54758 254139 250393 245417 239363 232456 225279 218374 211728 205068 198465 192260 186636 181731 177897 175269
54744 175269 173300 171385 169772 169152 169435 169762 169780 170105 171269 172935 174435 175573 176596 177900 180051 183588
54728 183588 188512 194282 200543 207367 214644 221732 228079 233740 238878 243063 245439 245370 242753 237963 231752
54713 231752 224922 217874 210620 203293 196318 189958 184079 178522 173400 168884 165015 161888 159651 158157
54699 158157 156947 155728 154568 153561 152704 152152 152097 152272 152095 151512 151085 151015 150734 149846 148883 148494 148370 147612
54681 147612 145953 144065 142825 142689 143568 144880 145869 146272 146564 147233 148008 148122 147160 145382 143413 141958
54665 141958 141562 142263 143551 144901 146132 147094 147390 146838 145913 145313 145277 145650 146289 146981 147234 146745 145936 145517
54647 145517 145596 145689 145532 145400 145598 146083 146661 147249 147945 149044 150856 153155 154983 155455 154756 153935 153696 153836
54629 153836 153887 153788 153677 153406 152641 151305 149684 148107 146695 145428 144434 144019 144312 144898 145132 144898 144826 145522
54611 145522 146774 147767 147931 147418 146853 146750 147026 147003 146121 144740 143847 143817 143976 143754 143675 144581 146216 147387
54593 147387 147415 146783 146339 146465 147044 147625 147568 146552 145063 143957 143514 143432 143680 144594 145972 146876 146758 146210
54575 146210 146109 146523 146916 146969 146650 145893 144902 144480 145277 146785 147833 148152 148684 150034 151376 151456 150285 149126
54557 149126 148966 149617 150423 151208 152172 153230 153962 154193 154309 154960 156556 158971 161512 163292 163902 163755 163600
54540 163600 163779 164166 164680 165399 166101 166241 165645 164871 164532 164578 164595 164596 165011 165921 166657 166307 164505 161775 159216
54521 159216 157677 157036 156390 155115 153608 152787 153071 154097 155271 156234 156911 157479 158261 159329 160256 160499 160030
54504 160030 159332 158900 159030 159891 161317 162569 162837 162077 160981 160066 159324 158882 159304 160746 162293 162743 161978
54487 161978 161019 160792 161281 161980 162730 163793 165265 166747 167620 167604 166961 166252 165956 166314 167413 169171 171191
54470 171191 172829 173640 173783 173838 174193 174709 175010 174969 174744 174463 174108 173758 173694 174081 174651 174903 174606 173964 173337
54451 173337 172957 172813 172654 172176 171390 170771 170799 171397 172075 172524 172734 172565 171753 170476 169485 169387 170074 170995 171646
54432 171646 171623 170674 169046 167443 166265 165201 163931 162899 162896 164096 165940 167774 169225 170159 170726 171314
54416 171314 172020 172370 171999 171361 171281 171926 172747 173316 173622 173716 173695 174003 175048 176460 177377 177540 177535 177847 178350 178947
54396 178947 179962 181540 183205 184404 185071 185355 185248 184853 184531 184435 184303 184010 183848 183811 183155 181291 178791
54379 178791 176875 176090 176071 176431 177202 178399 179712 180850 181823 182742 183593 184274 184726 185030 185478 186434 187920
54362 187920 189530 190983 192540 194512 196601 198262 199709 201963 205751 210695 215704 219810 222522 223851
54348 223851 224303 224510 224474 223425 220843 217460 214730 213225 212042 210057 207380 205080 203605 202052 199296
54333 199296 195494 191993 189803 188630 187536 186133 184753 183681 182798 182082 181995 182943 184518 185748 186179 186339
54317 186339 186842 187378 187056 185696 184226 183593 183706 183806 183578 183343 183229 182722 181279 179073 176856 175225 174217
54300 174217 173590 173243 173220 173333 173008 171800 170058 168759 168536 169135 170040 171205 172768 174336 175193 175157 174734
54283 174734 174381 174195 174350 175174 176488 177436 177415 176894 176898 177912 179610 181461 183235 184969 186653 187998 188536
54266 188536 188130 187358 187073 187524 188307 189200 190517 192404 194359 195894 197198 198642 199981 200647 200634 200511 200590
54249 200590 200611 200230 199445 198545 197964 198067 198744 199274 198960 197880 196753 196170 196223 196643 196912 196450 195150 193626
54231 193626 192480 191538 190319 189037 188405 188528 188758 188709 188666 188830 188960 189016 189412 190195 190679 190418 189921 189793 189743
54212 189743 189151 188209 187697 187863 188302 188806 189534 190336 190668 190390 190057 190186 190703 191320 192006 192788 193448 193751 193692
54193 193692 193314 192502 191232 189800 188570 187663 187079 186912 187217 187831 188594 189627 191092 192741 193926 194106
54177 194106 193287 192015 191048 190855 191258 191696 191967 192458 193380 194075 193624 192129 190759 190334 190402 190079 189295 188641
54159 188641 188204 187273 185339 182866 180813 179720 179543 180074 181194 182775 184663 186730 188745 190227 190688
54144 190688 190093 188891 187567 186333 185276 184530 184081 183641 183005 182487 182698 183849 185517 187141 188497 189513
54128 189513 189962 189722 189245 189351 190450 192200 194084 196006 198091 200156 201804 202998 204182 205691 207339
54113 207339 208732 209709 210260 210266 209721 209115 209176 210100 211308 212121 212413 212476 212496 212472 212421 212308 211871 210911 209789 209294
54093 209294 209903 211439 213483 215718 217747 219104 219826 220709 222545 225340 228704 232769 238060 244597 251735
54078 251735 259022 266532 274131 281027 286474 290412 292965 293726 292136 288345 283124 277060 270380 263513
54064 263513 257190 251850 247420 243851 241398 240069 239198 238033 236603 235641 235616 236156 236588 236849 237570 239214
54048 239214 241448 243576 245412 247301 249364 251275 253050 255483 259197 263522 266961 268854 270147 272424
54034 272424 276486 281939 287803 293391 298788 304612 311219 318294 325372 332492 339896 347302 354086 360184
54020 360184 366175 372352 378339 383836 389038 393867 397328 398316 396811 393727 389709 384602 378090 370375
54006 370375 362115 353935 346105 338530 331021 323610 316536 309969 303903 298378 293490 289083 284780 280557
53992 280557 276945 274348 272437 270524 268260 265645 262698 259630 257070 255521 254661 253730 252548 251564 250917
53977 250917 250134 248965 247911 247565 247817 248105 248130 247965 247650 247142 246635 246603 247414 248940 250601 251731 252015 251622
53959 251622 250975 250440 250311 250912 252388 254426 256480 258388 260487 263051 265927 268986 272589 277212 282664
53944 282664 288048 292514 295888 298590 301267 304576 309031 314748 321336 328271 335400 343014 351394 360470
53930 360470 370069 380397 391977 405011 418925 432657 445218 455864 463924 468892 470783 470161 467669
53917 467669 463681 458599 453327 449133 446864 446384 446967 448239 450552 454285 458940 463293 466522 468867 470948
53902 470948 472736 473622 473387 472560 471642 470427 468423 465694 462827 460104 457116 453354 448896 444224 439495
53887 439495 434290 428162 421160 413642 405769 397472 388929 380753 373515 367182 361216 355182 349143 343477
53873 343477 338461 334083 330187 326691 323544 320459 316908 312648 308167 304320 301391 298746 295503 291340
53859 291340 286578 281860 277958 275464 274194 273075 271150 268593 266339 264755 263229 261180 258920 257221
53845 257221 256383 256029 255609 254822 253739 252764 252352 252545 252887 252937 252719 252566 252714 253269 254298 255618 256662 256967
53827 256967 256787 256828 257309 257586 256885 255204 253348 252263 252412 253629 255323 256925 258303 259733 261425 263243
53811 263243 265009 266868 269053 271397 273498 275417 277839 281302 285598 290182 294918 299957 305110 309875
53797 309875 314127 318335 322918 327809 332847 338153 343764 349162 353681 357264 360377 363191 365255 366141
53783 366141 366104 365881 365975 366216 365915 364389 361467 357668 353841 350538 347656 344632 340970 336624 331931 327199
53767 327199 322392 317338 312182 307363 303076 299047 295042 291312 288189 285526 282952 280517 278457 276396
53753 276396 273534 269913 266868 265635 265820 265757 264276 261618 258766 256485 255172 255021 255839 256838 257105 256461
53737 256461 255686 255723 256684 257753 258082 257688 257319 257537 258125 258498 258480 258468 258873 259687 260656 261612 262486 263219 263939
53718 263939 265101 267081 269589 271836 273421 274757 276415 278384 280282 282010 283683 285110 285957 286480 287521
53703 287521 289625 292616 296180 300321 304923 309505 313882 318620 324211 330111 335202 338970 341625 343287
53689 343287 343839 343623 343478 343854 344289 344007 342713 340794 339168 338834 339953 341307 341350 339957 338467 337806 337413
53672 337413 336495 335444 335113 335288 334925 333750 332607 332173 332180 332166 332251 332712 333294 333459 333062 332366 331562 330670 329905
53653 329905 329727 330358 331404 332095 331956 331226 330645 330794 331541 332118 331792 330554 329180 328573 329098 330560 332705
53636 332705 335405 338276 340496 341399 341228 341030 341779 343790 346816 350232 353090 354495 354328 353442 353010 353793
53620 353793 356050 359700 364282 369011 373271 377057 380783 384796 389134 393606 397975 402285 407082 412957
53606 412957 419663 426098 431538 436528 442140 448636 455388 461891 468173 474170 479347 483223 485951 488115
53592 488115 490199 492275 493956 494519 493353 490493 486644 482616 478825 475234 471547 467517 463293 459431
53578 459431 456325 453773 451441 449549 448513 447935 446669 444206 441396 439317 437884 436155 433755 431378
53564 431378 429887 429400 429359 429120 428396 427421 426820 427069 427972 428830 429206 429334 429698 430469 431585 433150 435383 438108
53546 438108 440608 442275 443237 444126 445271 446421 447287 448049 449145 450887 453544 457477 462705 468497 473975
53531 473975 479184 485056 492163 500033 507920 515750 523924 532618 541851 551946 563280 575622 588252
53518 588252 600822 613703 627427 642174 657898 674592 692293 711105 731239 752725 775017
53507 775017 797348 819599 842431 866313 890815 915159 939097 962843 986422 1009548 1032036
53496 1032036 1053903 1075113 1095645 1115859 1136378 1157440 1178566 1199045 1218645 1237794 1257146
53485 1257146 1276939 1296709 1315699 1333661 1351131 1368774 1386598 1404077 1420936 1437417 1453781
53474 1453781 1469795 1484784 1498008 1509038 1518013 1525511 1531895 1536787 1539391 1539244 1536344 1530718 1522388
53461 1522388 1511813 1499797 1486768 1472600 1457330 1441562 1425887 1410288 1394341 1377629 1359778
53450 1359778 1340639 1320782 1301245 1282373 1263418 1243788 1224065 1205116 1186752 1168284 1150029
53439 1150029 1133162 1118101 1104180 1091106 1079758 1071011 1064553 1059430 1055141 1051664 1048928 1046921 1046063
53426 1046063 1046801 1048942 1051841 1055266 1059719 1065833 1073671 1082736 1092637 1103742 1117033 1133156 1151693
53413 1151693 1171596 1192240 1213723 1236320 1260163 1285490 1312616 1341449 1371479 1402454 1434629
53402 1434629 1468175 1502828 1538442 1575506 1614834 1657001 1702199 1750157 1800042 1850955 1902731
53391 1902731 1955703 2009538 2063194 2116496 2170775 2227032 2284152 2339963 2393585 2445698 2496784
53380 2496784 2546357 2593918 2639498 2682921 2723400 2760273 2793480 2823089 2848976 2871214 2890067
53369 2890067 2905210 2915591 2920442 2919869 2913995 2902098 2883248 2857557 2826202 2790281 2750104 2705621
53357 2705621 2657271 2606230 2553832 2500775 2447116 2393184 2340131 2289015 2239572 2190689 2142161
53346 2142161 2095079 2050095 2006211 1961989 1917347 1873351 1830639 1789010 1748394 1709254 1671857
53335 1671857 1635912 1601294 1568539 1538231 1510313 1484427 1460682 1439641 1421554 1405873 1391547
53324 1391547 1377614 1363547 1349221 1334703 1320044 1305271 1290563 1276380 1263289 1251519 1240721
53313 1240721 1230314 1220145 1210743 1202882 1196973 1192940 1190485 1189254 1188942 1189599 1191842 1196351 1203054 1211104
53299 1211104 1219834 1229423 1240441 1253042 1266931 1281983 1298563 1317247 1338347 1361613 1386298 1411623
53287 1411623 1437286 1463329 1489466 1514937 1539266 1562796 1586058 1608849 1630415 1650306 1668489
53276 1668489 1684654 1697995 1707855 1714182 1717222 1717207 1714470 1709455 1702340 1692912 1681054 1667003 1650915
53263 1650915 1632482 1611323 1587561 1561733 1534357 1505835 1476586 1446929 1416991 1386962 1357207
53252 1357207 1327750 1297979 1267420 1236744 1207415 1180217 1154610 1129609 1104756 1080006 1055205
53241 1055205 1030185 1005114 980364 956148 932610 910072 888826 868697 849101 829542 810019
53230 810019 791107 773762 758765 746071 734822 724217 714128 704611 695217 685377 675223 665372
53218 665372 655813 645671 634243 621754 608810 595558 581775 567501 553207 539544 527157 516526
53206 516526 507604 499698 491951 483961 475841 467873 460294 453252 446728 440445 434028 427264 420214 413155
53192 413155 406411 400152 394368 389079 384375 379990 375128 369266 363086 357982 354458 351609 348414 344941
53178 344941 341876 339430 337272 335142 332976 330675 328316 326340 324999 323839 322174 319917 317490 315219
53164 315219 313345 312286 312144 312138 311358 310066 309449 309977 310745 310650 309521 307866 306142 304614 303404 302256 300692
53147 300692 298681 296790 295369 294028 292285 290335 288767 287820 287310 287110 287334 288138 289572 291526 293622
53132 293622 295317 296229 296343 295869 295187 294891 295469 296785 298157 299067 299500 299553 299291 299134 299816 301518 303475
53115 303475 304832 305573 306220 307026 307901 308774 309434 309311 308090 306466 305605 305771 305990 305303 303908 302817 302620
53098 302620 302856 302549 301219 299314 297672 296665 296050 295575 295320 295254 294798 293291 290795 288127 286114 285017
53082 285017 284632 284723 285333 286684 288687 290627 291670 291778 291713 291980 292276 292307 292522 293387 294331 294282 293167 292007
53064 292007 291406 290693 288907 286092 283223 281228 280447 280743 281750 283070 284415 285519 285982 285538 284556 283856
53048 283856 283775 283789 283316 282568 282117 281924 281406 280455 279755 279893 280637 281442 282273 283410 284637 285277 285152 284975 285448
53029 285448 286340 286833 286548 285771 284874 284077 283764 284374 285691 286752 286844 286298 285963 286221 286869 287688 288611 289441
53011 289441 289962 290358 291104 292344 293696 294778 295643 296522 297406 298050 298256 298051 297700 297590 297940 298537 298915 298860
52993 298860 298559 298249 297967 297808 298147 299276 300928 302485 303708 304935 306480 308144 309615 311165 313505
52978 313505 316930 320979 325010 328668 331619 333310 333543 333000 332626 332564 332235 331424 330636 330302 330256 330297 330655 331511
52960 331511 332519 333268 333841 334493 335028 335026 334423 333370 331717 329217 326224 323607 321828 320468 318826 316724
52944 316724 314586 312926 311872 311139 310413 309656 308933 308045 306728 305225 304185 303811 303664 303600 304263 306039 308060
52927 308060 309012 308708 308048 307650 307366 307056 306950 307050 306974 306637 306375 306113 305120 303053 300698 299231 299081 299853
52909 299853 300897 301609 301555 300831 300058 299652 299312 298549 297446 296567 296283 296556 297188 297977 298719 299283 299595 299489
52891 299489 298845 298045 297868 298597 299594 300102 300132 300118 300042 299589 299004 299094 300241 301937 303453 304509 305148 305405 305434
52872 305434 305628 306282 307313 308564 310197 312515 315523 318945 322596 326453 330330 333729 336089 337055 336535
52857 336535 334756 332337 330068 328339 326815 324788 321798 317893 313472 309110 305354 302325 299513 296282
52843 296282 292685 289514 287450 286403 285766 284989 283796 282211 280642 279679 279486 279624 279718 280012 280948 282460
52827 282460 284051 285345 286128 286148 285371 284293 283412 282528 281181 279714 279169 279943 281236 282096 282474 282928 283767
52810 283767 284896 286146 287384 288461 289345 290083 290552 290491 289928 289166 288221 286706 284536 282300 280560 279188
52794 279188 277732 276099 274461 272880 271519 270877 271215 271938 272147 271734 271395 271647 272437 273771 275966 278915
52778 278915 281633 283113 283496 283933 285238 287030 288350 288866 289122 289627 290102 289921 289054 288125 287536 286974 285946
52761 285946 284432 282800 281340 280100 279025 278078 277429 277545 278746 280529 281817 282153 282235 282917 284146 285390
52745 285390 286669 288435 290640 292715 294432 296095 297760 298973 299474 299641 299951 300460 301068 301818 302641 303223
52729 303223 303499 303953 305096 306878 308909 310895 312496 313088 312331 310854 309792 309480 309085 307736 305645 303842
52713 303842 303083 303298 303923 304363 304174 303207 301761 300470 299833 299855 300127 300159 299602 298444 297176 296641 297410 299205
52695 299205 301065 302138 302220 301628 300838 300305 300343 300907 301607 302122 302595 303443 304830 306406 307562 307864 307340 306452
52677 306452 305755 305470 305420 305396 305461 305740 306074 306162 306012 305991 306304 306620 306415 305592 304581 303820 303326 302938 302842 303598
52657 303598 305506 308113 310561 312466 314305 316860 320335 324008 326688 327524 326524 324447 322234 320498
52643 320498 319435 318926 318616 318064 317133 316215 315841 316055 316364 316340 316059 315881 315982 316225 316342 316197 315922 315817 315974
52624 315974 316105 315933 315659 315697 315936 315648 314327 312310 310350 308831 307610 306490 305555 305080 305232 305845 306519
52607 306519 307029 307569 308387 309279 309805 309999 310457 311569 313065 314459 315517 316055 315727 314454 312829 311738
52591 311738 311632 312384 313565 314638 315170 315231 315470 316489 318273 320407 322587 324652 326356 327477 328035 328147
52575 328147 327835 327194 326493 325847 325069 324091 323220 322661 322121 321317 320496 319984 319589 319043 318714 319134 319962 320209 319518
52556 319518 318541 317944 317710 317612 317719 318050 318176 317591 316270 314640 313111 311775 310437 308942 307546 306820 307011
52539 307011 307693 308405 309280 310592 311937 312539 312282 311703 311042 310118 309298 309641 311622 314347 316628 318334 320164
52522 320164 322444 324756 326573 327810 328772 329808 330979 332057 333030 334506 337145 340680 344131 347131 350314
52507 350314 354013 357305 359070 359423 359272 358797 357309 354506 350991 347352 343499 339296 335283 332289 330531
52492 330531 329455 328377 327071 325787 324896 324559 324686 325182 326125 327604 329490 331498 333449 335315 336986
52477 336986 338173 338638 338534 338449 339044 340512 342422 344150 345443 346498 347670 349354 352029 355898 360322
52462 360322 364030 366167 366903 366840 366172 364773 362744 360411 357840 354797 351214 347364 343536 339748 335828
52447 335828 331697 327680 324572 323156 323327 323934 323795 322780 321590 320740 320213 319977 320190 320787 321386 321809 322231
52430 322231 322644 322645 322051 321301 320861 320556 319975 319224 318836 319121 320112 321918 324420 326638 327264 326247 325216 325805
52412 325805 327949 330387 332500 334943 338595 343704 350261 358481 368435 379550 390852 401467 410650
52399 410650 417668 422121 424213 424339 422511 418522 412559 405310 397572 390042 383336 377711 372782 368029
52385 368029 363714 360857 360074 360770 361717 362188 362309 362592 363498 365372 368377 372320 376672 380936 385050 389348
52369 389348 393996 398495 401917 403755 404364 404489 404542 404487 404155 403315 401684 399326 396964 395497 395159 395497 396076
52352 396076 396755 397301 397389 397242 397812 399922 403409 407321 410746 413293 415037 416260 417185 417848 418348 419135 420777
52335 420777 423445 426921 431131 436236 442214 448777 455854 463687 472332 481622 491807 503593 517072
52322 517072 531084 544179 555891 566681 576968 586812 596302 605718 615340 625495 636639 648991
52310 648991 662136 675476 689080 703835 720669 739690 759950 780001 799038 817742 837662
52299 837662 859415 881803 903044 922479 940576 957573 972860 985640 995638 1003117 1008707 1013241
52287 1013241 1017234 1020433 1022215 1022459 1021708 1020581 1019444 1018567 1018074 1017649 1016770 1015349 1013771 1012264 1010666
52272 1010666 1008898 1007222 1005920 1005183 1005426 1007183 1010365 1014046 1017347 1020311 1023645 1027870 1033090 1039367
52258 1039367 1046879 1055685 1065644 1076685 1089054 1103107 1118800 1135311 1151388 1166226 1179991 1193309
52246 1193309 1206336 1218521 1229202 1238027 1244917 1250021 1253880 1257217 1260349 1263015 1264900 1266005 1266327
52233 1266327 1265595 1263686 1261034 1258141 1254798 1250288 1244431 1237920 1231408 1224622 1216866 1208241 1199798 1192294
52219 1192294 1185270 1177761 1169689 1161988 1155411 1149830 1144889 1140760 1137824 1136069 1135268 1135476 1136764 1138701
52205 1138701 1140727 1142969 1146039 1149974 1154017 1157722 1161688 1166798 1173097 1179866 1186649 1193795 1201919 1211014
52191 1211014 1220152 1228121 1234421 1239532 1244061 1247785 1249889 1250023 1248608 1246015 1242020 1236356 1229345 1221571
52177 1221571 1213281 1204554 1195850 1187815 1180591 1173791 1167244 1161320 1156335 1152008 1147863 1144040 1141354 1140474
52163 1140474 1141275 1143051 1145184 1147399 1149509 1151263 1152494 1153190 1153299 1152658 1151310 1149722 1148487 1147838 1147623
52148 1147623 1147619 1147784 1148359 1149879 1152787 1156703 1160321 1162515 1163457 1164147 1164895 1164909 1163579 1161563 1160160 1160007 1160909
52131 1160909 1162701 1165710 1170252 1176168 1183078 1190957 1200194 1211127 1223647 1237311 1251745 1266821 1282462
52118 1282462 1298436 1314456 1330404 1346398 1362674 1379414 1396555 1413647 1430093 1445638 1460586
52107 1460586 1475505 1490952 1507493 1525582 1545084 1565212 1585270 1605283 1625518 1645612 1664585
52096 1664585 1681556 1695947 1707153 1714606 1718244 1718498 1715776 1710380 1702860 1693986 1684321 1674250 1664382
52083 1664382 1655341 1647073 1638877 1630238 1621117 1611432 1601001 1590256 1580247 1571513 1563532 1555748 1548551
52070 1548551 1542644 1537938 1533784 1530084 1527519 1526751 1527891 1530745 1535117 1540885 1548100 1556994 1567618 1579524
52056 1579524 1592028 1604659 1617196 1629429 1641160 1652266 1662435 1671000 1677326 1681320 1683402 1684052
52044 1684052 1683617 1682336 1680254 1677225 1673232 1668640 1663928 1659233 1654318 1648851 1642654 1635803 1628617 1621296
52030 1621296 1613478 1604390 1593605 1581375 1568181 1554325 1540154 1526146 1512438 1498647 1484544 1470545
52018 1470545 1457177 1444470 1432353 1421253 1411696 1403542 1396173 1389236 1382678 1376213 1369254 1361249 1351633
52005 1351633 1339691 1325092 1308432 1290716 1272433 1253717 1235156 1217561 1200968 1184686 1168476
51994 1168476 1152873 1138020 1123010 1106847 1089499 1071455 1052692 1032724 1011513 989792 968416
51983 968416 947649 927109 906337 885364 864654 844428 824305 804034 784429 767030 752745
51972 752745 741317 732239 725609 721750 720509 721435 724331 729104 735207 741685 747763 753007 756951 759012
51958 759012 758914 756818 752792 746428 737488 726926 716743 708461 702008 696605 692452 690755 692033 695354
51944 695354 699811 705978 714996 726692 739620 752744 766021 779282 791702 802751 812736 821746
51932 821746 828816 832837 833853 832749 829948 824999 817268 806557 793266 778503 763919 750900 739799
51919 739799 730170 721684 714574 709349 706532 706700 710383 717713 728236 741138 755582 770774 785758
51906 785758 799206 809659 816196 818800 817863 813449 805385 793914 779668 762976 743838 722759 700941
51893 700941 679292 657919 637056 617790 601101 586711 573840 562806 554944 550957 550246 551944
51881 551944 555741 561381 568228 575885 584730 595277 607270 619829 632158 643623 653358 660345 664017
51868 664017 664537 662508 658647 653721 648533 643752 639699 636248 632948 629444 625899 622951 621098 620232 619792
51853 619792 619231 618170 616290 613373 609482 604846 599465 593011 585292 576734 568216 560401 553367 546888
51839 546888 540913 535630 531186 527550 524722 522910 522416 523377 525606 528546 531398 533529 534875 535813 536507
51824 536507 536544 535396 533206 530860 529313 528897 529247 529719 529909 529969 530447 531701 533387 534620 534661 533417 531331
51807 531331 528885 526287 523536 520672 517942 515723 514321 513853 514231 515127 516009 516456 516517 516568 516716 516590 515903
51790 515903 514950 514273 513976 513727 513375 513147 513177 513223 512959 512297 511263 509843 508185 506814 506440 507646 510839
51773 510839 516277 523881 533127 543379 554348 565948 577704 588546 597362 603689 607751 609910 610228
51760 610228 608561 604911 599600 593131 585986 578555 571162 564138 557822 552431 547795 543325 538451 533261
51746 533261 528568 525236 523448 522649 522080 521322 520566 520552 522065 525230 529439 534199 539840 546780 554174 559960
51730 559960 562729 563071 562650 562312 561772 560946 560683 561814 564046 566266 567622 567875 567007 565107 562585 559974
51714 559974 557430 554918 552903 552206 552812 553352 552379 549947 547401 545834 545346 545700 546881 548692 550431 551448
51698 551448 551711 551507 550954 550201 549788 550269 551580 553195 554722 555887 556086 554565 551207 546743 542041 537540
51682 537540 533448 529994 527207 524756 522350 520147 518477 517264 515989 514197 511902 509564 507752 506831
51668 506831 506944 508365 511727 517637 525977 535889 546483 557237 567461 575854 581130 583065 582544 580611
51654 580611 577881 574893 572559 571858 573228 576508 581343 587337 593727 599221 602515 603025 600917 596355 589013
51639 589013 578679 566203 553355 541553 531044 521479 512840 505454 499376 494392 490573 488277 487457
51626 487457 487386 487335 487244 487491 488213 489124 489874 490292 490376 490254 490130 490075 489871 489245 488235 487172 486334 485772 485463 485359
51606 485359 485176 484462 483144 481927 481809 483212 485786 489107 493229 498368 504374 510896 518017 526270 535847
51591 535847 545964 555209 562406 567107 569447 569694 567958 564273 559096 553648 549487 547544 547843 550287
51577 550287 555362 563659 574910 588058 602302 617742 634928 654153 675224 697577 720485 743479
51565 743479 766729 790796 815971 842245 870115 900977 936330 976674 1021226 1068291 1115575
51554 1115575 1160466 1200523 1233786 1258583 1273477 1277768 1271827 1256527 1232568 1200772 1162688 1120245
51542 1120245 1074840 1027314 978809 930980 885216 842206 802365 766151 733738 704908 679573
51531 679573 657885 639562 623579 608985 595695 584159 574643 567156 561611 557575 554244 551237 549077
51518 549077 548328 548547 548831 549156 550371 552899 556190 559518 562503 564634 565103 563572 560541 556566 551680
51503 551680 546018 540490 536117 532977 530345 527672 524954 522363 520092 518428 517410 516451 514854 512661
51489 512661 510435 508227 505427 501785 497903 494317 490701 486549 482268 478907 476853 475391 473599 471289
51475 471289 468912 466905 465365 464161 463105 462035 460882 459646 458303 456771 455050 453354 452047 451364
51461 451364 451153 450862 449923 448229 446239 444557 443520 443253 443931 445745 448644 452418 457045 462723 469478
51446 469478 477064 485483 495316 507164 520732 534670 547369 557775 565580 570996 574568 577036 579085
51433 579085 580997 582498 582939 581737 578705 573972 567676 559892 550890 541227 531467 522007 513372 506369
51419 506369 501557 498643 496770 495439 494856 495348 496810 498816 500913 502697 503974 505041 506478 508462 510570
51404 510570 512462 514369 516623 519102 521608 524503 528381 533168 538066 542451 546486 550877 556412 563699
51390 563699 572928 583793 596051 610264 627594 648790 673779 702393 735052 772414 814746 862024
51378 862024 914329 971697 1033612 1098893 1165835 1232089 1294579 1350051 1395926 1430514 1452504
51367 1452504 1460734 1454675 1434945 1403109 1361028 1310507 1253513 1192448 1129875 1067737 1006930 947849
51355 947849 891387 839146 792512 751740 716156 685009 657823 634100 613220 594831 578978
51344 578978 565658 554405 544485 535279 526306 517151 507757 498745 491017 484919 479991 475621 471669 468315
51330 468315 465573 463249 461221 459421 457631 455674 453729 452148 450899 449584 448076 446718 445738 444996 444670
51315 444670 445639 448537 452672 456678 460132 463867 468581 473907 479127 484150 489211 494051 497940 500324
51301 500324 501019 499990 497460 494102 490550 486644 481562 474903 467363 460158 453978 448672 443891 439859
51287 439859 437407 437196 438952 441633 444392 447222 450553 454449 458463 462187 465621 468966 472214 475044
51273 475044 477068 478176 478689 479108 479667 480272 480908 481953 483923 486993 490827 494702 497734 499293 499448 498852
51257 498852 497936 496462 494126 491290 488653 486349 483918 481193 478632 476632 474988 473321 471680 470432
51243 470432 469729 469311 468690 467449 465517 463303 461333 459654 457816 455524 453039 450740 448682 446864 445614
51228 445614 445274 445610 445920 445761 445259 444729 444287 443841 443209 442275 441357 441357 443120 446418 449952 452655 454740 457145
51210 457145 460232 463566 466912 470804 475812 481562 486932 491137 494316 497070 499733 502153 503995 505059
51196 505059 505377 505098 504304 502960 501009 498491 495544 492387 489411 487116 485720 484911 484163 483265 482300 481210
51180 481210 479799 478220 477034 476620 476854 477529 478717 480350 481848 482669 483019 483596 484702 486113 487691 489581
51164 489581 491642 493217 493769 493524 493276 493685 494843 496339 497654 498666 499751 501245 502855 503952 504425
51149 504425 504795 505378 505797 505610 504962 504161 502930 500662 497360 493804 490652 487864 485210 482936 481507 480852
51133 480852 480281 479198 477630 475954 474433 473263 472781 473199 474157 475043 475906 477610 480799 485063 489478 493605
51117 493605 497471 500870 503437 505444 507795 511031 514810 518548 522049 525235 527865 529980 532186 534929
51103 534929 537777 539933 541255 542194 542933 543184 542814 542027 540800 538755 535903 533020 530877 529369 527737
51088 527737 525496 522794 520027 517516 515626 514775 515056 515992 516879 517384 517633 517780 517698 517273 516860 517170 518653
51071 518653 521125 524061 527092 530191 533541 537403 542055 547696 554361 562020 570767 581021 593488 608702
51057 608702 626292 644779 662494 678875 694611 710437 726182 741328 756093 771402 787774
51046 787774 804657 820873 835407 847688 857349 863889 866510 864423 857602 847275 835435 823767
51034 823767 813003 802997 793008 782045 769556 756007 742451 729378 716348 702944 689707 677856
51022 677856 668413 661878 658395 657711 659108 661824 665611 670657 677038 684549 692933 701874 710809 719209
51008 719209 727156 735303 744157 753738 764043 775372 787848 800930 813816 826173 838101 849492
50996 849492 859853 868854 876721 883942 890723 896758 901353 903787 903853 902187 899937 897989 896634 896004 896550
50981 896550 898889 903361 909981 918747 929753 942986 958201 975010 993058 1012208 1032768 1055533
50969 1055533 1081432 1111007 1144292 1181142 1221546 1265581 1313163 1363934 1417363 1472963 1530371
50958 1530371 1589189 1648648 1707561 1764733 1819375 1871044 1919268 1963458 2003183 2038318 2068854
50947 2068854 2094771 2116166 2133468 2147496 2159435 2170655 2182106 2193578 2203693 2210968 2214951 2216195
50935 2216195 2215175 2211478 2204162 2192742 2177547 2159064 2137171 2111292 2081209 2047366 2010207 1969523
50923 1969523 1924835 1876305 1824880 1771506 1716595 1660398 1603593 1547307 1492775 1441118 1393113
50912 1393113 1348918 1308111 1270232 1235137 1202712 1172529 1144168 1117734 1093697 1072193 1052800
50901 1052800 1035043 1018835 1004351 991739 981019 972026 964262 957033 949966 943413 938198 934913 933429
50888 933429 933000 932854 932824 933465 935490 939043 943605 948590 953826 959361 965073 970798 976712 983283 990757
50873 990757 999062 1008335 1019194 1032139 1046869 1062618 1079104 1096724 1115807 1136284 1158351 1182911
50861 1182911 1210839 1242126 1276334 1313689 1355102 1401237 1452287 1508796 1571950 1642683 1721014
50850 1721014 1806622 1899514 1999656 2106442 2219229 2338096 2463344 2594295 2729176 2866164
50840 2866164 3003892 3140756 3274225 3401110 3518216 3622691 3712332 3786108 3844284 3887743
50830 3887743 3917198 3933208 3936879 3930352 3916552 3898509 3878866 3859860 3843486 3831284 3823798 3820431
50818 3820431 3819967 3820979 3821494 3818595 3808932 3789682 3758714 3714094 3654228 3578880 3489532 3388317
50806 3388317 3276811 3156188 3028272 2895985 2762653 2631061 2503121 2380263 2263996
50797 2263996 2156038 2057754 1969555 1891148 1822376 1763451 1714233 1673717 1640624 1614270 1594452
50786 1594452 1580613 1571520 1565754 1562200 1560069 1558753 1557777 1556683 1554911 1551922 1547528 1541979 1535634 1528560
50772 1528560 1520422 1510670 1498919 1485220 1469915 1453184 1434867 1414891 1393675 1371851 1349677 1327091
50760 1327091 1304366 1282379 1262097 1243979 1227994 1214024 1202052 1192103 1184244 1178640 1175488 1174866
50748 1174866 1176772 1181256 1188463 1198538 1211616 1227990 1248199 1272785 1301885 1335158 1372291 1413612
50736 1413612 1460005 1512093 1569573 1631444 1696730 1764846 1835437 1908150 1982464 2057418 2131516
50725 2131516 2203309 2272310 2338940 2403278 2464063 2519250 2567327 2607623 2639435 2661440 2672335
50714 2672335 2671853 2661041 2641837 2616546 2587457 2556536 2525432 2495806 2469451 2447809 2431529 2420681
50702 2420681 2415204 2414692 2417761 2422059 2425059 2424646 2418908 2405861 2383803 2351877 2310194 2259564 2201306
50689 2201306 2137130 2068975 1998918 1929126 1861487 1797078 1736310 1679896 1629336 1586071 1550438
50678 1550438 1522012 1500799 1487373 1481777 1483037 1490133 1502862 1521235 1544433 1571069 1600353 1632261
50666 1632261 1666312 1700689 1733036 1762021 1787801 1811023 1831764 1849672 1864895 1878456 1891554
50655 1891554 1904716 1917724 1930159 1941724 1952222 1961701 1970808 1980681 1992258 2005752 2021010 2038288
50643 2038288 2058526 2082854 2111901 2145499 2182932 2223421 2266406 2311374 2357510 2403697 2448922
50632 2448922 2492559 2534235 2573614 2610611 2645874 2680861 2717114 2754968 2792521 2825692 2849576
50621 2849576 2860279 2856057 2837324 2806017 2764995 2717650 2667669 2618830 2574518 2536915 2506416
50610 2506416 2482109 2463024 2448829 2439239 2433000 2427759 2420867 2410223 2394495 2372869 2344715 2309480
50598 2309480 2266926 2217511 2162404 2103003 2040527 1976151 1911354 1847822 1786955 1729522 1675772
50587 1675772 1625737 1579398 1536720 1497605 1461872 1429263 1399396 1371669 1345392 1320254 1296646
50576 1296646 1275311 1256713 1241010 1228501 1219571 1214073 1211275 1210708 1212618 1217198 1223897 1232065 1241934
50563 1241934 1254296 1269349 1286597 1305781 1327154 1350833 1376679 1405065 1436923 1472448 1510240
50552 1510240 1548320 1585674 1622345 1658408 1693487 1727165 1759282 1789788 1818813 1847003 1875421
50541 1875421 1904996 1936236 1969564 2005690 2045583 2090144 2139867 2194622 2253871 2317354 2385546
50530 2385546 2459192 2538516 2623250 2713410 2809499 2911684 3019121 3130324 3243924 3358710
50520 3358710 3473175 3585390 3693179 3794027 3884998 3963331 4027329 4076279 4109321 4124879
50510 4124879 4121561 4099406 4059832 4004588 3935304 3854101 3763998 3668273 3569684 3470690 3374298
50499 3374298 3284283 3204416 3137587 3085428 3048367 3025912 3017247 3021811 3039080 3067448 3103338 3141617
50487 3141617 3176972 3204920 3221830 3224525 3210258 3177135 3124633 3053861 2967342 2868353 2760130
50476 2760130 2645481 2527003 2407459 2289721 2176306 2069009 1968969 1876864 1792877 1716603
50466 1716603 1647349 1584763 1529045 1480374 1438266 1401759 1370231 1343741 1322476 1306154 1294091
50455 1294091 1285563 1279850 1276142 1273770 1272502 1272368 1273253 1275008 1277858 1282354 1288806 1297098 1307174 1319320
50441 1319320 1333709 1349842 1366657 1383065 1398271 1411868 1423887 1434643 1444356 1453087 1461197 1469571
50429 1469571 1479013 1489562 1500780 1512557 1525180 1538668 1552586 1566724 1581574 1597887 1615951
50418 1615951 1635572 1656634 1679536 1705140 1734386 1767900 1805854 1848192 1894747 1944974 1997731
50407 1997731 2051733 2106323 2161515 2217234 2272729 2326675 2377599 2424224 2465711 2501540 2530782
50396 2530782 2551631 2562245 2562032 2551451 2530488 2498302 2454849 2402068 2342738 2278834 2211775 2143671
50384 2143671 2077140 2014078 1955645 1903415 1859394 1824587 1798441 1780154 1769766 1767488 1772546 1783312
50372 1783312 1798112 1815231 1832302 1846332 1854551 1855128 1847222 1830591 1805240 1771424 1730072 1683087
50360 1683087 1632860 1581259 1529207 1477227 1426070 1376718 1330021 1286445 1245940 1208037 1172382
50349 1172382 1139304 1109533 1083348 1060429 1040642 1024486 1012472 1004451 999840 998244 999616 1004188
50337 1004188 1012424 1024506 1039394 1054646 1067634 1076854 1081906 1082703 1079293 1072157 1062137 1050117 1037142
50324 1037142 1024634 1013890 1005380 998991 994975 994092 996610 1001508 1007031 1012016 1016560 1021462 1027128 1033176
50310 1033176 1039121 1045124 1051714 1058934 1066371 1074061 1082712 1092668 1103247 1113565 1123574 1133776 1144325
50297 1144325 1155087 1166287 1178454 1191854 1206584 1223159 1242534 1265422 1291610 1319345 1344923
50286 1344923 1363624 1372138 1370200 1359375 1340849 1315431 1285297 1254128 1225018 1199152 1176868 1158900
50274 1158900 1145915 1137648 1133270 1132220 1134103 1138283 1144122 1151291 1159385 1167666 1175651 1183522 1191440 1198853
50260 1198853 1205091 1210366 1215497 1220808 1225943 1230803 1236060 1242528 1250265 1258470 1266224 1273409 1281028 1290553
50246 1290553 1302850 1317799 1334863 1353721 1374253 1396309 1419721 1444266 1469426 1494505 1519146
50235 1519146 1543452 1567429 1590747 1613164 1634570 1654146 1670041 1680537 1685230 1684496 1678106 1665184
50223 1665184 1645576 1620627 1592488 1563078 1533796 1505762 1480007 1457350 1437968 1420854 1403905
50212 1403905 1384930 1362707 1337061 1308296 1276915 1243699 1209599 1175498 1142249 1110669 1081180
50201 1081180 1053643 1027891 1004174 982693 963044 944717 927909 913152 900254 888387 877260
50190 877260 867467 859369 852334 845499 838834 832990 828392 824868 822029 819673 817895 816904 816680 816777 816700 816498
50174 816498 816705 817658 819094 820449 821307 821600 821733 822549 824742 828104 831723 835023 838290 841997 846049 849979
50158 849979 853547 856810 859897 863065 866841 871769 878048 885480 893555 901473 908376 913832 917996 921173
50144 921173 923463 924985 926179 927654 929981 933804 939817 948332 959164 972394 989013 1010384 1037124
50131 1037124 1068949 1105500 1146875 1193255 1244331 1299187 1356493 1414788 1472901 1530297 1586912
50120 1586912 1642659 1697241 1750476 1802457 1853224 1902252 1948296 1989576 2024125 2050148 2066254
50109 2066254 2071441 2065036 2046880 2017645 1978855 1932423 1880088 1823214 1763094 1701348 1639918 1580499
50097 1580499 1523963 1470453 1419999 1372860 1329239 1289051 1252165 1218667 1188535 1161201 1135752
50086 1135752 1111616 1088878 1067985 1049315 1033002 1018908 1006692 996090 987210 980485 976287 974609
50074 974609 975018 976842 979463 982604 986331 990741 995765 1001322 1007445 1013992 1020414 1026099 1030933 1035296
50060 1035296 1039460 1043217 1046069 1047639 1047900 1047236 1046246 1045295 1044257 1042804 1040873 1038644 1036201 1033456 1030413
50045 1030413 1027255 1024279 1021980 1021026 1021737 1023742 1026606 1030718 1036941 1045323 1054815 1064519 1074618 1085742
50031 1085742 1098077 1111615 1126699 1143496 1161172 1178341 1194362 1209623 1224517 1238733 1251752
50020 1251752 1263592 1274815 1285989 1297230 1308017 1317488 1325223 1331863 1338753 1347002 1357197 1369920
50008 1369920 1385940 1405609 1428400 1453357 1479794 1507341 1535579 1564015 1592330 1620379 1647948
49997 1647948 1674689 1700257 1724262 1745993 1764209 1777206 1783094 1780169 1767269 1743961 1710623 1668418
49985 1668418 1619057 1564354 1505974 1445654 1385466 1327467 1273056 1222936 1177593 1137335 1101820
49974 1101820 1070133 1041708 1016793 995655 977692 961858 947712 935516 925464 917362 911055 906562
49962 906562 903661 901868 901117 902046 905300 910824 918092 926809 937030 948677 961209 973745 985319
49949 985319 995119 1002689 1008016 1011289 1012552 1011684 1008709 1003992 997984 990793 982141 971857 960285 947944
49935 947944 934788 920176 903812 886461 869361 853078 837374 822124 807801 794866 783249
49924 783249 772832 764133 757993 754630 753337 753148 753602 754855 757243 760808 765167 769820 774649 780048
49910 780048 786556 794487 803959 815036 827634 841445 856159 871595 887404 902834 917145 930208
49898 930208 942359 953601 963209 970220 974112 974959 973048 968464 960932 950137 936357 920696 904386
49885 904386 887893 871049 854055 837916 823552 810821 798738 786569 774417 762877 752556
49874 752556 743948 737403 732892 729860 727581 725772 724849 725500 727953 731725 736190 741346 747859 756341 766792
49859 766792 778826 792245 807179 823651 841105 858369 874098 887436 898398 907528 915099 920785
49847 920785 924204 925514 925190 923301 919303 912605 903127 891367 878195 864560 851143 838231 826071
49834 826071 815255 806340 799120 792750 786782 781624 777807 775363 774456 776089 781296 789686 799641 810142
49820 810142 821717 835167 849953 864445 877484 889042 899468 908711 916489 922758 927712 931488
49808 931488 934098 935484 935404 933352 928887 922202 914239 906078 898235 890604 882966 875258 867288 858535 848610
49793 848610 837817 826991 816760 807309 798835 791786 786369 782142 778441 775115 772566 771157 770856 771439
49779 771439 772756 774752 777406 780770 785058 790683 798071 807252 817578 828091 838246 847991 857096
49766 857096 864858 870778 875102 878304 880413 881360 881555 881295 879787 875678 868646 859641 849376 837491
49752 837491 823700 809001 795073 782870 772368 763268 755319 748260 742113 737390 734400 732492 730532
49739 730532 728078 725596 723622 722290 721703 722200 724074 727382 732096 738084 744915 752132 759787 768319 777826
49724 777826 787986 798809 810888 824550 839133 853544 867268 880490 893400 905747 916925
49713 916925 926110 932312 934607 932539 926367 916968 905557 893266 880789 868482 856787 846377 837693
49700 837693 830557 824441 819101 814773 811749 809860 808352 806314 803443 800491 798760 799015 801073 804559
49686 804559 809661 816764 825559 835095 844757 854839 866073 879072 894390 912684 934258 958417
49674 958417 983408 1007013 1027179 1042464 1052371 1057395 1058548 1056729 1052558 1046751 1040362 1034585 1030388
49661 1030388 1028217 1027715 1027545 1025806 1020968 1012531 1000760 986010 968526 948753 927536 906009 885428
49648 885428 866955 851175 837758 825945 815515 807012 800888 796852 794371 793439 794341 796765 799652
49635 799652 801952 803122 802866 800872 797109 792063 786376 780370 774080 767579 761067 754818 749170 744327
49621 744327 739944 735259 730075 725408 722541 721405 720563 719047 717613 717605 719025 720473 720923 720760 720890 721545
49605 721545 722459 723652 725335 727195 728490 728992 729305 730036 731026 731716 732009 732411 733363 734703 735875 736571 737096
49588 737096 738104 739967 742404 744780 746676 748133 749464 751037 753189 756109 759738 763889 768364 772775
49574 772775 776461 779040 781126 784102 789023 796005 804687 814851 826366 838987 852468 866616 880921
49561 880921 894487 906549 916731 924558 929272 930660 929635 927324 923854 918742 912353 906127 901202
49548 901202 897451 894114 890856 887869 885370 883345 881570 879684 877445 875097 873279 872434 872474 873124 874381
49533 874381 876551 880055 885285 892451 901474 912247 925043 940428 958644 979331 1001934 1026143
49521 1026143 1051689 1077789 1102942 1125291 1143338 1156619 1165846 1172306 1177145 1181243 1185454 1190482
49509 1190482 1196402 1202578 1208065 1211762 1212279 1208181 1198796 1184663 1167044 1147130 1125773 1103736 1081964
49496 1081964 1061505 1043064 1026557 1011370 997228 984599 973939 964937 957029 950369 945512 942278
49484 942278 939677 937110 934844 933199 932077 931558 932112 933761 935746 937600 939872 943219 947316 951316 954836
49469 954836 957892 960420 962678 965680 970276 975949 981373 985988 990171 993958 996635 997747 997626 996547
49455 996547 994136 990096 985006 979837 974934 969846 963959 956993 949110 940905 933262 926897 921982 918199
49441 918199 915162 912757 911225 911040 912681 916462 922502 930718 940791 952283 964925 978768 994036
49428 994036 1010987 1029871 1050782 1073529 1098030 1124809 1154379 1185561 1214810 1237980 1252835
49417 1252835 1259661 1259922 1255080 1246647 1236506 1226705 1219068 1214915 1214713 1217916 1223560 1231129 1240554 1251398
49403 1251398 1262623 1273417 1283883 1294665 1306079 1317851 1329516 1340964 1352604 1364941 1377772
49392 1377772 1389888 1399861 1407128 1412042 1414941 1415501 1413065 1407299 1398487 1387414 1374949 1361495 1346865
49379 1346865 1331008 1314695 1299116 1284933 1272257 1261436 1253196 1247826 1244858 1243815 1244779 1247911 1252824
49366 1252824 1258759 1265009 1270912 1275832 1279476 1281943 1283118 1282328 1278918 1272914 1264845 1255244 1244702 1234136
49352 1234136 1224410 1215696 1207548 1199693 1192536 1186812 1182850 1180183 1177877 1175321 1172653 1170237 1167817 1164563
49338 1164563 1159959 1154227 1147805 1140891 1133757 1127005 1121114 1115982 1111310 1107233 1104263 1102834 1103146 1105214
49324 1105214 1108761 1113298 1118551 1124612 1131483 1138910 1146973 1156337 1167345 1179223 1190842 1202036 1213590
49311 1213590 1226144 1239919 1255427 1273555 1294624 1317946 1342529 1367651 1392467 1415584 1435531
49300 1435531 1451401 1462753 1469241 1470731 1467579 1460461 1450000 1436794 1421600 1405183 1388010 1370272
49288 1370272 1352183 1334093 1316362 1299252 1282931 1267567 1253508 1241305 1231289 1223135 1216172 1210353
49276 1210353 1206585 1205792 1207769 1211300 1215275 1219453 1224182 1229709 1235839 1242001 1247564 1252174 1255832 1258644
49262 1258644 1260663 1262179 1264025 1267305 1272815 1280898 1291736 1305441 1321789 1340144 1359583 1378696
49250 1378696 1395253 1406767 1411870 1410863 1404555 1392942 1375583 1353103 1327570 1301311 1275771 1251586
49238 1251586 1229188 1208982 1191283 1176421 1164645 1155804 1149483 1145720 1145221 1148382 1154388 1161785 1169855
49225 1169855 1178950 1189448 1200915 1212519 1223933 1235563 1247963 1261109 1274140 1285788 1295249 1302715
49213 1302715 1308941 1314340 1318758 1322236 1325667 1330358 1336965 1345090 1353975 1363418 1373891 1385924 1399576
49200 1399576 1414522 1430383 1446770 1463202 1479254 1494710 1509278 1522293 1533186 1542283 1550544 1558307
49188 1558307 1564797 1569371 1572757 1576531 1581659 1588140 1595866 1605071 1615999 1628799 1643984 1662531 1685380
49175 1685380 1713213 1746804 1787122 1834719 1888987 1947719 2006923 2061396 2106529 2140267 2163182
49164 2163182 2176696 2181782 2179519 2172071 2162274 2152264 2142786 2133566 2124021 2113821 2103225 2092977 2083742
49151 2083742 2075676 2068552 2062206 2056885 2053406 2052849 2055714 2061356 2068595 2076900 2086489 2097351 2108890 2120789
49137 2120789 2133506 2147528 2162647 2178467 2195059 2212527 2230299 2247530 2264080 2280609 2297836
49126 2297836 2316068 2335310 2355459 2376519 2398795 2422659 2448004 2474496 2502652 2534013 2569742
49115 2569742 2609674 2653495 2702366 2758614 2824394 2901757 2993556 3102464 3228175 3366063 3509298
49104 3509298 3652608 3794729 3937763 4083149 4226297 4354853 4454083 4515643 4541124 4536983
49094 4536983 4507123 4451146 4368562 4262817 4140988 4010608 3877037 3743037 3610175 3480800
49084 3480800 3358847 3248612 3152666 3071027 3002144 2944240 2895715 2854918 2820140 2789966 2763442
49073 2763442 2739892 2718768 2699773 2682952 2668338 2655461 2643495 2632057 2621608 2612723 2605118 2597796
49061 2597796 2590031 2581773 2573120 2564023 2554731 2546009 2538460 2531882 2525624 2519374 2513341 2507965 2503747 2501168
49047 2501168 2500302 2500643 2501722 2503856 2507919 2514412 2523081 2533347 2544595 2555893 2565985 2574007 2580082
49034 2580082 2584956 2589194 2592977 2596479 2600017 2603742 2607468 2610942 2614079 2616766 2618656 2619428 2619245 2618684 2618162
49019 2618162 2617634 2616972 2616449 2616570 2617488 2618807 2620065 2621211 2622520 2624195 2626335 2629260 2633540 2639427 2646341
49004 2646341 2653206 2659377 2665153 2671324 2678344 2686016 2693759 2701053 2707762 2714148 2720466 2726425 2731357 2735080
48990 2735080 2738260 2741543 2744650 2746893 2748324 2749609 2750834 2751257 2750439 2748782 2746610 2743550 2739339 2734462
48976 2734462 2729267 2723092 2715158 2705865 2696235 2686368 2675456 2663244 2650478 2637866 2625574 2613972
48964 2613972 2603984 2596277 2590800 2587459 2586583 2588352 2592421 2598583 2607236 2618607 2632010 2646466 2661749
48951 2661749 2678222 2695847 2713924 2731715 2748868 2765303 2781120 2796642 2812220 2827965 2843868
48940 2843868 2860096 2877037 2895164 2915101 2937610 2963223 2991875 3023104 3056521 3091912 3129022
48929 3129022 3167491 3207021 3247600 3289675 3334131 3381738 3432391 3485189 3539463 3595416 3653447
48918 3653447 3713224 3773914 3835056 3896628 3958311 4019356 4079340 4138552 4197399 4255780 4313257
48907 4313257 4369485 4424239 4477322 4528834 4579286 4629036 4677592 4723848 4767066 4807431 4845558
48896 4845558 4881746 4915836 4947600 4976858 5003293 5026451 5046081 5062245 5074968 5084009 5089212 5090961
48884 5090961 5090063 5087168 5082478 5075917 5067321 5056404 5042721 5025714 5004793 4979505 4949811 4916134
48872 4916134 4878878 4838022 4793406 4745316 4694464 4641464 4586723 4530830 4474640 4418873 4364005
48861 4364005 4310533 4258882 4208881 4159878 4111636 4064674 4019426 3975554 3932539 3890591 3850443
$$ [...]
##END NTUPLES=NMR SPECTRUM
##END=
